{"text_format":"1","workbook":"xlsx","n_sheets":4,"sheets":["Flowable Backfill Mix Design ","Trial Batch Results","RX","Reference"],"not_rendered":{"charts":0,"images":1,"macros":1,"external_links":0,"defined_names":94,"comments":2,"pivot_tables":0},"unopened":[],"bounds":{"document_bytes":16777216,"sheet_cells":100000,"rows_first":2000,"rows_last":500,"rows_between":2000,"halvings":0,"cell_chars":16384,"cell_head_chars":4096},"cells_cut":0,"cells_raw":0,"read":"whole","date_system":"1900"}

{"sheet":"Flowable Backfill Mix Design ","index":0,"n_rows":61,"n_cols":11,"rows_kept":61,"cut":false,"hidden":false,"merged":[[46,6,46,7],[45,6,45,7],[44,6,44,7],[43,6,43,7],[42,6,42,7],[61,1,61,4],[50,1,51,8],[24,3,24,4],[32,1,32,3],[35,1,35,3],[29,1,29,3],[31,1,31,3],[24,5,24,8],[57,1,57,4],[54,3,54,5],[57,7,57,10],[55,2,55,5],[25,1,25,2],[0,0,0,1],[11,3,11,4],[8,7,8,8],[11,7,11,8],[7,3,7,4],[9,3,9,4],[10,7,10,8],[10,3,10,4],[7,7,7,8],[8,3,8,4],[9,7,9,8],[13,3,13,4],[16,3,16,4],[53,1,53,8],[14,3,14,8],[52,1,52,8],[24,1,24,2],[21,1,21,2],[21,3,21,4],[22,3,22,4],[23,3,23,4],[22,5,22,8],[23,5,23,8],[25,3,25,4],[25,5,25,8],[12,7,12,8],[15,3,15,8],[12,3,12,4],[13,7,13,8],[39,1,39,5],[16,7,16,8],[33,1,33,3],[30,1,30,3],[36,1,36,3],[37,1,37,3],[21,5,21,8],[22,1,22,2],[23,1,23,2]]}
["TxDOT Manuals >"]
[null,"TEXAS DEPARTMENT OF TRANSPORTATION",null,null,null,null,null,null,null,null,41]
[null,null,null,null,null,null,null,null,null,null,2]
[null,null,null,null,null,null,null,null,null,null,"txfbmxdes.xlsm::45719.45456"]
[null,"MIX DESIGN for FLOWABLE BACKFILL "]
[]
[null,null,null,null,null,null,null,null,{"$f":"\"File Version: \" & TEXT(MID(sn,SEARCH(\"::\",sn,1)+2,20),\"mm/dd/yy hh:mm:ss\")","v":"File Version: 03/03/25 10:54:34"}]
[null,null,"SAMPLE ID:",null,null,null,"SAMPLED DATE:"]
[null,null,"TEST NUMBER:",null,null,null,"LETTING DATE:"]
[null,null,"SAMPLE STATUS:",null,null,null,"CONTROLLING CSJ:"]
[null,null,"COUNTY:",null,null,null,"SPEC YEAR:"]
[null,null,"SAMPLED BY:",null,null,null,"SPEC ITEM:"]
[null,null,"SAMPLE LOCATION:",null,null,null,"SPECIAL PROVISION:"]
[null,null,"MATERIAL CODE:",null,null,null,"CLASS:"]
[null,null,"MATERIAL NAME:"]
[null,null,"PRODUCER:"]
[null,null,"AREA ENGINEER:",null,null,null,"PROJECT MANAGER:"]
[]
[null,null,"COURSE\\LIFT:",null,"STATION:",null,"DIST. FROM CL:"]
[]
[null,"MIXTURE COMPONENTS"]
[null,"Component",null,"Material",null,"Producer"]
[null,"Fine Aggregate:"]
[null,"Cement:"]
[null,"Fly Ash:"]
[null,"Admixture:"]
[]
[null,"COMPONENTS "]
[null,"for 1 Cubic Yard Batch",null,null,"Weight (lbs)","Sp. Gravities","Abs Vol (ft3)"]
[null,"Weight of Cement, (Lbs):",null,null,null,null,{"$f":"IF(E30=\"\",\"\",(E30/(62.4*$F$30)))","v":""}]
[null,"Weight of Fly Ash, (Lbs):",null,null,null,null,{"$f":"IF($E$31=\"\",\"\",($E$31/($F$31*62.4)))","v":""}]
[null,"Volume of Water, (Gal):",null,null,null,null,{"$f":"IF(E32=\"\",\"\",(E32*0.1336806))","v":""}]
[null,"SSD Weight of Fine Aggregate 1",null,null,null,null,{"$f":"IF(E33=\"\",\"\",(E33/($F$33*62.4)))","v":""}]
[null,"SSD Weight of Fine Aggregate 2",null,null,null,null,{"$f":"IF(E34=\"\",\"\",(E34/($F$34*62.4)))","v":""}]
[]
[null,"Air Content, (%):",null,null,null,"delete",{"$f":"IF($E$36=\"\",\"\",(27*$E$36/100))","v":""}]
[null,{"$f":"\"Admixture 1, \" & IF(SpecYear=\"1995\",\"(ml)\",\"(oz)\") & \":\"","v":"Admixture 1, (oz):"},null,null,null,null,{"$f":"IF($E$37=\"\",\"\",($E$37*1.044379*0.001))","v":""}]
[null,{"$f":"\"Admixture 2, \" & IF(SpecYear=\"1995\",\"(ml)\",\"(oz)\") & \":\"","v":"Admixture 2, (oz):"},null,null,null,null,{"$f":"IF($E$38=\"\",\"\",($E$38*1.044379*0.001))","v":""}]
[]
[null,"Total:",null,null,null,null,{"$f":"IF($G$30=\"\",\"\",(SUM($G$30:$G$38)))","v":""}]
[]
[null,"DESIGN REQUIREMENTS"]
[null,"Property",null,null,"Test Method","Trial Batch Result","Comments"]
[null,null,null,"28-day compressive strength, psi","ASTM D4832"]
[null,null,null,"Consistency, Min diameter","ASTM D6103"]
[null,null,null,"Unit weight, pcf","ASTM D6023"]
[null,null,null,"Air content, %","ASTM D6023"]
[]
[]
[null,"Remarks:",{"$f":"NOW()","v":"2025-03-03T10:54:34.650"}]
[]
[]
[]
[]
[null,"Test Method:","Tested By:",null,null,null,"Tested Date:"]
[null,"TXTRAEI"]
[null,"Test Stamp Code:",null,null,null,"Omit Test:","Completed Date:","Reviewed By:"]
[]
[null,"Locked By:","TxDOT:","District:","Area:"]
[]
[null,"Authorized By:",null,null,null,"Authorized Date:"]

{"sheet":"Trial Batch Results","index":1,"n_rows":53,"n_cols":12,"rows_kept":53,"cut":false,"hidden":true,"merged":[[52,3,52,5],[48,2,49,10],[50,3,50,5],[36,3,37,3],[36,11,37,11],[25,7,27,7],[25,8,27,8],[28,3,29,3],[28,11,29,11],[30,3,31,3],[30,11,31,11],[18,2,18,3],[18,7,18,8],[32,3,33,3],[32,11,33,11],[34,3,35,3],[34,11,35,11],[25,9,27,9],[25,10,27,10],[25,11,27,11],[26,4,27,4],[21,2,21,11],[24,2,24,11],[25,2,27,2],[25,3,27,3],[25,5,27,5],[25,6,27,6],[15,2,15,3],[15,4,15,9],[16,2,16,3],[16,4,16,5],[16,6,16,7],[16,8,16,9],[13,2,13,3],[13,4,13,5],[13,6,13,7],[13,8,13,9],[14,2,14,3],[14,4,14,9],[11,2,11,3],[11,4,11,5],[11,6,11,7],[11,8,11,9],[12,2,12,3],[12,4,12,5],[12,6,12,7],[12,8,12,9],[9,2,9,3],[9,4,9,5],[9,6,9,7],[9,8,9,9],[10,2,10,3],[10,4,10,5],[10,6,10,7],[10,8,10,9],[8,2,8,3],[8,4,8,5],[8,6,8,7],[8,8,8,9],[0,1,0,2],[7,2,7,3],[7,4,7,5],[7,6,7,7],[7,8,7,9]]}
[null,"TxDOT Manuals >",null,null,"Tex-414-A","Tex-415-A","Tex-416-A","Tex-417-A","Tex-418-A","Tex-422-A","Tex-447-A","Tex-448-A"]
[null,null,"HELP"]
[null,null,"TEXAS DEPARTMENT OF TRANSPORTATION",null,null,null,null,null,null,null,null,16]
[null,null,null,null,null,null,null,null,null,null,null,1]
[null,null,"HYDRAULIC CEMENT CONCRETE MIX DESIGN & CONTROL",null,null,null,null,null,null,null,null,"Tx417.xls::38117.490382"]
[null,null,"Trial Batch Results"]
[]
[null,null,"SAMPLE ID",null,{"$f":"IF('Flowable Backfill Mix Design '!D8=\"\",\"\",'Flowable Backfill Mix Design '!D8)","v":""},null,"SAMPLED DATE:",null,{"$f":"IF('Flowable Backfill Mix Design '!H8=\"\",\"\",'Flowable Backfill Mix Design '!H8)","v":""}]
[null,null,"TEST NUMBER:",null,{"$f":"IF('Flowable Backfill Mix Design '!D9=\"\",\"\",'Flowable Backfill Mix Design '!D9)","v":""},null,"LETTING DATE:",null,{"$f":"IF('Flowable Backfill Mix Design '!H9=\"\",\"\",'Flowable Backfill Mix Design '!H9)","v":""}]
[null,null,"SAMPLE STATUS:",null,{"$f":"IF('Flowable Backfill Mix Design '!D10=\"\",\"\",'Flowable Backfill Mix Design '!D10)","v":""},null,"CONTROLLING CSJ:",null,{"$f":"IF('Flowable Backfill Mix Design '!H10=\"\",\"\",'Flowable Backfill Mix Design '!H10)","v":""}]
[null,null,"COUNTY:",null,{"$f":"IF('Flowable Backfill Mix Design '!D11=\"\",\"\",'Flowable Backfill Mix Design '!D11)","v":""},null,"SPEC YEAR:",null,{"$f":"IF('Flowable Backfill Mix Design '!H11=\"\",\"\",'Flowable Backfill Mix Design '!H11)","v":""}]
[null,null,"SAMPLED BY:",null,{"$f":"IF('Flowable Backfill Mix Design '!D12=\"\",\"\",'Flowable Backfill Mix Design '!D12)","v":""},null,"SPEC ITEM:",null,{"$f":"IF('Flowable Backfill Mix Design '!H12=\"\",\"\",'Flowable Backfill Mix Design '!H12)","v":""}]
[null,null,"SAMPLE LOCATION:",null,{"$f":"IF('Flowable Backfill Mix Design '!D13=\"\",\"\",'Flowable Backfill Mix Design '!D13)","v":""},null,"SPECIAL PROVISION:",null,{"$f":"IF('Flowable Backfill Mix Design '!H13=\"\",\"\",'Flowable Backfill Mix Design '!H13)","v":""}]
[null,null,"MATERIAL CODE:",null,{"$f":"IF('Flowable Backfill Mix Design '!D14=\"\",\"\",'Flowable Backfill Mix Design '!D14)","v":""},null,"CLASS:",null,{"$f":"IF('Flowable Backfill Mix Design '!H14=\"\",\"\",'Flowable Backfill Mix Design '!H14)","v":""}]
[null,null,"MATERIAL NAME:",null,{"$f":"IF('Flowable Backfill Mix Design '!D15=\"\",\"\",'Flowable Backfill Mix Design '!D15)","v":""}]
[null,null,"PRODUCER:",null,{"$f":"IF('Flowable Backfill Mix Design '!D16=\"\",\"\",'Flowable Backfill Mix Design '!D16)","v":""}]
[null,null,"AREA ENGINEER:",null,{"$f":"IF('Flowable Backfill Mix Design '!D17=\"\",\"\",'Flowable Backfill Mix Design '!D17)","v":""},null,"PROJECT MANAGER:",null,{"$f":"IF('Flowable Backfill Mix Design '!H17=\"\",\"\",'Flowable Backfill Mix Design '!H17)","v":""}]
[]
[null,null,"COURSE\\LIFT:",null,{"$f":"IF('Flowable Backfill Mix Design '!D19=\"\",\"\",'Flowable Backfill Mix Design '!D19)","v":""},"STATION:",{"$f":"IF('Flowable Backfill Mix Design '!F19=\"\",\"\",'Flowable Backfill Mix Design '!F19)","v":""},"DIST. FROM CL:",null,{"$f":"IF('Flowable Backfill Mix Design '!I19=\"\",\"\",'Flowable Backfill Mix Design '!I19)","v":""}]
[]
[]
[null,null,"COMPRESSIVE STRENGTH"]
[null,null,null,null,null,null,null,"Min. 28-Day Design Strength, (psi):"]
[null,null,null,null,null,null,null,"Min. 28-Day Target Strength (based on over-design requirements), (psi):"]
[null,null,"Test Method Tex-418-A (ASTM C 39)"]
[null,null,"Cylinder Number","Age",null,"Length of Cylinder  (inches)","Length to Diameter Ratio","Max Load (lbs.)","Failure Type","Correction Factor","Compressive Strength  (psi)","Average Compressive Strength (psi)"]
[null,null,null,null," of Cylinder "]
[]
[null,1,null,null,null,null,{"$f":"IF(ISERROR(IF(CircumDiameter1=\"circumference\",$F29/(SQRT($E29/PI())*2),($F29/$E29))),\"\",IF(CircumDiameter1=\"circumference\",$F29/(SQRT($E29/PI())*2),($F29/$E29)))","v":""},null,null,{"$f":"IF(G29=\"\",\"\",IF(G29<1,\"CHK SIZES\",IF(G29<2.1,1,VLOOKUP(G29,CorrectionFactor,2))))","v":""},{"$f":"IF(G29=\"\",\"\",ROUND(J29*IF(CircumDiameter1=\"Circumference\",(H29/((E29*E29)/12.566)),(H29/(0.7854*E29*E29))),-1))","v":""},{"$f":"IF(ISERROR(IF(ISBLANK(#REF!),ROUND(AVERAGE(K29:K30),-1),ROUND(AVERAGE(K29:K30),-1))),\"\",IF(ISBLANK(#REF!),ROUND(AVERAGE(K29:K30),-1),ROUND(AVERAGE(K29:K30),-1)))","v":""}]
[null,2,null,null,null,null,{"$f":"IF(ISERROR(IF(CircumDiameter1=\"circumference\",$F30/(SQRT($E30/PI())*2),($F30/$E30))),\"\",IF(CircumDiameter1=\"circumference\",$F30/(SQRT($E30/PI())*2),($F30/$E30)))","v":""},null,null,{"$f":"IF(G30=\"\",\"\",IF(G30<1,\"CHK SIZES\",IF(G30<2.1,1,VLOOKUP(G30,CorrectionFactor,2))))","v":""},{"$f":"IF(G30=\"\",\"\",ROUND(J30*IF(CircumDiameter1=\"Circumference\",(H30/((E30*E30)/12.566)),(H30/(0.7854*E30*E30))),-1))","v":""}]
[null,3,null,null,null,null,{"$f":"IF(ISERROR(IF(CircumDiameter1=\"circumference\",$F31/(SQRT($E31/PI())*2),($F31/$E31))),\"\",IF(CircumDiameter1=\"circumference\",$F31/(SQRT($E31/PI())*2),($F31/$E31)))","v":""},null,null,{"$f":"IF(G31=\"\",\"\",IF(G31<1,\"CHK SIZES\",IF(G31<2.1,1,VLOOKUP(G31,CorrectionFactor,2))))","v":""},{"$f":"IF(G31=\"\",\"\",ROUND(J31*IF(CircumDiameter1=\"Circumference\",(H31/((E31*E31)/12.566)),(H31/(0.7854*E31*E31))),-1))","v":""},{"$f":"IF(ISERROR(IF(ISBLANK(#REF!),ROUND(AVERAGE(K31:K32),-1),ROUND(AVERAGE(K31:K32),-1))),\"\",IF(ISBLANK(#REF!),ROUND(AVERAGE(K31:K32),-1),ROUND(AVERAGE(K31:K32),-1)))","v":""}]
[null,4,null,null,null,null,{"$f":"IF(ISERROR(IF(CircumDiameter1=\"circumference\",$F32/(SQRT($E32/PI())*2),($F32/$E32))),\"\",IF(CircumDiameter1=\"circumference\",$F32/(SQRT($E32/PI())*2),($F32/$E32)))","v":""},null,null,{"$f":"IF(G32=\"\",\"\",IF(G32<1,\"CHK SIZES\",IF(G32<2.1,1,VLOOKUP(G32,CorrectionFactor,2))))","v":""},{"$f":"IF(G32=\"\",\"\",ROUND(J32*IF(CircumDiameter1=\"Circumference\",(H32/((E32*E32)/12.566)),(H32/(0.7854*E32*E32))),-1))","v":""}]
[null,5,null,null,null,null,"",null,null,{"$f":"IF(G33=\"\",\"\",IF(G33<1,\"CHK SIZES\",IF(G33<2.1,1,VLOOKUP(G33,CorrectionFactor,2))))","v":""},{"$f":"IF(G33=\"\",\"\",ROUND(J33*IF(CircumDiameter1=\"Circumference\",(H33/((E33*E33)/12.566)),(H33/(0.7854*E33*E33))),-1))","v":""},{"$f":"IF(ISERROR(IF(ISBLANK(#REF!),ROUND(AVERAGE(K33:K34),-1),ROUND(AVERAGE(K33:K34),-1))),\"\",IF(ISBLANK(#REF!),ROUND(AVERAGE(K33:K34),-1),ROUND(AVERAGE(K33:K34),-1)))","v":""}]
[null,6,null,null,null,null,"",null,null,"",""]
[null,7,null,null,null,null,{"$f":"IF(ISERROR(IF(CircumDiameter1=\"circumference\",$F35/(SQRT($E35/PI())*2),($F35/$E35))),\"\",IF(CircumDiameter1=\"circumference\",$F35/(SQRT($E35/PI())*2),($F35/$E35)))","v":""},null,null,"","",{"$f":"IF(ISERROR(IF(ISBLANK(#REF!),ROUND(AVERAGE(K35:K36),-1),ROUND(AVERAGE(K35:K36),-1))),\"\",IF(ISBLANK(#REF!),ROUND(AVERAGE(K35:K36),-1),ROUND(AVERAGE(K35:K36),-1)))","v":""}]
[null,8,null,null,null,null,"",null,null,"",""]
[null,9,null,null,null,null,"",null,null,"","",{"$f":"IF(ISERROR(IF(ISBLANK(#REF!),ROUND(AVERAGE(K37:K38),-1),ROUND(AVERAGE(K37:K38),-1))),\"\",IF(ISBLANK(#REF!),ROUND(AVERAGE(K37:K38),-1),ROUND(AVERAGE(K37:K38),-1)))","v":""}]
[null,10,null,null,null,null,"",null,null,"",""]
[]
[]
[]
[]
[]
[]
[]
[]
[]
[null,null,"Trial Batch Remarks:"]
[]
[]
[null,null,"Test Method:","Tested By:",null,null,"Tested Date:"]
[]
[null,null,"TX418"]

{"sheet":"RX","index":2,"n_rows":137,"n_cols":9,"rows_kept":137,"cut":false,"hidden":true,"merged":[]}
[46]
["Fld_nbr","Value","Desc_1","Desc_2","Desc_3","Desc_4","Desc_5","Desc_6","Desc_7"]
[1,{"$f":"IF(Field2=\"\", \"\", Field2)","v":""},{"$f":"'Flowable Backfill Mix Design '!G11","v":"SPEC YEAR:"}]
[2,{"$f":"IF(Field3=\"\", \"\", Field3)","v":""},{"$f":"'Flowable Backfill Mix Design '!G13","v":"SPECIAL PROVISION:"}]
[3,{"$f":"IF(_PCC4=\"\", \"\", _PCC4)","v":""},{"$f":"'Flowable Backfill Mix Design '!G14","v":"CLASS:"}]
[4,{"$f":"IF(CourseLift=\"\", \"\", CourseLift)","v":""},{"$f":"'Flowable Backfill Mix Design '!C19","v":"COURSE\\LIFT:"}]
[5,{"$f":"IF(Field6=\"\", \"\", Field6)","v":""},{"$f":"'Flowable Backfill Mix Design '!$B$21","v":"MIXTURE COMPONENTS"},{"$f":"'Flowable Backfill Mix Design '!$D$22","v":"Material"},{"$f":"'Flowable Backfill Mix Design '!B23","v":"Fine Aggregate:"}]
[6,{"$f":"IF(Field8=\"\", \"\", Field8)","v":""},{"$f":"'Flowable Backfill Mix Design '!$B$21","v":"MIXTURE COMPONENTS"},{"$f":"'Flowable Backfill Mix Design '!$D$22","v":"Material"},{"$f":"'Flowable Backfill Mix Design '!B24","v":"Cement:"}]
[7,{"$f":"IF(Field10=\"\", \"\", Field10)","v":""},{"$f":"'Flowable Backfill Mix Design '!$B$21","v":"MIXTURE COMPONENTS"},{"$f":"'Flowable Backfill Mix Design '!$D$22","v":"Material"},{"$f":"'Flowable Backfill Mix Design '!B25","v":"Fly Ash:"}]
[8,{"$f":"IF(Field12=\"\", \"\", Field12)","v":""},{"$f":"'Flowable Backfill Mix Design '!$B$21","v":"MIXTURE COMPONENTS"},{"$f":"'Flowable Backfill Mix Design '!$D$22","v":"Material"},{"$f":"'Flowable Backfill Mix Design '!B26","v":"Admixture:"}]
[9,{"$f":"IF(Field7=\"\", \"\", Field7)","v":""},{"$f":"'Flowable Backfill Mix Design '!$B$21","v":"MIXTURE COMPONENTS"},{"$f":"'Flowable Backfill Mix Design '!$F$22","v":"Producer"},{"$f":"'Flowable Backfill Mix Design '!B23","v":"Fine Aggregate:"}]
[10,{"$f":"IF(Field9=\"\", \"\", Field9)","v":""},{"$f":"'Flowable Backfill Mix Design '!$B$21","v":"MIXTURE COMPONENTS"},{"$f":"'Flowable Backfill Mix Design '!$F$22","v":"Producer"},{"$f":"'Flowable Backfill Mix Design '!B24","v":"Cement:"}]
[11,{"$f":"IF(Field11=\"\", \"\",Field11)","v":""},{"$f":"'Flowable Backfill Mix Design '!$B$21","v":"MIXTURE COMPONENTS"},{"$f":"'Flowable Backfill Mix Design '!$F$22","v":"Producer"},{"$f":"'Flowable Backfill Mix Design '!B25","v":"Fly Ash:"}]
[12,{"$f":"IF(Field13=\"\", \"\",Field13)","v":""},{"$f":"'Flowable Backfill Mix Design '!$B$21","v":"MIXTURE COMPONENTS"},{"$f":"'Flowable Backfill Mix Design '!$F$22","v":"Producer"},{"$f":"'Flowable Backfill Mix Design '!B26","v":"Admixture:"}]
[13,{"$f":"IF(Field14=\"\", \"\",Field14)","v":""},{"$f":"'Flowable Backfill Mix Design '!$B$28","v":"COMPONENTS "},{"$f":"'Flowable Backfill Mix Design '!$E$29","v":"Weight (lbs)"},{"$f":"'Flowable Backfill Mix Design '!B30","v":"Weight of Cement, (Lbs):"}]
[14,{"$f":"IF(Field16=\"\", \"\",Field16)","v":""},{"$f":"'Flowable Backfill Mix Design '!$B$28","v":"COMPONENTS "},{"$f":"'Flowable Backfill Mix Design '!$E$29","v":"Weight (lbs)"},{"$f":"'Flowable Backfill Mix Design '!B31","v":"Weight of Fly Ash, (Lbs):"}]
[15,{"$f":"IF(Field18=\"\", \"\",Field18)","v":""},{"$f":"'Flowable Backfill Mix Design '!$B$28","v":"COMPONENTS "},{"$f":"'Flowable Backfill Mix Design '!$E$29","v":"Weight (lbs)"},{"$f":"'Flowable Backfill Mix Design '!B32","v":"Volume of Water, (Gal):"}]
[16,{"$f":"IF(Field20=\"\", \"\",Field20)","v":""},{"$f":"'Flowable Backfill Mix Design '!$B$28","v":"COMPONENTS "},{"$f":"'Flowable Backfill Mix Design '!$E$29","v":"Weight (lbs)"},{"$f":"'Flowable Backfill Mix Design '!B33","v":"SSD Weight of Fine Aggregate 1"}]
[17,{"$f":"IF(Field22=\"\", \"\",Field22)","v":""},{"$f":"'Flowable Backfill Mix Design '!$B$28","v":"COMPONENTS "},{"$f":"'Flowable Backfill Mix Design '!$E$29","v":"Weight (lbs)"},{"$f":"'Flowable Backfill Mix Design '!B34","v":"SSD Weight of Fine Aggregate 2"}]
[18,{"$f":"IF(Field24=\"\", \"\",Field24)","v":""},{"$f":"'Flowable Backfill Mix Design '!$B$28","v":"COMPONENTS "},{"$f":"'Flowable Backfill Mix Design '!$E$29","v":"Weight (lbs)"},{"$f":"'Flowable Backfill Mix Design '!B36","v":"Air Content, (%):"}]
[19,{"$f":"IF(Field25=\"\", \"\",Field25)","v":""},{"$f":"'Flowable Backfill Mix Design '!$B$28","v":"COMPONENTS "},{"$f":"'Flowable Backfill Mix Design '!$E$29","v":"Weight (lbs)"},{"$f":"'Flowable Backfill Mix Design '!B37","v":"Admixture 1, (oz):"}]
[20,{"$f":"IF(Field27=\"\", \"\",Field27)","v":""},{"$f":"'Flowable Backfill Mix Design '!$B$28","v":"COMPONENTS "},{"$f":"'Flowable Backfill Mix Design '!$E$29","v":"Weight (lbs)"},{"$f":"'Flowable Backfill Mix Design '!B38","v":"Admixture 2, (oz):"}]
[21,{"$f":"IF(Field15=\"\", \"\",Field15)","v":""},{"$f":"'Flowable Backfill Mix Design '!$B$28","v":"COMPONENTS "},{"$f":"'Flowable Backfill Mix Design '!$F$29","v":"Sp. Gravities"},{"$f":"'Flowable Backfill Mix Design '!B30","v":"Weight of Cement, (Lbs):"}]
[22,{"$f":"IF(Field17=\"\", \"\",Field17)","v":""},{"$f":"'Flowable Backfill Mix Design '!$B$28","v":"COMPONENTS "},{"$f":"'Flowable Backfill Mix Design '!$F$29","v":"Sp. Gravities"},{"$f":"'Flowable Backfill Mix Design '!B31","v":"Weight of Fly Ash, (Lbs):"}]
[23,{"$f":"IF(Field19=\"\", \"\",Field19)","v":""},{"$f":"'Flowable Backfill Mix Design '!$B$28","v":"COMPONENTS "},{"$f":"'Flowable Backfill Mix Design '!$F$29","v":"Sp. Gravities"},{"$f":"'Flowable Backfill Mix Design '!B32","v":"Volume of Water, (Gal):"}]
[24,{"$f":"IF(Field21=\"\", \"\",Field21)","v":""},{"$f":"'Flowable Backfill Mix Design '!$B$28","v":"COMPONENTS "},{"$f":"'Flowable Backfill Mix Design '!$F$29","v":"Sp. Gravities"},{"$f":"'Flowable Backfill Mix Design '!B33","v":"SSD Weight of Fine Aggregate 1"}]
[25,{"$f":"IF(Field23=\"\", \"\",Field23)","v":""},{"$f":"'Flowable Backfill Mix Design '!$B$28","v":"COMPONENTS "},{"$f":"'Flowable Backfill Mix Design '!$F$29","v":"Sp. Gravities"},{"$f":"'Flowable Backfill Mix Design '!B34","v":"SSD Weight of Fine Aggregate 2"}]
[26,{"$f":"IF(Field26=\"\", \"\",Field26)","v":""},{"$f":"'Flowable Backfill Mix Design '!$B$28","v":"COMPONENTS "},{"$f":"'Flowable Backfill Mix Design '!$F$29","v":"Sp. Gravities"},{"$f":"'Flowable Backfill Mix Design '!B37","v":"Admixture 1, (oz):"}]
[27,{"$f":"IF(Field28=\"\", \"\",Field28)","v":""},{"$f":"'Flowable Backfill Mix Design '!$B$28","v":"COMPONENTS "},{"$f":"'Flowable Backfill Mix Design '!$F$29","v":"Sp. Gravities"},{"$f":"'Flowable Backfill Mix Design '!B38","v":"Admixture 2, (oz):"}]
[28,{"$f":"IF('Flowable Backfill Mix Design '!G30=\"\", \"\",'Flowable Backfill Mix Design '!G30)","v":""},{"$f":"'Flowable Backfill Mix Design '!$B$28","v":"COMPONENTS "},{"$f":"'Flowable Backfill Mix Design '!$G$29","v":"Abs Vol (ft3)"},{"$f":"'Flowable Backfill Mix Design '!B30","v":"Weight of Cement, (Lbs):"}]
[29,{"$f":"IF('Flowable Backfill Mix Design '!G31=\"\", \"\",'Flowable Backfill Mix Design '!G31)","v":""},{"$f":"'Flowable Backfill Mix Design '!$B$28","v":"COMPONENTS "},{"$f":"'Flowable Backfill Mix Design '!$G$29","v":"Abs Vol (ft3)"},{"$f":"'Flowable Backfill Mix Design '!B31","v":"Weight of Fly Ash, (Lbs):"}]
[30,{"$f":"IF('Flowable Backfill Mix Design '!G32=\"\", \"\",'Flowable Backfill Mix Design '!G32)","v":""},{"$f":"'Flowable Backfill Mix Design '!$B$28","v":"COMPONENTS "},{"$f":"'Flowable Backfill Mix Design '!$G$29","v":"Abs Vol (ft3)"},{"$f":"'Flowable Backfill Mix Design '!B32","v":"Volume of Water, (Gal):"}]
[31,{"$f":"IF('Flowable Backfill Mix Design '!G33=\"\", \"\",'Flowable Backfill Mix Design '!G33)","v":""},{"$f":"'Flowable Backfill Mix Design '!$B$28","v":"COMPONENTS "},{"$f":"'Flowable Backfill Mix Design '!$G$29","v":"Abs Vol (ft3)"},{"$f":"'Flowable Backfill Mix Design '!B33","v":"SSD Weight of Fine Aggregate 1"}]
[32,{"$f":"IF('Flowable Backfill Mix Design '!G34=\"\", \"\",'Flowable Backfill Mix Design '!G34)","v":""},{"$f":"'Flowable Backfill Mix Design '!$B$28","v":"COMPONENTS "},{"$f":"'Flowable Backfill Mix Design '!$G$29","v":"Abs Vol (ft3)"},{"$f":"'Flowable Backfill Mix Design '!B34","v":"SSD Weight of Fine Aggregate 2"}]
[33,{"$f":"IF('Flowable Backfill Mix Design '!G36=\"\", \"\",'Flowable Backfill Mix Design '!G36)","v":""},{"$f":"'Flowable Backfill Mix Design '!$B$28","v":"COMPONENTS "},{"$f":"'Flowable Backfill Mix Design '!$G$29","v":"Abs Vol (ft3)"},{"$f":"'Flowable Backfill Mix Design '!B36","v":"Air Content, (%):"}]
[34,{"$f":"IF('Flowable Backfill Mix Design '!G37=\"\", \"\",'Flowable Backfill Mix Design '!G37)","v":""},{"$f":"'Flowable Backfill Mix Design '!$B$28","v":"COMPONENTS "},{"$f":"'Flowable Backfill Mix Design '!$G$29","v":"Abs Vol (ft3)"},{"$f":"'Flowable Backfill Mix Design '!B37","v":"Admixture 1, (oz):"}]
[35,{"$f":"IF('Flowable Backfill Mix Design '!G38=\"\", \"\",'Flowable Backfill Mix Design '!G38)","v":""},{"$f":"'Flowable Backfill Mix Design '!$B$28","v":"COMPONENTS "},{"$f":"'Flowable Backfill Mix Design '!$G$29","v":"Abs Vol (ft3)"},{"$f":"'Flowable Backfill Mix Design '!B38","v":"Admixture 2, (oz):"}]
[36,{"$f":"IF(Field29=\"\", \"\",Field29)","v":""},{"$f":"'Flowable Backfill Mix Design '!$B$42","v":"DESIGN REQUIREMENTS"},{"$f":"'Flowable Backfill Mix Design '!$F$43","v":"Trial Batch Result"},{"$f":"'Flowable Backfill Mix Design '!D44","v":"28-day compressive strength, psi"}]
[37,{"$f":"IF(Field31=\"\", \"\",Field31)","v":""},{"$f":"'Flowable Backfill Mix Design '!$B$42","v":"DESIGN REQUIREMENTS"},{"$f":"'Flowable Backfill Mix Design '!$F$43","v":"Trial Batch Result"},{"$f":"'Flowable Backfill Mix Design '!D45","v":"Consistency, Min diameter"}]
[38,{"$f":"IF(Field33=\"\", \"\",Field33)","v":""},{"$f":"'Flowable Backfill Mix Design '!$B$42","v":"DESIGN REQUIREMENTS"},{"$f":"'Flowable Backfill Mix Design '!$F$43","v":"Trial Batch Result"},{"$f":"'Flowable Backfill Mix Design '!D46","v":"Unit weight, pcf"}]
[39,{"$f":"IF(Field35=\"\", \"\",Field35)","v":""},{"$f":"'Flowable Backfill Mix Design '!$B$42","v":"DESIGN REQUIREMENTS"},{"$f":"'Flowable Backfill Mix Design '!$F$43","v":"Trial Batch Result"},{"$f":"'Flowable Backfill Mix Design '!D47","v":"Air content, %"}]
[40,{"$f":"IF(Field30=\"\", \"\", Field30)","v":""},{"$f":"'Flowable Backfill Mix Design '!$B$42","v":"DESIGN REQUIREMENTS"},{"$f":"'Flowable Backfill Mix Design '!$G$43","v":"Comments"},{"$f":"'Flowable Backfill Mix Design '!D44","v":"28-day compressive strength, psi"}]
[41,{"$f":"IF(Field32=\"\", \"\",Field32)","v":""},{"$f":"'Flowable Backfill Mix Design '!$B$42","v":"DESIGN REQUIREMENTS"},{"$f":"'Flowable Backfill Mix Design '!$G$43","v":"Comments"},{"$f":"'Flowable Backfill Mix Design '!D45","v":"Consistency, Min diameter"}]
[42,{"$f":"IF(Field34=\"\", \"\",Field34)","v":""},{"$f":"'Flowable Backfill Mix Design '!$B$42","v":"DESIGN REQUIREMENTS"},{"$f":"'Flowable Backfill Mix Design '!$G$43","v":"Comments"},{"$f":"'Flowable Backfill Mix Design '!D46","v":"Unit weight, pcf"}]
[43,{"$f":"IF(Field36=\"\", \"\",Field36)","v":""},{"$f":"'Flowable Backfill Mix Design '!$B$42","v":"DESIGN REQUIREMENTS"},{"$f":"'Flowable Backfill Mix Design '!$G$43","v":"Comments"},{"$f":"'Flowable Backfill Mix Design '!D47","v":"Air content, %"}]
[44,{"$f":"IF(Field1=\"\", \"\",Field1)","v":""},{"$f":"IF('Flowable Backfill Mix Design '!B50=\"\", \"\", 'Flowable Backfill Mix Design '!B50)","v":"Remarks:"}]
[45,{"$f":"IF(Field37=\"\", \"\",Field37)","v":""},{"$f":"test1","v":"TXTRAEI"},{"$f":"'Flowable Backfill Mix Design '!C55","v":"Tested By:"}]
[46,{"$f":"IF(Field38=\"\", \"\",Field38)","v":""},{"$f":"test1","v":"TXTRAEI"},{"$f":"'Flowable Backfill Mix Design '!G55","v":"Tested Date:"}]
[47]
[48]
[49]
[50]
[51]
[52]
[53]
[54]
[55]
[56]
[57]
[58]
[59]
[60]
[61]
[62]
[63]
[64]
[65]
[66]
[67]
[68]
[69]
[70]
[71]
[72]
[73]
[74]
[75]
[76]
[77]
[78]
[79]
[80]
[81]
[82]
[83]
[84]
[85]
[86]
[87]
[88]
[89]
[90]
[91]
[92]
[93]
[94]
[95]
[96]
[97]
[98]
[99]
[100]
[101]
[102]
[103]
[104]
[105]
[106]
[107]
[108]
[109]
[110]
[111]
[112]
[113]
[114]
[115]
[116]
[117]
[118]
{"$rows_left_out":18}
{"sheet":"Reference","index":3,"n_rows":22,"n_cols":12,"rows_kept":22,"cut":false,"hidden":true,"merged":[]}
[]
[null,"Class","Flex St (E)","Flex St (M)","Flex St Unit (E)","Flex St Unit (M)","Age","Comp St (E)","Comp St (M)","Comp St Unit (E)","Comp St Unit (M)","Age"]
[null,"A","425 (390*)","2930 (2690*)","psi","kPa",7,3000,21,"psi","Mpa",28]
[null,"B",280,1930,"psi","kPa",7,2000,14,"psi","Mpa",28]
[null,"C","510 (470*)","3520 (3240*)","psi","kPa",7,3600,25,"psi","Mpa",28]
[null,"D",215,1480,"psi","kPa",7,1500,10,"psi","Mpa",28]
[null,"E",425,2930,"psi","kPa",7,3000,21,"psi","Mpa",28]
[null,"F",null,3.93,"psi","kPa",7,null,null,"psi","Mpa",28]
[null,"H","N/A","N/A","psi","kPa",7,null,null,"psi","Mpa",28]
[null,"S","570 (525*)","3930 (3620*)","psi","kPa",7,4000,28,"psi","Mpa",28]
[null,"P","555*","3830*","psi","kPa",7,"N/A","N/A","psi","Mpa",28]
[null,"DC",720,4960,"psi","kPa",7,5500,38,"psi","Mpa",28]
[null,"CO",640,4410,"psi","kPa",7,4600,32,"psi","Mpa",28]
[null,"SS",510,3520,"psi","kPa",7,3600,25,"psi","Mpa",28]
[null,"K",null,null,"psi","kPa",7,null,null,"psi","Mpa",28]
[null,"*  When Type II or Type I/II cement is used."]
[null,"*  Min. running average for conc. Pavement (in accordance with const. Bulltin C-11)."]
[]
[]
[null,"Ash","Coal Ash"]
[null,"Class C Fly Ash","Coal Ash"]
[null,"Class F Fly Ash"]