{"text_format":"1","workbook":"xlsx","n_sheets":5,"sheets":["ASTM-A-931","RX","Diameter","Revisions","L to D Lookup"],"not_rendered":{"charts":0,"images":1,"macros":1,"external_links":0,"defined_names":90,"comments":1,"pivot_tables":0},"unopened":[],"bounds":{"document_bytes":16777216,"sheet_cells":100000,"rows_first":2000,"rows_last":500,"rows_between":2000,"halvings":0,"cell_chars":16384,"cell_head_chars":4096},"cells_cut":0,"cells_raw":0,"read":"whole","date_system":"1900"}

{"sheet":"ASTM-A-931","index":0,"n_rows":48,"n_cols":11,"rows_kept":48,"cut":false,"hidden":false,"merged":[[0,0,0,1],[16,3,16,4],[7,3,7,4],[13,3,13,4],[11,3,11,4],[8,3,8,4],[10,3,10,4],[12,3,12,4],[9,3,9,4],[15,3,15,8],[31,10,32,10],[16,7,16,8],[7,7,7,8],[10,7,10,8],[8,7,8,8],[11,7,11,8],[9,7,9,8],[12,7,12,8],[27,10,28,10],[13,7,13,8],[29,10,30,10],[24,10,25,10],[14,3,14,8],[40,2,40,4],[36,1,37,8],[21,2,21,4],[22,2,22,4],[24,3,25,3],[24,8,25,8],[27,6,27,7],[28,6,28,7],[24,6,26,7],[24,2,26,2],[47,1,47,3],[24,4,25,4],[33,10,34,10],[43,6,43,8],[24,9,25,9],[24,5,25,5],[43,1,43,3],[41,2,41,4],[29,6,29,7],[39,1,39,8],[34,6,34,7],[30,6,30,7],[31,6,31,7],[32,6,32,7],[33,6,33,7],[38,1,38,8]]}
["TxDOT Manuals >",null,null,"ASTM A 931"]
[null,"TEXAS DEPARTMENT OF TRANSPORTATION",null,null,null,null,null,null,null,null,41]
[null,null,null,null,null,null,null,null,null,null,1]
[null,null,null,null,null,null,null,null,null,null,"astma931.xlsm::45575.373993"]
[null,"TENSION TESTING OF WIRE ROPES AND STRAND"]
[null,"ASTM A 931"]
[null,null,null,null,null,null,null,null,{"$f":"\"ASTM A 931 - File Version: \" & TEXT(MID(sn,SEARCH(\"::\",sn,1)+2,20),\"mm/dd/yy hh:mm:ss\")","v":"ASTM A 931 - File Version: 10/10/24 08:58:33"}]
[null,null,"SAMPLE ID:",null,null,null,"SAMPLED DATE:"]
[null,null,"TEST NUMBER:",null,null,null,"LETTING DATE:"]
[null,null,"SAMPLE STATUS:",null,null,null,"CONTROLLING CSJ:"]
[null,null,"COUNTY:",null,null,null,"SPEC YEAR:"]
[null,null,"SAMPLED BY:",null,null,null,"SPEC ITEM:"]
[null,null,"SAMPLE LOCATION:",null,null,null,"SPECIAL PROVISION:"]
[null,null,"MATERIAL CODE:",null,null,null,"GRADE:"]
[null,null,"MATERIAL NAME:"]
{"$rows_left_out":34}
{"sheet":"RX","index":1,"n_rows":46,"n_cols":9,"rows_kept":46,"cut":false,"hidden":true,"merged":[]}
[44]
["Fld_nbr","Value","Desc_1","Desc_2","Desc_3","Desc_4","Desc_5","Desc_6","Desc_7"]
[1,{"$f":"IF('ASTM-A-931'!$B$37=\"\",\"\",'ASTM-A-931'!$B$37)","v":""},{"$f":"'ASTM-A-931'!$B$36","v":"Remarks:"}]
[2,{"$f":"IF('ASTM-A-931'!$D$19=\"\",\"\",'ASTM-A-931'!$D$19)","v":""},{"$f":"IF('ASTM-A-931'!$C$19=\"\",\"\",'ASTM-A-931'!$C$19)","v":"COURSE\\LIFT:"}]
[3,{"$f":"IF('ASTM-A-931'!$C$42=\"\",\"\",'ASTM-A-931'!$C$42)","v":""},"Tested By ",{"$f":"IF('ASTM-A-931'!$B$42=\"\",\"\",'ASTM-A-931'!$B$42)","v":"ASTMA931"}]
[4,{"$f":"IF('ASTM-A-931'!$F$42=\"\",\"\",'ASTM-A-931'!$F$42)","v":""},"Tested Date ",{"$f":"IF('ASTM-A-931'!$B$42=\"\",\"\",'ASTM-A-931'!$B$42)","v":"ASTMA931"}]
[5,{"$f":"IF('ASTM-A-931'!$C$28=\"\",\"\",'ASTM-A-931'!$C$28)","v":""},{"$f":"IF( 'ASTM-A-931'!$B$6=\"\",\"\", 'ASTM-A-931'!$B$6)","v":"ASTM A 931"},{"$f":"IF('ASTM-A-931'!$C$25=\"\",\"\",'ASTM-A-931'!$C$25)","v":"Heat Number"},{"$f":"IF('ASTM-A-931'!$B$28=\"\",\"\",'ASTM-A-931'!$B$28)","v":1}]
[6,{"$f":"IF('ASTM-A-931'!$D$28=\"\",\"\",'ASTM-A-931'!$D$28)","v":""},{"$f":"IF( 'ASTM-A-931'!$B$6=\"\",\"\", 'ASTM-A-931'!$B$6)","v":"ASTM A 931"},{"$f":"IF('ASTM-A-931'!$D$25=\"\",\"\",'ASTM-A-931'!$D$25)","v":"Nominal Rope Diameter"},{"$f":"IF('ASTM-A-931'!$D$27=\"\",\"\",'ASTM-A-931'!$D$27)","v":""},{"$f":"IF('ASTM-A-931'!$B$28=\"\",\"\",'ASTM-A-931'!$B$28)","v":1}]
[7,{"$f":"IF('ASTM-A-931'!$E$28=\"\",\"\",'ASTM-A-931'!$E$28)","v":""},{"$f":"IF( 'ASTM-A-931'!$B$6=\"\",\"\", 'ASTM-A-931'!$B$6)","v":"ASTM A 931"},{"$f":"IF('ASTM-A-931'!$E$25=\"\",\"\",'ASTM-A-931'!$E$25)","v":"Length of Rope"},{"$f":"IF('ASTM-A-931'!$E$27=\"\",\"\",'ASTM-A-931'!$E$27)","v":""},{"$f":"IF('ASTM-A-931'!$B$28=\"\",\"\",'ASTM-A-931'!$B$28)","v":1}]
[8,{"$f":"IF('ASTM-A-931'!$F$28=\"\",\"\",'ASTM-A-931'!$F$28)","v":""},{"$f":"IF( 'ASTM-A-931'!$B$6=\"\",\"\", 'ASTM-A-931'!$B$6)","v":"ASTM A 931"},{"$f":"IF('ASTM-A-931'!$F$25=\"\",\"\",'ASTM-A-931'!$F$25)","v":"Tensile Strength"},{"$f":"IF('ASTM-A-931'!$F$27=\"\",\"\",'ASTM-A-931'!$F$27)","v":""},{"$f":"IF('ASTM-A-931'!$B$28=\"\",\"\",'ASTM-A-931'!$B$28)","v":1}]
[9,{"$f":"IF('ASTM-A-931'!$G$28=\"\",\"\",'ASTM-A-931'!$G$28)","v":""},{"$f":"IF( 'ASTM-A-931'!$B$6=\"\",\"\", 'ASTM-A-931'!$B$6)","v":"ASTM A 931"},{"$f":"IF('ASTM-A-931'!$G$25=\"\",\"\",'ASTM-A-931'!$G$25)","v":"Meet Minimun Tensile strength Requirements"},{"$f":"IF('ASTM-A-931'!$B$28=\"\",\"\",'ASTM-A-931'!$B$28)","v":1}]
[10,{"$f":"IF('ASTM-A-931'!$C$29=\"\",\"\",'ASTM-A-931'!$C$29)","v":""},{"$f":"IF( 'ASTM-A-931'!$B$6=\"\",\"\", 'ASTM-A-931'!$B$6)","v":"ASTM A 931"},{"$f":"IF('ASTM-A-931'!$C$25=\"\",\"\",'ASTM-A-931'!$C$25)","v":"Heat Number"},{"$f":"IF('ASTM-A-931'!$B$29=\"\",\"\",'ASTM-A-931'!$B$29)","v":2}]
[11,{"$f":"IF('ASTM-A-931'!$D$29=\"\",\"\",'ASTM-A-931'!$D$29)","v":""},{"$f":"IF( 'ASTM-A-931'!$B$6=\"\",\"\", 'ASTM-A-931'!$B$6)","v":"ASTM A 931"},{"$f":"IF('ASTM-A-931'!$D$25=\"\",\"\",'ASTM-A-931'!$D$25)","v":"Nominal Rope Diameter"},{"$f":"IF('ASTM-A-931'!$D$27=\"\",\"\",'ASTM-A-931'!$D$27)","v":""},{"$f":"IF('ASTM-A-931'!$B$29=\"\",\"\",'ASTM-A-931'!$B$29)","v":2}]
[12,{"$f":"IF('ASTM-A-931'!$E$29=\"\",\"\",'ASTM-A-931'!$E$29)","v":""},{"$f":"IF( 'ASTM-A-931'!$B$6=\"\",\"\", 'ASTM-A-931'!$B$6)","v":"ASTM A 931"},{"$f":"IF('ASTM-A-931'!$E$25=\"\",\"\",'ASTM-A-931'!$E$25)","v":"Length of Rope"},{"$f":"IF('ASTM-A-931'!$E$27=\"\",\"\",'ASTM-A-931'!$E$27)","v":""},{"$f":"IF('ASTM-A-931'!$B$29=\"\",\"\",'ASTM-A-931'!$B$29)","v":2}]
[13,{"$f":"IF('ASTM-A-931'!$F$29=\"\",\"\",'ASTM-A-931'!$F$29)","v":""},{"$f":"IF( 'ASTM-A-931'!$B$6=\"\",\"\", 'ASTM-A-931'!$B$6)","v":"ASTM A 931"},{"$f":"IF('ASTM-A-931'!$F$25=\"\",\"\",'ASTM-A-931'!$F$25)","v":"Tensile Strength"},{"$f":"IF('ASTM-A-931'!$F$27=\"\",\"\",'ASTM-A-931'!$F$27)","v":""},{"$f":"IF('ASTM-A-931'!$B$29=\"\",\"\",'ASTM-A-931'!$B$29)","v":2}]
{"$rows_left_out":32}
{"sheet":"Diameter","index":2,"n_rows":3,"n_cols":2,"rows_kept":3,"cut":false,"hidden":false,"merged":[]}
["English","Metric"]
[0.375,9.5250000000000004]
[0.3125,7.9379999999999997]

{"sheet":"Revisions","index":3,"n_rows":3,"n_cols":4,"rows_kept":3,"cut":false,"hidden":true,"merged":[]}
["Date","Changes","By","Comments"]
["2005-05-24","Change Test1 from ASTM931 to ASTMA931","Joe Liu"]
["2020-03-17","Changed breaking strength requirements to match DMS-11021, August 2014, requirements","RCANO","included versioning effective 3/20/20"]

{"sheet":"L to D Lookup","index":4,"n_rows":112,"n_cols":7,"rows_kept":112,"cut":false,"hidden":false,"merged":[]}
["Length to Diameter Ratio","Correction Factor",null,"English MOR","Metric MOR"]
[1,0.87,null,{"$f":"IF(ISERROR(IF('ASTM-A-931'!#REF!>('ASTM-A-931'!#REF!*0.05),\"RETEST\",IF('ASTM-A-931'!#REF!=0,ROUND(((('ASTM-A-931'!#REF!*6^3/'ASTM-A-931'!#REF!)*'ASTM-A-931'!#REF!)/('ASTM-A-931'!#REF!*'ASTM-A-931'!#REF!^2))*2,-1)/2,(ROUND(3*((('ASTM-A-931'!#REF!*6^3/'ASTM-A-931'!#REF!)*('ASTM-A-931'!#REF!/3-'ASTM-A-931'!#REF!))/('ASTM-A-931'!#REF!*'ASTM-A-931'!#REF!^2))*2,-1)/2)))),\"\",IF('ASTM-A-931'!#REF!>('ASTM-A-931'!#REF!*0.05),\"RETEST\",IF('ASTM-A-931'!#REF!=0,ROUND(((('ASTM-A-931'!#REF!*6^3/'ASTM-A-931'!#REF!)*'ASTM-A-931'!#REF!)/('ASTM-A-931'!#REF!*'ASTM-A-931'!#REF!^2))*2,-1)/2,(ROUND(3*((('ASTM-A-931'!#REF!*6^3/'ASTM-A-931'!#REF!)*('ASTM-A-931'!#REF!/3-'ASTM-A-931'!#REF!))/('ASTM-A-931'!#REF!*'ASTM-A-931'!#REF!^2))*2,-1)/2))))","v":""},{"$f":"IF(ISERROR(IF('ASTM-A-931'!#REF!>('ASTM-A-931'!#REF!*0.05),\"RETEST\",IF('ASTM-A-931'!#REF!=0,ROUND((((('ASTM-A-931'!#REF!*1000)*('ASTM-A-931'!#REF!))/(('ASTM-A-931'!#REF!)*(('ASTM-A-931'!#REF!))^2)))*2,-2)/2,ROUND((3*((('ASTM-A-931'!#REF!*1000)*('ASTM-A-931'!#REF!/3-'ASTM-A-931'!#REF!))/('ASTM-A-931'!#REF!*'ASTM-A-931'!#REF!^2)))*2,-2)/2))),\"\",IF('ASTM-A-931'!#REF!>('ASTM-A-931'!#REF!*0.05),\"RETEST\",IF('ASTM-A-931'!#REF!=0,ROUND((((('ASTM-A-931'!#REF!*1000)*('ASTM-A-931'!#REF!))/(('ASTM-A-931'!#REF!)*(('ASTM-A-931'!#REF!))^2)))*2,-2)/2,ROUND((3*((('ASTM-A-931'!#REF!*1000)*('ASTM-A-931'!#REF!/3-'ASTM-A-931'!#REF!))/('ASTM-A-931'!#REF!*'ASTM-A-931'!#REF!^2)))*2,-2)/2)))","v":""}]
[1.01,0.872,null,{"$f":"IF(ISERROR(IF('ASTM-A-931'!#REF!>('ASTM-A-931'!#REF!*0.05),\"RETEST\",IF('ASTM-A-931'!#REF!=0,ROUND(((('ASTM-A-931'!#REF!*6^3/'ASTM-A-931'!#REF!)*'ASTM-A-931'!#REF!)/('ASTM-A-931'!#REF!*'ASTM-A-931'!#REF!^2))*2,-1)/2,(ROUND(3*((('ASTM-A-931'!#REF!*6^3/'ASTM-A-931'!#REF!)*('ASTM-A-931'!#REF!/3-'ASTM-A-931'!#REF!))/('ASTM-A-931'!#REF!*'ASTM-A-931'!#REF!^2))*2,-1)/2)))),\"\",IF('ASTM-A-931'!#REF!>('ASTM-A-931'!#REF!*0.05),\"RETEST\",IF('ASTM-A-931'!#REF!=0,ROUND(((('ASTM-A-931'!#REF!*6^3/'ASTM-A-931'!#REF!)*'ASTM-A-931'!#REF!)/('ASTM-A-931'!#REF!*'ASTM-A-931'!#REF!^2))*2,-1)/2,(ROUND(3*((('ASTM-A-931'!#REF!*6^3/'ASTM-A-931'!#REF!)*('ASTM-A-931'!#REF!/3-'ASTM-A-931'!#REF!))/('ASTM-A-931'!#REF!*'ASTM-A-931'!#REF!^2))*2,-1)/2))))","v":""},{"$f":"IF(ISERROR(IF('ASTM-A-931'!#REF!>('ASTM-A-931'!#REF!*0.05),\"RETEST\",IF('ASTM-A-931'!#REF!=0,ROUND((((('ASTM-A-931'!#REF!*1000)*('ASTM-A-931'!#REF!))/(('ASTM-A-931'!#REF!)*(('ASTM-A-931'!#REF!))^2)))*2,-2)/2,ROUND((3*((('ASTM-A-931'!#REF!*1000)*('ASTM-A-931'!#REF!/3-'ASTM-A-931'!#REF!))/('ASTM-A-931'!#REF!*'ASTM-A-931'!#REF!^2)))*2,-2)/2))),\"\",IF('ASTM-A-931'!#REF!>('ASTM-A-931'!#REF!*0.05),\"RETEST\",IF('ASTM-A-931'!#REF!=0,ROUND((((('ASTM-A-931'!#REF!*1000)*('ASTM-A-931'!#REF!))/(('ASTM-A-931'!#REF!)*(('ASTM-A-931'!#REF!))^2)))*2,-2)/2,ROUND((3*((('ASTM-A-931'!#REF!*1000)*('ASTM-A-931'!#REF!/3-'ASTM-A-931'!#REF!))/('ASTM-A-931'!#REF!*'ASTM-A-931'!#REF!^2)))*2,-2)/2)))","v":""}]
[1.02,0.875,null,{"$f":"IF(ISERROR(IF('ASTM-A-931'!#REF!>('ASTM-A-931'!#REF!*0.05),\"RETEST\",IF('ASTM-A-931'!#REF!=0,ROUND(((('ASTM-A-931'!#REF!*6^3/'ASTM-A-931'!#REF!)*'ASTM-A-931'!#REF!)/('ASTM-A-931'!#REF!*'ASTM-A-931'!#REF!^2))*2,-1)/2,(ROUND(3*((('ASTM-A-931'!#REF!*6^3/'ASTM-A-931'!#REF!)*('ASTM-A-931'!#REF!/3-'ASTM-A-931'!#REF!))/('ASTM-A-931'!#REF!*'ASTM-A-931'!#REF!^2))*2,-1)/2)))),\"\",IF('ASTM-A-931'!#REF!>('ASTM-A-931'!#REF!*0.05),\"RETEST\",IF('ASTM-A-931'!#REF!=0,ROUND(((('ASTM-A-931'!#REF!*6^3/'ASTM-A-931'!#REF!)*'ASTM-A-931'!#REF!)/('ASTM-A-931'!#REF!*'ASTM-A-931'!#REF!^2))*2,-1)/2,(ROUND(3*((('ASTM-A-931'!#REF!*6^3/'ASTM-A-931'!#REF!)*('ASTM-A-931'!#REF!/3-'ASTM-A-931'!#REF!))/('ASTM-A-931'!#REF!*'ASTM-A-931'!#REF!^2))*2,-1)/2))))","v":""},{"$f":"IF(ISERROR(IF('ASTM-A-931'!#REF!>('ASTM-A-931'!#REF!*0.05),\"RETEST\",IF('ASTM-A-931'!#REF!=0,ROUND((((('ASTM-A-931'!#REF!*1000)*('ASTM-A-931'!#REF!))/(('ASTM-A-931'!#REF!)*(('ASTM-A-931'!#REF!))^2)))*2,-2)/2,ROUND((3*((('ASTM-A-931'!#REF!*1000)*('ASTM-A-931'!#REF!/3-'ASTM-A-931'!#REF!))/('ASTM-A-931'!#REF!*'ASTM-A-931'!#REF!^2)))*2,-2)/2))),\"\",IF('ASTM-A-931'!#REF!>('ASTM-A-931'!#REF!*0.05),\"RETEST\",IF('ASTM-A-931'!#REF!=0,ROUND((((('ASTM-A-931'!#REF!*1000)*('ASTM-A-931'!#REF!))/(('ASTM-A-931'!#REF!)*(('ASTM-A-931'!#REF!))^2)))*2,-2)/2,ROUND((3*((('ASTM-A-931'!#REF!*1000)*('ASTM-A-931'!#REF!/3-'ASTM-A-931'!#REF!))/('ASTM-A-931'!#REF!*'ASTM-A-931'!#REF!^2)))*2,-2)/2)))","v":""}]
[1.03,0.877,null,{"$f":"IF(ISERROR(IF('ASTM-A-931'!#REF!>('ASTM-A-931'!#REF!*0.05),\"RETEST\",IF('ASTM-A-931'!#REF!=0,ROUND(((('ASTM-A-931'!#REF!*6^3/'ASTM-A-931'!#REF!)*'ASTM-A-931'!#REF!)/('ASTM-A-931'!#REF!*'ASTM-A-931'!#REF!^2))*2,-1)/2,(ROUND(3*((('ASTM-A-931'!#REF!*6^3/'ASTM-A-931'!#REF!)*('ASTM-A-931'!#REF!/3-'ASTM-A-931'!#REF!))/('ASTM-A-931'!#REF!*'ASTM-A-931'!#REF!^2))*2,-1)/2)))),\"\",IF('ASTM-A-931'!#REF!>('ASTM-A-931'!#REF!*0.05),\"RETEST\",IF('ASTM-A-931'!#REF!=0,ROUND(((('ASTM-A-931'!#REF!*6^3/'ASTM-A-931'!#REF!)*'ASTM-A-931'!#REF!)/('ASTM-A-931'!#REF!*'ASTM-A-931'!#REF!^2))*2,-1)/2,(ROUND(3*((('ASTM-A-931'!#REF!*6^3/'ASTM-A-931'!#REF!)*('ASTM-A-931'!#REF!/3-'ASTM-A-931'!#REF!))/('ASTM-A-931'!#REF!*'ASTM-A-931'!#REF!^2))*2,-1)/2))))","v":""},{"$f":"IF(ISERROR(IF('ASTM-A-931'!#REF!>('ASTM-A-931'!#REF!*0.05),\"RETEST\",IF('ASTM-A-931'!#REF!=0,ROUND((((('ASTM-A-931'!#REF!*1000)*('ASTM-A-931'!#REF!))/(('ASTM-A-931'!#REF!)*(('ASTM-A-931'!#REF!))^2)))*2,-2)/2,ROUND((3*((('ASTM-A-931'!#REF!*1000)*('ASTM-A-931'!#REF!/3-'ASTM-A-931'!#REF!))/('ASTM-A-931'!#REF!*'ASTM-A-931'!#REF!^2)))*2,-2)/2))),\"\",IF('ASTM-A-931'!#REF!>('ASTM-A-931'!#REF!*0.05),\"RETEST\",IF('ASTM-A-931'!#REF!=0,ROUND((((('ASTM-A-931'!#REF!*1000)*('ASTM-A-931'!#REF!))/(('ASTM-A-931'!#REF!)*(('ASTM-A-931'!#REF!))^2)))*2,-2)/2,ROUND((3*((('ASTM-A-931'!#REF!*1000)*('ASTM-A-931'!#REF!/3-'ASTM-A-931'!#REF!))/('ASTM-A-931'!#REF!*'ASTM-A-931'!#REF!^2)))*2,-2)/2)))","v":""}]
[1.04,0.88,null,{"$f":"IF(ISERROR(IF('ASTM-A-931'!#REF!>('ASTM-A-931'!#REF!*0.05),\"RETEST\",IF('ASTM-A-931'!#REF!=0,ROUND(((('ASTM-A-931'!#REF!*6^3/'ASTM-A-931'!#REF!)*'ASTM-A-931'!#REF!)/('ASTM-A-931'!#REF!*'ASTM-A-931'!#REF!^2))*2,-1)/2,(ROUND(3*((('ASTM-A-931'!#REF!*6^3/'ASTM-A-931'!#REF!)*('ASTM-A-931'!#REF!/3-'ASTM-A-931'!#REF!))/('ASTM-A-931'!#REF!*'ASTM-A-931'!#REF!^2))*2,-1)/2)))),\"\",IF('ASTM-A-931'!#REF!>('ASTM-A-931'!#REF!*0.05),\"RETEST\",IF('ASTM-A-931'!#REF!=0,ROUND(((('ASTM-A-931'!#REF!*6^3/'ASTM-A-931'!#REF!)*'ASTM-A-931'!#REF!)/('ASTM-A-931'!#REF!*'ASTM-A-931'!#REF!^2))*2,-1)/2,(ROUND(3*((('ASTM-A-931'!#REF!*6^3/'ASTM-A-931'!#REF!)*('ASTM-A-931'!#REF!/3-'ASTM-A-931'!#REF!))/('ASTM-A-931'!#REF!*'ASTM-A-931'!#REF!^2))*2,-1)/2))))","v":""},{"$f":"IF(ISERROR(IF('ASTM-A-931'!#REF!>('ASTM-A-931'!#REF!*0.05),\"RETEST\",IF('ASTM-A-931'!#REF!=0,ROUND((((('ASTM-A-931'!#REF!*1000)*('ASTM-A-931'!#REF!))/(('ASTM-A-931'!#REF!)*(('ASTM-A-931'!#REF!))^2)))*2,-2)/2,ROUND((3*((('ASTM-A-931'!#REF!*1000)*('ASTM-A-931'!#REF!/3-'ASTM-A-931'!#REF!))/('ASTM-A-931'!#REF!*'ASTM-A-931'!#REF!^2)))*2,-2)/2))),\"\",IF('ASTM-A-931'!#REF!>('ASTM-A-931'!#REF!*0.05),\"RETEST\",IF('ASTM-A-931'!#REF!=0,ROUND((((('ASTM-A-931'!#REF!*1000)*('ASTM-A-931'!#REF!))/(('ASTM-A-931'!#REF!)*(('ASTM-A-931'!#REF!))^2)))*2,-2)/2,ROUND((3*((('ASTM-A-931'!#REF!*1000)*('ASTM-A-931'!#REF!/3-'ASTM-A-931'!#REF!))/('ASTM-A-931'!#REF!*'ASTM-A-931'!#REF!^2)))*2,-2)/2)))","v":""}]
[1.05,0.88200000000000001,null,{"$f":"IF(ISERROR(IF('ASTM-A-931'!#REF!>('ASTM-A-931'!#REF!*0.05),\"RETEST\",IF('ASTM-A-931'!#REF!=0,ROUND(((('ASTM-A-931'!#REF!*6^3/'ASTM-A-931'!#REF!)*'ASTM-A-931'!#REF!)/('ASTM-A-931'!#REF!*'ASTM-A-931'!#REF!^2))*2,-1)/2,(ROUND(3*((('ASTM-A-931'!#REF!*6^3/'ASTM-A-931'!#REF!)*('ASTM-A-931'!#REF!/3-'ASTM-A-931'!#REF!))/('ASTM-A-931'!#REF!*'ASTM-A-931'!#REF!^2))*2,-1)/2)))),\"\",IF('ASTM-A-931'!#REF!>('ASTM-A-931'!#REF!*0.05),\"RETEST\",IF('ASTM-A-931'!#REF!=0,ROUND(((('ASTM-A-931'!#REF!*6^3/'ASTM-A-931'!#REF!)*'ASTM-A-931'!#REF!)/('ASTM-A-931'!#REF!*'ASTM-A-931'!#REF!^2))*2,-1)/2,(ROUND(3*((('ASTM-A-931'!#REF!*6^3/'ASTM-A-931'!#REF!)*('ASTM-A-931'!#REF!/3-'ASTM-A-931'!#REF!))/('ASTM-A-931'!#REF!*'ASTM-A-931'!#REF!^2))*2,-1)/2))))","v":""},{"$f":"IF(ISERROR(IF('ASTM-A-931'!#REF!>('ASTM-A-931'!#REF!*0.05),\"RETEST\",IF('ASTM-A-931'!#REF!=0,ROUND((((('ASTM-A-931'!#REF!*1000)*('ASTM-A-931'!#REF!))/(('ASTM-A-931'!#REF!)*(('ASTM-A-931'!#REF!))^2)))*2,-2)/2,ROUND((3*((('ASTM-A-931'!#REF!*1000)*('ASTM-A-931'!#REF!/3-'ASTM-A-931'!#REF!))/('ASTM-A-931'!#REF!*'ASTM-A-931'!#REF!^2)))*2,-2)/2))),\"\",IF('ASTM-A-931'!#REF!>('ASTM-A-931'!#REF!*0.05),\"RETEST\",IF('ASTM-A-931'!#REF!=0,ROUND((((('ASTM-A-931'!#REF!*1000)*('ASTM-A-931'!#REF!))/(('ASTM-A-931'!#REF!)*(('ASTM-A-931'!#REF!))^2)))*2,-2)/2,ROUND((3*((('ASTM-A-931'!#REF!*1000)*('ASTM-A-931'!#REF!/3-'ASTM-A-931'!#REF!))/('ASTM-A-931'!#REF!*'ASTM-A-931'!#REF!^2)))*2,-2)/2)))","v":""}]
[1.06,0.88400000000000001,null,{"$f":"IF(ISERROR(IF('ASTM-A-931'!#REF!>('ASTM-A-931'!#REF!*0.05),\"RETEST\",IF('ASTM-A-931'!#REF!=0,ROUND(((('ASTM-A-931'!#REF!*6^3/'ASTM-A-931'!#REF!)*'ASTM-A-931'!#REF!)/('ASTM-A-931'!#REF!*'ASTM-A-931'!#REF!^2))*2,-1)/2,(ROUND(3*((('ASTM-A-931'!#REF!*6^3/'ASTM-A-931'!#REF!)*('ASTM-A-931'!#REF!/3-'ASTM-A-931'!#REF!))/('ASTM-A-931'!#REF!*'ASTM-A-931'!#REF!^2))*2,-1)/2)))),\"\",IF('ASTM-A-931'!#REF!>('ASTM-A-931'!#REF!*0.05),\"RETEST\",IF('ASTM-A-931'!#REF!=0,ROUND(((('ASTM-A-931'!#REF!*6^3/'ASTM-A-931'!#REF!)*'ASTM-A-931'!#REF!)/('ASTM-A-931'!#REF!*'ASTM-A-931'!#REF!^2))*2,-1)/2,(ROUND(3*((('ASTM-A-931'!#REF!*6^3/'ASTM-A-931'!#REF!)*('ASTM-A-931'!#REF!/3-'ASTM-A-931'!#REF!))/('ASTM-A-931'!#REF!*'ASTM-A-931'!#REF!^2))*2,-1)/2))))","v":""},{"$f":"IF(ISERROR(IF('ASTM-A-931'!#REF!>('ASTM-A-931'!#REF!*0.05),\"RETEST\",IF('ASTM-A-931'!#REF!=0,ROUND((((('ASTM-A-931'!#REF!*1000)*('ASTM-A-931'!#REF!))/(('ASTM-A-931'!#REF!)*(('ASTM-A-931'!#REF!))^2)))*2,-2)/2,ROUND((3*((('ASTM-A-931'!#REF!*1000)*('ASTM-A-931'!#REF!/3-'ASTM-A-931'!#REF!))/('ASTM-A-931'!#REF!*'ASTM-A-931'!#REF!^2)))*2,-2)/2))),\"\",IF('ASTM-A-931'!#REF!>('ASTM-A-931'!#REF!*0.05),\"RETEST\",IF('ASTM-A-931'!#REF!=0,ROUND((((('ASTM-A-931'!#REF!*1000)*('ASTM-A-931'!#REF!))/(('ASTM-A-931'!#REF!)*(('ASTM-A-931'!#REF!))^2)))*2,-2)/2,ROUND((3*((('ASTM-A-931'!#REF!*1000)*('ASTM-A-931'!#REF!/3-'ASTM-A-931'!#REF!))/('ASTM-A-931'!#REF!*'ASTM-A-931'!#REF!^2)))*2,-2)/2)))","v":""}]
[1.07,0.88700000000000001,null,{"$f":"IF(ISERROR(IF('ASTM-A-931'!#REF!>('ASTM-A-931'!#REF!*0.05),\"RETEST\",IF('ASTM-A-931'!#REF!=0,ROUND(((('ASTM-A-931'!#REF!*6^3/'ASTM-A-931'!#REF!)*'ASTM-A-931'!#REF!)/('ASTM-A-931'!#REF!*'ASTM-A-931'!#REF!^2))*2,-1)/2,(ROUND(3*((('ASTM-A-931'!#REF!*6^3/'ASTM-A-931'!#REF!)*('ASTM-A-931'!#REF!/3-'ASTM-A-931'!#REF!))/('ASTM-A-931'!#REF!*'ASTM-A-931'!#REF!^2))*2,-1)/2)))),\"\",IF('ASTM-A-931'!#REF!>('ASTM-A-931'!#REF!*0.05),\"RETEST\",IF('ASTM-A-931'!#REF!=0,ROUND(((('ASTM-A-931'!#REF!*6^3/'ASTM-A-931'!#REF!)*'ASTM-A-931'!#REF!)/('ASTM-A-931'!#REF!*'ASTM-A-931'!#REF!^2))*2,-1)/2,(ROUND(3*((('ASTM-A-931'!#REF!*6^3/'ASTM-A-931'!#REF!)*('ASTM-A-931'!#REF!/3-'ASTM-A-931'!#REF!))/('ASTM-A-931'!#REF!*'ASTM-A-931'!#REF!^2))*2,-1)/2))))","v":""},{"$f":"IF(ISERROR(IF('ASTM-A-931'!#REF!>('ASTM-A-931'!#REF!*0.05),\"RETEST\",IF('ASTM-A-931'!#REF!=0,ROUND((((('ASTM-A-931'!#REF!*1000)*('ASTM-A-931'!#REF!))/(('ASTM-A-931'!#REF!)*(('ASTM-A-931'!#REF!))^2)))*2,-2)/2,ROUND((3*((('ASTM-A-931'!#REF!*1000)*('ASTM-A-931'!#REF!/3-'ASTM-A-931'!#REF!))/('ASTM-A-931'!#REF!*'ASTM-A-931'!#REF!^2)))*2,-2)/2))),\"\",IF('ASTM-A-931'!#REF!>('ASTM-A-931'!#REF!*0.05),\"RETEST\",IF('ASTM-A-931'!#REF!=0,ROUND((((('ASTM-A-931'!#REF!*1000)*('ASTM-A-931'!#REF!))/(('ASTM-A-931'!#REF!)*(('ASTM-A-931'!#REF!))^2)))*2,-2)/2,ROUND((3*((('ASTM-A-931'!#REF!*1000)*('ASTM-A-931'!#REF!/3-'ASTM-A-931'!#REF!))/('ASTM-A-931'!#REF!*'ASTM-A-931'!#REF!^2)))*2,-2)/2)))","v":""}]
[1.08,0.88900000000000001]
[1.0900000000000001,0.89200000000000002,null,"English f'c","Metric f'c"]
[1.1000000000000001,0.89400000000000002,null,{"$f":"IF(ISERROR(ROUND('ASTM-A-931'!#REF!*('ASTM-A-931'!#REF!/(PI()*(IF(CircumDiameter1=\"Diameter\",'ASTM-A-931'!#REF!,SQRT('ASTM-A-931'!#REF!/PI())*2)^2/4))),-1)),\"\",ROUND('ASTM-A-931'!#REF!*('ASTM-A-931'!#REF!/(PI()*(IF(CircumDiameter1=\"Diameter\",'ASTM-A-931'!#REF!,SQRT('ASTM-A-931'!#REF!/PI())*2)^2/4))),-1))","v":""},{"$f":"IF(ISERROR(ROUND(0.000001*('ASTM-A-931'!#REF!*('ASTM-A-931'!#REF!/(PI()*((IF(CircumDiameter1=\"Diameter\",'ASTM-A-931'!#REF!,SQRT('ASTM-A-931'!#REF!/PI())*2)/1000)^2/4))))*2,1)/2),\"\",ROUND(0.000001*('ASTM-A-931'!#REF!*('ASTM-A-931'!#REF!/(PI()*((IF(CircumDiameter1=\"Diameter\",'ASTM-A-931'!#REF!,SQRT('ASTM-A-931'!#REF!/PI())*2)/1000)^2/4))))*2,1)/2)","v":""}]
[1.1100000000000001,0.89600000000000002,null,{"$f":"IF(ISERROR(ROUND('ASTM-A-931'!#REF!*('ASTM-A-931'!#REF!/(PI()*(IF(CircumDiameter1=\"Diameter\",'ASTM-A-931'!#REF!,SQRT('ASTM-A-931'!#REF!/PI())*2)^2/4))),-1)),\"\",ROUND('ASTM-A-931'!#REF!*('ASTM-A-931'!#REF!/(PI()*(IF(CircumDiameter1=\"Diameter\",'ASTM-A-931'!#REF!,SQRT('ASTM-A-931'!#REF!/PI())*2)^2/4))),-1))","v":""},{"$f":"IF(ISERROR(ROUND(0.000001*('ASTM-A-931'!#REF!*('ASTM-A-931'!#REF!/(PI()*((IF(CircumDiameter1=\"Diameter\",'ASTM-A-931'!#REF!,SQRT('ASTM-A-931'!#REF!/PI())*2)/1000)^2/4))))*2,1)/2),\"\",ROUND(0.000001*('ASTM-A-931'!#REF!*('ASTM-A-931'!#REF!/(PI()*((IF(CircumDiameter1=\"Diameter\",'ASTM-A-931'!#REF!,SQRT('ASTM-A-931'!#REF!/PI())*2)/1000)^2/4))))*2,1)/2)","v":""}]
[1.1200000000000001,0.89900000000000002,null,{"$f":"IF(ISERROR(ROUND('ASTM-A-931'!#REF!*('ASTM-A-931'!#REF!/(PI()*(IF(CircumDiameter1=\"Diameter\",'ASTM-A-931'!#REF!,SQRT('ASTM-A-931'!#REF!/PI())*2)^2/4))),-1)),\"\",ROUND('ASTM-A-931'!#REF!*('ASTM-A-931'!#REF!/(PI()*(IF(CircumDiameter1=\"Diameter\",'ASTM-A-931'!#REF!,SQRT('ASTM-A-931'!#REF!/PI())*2)^2/4))),-1))","v":""},{"$f":"IF(ISERROR(ROUND(0.000001*('ASTM-A-931'!#REF!*('ASTM-A-931'!#REF!/(PI()*((IF(CircumDiameter1=\"Diameter\",'ASTM-A-931'!#REF!,SQRT('ASTM-A-931'!#REF!/PI())*2)/1000)^2/4))))*2,1)/2),\"\",ROUND(0.000001*('ASTM-A-931'!#REF!*('ASTM-A-931'!#REF!/(PI()*((IF(CircumDiameter1=\"Diameter\",'ASTM-A-931'!#REF!,SQRT('ASTM-A-931'!#REF!/PI())*2)/1000)^2/4))))*2,1)/2)","v":""}]
[1.1299999999999999,0.90100000000000002,null,{"$f":"IF(ISERROR(ROUND('ASTM-A-931'!#REF!*('ASTM-A-931'!#REF!/(PI()*(IF(CircumDiameter1=\"Diameter\",'ASTM-A-931'!#REF!,SQRT('ASTM-A-931'!#REF!/PI())*2)^2/4))),-1)),\"\",ROUND('ASTM-A-931'!#REF!*('ASTM-A-931'!#REF!/(PI()*(IF(CircumDiameter1=\"Diameter\",'ASTM-A-931'!#REF!,SQRT('ASTM-A-931'!#REF!/PI())*2)^2/4))),-1))","v":""},{"$f":"IF(ISERROR(ROUND(0.000001*('ASTM-A-931'!#REF!*('ASTM-A-931'!#REF!/(PI()*((IF(CircumDiameter1=\"Diameter\",'ASTM-A-931'!#REF!,SQRT('ASTM-A-931'!#REF!/PI())*2)/1000)^2/4))))*2,1)/2),\"\",ROUND(0.000001*('ASTM-A-931'!#REF!*('ASTM-A-931'!#REF!/(PI()*((IF(CircumDiameter1=\"Diameter\",'ASTM-A-931'!#REF!,SQRT('ASTM-A-931'!#REF!/PI())*2)/1000)^2/4))))*2,1)/2)","v":""}]
{"$rows_left_out":97}