{"text_format":"1","workbook":"xlsx","n_sheets":5,"sheets":["ASTM-A-931","RX","Diameter","Revisions","L to D Lookup"],"not_rendered":{"charts":0,"images":1,"macros":1,"external_links":0,"defined_names":90,"comments":1,"pivot_tables":0},"unopened":[],"bounds":{"document_bytes":16777216,"sheet_cells":100000,"rows_first":2000,"rows_last":500,"rows_between":2000,"halvings":0,"cell_chars":16384,"cell_head_chars":4096},"cells_cut":0,"cells_raw":0,"read":"whole","date_system":"1900"}

{"sheet":"ASTM-A-931","index":0,"n_rows":48,"n_cols":11,"rows_kept":48,"cut":false,"hidden":false,"merged":[[0,0,0,1],[16,3,16,4],[7,3,7,4],[13,3,13,4],[11,3,11,4],[8,3,8,4],[10,3,10,4],[12,3,12,4],[9,3,9,4],[15,3,15,8],[31,10,32,10],[16,7,16,8],[7,7,7,8],[10,7,10,8],[8,7,8,8],[11,7,11,8],[9,7,9,8],[12,7,12,8],[27,10,28,10],[13,7,13,8],[29,10,30,10],[24,10,25,10],[14,3,14,8],[40,2,40,4],[36,1,37,8],[21,2,21,4],[22,2,22,4],[24,3,25,3],[24,8,25,8],[27,6,27,7],[28,6,28,7],[24,6,26,7],[24,2,26,2],[47,1,47,3],[24,4,25,4],[33,10,34,10],[43,6,43,8],[24,9,25,9],[24,5,25,5],[43,1,43,3],[41,2,41,4],[29,6,29,7],[39,1,39,8],[34,6,34,7],[30,6,30,7],[31,6,31,7],[32,6,32,7],[33,6,33,7],[38,1,38,8]]}
["TxDOT Manuals >",null,null,"ASTM A 931"]
[null,"TEXAS DEPARTMENT OF TRANSPORTATION",null,null,null,null,null,null,null,null,41]
[null,null,null,null,null,null,null,null,null,null,1]
[null,null,null,null,null,null,null,null,null,null,"astma931.xlsm::45575.373993"]
[null,"TENSION TESTING OF WIRE ROPES AND STRAND"]
[null,"ASTM A 931"]
[null,null,null,null,null,null,null,null,{"$f":"\"ASTM A 931 - File Version: \" & TEXT(MID(sn,SEARCH(\"::\",sn,1)+2,20),\"mm/dd/yy hh:mm:ss\")","v":"ASTM A 931 - File Version: 10/10/24 08:58:33"}]
[null,null,"SAMPLE ID:",null,null,null,"SAMPLED DATE:"]
[null,null,"TEST NUMBER:",null,null,null,"LETTING DATE:"]
[null,null,"SAMPLE STATUS:",null,null,null,"CONTROLLING CSJ:"]
[null,null,"COUNTY:",null,null,null,"SPEC YEAR:"]
[null,null,"SAMPLED BY:",null,null,null,"SPEC ITEM:"]
[null,null,"SAMPLE LOCATION:",null,null,null,"SPECIAL PROVISION:"]
[null,null,"MATERIAL CODE:",null,null,null,"GRADE:"]
[null,null,"MATERIAL NAME:"]
[null,null,"PRODUCER:"]
[null,null,"AREA ENGINEER:",null,null,null,"PROJECT MANAGER:"]
[]
[null,null,"COURSE\\LIFT:",null,"STATION:",null,null,"DIST. FROM CL:"]
[]
[null,null,null,null,null,"Nominal Rope Diameter","Strand Configuration","Minimum Tensile Strength Requirements"]
[null,null,"SS304 Rotation Resistant Wire Rope",null,null,"3/8 inches","19 x 7","11,100 Lbs."]
[null,null,"SS304 Wire Rope",null,null,"5/16 inches","7 x 19","9,000 Lbs."]
[]
[null,null,"Heat Number","Nominal Rope Diameter","Length of Rope","Tensile Strength","Meet Minimun Tensile strength Requirements"]
[]
[null,null,null,{"$f":"IF(SpecYear=\"\",\"\",IF(SpecYear=\"1993\",\"( inches )\",IF(SpecYear>=\"2004\",\"( inches )\",\"( mm )\")))","v":""},{"$f":"IF(SpecYear=\"\",\"\",IF(SpecYear=\"1993\",\"( inches )\",IF(SpecYear>=\"2004\",\"( inches )\",\"( mm )\")))","v":""},{"$f":"IF(SpecYear=\"\",\"\",IF(SpecYear=\"1993\",\"( Lbs. )\",IF(SpecYear>=\"2004\",\"( Lbs. )\",\"( Newtons )\")))","v":""}]
[null,1,null,null,null,null,{"$f":"IF(version>0, IF(F28=\"\",\"\",IF(OR(D28=0.375,D28=9.525),IF(F28>11000,\"Yes\",\"No\"),IF(F28>9000,\"Yes\",\"No\"))), IF(F28=\"\",\"\",IF(OR(D28=0.375,D28=9.525),IF(F28>10800,\"Yes\",\"No\"),IF(F28>8800,\"Yes\",\"No\"))))","v":""}]
[null,2,null,null,null,null,""]
[null,3,null,null,null,null,""]
[null,4,null,null,null,null,""]
[null,5,null,null,null,null,""]
[null,6,null,null,null,null,""]
[null,7,null,null,null,null,""]
[null,8,null,null,null,null,""]
[null,"Remarks:",{"$f":"NOW()","v":"2024-10-10T08:58:33.630"}]
[]
[]
[]
[]
[null,"Test Method:","Tested By:",null,null,"Tested Date:"]
[null,"ASTMA931"]
[null,"Test Stamp Code:",null,null,"Omit Test:","Completed Date:","Reviewed By:"]
[]
[null,"Locked By:","TxDOT:","District:","Area:"]
[]
[null,"Authorized By:",null,null,"Authorized Date:"]
[null,null,null,null,null,{"$f":"IF(OR(ISBLANK(AuthorizedDate), TODAY()>=44000), 1, 0)","v":1}]

{"sheet":"RX","index":1,"n_rows":46,"n_cols":9,"rows_kept":46,"cut":false,"hidden":true,"merged":[]}
[44]
["Fld_nbr","Value","Desc_1","Desc_2","Desc_3","Desc_4","Desc_5","Desc_6","Desc_7"]
[1,{"$f":"IF('ASTM-A-931'!$B$37=\"\",\"\",'ASTM-A-931'!$B$37)","v":""},{"$f":"'ASTM-A-931'!$B$36","v":"Remarks:"}]
[2,{"$f":"IF('ASTM-A-931'!$D$19=\"\",\"\",'ASTM-A-931'!$D$19)","v":""},{"$f":"IF('ASTM-A-931'!$C$19=\"\",\"\",'ASTM-A-931'!$C$19)","v":"COURSE\\LIFT:"}]
[3,{"$f":"IF('ASTM-A-931'!$C$42=\"\",\"\",'ASTM-A-931'!$C$42)","v":""},"Tested By ",{"$f":"IF('ASTM-A-931'!$B$42=\"\",\"\",'ASTM-A-931'!$B$42)","v":"ASTMA931"}]
[4,{"$f":"IF('ASTM-A-931'!$F$42=\"\",\"\",'ASTM-A-931'!$F$42)","v":""},"Tested Date ",{"$f":"IF('ASTM-A-931'!$B$42=\"\",\"\",'ASTM-A-931'!$B$42)","v":"ASTMA931"}]
[5,{"$f":"IF('ASTM-A-931'!$C$28=\"\",\"\",'ASTM-A-931'!$C$28)","v":""},{"$f":"IF( 'ASTM-A-931'!$B$6=\"\",\"\", 'ASTM-A-931'!$B$6)","v":"ASTM A 931"},{"$f":"IF('ASTM-A-931'!$C$25=\"\",\"\",'ASTM-A-931'!$C$25)","v":"Heat Number"},{"$f":"IF('ASTM-A-931'!$B$28=\"\",\"\",'ASTM-A-931'!$B$28)","v":1}]
[6,{"$f":"IF('ASTM-A-931'!$D$28=\"\",\"\",'ASTM-A-931'!$D$28)","v":""},{"$f":"IF( 'ASTM-A-931'!$B$6=\"\",\"\", 'ASTM-A-931'!$B$6)","v":"ASTM A 931"},{"$f":"IF('ASTM-A-931'!$D$25=\"\",\"\",'ASTM-A-931'!$D$25)","v":"Nominal Rope Diameter"},{"$f":"IF('ASTM-A-931'!$D$27=\"\",\"\",'ASTM-A-931'!$D$27)","v":""},{"$f":"IF('ASTM-A-931'!$B$28=\"\",\"\",'ASTM-A-931'!$B$28)","v":1}]
[7,{"$f":"IF('ASTM-A-931'!$E$28=\"\",\"\",'ASTM-A-931'!$E$28)","v":""},{"$f":"IF( 'ASTM-A-931'!$B$6=\"\",\"\", 'ASTM-A-931'!$B$6)","v":"ASTM A 931"},{"$f":"IF('ASTM-A-931'!$E$25=\"\",\"\",'ASTM-A-931'!$E$25)","v":"Length of Rope"},{"$f":"IF('ASTM-A-931'!$E$27=\"\",\"\",'ASTM-A-931'!$E$27)","v":""},{"$f":"IF('ASTM-A-931'!$B$28=\"\",\"\",'ASTM-A-931'!$B$28)","v":1}]
[8,{"$f":"IF('ASTM-A-931'!$F$28=\"\",\"\",'ASTM-A-931'!$F$28)","v":""},{"$f":"IF( 'ASTM-A-931'!$B$6=\"\",\"\", 'ASTM-A-931'!$B$6)","v":"ASTM A 931"},{"$f":"IF('ASTM-A-931'!$F$25=\"\",\"\",'ASTM-A-931'!$F$25)","v":"Tensile Strength"},{"$f":"IF('ASTM-A-931'!$F$27=\"\",\"\",'ASTM-A-931'!$F$27)","v":""},{"$f":"IF('ASTM-A-931'!$B$28=\"\",\"\",'ASTM-A-931'!$B$28)","v":1}]
[9,{"$f":"IF('ASTM-A-931'!$G$28=\"\",\"\",'ASTM-A-931'!$G$28)","v":""},{"$f":"IF( 'ASTM-A-931'!$B$6=\"\",\"\", 'ASTM-A-931'!$B$6)","v":"ASTM A 931"},{"$f":"IF('ASTM-A-931'!$G$25=\"\",\"\",'ASTM-A-931'!$G$25)","v":"Meet Minimun Tensile strength Requirements"},{"$f":"IF('ASTM-A-931'!$B$28=\"\",\"\",'ASTM-A-931'!$B$28)","v":1}]
[10,{"$f":"IF('ASTM-A-931'!$C$29=\"\",\"\",'ASTM-A-931'!$C$29)","v":""},{"$f":"IF( 'ASTM-A-931'!$B$6=\"\",\"\", 'ASTM-A-931'!$B$6)","v":"ASTM A 931"},{"$f":"IF('ASTM-A-931'!$C$25=\"\",\"\",'ASTM-A-931'!$C$25)","v":"Heat Number"},{"$f":"IF('ASTM-A-931'!$B$29=\"\",\"\",'ASTM-A-931'!$B$29)","v":2}]
[11,{"$f":"IF('ASTM-A-931'!$D$29=\"\",\"\",'ASTM-A-931'!$D$29)","v":""},{"$f":"IF( 'ASTM-A-931'!$B$6=\"\",\"\", 'ASTM-A-931'!$B$6)","v":"ASTM A 931"},{"$f":"IF('ASTM-A-931'!$D$25=\"\",\"\",'ASTM-A-931'!$D$25)","v":"Nominal Rope Diameter"},{"$f":"IF('ASTM-A-931'!$D$27=\"\",\"\",'ASTM-A-931'!$D$27)","v":""},{"$f":"IF('ASTM-A-931'!$B$29=\"\",\"\",'ASTM-A-931'!$B$29)","v":2}]
[12,{"$f":"IF('ASTM-A-931'!$E$29=\"\",\"\",'ASTM-A-931'!$E$29)","v":""},{"$f":"IF( 'ASTM-A-931'!$B$6=\"\",\"\", 'ASTM-A-931'!$B$6)","v":"ASTM A 931"},{"$f":"IF('ASTM-A-931'!$E$25=\"\",\"\",'ASTM-A-931'!$E$25)","v":"Length of Rope"},{"$f":"IF('ASTM-A-931'!$E$27=\"\",\"\",'ASTM-A-931'!$E$27)","v":""},{"$f":"IF('ASTM-A-931'!$B$29=\"\",\"\",'ASTM-A-931'!$B$29)","v":2}]
[13,{"$f":"IF('ASTM-A-931'!$F$29=\"\",\"\",'ASTM-A-931'!$F$29)","v":""},{"$f":"IF( 'ASTM-A-931'!$B$6=\"\",\"\", 'ASTM-A-931'!$B$6)","v":"ASTM A 931"},{"$f":"IF('ASTM-A-931'!$F$25=\"\",\"\",'ASTM-A-931'!$F$25)","v":"Tensile Strength"},{"$f":"IF('ASTM-A-931'!$F$27=\"\",\"\",'ASTM-A-931'!$F$27)","v":""},{"$f":"IF('ASTM-A-931'!$B$29=\"\",\"\",'ASTM-A-931'!$B$29)","v":2}]
[14,{"$f":"IF('ASTM-A-931'!$G$29=\"\",\"\",'ASTM-A-931'!$G$29)","v":""},{"$f":"IF( 'ASTM-A-931'!$B$6=\"\",\"\", 'ASTM-A-931'!$B$6)","v":"ASTM A 931"},{"$f":"IF('ASTM-A-931'!$G$25=\"\",\"\",'ASTM-A-931'!$G$25)","v":"Meet Minimun Tensile strength Requirements"},{"$f":"IF('ASTM-A-931'!$B$29=\"\",\"\",'ASTM-A-931'!$B$29)","v":2}]
[15,{"$f":"IF('ASTM-A-931'!$C$30=\"\",\"\",'ASTM-A-931'!$C$30)","v":""},{"$f":"IF( 'ASTM-A-931'!$B$6=\"\",\"\", 'ASTM-A-931'!$B$6)","v":"ASTM A 931"},{"$f":"IF('ASTM-A-931'!$C$25=\"\",\"\",'ASTM-A-931'!$C$25)","v":"Heat Number"},{"$f":"IF('ASTM-A-931'!$B$30=\"\",\"\",'ASTM-A-931'!$B$30)","v":3}]
[16,{"$f":"IF('ASTM-A-931'!$D$30=\"\",\"\",'ASTM-A-931'!$D$30)","v":""},{"$f":"IF( 'ASTM-A-931'!$B$6=\"\",\"\", 'ASTM-A-931'!$B$6)","v":"ASTM A 931"},{"$f":"IF('ASTM-A-931'!$D$25=\"\",\"\",'ASTM-A-931'!$D$25)","v":"Nominal Rope Diameter"},{"$f":"IF('ASTM-A-931'!$D$27=\"\",\"\",'ASTM-A-931'!$D$27)","v":""},{"$f":"IF('ASTM-A-931'!$B$30=\"\",\"\",'ASTM-A-931'!$B$30)","v":3}]
[17,{"$f":"IF('ASTM-A-931'!$E$30=\"\",\"\",'ASTM-A-931'!$E$30)","v":""},{"$f":"IF( 'ASTM-A-931'!$B$6=\"\",\"\", 'ASTM-A-931'!$B$6)","v":"ASTM A 931"},{"$f":"IF('ASTM-A-931'!$E$25=\"\",\"\",'ASTM-A-931'!$E$25)","v":"Length of Rope"},{"$f":"IF('ASTM-A-931'!$E$27=\"\",\"\",'ASTM-A-931'!$E$27)","v":""},{"$f":"IF('ASTM-A-931'!$B$30=\"\",\"\",'ASTM-A-931'!$B$30)","v":3}]
[18,{"$f":"IF('ASTM-A-931'!$F$30=\"\",\"\",'ASTM-A-931'!$F$30)","v":""},{"$f":"IF( 'ASTM-A-931'!$B$6=\"\",\"\", 'ASTM-A-931'!$B$6)","v":"ASTM A 931"},{"$f":"IF('ASTM-A-931'!$F$25=\"\",\"\",'ASTM-A-931'!$F$25)","v":"Tensile Strength"},{"$f":"IF('ASTM-A-931'!$F$27=\"\",\"\",'ASTM-A-931'!$F$27)","v":""},{"$f":"IF('ASTM-A-931'!$B$30=\"\",\"\",'ASTM-A-931'!$B$30)","v":3}]
[19,{"$f":"IF('ASTM-A-931'!$G$30=\"\",\"\",'ASTM-A-931'!$G$30)","v":""},{"$f":"IF( 'ASTM-A-931'!$B$6=\"\",\"\", 'ASTM-A-931'!$B$6)","v":"ASTM A 931"},{"$f":"IF('ASTM-A-931'!$G$25=\"\",\"\",'ASTM-A-931'!$G$25)","v":"Meet Minimun Tensile strength Requirements"},{"$f":"IF('ASTM-A-931'!$B$30=\"\",\"\",'ASTM-A-931'!$B$30)","v":3}]
[20,{"$f":"IF('ASTM-A-931'!$C$31=\"\",\"\",'ASTM-A-931'!$C$31)","v":""},{"$f":"IF( 'ASTM-A-931'!$B$6=\"\",\"\", 'ASTM-A-931'!$B$6)","v":"ASTM A 931"},{"$f":"IF('ASTM-A-931'!$C$25=\"\",\"\",'ASTM-A-931'!$C$25)","v":"Heat Number"},{"$f":"IF('ASTM-A-931'!$B$31=\"\",\"\",'ASTM-A-931'!$B$31)","v":4}]
[21,{"$f":"IF('ASTM-A-931'!$D$31=\"\",\"\",'ASTM-A-931'!$D$31)","v":""},{"$f":"IF( 'ASTM-A-931'!$B$6=\"\",\"\", 'ASTM-A-931'!$B$6)","v":"ASTM A 931"},{"$f":"IF('ASTM-A-931'!$D$25=\"\",\"\",'ASTM-A-931'!$D$25)","v":"Nominal Rope Diameter"},{"$f":"IF('ASTM-A-931'!$D$27=\"\",\"\",'ASTM-A-931'!$D$27)","v":""},{"$f":"IF('ASTM-A-931'!$B$31=\"\",\"\",'ASTM-A-931'!$B$31)","v":4}]
[22,{"$f":"IF('ASTM-A-931'!$E$31=\"\",\"\",'ASTM-A-931'!$E$31)","v":""},{"$f":"IF( 'ASTM-A-931'!$B$6=\"\",\"\", 'ASTM-A-931'!$B$6)","v":"ASTM A 931"},{"$f":"IF('ASTM-A-931'!$E$25=\"\",\"\",'ASTM-A-931'!$E$25)","v":"Length of Rope"},{"$f":"IF('ASTM-A-931'!$E$27=\"\",\"\",'ASTM-A-931'!$E$27)","v":""},{"$f":"IF('ASTM-A-931'!$B$31=\"\",\"\",'ASTM-A-931'!$B$31)","v":4}]
[23,{"$f":"IF('ASTM-A-931'!$F$31=\"\",\"\",'ASTM-A-931'!$F$31)","v":""},{"$f":"IF( 'ASTM-A-931'!$B$6=\"\",\"\", 'ASTM-A-931'!$B$6)","v":"ASTM A 931"},{"$f":"IF('ASTM-A-931'!$F$25=\"\",\"\",'ASTM-A-931'!$F$25)","v":"Tensile Strength"},{"$f":"IF('ASTM-A-931'!$F$27=\"\",\"\",'ASTM-A-931'!$F$27)","v":""},{"$f":"IF('ASTM-A-931'!$B$31=\"\",\"\",'ASTM-A-931'!$B$31)","v":4}]
[24,{"$f":"IF('ASTM-A-931'!$G$31=\"\",\"\",'ASTM-A-931'!$G$31)","v":""},{"$f":"IF( 'ASTM-A-931'!$B$6=\"\",\"\", 'ASTM-A-931'!$B$6)","v":"ASTM A 931"},{"$f":"IF('ASTM-A-931'!$G$25=\"\",\"\",'ASTM-A-931'!$G$25)","v":"Meet Minimun Tensile strength Requirements"},{"$f":"IF('ASTM-A-931'!$B$31=\"\",\"\",'ASTM-A-931'!$B$31)","v":4}]
[25,{"$f":"IF('ASTM-A-931'!$C$32=\"\",\"\",'ASTM-A-931'!$C$32)","v":""},{"$f":"IF( 'ASTM-A-931'!$B$6=\"\",\"\", 'ASTM-A-931'!$B$6)","v":"ASTM A 931"},{"$f":"IF('ASTM-A-931'!$C$25=\"\",\"\",'ASTM-A-931'!$C$25)","v":"Heat Number"},{"$f":"IF('ASTM-A-931'!$B$32=\"\",\"\",'ASTM-A-931'!$B$32)","v":5}]
[26,{"$f":"IF('ASTM-A-931'!$D$32=\"\",\"\",'ASTM-A-931'!$D$32)","v":""},{"$f":"IF( 'ASTM-A-931'!$B$6=\"\",\"\", 'ASTM-A-931'!$B$6)","v":"ASTM A 931"},{"$f":"IF('ASTM-A-931'!$D$25=\"\",\"\",'ASTM-A-931'!$D$25)","v":"Nominal Rope Diameter"},{"$f":"IF('ASTM-A-931'!$D$27=\"\",\"\",'ASTM-A-931'!$D$27)","v":""},{"$f":"IF('ASTM-A-931'!$B$32=\"\",\"\",'ASTM-A-931'!$B$32)","v":5}]
[27,{"$f":"IF('ASTM-A-931'!$E$32=\"\",\"\",'ASTM-A-931'!$E$32)","v":""},{"$f":"IF( 'ASTM-A-931'!$B$6=\"\",\"\", 'ASTM-A-931'!$B$6)","v":"ASTM A 931"},{"$f":"IF('ASTM-A-931'!$E$25=\"\",\"\",'ASTM-A-931'!$E$25)","v":"Length of Rope"},{"$f":"IF('ASTM-A-931'!$E$27=\"\",\"\",'ASTM-A-931'!$E$27)","v":""},{"$f":"IF('ASTM-A-931'!$B$32=\"\",\"\",'ASTM-A-931'!$B$32)","v":5}]
[28,{"$f":"IF('ASTM-A-931'!$F$32=\"\",\"\",'ASTM-A-931'!$F$32)","v":""},{"$f":"IF( 'ASTM-A-931'!$B$6=\"\",\"\", 'ASTM-A-931'!$B$6)","v":"ASTM A 931"},{"$f":"IF('ASTM-A-931'!$F$25=\"\",\"\",'ASTM-A-931'!$F$25)","v":"Tensile Strength"},{"$f":"IF('ASTM-A-931'!$F$27=\"\",\"\",'ASTM-A-931'!$F$27)","v":""},{"$f":"IF('ASTM-A-931'!$B$32=\"\",\"\",'ASTM-A-931'!$B$32)","v":5}]
[29,{"$f":"IF('ASTM-A-931'!$G$32=\"\",\"\",'ASTM-A-931'!$G$32)","v":""},{"$f":"IF( 'ASTM-A-931'!$B$6=\"\",\"\", 'ASTM-A-931'!$B$6)","v":"ASTM A 931"},{"$f":"IF('ASTM-A-931'!$G$25=\"\",\"\",'ASTM-A-931'!$G$25)","v":"Meet Minimun Tensile strength Requirements"},{"$f":"IF('ASTM-A-931'!$B$32=\"\",\"\",'ASTM-A-931'!$B$32)","v":5}]
[30,{"$f":"IF('ASTM-A-931'!$C$33=\"\",\"\",'ASTM-A-931'!$C$33)","v":""},{"$f":"IF( 'ASTM-A-931'!$B$6=\"\",\"\", 'ASTM-A-931'!$B$6)","v":"ASTM A 931"},{"$f":"IF('ASTM-A-931'!$C$25=\"\",\"\",'ASTM-A-931'!$C$25)","v":"Heat Number"},{"$f":"IF('ASTM-A-931'!$B$33=\"\",\"\",'ASTM-A-931'!$B$33)","v":6}]
[31,{"$f":"IF('ASTM-A-931'!$D$33=\"\",\"\",'ASTM-A-931'!$D$33)","v":""},{"$f":"IF( 'ASTM-A-931'!$B$6=\"\",\"\", 'ASTM-A-931'!$B$6)","v":"ASTM A 931"},{"$f":"IF('ASTM-A-931'!$D$25=\"\",\"\",'ASTM-A-931'!$D$25)","v":"Nominal Rope Diameter"},{"$f":"IF('ASTM-A-931'!$D$27=\"\",\"\",'ASTM-A-931'!$D$27)","v":""},{"$f":"IF('ASTM-A-931'!$B$33=\"\",\"\",'ASTM-A-931'!$B$33)","v":6}]
[32,{"$f":"IF('ASTM-A-931'!$E$33=\"\",\"\",'ASTM-A-931'!$E$33)","v":""},{"$f":"IF( 'ASTM-A-931'!$B$6=\"\",\"\", 'ASTM-A-931'!$B$6)","v":"ASTM A 931"},{"$f":"IF('ASTM-A-931'!$E$25=\"\",\"\",'ASTM-A-931'!$E$25)","v":"Length of Rope"},{"$f":"IF('ASTM-A-931'!$E$27=\"\",\"\",'ASTM-A-931'!$E$27)","v":""},{"$f":"IF('ASTM-A-931'!$B$33=\"\",\"\",'ASTM-A-931'!$B$33)","v":6}]
[33,{"$f":"IF('ASTM-A-931'!$F$33=\"\",\"\",'ASTM-A-931'!$F$33)","v":""},{"$f":"IF( 'ASTM-A-931'!$B$6=\"\",\"\", 'ASTM-A-931'!$B$6)","v":"ASTM A 931"},{"$f":"IF('ASTM-A-931'!$F$25=\"\",\"\",'ASTM-A-931'!$F$25)","v":"Tensile Strength"},{"$f":"IF('ASTM-A-931'!$F$27=\"\",\"\",'ASTM-A-931'!$F$27)","v":""},{"$f":"IF('ASTM-A-931'!$B$33=\"\",\"\",'ASTM-A-931'!$B$33)","v":6}]
[34,{"$f":"IF('ASTM-A-931'!$G$33=\"\",\"\",'ASTM-A-931'!$G$33)","v":""},{"$f":"IF( 'ASTM-A-931'!$B$6=\"\",\"\", 'ASTM-A-931'!$B$6)","v":"ASTM A 931"},{"$f":"IF('ASTM-A-931'!$G$25=\"\",\"\",'ASTM-A-931'!$G$25)","v":"Meet Minimun Tensile strength Requirements"},{"$f":"IF('ASTM-A-931'!$B$33=\"\",\"\",'ASTM-A-931'!$B$33)","v":6}]
[35,{"$f":"IF('ASTM-A-931'!$C$34=\"\",\"\",'ASTM-A-931'!$C$34)","v":""},{"$f":"IF( 'ASTM-A-931'!$B$6=\"\",\"\", 'ASTM-A-931'!$B$6)","v":"ASTM A 931"},{"$f":"IF('ASTM-A-931'!$C$25=\"\",\"\",'ASTM-A-931'!$C$25)","v":"Heat Number"},{"$f":"IF('ASTM-A-931'!$B$34=\"\",\"\",'ASTM-A-931'!$B$34)","v":7}]
[36,{"$f":"IF('ASTM-A-931'!$D$34=\"\",\"\",'ASTM-A-931'!$D$34)","v":""},{"$f":"IF( 'ASTM-A-931'!$B$6=\"\",\"\", 'ASTM-A-931'!$B$6)","v":"ASTM A 931"},{"$f":"IF('ASTM-A-931'!$D$25=\"\",\"\",'ASTM-A-931'!$D$25)","v":"Nominal Rope Diameter"},{"$f":"IF('ASTM-A-931'!$D$27=\"\",\"\",'ASTM-A-931'!$D$27)","v":""},{"$f":"IF('ASTM-A-931'!$B$34=\"\",\"\",'ASTM-A-931'!$B$34)","v":7}]
[37,{"$f":"IF('ASTM-A-931'!$E$34=\"\",\"\",'ASTM-A-931'!$E$34)","v":""},{"$f":"IF( 'ASTM-A-931'!$B$6=\"\",\"\", 'ASTM-A-931'!$B$6)","v":"ASTM A 931"},{"$f":"IF('ASTM-A-931'!$E$25=\"\",\"\",'ASTM-A-931'!$E$25)","v":"Length of Rope"},{"$f":"IF('ASTM-A-931'!$E$27=\"\",\"\",'ASTM-A-931'!$E$27)","v":""},{"$f":"IF('ASTM-A-931'!$B$34=\"\",\"\",'ASTM-A-931'!$B$34)","v":7}]
[38,{"$f":"IF('ASTM-A-931'!$F$34=\"\",\"\",'ASTM-A-931'!$F$34)","v":""},{"$f":"IF( 'ASTM-A-931'!$B$6=\"\",\"\", 'ASTM-A-931'!$B$6)","v":"ASTM A 931"},{"$f":"IF('ASTM-A-931'!$F$25=\"\",\"\",'ASTM-A-931'!$F$25)","v":"Tensile Strength"},{"$f":"IF('ASTM-A-931'!$F$27=\"\",\"\",'ASTM-A-931'!$F$27)","v":""},{"$f":"IF('ASTM-A-931'!$B$34=\"\",\"\",'ASTM-A-931'!$B$34)","v":7}]
[39,{"$f":"IF('ASTM-A-931'!$G$34=\"\",\"\",'ASTM-A-931'!$G$34)","v":""},{"$f":"IF( 'ASTM-A-931'!$B$6=\"\",\"\", 'ASTM-A-931'!$B$6)","v":"ASTM A 931"},{"$f":"IF('ASTM-A-931'!$G$25=\"\",\"\",'ASTM-A-931'!$G$25)","v":"Meet Minimun Tensile strength Requirements"},{"$f":"IF('ASTM-A-931'!$B$34=\"\",\"\",'ASTM-A-931'!$B$34)","v":7}]
[40,{"$f":"IF('ASTM-A-931'!$C$35=\"\",\"\",'ASTM-A-931'!$C$35)","v":""},{"$f":"IF( 'ASTM-A-931'!$B$6=\"\",\"\", 'ASTM-A-931'!$B$6)","v":"ASTM A 931"},{"$f":"IF('ASTM-A-931'!$C$25=\"\",\"\",'ASTM-A-931'!$C$25)","v":"Heat Number"},{"$f":"IF('ASTM-A-931'!$B$35=\"\",\"\",'ASTM-A-931'!$B$35)","v":8}]
[41,{"$f":"IF('ASTM-A-931'!$D$35=\"\",\"\",'ASTM-A-931'!$D$35)","v":""},{"$f":"IF( 'ASTM-A-931'!$B$6=\"\",\"\", 'ASTM-A-931'!$B$6)","v":"ASTM A 931"},{"$f":"IF('ASTM-A-931'!$D$25=\"\",\"\",'ASTM-A-931'!$D$25)","v":"Nominal Rope Diameter"},{"$f":"IF('ASTM-A-931'!$D$27=\"\",\"\",'ASTM-A-931'!$D$27)","v":""},{"$f":"IF('ASTM-A-931'!$B$35=\"\",\"\",'ASTM-A-931'!$B$35)","v":8}]
[42,{"$f":"IF('ASTM-A-931'!$E$35=\"\",\"\",'ASTM-A-931'!$E$35)","v":""},{"$f":"IF( 'ASTM-A-931'!$B$6=\"\",\"\", 'ASTM-A-931'!$B$6)","v":"ASTM A 931"},{"$f":"IF('ASTM-A-931'!$E$25=\"\",\"\",'ASTM-A-931'!$E$25)","v":"Length of Rope"},{"$f":"IF('ASTM-A-931'!$E$27=\"\",\"\",'ASTM-A-931'!$E$27)","v":""},{"$f":"IF('ASTM-A-931'!$B$35=\"\",\"\",'ASTM-A-931'!$B$35)","v":8}]
[43,{"$f":"IF('ASTM-A-931'!$F$35=\"\",\"\",'ASTM-A-931'!$F$35)","v":""},{"$f":"IF( 'ASTM-A-931'!$B$6=\"\",\"\", 'ASTM-A-931'!$B$6)","v":"ASTM A 931"},{"$f":"IF('ASTM-A-931'!$F$25=\"\",\"\",'ASTM-A-931'!$F$25)","v":"Tensile Strength"},{"$f":"IF('ASTM-A-931'!$F$27=\"\",\"\",'ASTM-A-931'!$F$27)","v":""},{"$f":"IF('ASTM-A-931'!$B$35=\"\",\"\",'ASTM-A-931'!$B$35)","v":8}]
[44,{"$f":"IF('ASTM-A-931'!$G$35=\"\",\"\",'ASTM-A-931'!$G$35)","v":""},{"$f":"IF( 'ASTM-A-931'!$B$6=\"\",\"\", 'ASTM-A-931'!$B$6)","v":"ASTM A 931"},{"$f":"IF('ASTM-A-931'!$G$25=\"\",\"\",'ASTM-A-931'!$G$25)","v":"Meet Minimun Tensile strength Requirements"},{"$f":"IF('ASTM-A-931'!$B$35=\"\",\"\",'ASTM-A-931'!$B$35)","v":8}]

{"sheet":"Diameter","index":2,"n_rows":3,"n_cols":2,"rows_kept":3,"cut":false,"hidden":false,"merged":[]}
["English","Metric"]
[0.375,9.5250000000000004]
[0.3125,7.9379999999999997]

{"sheet":"Revisions","index":3,"n_rows":3,"n_cols":4,"rows_kept":3,"cut":false,"hidden":true,"merged":[]}
["Date","Changes","By","Comments"]
["2005-05-24","Change Test1 from ASTM931 to ASTMA931","Joe Liu"]
["2020-03-17","Changed breaking strength requirements to match DMS-11021, August 2014, requirements","RCANO","included versioning effective 3/20/20"]

{"sheet":"L to D Lookup","index":4,"n_rows":112,"n_cols":7,"rows_kept":112,"cut":false,"hidden":false,"merged":[]}
["Length to Diameter Ratio","Correction Factor",null,"English MOR","Metric MOR"]
[1,0.87,null,{"$f":"IF(ISERROR(IF('ASTM-A-931'!#REF!>('ASTM-A-931'!#REF!*0.05),\"RETEST\",IF('ASTM-A-931'!#REF!=0,ROUND(((('ASTM-A-931'!#REF!*6^3/'ASTM-A-931'!#REF!)*'ASTM-A-931'!#REF!)/('ASTM-A-931'!#REF!*'ASTM-A-931'!#REF!^2))*2,-1)/2,(ROUND(3*((('ASTM-A-931'!#REF!*6^3/'ASTM-A-931'!#REF!)*('ASTM-A-931'!#REF!/3-'ASTM-A-931'!#REF!))/('ASTM-A-931'!#REF!*'ASTM-A-931'!#REF!^2))*2,-1)/2)))),\"\",IF('ASTM-A-931'!#REF!>('ASTM-A-931'!#REF!*0.05),\"RETEST\",IF('ASTM-A-931'!#REF!=0,ROUND(((('ASTM-A-931'!#REF!*6^3/'ASTM-A-931'!#REF!)*'ASTM-A-931'!#REF!)/('ASTM-A-931'!#REF!*'ASTM-A-931'!#REF!^2))*2,-1)/2,(ROUND(3*((('ASTM-A-931'!#REF!*6^3/'ASTM-A-931'!#REF!)*('ASTM-A-931'!#REF!/3-'ASTM-A-931'!#REF!))/('ASTM-A-931'!#REF!*'ASTM-A-931'!#REF!^2))*2,-1)/2))))","v":""},{"$f":"IF(ISERROR(IF('ASTM-A-931'!#REF!>('ASTM-A-931'!#REF!*0.05),\"RETEST\",IF('ASTM-A-931'!#REF!=0,ROUND((((('ASTM-A-931'!#REF!*1000)*('ASTM-A-931'!#REF!))/(('ASTM-A-931'!#REF!)*(('ASTM-A-931'!#REF!))^2)))*2,-2)/2,ROUND((3*((('ASTM-A-931'!#REF!*1000)*('ASTM-A-931'!#REF!/3-'ASTM-A-931'!#REF!))/('ASTM-A-931'!#REF!*'ASTM-A-931'!#REF!^2)))*2,-2)/2))),\"\",IF('ASTM-A-931'!#REF!>('ASTM-A-931'!#REF!*0.05),\"RETEST\",IF('ASTM-A-931'!#REF!=0,ROUND((((('ASTM-A-931'!#REF!*1000)*('ASTM-A-931'!#REF!))/(('ASTM-A-931'!#REF!)*(('ASTM-A-931'!#REF!))^2)))*2,-2)/2,ROUND((3*((('ASTM-A-931'!#REF!*1000)*('ASTM-A-931'!#REF!/3-'ASTM-A-931'!#REF!))/('ASTM-A-931'!#REF!*'ASTM-A-931'!#REF!^2)))*2,-2)/2)))","v":""}]
[1.01,0.872,null,{"$f":"IF(ISERROR(IF('ASTM-A-931'!#REF!>('ASTM-A-931'!#REF!*0.05),\"RETEST\",IF('ASTM-A-931'!#REF!=0,ROUND(((('ASTM-A-931'!#REF!*6^3/'ASTM-A-931'!#REF!)*'ASTM-A-931'!#REF!)/('ASTM-A-931'!#REF!*'ASTM-A-931'!#REF!^2))*2,-1)/2,(ROUND(3*((('ASTM-A-931'!#REF!*6^3/'ASTM-A-931'!#REF!)*('ASTM-A-931'!#REF!/3-'ASTM-A-931'!#REF!))/('ASTM-A-931'!#REF!*'ASTM-A-931'!#REF!^2))*2,-1)/2)))),\"\",IF('ASTM-A-931'!#REF!>('ASTM-A-931'!#REF!*0.05),\"RETEST\",IF('ASTM-A-931'!#REF!=0,ROUND(((('ASTM-A-931'!#REF!*6^3/'ASTM-A-931'!#REF!)*'ASTM-A-931'!#REF!)/('ASTM-A-931'!#REF!*'ASTM-A-931'!#REF!^2))*2,-1)/2,(ROUND(3*((('ASTM-A-931'!#REF!*6^3/'ASTM-A-931'!#REF!)*('ASTM-A-931'!#REF!/3-'ASTM-A-931'!#REF!))/('ASTM-A-931'!#REF!*'ASTM-A-931'!#REF!^2))*2,-1)/2))))","v":""},{"$f":"IF(ISERROR(IF('ASTM-A-931'!#REF!>('ASTM-A-931'!#REF!*0.05),\"RETEST\",IF('ASTM-A-931'!#REF!=0,ROUND((((('ASTM-A-931'!#REF!*1000)*('ASTM-A-931'!#REF!))/(('ASTM-A-931'!#REF!)*(('ASTM-A-931'!#REF!))^2)))*2,-2)/2,ROUND((3*((('ASTM-A-931'!#REF!*1000)*('ASTM-A-931'!#REF!/3-'ASTM-A-931'!#REF!))/('ASTM-A-931'!#REF!*'ASTM-A-931'!#REF!^2)))*2,-2)/2))),\"\",IF('ASTM-A-931'!#REF!>('ASTM-A-931'!#REF!*0.05),\"RETEST\",IF('ASTM-A-931'!#REF!=0,ROUND((((('ASTM-A-931'!#REF!*1000)*('ASTM-A-931'!#REF!))/(('ASTM-A-931'!#REF!)*(('ASTM-A-931'!#REF!))^2)))*2,-2)/2,ROUND((3*((('ASTM-A-931'!#REF!*1000)*('ASTM-A-931'!#REF!/3-'ASTM-A-931'!#REF!))/('ASTM-A-931'!#REF!*'ASTM-A-931'!#REF!^2)))*2,-2)/2)))","v":""}]
[1.02,0.875,null,{"$f":"IF(ISERROR(IF('ASTM-A-931'!#REF!>('ASTM-A-931'!#REF!*0.05),\"RETEST\",IF('ASTM-A-931'!#REF!=0,ROUND(((('ASTM-A-931'!#REF!*6^3/'ASTM-A-931'!#REF!)*'ASTM-A-931'!#REF!)/('ASTM-A-931'!#REF!*'ASTM-A-931'!#REF!^2))*2,-1)/2,(ROUND(3*((('ASTM-A-931'!#REF!*6^3/'ASTM-A-931'!#REF!)*('ASTM-A-931'!#REF!/3-'ASTM-A-931'!#REF!))/('ASTM-A-931'!#REF!*'ASTM-A-931'!#REF!^2))*2,-1)/2)))),\"\",IF('ASTM-A-931'!#REF!>('ASTM-A-931'!#REF!*0.05),\"RETEST\",IF('ASTM-A-931'!#REF!=0,ROUND(((('ASTM-A-931'!#REF!*6^3/'ASTM-A-931'!#REF!)*'ASTM-A-931'!#REF!)/('ASTM-A-931'!#REF!*'ASTM-A-931'!#REF!^2))*2,-1)/2,(ROUND(3*((('ASTM-A-931'!#REF!*6^3/'ASTM-A-931'!#REF!)*('ASTM-A-931'!#REF!/3-'ASTM-A-931'!#REF!))/('ASTM-A-931'!#REF!*'ASTM-A-931'!#REF!^2))*2,-1)/2))))","v":""},{"$f":"IF(ISERROR(IF('ASTM-A-931'!#REF!>('ASTM-A-931'!#REF!*0.05),\"RETEST\",IF('ASTM-A-931'!#REF!=0,ROUND((((('ASTM-A-931'!#REF!*1000)*('ASTM-A-931'!#REF!))/(('ASTM-A-931'!#REF!)*(('ASTM-A-931'!#REF!))^2)))*2,-2)/2,ROUND((3*((('ASTM-A-931'!#REF!*1000)*('ASTM-A-931'!#REF!/3-'ASTM-A-931'!#REF!))/('ASTM-A-931'!#REF!*'ASTM-A-931'!#REF!^2)))*2,-2)/2))),\"\",IF('ASTM-A-931'!#REF!>('ASTM-A-931'!#REF!*0.05),\"RETEST\",IF('ASTM-A-931'!#REF!=0,ROUND((((('ASTM-A-931'!#REF!*1000)*('ASTM-A-931'!#REF!))/(('ASTM-A-931'!#REF!)*(('ASTM-A-931'!#REF!))^2)))*2,-2)/2,ROUND((3*((('ASTM-A-931'!#REF!*1000)*('ASTM-A-931'!#REF!/3-'ASTM-A-931'!#REF!))/('ASTM-A-931'!#REF!*'ASTM-A-931'!#REF!^2)))*2,-2)/2)))","v":""}]
[1.03,0.877,null,{"$f":"IF(ISERROR(IF('ASTM-A-931'!#REF!>('ASTM-A-931'!#REF!*0.05),\"RETEST\",IF('ASTM-A-931'!#REF!=0,ROUND(((('ASTM-A-931'!#REF!*6^3/'ASTM-A-931'!#REF!)*'ASTM-A-931'!#REF!)/('ASTM-A-931'!#REF!*'ASTM-A-931'!#REF!^2))*2,-1)/2,(ROUND(3*((('ASTM-A-931'!#REF!*6^3/'ASTM-A-931'!#REF!)*('ASTM-A-931'!#REF!/3-'ASTM-A-931'!#REF!))/('ASTM-A-931'!#REF!*'ASTM-A-931'!#REF!^2))*2,-1)/2)))),\"\",IF('ASTM-A-931'!#REF!>('ASTM-A-931'!#REF!*0.05),\"RETEST\",IF('ASTM-A-931'!#REF!=0,ROUND(((('ASTM-A-931'!#REF!*6^3/'ASTM-A-931'!#REF!)*'ASTM-A-931'!#REF!)/('ASTM-A-931'!#REF!*'ASTM-A-931'!#REF!^2))*2,-1)/2,(ROUND(3*((('ASTM-A-931'!#REF!*6^3/'ASTM-A-931'!#REF!)*('ASTM-A-931'!#REF!/3-'ASTM-A-931'!#REF!))/('ASTM-A-931'!#REF!*'ASTM-A-931'!#REF!^2))*2,-1)/2))))","v":""},{"$f":"IF(ISERROR(IF('ASTM-A-931'!#REF!>('ASTM-A-931'!#REF!*0.05),\"RETEST\",IF('ASTM-A-931'!#REF!=0,ROUND((((('ASTM-A-931'!#REF!*1000)*('ASTM-A-931'!#REF!))/(('ASTM-A-931'!#REF!)*(('ASTM-A-931'!#REF!))^2)))*2,-2)/2,ROUND((3*((('ASTM-A-931'!#REF!*1000)*('ASTM-A-931'!#REF!/3-'ASTM-A-931'!#REF!))/('ASTM-A-931'!#REF!*'ASTM-A-931'!#REF!^2)))*2,-2)/2))),\"\",IF('ASTM-A-931'!#REF!>('ASTM-A-931'!#REF!*0.05),\"RETEST\",IF('ASTM-A-931'!#REF!=0,ROUND((((('ASTM-A-931'!#REF!*1000)*('ASTM-A-931'!#REF!))/(('ASTM-A-931'!#REF!)*(('ASTM-A-931'!#REF!))^2)))*2,-2)/2,ROUND((3*((('ASTM-A-931'!#REF!*1000)*('ASTM-A-931'!#REF!/3-'ASTM-A-931'!#REF!))/('ASTM-A-931'!#REF!*'ASTM-A-931'!#REF!^2)))*2,-2)/2)))","v":""}]
[1.04,0.88,null,{"$f":"IF(ISERROR(IF('ASTM-A-931'!#REF!>('ASTM-A-931'!#REF!*0.05),\"RETEST\",IF('ASTM-A-931'!#REF!=0,ROUND(((('ASTM-A-931'!#REF!*6^3/'ASTM-A-931'!#REF!)*'ASTM-A-931'!#REF!)/('ASTM-A-931'!#REF!*'ASTM-A-931'!#REF!^2))*2,-1)/2,(ROUND(3*((('ASTM-A-931'!#REF!*6^3/'ASTM-A-931'!#REF!)*('ASTM-A-931'!#REF!/3-'ASTM-A-931'!#REF!))/('ASTM-A-931'!#REF!*'ASTM-A-931'!#REF!^2))*2,-1)/2)))),\"\",IF('ASTM-A-931'!#REF!>('ASTM-A-931'!#REF!*0.05),\"RETEST\",IF('ASTM-A-931'!#REF!=0,ROUND(((('ASTM-A-931'!#REF!*6^3/'ASTM-A-931'!#REF!)*'ASTM-A-931'!#REF!)/('ASTM-A-931'!#REF!*'ASTM-A-931'!#REF!^2))*2,-1)/2,(ROUND(3*((('ASTM-A-931'!#REF!*6^3/'ASTM-A-931'!#REF!)*('ASTM-A-931'!#REF!/3-'ASTM-A-931'!#REF!))/('ASTM-A-931'!#REF!*'ASTM-A-931'!#REF!^2))*2,-1)/2))))","v":""},{"$f":"IF(ISERROR(IF('ASTM-A-931'!#REF!>('ASTM-A-931'!#REF!*0.05),\"RETEST\",IF('ASTM-A-931'!#REF!=0,ROUND((((('ASTM-A-931'!#REF!*1000)*('ASTM-A-931'!#REF!))/(('ASTM-A-931'!#REF!)*(('ASTM-A-931'!#REF!))^2)))*2,-2)/2,ROUND((3*((('ASTM-A-931'!#REF!*1000)*('ASTM-A-931'!#REF!/3-'ASTM-A-931'!#REF!))/('ASTM-A-931'!#REF!*'ASTM-A-931'!#REF!^2)))*2,-2)/2))),\"\",IF('ASTM-A-931'!#REF!>('ASTM-A-931'!#REF!*0.05),\"RETEST\",IF('ASTM-A-931'!#REF!=0,ROUND((((('ASTM-A-931'!#REF!*1000)*('ASTM-A-931'!#REF!))/(('ASTM-A-931'!#REF!)*(('ASTM-A-931'!#REF!))^2)))*2,-2)/2,ROUND((3*((('ASTM-A-931'!#REF!*1000)*('ASTM-A-931'!#REF!/3-'ASTM-A-931'!#REF!))/('ASTM-A-931'!#REF!*'ASTM-A-931'!#REF!^2)))*2,-2)/2)))","v":""}]
[1.05,0.88200000000000001,null,{"$f":"IF(ISERROR(IF('ASTM-A-931'!#REF!>('ASTM-A-931'!#REF!*0.05),\"RETEST\",IF('ASTM-A-931'!#REF!=0,ROUND(((('ASTM-A-931'!#REF!*6^3/'ASTM-A-931'!#REF!)*'ASTM-A-931'!#REF!)/('ASTM-A-931'!#REF!*'ASTM-A-931'!#REF!^2))*2,-1)/2,(ROUND(3*((('ASTM-A-931'!#REF!*6^3/'ASTM-A-931'!#REF!)*('ASTM-A-931'!#REF!/3-'ASTM-A-931'!#REF!))/('ASTM-A-931'!#REF!*'ASTM-A-931'!#REF!^2))*2,-1)/2)))),\"\",IF('ASTM-A-931'!#REF!>('ASTM-A-931'!#REF!*0.05),\"RETEST\",IF('ASTM-A-931'!#REF!=0,ROUND(((('ASTM-A-931'!#REF!*6^3/'ASTM-A-931'!#REF!)*'ASTM-A-931'!#REF!)/('ASTM-A-931'!#REF!*'ASTM-A-931'!#REF!^2))*2,-1)/2,(ROUND(3*((('ASTM-A-931'!#REF!*6^3/'ASTM-A-931'!#REF!)*('ASTM-A-931'!#REF!/3-'ASTM-A-931'!#REF!))/('ASTM-A-931'!#REF!*'ASTM-A-931'!#REF!^2))*2,-1)/2))))","v":""},{"$f":"IF(ISERROR(IF('ASTM-A-931'!#REF!>('ASTM-A-931'!#REF!*0.05),\"RETEST\",IF('ASTM-A-931'!#REF!=0,ROUND((((('ASTM-A-931'!#REF!*1000)*('ASTM-A-931'!#REF!))/(('ASTM-A-931'!#REF!)*(('ASTM-A-931'!#REF!))^2)))*2,-2)/2,ROUND((3*((('ASTM-A-931'!#REF!*1000)*('ASTM-A-931'!#REF!/3-'ASTM-A-931'!#REF!))/('ASTM-A-931'!#REF!*'ASTM-A-931'!#REF!^2)))*2,-2)/2))),\"\",IF('ASTM-A-931'!#REF!>('ASTM-A-931'!#REF!*0.05),\"RETEST\",IF('ASTM-A-931'!#REF!=0,ROUND((((('ASTM-A-931'!#REF!*1000)*('ASTM-A-931'!#REF!))/(('ASTM-A-931'!#REF!)*(('ASTM-A-931'!#REF!))^2)))*2,-2)/2,ROUND((3*((('ASTM-A-931'!#REF!*1000)*('ASTM-A-931'!#REF!/3-'ASTM-A-931'!#REF!))/('ASTM-A-931'!#REF!*'ASTM-A-931'!#REF!^2)))*2,-2)/2)))","v":""}]
[1.06,0.88400000000000001,null,{"$f":"IF(ISERROR(IF('ASTM-A-931'!#REF!>('ASTM-A-931'!#REF!*0.05),\"RETEST\",IF('ASTM-A-931'!#REF!=0,ROUND(((('ASTM-A-931'!#REF!*6^3/'ASTM-A-931'!#REF!)*'ASTM-A-931'!#REF!)/('ASTM-A-931'!#REF!*'ASTM-A-931'!#REF!^2))*2,-1)/2,(ROUND(3*((('ASTM-A-931'!#REF!*6^3/'ASTM-A-931'!#REF!)*('ASTM-A-931'!#REF!/3-'ASTM-A-931'!#REF!))/('ASTM-A-931'!#REF!*'ASTM-A-931'!#REF!^2))*2,-1)/2)))),\"\",IF('ASTM-A-931'!#REF!>('ASTM-A-931'!#REF!*0.05),\"RETEST\",IF('ASTM-A-931'!#REF!=0,ROUND(((('ASTM-A-931'!#REF!*6^3/'ASTM-A-931'!#REF!)*'ASTM-A-931'!#REF!)/('ASTM-A-931'!#REF!*'ASTM-A-931'!#REF!^2))*2,-1)/2,(ROUND(3*((('ASTM-A-931'!#REF!*6^3/'ASTM-A-931'!#REF!)*('ASTM-A-931'!#REF!/3-'ASTM-A-931'!#REF!))/('ASTM-A-931'!#REF!*'ASTM-A-931'!#REF!^2))*2,-1)/2))))","v":""},{"$f":"IF(ISERROR(IF('ASTM-A-931'!#REF!>('ASTM-A-931'!#REF!*0.05),\"RETEST\",IF('ASTM-A-931'!#REF!=0,ROUND((((('ASTM-A-931'!#REF!*1000)*('ASTM-A-931'!#REF!))/(('ASTM-A-931'!#REF!)*(('ASTM-A-931'!#REF!))^2)))*2,-2)/2,ROUND((3*((('ASTM-A-931'!#REF!*1000)*('ASTM-A-931'!#REF!/3-'ASTM-A-931'!#REF!))/('ASTM-A-931'!#REF!*'ASTM-A-931'!#REF!^2)))*2,-2)/2))),\"\",IF('ASTM-A-931'!#REF!>('ASTM-A-931'!#REF!*0.05),\"RETEST\",IF('ASTM-A-931'!#REF!=0,ROUND((((('ASTM-A-931'!#REF!*1000)*('ASTM-A-931'!#REF!))/(('ASTM-A-931'!#REF!)*(('ASTM-A-931'!#REF!))^2)))*2,-2)/2,ROUND((3*((('ASTM-A-931'!#REF!*1000)*('ASTM-A-931'!#REF!/3-'ASTM-A-931'!#REF!))/('ASTM-A-931'!#REF!*'ASTM-A-931'!#REF!^2)))*2,-2)/2)))","v":""}]
[1.07,0.88700000000000001,null,{"$f":"IF(ISERROR(IF('ASTM-A-931'!#REF!>('ASTM-A-931'!#REF!*0.05),\"RETEST\",IF('ASTM-A-931'!#REF!=0,ROUND(((('ASTM-A-931'!#REF!*6^3/'ASTM-A-931'!#REF!)*'ASTM-A-931'!#REF!)/('ASTM-A-931'!#REF!*'ASTM-A-931'!#REF!^2))*2,-1)/2,(ROUND(3*((('ASTM-A-931'!#REF!*6^3/'ASTM-A-931'!#REF!)*('ASTM-A-931'!#REF!/3-'ASTM-A-931'!#REF!))/('ASTM-A-931'!#REF!*'ASTM-A-931'!#REF!^2))*2,-1)/2)))),\"\",IF('ASTM-A-931'!#REF!>('ASTM-A-931'!#REF!*0.05),\"RETEST\",IF('ASTM-A-931'!#REF!=0,ROUND(((('ASTM-A-931'!#REF!*6^3/'ASTM-A-931'!#REF!)*'ASTM-A-931'!#REF!)/('ASTM-A-931'!#REF!*'ASTM-A-931'!#REF!^2))*2,-1)/2,(ROUND(3*((('ASTM-A-931'!#REF!*6^3/'ASTM-A-931'!#REF!)*('ASTM-A-931'!#REF!/3-'ASTM-A-931'!#REF!))/('ASTM-A-931'!#REF!*'ASTM-A-931'!#REF!^2))*2,-1)/2))))","v":""},{"$f":"IF(ISERROR(IF('ASTM-A-931'!#REF!>('ASTM-A-931'!#REF!*0.05),\"RETEST\",IF('ASTM-A-931'!#REF!=0,ROUND((((('ASTM-A-931'!#REF!*1000)*('ASTM-A-931'!#REF!))/(('ASTM-A-931'!#REF!)*(('ASTM-A-931'!#REF!))^2)))*2,-2)/2,ROUND((3*((('ASTM-A-931'!#REF!*1000)*('ASTM-A-931'!#REF!/3-'ASTM-A-931'!#REF!))/('ASTM-A-931'!#REF!*'ASTM-A-931'!#REF!^2)))*2,-2)/2))),\"\",IF('ASTM-A-931'!#REF!>('ASTM-A-931'!#REF!*0.05),\"RETEST\",IF('ASTM-A-931'!#REF!=0,ROUND((((('ASTM-A-931'!#REF!*1000)*('ASTM-A-931'!#REF!))/(('ASTM-A-931'!#REF!)*(('ASTM-A-931'!#REF!))^2)))*2,-2)/2,ROUND((3*((('ASTM-A-931'!#REF!*1000)*('ASTM-A-931'!#REF!/3-'ASTM-A-931'!#REF!))/('ASTM-A-931'!#REF!*'ASTM-A-931'!#REF!^2)))*2,-2)/2)))","v":""}]
[1.08,0.88900000000000001]
[1.0900000000000001,0.89200000000000002,null,"English f'c","Metric f'c"]
[1.1000000000000001,0.89400000000000002,null,{"$f":"IF(ISERROR(ROUND('ASTM-A-931'!#REF!*('ASTM-A-931'!#REF!/(PI()*(IF(CircumDiameter1=\"Diameter\",'ASTM-A-931'!#REF!,SQRT('ASTM-A-931'!#REF!/PI())*2)^2/4))),-1)),\"\",ROUND('ASTM-A-931'!#REF!*('ASTM-A-931'!#REF!/(PI()*(IF(CircumDiameter1=\"Diameter\",'ASTM-A-931'!#REF!,SQRT('ASTM-A-931'!#REF!/PI())*2)^2/4))),-1))","v":""},{"$f":"IF(ISERROR(ROUND(0.000001*('ASTM-A-931'!#REF!*('ASTM-A-931'!#REF!/(PI()*((IF(CircumDiameter1=\"Diameter\",'ASTM-A-931'!#REF!,SQRT('ASTM-A-931'!#REF!/PI())*2)/1000)^2/4))))*2,1)/2),\"\",ROUND(0.000001*('ASTM-A-931'!#REF!*('ASTM-A-931'!#REF!/(PI()*((IF(CircumDiameter1=\"Diameter\",'ASTM-A-931'!#REF!,SQRT('ASTM-A-931'!#REF!/PI())*2)/1000)^2/4))))*2,1)/2)","v":""}]
[1.1100000000000001,0.89600000000000002,null,{"$f":"IF(ISERROR(ROUND('ASTM-A-931'!#REF!*('ASTM-A-931'!#REF!/(PI()*(IF(CircumDiameter1=\"Diameter\",'ASTM-A-931'!#REF!,SQRT('ASTM-A-931'!#REF!/PI())*2)^2/4))),-1)),\"\",ROUND('ASTM-A-931'!#REF!*('ASTM-A-931'!#REF!/(PI()*(IF(CircumDiameter1=\"Diameter\",'ASTM-A-931'!#REF!,SQRT('ASTM-A-931'!#REF!/PI())*2)^2/4))),-1))","v":""},{"$f":"IF(ISERROR(ROUND(0.000001*('ASTM-A-931'!#REF!*('ASTM-A-931'!#REF!/(PI()*((IF(CircumDiameter1=\"Diameter\",'ASTM-A-931'!#REF!,SQRT('ASTM-A-931'!#REF!/PI())*2)/1000)^2/4))))*2,1)/2),\"\",ROUND(0.000001*('ASTM-A-931'!#REF!*('ASTM-A-931'!#REF!/(PI()*((IF(CircumDiameter1=\"Diameter\",'ASTM-A-931'!#REF!,SQRT('ASTM-A-931'!#REF!/PI())*2)/1000)^2/4))))*2,1)/2)","v":""}]
[1.1200000000000001,0.89900000000000002,null,{"$f":"IF(ISERROR(ROUND('ASTM-A-931'!#REF!*('ASTM-A-931'!#REF!/(PI()*(IF(CircumDiameter1=\"Diameter\",'ASTM-A-931'!#REF!,SQRT('ASTM-A-931'!#REF!/PI())*2)^2/4))),-1)),\"\",ROUND('ASTM-A-931'!#REF!*('ASTM-A-931'!#REF!/(PI()*(IF(CircumDiameter1=\"Diameter\",'ASTM-A-931'!#REF!,SQRT('ASTM-A-931'!#REF!/PI())*2)^2/4))),-1))","v":""},{"$f":"IF(ISERROR(ROUND(0.000001*('ASTM-A-931'!#REF!*('ASTM-A-931'!#REF!/(PI()*((IF(CircumDiameter1=\"Diameter\",'ASTM-A-931'!#REF!,SQRT('ASTM-A-931'!#REF!/PI())*2)/1000)^2/4))))*2,1)/2),\"\",ROUND(0.000001*('ASTM-A-931'!#REF!*('ASTM-A-931'!#REF!/(PI()*((IF(CircumDiameter1=\"Diameter\",'ASTM-A-931'!#REF!,SQRT('ASTM-A-931'!#REF!/PI())*2)/1000)^2/4))))*2,1)/2)","v":""}]
[1.1299999999999999,0.90100000000000002,null,{"$f":"IF(ISERROR(ROUND('ASTM-A-931'!#REF!*('ASTM-A-931'!#REF!/(PI()*(IF(CircumDiameter1=\"Diameter\",'ASTM-A-931'!#REF!,SQRT('ASTM-A-931'!#REF!/PI())*2)^2/4))),-1)),\"\",ROUND('ASTM-A-931'!#REF!*('ASTM-A-931'!#REF!/(PI()*(IF(CircumDiameter1=\"Diameter\",'ASTM-A-931'!#REF!,SQRT('ASTM-A-931'!#REF!/PI())*2)^2/4))),-1))","v":""},{"$f":"IF(ISERROR(ROUND(0.000001*('ASTM-A-931'!#REF!*('ASTM-A-931'!#REF!/(PI()*((IF(CircumDiameter1=\"Diameter\",'ASTM-A-931'!#REF!,SQRT('ASTM-A-931'!#REF!/PI())*2)/1000)^2/4))))*2,1)/2),\"\",ROUND(0.000001*('ASTM-A-931'!#REF!*('ASTM-A-931'!#REF!/(PI()*((IF(CircumDiameter1=\"Diameter\",'ASTM-A-931'!#REF!,SQRT('ASTM-A-931'!#REF!/PI())*2)/1000)^2/4))))*2,1)/2)","v":""}]
[1.1399999999999999,0.90400000000000003,null,{"$f":"IF(ISERROR(ROUND('ASTM-A-931'!#REF!*('ASTM-A-931'!#REF!/(PI()*(IF(CircumDiameter1=\"Diameter\",'ASTM-A-931'!#REF!,SQRT('ASTM-A-931'!#REF!/PI())*2)^2/4))),-1)),\"\",ROUND('ASTM-A-931'!#REF!*('ASTM-A-931'!#REF!/(PI()*(IF(CircumDiameter1=\"Diameter\",'ASTM-A-931'!#REF!,SQRT('ASTM-A-931'!#REF!/PI())*2)^2/4))),-1))","v":""},{"$f":"IF(ISERROR(ROUND(0.000001*('ASTM-A-931'!#REF!*('ASTM-A-931'!#REF!/(PI()*((IF(CircumDiameter1=\"Diameter\",'ASTM-A-931'!#REF!,SQRT('ASTM-A-931'!#REF!/PI())*2)/1000)^2/4))))*2,1)/2),\"\",ROUND(0.000001*('ASTM-A-931'!#REF!*('ASTM-A-931'!#REF!/(PI()*((IF(CircumDiameter1=\"Diameter\",'ASTM-A-931'!#REF!,SQRT('ASTM-A-931'!#REF!/PI())*2)/1000)^2/4))))*2,1)/2)","v":""}]
[1.1499999999999999,0.90600000000000003,null,{"$f":"IF(ISERROR(ROUND('ASTM-A-931'!#REF!*('ASTM-A-931'!#REF!/(PI()*(IF(CircumDiameter1=\"Diameter\",'ASTM-A-931'!#REF!,SQRT('ASTM-A-931'!#REF!/PI())*2)^2/4))),-1)),\"\",ROUND('ASTM-A-931'!#REF!*('ASTM-A-931'!#REF!/(PI()*(IF(CircumDiameter1=\"Diameter\",'ASTM-A-931'!#REF!,SQRT('ASTM-A-931'!#REF!/PI())*2)^2/4))),-1))","v":""},{"$f":"IF(ISERROR(ROUND(0.000001*('ASTM-A-931'!#REF!*('ASTM-A-931'!#REF!/(PI()*((IF(CircumDiameter1=\"Diameter\",'ASTM-A-931'!#REF!,SQRT('ASTM-A-931'!#REF!/PI())*2)/1000)^2/4))))*2,1)/2),\"\",ROUND(0.000001*('ASTM-A-931'!#REF!*('ASTM-A-931'!#REF!/(PI()*((IF(CircumDiameter1=\"Diameter\",'ASTM-A-931'!#REF!,SQRT('ASTM-A-931'!#REF!/PI())*2)/1000)^2/4))))*2,1)/2)","v":""}]
[1.1599999999999999,0.90800000000000003,null,{"$f":"IF(ISERROR(ROUND('ASTM-A-931'!#REF!*('ASTM-A-931'!#REF!/(PI()*(IF(CircumDiameter1=\"Diameter\",'ASTM-A-931'!#REF!,SQRT('ASTM-A-931'!#REF!/PI())*2)^2/4))),-1)),\"\",ROUND('ASTM-A-931'!#REF!*('ASTM-A-931'!#REF!/(PI()*(IF(CircumDiameter1=\"Diameter\",'ASTM-A-931'!#REF!,SQRT('ASTM-A-931'!#REF!/PI())*2)^2/4))),-1))","v":""},{"$f":"IF(ISERROR(ROUND(0.000001*('ASTM-A-931'!#REF!*('ASTM-A-931'!#REF!/(PI()*((IF(CircumDiameter1=\"Diameter\",'ASTM-A-931'!#REF!,SQRT('ASTM-A-931'!#REF!/PI())*2)/1000)^2/4))))*2,1)/2),\"\",ROUND(0.000001*('ASTM-A-931'!#REF!*('ASTM-A-931'!#REF!/(PI()*((IF(CircumDiameter1=\"Diameter\",'ASTM-A-931'!#REF!,SQRT('ASTM-A-931'!#REF!/PI())*2)/1000)^2/4))))*2,1)/2)","v":""}]
[1.17,0.91100000000000003,null,{"$f":"IF(ISERROR(ROUND('ASTM-A-931'!#REF!*('ASTM-A-931'!#REF!/(PI()*(IF(CircumDiameter1=\"Diameter\",'ASTM-A-931'!#REF!,SQRT('ASTM-A-931'!#REF!/PI())*2)^2/4))),-1)),\"\",ROUND('ASTM-A-931'!#REF!*('ASTM-A-931'!#REF!/(PI()*(IF(CircumDiameter1=\"Diameter\",'ASTM-A-931'!#REF!,SQRT('ASTM-A-931'!#REF!/PI())*2)^2/4))),-1))","v":""},{"$f":"IF(ISERROR(ROUND(0.000001*('ASTM-A-931'!#REF!*('ASTM-A-931'!#REF!/(PI()*((IF(CircumDiameter1=\"Diameter\",'ASTM-A-931'!#REF!,SQRT('ASTM-A-931'!#REF!/PI())*2)/1000)^2/4))))*2,1)/2),\"\",ROUND(0.000001*('ASTM-A-931'!#REF!*('ASTM-A-931'!#REF!/(PI()*((IF(CircumDiameter1=\"Diameter\",'ASTM-A-931'!#REF!,SQRT('ASTM-A-931'!#REF!/PI())*2)/1000)^2/4))))*2,1)/2)","v":""}]
[1.18,0.91300000000000003]
[1.19,0.91600000000000004,null,null,null,null,{"$f":"IF(CircumDiameter1=\"\",'ASTM-A-931'!#REF!,SQRT('ASTM-A-931'!#REF!/PI())*2)","v":{"$error":"#NAME?"}}]
[1.2,0.91800000000000004,null,{"$f":"IF(ISERROR('ASTM-A-931'!$I28*('ASTM-A-931'!#REF!/(PI()*(IF(CircumDiameter2=\"Diameter\",'ASTM-A-931'!$E28,SQRT('ASTM-A-931'!$E28/PI())*2)^2/4)))),\"\",'ASTM-A-931'!$I28*('ASTM-A-931'!#REF!/(PI()*(IF(CircumDiameter2=\"Diameter\",'ASTM-A-931'!$E28,SQRT('ASTM-A-931'!$E28/PI())*2)^2/4))))","v":""},{"$f":"IF(ISERROR(0.000001*('ASTM-A-931'!$I28*('ASTM-A-931'!#REF!/(PI()*((IF(CircumDiameter2=\"Diameter\",'ASTM-A-931'!$E28,SQRT('ASTM-A-931'!$E28/PI())*2)/1000)^2/4))))),\"\",0.000001*('ASTM-A-931'!$I28*('ASTM-A-931'!#REF!/(PI()*((IF(CircumDiameter2=\"Diameter\",'ASTM-A-931'!$E28,SQRT('ASTM-A-931'!$E28/PI())*2)/1000)^2/4)))))","v":""}]
[1.21,0.92,null,{"$f":"IF(ISERROR('ASTM-A-931'!$I29*('ASTM-A-931'!$G29/(PI()*(IF(CircumDiameter2=\"Diameter\",'ASTM-A-931'!$E29,SQRT('ASTM-A-931'!$E29/PI())*2)^2/4)))),\"\",'ASTM-A-931'!$I29*('ASTM-A-931'!$G29/(PI()*(IF(CircumDiameter2=\"Diameter\",'ASTM-A-931'!$E29,SQRT('ASTM-A-931'!$E29/PI())*2)^2/4))))","v":""},{"$f":"IF(ISERROR(0.000001*('ASTM-A-931'!$I29*('ASTM-A-931'!$G29/(PI()*((IF(CircumDiameter2=\"Diameter\",'ASTM-A-931'!$E29,SQRT('ASTM-A-931'!$E29/PI())*2)/1000)^2/4))))),\"\",0.000001*('ASTM-A-931'!$I29*('ASTM-A-931'!$G29/(PI()*((IF(CircumDiameter2=\"Diameter\",'ASTM-A-931'!$E29,SQRT('ASTM-A-931'!$E29/PI())*2)/1000)^2/4)))))","v":""}]
[1.22,0.92300000000000004,null,{"$f":"IF(ISERROR('ASTM-A-931'!$I30*('ASTM-A-931'!$G30/(PI()*(IF(CircumDiameter2=\"Diameter\",'ASTM-A-931'!$E30,SQRT('ASTM-A-931'!$E30/PI())*2)^2/4)))),\"\",'ASTM-A-931'!$I30*('ASTM-A-931'!$G30/(PI()*(IF(CircumDiameter2=\"Diameter\",'ASTM-A-931'!$E30,SQRT('ASTM-A-931'!$E30/PI())*2)^2/4))))","v":""},{"$f":"IF(ISERROR(0.000001*('ASTM-A-931'!$I30*('ASTM-A-931'!$G30/(PI()*((IF(CircumDiameter2=\"Diameter\",'ASTM-A-931'!$E30,SQRT('ASTM-A-931'!$E30/PI())*2)/1000)^2/4))))),\"\",0.000001*('ASTM-A-931'!$I30*('ASTM-A-931'!$G30/(PI()*((IF(CircumDiameter2=\"Diameter\",'ASTM-A-931'!$E30,SQRT('ASTM-A-931'!$E30/PI())*2)/1000)^2/4)))))","v":""}]
[1.23,0.92500000000000004,null,{"$f":"IF(ISERROR('ASTM-A-931'!$I31*('ASTM-A-931'!$G31/(PI()*(IF(CircumDiameter2=\"Diameter\",'ASTM-A-931'!$E31,SQRT('ASTM-A-931'!$E31/PI())*2)^2/4)))),\"\",'ASTM-A-931'!$I31*('ASTM-A-931'!$G31/(PI()*(IF(CircumDiameter2=\"Diameter\",'ASTM-A-931'!$E31,SQRT('ASTM-A-931'!$E31/PI())*2)^2/4))))","v":""},{"$f":"IF(ISERROR(0.000001*('ASTM-A-931'!$I31*('ASTM-A-931'!$G31/(PI()*((IF(CircumDiameter2=\"Diameter\",'ASTM-A-931'!$E31,SQRT('ASTM-A-931'!$E31/PI())*2)/1000)^2/4))))),\"\",0.000001*('ASTM-A-931'!$I31*('ASTM-A-931'!$G31/(PI()*((IF(CircumDiameter2=\"Diameter\",'ASTM-A-931'!$E31,SQRT('ASTM-A-931'!$E31/PI())*2)/1000)^2/4)))))","v":""}]
[1.24,0.92800000000000005,null,{"$f":"IF(ISERROR('ASTM-A-931'!$I32*('ASTM-A-931'!$G32/(PI()*(IF(CircumDiameter2=\"Diameter\",'ASTM-A-931'!$E32,SQRT('ASTM-A-931'!$E32/PI())*2)^2/4)))),\"\",'ASTM-A-931'!$I32*('ASTM-A-931'!$G32/(PI()*(IF(CircumDiameter2=\"Diameter\",'ASTM-A-931'!$E32,SQRT('ASTM-A-931'!$E32/PI())*2)^2/4))))","v":""},{"$f":"IF(ISERROR(0.000001*('ASTM-A-931'!$I32*('ASTM-A-931'!$G32/(PI()*((IF(CircumDiameter2=\"Diameter\",'ASTM-A-931'!$E32,SQRT('ASTM-A-931'!$E32/PI())*2)/1000)^2/4))))),\"\",0.000001*('ASTM-A-931'!$I32*('ASTM-A-931'!$G32/(PI()*((IF(CircumDiameter2=\"Diameter\",'ASTM-A-931'!$E32,SQRT('ASTM-A-931'!$E32/PI())*2)/1000)^2/4)))))","v":""}]
[1.25,0.93,null,{"$f":"IF(ISERROR('ASTM-A-931'!$I33*('ASTM-A-931'!$G33/(PI()*(IF(CircumDiameter2=\"Diameter\",'ASTM-A-931'!$E33,SQRT('ASTM-A-931'!$E33/PI())*2)^2/4)))),\"\",'ASTM-A-931'!$I33*('ASTM-A-931'!$G33/(PI()*(IF(CircumDiameter2=\"Diameter\",'ASTM-A-931'!$E33,SQRT('ASTM-A-931'!$E33/PI())*2)^2/4))))","v":""},{"$f":"IF(ISERROR(0.000001*('ASTM-A-931'!$I33*('ASTM-A-931'!$G33/(PI()*((IF(CircumDiameter2=\"Diameter\",'ASTM-A-931'!$E33,SQRT('ASTM-A-931'!$E33/PI())*2)/1000)^2/4))))),\"\",0.000001*('ASTM-A-931'!$I33*('ASTM-A-931'!$G33/(PI()*((IF(CircumDiameter2=\"Diameter\",'ASTM-A-931'!$E33,SQRT('ASTM-A-931'!$E33/PI())*2)/1000)^2/4)))))","v":""}]
[1.26,0.93100000000000005,null,{"$f":"IF(ISERROR('ASTM-A-931'!$I34*('ASTM-A-931'!$G34/(PI()*(IF(CircumDiameter2=\"Diameter\",'ASTM-A-931'!$E34,SQRT('ASTM-A-931'!$E34/PI())*2)^2/4)))),\"\",'ASTM-A-931'!$I34*('ASTM-A-931'!$G34/(PI()*(IF(CircumDiameter2=\"Diameter\",'ASTM-A-931'!$E34,SQRT('ASTM-A-931'!$E34/PI())*2)^2/4))))","v":""},{"$f":"IF(ISERROR(0.000001*('ASTM-A-931'!$I34*('ASTM-A-931'!$G34/(PI()*((IF(CircumDiameter2=\"Diameter\",'ASTM-A-931'!$E34,SQRT('ASTM-A-931'!$E34/PI())*2)/1000)^2/4))))),\"\",0.000001*('ASTM-A-931'!$I34*('ASTM-A-931'!$G34/(PI()*((IF(CircumDiameter2=\"Diameter\",'ASTM-A-931'!$E34,SQRT('ASTM-A-931'!$E34/PI())*2)/1000)^2/4)))))","v":""}]
[1.27,0.93200000000000005,null,{"$f":"IF(ISERROR('ASTM-A-931'!$I35*('ASTM-A-931'!$G35/(PI()*(IF(CircumDiameter2=\"Diameter\",'ASTM-A-931'!$E35,SQRT('ASTM-A-931'!$E35/PI())*2)^2/4)))),\"\",'ASTM-A-931'!$I35*('ASTM-A-931'!$G35/(PI()*(IF(CircumDiameter2=\"Diameter\",'ASTM-A-931'!$E35,SQRT('ASTM-A-931'!$E35/PI())*2)^2/4))))","v":""},{"$f":"IF(ISERROR(0.000001*('ASTM-A-931'!$I35*('ASTM-A-931'!$G35/(PI()*((IF(CircumDiameter2=\"Diameter\",'ASTM-A-931'!$E35,SQRT('ASTM-A-931'!$E35/PI())*2)/1000)^2/4))))),\"\",0.000001*('ASTM-A-931'!$I35*('ASTM-A-931'!$G35/(PI()*((IF(CircumDiameter2=\"Diameter\",'ASTM-A-931'!$E35,SQRT('ASTM-A-931'!$E35/PI())*2)/1000)^2/4)))))","v":""}]
[1.28,0.93300000000000005]
[1.29,0.93400000000000005]
[1.3,0.93600000000000005]
[1.31,0.93700000000000006]
[1.32,0.93799999999999994]
[1.33,0.93899999999999995]
[1.34,0.94]
[1.35,0.94199999999999995]
[1.36,0.94299999999999995]
[1.37,0.94399999999999995]
[1.38,0.94499999999999995]
[1.39,0.94599999999999995]
[1.4,0.94799999999999995]
[1.41,0.94899999999999995]
[1.42,0.95]
[1.43,0.95099999999999996]
[1.44,0.95199999999999996]
[1.45,0.95399999999999996]
[1.46,0.95499999999999996]
[1.47,0.95599999999999996]
[1.48,0.95699999999999996]
[1.49,0.95799999999999996]
[1.5,0.96]
[1.51,0.96099999999999997]
[1.52,0.96199999999999997]
[1.53,0.96199999999999997]
[1.54,0.96299999999999997]
[1.55,0.96399999999999997]
[1.56,0.96499999999999997]
[1.57,0.96599999999999997]
[1.58,0.96599999999999997]
[1.59,0.96699999999999997]
[1.6,0.96799999999999997]
[1.61,0.96899999999999997]
[1.62,0.97]
[1.63,0.97]
[1.64,0.97099999999999997]
[1.65,0.97199999999999998]
[1.66,0.97299999999999998]
[1.67,0.97399999999999998]
[1.68,0.97399999999999998]
[1.69,0.97499999999999998]
[1.7,0.97599999999999998]
[1.71,0.97699999999999998]
[1.72,0.97799999999999998]
[1.73,0.97799999999999998]
[1.74,0.97899999999999998]
[1.75,0.98]
[1.76,0.98099999999999998]
[1.77,0.98199999999999998]
[1.78,0.98199999999999998]
[1.79,0.98299999999999998]
[1.8,0.98399999999999999]
[1.81,0.98499999999999999]
[1.82,0.98599999999999999]
[1.83,0.98599999999999999]
[1.84,0.98699999999999999]
[1.85,0.98799999999999999]
[1.86,0.98899999999999999]
[1.87,0.99]
[1.88,0.99]
[1.89,0.99099999999999999]
[1.9,0.99199999999999999]
[1.91,0.99299999999999999]
[1.92,0.99399999999999999]
[1.93,0.99399999999999999]
[1.94,0.995]
[1.95,1]
[1.96,1]
[1.97,1]
[1.98,1]
[1.99,1]
[2,1]
[2.0099999999999998,1]
[2.02,1]
[2.0299999999999998,1]
[2.04,1]
[2.0499999999999998,1]
[2.06,1]
[2.0699999999999998,1]
[2.08,1]
[2.09,1]
[2.1,1]