{"text_format":"1","workbook":"xlsx","n_sheets":4,"sheets":["ASTM-C-1202","RX","Revision","Cell No."],"not_rendered":{"charts":0,"images":1,"macros":1,"external_links":0,"defined_names":180,"comments":1,"pivot_tables":0},"unopened":[],"bounds":{"document_bytes":16777216,"sheet_cells":100000,"rows_first":2000,"rows_last":500,"rows_between":2000,"halvings":0,"cell_chars":16384,"cell_head_chars":4096},"cells_cut":0,"cells_raw":0,"read":"whole","date_system":"1900"}

{"sheet":"ASTM-C-1202","index":0,"n_rows":79,"n_cols":15,"rows_kept":79,"cut":false,"hidden":false,"merged":[[44,10,44,11],[43,10,43,11],[42,10,42,11],[42,4,42,5],[42,6,42,7],[42,8,42,9],[45,6,45,7],[43,4,43,5],[43,6,43,7],[45,4,45,5],[0,0,0,1],[7,10,7,12],[10,10,10,12],[8,10,8,12],[9,10,9,12],[5,1,5,12],[15,4,15,12],[12,10,12,12],[35,4,35,5],[11,10,11,12],[12,4,12,6],[25,8,25,10],[31,4,31,5],[32,4,32,5],[31,6,31,7],[26,2,26,5],[27,2,27,5],[7,4,7,6],[8,4,8,6],[9,4,9,6],[10,4,10,6],[11,4,11,6],[21,8,21,9],[27,8,27,10],[31,15,33,15],[31,14,33,14],[33,4,33,5],[33,8,33,9],[33,6,33,7],[32,10,32,11],[32,6,32,7],[32,8,32,9],[13,10,13,12],[14,4,14,12],[16,10,16,12],[18,4,18,5],[18,7,18,8],[18,11,18,12],[13,4,13,6],[20,2,20,4],[21,2,21,4],[22,2,22,4],[22,5,22,7],[21,5,21,7],[20,5,20,7],[31,10,31,11],[30,10,30,11],[24,8,24,10],[77,3,77,4],[76,5,76,6],[77,5,77,6],[46,10,46,11],[58,8,58,9],[46,4,46,5],[46,6,46,7],[46,8,46,9],[56,4,56,5],[56,6,56,7],[71,1,71,12],[60,4,60,5],[60,10,60,11],[59,10,59,11],[58,10,58,11],[75,1,75,5],[74,7,74,8],[68,1,69,12],[70,1,70,12],[75,9,75,12],[56,10,56,11],[77,7,77,8],[76,7,76,8],[47,10,47,11],[79,6,79,7],[79,1,79,5],[78,6,78,7],[75,7,75,8],[76,1,76,2],[77,1,77,2],[76,3,76,4],[24,2,24,5],[25,2,25,5],[60,6,60,7],[58,4,58,5],[58,6,58,7],[59,8,59,9],[59,6,59,7],[43,8,43,9],[30,4,30,5],[31,8,31,9],[25,6,25,7],[24,6,24,7],[26,6,26,7],[30,8,30,9],[30,6,30,7],[27,6,27,7],[26,8,26,10],[29,2,29,11],[41,2,41,11],[33,10,33,11],[34,10,34,11],[35,6,35,7],[34,6,34,7],[31,2,31,3],[32,2,32,3],[33,2,33,3],[34,2,34,3],[35,2,35,3],[35,8,35,9],[35,10,35,11],[34,4,34,5],[34,8,34,9],[57,10,57,11],[60,8,60,9],[57,2,57,3],[59,4,59,5],[57,4,57,5],[57,6,57,7],[36,2,37,2],[36,3,37,3],[47,2,47,3],[47,4,47,5],[47,6,47,7],[47,8,47,9],[46,2,46,3],[54,2,54,11],[59,2,59,3],[58,2,58,3],[49,2,50,2],[49,3,50,3],[60,2,60,3],[56,2,56,3],[55,10,55,11],[45,10,45,11],[44,4,44,5],[44,6,44,7],[73,7,73,8],[72,7,72,8],[56,8,56,9],[73,3,73,6],[72,3,72,6],[73,1,73,2],[43,2,43,3],[44,2,44,3],[45,2,45,3],[62,2,63,2],[62,3,63,3],[55,4,55,5],[55,6,55,7],[55,8,55,9],[57,8,57,9],[45,8,45,9],[44,8,44,9]]}
["TxDOT Manuals >"]
[null,"TEXAS DEPARTMENT OF TRANSPORTATION",null,null,null,null,null,null,null,null,null,null,null,null,130]
[null,null,null,null,null,null,null,null,null,null,null,null,null,null,1]
[null,null,null,null,null,null,null,null,null,null,null,null,null,null,"ASTMC1202.xlsm::42072.434248"]
[null,"ELECTRICAL INDICATION OF CONCRETE'S ABILITY TO RESIST CHLORIDE ION PENETRATION (PERMEABILITY)"]
[null,"ASTM C 1202"]
[null,null,null,null,null,null,null,null,null,null,null,null,{"$f":"\"File Version: \" & TEXT(MID(sn,SEARCH(\"::\",sn,1)+2,20),\"mm/dd/yy hh:mm:ss\")","v":"File Version: 03/09/15 10:25:19"}]
[null,null,null,"SAMPLE ID:",null,null,null,null,null,"SAMPLED DATE:"]
[null,null,null,"TEST NUMBER:",null,null,null,null,null,"LETTING DATE:"]
[null,null,null,"SAMPLE STATUS:",null,null,null,null,null,"CONTROLLING CSJ:"]
[null,null,null,"COUNTY:",null,null,null,null,null,"SPEC YEAR:"]
[null,null,null,"SAMPLED BY:",null,null,null,null,null,"SPEC ITEM:"]
[null,null,null,"SAMPLE LOCATION:",null,null,null,null,null,"SPECIAL PROVISION:"]
[null,null,null,"MATERIAL CODE:",null,null,null,null,null,"CLASS:"]
[null,null,null,"MATERIAL NAME:"]
[null,null,null,"PRODUCER:"]
[null,null,null,"AREA ENGINEER:",null,null,null,null,null,"PROJECT MANAGER:"]
[]
[null,null,null,"COURSE\\LIFT:",null,null,"STATION:",null,null,null,"DIST. FROM CL:"]
[]
[null,null,"Cast Date :"]
[null,null,"Test Age :",null,null,null,null,null,"Other Age :",null,null,{"$f":"IF(F22=\"Other\",K22,F22)","v":0}]
[null,null,"Specimen Cure Type :"]
[]
[null,null,"Date to Move from Moist to 100°F",null,null,null,{"$f":"IF(ISBLANK(F21),\"\",F21+7)","v":""},null,"Actual Date :"]
[null,null,"Date to Cut and Epoxy :",null,null,null,{"$f":"IF(ISBLANK(F21),\"\",G27-1)","v":""},null,"Actual Date :"]
[null,null,"Date to Pull Vacuum :",null,null,null,{"$f":"IF(ISBLANK(F21),\"\",G28-1)","v":""},null,"Actual Date :"]
[null,null,"Date of Test :",null,null,null,{"$f":"IF(ISBLANK(F21),\"\",F21+L22)","v":""},null,"Actual Date :"]
[]
[null,null,"SET 1"]
[null,null,null,null,1,null,2,null,3,null,4]
[null,null,"Mach"]
[null,null,"Cell No."]
[null,null,"Specimen ID"]
[null,null,{"$f":"IF(SpecYear=\"1995\",\"Length (mm)\",\"Length (in.)\")","v":"Length (in.)"},null,1,null,1,null,1,null,1]
[null,null,{"$f":"IF(SpecYear=\"1995\",\"Diameter (mm)\",\"Diameter (in.)\")","v":"Diameter (in.)"},null,1,null,1,null,1,null,1]
[null,null,"Time (min)",{"$f":"IF(K11=\"1995\",\"Ambient Air Temp (°C)\",\"Ambient Air Temp (°F)\")","v":"Ambient Air Temp (°F)"},"Charge","Current","Charge","Current","Charge","Current","Charge","Current"]
[null,null,null,null,"[C]","[A]","[C]","[A]","[C]","[A]","[C]","[A]"]
[null,null,"0",1,1,1,1,1,1,1,1,1]
[null,null,360,1,1,1,1,1,1,1,1,1]
[]
[null,null,"SET 2"]
[null,null,null,null,1,null,2,null,3,null,4]
[null,null,"Mach"]
[null,null,"Cell No."]
[null,null,"Specimen ID"]
[null,null,{"$f":"IF(SpecYear=\"1995\",\"Length (mm)\",\"Length (in.)\")","v":"Length (in.)"}]
[null,null,{"$f":"IF(SpecYear=\"1995\",\"Diameter (mm)\",\"Diameter (in.)\")","v":"Diameter (in.)"}]
[]
[null,null,"Time (min)",{"$f":"IF(SpecYear=\"1995\",\"Ambient Air Temp (°C)\",\"Ambient Air Temp (°F)\")","v":"Ambient Air Temp (°F)"},"Charge","Current","Charge","Current","Charge","Current","Charge","Current"]
[null,null,null,null,"[C]","[A]","[C]","[A]","[C]","[A]","[C]","[A]"]
[null,null,"0"]
[null,null,360]
[]
[null,null,"SET 3"]
[null,null,null,null,1,null,2,null,3,null,4]
[null,null,"Mach"]
[null,null,"Cell No."]
[null,null,"Specimen ID"]
[null,null,{"$f":"IF(SpecYear=\"1995\",\"Length (mm)\",\"Length (in.)\")","v":"Length (in.)"}]
[null,null,{"$f":"IF(SpecYear=\"1995\",\"Diameter (mm)\",\"Diameter (in.)\")","v":"Diameter (in.)"}]
[]
[null,null,"Time (min)",{"$f":"IF(SpecYear=\"1995\",\"Ambient Air Temp (°C)\",\"Ambient Air Temp (°F)\")","v":"Ambient Air Temp (°F)"},"Charge","Current","Charge","Current","Charge","Current","Charge","Current"]
[null,null,null,null,"[C]","[A]","[C]","[A]","[C]","[A]","[C]","[A]"]
[null,null,"0"]
[null,null,360]
[]
[null,"Remarks:",{"$f":"TODAY()","v":"2015-06-23"}]
[]
[]
[]
[]
[null,"Test Method:",null,"Tested By:",null,null,null,"Tested Date:"]
[null,"ASTMC1202"]
[null,"Test Stamp Code:",null,null,null,null,"Omit Test:","Completed Date:",null,"Reviewed By:"]
[]
[null,"Locked By:",null,"TxDOT:",null,"District:",null,"Area:"]
[]
[null,"Authorized By:",null,null,null,null,"Authorized Date:"]

{"sheet":"RX","index":1,"n_rows":132,"n_cols":9,"rows_kept":132,"cut":false,"hidden":true,"merged":[]}
[130]
["Fld_nbr","Value","Desc_1","Desc_2","Desc_3","Desc_4","Desc_5","Desc_6","Desc_7"]
[1,{"$f":"IF('ASTM-C-1202'!$B$69=\"\",\"\",'ASTM-C-1202'!$B$69)","v":""},{"$f":"'ASTM-C-1202'!$B$68","v":"Remarks:"}]
[2,{"$f":"IF('ASTM-C-1202'!$E$19=\"\",\"\",'ASTM-C-1202'!$E$19)","v":""},{"$f":"IF('ASTM-C-1202'!$D$19=\"\",\"\",'ASTM-C-1202'!$D$19)","v":"COURSE\\LIFT:"}]
[3,{"$f":"IF('ASTM-C-1202'!$D$74=\"\",\"\",'ASTM-C-1202'!$D$74)","v":""},{"$f":"IF(\"Tested By \"=\"\",\"\",\"Tested By \")","v":"Tested By "},{"$f":"IF('ASTM-C-1202'!$B$74=\"\",\"\",'ASTM-C-1202'!$B$74)","v":"ASTMC1202"}]
[4,{"$f":"IF('ASTM-C-1202'!$I$74=\"\",\"\",'ASTM-C-1202'!$I$74)","v":""},{"$f":"IF(\"Tested Date \"=\"\",\"\",\"Tested Date \")","v":"Tested Date "},{"$f":"IF('ASTM-C-1202'!$B$74=\"\",\"\",'ASTM-C-1202'!$B$74)","v":"ASTMC1202"}]
[5,{"$f":"IF('ASTM-C-1202'!$F$21=\"\",\"\",'ASTM-C-1202'!$F$21)","v":""},{"$f":"IF('ASTM-C-1202'!$B$6=\"\",\"\",'ASTM-C-1202'!$B$6)","v":"ASTM C 1202"},{"$f":"IF('ASTM-C-1202'!$C$21=\"\",\"\",'ASTM-C-1202'!$C$21)","v":"Cast Date :"}]
[6,{"$f":"IF('ASTM-C-1202'!$F$22=\"\",\"\",'ASTM-C-1202'!$F$22)","v":""},{"$f":"IF('ASTM-C-1202'!$B$6=\"\",\"\",'ASTM-C-1202'!$B$6)","v":"ASTM C 1202"},{"$f":"IF('ASTM-C-1202'!$C$22=\"\",\"\",'ASTM-C-1202'!$C$22)","v":"Test Age :"}]
[7,{"$f":"IF('ASTM-C-1202'!$F$23=\"\",\"\",'ASTM-C-1202'!$F$23)","v":""},{"$f":"IF('ASTM-C-1202'!$B$6=\"\",\"\",'ASTM-C-1202'!$B$6)","v":"ASTM C 1202"},{"$f":"IF('ASTM-C-1202'!$C$23=\"\",\"\",'ASTM-C-1202'!$C$23)","v":"Specimen Cure Type :"}]
[8,{"$f":"IF('ASTM-C-1202'!$K$22=\"\",\"\",'ASTM-C-1202'!$K$22)","v":""},{"$f":"IF('ASTM-C-1202'!$B$6=\"\",\"\",'ASTM-C-1202'!$B$6)","v":"ASTM C 1202"},{"$f":"IF('ASTM-C-1202'!$I$22=\"\",\"\",'ASTM-C-1202'!$I$22)","v":"Other Age :"}]
[9,{"$f":"IF('ASTM-C-1202'!$G$25=\"\",\"\",'ASTM-C-1202'!$G$25)","v":""},{"$f":"IF('ASTM-C-1202'!$B$6=\"\",\"\",'ASTM-C-1202'!$B$6)","v":"ASTM C 1202"},{"$f":"IF('ASTM-C-1202'!$C$25=\"\",\"\",'ASTM-C-1202'!$C$25)","v":"Date to Move from Moist to 100°F"}]
[10,{"$f":"IF('ASTM-C-1202'!$G$26=\"\",\"\",'ASTM-C-1202'!$G$26)","v":""},{"$f":"IF('ASTM-C-1202'!$B$6=\"\",\"\",'ASTM-C-1202'!$B$6)","v":"ASTM C 1202"},{"$f":"IF('ASTM-C-1202'!$C$26=\"\",\"\",'ASTM-C-1202'!$C$26)","v":"Date to Cut and Epoxy :"}]
[11,{"$f":"IF('ASTM-C-1202'!$G$27=\"\",\"\",'ASTM-C-1202'!$G$27)","v":""},{"$f":"IF('ASTM-C-1202'!$B$6=\"\",\"\",'ASTM-C-1202'!$B$6)","v":"ASTM C 1202"},{"$f":"IF('ASTM-C-1202'!$C$27=\"\",\"\",'ASTM-C-1202'!$C$27)","v":"Date to Pull Vacuum :"}]
[12,{"$f":"IF('ASTM-C-1202'!$G$28=\"\",\"\",'ASTM-C-1202'!$G$28)","v":""},{"$f":"IF('ASTM-C-1202'!$B$6=\"\",\"\",'ASTM-C-1202'!$B$6)","v":"ASTM C 1202"},{"$f":"IF('ASTM-C-1202'!$C$28=\"\",\"\",'ASTM-C-1202'!$C$28)","v":"Date of Test :"}]
[13,{"$f":"IF('ASTM-C-1202'!$L$25=\"\",\"\",'ASTM-C-1202'!$L$25)","v":""},{"$f":"IF('ASTM-C-1202'!$B$6=\"\",\"\",'ASTM-C-1202'!$B$6)","v":"ASTM C 1202"},{"$f":"IF('ASTM-C-1202'!$C$25=\"\",\"\",'ASTM-C-1202'!$C$25)","v":"Date to Move from Moist to 100°F"},{"$f":"IF('ASTM-C-1202'!$I$25=\"\",\"\",'ASTM-C-1202'!$I$25)","v":"Actual Date :"}]
[14,{"$f":"IF('ASTM-C-1202'!$L$26=\"\",\"\",'ASTM-C-1202'!$L$26)","v":""},{"$f":"IF('ASTM-C-1202'!$B$6=\"\",\"\",'ASTM-C-1202'!$B$6)","v":"ASTM C 1202"},{"$f":"IF('ASTM-C-1202'!$C$26=\"\",\"\",'ASTM-C-1202'!$C$26)","v":"Date to Cut and Epoxy :"},{"$f":"IF('ASTM-C-1202'!$I$26=\"\",\"\",'ASTM-C-1202'!$I$26)","v":"Actual Date :"}]
[15,{"$f":"IF('ASTM-C-1202'!$L$27=\"\",\"\",'ASTM-C-1202'!$L$27)","v":""},{"$f":"IF('ASTM-C-1202'!$B$6=\"\",\"\",'ASTM-C-1202'!$B$6)","v":"ASTM C 1202"},{"$f":"IF('ASTM-C-1202'!$C$27=\"\",\"\",'ASTM-C-1202'!$C$27)","v":"Date to Pull Vacuum :"},{"$f":"IF('ASTM-C-1202'!$I$27=\"\",\"\",'ASTM-C-1202'!$I$27)","v":"Actual Date :"}]
[16,{"$f":"IF('ASTM-C-1202'!$L$28=\"\",\"\",'ASTM-C-1202'!$L$28)","v":""},{"$f":"IF('ASTM-C-1202'!$B$6=\"\",\"\",'ASTM-C-1202'!$B$6)","v":"ASTM C 1202"},{"$f":"IF('ASTM-C-1202'!$C$28=\"\",\"\",'ASTM-C-1202'!$C$28)","v":"Date of Test :"},{"$f":"IF('ASTM-C-1202'!$I$28=\"\",\"\",'ASTM-C-1202'!$I$28)","v":"Actual Date :"}]
[17,{"$f":"IF('ASTM-C-1202'!$E$32=\"\",\"\",'ASTM-C-1202'!$E$32)","v":""},{"$f":"IF('ASTM-C-1202'!$B$6=\"\",\"\",'ASTM-C-1202'!$B$6)","v":"ASTM C 1202"},{"$f":"IF('ASTM-C-1202'!$C$32=\"\",\"\",'ASTM-C-1202'!$C$32)","v":"Mach"},{"$f":"IF('ASTM-C-1202'!$C$30=\"\",\"\",'ASTM-C-1202'!$C$30)","v":"SET 1"},{"$f":"IF('ASTM-C-1202'!$E$31=\"\",\"\",'ASTM-C-1202'!$E$31)","v":1}]
[18,{"$f":"IF('ASTM-C-1202'!$G$32=\"\",\"\",'ASTM-C-1202'!$G$32)","v":""},{"$f":"IF('ASTM-C-1202'!$B$6=\"\",\"\",'ASTM-C-1202'!$B$6)","v":"ASTM C 1202"},{"$f":"IF('ASTM-C-1202'!$C$32=\"\",\"\",'ASTM-C-1202'!$C$32)","v":"Mach"},{"$f":"IF('ASTM-C-1202'!$C$30=\"\",\"\",'ASTM-C-1202'!$C$30)","v":"SET 1"},{"$f":"IF('ASTM-C-1202'!$G$31=\"\",\"\",'ASTM-C-1202'!$G$31)","v":2}]
[19,{"$f":"IF('ASTM-C-1202'!$I$32=\"\",\"\",'ASTM-C-1202'!$I$32)","v":""},{"$f":"IF('ASTM-C-1202'!$B$6=\"\",\"\",'ASTM-C-1202'!$B$6)","v":"ASTM C 1202"},{"$f":"IF('ASTM-C-1202'!$C$32=\"\",\"\",'ASTM-C-1202'!$C$32)","v":"Mach"},{"$f":"IF('ASTM-C-1202'!$C$30=\"\",\"\",'ASTM-C-1202'!$C$30)","v":"SET 1"},{"$f":"IF('ASTM-C-1202'!$I$31=\"\",\"\",'ASTM-C-1202'!$I$31)","v":3}]
[20,{"$f":"IF('ASTM-C-1202'!$K$32=\"\",\"\",'ASTM-C-1202'!$K$32)","v":""},{"$f":"IF('ASTM-C-1202'!$B$6=\"\",\"\",'ASTM-C-1202'!$B$6)","v":"ASTM C 1202"},{"$f":"IF('ASTM-C-1202'!$C$32=\"\",\"\",'ASTM-C-1202'!$C$32)","v":"Mach"},{"$f":"IF('ASTM-C-1202'!$C$30=\"\",\"\",'ASTM-C-1202'!$C$30)","v":"SET 1"},{"$f":"IF('ASTM-C-1202'!$K$31=\"\",\"\",'ASTM-C-1202'!$K$31)","v":4}]
[21,{"$f":"IF('ASTM-C-1202'!$E$33=\"\",\"\",'ASTM-C-1202'!$E$33)","v":""},{"$f":"IF('ASTM-C-1202'!$B$6=\"\",\"\",'ASTM-C-1202'!$B$6)","v":"ASTM C 1202"},{"$f":"IF('ASTM-C-1202'!$C$33=\"\",\"\",'ASTM-C-1202'!$C$33)","v":"Cell No."},{"$f":"IF('ASTM-C-1202'!$C$30=\"\",\"\",'ASTM-C-1202'!$C$30)","v":"SET 1"},{"$f":"IF('ASTM-C-1202'!$E$31=\"\",\"\",'ASTM-C-1202'!$E$31)","v":1}]
[22,{"$f":"IF('ASTM-C-1202'!$G$33=\"\",\"\",'ASTM-C-1202'!$G$33)","v":""},{"$f":"IF('ASTM-C-1202'!$B$6=\"\",\"\",'ASTM-C-1202'!$B$6)","v":"ASTM C 1202"},{"$f":"IF('ASTM-C-1202'!$C$33=\"\",\"\",'ASTM-C-1202'!$C$33)","v":"Cell No."},{"$f":"IF('ASTM-C-1202'!$C$30=\"\",\"\",'ASTM-C-1202'!$C$30)","v":"SET 1"},{"$f":"IF('ASTM-C-1202'!$G$31=\"\",\"\",'ASTM-C-1202'!$G$31)","v":2}]
[23,{"$f":"IF('ASTM-C-1202'!$I$33=\"\",\"\",'ASTM-C-1202'!$I$33)","v":""},{"$f":"IF('ASTM-C-1202'!$B$6=\"\",\"\",'ASTM-C-1202'!$B$6)","v":"ASTM C 1202"},{"$f":"IF('ASTM-C-1202'!$C$33=\"\",\"\",'ASTM-C-1202'!$C$33)","v":"Cell No."},{"$f":"IF('ASTM-C-1202'!$C$30=\"\",\"\",'ASTM-C-1202'!$C$30)","v":"SET 1"},{"$f":"IF('ASTM-C-1202'!$I$31=\"\",\"\",'ASTM-C-1202'!$I$31)","v":3}]
[24,{"$f":"IF('ASTM-C-1202'!$K$33=\"\",\"\",'ASTM-C-1202'!$K$33)","v":""},{"$f":"IF('ASTM-C-1202'!$B$6=\"\",\"\",'ASTM-C-1202'!$B$6)","v":"ASTM C 1202"},{"$f":"IF('ASTM-C-1202'!$C$33=\"\",\"\",'ASTM-C-1202'!$C$33)","v":"Cell No."},{"$f":"IF('ASTM-C-1202'!$C$30=\"\",\"\",'ASTM-C-1202'!$C$30)","v":"SET 1"},{"$f":"IF('ASTM-C-1202'!$K$31=\"\",\"\",'ASTM-C-1202'!$K$31)","v":4}]
[25,{"$f":"IF('ASTM-C-1202'!$E$34=\"\",\"\",'ASTM-C-1202'!$E$34)","v":""},{"$f":"IF('ASTM-C-1202'!$B$6=\"\",\"\",'ASTM-C-1202'!$B$6)","v":"ASTM C 1202"},{"$f":"IF('ASTM-C-1202'!$C$34=\"\",\"\",'ASTM-C-1202'!$C$34)","v":"Specimen ID"},{"$f":"IF('ASTM-C-1202'!$C$30=\"\",\"\",'ASTM-C-1202'!$C$30)","v":"SET 1"},{"$f":"IF('ASTM-C-1202'!$E$31=\"\",\"\",'ASTM-C-1202'!$E$31)","v":1}]
[26,{"$f":"IF('ASTM-C-1202'!$G$34=\"\",\"\",'ASTM-C-1202'!$G$34)","v":""},{"$f":"IF('ASTM-C-1202'!$B$6=\"\",\"\",'ASTM-C-1202'!$B$6)","v":"ASTM C 1202"},{"$f":"IF('ASTM-C-1202'!$C$34=\"\",\"\",'ASTM-C-1202'!$C$34)","v":"Specimen ID"},{"$f":"IF('ASTM-C-1202'!$C$30=\"\",\"\",'ASTM-C-1202'!$C$30)","v":"SET 1"},{"$f":"IF('ASTM-C-1202'!$G$31=\"\",\"\",'ASTM-C-1202'!$G$31)","v":2}]
[27,{"$f":"IF('ASTM-C-1202'!$I$34=\"\",\"\",'ASTM-C-1202'!$I$34)","v":""},{"$f":"IF('ASTM-C-1202'!$B$6=\"\",\"\",'ASTM-C-1202'!$B$6)","v":"ASTM C 1202"},{"$f":"IF('ASTM-C-1202'!$C$34=\"\",\"\",'ASTM-C-1202'!$C$34)","v":"Specimen ID"},{"$f":"IF('ASTM-C-1202'!$C$30=\"\",\"\",'ASTM-C-1202'!$C$30)","v":"SET 1"},{"$f":"IF('ASTM-C-1202'!$I$31=\"\",\"\",'ASTM-C-1202'!$I$31)","v":3}]
[28,{"$f":"IF('ASTM-C-1202'!$K$34=\"\",\"\",'ASTM-C-1202'!$K$34)","v":""},{"$f":"IF('ASTM-C-1202'!$B$6=\"\",\"\",'ASTM-C-1202'!$B$6)","v":"ASTM C 1202"},{"$f":"IF('ASTM-C-1202'!$C$34=\"\",\"\",'ASTM-C-1202'!$C$34)","v":"Specimen ID"},{"$f":"IF('ASTM-C-1202'!$C$30=\"\",\"\",'ASTM-C-1202'!$C$30)","v":"SET 1"},{"$f":"IF('ASTM-C-1202'!$K$31=\"\",\"\",'ASTM-C-1202'!$K$31)","v":4}]
[29,{"$f":"IF('ASTM-C-1202'!$E$35=\"\",\"\",'ASTM-C-1202'!$E$35)","v":1},{"$f":"IF('ASTM-C-1202'!$B$6=\"\",\"\",'ASTM-C-1202'!$B$6)","v":"ASTM C 1202"},{"$f":"IF('ASTM-C-1202'!$C$35=\"\",\"\",'ASTM-C-1202'!$C$35)","v":"Length (in.)"},{"$f":"IF('ASTM-C-1202'!$C$30=\"\",\"\",'ASTM-C-1202'!$C$30)","v":"SET 1"},{"$f":"IF('ASTM-C-1202'!$E$31=\"\",\"\",'ASTM-C-1202'!$E$31)","v":1}]
[30,{"$f":"IF('ASTM-C-1202'!$G$35=\"\",\"\",'ASTM-C-1202'!$G$35)","v":1},{"$f":"IF('ASTM-C-1202'!$B$6=\"\",\"\",'ASTM-C-1202'!$B$6)","v":"ASTM C 1202"},{"$f":"IF('ASTM-C-1202'!$C$35=\"\",\"\",'ASTM-C-1202'!$C$35)","v":"Length (in.)"},{"$f":"IF('ASTM-C-1202'!$C$30=\"\",\"\",'ASTM-C-1202'!$C$30)","v":"SET 1"},{"$f":"IF('ASTM-C-1202'!$G$31=\"\",\"\",'ASTM-C-1202'!$G$31)","v":2}]
[31,{"$f":"IF('ASTM-C-1202'!$I$35=\"\",\"\",'ASTM-C-1202'!$I$35)","v":1},{"$f":"IF('ASTM-C-1202'!$B$6=\"\",\"\",'ASTM-C-1202'!$B$6)","v":"ASTM C 1202"},{"$f":"IF('ASTM-C-1202'!$C$35=\"\",\"\",'ASTM-C-1202'!$C$35)","v":"Length (in.)"},{"$f":"IF('ASTM-C-1202'!$C$30=\"\",\"\",'ASTM-C-1202'!$C$30)","v":"SET 1"},{"$f":"IF('ASTM-C-1202'!$I$31=\"\",\"\",'ASTM-C-1202'!$I$31)","v":3}]
[32,{"$f":"IF('ASTM-C-1202'!$K$35=\"\",\"\",'ASTM-C-1202'!$K$35)","v":1},{"$f":"IF('ASTM-C-1202'!$B$6=\"\",\"\",'ASTM-C-1202'!$B$6)","v":"ASTM C 1202"},{"$f":"IF('ASTM-C-1202'!$C$35=\"\",\"\",'ASTM-C-1202'!$C$35)","v":"Length (in.)"},{"$f":"IF('ASTM-C-1202'!$C$30=\"\",\"\",'ASTM-C-1202'!$C$30)","v":"SET 1"},{"$f":"IF('ASTM-C-1202'!$K$31=\"\",\"\",'ASTM-C-1202'!$K$31)","v":4}]
[33,{"$f":"IF('ASTM-C-1202'!$E$36=\"\",\"\",'ASTM-C-1202'!$E$36)","v":1},{"$f":"IF('ASTM-C-1202'!$B$6=\"\",\"\",'ASTM-C-1202'!$B$6)","v":"ASTM C 1202"},{"$f":"IF('ASTM-C-1202'!$C$36=\"\",\"\",'ASTM-C-1202'!$C$36)","v":"Diameter (in.)"},{"$f":"IF('ASTM-C-1202'!$C$30=\"\",\"\",'ASTM-C-1202'!$C$30)","v":"SET 1"},{"$f":"IF('ASTM-C-1202'!$E$31=\"\",\"\",'ASTM-C-1202'!$E$31)","v":1}]
[34,{"$f":"IF('ASTM-C-1202'!$G$36=\"\",\"\",'ASTM-C-1202'!$G$36)","v":1},{"$f":"IF('ASTM-C-1202'!$B$6=\"\",\"\",'ASTM-C-1202'!$B$6)","v":"ASTM C 1202"},{"$f":"IF('ASTM-C-1202'!$C$36=\"\",\"\",'ASTM-C-1202'!$C$36)","v":"Diameter (in.)"},{"$f":"IF('ASTM-C-1202'!$C$30=\"\",\"\",'ASTM-C-1202'!$C$30)","v":"SET 1"},{"$f":"IF('ASTM-C-1202'!$G$31=\"\",\"\",'ASTM-C-1202'!$G$31)","v":2}]
[35,{"$f":"IF('ASTM-C-1202'!$I$36=\"\",\"\",'ASTM-C-1202'!$I$36)","v":1},{"$f":"IF('ASTM-C-1202'!$B$6=\"\",\"\",'ASTM-C-1202'!$B$6)","v":"ASTM C 1202"},{"$f":"IF('ASTM-C-1202'!$C$36=\"\",\"\",'ASTM-C-1202'!$C$36)","v":"Diameter (in.)"},{"$f":"IF('ASTM-C-1202'!$C$30=\"\",\"\",'ASTM-C-1202'!$C$30)","v":"SET 1"},{"$f":"IF('ASTM-C-1202'!$I$31=\"\",\"\",'ASTM-C-1202'!$I$31)","v":3}]
[36,{"$f":"IF('ASTM-C-1202'!$K$36=\"\",\"\",'ASTM-C-1202'!$K$36)","v":1},{"$f":"IF('ASTM-C-1202'!$B$6=\"\",\"\",'ASTM-C-1202'!$B$6)","v":"ASTM C 1202"},{"$f":"IF('ASTM-C-1202'!$C$36=\"\",\"\",'ASTM-C-1202'!$C$36)","v":"Diameter (in.)"},{"$f":"IF('ASTM-C-1202'!$C$30=\"\",\"\",'ASTM-C-1202'!$C$30)","v":"SET 1"},{"$f":"IF('ASTM-C-1202'!$K$31=\"\",\"\",'ASTM-C-1202'!$K$31)","v":4}]
[37,{"$f":"IF('ASTM-C-1202'!$D$39=\"\",\"\",'ASTM-C-1202'!$D$39)","v":1},{"$f":"IF('ASTM-C-1202'!$B$6=\"\",\"\",'ASTM-C-1202'!$B$6)","v":"ASTM C 1202"},{"$f":"IF('ASTM-C-1202'!$D$37=\"\",\"\",'ASTM-C-1202'!$D$37)","v":"Ambient Air Temp (°F)"},{"$f":"IF('ASTM-C-1202'!$C$37=\"\",\"\",'ASTM-C-1202'!$C$37)","v":"Time (min)"},{"$f":"IF('ASTM-C-1202'!$C$39=\"\",\"\",'ASTM-C-1202'!$C$39)","v":"0"}]
[38,{"$f":"IF('ASTM-C-1202'!$E$39=\"\",\"\",'ASTM-C-1202'!$E$39)","v":1},{"$f":"IF('ASTM-C-1202'!$B$6=\"\",\"\",'ASTM-C-1202'!$B$6)","v":"ASTM C 1202"},{"$f":"IF('ASTM-C-1202'!$C$37=\"\",\"\",'ASTM-C-1202'!$C$37)","v":"Time (min)"},{"$f":"IF('ASTM-C-1202'!$C$39=\"\",\"\",'ASTM-C-1202'!$C$39)","v":"0"}]
[39,{"$f":"IF('ASTM-C-1202'!$F$39=\"\",\"\",'ASTM-C-1202'!$F$39)","v":1},{"$f":"IF('ASTM-C-1202'!$B$6=\"\",\"\",'ASTM-C-1202'!$B$6)","v":"ASTM C 1202"},{"$f":"IF('ASTM-C-1202'!$C$37=\"\",\"\",'ASTM-C-1202'!$C$37)","v":"Time (min)"},{"$f":"IF('ASTM-C-1202'!$C$39=\"\",\"\",'ASTM-C-1202'!$C$39)","v":"0"}]
[40,{"$f":"IF('ASTM-C-1202'!$G$39=\"\",\"\",'ASTM-C-1202'!$G$39)","v":1},{"$f":"IF('ASTM-C-1202'!$B$6=\"\",\"\",'ASTM-C-1202'!$B$6)","v":"ASTM C 1202"},{"$f":"IF('ASTM-C-1202'!$C$37=\"\",\"\",'ASTM-C-1202'!$C$37)","v":"Time (min)"},{"$f":"IF('ASTM-C-1202'!$C$39=\"\",\"\",'ASTM-C-1202'!$C$39)","v":"0"}]
[41,{"$f":"IF('ASTM-C-1202'!$H$39=\"\",\"\",'ASTM-C-1202'!$H$39)","v":1},{"$f":"IF('ASTM-C-1202'!$B$6=\"\",\"\",'ASTM-C-1202'!$B$6)","v":"ASTM C 1202"},{"$f":"IF('ASTM-C-1202'!$C$37=\"\",\"\",'ASTM-C-1202'!$C$37)","v":"Time (min)"},{"$f":"IF('ASTM-C-1202'!$C$39=\"\",\"\",'ASTM-C-1202'!$C$39)","v":"0"}]
[42,{"$f":"IF('ASTM-C-1202'!$I$39=\"\",\"\",'ASTM-C-1202'!$I$39)","v":1},{"$f":"IF('ASTM-C-1202'!$B$6=\"\",\"\",'ASTM-C-1202'!$B$6)","v":"ASTM C 1202"},{"$f":"IF('ASTM-C-1202'!$C$37=\"\",\"\",'ASTM-C-1202'!$C$37)","v":"Time (min)"},{"$f":"IF('ASTM-C-1202'!$C$39=\"\",\"\",'ASTM-C-1202'!$C$39)","v":"0"}]
[43,{"$f":"IF('ASTM-C-1202'!$J$39=\"\",\"\",'ASTM-C-1202'!$J$39)","v":1},{"$f":"IF('ASTM-C-1202'!$B$6=\"\",\"\",'ASTM-C-1202'!$B$6)","v":"ASTM C 1202"},{"$f":"IF('ASTM-C-1202'!$C$37=\"\",\"\",'ASTM-C-1202'!$C$37)","v":"Time (min)"},{"$f":"IF('ASTM-C-1202'!$C$39=\"\",\"\",'ASTM-C-1202'!$C$39)","v":"0"}]
[44,{"$f":"IF('ASTM-C-1202'!$K$39=\"\",\"\",'ASTM-C-1202'!$K$39)","v":1},{"$f":"IF('ASTM-C-1202'!$B$6=\"\",\"\",'ASTM-C-1202'!$B$6)","v":"ASTM C 1202"},{"$f":"IF('ASTM-C-1202'!$C$37=\"\",\"\",'ASTM-C-1202'!$C$37)","v":"Time (min)"},{"$f":"IF('ASTM-C-1202'!$C$39=\"\",\"\",'ASTM-C-1202'!$C$39)","v":"0"}]
[45,{"$f":"IF('ASTM-C-1202'!$L$39=\"\",\"\",'ASTM-C-1202'!$L$39)","v":1},{"$f":"IF('ASTM-C-1202'!$B$6=\"\",\"\",'ASTM-C-1202'!$B$6)","v":"ASTM C 1202"},{"$f":"IF('ASTM-C-1202'!$C$37=\"\",\"\",'ASTM-C-1202'!$C$37)","v":"Time (min)"},{"$f":"IF('ASTM-C-1202'!$C$39=\"\",\"\",'ASTM-C-1202'!$C$39)","v":"0"}]
[46,{"$f":"IF('ASTM-C-1202'!$D$40=\"\",\"\",'ASTM-C-1202'!$D$40)","v":1},{"$f":"IF('ASTM-C-1202'!$B$6=\"\",\"\",'ASTM-C-1202'!$B$6)","v":"ASTM C 1202"},{"$f":"IF('ASTM-C-1202'!$D$37=\"\",\"\",'ASTM-C-1202'!$D$37)","v":"Ambient Air Temp (°F)"},{"$f":"IF('ASTM-C-1202'!$C$37=\"\",\"\",'ASTM-C-1202'!$C$37)","v":"Time (min)"},{"$f":"IF('ASTM-C-1202'!$C$40=\"\",\"\",'ASTM-C-1202'!$C$40)","v":360}]
[47,{"$f":"IF('ASTM-C-1202'!$E$40=\"\",\"\",'ASTM-C-1202'!$E$40)","v":1},{"$f":"IF('ASTM-C-1202'!$B$6=\"\",\"\",'ASTM-C-1202'!$B$6)","v":"ASTM C 1202"},{"$f":"IF('ASTM-C-1202'!$C$37=\"\",\"\",'ASTM-C-1202'!$C$37)","v":"Time (min)"},{"$f":"IF('ASTM-C-1202'!$C$40=\"\",\"\",'ASTM-C-1202'!$C$40)","v":360}]
[48,{"$f":"IF('ASTM-C-1202'!$F$40=\"\",\"\",'ASTM-C-1202'!$F$40)","v":1},{"$f":"IF('ASTM-C-1202'!$B$6=\"\",\"\",'ASTM-C-1202'!$B$6)","v":"ASTM C 1202"},{"$f":"IF('ASTM-C-1202'!$C$37=\"\",\"\",'ASTM-C-1202'!$C$37)","v":"Time (min)"},{"$f":"IF('ASTM-C-1202'!$C$40=\"\",\"\",'ASTM-C-1202'!$C$40)","v":360}]
[49,{"$f":"IF('ASTM-C-1202'!$G$40=\"\",\"\",'ASTM-C-1202'!$G$40)","v":1},{"$f":"IF('ASTM-C-1202'!$B$6=\"\",\"\",'ASTM-C-1202'!$B$6)","v":"ASTM C 1202"},{"$f":"IF('ASTM-C-1202'!$C$37=\"\",\"\",'ASTM-C-1202'!$C$37)","v":"Time (min)"},{"$f":"IF('ASTM-C-1202'!$C$40=\"\",\"\",'ASTM-C-1202'!$C$40)","v":360}]
[50,{"$f":"IF('ASTM-C-1202'!$H$40=\"\",\"\",'ASTM-C-1202'!$H$40)","v":1},{"$f":"IF('ASTM-C-1202'!$B$6=\"\",\"\",'ASTM-C-1202'!$B$6)","v":"ASTM C 1202"},{"$f":"IF('ASTM-C-1202'!$C$37=\"\",\"\",'ASTM-C-1202'!$C$37)","v":"Time (min)"},{"$f":"IF('ASTM-C-1202'!$C$40=\"\",\"\",'ASTM-C-1202'!$C$40)","v":360}]
[51,{"$f":"IF('ASTM-C-1202'!$I$40=\"\",\"\",'ASTM-C-1202'!$I$40)","v":1},{"$f":"IF('ASTM-C-1202'!$B$6=\"\",\"\",'ASTM-C-1202'!$B$6)","v":"ASTM C 1202"},{"$f":"IF('ASTM-C-1202'!$C$37=\"\",\"\",'ASTM-C-1202'!$C$37)","v":"Time (min)"},{"$f":"IF('ASTM-C-1202'!$C$40=\"\",\"\",'ASTM-C-1202'!$C$40)","v":360}]
[52,{"$f":"IF('ASTM-C-1202'!$J$40=\"\",\"\",'ASTM-C-1202'!$J$40)","v":1},{"$f":"IF('ASTM-C-1202'!$B$6=\"\",\"\",'ASTM-C-1202'!$B$6)","v":"ASTM C 1202"},{"$f":"IF('ASTM-C-1202'!$C$37=\"\",\"\",'ASTM-C-1202'!$C$37)","v":"Time (min)"},{"$f":"IF('ASTM-C-1202'!$C$40=\"\",\"\",'ASTM-C-1202'!$C$40)","v":360}]
[53,{"$f":"IF('ASTM-C-1202'!$K$40=\"\",\"\",'ASTM-C-1202'!$K$40)","v":1},{"$f":"IF('ASTM-C-1202'!$B$6=\"\",\"\",'ASTM-C-1202'!$B$6)","v":"ASTM C 1202"},{"$f":"IF('ASTM-C-1202'!$C$37=\"\",\"\",'ASTM-C-1202'!$C$37)","v":"Time (min)"},{"$f":"IF('ASTM-C-1202'!$C$40=\"\",\"\",'ASTM-C-1202'!$C$40)","v":360}]
[54,{"$f":"IF('ASTM-C-1202'!$L$40=\"\",\"\",'ASTM-C-1202'!$L$40)","v":1},{"$f":"IF('ASTM-C-1202'!$B$6=\"\",\"\",'ASTM-C-1202'!$B$6)","v":"ASTM C 1202"},{"$f":"IF('ASTM-C-1202'!$C$37=\"\",\"\",'ASTM-C-1202'!$C$37)","v":"Time (min)"},{"$f":"IF('ASTM-C-1202'!$C$40=\"\",\"\",'ASTM-C-1202'!$C$40)","v":360}]
[55,{"$f":"IF('ASTM-C-1202'!$E$44=\"\",\"\",'ASTM-C-1202'!$E$44)","v":""},{"$f":"IF('ASTM-C-1202'!$B$6=\"\",\"\",'ASTM-C-1202'!$B$6)","v":"ASTM C 1202"},{"$f":"IF('ASTM-C-1202'!$C$44=\"\",\"\",'ASTM-C-1202'!$C$44)","v":"Mach"},{"$f":"IF('ASTM-C-1202'!$C$42=\"\",\"\",'ASTM-C-1202'!$C$42)","v":"SET 2"},{"$f":"IF('ASTM-C-1202'!$E$43=\"\",\"\",'ASTM-C-1202'!$E$43)","v":1}]
[56,{"$f":"IF('ASTM-C-1202'!$G$44=\"\",\"\",'ASTM-C-1202'!$G$44)","v":""},{"$f":"IF('ASTM-C-1202'!$B$6=\"\",\"\",'ASTM-C-1202'!$B$6)","v":"ASTM C 1202"},{"$f":"IF('ASTM-C-1202'!$C$44=\"\",\"\",'ASTM-C-1202'!$C$44)","v":"Mach"},{"$f":"IF('ASTM-C-1202'!$C$42=\"\",\"\",'ASTM-C-1202'!$C$42)","v":"SET 2"},{"$f":"IF('ASTM-C-1202'!$G$43=\"\",\"\",'ASTM-C-1202'!$G$43)","v":2}]
[57,{"$f":"IF('ASTM-C-1202'!$I$44=\"\",\"\",'ASTM-C-1202'!$I$44)","v":""},{"$f":"IF('ASTM-C-1202'!$B$6=\"\",\"\",'ASTM-C-1202'!$B$6)","v":"ASTM C 1202"},{"$f":"IF('ASTM-C-1202'!$C$44=\"\",\"\",'ASTM-C-1202'!$C$44)","v":"Mach"},{"$f":"IF('ASTM-C-1202'!$C$42=\"\",\"\",'ASTM-C-1202'!$C$42)","v":"SET 2"},{"$f":"IF('ASTM-C-1202'!$I$43=\"\",\"\",'ASTM-C-1202'!$I$43)","v":3}]
[58,{"$f":"IF('ASTM-C-1202'!$K$44=\"\",\"\",'ASTM-C-1202'!$K$44)","v":""},{"$f":"IF('ASTM-C-1202'!$B$6=\"\",\"\",'ASTM-C-1202'!$B$6)","v":"ASTM C 1202"},{"$f":"IF('ASTM-C-1202'!$C$44=\"\",\"\",'ASTM-C-1202'!$C$44)","v":"Mach"},{"$f":"IF('ASTM-C-1202'!$C$42=\"\",\"\",'ASTM-C-1202'!$C$42)","v":"SET 2"},{"$f":"IF('ASTM-C-1202'!$K$43=\"\",\"\",'ASTM-C-1202'!$K$43)","v":4}]
[59,{"$f":"IF('ASTM-C-1202'!$E$45=\"\",\"\",'ASTM-C-1202'!$E$45)","v":""},{"$f":"IF('ASTM-C-1202'!$B$6=\"\",\"\",'ASTM-C-1202'!$B$6)","v":"ASTM C 1202"},{"$f":"IF('ASTM-C-1202'!$C$45=\"\",\"\",'ASTM-C-1202'!$C$45)","v":"Cell No."},{"$f":"IF('ASTM-C-1202'!$C$42=\"\",\"\",'ASTM-C-1202'!$C$42)","v":"SET 2"},{"$f":"IF('ASTM-C-1202'!$E$43=\"\",\"\",'ASTM-C-1202'!$E$43)","v":1}]
[60,{"$f":"IF('ASTM-C-1202'!$G$45=\"\",\"\",'ASTM-C-1202'!$G$45)","v":""},{"$f":"IF('ASTM-C-1202'!$B$6=\"\",\"\",'ASTM-C-1202'!$B$6)","v":"ASTM C 1202"},{"$f":"IF('ASTM-C-1202'!$C$45=\"\",\"\",'ASTM-C-1202'!$C$45)","v":"Cell No."},{"$f":"IF('ASTM-C-1202'!$C$42=\"\",\"\",'ASTM-C-1202'!$C$42)","v":"SET 2"},{"$f":"IF('ASTM-C-1202'!$G$43=\"\",\"\",'ASTM-C-1202'!$G$43)","v":2}]
[61,{"$f":"IF('ASTM-C-1202'!$I$45=\"\",\"\",'ASTM-C-1202'!$I$45)","v":""},{"$f":"IF('ASTM-C-1202'!$B$6=\"\",\"\",'ASTM-C-1202'!$B$6)","v":"ASTM C 1202"},{"$f":"IF('ASTM-C-1202'!$C$45=\"\",\"\",'ASTM-C-1202'!$C$45)","v":"Cell No."},{"$f":"IF('ASTM-C-1202'!$C$42=\"\",\"\",'ASTM-C-1202'!$C$42)","v":"SET 2"},{"$f":"IF('ASTM-C-1202'!$I$43=\"\",\"\",'ASTM-C-1202'!$I$43)","v":3}]
[62,{"$f":"IF('ASTM-C-1202'!$K$45=\"\",\"\",'ASTM-C-1202'!$K$45)","v":""},{"$f":"IF('ASTM-C-1202'!$B$6=\"\",\"\",'ASTM-C-1202'!$B$6)","v":"ASTM C 1202"},{"$f":"IF('ASTM-C-1202'!$C$45=\"\",\"\",'ASTM-C-1202'!$C$45)","v":"Cell No."},{"$f":"IF('ASTM-C-1202'!$C$42=\"\",\"\",'ASTM-C-1202'!$C$42)","v":"SET 2"},{"$f":"IF('ASTM-C-1202'!$K$43=\"\",\"\",'ASTM-C-1202'!$K$43)","v":4}]
[63,{"$f":"IF('ASTM-C-1202'!$E$46=\"\",\"\",'ASTM-C-1202'!$E$46)","v":""},{"$f":"IF('ASTM-C-1202'!$B$6=\"\",\"\",'ASTM-C-1202'!$B$6)","v":"ASTM C 1202"},{"$f":"IF('ASTM-C-1202'!$C$46=\"\",\"\",'ASTM-C-1202'!$C$46)","v":"Specimen ID"},{"$f":"IF('ASTM-C-1202'!$C$42=\"\",\"\",'ASTM-C-1202'!$C$42)","v":"SET 2"},{"$f":"IF('ASTM-C-1202'!$E$43=\"\",\"\",'ASTM-C-1202'!$E$43)","v":1}]
[64,{"$f":"IF('ASTM-C-1202'!$G$46=\"\",\"\",'ASTM-C-1202'!$G$46)","v":""},{"$f":"IF('ASTM-C-1202'!$B$6=\"\",\"\",'ASTM-C-1202'!$B$6)","v":"ASTM C 1202"},{"$f":"IF('ASTM-C-1202'!$C$46=\"\",\"\",'ASTM-C-1202'!$C$46)","v":"Specimen ID"},{"$f":"IF('ASTM-C-1202'!$C$42=\"\",\"\",'ASTM-C-1202'!$C$42)","v":"SET 2"},{"$f":"IF('ASTM-C-1202'!$G$43=\"\",\"\",'ASTM-C-1202'!$G$43)","v":2}]
[65,{"$f":"IF('ASTM-C-1202'!$I$46=\"\",\"\",'ASTM-C-1202'!$I$46)","v":""},{"$f":"IF('ASTM-C-1202'!$B$6=\"\",\"\",'ASTM-C-1202'!$B$6)","v":"ASTM C 1202"},{"$f":"IF('ASTM-C-1202'!$C$46=\"\",\"\",'ASTM-C-1202'!$C$46)","v":"Specimen ID"},{"$f":"IF('ASTM-C-1202'!$C$42=\"\",\"\",'ASTM-C-1202'!$C$42)","v":"SET 2"},{"$f":"IF('ASTM-C-1202'!$I$43=\"\",\"\",'ASTM-C-1202'!$I$43)","v":3}]
[66,{"$f":"IF('ASTM-C-1202'!$K$46=\"\",\"\",'ASTM-C-1202'!$K$46)","v":""},{"$f":"IF('ASTM-C-1202'!$B$6=\"\",\"\",'ASTM-C-1202'!$B$6)","v":"ASTM C 1202"},{"$f":"IF('ASTM-C-1202'!$C$46=\"\",\"\",'ASTM-C-1202'!$C$46)","v":"Specimen ID"},{"$f":"IF('ASTM-C-1202'!$C$42=\"\",\"\",'ASTM-C-1202'!$C$42)","v":"SET 2"},{"$f":"IF('ASTM-C-1202'!$K$43=\"\",\"\",'ASTM-C-1202'!$K$43)","v":4}]
[67,{"$f":"IF('ASTM-C-1202'!$E$47=\"\",\"\",'ASTM-C-1202'!$E$47)","v":""},{"$f":"IF('ASTM-C-1202'!$B$6=\"\",\"\",'ASTM-C-1202'!$B$6)","v":"ASTM C 1202"},{"$f":"IF('ASTM-C-1202'!$C$47=\"\",\"\",'ASTM-C-1202'!$C$47)","v":"Length (in.)"},{"$f":"IF('ASTM-C-1202'!$C$42=\"\",\"\",'ASTM-C-1202'!$C$42)","v":"SET 2"},{"$f":"IF('ASTM-C-1202'!$E$43=\"\",\"\",'ASTM-C-1202'!$E$43)","v":1}]
[68,{"$f":"IF('ASTM-C-1202'!$G$47=\"\",\"\",'ASTM-C-1202'!$G$47)","v":""},{"$f":"IF('ASTM-C-1202'!$B$6=\"\",\"\",'ASTM-C-1202'!$B$6)","v":"ASTM C 1202"},{"$f":"IF('ASTM-C-1202'!$C$47=\"\",\"\",'ASTM-C-1202'!$C$47)","v":"Length (in.)"},{"$f":"IF('ASTM-C-1202'!$C$42=\"\",\"\",'ASTM-C-1202'!$C$42)","v":"SET 2"},{"$f":"IF('ASTM-C-1202'!$G$43=\"\",\"\",'ASTM-C-1202'!$G$43)","v":2}]
[69,{"$f":"IF('ASTM-C-1202'!$I$47=\"\",\"\",'ASTM-C-1202'!$I$47)","v":""},{"$f":"IF('ASTM-C-1202'!$B$6=\"\",\"\",'ASTM-C-1202'!$B$6)","v":"ASTM C 1202"},{"$f":"IF('ASTM-C-1202'!$C$47=\"\",\"\",'ASTM-C-1202'!$C$47)","v":"Length (in.)"},{"$f":"IF('ASTM-C-1202'!$C$42=\"\",\"\",'ASTM-C-1202'!$C$42)","v":"SET 2"},{"$f":"IF('ASTM-C-1202'!$I$43=\"\",\"\",'ASTM-C-1202'!$I$43)","v":3}]
[70,{"$f":"IF('ASTM-C-1202'!$K$47=\"\",\"\",'ASTM-C-1202'!$K$47)","v":""},{"$f":"IF('ASTM-C-1202'!$B$6=\"\",\"\",'ASTM-C-1202'!$B$6)","v":"ASTM C 1202"},{"$f":"IF('ASTM-C-1202'!$C$47=\"\",\"\",'ASTM-C-1202'!$C$47)","v":"Length (in.)"},{"$f":"IF('ASTM-C-1202'!$C$42=\"\",\"\",'ASTM-C-1202'!$C$42)","v":"SET 2"},{"$f":"IF('ASTM-C-1202'!$K$43=\"\",\"\",'ASTM-C-1202'!$K$43)","v":4}]
[71,{"$f":"IF('ASTM-C-1202'!$E$48=\"\",\"\",'ASTM-C-1202'!$E$48)","v":""},{"$f":"IF('ASTM-C-1202'!$B$6=\"\",\"\",'ASTM-C-1202'!$B$6)","v":"ASTM C 1202"},{"$f":"IF('ASTM-C-1202'!$C$48=\"\",\"\",'ASTM-C-1202'!$C$48)","v":"Diameter (in.)"},{"$f":"IF('ASTM-C-1202'!$C$42=\"\",\"\",'ASTM-C-1202'!$C$42)","v":"SET 2"},{"$f":"IF('ASTM-C-1202'!$E$43=\"\",\"\",'ASTM-C-1202'!$E$43)","v":1}]
[72,{"$f":"IF('ASTM-C-1202'!$G$48=\"\",\"\",'ASTM-C-1202'!$G$48)","v":""},{"$f":"IF('ASTM-C-1202'!$B$6=\"\",\"\",'ASTM-C-1202'!$B$6)","v":"ASTM C 1202"},{"$f":"IF('ASTM-C-1202'!$C$48=\"\",\"\",'ASTM-C-1202'!$C$48)","v":"Diameter (in.)"},{"$f":"IF('ASTM-C-1202'!$C$42=\"\",\"\",'ASTM-C-1202'!$C$42)","v":"SET 2"},{"$f":"IF('ASTM-C-1202'!$G$43=\"\",\"\",'ASTM-C-1202'!$G$43)","v":2}]
[73,{"$f":"IF('ASTM-C-1202'!$I$48=\"\",\"\",'ASTM-C-1202'!$I$48)","v":""},{"$f":"IF('ASTM-C-1202'!$B$6=\"\",\"\",'ASTM-C-1202'!$B$6)","v":"ASTM C 1202"},{"$f":"IF('ASTM-C-1202'!$C$48=\"\",\"\",'ASTM-C-1202'!$C$48)","v":"Diameter (in.)"},{"$f":"IF('ASTM-C-1202'!$C$42=\"\",\"\",'ASTM-C-1202'!$C$42)","v":"SET 2"},{"$f":"IF('ASTM-C-1202'!$I$43=\"\",\"\",'ASTM-C-1202'!$I$43)","v":3}]
[74,{"$f":"IF('ASTM-C-1202'!$K$48=\"\",\"\",'ASTM-C-1202'!$K$48)","v":""},{"$f":"IF('ASTM-C-1202'!$B$6=\"\",\"\",'ASTM-C-1202'!$B$6)","v":"ASTM C 1202"},{"$f":"IF('ASTM-C-1202'!$C$48=\"\",\"\",'ASTM-C-1202'!$C$48)","v":"Diameter (in.)"},{"$f":"IF('ASTM-C-1202'!$C$42=\"\",\"\",'ASTM-C-1202'!$C$42)","v":"SET 2"},{"$f":"IF('ASTM-C-1202'!$K$43=\"\",\"\",'ASTM-C-1202'!$K$43)","v":4}]
[75,{"$f":"IF('ASTM-C-1202'!$D$52=\"\",\"\",'ASTM-C-1202'!$D$52)","v":""},{"$f":"IF('ASTM-C-1202'!$B$6=\"\",\"\",'ASTM-C-1202'!$B$6)","v":"ASTM C 1202"},{"$f":"IF('ASTM-C-1202'!$D$50=\"\",\"\",'ASTM-C-1202'!$D$50)","v":"Ambient Air Temp (°F)"},{"$f":"IF('ASTM-C-1202'!$C$50=\"\",\"\",'ASTM-C-1202'!$C$50)","v":"Time (min)"},{"$f":"IF('ASTM-C-1202'!$C$52=\"\",\"\",'ASTM-C-1202'!$C$52)","v":"0"}]
[76,{"$f":"IF('ASTM-C-1202'!$E$52=\"\",\"\",'ASTM-C-1202'!$E$52)","v":""},{"$f":"IF('ASTM-C-1202'!$B$6=\"\",\"\",'ASTM-C-1202'!$B$6)","v":"ASTM C 1202"},{"$f":"IF('ASTM-C-1202'!$C$50=\"\",\"\",'ASTM-C-1202'!$C$50)","v":"Time (min)"},{"$f":"IF('ASTM-C-1202'!$C$52=\"\",\"\",'ASTM-C-1202'!$C$52)","v":"0"}]
[77,{"$f":"IF('ASTM-C-1202'!$F$52=\"\",\"\",'ASTM-C-1202'!$F$52)","v":""},{"$f":"IF('ASTM-C-1202'!$B$6=\"\",\"\",'ASTM-C-1202'!$B$6)","v":"ASTM C 1202"},{"$f":"IF('ASTM-C-1202'!$C$50=\"\",\"\",'ASTM-C-1202'!$C$50)","v":"Time (min)"},{"$f":"IF('ASTM-C-1202'!$C$52=\"\",\"\",'ASTM-C-1202'!$C$52)","v":"0"}]
[78,{"$f":"IF('ASTM-C-1202'!$G$52=\"\",\"\",'ASTM-C-1202'!$G$52)","v":""},{"$f":"IF('ASTM-C-1202'!$B$6=\"\",\"\",'ASTM-C-1202'!$B$6)","v":"ASTM C 1202"},{"$f":"IF('ASTM-C-1202'!$C$50=\"\",\"\",'ASTM-C-1202'!$C$50)","v":"Time (min)"},{"$f":"IF('ASTM-C-1202'!$C$52=\"\",\"\",'ASTM-C-1202'!$C$52)","v":"0"}]
[79,{"$f":"IF('ASTM-C-1202'!$H$52=\"\",\"\",'ASTM-C-1202'!$H$52)","v":""},{"$f":"IF('ASTM-C-1202'!$B$6=\"\",\"\",'ASTM-C-1202'!$B$6)","v":"ASTM C 1202"},{"$f":"IF('ASTM-C-1202'!$C$50=\"\",\"\",'ASTM-C-1202'!$C$50)","v":"Time (min)"},{"$f":"IF('ASTM-C-1202'!$C$52=\"\",\"\",'ASTM-C-1202'!$C$52)","v":"0"}]
[80,{"$f":"IF('ASTM-C-1202'!$I$52=\"\",\"\",'ASTM-C-1202'!$I$52)","v":""},{"$f":"IF('ASTM-C-1202'!$B$6=\"\",\"\",'ASTM-C-1202'!$B$6)","v":"ASTM C 1202"},{"$f":"IF('ASTM-C-1202'!$C$50=\"\",\"\",'ASTM-C-1202'!$C$50)","v":"Time (min)"},{"$f":"IF('ASTM-C-1202'!$C$52=\"\",\"\",'ASTM-C-1202'!$C$52)","v":"0"}]
[81,{"$f":"IF('ASTM-C-1202'!$J$52=\"\",\"\",'ASTM-C-1202'!$J$52)","v":""},{"$f":"IF('ASTM-C-1202'!$B$6=\"\",\"\",'ASTM-C-1202'!$B$6)","v":"ASTM C 1202"},{"$f":"IF('ASTM-C-1202'!$C$50=\"\",\"\",'ASTM-C-1202'!$C$50)","v":"Time (min)"},{"$f":"IF('ASTM-C-1202'!$C$52=\"\",\"\",'ASTM-C-1202'!$C$52)","v":"0"}]
[82,{"$f":"IF('ASTM-C-1202'!$K$52=\"\",\"\",'ASTM-C-1202'!$K$52)","v":""},{"$f":"IF('ASTM-C-1202'!$B$6=\"\",\"\",'ASTM-C-1202'!$B$6)","v":"ASTM C 1202"},{"$f":"IF('ASTM-C-1202'!$C$50=\"\",\"\",'ASTM-C-1202'!$C$50)","v":"Time (min)"},{"$f":"IF('ASTM-C-1202'!$C$52=\"\",\"\",'ASTM-C-1202'!$C$52)","v":"0"}]
[83,{"$f":"IF('ASTM-C-1202'!$L$52=\"\",\"\",'ASTM-C-1202'!$L$52)","v":""},{"$f":"IF('ASTM-C-1202'!$B$6=\"\",\"\",'ASTM-C-1202'!$B$6)","v":"ASTM C 1202"},{"$f":"IF('ASTM-C-1202'!$C$50=\"\",\"\",'ASTM-C-1202'!$C$50)","v":"Time (min)"},{"$f":"IF('ASTM-C-1202'!$C$52=\"\",\"\",'ASTM-C-1202'!$C$52)","v":"0"}]
[84,{"$f":"IF('ASTM-C-1202'!$D$53=\"\",\"\",'ASTM-C-1202'!$D$53)","v":""},{"$f":"IF('ASTM-C-1202'!$B$6=\"\",\"\",'ASTM-C-1202'!$B$6)","v":"ASTM C 1202"},{"$f":"IF('ASTM-C-1202'!$D$50=\"\",\"\",'ASTM-C-1202'!$D$50)","v":"Ambient Air Temp (°F)"},{"$f":"IF('ASTM-C-1202'!$C$50=\"\",\"\",'ASTM-C-1202'!$C$50)","v":"Time (min)"},{"$f":"IF('ASTM-C-1202'!$C$53=\"\",\"\",'ASTM-C-1202'!$C$53)","v":360}]
[85,{"$f":"IF('ASTM-C-1202'!$E$53=\"\",\"\",'ASTM-C-1202'!$E$53)","v":""},{"$f":"IF('ASTM-C-1202'!$B$6=\"\",\"\",'ASTM-C-1202'!$B$6)","v":"ASTM C 1202"},{"$f":"IF('ASTM-C-1202'!$C$50=\"\",\"\",'ASTM-C-1202'!$C$50)","v":"Time (min)"},{"$f":"IF('ASTM-C-1202'!$C$53=\"\",\"\",'ASTM-C-1202'!$C$53)","v":360}]
[86,{"$f":"IF('ASTM-C-1202'!$F$53=\"\",\"\",'ASTM-C-1202'!$F$53)","v":""},{"$f":"IF('ASTM-C-1202'!$B$6=\"\",\"\",'ASTM-C-1202'!$B$6)","v":"ASTM C 1202"},{"$f":"IF('ASTM-C-1202'!$C$50=\"\",\"\",'ASTM-C-1202'!$C$50)","v":"Time (min)"},{"$f":"IF('ASTM-C-1202'!$C$53=\"\",\"\",'ASTM-C-1202'!$C$53)","v":360}]
[87,{"$f":"IF('ASTM-C-1202'!$G$53=\"\",\"\",'ASTM-C-1202'!$G$53)","v":""},{"$f":"IF('ASTM-C-1202'!$B$6=\"\",\"\",'ASTM-C-1202'!$B$6)","v":"ASTM C 1202"},{"$f":"IF('ASTM-C-1202'!$C$50=\"\",\"\",'ASTM-C-1202'!$C$50)","v":"Time (min)"},{"$f":"IF('ASTM-C-1202'!$C$53=\"\",\"\",'ASTM-C-1202'!$C$53)","v":360}]
[88,{"$f":"IF('ASTM-C-1202'!$H$53=\"\",\"\",'ASTM-C-1202'!$H$53)","v":""},{"$f":"IF('ASTM-C-1202'!$B$6=\"\",\"\",'ASTM-C-1202'!$B$6)","v":"ASTM C 1202"},{"$f":"IF('ASTM-C-1202'!$C$50=\"\",\"\",'ASTM-C-1202'!$C$50)","v":"Time (min)"},{"$f":"IF('ASTM-C-1202'!$C$53=\"\",\"\",'ASTM-C-1202'!$C$53)","v":360}]
[89,{"$f":"IF('ASTM-C-1202'!$I$53=\"\",\"\",'ASTM-C-1202'!$I$53)","v":""},{"$f":"IF('ASTM-C-1202'!$B$6=\"\",\"\",'ASTM-C-1202'!$B$6)","v":"ASTM C 1202"},{"$f":"IF('ASTM-C-1202'!$C$50=\"\",\"\",'ASTM-C-1202'!$C$50)","v":"Time (min)"},{"$f":"IF('ASTM-C-1202'!$C$53=\"\",\"\",'ASTM-C-1202'!$C$53)","v":360}]
[90,{"$f":"IF('ASTM-C-1202'!$J$53=\"\",\"\",'ASTM-C-1202'!$J$53)","v":""},{"$f":"IF('ASTM-C-1202'!$B$6=\"\",\"\",'ASTM-C-1202'!$B$6)","v":"ASTM C 1202"},{"$f":"IF('ASTM-C-1202'!$C$50=\"\",\"\",'ASTM-C-1202'!$C$50)","v":"Time (min)"},{"$f":"IF('ASTM-C-1202'!$C$53=\"\",\"\",'ASTM-C-1202'!$C$53)","v":360}]
[91,{"$f":"IF('ASTM-C-1202'!$K$53=\"\",\"\",'ASTM-C-1202'!$K$53)","v":""},{"$f":"IF('ASTM-C-1202'!$B$6=\"\",\"\",'ASTM-C-1202'!$B$6)","v":"ASTM C 1202"},{"$f":"IF('ASTM-C-1202'!$C$50=\"\",\"\",'ASTM-C-1202'!$C$50)","v":"Time (min)"},{"$f":"IF('ASTM-C-1202'!$C$53=\"\",\"\",'ASTM-C-1202'!$C$53)","v":360}]
[92,{"$f":"IF('ASTM-C-1202'!$L$53=\"\",\"\",'ASTM-C-1202'!$L$53)","v":""},{"$f":"IF('ASTM-C-1202'!$B$6=\"\",\"\",'ASTM-C-1202'!$B$6)","v":"ASTM C 1202"},{"$f":"IF('ASTM-C-1202'!$C$50=\"\",\"\",'ASTM-C-1202'!$C$50)","v":"Time (min)"},{"$f":"IF('ASTM-C-1202'!$C$53=\"\",\"\",'ASTM-C-1202'!$C$53)","v":360}]
[93,{"$f":"IF('ASTM-C-1202'!$E$57=\"\",\"\",'ASTM-C-1202'!$E$57)","v":""},{"$f":"IF('ASTM-C-1202'!$B$6=\"\",\"\",'ASTM-C-1202'!$B$6)","v":"ASTM C 1202"},{"$f":"IF('ASTM-C-1202'!$C$57=\"\",\"\",'ASTM-C-1202'!$C$57)","v":"Mach"},{"$f":"IF('ASTM-C-1202'!$C$55=\"\",\"\",'ASTM-C-1202'!$C$55)","v":"SET 3"},{"$f":"IF('ASTM-C-1202'!$E$56=\"\",\"\",'ASTM-C-1202'!$E$56)","v":1}]
[94,{"$f":"IF('ASTM-C-1202'!$G$57=\"\",\"\",'ASTM-C-1202'!$G$57)","v":""},{"$f":"IF('ASTM-C-1202'!$B$6=\"\",\"\",'ASTM-C-1202'!$B$6)","v":"ASTM C 1202"},{"$f":"IF('ASTM-C-1202'!$C$57=\"\",\"\",'ASTM-C-1202'!$C$57)","v":"Mach"},{"$f":"IF('ASTM-C-1202'!$C$55=\"\",\"\",'ASTM-C-1202'!$C$55)","v":"SET 3"},{"$f":"IF('ASTM-C-1202'!$G$56=\"\",\"\",'ASTM-C-1202'!$G$56)","v":2}]
[95,{"$f":"IF('ASTM-C-1202'!$I$57=\"\",\"\",'ASTM-C-1202'!$I$57)","v":""},{"$f":"IF('ASTM-C-1202'!$B$6=\"\",\"\",'ASTM-C-1202'!$B$6)","v":"ASTM C 1202"},{"$f":"IF('ASTM-C-1202'!$C$57=\"\",\"\",'ASTM-C-1202'!$C$57)","v":"Mach"},{"$f":"IF('ASTM-C-1202'!$C$55=\"\",\"\",'ASTM-C-1202'!$C$55)","v":"SET 3"},{"$f":"IF('ASTM-C-1202'!$I$56=\"\",\"\",'ASTM-C-1202'!$I$56)","v":3}]
[96,{"$f":"IF('ASTM-C-1202'!$K$57=\"\",\"\",'ASTM-C-1202'!$K$57)","v":""},{"$f":"IF('ASTM-C-1202'!$B$6=\"\",\"\",'ASTM-C-1202'!$B$6)","v":"ASTM C 1202"},{"$f":"IF('ASTM-C-1202'!$C$57=\"\",\"\",'ASTM-C-1202'!$C$57)","v":"Mach"},{"$f":"IF('ASTM-C-1202'!$C$55=\"\",\"\",'ASTM-C-1202'!$C$55)","v":"SET 3"},{"$f":"IF('ASTM-C-1202'!$K$56=\"\",\"\",'ASTM-C-1202'!$K$56)","v":4}]
[97,{"$f":"IF('ASTM-C-1202'!$E$58=\"\",\"\",'ASTM-C-1202'!$E$58)","v":""},{"$f":"IF('ASTM-C-1202'!$B$6=\"\",\"\",'ASTM-C-1202'!$B$6)","v":"ASTM C 1202"},{"$f":"IF('ASTM-C-1202'!$C$58=\"\",\"\",'ASTM-C-1202'!$C$58)","v":"Cell No."},{"$f":"IF('ASTM-C-1202'!$C$55=\"\",\"\",'ASTM-C-1202'!$C$55)","v":"SET 3"},{"$f":"IF('ASTM-C-1202'!$E$56=\"\",\"\",'ASTM-C-1202'!$E$56)","v":1}]
[98,{"$f":"IF('ASTM-C-1202'!$G$58=\"\",\"\",'ASTM-C-1202'!$G$58)","v":""},{"$f":"IF('ASTM-C-1202'!$B$6=\"\",\"\",'ASTM-C-1202'!$B$6)","v":"ASTM C 1202"},{"$f":"IF('ASTM-C-1202'!$C$58=\"\",\"\",'ASTM-C-1202'!$C$58)","v":"Cell No."},{"$f":"IF('ASTM-C-1202'!$C$55=\"\",\"\",'ASTM-C-1202'!$C$55)","v":"SET 3"},{"$f":"IF('ASTM-C-1202'!$G$56=\"\",\"\",'ASTM-C-1202'!$G$56)","v":2}]
[99,{"$f":"IF('ASTM-C-1202'!$I$58=\"\",\"\",'ASTM-C-1202'!$I$58)","v":""},{"$f":"IF('ASTM-C-1202'!$B$6=\"\",\"\",'ASTM-C-1202'!$B$6)","v":"ASTM C 1202"},{"$f":"IF('ASTM-C-1202'!$C$58=\"\",\"\",'ASTM-C-1202'!$C$58)","v":"Cell No."},{"$f":"IF('ASTM-C-1202'!$C$55=\"\",\"\",'ASTM-C-1202'!$C$55)","v":"SET 3"},{"$f":"IF('ASTM-C-1202'!$I$56=\"\",\"\",'ASTM-C-1202'!$I$56)","v":3}]
[100,{"$f":"IF('ASTM-C-1202'!$K$58=\"\",\"\",'ASTM-C-1202'!$K$58)","v":""},{"$f":"IF('ASTM-C-1202'!$B$6=\"\",\"\",'ASTM-C-1202'!$B$6)","v":"ASTM C 1202"},{"$f":"IF('ASTM-C-1202'!$C$58=\"\",\"\",'ASTM-C-1202'!$C$58)","v":"Cell No."},{"$f":"IF('ASTM-C-1202'!$C$55=\"\",\"\",'ASTM-C-1202'!$C$55)","v":"SET 3"},{"$f":"IF('ASTM-C-1202'!$K$56=\"\",\"\",'ASTM-C-1202'!$K$56)","v":4}]
[101,{"$f":"IF('ASTM-C-1202'!$E$59=\"\",\"\",'ASTM-C-1202'!$E$59)","v":""},{"$f":"IF('ASTM-C-1202'!$B$6=\"\",\"\",'ASTM-C-1202'!$B$6)","v":"ASTM C 1202"},{"$f":"IF('ASTM-C-1202'!$C$59=\"\",\"\",'ASTM-C-1202'!$C$59)","v":"Specimen ID"},{"$f":"IF('ASTM-C-1202'!$C$55=\"\",\"\",'ASTM-C-1202'!$C$55)","v":"SET 3"},{"$f":"IF('ASTM-C-1202'!$E$56=\"\",\"\",'ASTM-C-1202'!$E$56)","v":1}]
[102,{"$f":"IF('ASTM-C-1202'!$G$59=\"\",\"\",'ASTM-C-1202'!$G$59)","v":""},{"$f":"IF('ASTM-C-1202'!$B$6=\"\",\"\",'ASTM-C-1202'!$B$6)","v":"ASTM C 1202"},{"$f":"IF('ASTM-C-1202'!$C$59=\"\",\"\",'ASTM-C-1202'!$C$59)","v":"Specimen ID"},{"$f":"IF('ASTM-C-1202'!$C$55=\"\",\"\",'ASTM-C-1202'!$C$55)","v":"SET 3"},{"$f":"IF('ASTM-C-1202'!$G$56=\"\",\"\",'ASTM-C-1202'!$G$56)","v":2}]
[103,{"$f":"IF('ASTM-C-1202'!$I$59=\"\",\"\",'ASTM-C-1202'!$I$59)","v":""},{"$f":"IF('ASTM-C-1202'!$B$6=\"\",\"\",'ASTM-C-1202'!$B$6)","v":"ASTM C 1202"},{"$f":"IF('ASTM-C-1202'!$C$59=\"\",\"\",'ASTM-C-1202'!$C$59)","v":"Specimen ID"},{"$f":"IF('ASTM-C-1202'!$C$55=\"\",\"\",'ASTM-C-1202'!$C$55)","v":"SET 3"},{"$f":"IF('ASTM-C-1202'!$I$56=\"\",\"\",'ASTM-C-1202'!$I$56)","v":3}]
[104,{"$f":"IF('ASTM-C-1202'!$K$59=\"\",\"\",'ASTM-C-1202'!$K$59)","v":""},{"$f":"IF('ASTM-C-1202'!$B$6=\"\",\"\",'ASTM-C-1202'!$B$6)","v":"ASTM C 1202"},{"$f":"IF('ASTM-C-1202'!$C$59=\"\",\"\",'ASTM-C-1202'!$C$59)","v":"Specimen ID"},{"$f":"IF('ASTM-C-1202'!$C$55=\"\",\"\",'ASTM-C-1202'!$C$55)","v":"SET 3"},{"$f":"IF('ASTM-C-1202'!$K$56=\"\",\"\",'ASTM-C-1202'!$K$56)","v":4}]
[105,{"$f":"IF('ASTM-C-1202'!$E$60=\"\",\"\",'ASTM-C-1202'!$E$60)","v":""},{"$f":"IF('ASTM-C-1202'!$B$6=\"\",\"\",'ASTM-C-1202'!$B$6)","v":"ASTM C 1202"},{"$f":"IF('ASTM-C-1202'!$C$60=\"\",\"\",'ASTM-C-1202'!$C$60)","v":"Length (in.)"},{"$f":"IF('ASTM-C-1202'!$C$55=\"\",\"\",'ASTM-C-1202'!$C$55)","v":"SET 3"},{"$f":"IF('ASTM-C-1202'!$E$56=\"\",\"\",'ASTM-C-1202'!$E$56)","v":1}]
[106,{"$f":"IF('ASTM-C-1202'!$G$60=\"\",\"\",'ASTM-C-1202'!$G$60)","v":""},{"$f":"IF('ASTM-C-1202'!$B$6=\"\",\"\",'ASTM-C-1202'!$B$6)","v":"ASTM C 1202"},{"$f":"IF('ASTM-C-1202'!$C$60=\"\",\"\",'ASTM-C-1202'!$C$60)","v":"Length (in.)"},{"$f":"IF('ASTM-C-1202'!$C$55=\"\",\"\",'ASTM-C-1202'!$C$55)","v":"SET 3"},{"$f":"IF('ASTM-C-1202'!$G$56=\"\",\"\",'ASTM-C-1202'!$G$56)","v":2}]
[107,{"$f":"IF('ASTM-C-1202'!$I$60=\"\",\"\",'ASTM-C-1202'!$I$60)","v":""},{"$f":"IF('ASTM-C-1202'!$B$6=\"\",\"\",'ASTM-C-1202'!$B$6)","v":"ASTM C 1202"},{"$f":"IF('ASTM-C-1202'!$C$60=\"\",\"\",'ASTM-C-1202'!$C$60)","v":"Length (in.)"},{"$f":"IF('ASTM-C-1202'!$C$55=\"\",\"\",'ASTM-C-1202'!$C$55)","v":"SET 3"},{"$f":"IF('ASTM-C-1202'!$I$56=\"\",\"\",'ASTM-C-1202'!$I$56)","v":3}]
[108,{"$f":"IF('ASTM-C-1202'!$K$60=\"\",\"\",'ASTM-C-1202'!$K$60)","v":""},{"$f":"IF('ASTM-C-1202'!$B$6=\"\",\"\",'ASTM-C-1202'!$B$6)","v":"ASTM C 1202"},{"$f":"IF('ASTM-C-1202'!$C$60=\"\",\"\",'ASTM-C-1202'!$C$60)","v":"Length (in.)"},{"$f":"IF('ASTM-C-1202'!$C$55=\"\",\"\",'ASTM-C-1202'!$C$55)","v":"SET 3"},{"$f":"IF('ASTM-C-1202'!$K$56=\"\",\"\",'ASTM-C-1202'!$K$56)","v":4}]
[109,{"$f":"IF('ASTM-C-1202'!$E$61=\"\",\"\",'ASTM-C-1202'!$E$61)","v":""},{"$f":"IF('ASTM-C-1202'!$B$6=\"\",\"\",'ASTM-C-1202'!$B$6)","v":"ASTM C 1202"},{"$f":"IF('ASTM-C-1202'!$C$61=\"\",\"\",'ASTM-C-1202'!$C$61)","v":"Diameter (in.)"},{"$f":"IF('ASTM-C-1202'!$C$55=\"\",\"\",'ASTM-C-1202'!$C$55)","v":"SET 3"},{"$f":"IF('ASTM-C-1202'!$E$56=\"\",\"\",'ASTM-C-1202'!$E$56)","v":1}]
[110,{"$f":"IF('ASTM-C-1202'!$G$61=\"\",\"\",'ASTM-C-1202'!$G$61)","v":""},{"$f":"IF('ASTM-C-1202'!$B$6=\"\",\"\",'ASTM-C-1202'!$B$6)","v":"ASTM C 1202"},{"$f":"IF('ASTM-C-1202'!$C$61=\"\",\"\",'ASTM-C-1202'!$C$61)","v":"Diameter (in.)"},{"$f":"IF('ASTM-C-1202'!$C$55=\"\",\"\",'ASTM-C-1202'!$C$55)","v":"SET 3"},{"$f":"IF('ASTM-C-1202'!$G$56=\"\",\"\",'ASTM-C-1202'!$G$56)","v":2}]
[111,{"$f":"IF('ASTM-C-1202'!$I$61=\"\",\"\",'ASTM-C-1202'!$I$61)","v":""},{"$f":"IF('ASTM-C-1202'!$B$6=\"\",\"\",'ASTM-C-1202'!$B$6)","v":"ASTM C 1202"},{"$f":"IF('ASTM-C-1202'!$C$61=\"\",\"\",'ASTM-C-1202'!$C$61)","v":"Diameter (in.)"},{"$f":"IF('ASTM-C-1202'!$C$55=\"\",\"\",'ASTM-C-1202'!$C$55)","v":"SET 3"},{"$f":"IF('ASTM-C-1202'!$I$56=\"\",\"\",'ASTM-C-1202'!$I$56)","v":3}]
[112,{"$f":"IF('ASTM-C-1202'!$K$61=\"\",\"\",'ASTM-C-1202'!$K$61)","v":""},{"$f":"IF('ASTM-C-1202'!$B$6=\"\",\"\",'ASTM-C-1202'!$B$6)","v":"ASTM C 1202"},{"$f":"IF('ASTM-C-1202'!$C$61=\"\",\"\",'ASTM-C-1202'!$C$61)","v":"Diameter (in.)"},{"$f":"IF('ASTM-C-1202'!$C$55=\"\",\"\",'ASTM-C-1202'!$C$55)","v":"SET 3"},{"$f":"IF('ASTM-C-1202'!$K$56=\"\",\"\",'ASTM-C-1202'!$K$56)","v":4}]
[113,{"$f":"IF('ASTM-C-1202'!$D$65=\"\",\"\",'ASTM-C-1202'!$D$65)","v":""},{"$f":"IF('ASTM-C-1202'!$B$6=\"\",\"\",'ASTM-C-1202'!$B$6)","v":"ASTM C 1202"},{"$f":"IF('ASTM-C-1202'!$D$63=\"\",\"\",'ASTM-C-1202'!$D$63)","v":"Ambient Air Temp (°F)"},{"$f":"IF('ASTM-C-1202'!$C$63=\"\",\"\",'ASTM-C-1202'!$C$63)","v":"Time (min)"},{"$f":"IF('ASTM-C-1202'!$C$65=\"\",\"\",'ASTM-C-1202'!$C$65)","v":"0"}]
[114,{"$f":"IF('ASTM-C-1202'!$E$65=\"\",\"\",'ASTM-C-1202'!$E$65)","v":""},{"$f":"IF('ASTM-C-1202'!$B$6=\"\",\"\",'ASTM-C-1202'!$B$6)","v":"ASTM C 1202"},{"$f":"IF('ASTM-C-1202'!$C$63=\"\",\"\",'ASTM-C-1202'!$C$63)","v":"Time (min)"},{"$f":"IF('ASTM-C-1202'!$C$65=\"\",\"\",'ASTM-C-1202'!$C$65)","v":"0"}]
[115,{"$f":"IF('ASTM-C-1202'!$F$65=\"\",\"\",'ASTM-C-1202'!$F$65)","v":""},{"$f":"IF('ASTM-C-1202'!$B$6=\"\",\"\",'ASTM-C-1202'!$B$6)","v":"ASTM C 1202"},{"$f":"IF('ASTM-C-1202'!$C$63=\"\",\"\",'ASTM-C-1202'!$C$63)","v":"Time (min)"},{"$f":"IF('ASTM-C-1202'!$C$65=\"\",\"\",'ASTM-C-1202'!$C$65)","v":"0"}]
[116,{"$f":"IF('ASTM-C-1202'!$G$65=\"\",\"\",'ASTM-C-1202'!$G$65)","v":""},{"$f":"IF('ASTM-C-1202'!$B$6=\"\",\"\",'ASTM-C-1202'!$B$6)","v":"ASTM C 1202"},{"$f":"IF('ASTM-C-1202'!$C$63=\"\",\"\",'ASTM-C-1202'!$C$63)","v":"Time (min)"},{"$f":"IF('ASTM-C-1202'!$C$65=\"\",\"\",'ASTM-C-1202'!$C$65)","v":"0"}]
[117,{"$f":"IF('ASTM-C-1202'!$H$65=\"\",\"\",'ASTM-C-1202'!$H$65)","v":""},{"$f":"IF('ASTM-C-1202'!$B$6=\"\",\"\",'ASTM-C-1202'!$B$6)","v":"ASTM C 1202"},{"$f":"IF('ASTM-C-1202'!$C$63=\"\",\"\",'ASTM-C-1202'!$C$63)","v":"Time (min)"},{"$f":"IF('ASTM-C-1202'!$C$65=\"\",\"\",'ASTM-C-1202'!$C$65)","v":"0"}]
[118,{"$f":"IF('ASTM-C-1202'!$I$65=\"\",\"\",'ASTM-C-1202'!$I$65)","v":""},{"$f":"IF('ASTM-C-1202'!$B$6=\"\",\"\",'ASTM-C-1202'!$B$6)","v":"ASTM C 1202"},{"$f":"IF('ASTM-C-1202'!$C$63=\"\",\"\",'ASTM-C-1202'!$C$63)","v":"Time (min)"},{"$f":"IF('ASTM-C-1202'!$C$65=\"\",\"\",'ASTM-C-1202'!$C$65)","v":"0"}]
[119,{"$f":"IF('ASTM-C-1202'!$J$65=\"\",\"\",'ASTM-C-1202'!$J$65)","v":""},{"$f":"IF('ASTM-C-1202'!$B$6=\"\",\"\",'ASTM-C-1202'!$B$6)","v":"ASTM C 1202"},{"$f":"IF('ASTM-C-1202'!$C$63=\"\",\"\",'ASTM-C-1202'!$C$63)","v":"Time (min)"},{"$f":"IF('ASTM-C-1202'!$C$65=\"\",\"\",'ASTM-C-1202'!$C$65)","v":"0"}]
[120,{"$f":"IF('ASTM-C-1202'!$K$65=\"\",\"\",'ASTM-C-1202'!$K$65)","v":""},{"$f":"IF('ASTM-C-1202'!$B$6=\"\",\"\",'ASTM-C-1202'!$B$6)","v":"ASTM C 1202"},{"$f":"IF('ASTM-C-1202'!$C$63=\"\",\"\",'ASTM-C-1202'!$C$63)","v":"Time (min)"},{"$f":"IF('ASTM-C-1202'!$C$65=\"\",\"\",'ASTM-C-1202'!$C$65)","v":"0"}]
[121,{"$f":"IF('ASTM-C-1202'!$L$65=\"\",\"\",'ASTM-C-1202'!$L$65)","v":""},{"$f":"IF('ASTM-C-1202'!$B$6=\"\",\"\",'ASTM-C-1202'!$B$6)","v":"ASTM C 1202"},{"$f":"IF('ASTM-C-1202'!$C$63=\"\",\"\",'ASTM-C-1202'!$C$63)","v":"Time (min)"},{"$f":"IF('ASTM-C-1202'!$C$65=\"\",\"\",'ASTM-C-1202'!$C$65)","v":"0"}]
[122,{"$f":"IF('ASTM-C-1202'!$D$66=\"\",\"\",'ASTM-C-1202'!$D$66)","v":""},{"$f":"IF('ASTM-C-1202'!$B$6=\"\",\"\",'ASTM-C-1202'!$B$6)","v":"ASTM C 1202"},{"$f":"IF('ASTM-C-1202'!$D$63=\"\",\"\",'ASTM-C-1202'!$D$63)","v":"Ambient Air Temp (°F)"},{"$f":"IF('ASTM-C-1202'!$C$63=\"\",\"\",'ASTM-C-1202'!$C$63)","v":"Time (min)"},{"$f":"IF('ASTM-C-1202'!$C$66=\"\",\"\",'ASTM-C-1202'!$C$66)","v":360}]
[123,{"$f":"IF('ASTM-C-1202'!$E$66=\"\",\"\",'ASTM-C-1202'!$E$66)","v":""},{"$f":"IF('ASTM-C-1202'!$B$6=\"\",\"\",'ASTM-C-1202'!$B$6)","v":"ASTM C 1202"},{"$f":"IF('ASTM-C-1202'!$C$63=\"\",\"\",'ASTM-C-1202'!$C$63)","v":"Time (min)"},{"$f":"IF('ASTM-C-1202'!$C$66=\"\",\"\",'ASTM-C-1202'!$C$66)","v":360}]
[124,{"$f":"IF('ASTM-C-1202'!$F$66=\"\",\"\",'ASTM-C-1202'!$F$66)","v":""},{"$f":"IF('ASTM-C-1202'!$B$6=\"\",\"\",'ASTM-C-1202'!$B$6)","v":"ASTM C 1202"},{"$f":"IF('ASTM-C-1202'!$C$63=\"\",\"\",'ASTM-C-1202'!$C$63)","v":"Time (min)"},{"$f":"IF('ASTM-C-1202'!$C$66=\"\",\"\",'ASTM-C-1202'!$C$66)","v":360}]
[125,{"$f":"IF('ASTM-C-1202'!$G$66=\"\",\"\",'ASTM-C-1202'!$G$66)","v":""},{"$f":"IF('ASTM-C-1202'!$B$6=\"\",\"\",'ASTM-C-1202'!$B$6)","v":"ASTM C 1202"},{"$f":"IF('ASTM-C-1202'!$C$63=\"\",\"\",'ASTM-C-1202'!$C$63)","v":"Time (min)"},{"$f":"IF('ASTM-C-1202'!$C$66=\"\",\"\",'ASTM-C-1202'!$C$66)","v":360}]
[126,{"$f":"IF('ASTM-C-1202'!$H$66=\"\",\"\",'ASTM-C-1202'!$H$66)","v":""},{"$f":"IF('ASTM-C-1202'!$B$6=\"\",\"\",'ASTM-C-1202'!$B$6)","v":"ASTM C 1202"},{"$f":"IF('ASTM-C-1202'!$C$63=\"\",\"\",'ASTM-C-1202'!$C$63)","v":"Time (min)"},{"$f":"IF('ASTM-C-1202'!$C$66=\"\",\"\",'ASTM-C-1202'!$C$66)","v":360}]
[127,{"$f":"IF('ASTM-C-1202'!$I$66=\"\",\"\",'ASTM-C-1202'!$I$66)","v":""},{"$f":"IF('ASTM-C-1202'!$B$6=\"\",\"\",'ASTM-C-1202'!$B$6)","v":"ASTM C 1202"},{"$f":"IF('ASTM-C-1202'!$C$63=\"\",\"\",'ASTM-C-1202'!$C$63)","v":"Time (min)"},{"$f":"IF('ASTM-C-1202'!$C$66=\"\",\"\",'ASTM-C-1202'!$C$66)","v":360}]
[128,{"$f":"IF('ASTM-C-1202'!$J$66=\"\",\"\",'ASTM-C-1202'!$J$66)","v":""},{"$f":"IF('ASTM-C-1202'!$B$6=\"\",\"\",'ASTM-C-1202'!$B$6)","v":"ASTM C 1202"},{"$f":"IF('ASTM-C-1202'!$C$63=\"\",\"\",'ASTM-C-1202'!$C$63)","v":"Time (min)"},{"$f":"IF('ASTM-C-1202'!$C$66=\"\",\"\",'ASTM-C-1202'!$C$66)","v":360}]
[129,{"$f":"IF('ASTM-C-1202'!$K$66=\"\",\"\",'ASTM-C-1202'!$K$66)","v":""},{"$f":"IF('ASTM-C-1202'!$B$6=\"\",\"\",'ASTM-C-1202'!$B$6)","v":"ASTM C 1202"},{"$f":"IF('ASTM-C-1202'!$C$63=\"\",\"\",'ASTM-C-1202'!$C$63)","v":"Time (min)"},{"$f":"IF('ASTM-C-1202'!$C$66=\"\",\"\",'ASTM-C-1202'!$C$66)","v":360}]
[130,{"$f":"IF('ASTM-C-1202'!$L$66=\"\",\"\",'ASTM-C-1202'!$L$66)","v":""},{"$f":"IF('ASTM-C-1202'!$B$6=\"\",\"\",'ASTM-C-1202'!$B$6)","v":"ASTM C 1202"},{"$f":"IF('ASTM-C-1202'!$C$63=\"\",\"\",'ASTM-C-1202'!$C$63)","v":"Time (min)"},{"$f":"IF('ASTM-C-1202'!$C$66=\"\",\"\",'ASTM-C-1202'!$C$66)","v":360}]

{"sheet":"Revision","index":2,"n_rows":2,"n_cols":3,"rows_kept":2,"cut":false,"hidden":true,"merged":[]}
["Date","Changes","By"]
["2005-05-06","Correct SampleId,TestNumber,Status,County,SampleBy,AreaEngineer,Material Cell Merge and Name Range","Joe Liu"]

{"sheet":"Cell No.","index":3,"n_rows":13,"n_cols":5,"rows_kept":13,"cut":false,"hidden":true,"merged":[]}
["Cell No."]
["1-1"]
["1-2"]
["1-3"]
["1-4"]
["2-1"]
["2-2",null,null,null,"Notes"]
["2-3"]
["2-4",null,null,null,"Cells I21:J21, E23, F23:G23, J23, and K23 have conditional formatting. DO NOT DELETE."]
["3-1"]
["3-2",null,null,null,"Cell K21 has a hidden formula in it. DO NOT DELETE."]
["3-3"]
["3-4",null,null,null,"Cells O25:O37 has the cell no. in it for cell validation. DO NOT DELETE."]