{"text_format":"1","workbook":"xlsx","n_sheets":16,"sheets":["General","Project Summary","Water&Cement","Air&MixDesignOptions","Matl Properties","Optimized Gradation","Percent Retained","DryBatchWeights - Existing","DryBatchWeights - ACI211","Batch Weights","Trial Batch Results","DATA_Lists","DATA_Tables","RX","Internal Curing","DATA_Revisions"],"not_rendered":{"charts":3,"images":1,"macros":1,"external_links":0,"defined_names":767,"comments":0,"pivot_tables":0},"unopened":[{"sheet":"Percent Retained","index":6,"reason":"not_a_worksheet"}],"bounds":{"document_bytes":16777216,"sheet_cells":100000,"rows_first":2000,"rows_last":500,"rows_between":2000,"halvings":0,"cell_chars":16384,"cell_head_chars":4096},"cells_cut":0,"cells_raw":0,"read":"whole","date_system":"1900"}

{"sheet":"General","index":0,"n_rows":37,"n_cols":15,"rows_kept":37,"cut":false,"hidden":false,"merged":[[6,4,6,5],[6,8,6,11],[7,4,7,5],[7,8,7,11],[8,4,8,5],[8,8,8,11],[9,4,9,5],[9,8,9,11],[10,4,10,5],[10,8,10,11],[11,4,11,5],[11,8,11,11],[17,6,17,7],[19,3,19,4],[19,6,19,7],[12,4,12,5],[12,8,12,11],[13,4,13,11],[14,4,14,11],[15,4,15,5],[15,8,15,11],[23,1,24,12],[33,1,33,4],[33,7,33,12],[35,1,35,2],[37,1,37,4],[27,3,27,5],[29,3,29,5]]}
["TxDOT Manuals >"]
[null,"TEXAS DEPARTMENT OF TRANSPORTATION",null,null,null,null,null,null,null,null,null,null,null,"UPLC:",455]
[null,"2024 - HYDRAULIC CEMENT CONCRETE MIX DESIGN & CONTROL",null,null,null,null,null,null,null,null,null,null,null,"DLT:",1]
[]
[null,"General",null,null,null,null,null,null,null,null,null,null,null,"SN:","hccmxdes24.xlsm::45692.517778"]
[null,null,null,null,null,null,null,null,null,null,null,{"$f":"\"HCCMXDES24 :: File Version: \" & TEXT(MID(sn,SEARCH(\"::\",sn,1)+2,20),\"mm/dd/yy hh:mm:ss\")","v":"HCCMXDES24 :: File Version: 02/04/25 12:25:36"}]
[null,null,null,"SAMPLE ID:",null,null,null,"SAMPLED DATE:"]
[null,null,null,"TEST NUMBER:",null,null,null,"LETTING DATE:"]
[null,null,null,"SAMPLE STATUS:",null,null,null,"CONTROLLING CSJ:"]
[null,null,null,"COUNTY:","Lubbock",null,null,"SPEC YEAR:"]
[null,null,null,"SAMPLED BY:",null,null,null,"SPEC ITEM:"]
[null,null,null,"SAMPLE LOCATION:",null,null,null,"SPECIAL PROVISION:"]
[null,null,null,"MATERIAL CODE:",null,null,null,"CLASS:"]
[null,null,null,"MATERIAL NAME:"]
[null,null,null,"PRODUCER:","PB Materials"]
[null,null,null,"AREA ENGINEER:",null,null,null,"PROJECT MANAGER:"]
[]
[null,null,null,"COURSE\\LIFT:",null,"STATION:",null,null,null,null,"DIST. FROM CL:"]
[]
[null,null,"Plant:",null,null,"Design #:",null,null,null,"Date:"]
[]
[]
[null,"Remarks:",null,null,null,null,null,null,null,null,null,null,{"$f":"TODAY()","v":"2025-02-04"}]
[]
[]
[]
[]
[null,null,"Test Method:","Tested By:",null,null,"Tested Date:"]
[]
[null,null,"HCCMXDES24"]
[]
[]
[null,"Test Stamp Code:",null,null,null,"Omit Test:","Comp. Date:","Reviewed By:"]
[]
[null,"Locked By:",null,"TxDOT:","District:","Area:"]
[]
[null,"Authorized By:",null,null,null,"Authorized Date:"]

{"sheet":"Project Summary","index":1,"n_rows":46,"n_cols":10,"rows_kept":46,"cut":false,"hidden":false,"merged":[[17,1,17,4],[18,1,18,4],[15,1,15,4],[28,1,32,11],[7,7,17,11],[7,1,7,4],[20,1,20,4],[12,1,12,4],[14,1,14,4],[10,1,10,4],[8,1,8,4],[9,1,9,4],[11,1,11,4],[16,1,16,4],[25,1,25,11]]}
[null,null,null,null,null,null,null,null,null,1]
[null,"TEXAS DEPARTMENT OF TRANSPORTATION"]
[null,"HYDRAULIC CEMENT CONCRETE MIX DESIGN & CONTROL"]
[null,"Project Summary"]
[]
[null,null,0]
[null,"Project Summary",null,null,null,null,null,{"$f":"IF(AND(OR(Class=\"Class X (HPC)\", Class=\"Class X (SRC)\"), PlanClass<>\"\"), CONCATENATE(\"General Usage listed for \", PlanClass, \" concrete\"), IF(AND(OR(Class=\"Class X (HPC)\", Class=\"Class X (SRC)\"), PlanClass=\"\"), \"Select the concrete class listed on the plans\", CONCATENATE(\"General Usage listed for \", Class, \" concrete\")))","v":"General Usage listed for  concrete"}]
[null,"Concrete Class on Plans:",null,null,null,null,null,{"$f":"IF(Class=\"\", \"\", IF(AND(OR(Class=\"Class X (HPC)\", Class=\"Class X (SRC)\"), PlanClass=\"\"), \"\", IF(AND(OR(Class=\"Class X (HPC)\", Class=\"Class X (SRC)\"), PlanClass<>\"\"), VLOOKUP(VLOOKUP(PlanClass, DATA_Lists!A2:G14,1), DATA_Tables!D2:G14, 4), VLOOKUP(Class, DATA_Tables!D2:G14, 4))))","v":""}]
[null,"General Usage (Note 1):"]
[null,"Design Strength, Min. 28-day f'c (psi):",null,null,null,{"$f":"IF(AND(Class=\"\",PlanClass=\"\"),\"\",IF(OR(Class=\"Class X (HPC)\", Class=\"Class X (SRC)\"),IF(PlanClass<>\"\",IF(ISERROR(VLOOKUP(PlanClass, DATA_Tables!D2:E16,2)),\"\",VLOOKUP(PlanClass, DATA_Tables!D2:E16,2)),\"Choose a Plan Class\"),IF(Class<>\"\",IF(ISERROR(VLOOKUP(Class, DATA_Tables!D2:E16,2)),\"\",VLOOKUP(Class, DATA_Tables!D2:E16,2)))))","v":""}]
[null,"Specified Design Strength, Min. 28-day f'c (psi):"]
[null,"Max. W/C Ratio:",null,null,null,{"$f":"IF(Class=\"\",\"\",VLOOKUP(Class,DATA_Tables!D1:F16,3))","v":""}]
[null,"Optimized Gradation Design?:"]
[]
[null,"Acceptable Coarse Aggregate Grades:"]
[null,"Acceptable Cement Types:"]
[null,"Available Mix Design Options:"]
[null,"Acceptable Slump Range:",null,null,null,{"$f":"IF(GenUse=\"\",\"Choose a General Usage\",VLOOKUP(GenUse,DATA_Tables!A2:B35,2))","v":"Choose a General Usage"}]
[null,"Design Slump Range:"]
[]
[null,"Mix Design Input: "]
[null,null,null,null,"Internal Curing:"]
[]
[null,null,"Is this for CRCP?:",null,null,"Coarse Aggregate CoTE Value:",null,null,null,"Last Verified Date:"]
[]
[null,{"$f":"IF(ISBLANK(Field14),\"\",IF(Field14=\"No\",\"Coarse Aggregate CoTE not required\",IF(ISBLANK(Field13),\"Input coarse aggregate CoTE value\",IF(G24>5.5,\"Reported CoTE value is greater than allowed by Item 360\",IF(ISBLANK(Field12),\"Date CoTE value was last verified was not input\",IF(ISBLANK(ReviewedDate),IF(today-Field12>180,\"Coarse Aggregate CoTE needs to be re-verified against the latest CRSQC\",\"Reported Coarse Aggregate CoTE meets the requirements of Item 360\"),IF(ReviewedDate-Field12>180,\"Reported Coarse Aggregate CoTE was not  re-verified within  6 months of Reviewed Date\",\"Reported Coarse Aggregate CoTE meets the requirements of Item 360\")))))))","v":""}]
[]
[null,"Exceptions to Mix Design Options"]
[null,{"$f":"IF(Class=\"\",\"\",IF(OR(ISBLANK(SpecYear),SpecYear=2024),VLOOKUP(Class, DATA_Tables!D2:L16, 9),\"\"))","v":""}]
[]
[]
[]
[]
[]
[null,"Notes"]
[null,"1.    Some Concrete Classes may not be suitable for all applications."]
[null,"2.    Design strength must be attained within 56 days."]
[null,{"$f":"IF(GenUse=\"Drilled shafts\", \"3.    Do not use Grade 1 aggregate in drilled shafts.\", \"3.    Do not use Grade 1 coarse aggregate except in massive foundations with 4 in. minimum clear spacing, unless otherwise permitted.\")","v":"3.    Do not use Grade 1 coarse aggregate except in massive foundations with 4 in. minimum clear spacing, unless otherwise permitted."}]
[null,"4.    Use Grade 8 aggregate in extruded curbs unless otherwise approved."]
[null,"5.    Other grades of coarse aggregate maybe used in non-structural concrete classes when allowed by the Engineer."]
[null,"6.    Structural concrete classes."]
[null,"7.    Do not use Type IT cements containing >5% limestone."]
[null,"8.    As shown on the plans or specified."]
[null,"9.    \"X\" denotes class of concrete shown on the plans or specified."]
[null,{"$f":"IF(Class=\"Class X (SRC)\", \"10. (SRC): Sulfate Resistant Concrete.\", \"10. (HPC): High Performance Concrete.\")","v":"10. (HPC): High Performance Concrete."}]
[null,"11. Option 7 will be allowed for precast concrete products included in Items 462, 464, and 465."]

{"sheet":"Water&Cement","index":2,"n_rows":11,"n_cols":7,"rows_kept":11,"cut":false,"hidden":false,"merged":[[6,1,6,4],[10,6,10,7],[10,1,10,4],[8,1,8,4],[7,1,7,4],[9,1,9,4]]}
[]
[null,"TEXAS DEPARTMENT OF TRANSPORTATION"]
[null,"HYDRAULIC CEMENT CONCRETE MIX DESIGN & CONTROL"]
[null,"W/C and Cement Content"]
[]
[null,"W/C or W/CM"]
[null,"Max. w/c or w/cm based on concrete class:",null,null,null,{"$f":"IF(Class=\"\",\"Concrete Class not selected.\",IF(AND(Class=\"Class X (SRC)\",OR(CementType=\"Other\", CementType=\"Type I\", CementType=\"Type IL\", CementType=\"Type III\")),0.4,ClassMaxWC))","v":"Concrete Class not selected."}]
[null,"Specified max. w/c or w/cm if different from above*:"]
[null,"Mix design w/c or w/cm: ",null,null,null,{"$f":"IF(SpecMaxWC=\"\", MaxWC, SpecMaxWC)","v":"Concrete Class not selected."},{"$f":"IF(DesignWC>MaxWC, \"W/c exceeds maximum w/c\", \"\")","v":""}]
[null,{"$f":"IF(MDInput=\"\", \"Mix design input not selected.\", IF(MDInput=\"Existing design\", \"Cementitious material content if this is an exisiting design, (lb./cu.yd.)*:\", IF(MDInput=\"ACI 211 design process\", \"Max. cementitious material content if different from below, (lb./cu.yd.)*:\")))","v":"Mix design input not selected."}]
[null,"Mix design max. cementitious material content, (lb./cu.yd.):",null,null,null,{"$f":"IF(OR(Class=\"Class P\", AND(Class=\"Class X (HPC)\", PlanClass=\"Class P (HPC)\"), AND(Class=\"Class X (SRC)\", PlanClass=\"Class P (SRC)\")), IF(MaxCementDifferent=\"\", 520, MaxCementDifferent), IF(MaxCementDifferent=\"\", 700, MaxCementDifferent))","v":700},{"$f":"IF(Class=\"Class HES\", \"\", IF(DesignMaxCement>700, \"Engineer Approval Required!!!\", IF(AND(OR(Class=\"Class SS\", AND(Class=\"Class X (HPC)\", PlanClass=\"Class SS (HPC)\"), AND(Class=\"Class X (SRC)\", PlanClass=\"Class SS (SRC)\")), DesignMaxCement<658), \"Class SS minimum cement content is 658 lb./cu.yd.\", IF(AND(OR(Class=\"Class P\", AND(Class=\"Class X (HPC)\", PlanClass=\"Class P (HPC)\"), AND(Class=\"Class X (SRC)\", PlanClass=\"Class P (SRC)\")), DesignMaxCement>520), \"Engineer Approval Required!!!\", \"!!\"))))","v":"!!"}]

{"sheet":"Air&MixDesignOptions","index":3,"n_rows":39,"n_cols":10,"rows_kept":39,"cut":false,"hidden":false,"merged":[[13,1,13,4],[10,1,10,4],[9,1,9,4],[7,1,7,4],[6,1,6,4],[11,1,11,4],[24,1,24,4],[38,1,39,5],[37,1,37,5],[36,1,36,4],[35,1,35,4],[34,1,34,4],[36,5,36,10],[30,1,30,4],[28,1,28,4],[19,1,19,4],[33,1,33,4],[29,1,29,4],[8,1,8,4],[26,1,26,5],[17,1,17,4],[23,1,23,4],[27,1,27,4],[12,1,12,4],[31,1,31,5],[32,1,32,4],[18,1,18,5],[20,1,20,4],[21,1,21,4],[22,1,22,4],[25,1,25,4]]}
[null,null,null,null,null,null,null,null,null,18]
[null,"TEXAS DEPARTMENT OF TRANSPORTATION"]
[null,"HYDRAULIC CEMENT CONCRETE MIX DESIGN & CONTROL"]
[null,"Air Entrainment and Mix Design Options"]
[]
[null,"Air-Entrainment"]
[null,"Specified Air-Entrainment?:"]
[null,"Air-Entrainer Used?:"]
[null,"Specified total air content, (%):",null,null,null,{"$f":"IF(OR(ISBLANK(SpecYear),SpecYear=2024),IF(SpecAir=\"\",\"0.0\",IF(OR(Class=\"Class P\",PlanClass=\"Class P (HPC)\",PlanClass=\"Class P (SRC)\"),\"Minimum of 4.0\",IF(Field27>=5000,\"Minimum of 4.5\",\"Minimum of 5.5\"))),\"\")","v":"0.0"}]
[null,{"$f":"IF(AND(SpecAir=\"\", AirUsed=\"Yes\"), \"Contractor target air content, (%):\",\"Target entrained air content, (%):\")","v":"Target entrained air content, (%):"}]
[null,"Nominal maximum aggregate size from Project Summary, (in.):",null,null,null,{"$f":"IF(OptGrade=\"Yes\", \"Not Applicable\", IF(CoarseAgg=\"Choose a Concrete Class.\", \"Choose a Concrete Class.\",IF(AND(CoarseAgg=\"\", NOT(OR(Class=\"Class K\", Class=\"Class HES\", PlanClass=\"Class K\", PlanClass=\"Class HES\"))),\"Coarse Aggregate Grade not selected.\",  IF(ISERROR(VLOOKUP(CoarseAgg, DATA_Tables!D19:E26, 2)), \"As shown on the plans or specified.\", VLOOKUP(CoarseAgg, DATA_Tables!D19:E26, 2)))))","v":"Coarse Aggregate Grade not selected."}]
[null,"Nominal maximum aggregate size, (in.):",null,null,null,null,"<-- Required!"]
[null,"Approximate entrapped air content, (%):",null,null,null,{"$f":"IF(OR(AND(SpecAir=\"\",AirUsed=\"Yes\"),SpecAir=\"Yes\"),0,IF(AND(SpecAir=\"\",AirUsed=\"\"),IF(AND(NOT(ISBLANK(NMAS)), ISNUMBER(NMAS)), VLOOKUP(NMAS, DATA_Tables!G19:H24, 2), IF(ISNUMBER(PSAggSize),VLOOKUP(PSAggSize, DATA_Tables!G19:H24,2), 0))))","v":0}]
[null,"Entrapped air content different from above, (%):"]
[]
[]
[null,"Mix Design Option"]
[null,"Mix Design Option:",null,null,null,{"$f":"IF(MDOption=\"\",\"Mix design option not selected.\",IF(AND(MDOption=7,Class=\"Class X (SRC)\",OR(CementType=\"Other\",CementType=\"Type I\",CementType=\"Type IL\",CementType=\"Type III\")),\"Option 7 not allowed for SRC.\",IF(OR(MDOption=\"7 (Items 462, 464, 465 only)\", MDOption=\"7 (CIP Only)\"),7,IF(MDOption=\"6 (CIP Only)\",6,IF(MDOption=\"8 (CIP Only)\",8,MDOption)))))","v":"Mix design option not selected."},{"$f":"COUNT(SCMInput)","v":0}]
[null,"No mix design requirements."]
[null,{"$f":"IF(OR(ISBLANK(SpecYear),SpecYear=2024),\"Coal ash,(% cement replaced):\",\"\")","v":"Coal ash,(% cement replaced):"},null,null,null,null,{"$f":"IF(OR(ISBLANK(SpecYear),SpecYear=2024),\"Coal Ash MPL\",\"\")","v":"Coal Ash MPL"}]
[null,{"$f":"IF(OR(ISBLANK(SpecYear),SpecYear=2024),\"Natural Pozzolan, (% cement replaced):\",\"\")","v":"Natural Pozzolan, (% cement replaced):"},null,null,null,null,{"$f":"IF(OR(ISBLANK(SpecYear), SpecYear=2024), \"Natural Pozzolan MPL\", \"\")","v":"Natural Pozzolan MPL"}]
[null,"Slag cement, (% cement replaced):"]
[null,"Historical, no entry"]
[null,"Historical, no entry"]
[null,"Historical, no entry"]
[null,"Silica Fume, (% cement replaced):"]
[null,"Lithium dosage testing required. See Tex-471-A."]
[null,"Max. Na2Oeq in cement (%)*:"]
[null,"Limestone content of cement (%)*:"]
[null,"Max. Allowable Alkali Loading,\n(lb./cu.yd.):",null,null,null,{"$f":"IF(AND(OR(ISBLANK(SpecYear),SpecYear=2024),OR(Class=\"Class A\",Class=\"Class B\",Class=\"Class E\",Class=\"Class SS\")),4,3.5)","v":3.5}]
[null,"Total Alkalis - max. design cement content, (lb./cu.yd.):",null,null,null,{"$f":"IF(CementAlkali=\"\",\"\",IF(CementType=\"Type IL\",ROUND(((100-LimestonePerc)/100)*CementAlkali*MaxCementDifferent/100,1),ROUND((CementAlkali*MaxCementDifferent/100),1)))","v":""},{"$f":"IF(F31=\"\",\"\",IF(F31>F30,\"Exceeds max. allowable alkali loading\",\"\"))","v":""}]
[null,"ASTM C 1260, C 1567, C 1293 testing required."]
[null,"Fine Agg. ASTM C 1260 Expansion, (%):"]
[null,"Coarse Agg. ASTM C 1260 Expansion, (%):"]
[null,"Coarse Agg. ASTM C 1293 Expansion, (%):"]
[null,"Testing Requirements or Prescriptive Mix Design Options?:"]
[null,{"$f":"IF(TestOrRx=\"\", \"\", CONCATENATE(Field52, \":\"))","v":""},null,null,null,{"$f":"IF(OR(ISBLANK(Fine1260), ISBLANK(Coarse1260), ISBLANK(Field52)), \"\", IF(AND(Fine1260>0.1, Coarse1260>0.1, OR(ISBLANK(Coarse1293), Coarse1293<>\"\")), IF(Field52=\"Testing Requirements\", DATA_Lists!D19, DATA_Lists!D24), IF(AND(Fine1260<=0.1, Coarse1260<=0.1, OR(ISBLANK(Coarse1293), Coarse1293>0.04)), IF(Field52=\"Prescriptive Mix Design\", DATA_Lists!D25, \"Must choose Prescriptive Mix Design.\"), IF(AND(Fine1260<=0.1, OR(ISBLANK(Coarse1260), Coarse1260<>\"\"), AND(Coarse1293<>\"\", Coarse1293<=0.04)), IF(Field52=\"Prescriptive Mix Design\", DATA_Lists!D26, \"Must choose Prescriptive Mix Design.\"), IF(AND(Field49<=0.1, Coarse1260>0.1, OR(ISBLANK(Coarse1293), Coarse1293<>\"\")), IF(Field52=\"Prescriptive Mix Design\", DATA_Lists!D24, DATA_Lists!D20), IF(AND(Field49>0.1, Coarse1260<=0.1, OR(ISBLANK(Coarse1293), Coarse1293>0.04)), IF(Field52=\"Prescriptive Mix Design\", DATA_Lists!D25, \"Must choose Prescriptive Mix Design.\"), IF(AND(Field49>0.1, OR(ISBLANK(Coarse1260), Coarse1260<>\"\"), Coarse1293<=0.04), IF(Field52=\"Prescriptive Mix Design\", DATA_Lists!D24, DATA_Lists!D21))))))))","v":""}]
[null,{"$f":"IF(MDO=3,IF(SUM(CAsh,FAsh)>35,IF(AND(Class=\"Class X (HPC)\",SUM(CAsh,FAsh)>50),IF(OR(SF<3,SF>10),\"Fly ash and silica fume contents are outside of the acceptable range.\",\"Fly ash content is outside of the acceptable range\"),IF(OR(SF<3,SF>10),\"Silica fume content is outside of the acceptable range.\",\"\")),IF(AND(SF<3,SF>10),\"Silica fume content is outside of acceptable range.\",\"\")),\"\")","v":""},null,null,null,null,{"$f":"IF(MDO=3,IF(OR(ISBLANK(SpecYear),SpecYear=2024),IF(SUM(CAsh, FAsh, Slag, SF)>=35,IF(SUM(CAsh, FAsh, Slag, SF)<=50,IF(AND(SF>=3,SF<=10),\"\",\"Silica fume content is out of range.\"),IF(SUM(CAsh, FAsh, Slag, SF)<=70,IF(AND(SF>=3,SF<=10),\"SCM content is appropriate for mass concrete design.\",\"Silica fume content is out of range for mass concrete design.\"),\"SCM content exceeds allowable for mass content design.\")),\"SCM content does not meet required minimum replacement.\"),\"\"),\"\")","v":""}]
[null,"Mix design option not selected."]

{"sheet":"Matl Properties","index":4,"n_rows":30,"n_cols":20,"rows_kept":30,"cut":false,"hidden":false,"merged":[[6,16,13,19],[5,1,5,9],[25,1,25,3],[24,1,24,3],[23,1,23,3],[22,1,22,3],[21,1,21,3],[18,1,18,3],[17,1,17,3],[16,1,16,3],[15,1,15,4],[7,1,7,3],[6,1,6,3],[13,8,13,9],[12,8,12,9],[11,8,11,9],[10,8,10,9],[9,8,9,9],[8,8,8,9],[7,8,7,9],[6,8,6,9],[12,1,12,3],[11,1,11,3],[10,1,10,3],[9,1,9,3],[8,1,8,3],[6,4,6,5],[6,6,6,7],[19,0,24,0],[24,4,24,5],[23,4,23,5],[22,4,22,5],[15,12,15,15],[16,12,16,14],[13,1,13,3],[16,4,16,5],[16,6,16,7],[21,8,21,9],[18,8,18,9],[17,8,17,9],[16,8,16,9],[13,6,13,7],[18,4,18,5],[17,4,17,5],[24,6,24,7],[23,6,23,7],[22,6,22,7],[21,6,21,7],[18,6,18,7],[17,6,17,7],[18,13,18,14],[17,13,17,14],[29,1,29,2],[29,7,29,8],[30,1,30,2],[30,7,30,8],[27,1,27,4],[28,1,28,2],[25,4,25,5],[25,13,25,14],[30,5,30,6],[30,3,30,4],[29,3,29,4],[29,5,29,6],[28,5,28,6],[25,6,25,7],[28,7,28,8],[28,3,28,4],[19,8,19,9],[19,6,19,7],[19,1,19,3],[25,8,25,9],[12,6,12,7],[11,6,11,7],[10,6,10,7],[9,6,9,7],[8,6,8,7],[7,6,7,7],[13,4,13,5],[12,4,12,5],[11,4,11,5],[10,4,10,5],[9,4,9,5],[8,4,8,5],[7,4,7,5],[16,17,16,18],[16,15,16,16],[17,17,17,18],[18,17,18,18],[19,17,19,18],[24,13,24,14],[23,13,23,14],[22,13,22,14],[21,13,21,14],[20,13,20,14],[18,15,18,16],[17,15,17,16],[25,17,25,18],[25,15,25,16],[24,15,24,16],[23,15,23,16],[22,15,22,16],[20,17,20,18],[21,17,21,18],[22,17,22,18],[23,17,23,18],[24,17,24,18],[20,1,20,3],[24,8,24,9],[23,8,23,9],[22,8,22,9],[21,15,21,16],[20,15,20,16],[19,15,19,16],[19,13,19,14],[21,4,21,5],[19,4,19,5],[20,8,20,9],[20,6,20,7],[20,4,20,5]]}
[null,null,null,null,null,null,null,null,null,10]
[null,"TEXAS DEPARTMENT OF TRANSPORTATION"]
[null,"HYDRAULIC CEMENT CONCRETE MIX DESIGN & CONTROL"]
[null,"Material Properties"]
[]
[null,"Aggregate Properties (from laboratory testing)"]
[null,null,null,null,"Producer*",null,"Pit*",null,"Grade*",null,"Specific Gravity (SSD)*","Rodded Unit Weight (UDRY)*","Fineness Modulus (FM)*","Absorption (%)*","Unit Weight (SSD)",null,"Note: Columns labeled with an astrick (*) are required for proper mixture design viewing and calculations"]
[null,"Test Method",null,null,null,null,null,null,null,null,"Tex-403-A","Tex-404-A","Tex-402-A","Tex-403-A"]
[null,"Coarse Aggregate 1:",null,null,null,null,null,null,null,null,null,null,null,null,{"$f":"IF(ISBLANK(L9), \"\", ROUND(L9*(1+N9/100),2))","v":""}]
[null,"Coarse Aggregate 2:",null,null,null,null,null,null,null,null,null,null,null,null,{"$f":"IF(ISBLANK(L10), \"\", ROUND(L10*(1+N10/100),2))","v":""}]
[null,"Intermediate Aggregate 1:",null,null,null,null,null,null,null,null,null,null,null,null,""]
[null,"Intermediate Aggregate 2:",null,null,null,null,null,null,null,null,null,null,null,null,""]
[null,"Fine Aggregate 1:"]
[null,{"$f":"IF(Field24=\"Yes\", \"Lightweight Aggregate:\", \"Fine Aggregate 2:\")","v":"Fine Aggregate 2:"}]
[]
[null,"Cementitious Materials",null,null,null,null,null,null,null,null,null,null,"Chemical Admixtures"]
[null,null,null,null,"Producer*",null,"Plant/Name*",null,"Type/Class/Grade*",null,"Specific Gravity*",null,null,null,null,"Producer*",null,"Name*",null,"% Solids*"]
[null,"Hydraulic cement",null,null,null,null,null,null,null,null,null,null,"Admix 1:"]
[null,null,null,null,null,null,null,null,{"$f":"IF(B19=\"Fly Ash - C\", \"Class C\", IF(B19=\"Fly Ash - F\", \"Class F\", \"\"))","v":""},null,null,null,"Admix 2:"]
[null,null,null,null,null,null,null,null,{"$f":"IF(B20=\"Fly Ash - C\", \"Class C\", IF(B20=\"Fly Ash - F\", \"Class F\", \"\"))","v":""},null,null,null,"Admix 3:"]
[null,null,null,null,null,null,null,null,"",null,null,null,"Admix 4:"]
[null,null,null,null,null,null,null,null,"",null,null,null,"Admix 5:"]
[null,null,null,null,null,null,null,null,"",null,null,null,"Admix 6:"]
[null,null,null,null,null,null,null,null,"",null,null,null,"Admix 7:"]
[null,null,null,null,null,null,null,null,"",null,null,null,"Admix 8:"]
[null,null,null,null,null,null,null,null,"",null,null,null,"Admix9:"]
[]
[null,"Other Materials"]
[null,null,null,"Producer*",null,"Name*",null,"Specific Gravity*"]
[null,"Fibers"]

{"sheet":"Optimized Gradation","index":5,"n_rows":33,"n_cols":17,"rows_kept":33,"cut":false,"hidden":true,"merged":[[7,1,7,11],[32,3,32,8],[31,3,31,8],[30,3,30,8],[26,3,29,8],[24,1,24,2]]}
[]
[null,"TEXAS DEPARTMENT OF TRANSPORTATION"]
[]
[]
[null,"HYDRAULIC CEMENT CONCRETE MIX DESIGN & CONTROL"]
[null,"Optimized Gradation"]
[]
[null,"Sieve Analysis"]
[null,"Sieve Size","Sieve Size (in)","Coarse Agg. 1\n% Passing","Coarse Agg. 2\n% Passing","Intermediate Agg. 1\n% Passing","Intermediate Agg. 2\n% Passing","Fine Agg. 1 % Passing","Fine Agg. 2 % Passing","Combined % Passing","Combined Cumulative % Retained","Combined % Retained","Within Gradation Limits?",null,"Percent Retained Chart"]
[null,"2 1/2 in",2.5,null,null,null,null,null,null,{"$f":"IF(ISERROR(D10*$D$25+E10*$E$25+F10*$F$25+G10*$G$25+H10*$H$25+I10*$I$25),\"\",ROUND((D10*$D$25+E10*$E$25+F10*$F$25+G10*$G$25+H10*$H$25+I10*$I$25),1))","v":0},{"$f":"IF(ISERROR(100-J10),\"\",100-J10)","v":100},{"$f":"K10","v":100},{"$f":"IF(AND(L10<=P10, L10>=Q10), \"Yes\", \"No\")","v":"No"},null,"2 1/2 in"]
[null,"2 in",2,null,null,null,null,null,null,{"$f":"IF(ISERROR(D11*$D$25+E11*$E$25+F11*$F$25+G11*$G$25+H11*$H$25+I11*$I$25),\"\",ROUND((D11*$D$25+E11*$E$25+F11*$F$25+G11*$G$25+H11*$H$25+I11*$I$25),1))","v":0},100,{"$f":"IF(ISERROR(K11-K10),\"\",K11-K10)","v":0},{"$f":"IF(AND(L11<=P11, L11>=Q11), \"Yes\", \"No\")","v":"Yes"},null,"2 in"]
[null,"1 1/2 in",1.5,null,null,null,null,null,null,0,100,0,"Yes",null,"1 1/2 in",3]
[null,"1 in",1,null,null,null,null,null,null,0,100,0,"Yes",null,"1 in",16]
[null,"3/4 in",0.75,null,null,null,null,null,null,0,100,0,"Yes",null,"3/4 in",20,0]
[null,"1/2 in",0.5,null,null,null,null,null,null,0,100,0,"No",null,"1/2 in",20,4]
[null,"3/8 in",0.375,null,null,null,null,null,null,0,100,0,"No",null,"3/8 in",20,4]
[null,"No. 4",0.187,null,null,null,null,null,null,0,100,0,"No",null,"No. 4",20,4]
[null,"No. 8",9.2999999999999999E-2,null,null,null,null,null,null,0,100,0,"Yes",null,"No. 8",12,0]
[null,"No. 16",4.65E-2,null,null,null,null,null,null,0,100,0,"Yes",null,"No. 16",12,0]
[null,"No. 30",2.4E-2,null,null,null,null,null,null,0,100,0,"No",null,"No. 30",20,4]
[null,"No. 50",1.2E-2,null,null,null,null,null,null,0,100,0,"No",null,"No. 50",20,4]
[null,"No. 100",6.0000000000000001E-3,null,null,null,null,null,null,0,100,0,"Yes",null,"No. 100",10,0]
[null,"No. 200",3.0000000000000001E-3,null,null,null,null,null,null,0,100,0,"Yes",null,"No. 200",2]
[null,"Pan",0,null,null,null,null,null,null,0,100,0,"Yes",null,"Pan"]
[null,"Percent  of Total Agg.",null,null,null,null,null,null,null,{"$f":"ROUND(SUM(D25:I25),4)","v":0},{"$f":"IF(AND(OR(J25>1, J25<1), J25<>0),\"<-- WARNING! Check aggregate percentages\", \"\")","v":""}]
[]
[null,null,null,{"$f":"IF(AND(N33=\"True\", O33=\"True\", P33=\"True\"), \"This Optimized Gradation meets the requirements of Tex-470-A.\", \"This Optimized Gradation DOES NOT meet the requirements of Tex-470-A.\")","v":"This Optimized Gradation DOES NOT meet the requirements of Tex-470-A."},null,null,null,null,null,null,null,null,"Click buttons below to view larger chart:"]
[]
[]
[]
[null,null,null,"Check Gradation"]
[null,null,null,{"$f":"CONCATENATE(\"Check Sum of Sieves No. 8 - No. 30: >15% required, Current value = \", ROUND(SUM(L18:L20),1))","v":"Check Sum of Sieves No. 8 - No. 30: >15% required, Current value = 0"},null,null,null,null,null,null,null,null,null,"Gradation Check","Sum No.8 - No. 30","Sum No. 30 - No. 200"]
[null,null,null,{"$f":"CONCATENATE(\"Check Sum of Sieves No. 30 - No. 200: between 24% and 34% required, Current value = \", ROUND(SUM(L20:L23),1))","v":"Check Sum of Sieves No. 30 - No. 200: between 24% and 34% required, Current value = 0"},null,null,null,null,null,null,null,null,null,{"$f":"IF(AND(M10=\"Yes\", M11=\"Yes\", M12=\"Yes\", M13=\"Yes\", M14=\"Yes\", M15=\"Yes\", M16=\"Yes\", M17=\"Yes\", M18=\"Yes\", M19=\"Yes\", M20=\"Yes\", M21=\"Yes\", M22=\"Yes\", M23=\"Yes\"), \"True\", \"False\")","v":"False"},{"$f":"IF(SUM(L18:L20)>15, \"True\", \"False\")","v":"False"},{"$f":"IF(AND(SUM(L20:L23)>=24, SUM(L20:L23)<=34), \"True\", \"False\")","v":"False"}]

{"sheet":"DryBatchWeights - Existing","index":7,"n_rows":54,"n_cols":12,"rows_kept":54,"cut":false,"hidden":true,"merged":[[53,1,53,10],[52,1,52,10],[49,8,49,9],[49,6,49,7],[50,1,51,10],[23,8,23,9],[24,8,24,9],[25,8,25,9],[45,8,45,9],[46,8,46,9],[47,8,47,9],[27,8,27,9],[27,5,27,6],[27,2,27,3],[39,8,39,9],[40,8,40,9],[41,8,41,9],[42,8,42,9],[43,8,43,9],[44,8,44,9],[33,8,33,9],[34,8,34,9],[43,2,43,3],[44,2,44,3],[47,5,47,6],[46,2,46,3],[47,2,47,3],[14,8,14,9],[15,8,15,9],[16,8,16,9],[17,8,17,9],[18,8,18,9],[19,8,19,9],[44,5,44,6],[45,5,45,6],[46,5,46,6],[41,5,41,6],[42,5,42,6],[43,5,43,6],[22,5,22,6],[23,5,23,6],[24,5,24,6],[26,8,26,9],[28,8,28,9],[35,8,35,9],[29,8,29,9],[30,8,30,9],[31,8,31,9],[13,5,13,6],[14,5,14,6],[15,5,15,6],[16,5,16,6],[45,2,45,3],[41,2,41,3],[42,2,42,3],[8,8,8,9],[9,8,9,9],[10,8,10,9],[11,8,11,9],[12,8,12,9],[13,8,13,9],[17,5,17,6],[18,5,18,6],[19,5,19,6],[37,8,37,9],[38,8,38,9],[38,5,38,6],[32,8,32,9],[20,8,20,9],[39,5,39,6],[40,5,40,6],[32,5,32,6],[40,2,40,3],[33,5,33,6],[34,5,34,6],[35,5,35,6],[36,5,36,6],[37,5,37,6],[25,5,25,6],[26,5,26,6],[28,5,28,6],[29,5,29,6],[30,5,30,6],[31,5,31,6],[35,2,35,3],[21,5,21,6],[36,8,36,9],[21,8,21,9],[22,8,22,9],[20,5,20,6],[41,1,47,1],[7,2,7,3],[7,5,7,6],[7,8,7,9],[8,2,8,3],[9,2,9,3],[10,2,10,3],[11,2,11,3],[12,2,12,3],[13,2,13,3],[8,5,8,6],[9,5,9,6],[10,5,10,6],[11,5,11,6],[12,5,12,6],[37,2,37,3],[38,2,38,3],[22,2,22,3],[39,2,39,3],[23,2,23,3],[31,2,31,3],[8,1,28,1],[29,1,31,1],[32,1,33,1],[34,1,40,1],[14,2,14,3],[15,2,15,3],[16,2,16,3],[17,2,17,3],[36,2,36,3],[24,2,24,3],[25,2,25,3],[26,2,26,3],[28,2,28,3],[29,2,29,3],[30,2,30,3],[18,2,18,3],[19,2,19,3],[20,2,20,3],[32,2,32,3],[33,2,33,3],[34,2,34,3],[21,2,21,3]]}
[]
[null,"TEXAS DEPARTMENT OF TRANSPORTATION"]
[]
[]
[null,"HYDRAULIC CEMENT CONCRETE MIX DESIGN & CONTROL"]
[null,"Dry Batch Weights - Existing"]
[]
[null,null,"Mix Component",null,"Type/Class/Grade","Producer/Source",null,"% of Dosage*","Absolute Vol. (ft3)",null,"SSD Weight (lbs/CY)"]
[null,"Paste","Basic Water Demand:",null,null,null,null,null,{"$f":"WaterSSDED/62.4","v":0},null,null,{"$f":"IF(ISERROR(ROUND(SUM(K20:K28,WaterSSDED)/TotCemSSDED, 2)), \"\", IF(ROUND((SUM(K20:K28, WaterSSDED))/TotCemSSDED, 2)>MaxWC, \"w/cm exceeds maximum w/cm\", IF(NOT(ISBLANK(SpecMaxWC)),IF(ROUND(SUM(K20:K28,WaterSSDED)/TotCemSSDED,2)>SpecMaxWC,\"w/cm exceeds target w/cm\",\"\"),\"\")))","v":""}]
[null,null,"Total Cementitious:",null,null,null,null,{"$f":"IF(AND(ISBLANK(K9), ISBLANK(K11)), \"\", CONCATENATE(\"W/CM= \",ROUND((K9+SUM(K20:K28))/K10,2)))","v":""},{"$f":"SUM(SCMVolED)","v":0},null,{"$f":"SUM(SCMSSDED)","v":0}]
[null,null,"Hydraulic cement:",null,{"$f":"IF(ISBLANK('Matl Properties'!I18), \"\", 'Matl Properties'!I18)","v":""},{"$f":"IF(AND(ISBLANK(HC1Prod), ISBLANK(HC1Plant)), \"\", CONCATENATE(HC1Prod,\"/\",HC1Plant))","v":""},null,{"$f":"IF(ISBLANK(K11), \"\", ROUND(K11*100/$K$10,0))","v":""},{"$f":"IF(ISBLANK(HC1SG), \"\", K11/(HC1SG*62.4))","v":""}]
[null,null,{"$f":"IF(ISBLANK(Cementitious2), \"\", CONCATENATE(Cementitious2,\":\"))","v":""},null,{"$f":"IF(ISBLANK(Cementitious2),\"\",Cementitious2)","v":""},{"$f":"IF(AND(ISBLANK(SCM2Prod), ISBLANK(SCM2Plant)), \"\", CONCATENATE(SCM2Prod,\"/\",SCM2Plant))","v":""},null,{"$f":"IF(ISBLANK(K12), \"\", ROUND(K12*100/$K$10,0))","v":""},{"$f":"IF(ISBLANK(SCM2SG), \"\", K12/(SCM2SG*62.4))","v":""}]
[null,null,{"$f":"IF(ISBLANK(Cementitious3), \"\", CONCATENATE(Cementitious3,\":\"))","v":""},null,{"$f":"IF(ISBLANK(Cementitious3),\"\",Cementitious3)","v":""},{"$f":"IF(AND(ISBLANK(SCM3Prod), ISBLANK(SCM3Plant)), \"\", CONCATENATE(SCM3Prod,\"/\",SCM3Plant))","v":""},null,"",{"$f":"IF(ISBLANK(SCM3SG), \"\", K13/(SCM3SG*62.4))","v":""}]
[null,null,{"$f":"IF(ISBLANK(Cementitious4), \"\", CONCATENATE(Cementitious4,\":\"))","v":""},null,{"$f":"IF(ISBLANK(Cementitious4),\"\",Cementitious4)","v":""},{"$f":"IF(AND(ISBLANK(SCM4Prod), ISBLANK(SCM4Plant)), \"\", CONCATENATE(SCM4Prod,\"/\",SCM4Plant))","v":""},null,"",{"$f":"IF(ISBLANK(SCM4SG), \"\", K14/(SCM4SG*62.4))","v":""}]
[null,null,{"$f":"IF(ISBLANK(Cementitious5), \"\", CONCATENATE(Cementitious5,\":\"))","v":""},null,{"$f":"IF(ISBLANK(Cementitious5),\"\",Cementitious5)","v":""},{"$f":"IF(AND(ISBLANK(SCM5Prod), ISBLANK(SCM5Plant)), \"\", CONCATENATE(SCM5Prod,\"/\",SCM5Plant))","v":""},null,"",{"$f":"IF(ISBLANK(SCM5SG), \"\", K15/(SCM5SG*62.4))","v":""}]
[null,null,{"$f":"IF(ISBLANK(Cementitious6), \"\", CONCATENATE(Cementitious6,\":\"))","v":""},null,{"$f":"IF(ISBLANK(Cementitious6),\"\",Cementitious6)","v":""},{"$f":"IF(AND(ISBLANK(SCM6Prod), ISBLANK(SCM6Plant)), \"\",CONCATENATE(SCM6Prod,\"/\",SCM6Plant))","v":""},null,"",{"$f":"IF(ISBLANK(SCM6SG), \"\", K16/(SCM6SG*62.4))","v":""}]
[null,null,{"$f":"IF(ISBLANK(Cementitious7), \"\", CONCATENATE(Cementitious7,\":\"))","v":""},null,{"$f":"IF(ISBLANK(Cementitious7),\"\",Cementitious7)","v":""},{"$f":"IF(AND(ISBLANK(SCM7Prod), ISBLANK(SCM7Plant)), \"\", CONCATENATE(SCM7Prod,\"/\",scm7palnt))","v":""},null,"",{"$f":"IF(ISBLANK(SCM7SG), \"\", K17/(SCM7SG*62.4))","v":""},null,null,{"$f":"IF(ISBLANK(Cementitious7), \"\", Cementitious7)","v":""}]
[null,null,{"$f":"IF(ISBLANK(Cementitious8), \"\", CONCATENATE(Cementitious8,\":\"))","v":""},null,{"$f":"IF(ISBLANK(Cementitious8),\"\",Cementitious8)","v":""},{"$f":"IF(AND(ISBLANK(SCM8Prod), ISBLANK(SCM8Plant)), \"\", CONCATENATE(SCM8Prod,\"/\",SCM8Plant))","v":""},null,"",{"$f":"IF(ISBLANK(SCM8SG), \"\", K18/(SCM8SG*62.4))","v":""},null,null,{"$f":"IF(ISBLANK(Cementitious8), \"\", Cementitious8)","v":""}]
[null,null,{"$f":"IF(ISBLANK(Cementitious9), \"\", CONCATENATE(Cementitious9, \":\"))","v":""},null,{"$f":"IF(ISBLANK(Cementitious9),\"\",Cementitious9)","v":""},{"$f":"IF(AND(ISBLANK(SCM9Prod), ISBLANK(SCM9Plant)), \"\",CONCATENATE(SCM9Prod,\"/\",SCM9Plant))","v":""},null,"",{"$f":"IF(ISBLANK(SCM9SG), \"\", K19/(SCM9SG*62.4))","v":""},null,null,{"$f":"IF(ISBLANK(Cementitious9), \"\", Cementitious9)","v":""}]
[null,null,{"$f":"IF(ISBLANK(Admix1), \"\", CONCATENATE(Admix1, \":\"))","v":""},null,{"$f":"IF(ISBLANK(Admix1), \"\", IF(VLOOKUP(Admix1, DATA_Tables!D29:E36, 2)<>0,VLOOKUP(Admix1, DATA_Tables!D29:E36, 2), \"\"))","v":""},{"$f":"IF(AND(ISBLANK(Admix1Prod), ISBLANK(Admix1Name)), \"\", CONCATENATE(Admix1Prod,\"/\",Admix1Name))","v":""},null,null,{"$f":"IF(ISBLANK(H20),\"\",(H20*$K$10/100)*0.00104437934)","v":""},null,{"$f":"IF(ISBLANK(H20),\"\",(I20*62.4*(1-(Admix1Sol/100))))","v":""}]
[null,null,{"$f":"IF(ISBLANK(Admix2), \"\", CONCATENATE(Admix2, \":\"))","v":""},null,{"$f":"IF(ISBLANK(Admix2), \"\", IF(VLOOKUP(Admix2, DATA_Tables!D29:E36, 2)<>0,VLOOKUP(Admix2, DATA_Tables!D29:E36, 2), \"\"))","v":""},{"$f":"IF(AND(ISBLANK(Admix2Prod), ISBLANK(Admix2Name)), \"\", CONCATENATE(Admix2Prod,\"/\",Admix2Name))","v":""},null,null,{"$f":"IF(ISBLANK(H21),\"\",(H21*$K$10/100)*0.00104437934)","v":""},null,{"$f":"IF(ISBLANK(H21),\"\",(I21*62.4*(1-(Admix2Sol/100))))","v":""}]
[null,null,{"$f":"IF(ISBLANK(Admix3), \"\", CONCATENATE(Admix3,\":\"))","v":""},null,{"$f":"IF(ISBLANK(Admix3), \"\", IF(VLOOKUP(Admix3, DATA_Tables!D29:E36, 2)<>0,VLOOKUP(Admix3, DATA_Tables!D29:E36, 2), \"\"))","v":""},{"$f":"IF(AND(ISBLANK(Admix3Prod), ISBLANK(Admix3Name)), \"\", CONCATENATE(Admix3Prod,\"/\",Admix3Name))","v":""},null,null,{"$f":"IF(ISBLANK(H22), \"\", (H22*$K$10/100)*0.00104437934)","v":""},null,{"$f":"IF(ISBLANK(H22),\"\",(I22*62.4*(1-(Admix3Sol/100))))","v":""}]
[null,null,{"$f":"IF(ISBLANK(Admix4), \"\", CONCATENATE(Admix4,\":\"))","v":""},null,{"$f":"IF(ISBLANK(Admix4), \"\", IF(VLOOKUP(Admix4, DATA_Tables!D29:E36, 2)<>0,VLOOKUP(Admix4, DATA_Tables!D29:E36, 2), \"\"))","v":""},{"$f":"IF(AND(ISBLANK(Admix4Prod), ISBLANK(Admix4Name)), \"\", CONCATENATE(Admix4Prod,\"/\",Admix4Name))","v":""},null,null,"",null,{"$f":"IF(ISBLANK(H23),\"\",(I23*62.4*(1-(Admix4Sol/100))))","v":""}]
[null,null,{"$f":"IF(ISBLANK(Admix5), \"\", CONCATENATE(Admix5,\":\"))","v":""},null,{"$f":"IF(ISBLANK(Admix5), \"\", IF(VLOOKUP(Admix5, DATA_Tables!D29:E36, 2)<>0,VLOOKUP(Admix5, DATA_Tables!D29:E36, 2), \"\"))","v":""},{"$f":"IF(AND(ISBLANK(Admix5Prod), ISBLANK(Admix5Name)), \"\", CONCATENATE(Admix5Prod,\"/\",Admix5Name))","v":""},null,null,"",null,{"$f":"IF(ISBLANK(H24),\"\",(I24*62.4*(1-(Admix5Sol/100))))","v":""}]
[null,null,{"$f":"IF(ISBLANK(Admix6), \"\", CONCATENATE(Admix6,\":\"))","v":""},null,{"$f":"IF(ISBLANK(Admix6), \"\", IF(VLOOKUP(Admix6, DATA_Tables!D29:E36, 2)<>0,VLOOKUP(Admix6, DATA_Tables!D29:E36, 2), \"\"))","v":""},{"$f":"IF(AND(ISBLANK(Admix6Prod), ISBLANK(Admix6Name)), \"\", CONCATENATE(Admix6Prod,\"/\",Admix6Name))","v":""},null,null,"",null,{"$f":"IF(ISBLANK(H25),\"\",(I25*62.4*(1-(Admix6Sol/100))))","v":""}]
[null,null,{"$f":"IF(ISBLANK(Admix7), \"\", CONCATENATE(Admix7,\":\"))","v":""},null,{"$f":"IF(ISBLANK(Admix7), \"\", IF(VLOOKUP(Admix7, DATA_Tables!D29:E36, 2)<>0,VLOOKUP(Admix7, DATA_Tables!D29:E36, 2), \"\"))","v":""},{"$f":"IF(AND(ISBLANK(Admix7Prod), ISBLANK(Admix7Name)), \"\", CONCATENATE(Admix7Prod,\"/\",Admix7Name))","v":""},null,null,"",null,{"$f":"IF(ISBLANK(H26),\"\",(I26*62.4*(1-(Admix7Sol/100))))","v":""}]
[null,null,{"$f":"IF(ISBLANK(Admix8), \"\", CONCATENATE(Admix8,\":\"))","v":""},null,{"$f":"IF(ISBLANK(Admix8), \"\", IF(VLOOKUP(Admix8, DATA_Tables!D29:E36, 2)<>0,VLOOKUP(Admix8, DATA_Tables!D29:E36, 2), \"\"))","v":""},{"$f":"IF(AND(ISBLANK(Admix8Prod), ISBLANK(Admix8Name)), \"\", CONCATENATE(Admix8Prod,\"/\",Admix8Name))","v":""},null,null,"",null,{"$f":"IF(ISBLANK(H27),\"\",(I27*62.4*(1-(Admix8Sol/100))))","v":""}]
[null,null,{"$f":"IF(ISBLANK(Admix9),\"\", CONCATENATE(Admix9,\":\"))","v":""},null,{"$f":"IF(ISBLANK(Admix9), \"\", IF(VLOOKUP(Admix9, DATA_Tables!D29:E36, 2)<>0,VLOOKUP(Admix9, DATA_Tables!D29:E36, 2), \"\"))","v":""},{"$f":"IF(AND(ISBLANK(Admix9Prod), ISBLANK(Admix9Name)), \"\", CONCATENATE(Admix9Prod,\"/\",Admix9Name))","v":""},null,null,"",null,{"$f":"IF(ISBLANK(H28),\"\",(I28*62.4*(1-(Admix9Sol/100))))","v":""}]
[null,null,"Paste Volume = Total (water + cm):",null,null,null,null,null,{"$f":"SUM(I9,I10,I20:J28)","v":0},null,{"$f":"SUM(K9:K10)","v":0}]
[null,"Air","Entrapped air:",null,null,null,null,{"$f":"IF(ISBLANK(InputEntrAir), IF(ISNUMBER(ApproxEntrAir), ApproxEntrAir, 0), InputEntrAir)","v":0},{"$f":"H30*27/100","v":0}]
[null,null,"Target Total Air Content:",null,null,null,null,{"$f":"IF(AND(SpecAir=\"Yes\", ISNUMBER(TargetAir)), TargetAir, IF(SpecAir=\"Yes\", 3, IF(AND(SpecAir=\"\", AirUsed=\"Yes\"), TargetAir,0)))","v":0},{"$f":"H31*27/100","v":0}]
[null,null,"Air + Paste Volume:",null,null,null,null,null,{"$f":"SUM(I29:J31)","v":0}]
[null,"Misc.","Fibers:",null,null,{"$f":"IF(AND(ISBLANK(FiberProd), ISBLANK(FiberName)), \"\", CONCATENATE(FiberProd,\"/\", FiberName))","v":""},null,null,{"$f":"IF(OR(ISBLANK(K33),K33=0),\"\",IF(ISERROR(K33/(FiberSG*62.4)), \"Matl properties!!\", K33/(FiberSG*62.4)))","v":""}]
[null,null,{"$f":"IF(ISBLANK(OtherMat), \"\", CONCATENATE(OtherMat,\":\"))","v":""},null,null,{"$f":"IF(AND(ISBLANK(OtherMatProd), ISBLANK(OtherMatName)), \"\", CONCATENATE(OtherMatProd,\"/\", OtherMatName))","v":""},null,null,{"$f":"IF(OR(ISBLANK(K34),K34=0),\"\",IF(ISERROR(K34/(OtherMatSG*62.4)), \"Matl properties!!\", K34/(OtherMatSG*62.4)))","v":""}]
[null,"Optimized Gradation","Total Aggregate Volume:",null,null,null,null,{"$f":"IF(I35=\"\", \"\", SUM(H36:H41))","v":0},{"$f":"IF(AND(ISNUMBER(I33), ISNUMBER(I34)), 27-I32-I33-I34, IF(ISNUMBER(I33), 27-I32-I33, IF(ISNUMBER(I34), 27-I32-I34, 27-I32)))","v":27},null,{"$f":"IF(COUNTBLANK(K36:K41)=6, \"\", SUM(K36:K41))","v":""}]
[null,null,"Coarse Aggregate 1:",null,{"$f":"IF(ISBLANK('Matl Properties'!I9),\"\",'Matl Properties'!I9)","v":""},{"$f":"IF(AND(ISBLANK(Agg1Prod), ISBLANK(Agg1Pit)), \"\", CONCATENATE(Agg1Prod,\"/\", Agg1Pit))","v":""},null,{"$f":"IF(ISBLANK(Agg1Percent), \"\", Agg1Percent*100)","v":""},{"$f":"IF(H36=\"\", \"\",I35*H36/$H$35)","v":""},null,{"$f":"IF(I36=\"\", \"\", I36*62.4*Agg1SG)","v":""}]
[null,null,"Coarse Aggregate 2:",null,{"$f":"IF(ISBLANK('Matl Properties'!I10),\"\",'Matl Properties'!I10)","v":""},{"$f":"IF(AND(ISBLANK(Agg2Prod), ISBLANK(Agg2Pit)), \"\", CONCATENATE(Agg2Prod,\"/\", Agg2Pit))","v":""},null,{"$f":"IF(ISBLANK(Agg2Percent), \"\", Agg2Percent*100)","v":""},{"$f":"IF(H37=\"\", \"\", I35*H37/H35)","v":""},null,{"$f":"IF(I37=\"\", \"\", I37*62.4*Agg2SG)","v":""}]
[null,null,"Intermediate Aggregate 1:",null,{"$f":"IF(ISBLANK('Matl Properties'!I11),\"\",'Matl Properties'!I11)","v":""},{"$f":"IF(AND(ISBLANK(Agg3Prod), ISBLANK(Agg3Pit)), \"\", CONCATENATE(Agg3Prod,\"/\", Agg3Pit))","v":""},null,{"$f":"IF(ISBLANK(Agg3Percent), \"\", Agg3Percent*100)","v":""},{"$f":"IF(H38=\"\", \"\", I35*H38/H35)","v":""},null,{"$f":"IF(I38=\"\", \"\", I38*62.4*Agg3SG)","v":""}]
[null,null,"Intermediate Aggregate 2:",null,{"$f":"IF(ISBLANK('Matl Properties'!I12),\"\",'Matl Properties'!I12)","v":""},{"$f":"IF(AND(ISBLANK(Agg4Prod), ISBLANK(Agg4Pit)), \"\", CONCATENATE(Agg4Prod,\"/\", Agg4Pit))","v":""},null,{"$f":"IF(ISBLANK(Agg4Percent), \"\", Agg4Percent*100)","v":""},{"$f":"IF(H39=\"\", \"\", I35*H39/H35)","v":""},null,{"$f":"IF(I39=\"\", \"\", I39*62.4*Agg4SG)","v":""}]
[null,null,"Fine Aggregate 1:",null,null,{"$f":"IF(AND(ISBLANK(Agg5Prod), ISBLANK(Agg5Pit)), \"\", CONCATENATE(Agg5Prod,\"/\", Agg5Pit))","v":""},null,{"$f":"IF(ISBLANK(Agg5Percent), \"\", Agg5Percent*100)","v":""},{"$f":"IF(H40=\"\", \"\", I35*H40/H35)","v":""},null,{"$f":"IF(I40=\"\", \"\", I40*62.4*Agg5SG)","v":""}]
[null,null,"Fine Aggregate 2:",null,null,{"$f":"IF(AND(ISBLANK(Agg6Prod), ISBLANK(Agg6Pit)), \"\", CONCATENATE(Agg6Prod,\"/\", Agg6Pit))","v":""},null,{"$f":"IF(ISBLANK(Agg6Percent), \"\", Agg6Percent*100)","v":""},{"$f":"IF(H41=\"\", \"\", I35*H41/H35)","v":""},null,{"$f":"IF(I41=\"\", \"\", I41*62.4*Agg6SG)","v":""}]
[null,"Non Optimized Gradation","Total Aggregate Volume:",null,null,{"$f":"IF(Class<>\"Class CO\", \"\", CONCATENATE(\"Coarse Aggregate Factor = \", ROUND((IF(ISBLANK(Field284), 0, (Field284*(H43/SUM(H43:H44))/(27*'Matl Properties'!L9)))+IF(ISBLANK('Matl Properties'!L10), 0, Field285*(H44/SUM(H43:H44))/(27*'Matl Properties'!L10))), 3)))","v":""},null,{"$f":"IF(I42=\"\",\"\",SUM(H43:H48))","v":""},{"$f":"IF(K42=\"\", \"\", SUM(I43:J48))","v":""},null,{"$f":"IF(COUNTBLANK(K43:K48)=6, \"\", SUM(K43:K48))","v":""}]
[null,null,"Coarse Aggregate 1:",null,{"$f":"IF(ISBLANK('Matl Properties'!I9),\"\",'Matl Properties'!I9)","v":""},{"$f":"IF(AND(ISBLANK(Agg1Prod), ISBLANK(Agg1Pit)), \"\", CONCATENATE(Agg1Prod,\"/\", Agg1Pit))","v":""},null,{"$f":"IF(OR(ISBLANK(K43),K43=0),\"\", K43*100/$K$42)","v":""},{"$f":"IF(OR(ISBLANK(K43), K43=0),\"\", K43/(62.4*Agg1SG))","v":""}]
[null,null,"Coarse Aggregate 2:",null,{"$f":"IF(ISBLANK('Matl Properties'!I10),\"\",'Matl Properties'!I10)","v":""},{"$f":"IF(AND(ISBLANK(Agg2Prod), ISBLANK(Agg2Pit)), \"\", CONCATENATE(Agg2Prod,\"/\", Agg2Pit))","v":""},null,{"$f":"IF(OR(ISBLANK(K44),K44=0),\"\",K44*100/$K$42)","v":""},{"$f":"IF(OR(ISBLANK(K44), K44=0),\"\", K44/(62.4*Agg2SG))","v":""}]
[null,null,"Intermediate Aggregate 1:",null,{"$f":"IF(ISBLANK('Matl Properties'!I11),\"\",'Matl Properties'!I11)","v":""},{"$f":"IF(AND(ISBLANK(Agg3Prod), ISBLANK(Agg3Pit)), \"\", CONCATENATE(Agg3Prod,\"/\", Agg3Pit))","v":""},null,{"$f":"IF(OR(ISBLANK(K45),K45=0),\"\",K45*100/$K$42)","v":""},{"$f":"IF(OR(ISBLANK(K45), K45=0),\"\", K45/(62.4*Agg3SG))","v":""}]
[null,null,"Intermediate Aggregate 2:",null,{"$f":"IF(ISBLANK('Matl Properties'!I12),\"\",'Matl Properties'!I12)","v":""},{"$f":"IF(AND(ISBLANK(Agg4Prod), ISBLANK(Agg4Pit)), \"\", CONCATENATE(Agg4Prod,\"/\", Agg4Pit))","v":""},null,{"$f":"IF(OR(ISBLANK(K46),K46=0),\"\",K46*100/$K$42)","v":""},{"$f":" IF(OR(ISBLANK(K46), K46=0),\"\", K46/(62.4*Agg4SG))","v":""}]
[null,null,"Fine Aggregate 1:",null,null,{"$f":"IF(AND(ISBLANK(Agg5Prod), ISBLANK(Agg5Pit)), \"\", CONCATENATE(Agg5Prod,\"/\", Agg5Pit))","v":""},null,{"$f":"IF(OR(ISBLANK(K47),K47=0),\"\",K47*100/$K$42)","v":""},{"$f":"IF(OR(ISBLANK(K47), K47=0),\"\", K47/(62.4*Agg5SG))","v":""}]
[null,null,"Fine Aggregate 2:",null,null,{"$f":"IF(AND(ISBLANK(Agg6Prod), ISBLANK(Agg6Pit)), \"\", CONCATENATE(Agg6Prod,\"/\", Agg6Pit))","v":""},null,{"$f":"IF(OR(ISBLANK(K48),K48=0),\"\",K48*100/$K$42)","v":""},{"$f":" IF(OR(ISBLANK(K48), K48=0),\"\", K48/(62.4*Agg6SG))","v":""},null,null,{"$f":"IF(Field24=\"Yes\", \"Use the \"\"Internal Curing\"\" worksheet.\",\"\")","v":""}]
[null,"*Input admixture dosages in fl.oz/100 lb. cementitious material",null,null,null,null,null,null,null,null,{"$f":"IF(OptGrade=\"Yes\", SUM(K35,K33:K34,K29), SUM(K42,K33:K34,K29))","v":0}]
[null,null,null,null,null,null,"Total Input Volume, (ft3):",null,{"$f":"IF(OptGrade=\"Yes\",SUM(I32:I34,I35),SUM(I32:I34,I42))","v":0},null,"Verify all materials were input correctly!!!"]
[null,{"$f":"IF(OR(ISBLANK(SpecYear),SpecYear=2024),IF(TotCemSSDED=0,\"\",IF(AND(MDOption=4,TotCemSSDED=DesignMaxCement,SUMIF(E12:E19,\"Coal Ash\",pct_dos)<=CAsh,SUMIF(E12:E19,\"Natural Pozzolan\",pct_dos)<=FAsh,SUMIF(E12:E19,\"Slag Cement\",pct_dos)<=Slag,SUMIF(E12:E19,\"Silica Fume\",pct_dos)<=SF),MDOCheck,IF(AND(TotCemSSDED=DesignMaxCement,SUMIF(E12:E19,\"Coal Ash\",pct_dos)=CAsh,SUMIF(E12:E19,\"Natural Pozzolan\",pct_dos)=FAsh,SUMIF(E12:E19,\"Slag Cement\",pct_dos)=Slag,SUMIF(E12:E19,\"Silica Fume\",pct_dos)=SF),MDOCheck,\"The SCM proportions listed in this mix design do not match the proportions listed in the Air Entrainment and Mix Design Options sheet.\"))),\"\")","v":""}]
[]
[null,{"$f":"IF(Field24=\"Yes\", \"Complete this worksheet, then use the \"\"Internal Curing\"\" worksheet to complete the internally cured mix design.\",\"\")","v":""}]
[null,{"$f":"IF(Class=\"Class P\", 'Project Summary'!B26, \"\")","v":""}]

{"sheet":"DryBatchWeights - ACI211","index":8,"n_rows":72,"n_cols":13,"rows_kept":72,"cut":false,"hidden":true,"merged":[[69,1,70,10],[61,1,67,1],[61,2,61,3],[61,5,61,6],[61,8,61,9],[62,2,62,3],[62,5,62,6],[62,8,62,9],[63,2,63,3],[63,5,63,6],[63,8,63,9],[66,2,66,3],[66,5,66,6],[66,8,66,9],[67,2,67,3],[67,5,67,6],[67,8,67,9],[64,2,64,3],[64,5,64,6],[64,8,64,9],[65,2,65,3],[65,5,65,6],[65,8,65,9],[68,8,68,9],[54,1,60,1],[54,2,54,3],[54,5,54,6],[54,8,54,9],[55,2,55,3],[55,5,55,6],[55,8,55,9],[56,2,56,3],[56,5,56,6],[56,8,56,9],[59,2,59,3],[59,5,59,6],[59,8,59,9],[60,2,60,3],[60,5,60,6],[60,8,60,9],[57,2,57,3],[57,5,57,6],[57,8,57,9],[58,2,58,3],[58,5,58,6],[58,8,58,9],[52,1,53,1],[52,2,52,3],[52,5,52,6],[52,8,52,9],[53,2,53,3],[53,5,53,6],[53,8,53,9],[49,1,51,1],[49,2,49,3],[49,5,49,6],[49,8,49,9],[50,2,50,3],[50,5,50,6],[50,8,50,9],[51,2,51,3],[51,5,51,6],[51,8,51,9],[47,2,47,3],[47,5,47,6],[47,8,47,9],[48,2,48,3],[48,5,48,6],[48,8,48,9],[45,2,45,3],[45,5,45,6],[45,8,45,9],[46,2,46,3],[46,5,46,6],[46,8,46,9],[43,2,43,3],[43,5,43,6],[43,8,43,9],[44,2,44,3],[44,5,44,6],[44,8,44,9],[41,2,41,3],[41,5,41,6],[41,8,41,9],[42,2,42,3],[42,5,42,6],[42,8,42,9],[39,2,39,3],[39,5,39,6],[39,8,39,9],[40,2,40,3],[40,5,40,6],[40,8,40,9],[37,2,37,3],[37,5,37,6],[37,8,37,9],[38,2,38,3],[38,5,38,6],[38,8,38,9],[35,8,35,9],[36,2,36,3],[36,5,36,6],[36,8,36,9],[33,2,33,3],[33,5,33,6],[33,8,33,9],[34,2,34,3],[34,5,34,6],[34,8,34,9],[71,1,72,10],[6,5,6,6],[6,1,6,4],[28,1,48,1],[28,2,28,3],[28,5,28,6],[28,8,28,9],[29,2,29,3],[29,5,29,6],[29,8,29,9],[30,2,30,3],[30,5,30,6],[30,8,30,9],[31,2,31,3],[31,5,31,6],[31,8,31,9],[32,2,32,3],[32,5,32,6],[32,8,32,9],[27,2,27,3],[27,5,27,6],[27,8,27,9],[35,2,35,3],[35,5,35,6]]}
[]
[null,"TEXAS DEPARTMENT OF TRANSPORTATION"]
[null,"HYDRAULIC CEMENT CONCRETE MIX DESIGN & CONTROL"]
[null,"Dry Batch Weights - ACI 211"]
[]
[null,"Water Adjustment"]
[null,"Water Adjustment Factor",null,null,null,"Water Adjustment Effectiveness",null,"Select Adjustment %"]
[null,null,null,null,"Aggregate shape & texture","(-5 to +5%)"]
[null,null,null,null,"Optimized aggregate gradation","(-10 to +10%)"]
[null,null,null,null,"Air entraining admixture","(-10 to 0%)"]
[null,null,null,null,"Normal range water reducing admixture","(-10 to -5%)"]
[null,null,null,null,"High-range water reducer (HRWR)","(-30 to -12%)"]
[null,null,null,null,"Mineral admixtures, fly ash to silica fume","(-10 to +15%)"]
[null,null,null,null,"Other factors: w/c, cement fineness, temperature","(-10 to +10%)"]
[null,null,null,null,null,null,"Cumulative adjustment percentage, %:",{"$f":"IF(COUNTBLANK(H8:H14)=7, \"\", SUM(H8:H14))","v":""}]
[null,null,null,null,null,null,"Water Adjustment Factor:",{"$f":"1+(N(H15)/100)","v":1}]
[]
[null,"Coarse Aggregate Factor"]
[null,null,null,null,null,null,"Calculated Coarse Aggregate Factor, CAF (based on inputted material properties):",{"$f":"IF(OR(I23=\"\",ISNUMBER(ACI211AggSize)=FALSE),0,IF(I23=2.4,IF(E22<1,-0.4503*E22^2+0.9383*E22+0.2191,-0.02*E22^2+0.13*E22+0.6),IF(E22<1,(-0.4503*E22^2+0.9383*E22+0.2191-((I23-2.4)*10)*0.01),(-0.02*E22^2+0.13*E22+0.6-((I23-2.4)*10)*0.01))))","v":0.45909999999999995},{"$f":"IF(AND(H19=0,ISNUMBER(ACI211AggSize)=FALSE),\"Check max aggregate size\",IF(AND(H19=0,ISBLANK(WeightedFM)),\"Verify value for fineness modulus in Matl Properties worksheet\",\"\"))","v":""}]
[null,null,null,null,null,null,"Specified Coarse Aggregate Factor, CAF:"]
[]
[null,null,null,"Nom. Max. Agg. Size, (inches):",{"$f":"IF(OptGrade=\"Yes\",IF('Optimized Gradation'!L12>0,1.5,IF('Optimized Gradation'!L13>0,1,IF('Optimized Gradation'!L14>0,0.75,\"Aggregate Gradation\"))),IF(ISNUMBER(PSAggSize),PSAggSize,NMAS))","v":0},null,"Target slump, (inches):"]
[null,null,null,"Mix design target strength, (psi):",{"$f":"IF(AND(SpecDesignStrength=\"\", MinDesignStrength=\"Note 8\"), \"No Strength Input\", IF(AND(ISNUMBER(SpecDesignStrength), ISNUMBER(MinDesignStrength)), IF(SpecDesignStrength>MinDesignStrength, SpecDesignStrength,MinDesignStrength), IF(ISNUMBER(SpecDesignStrength), SpecDesignStrength, MinDesignStrength)))","v":""},null,"Air Entrained?:",{"$f":" SpecAir","v":0},{"$f":"IF(OptGrade=\"Yes\",OptFM,NonOptFM)","v":0}]
[null,null,null,"Basic Water Demand, lb/CY:",{"$f":"IF(E22=0.375,335.34*H22^0.1082,IF(E22=0.5,322.79*H22^0.0952,IF(E22=0.75,303.52*H22^0.091,IF(E22=1,290.36*H22^0.0859,IF(E22=1.5,265.43*H22^0.0932,IF(E22=2,250.48*H22^0.0982,\" \"))))))","v":" "},null,"Controlling w/c or w/cm:",{"$f":"IF(DesignWC=\"Concrete class not selected.\", \"Unknown\", DesignWC)","v":"Unknown"}]
[null,null,null,"Water Adjustment Factor:",{"$f":"H16","v":1},null,"Max. Cementitious content, lb/CY:",{"$f":"DesignMaxCement","v":700}]
[]
[null,"ACI 211 Mix Design"]
[null,null,"Mix Component",null,"Type/Class/Grade","Producer/Source",null,"% or\nDosage","Absolute Vol. (ft3)",null,"SSD Weight (lbs/CY)"]
[null,"Paste","Basic Water Demand:",null,null,null,null,null,{"$f":"IF(K29=\"\",\"\",K29/62.4)","v":0},null,{"$f":"IF(M29=0, 0, IF((SUM(K40:K48,M29)/H24)<=H25, M29, ROUND((K30*H24)-SUM(K40:K48),0)))","v":0},{"$f":"IF(ISERROR(ROUND(SUM(K29,K40:K48)/K30, 2)), \"\", IF(ROUND(SUM(K29,K40:K48)/K30, 2)>MaxWC, \"w/cm exceeds maximum w/cm\", IF(ROUND(SUM(K29,K40:K48)/K30,2)>H24, \"w/cm exceeds target w/cm\",\"\")))","v":""},{"$f":"IF(ISERROR(ROUND((E24*E25),0)),0,ROUND((E24*E25),0))","v":0}]
[null,null,"Total Cementitious:",null,null,null,null,{"$f":"IF(K30=0, \"\", CONCATENATE(\"W/CM= \",ROUND((K29+SUM(K40:K48))/K30,2)))","v":""},{"$f":"IF(K30=\"\",\"\",SUM(I31:J39))","v":0},null,{"$f":"IF(M29=0,0,IF((M29/H24)<=H25,ROUND(M29/H24,0),H25))","v":0},{"$f":"IF(K30<>0,IF(K30<=DesignMaxCement,\"\",\"Does not match previous entry\"),\"\")","v":""}]
[null,null,"Hydraulic cement:",null,{"$f":"IF(OR(ISBLANK('Matl Properties'!I18), 'Matl Properties'!I18=\"Not Selected.\"), \"\", 'Matl Properties'!I18)","v":""},{"$f":"IF(AND(ISBLANK(HC1Prod), ISBLANK(HC1Plant)), \"\", CONCATENATE(HC1Prod,\"/\",HC1Plant))","v":""},null,null,{"$f":"IF(ISBLANK(H31), \"\", K31/(HC1SG*62.4))","v":""},null,{"$f":"IF(ISBLANK(H31),\"\",$K$30*H31/SUM($H$31:$H$39))","v":""}]
[null,null,{"$f":"IF(ISBLANK(Cementitious2), \"\", CONCATENATE(Cementitious2,\":\"))","v":""},null,{"$f":"IF(ISBLANK(Cementitious2),\"\",Cementitious2)","v":""},{"$f":"IF(AND(ISBLANK(SCM2Prod), ISBLANK(SCM2Plant)), \"\", CONCATENATE(SCM2Prod,\"/\",SCM2Plant))","v":""},null,null,{"$f":"IF(ISBLANK(H32), \"\", K32/(SCM2SG*62.4))","v":""},null,{"$f":"IF(ISBLANK(H32),\"\",$K$30*H32/SUM($H$31:$H$39))","v":""}]
[null,null,{"$f":"IF(ISBLANK(Cementitious3), \"\", CONCATENATE(Cementitious3,\":\"))","v":""},null,{"$f":"IF(ISBLANK(Cementitious3),\"\",Cementitious3)","v":""},{"$f":"IF(AND(ISBLANK(SCM3Prod), ISBLANK(SCM3Plant)), \"\", CONCATENATE(SCM3Prod,\"/\",SCM3Plant))","v":""},null,null,{"$f":"IF(ISBLANK(H33), \"\", K33/(SCM3SG*62.4))","v":""},null,""]
[null,null,{"$f":"IF(ISBLANK(Cementitious4), \"\", CONCATENATE(Cementitious4,\":\"))","v":""},null,{"$f":"IF(ISBLANK(Cementitious4),\"\",Cementitious4)","v":""},{"$f":"IF(AND(ISBLANK(SCM4Prod), ISBLANK(SCM4Plant)), \"\", CONCATENATE(SCM4Prod,\"/\",SCM4Plant))","v":""},null,null,{"$f":"IF(ISBLANK(H34), \"\", K34/(SCM4SG*62.4))","v":""},null,""]
[null,null,{"$f":"IF(ISBLANK(Cementitious5), \"\", CONCATENATE(Cementitious5,\":\"))","v":""},null,{"$f":"IF(ISBLANK(Cementitious5),\"\",Cementitious5)","v":""},{"$f":"IF(AND(ISBLANK(SCM5Prod), ISBLANK(SCM5Plant)), \"\", CONCATENATE(SCM5Prod,\"/\",SCM5Plant))","v":""},null,null,{"$f":"IF(ISBLANK(H35), \"\", K35/(SCM5SG*62.4))","v":""},null,""]
[null,null,{"$f":"IF(ISBLANK(Cementitious6), \"\", CONCATENATE(Cementitious6,\":\"))","v":""},null,{"$f":"IF(ISBLANK(Cementitious6),\"\",Cementitious6)","v":""},{"$f":"IF(AND(ISBLANK(SCM6Prod), ISBLANK(SCM6Plant)), \"\",CONCATENATE(SCM6Prod,\"/\",SCM6Plant))","v":""},null,null,{"$f":"IF(ISBLANK(H36), \"\", K36/(SCM6SG*62.4))","v":""},null,""]
[null,null,{"$f":"IF(ISBLANK(Cementitious7), \"\", CONCATENATE(Cementitious7,\":\"))","v":""},null,{"$f":"IF(ISBLANK(Cementitious7),\"\",Cementitious7)","v":""},{"$f":"IF(AND(ISBLANK(SCM7Prod), ISBLANK(SCM7Plant)), \"\", CONCATENATE(SCM7Prod,\"/\",SCM7Plant))","v":""},null,null,{"$f":"IF(ISBLANK(H37), \"\", K37/(SCM7SG*62.4))","v":""},null,""]
[null,null,{"$f":"IF(ISBLANK(Cementitious8), \"\", CONCATENATE(Cementitious8,\":\"))","v":""},null,{"$f":"IF(ISBLANK(Cementitious8),\"\",Cementitious8)","v":""},{"$f":"IF(AND(ISBLANK(SCM8Prod), ISBLANK(SCM8Plant)), \"\", CONCATENATE(SCM8Prod,\"/\",SCM8Plant))","v":""},null,null,{"$f":"IF(ISBLANK(H38), \"\", K38/(SCM8SG*62.4))","v":""},null,""]
[null,null,{"$f":"IF(ISBLANK(Cementitious9), \"\", CONCATENATE(Cementitious9, \":\"))","v":""},null,{"$f":"IF(ISBLANK(Cementitious9),\"\",Cementitious9)","v":""},{"$f":"IF(AND(ISBLANK(SCM9Prod), ISBLANK(SCM9Plant)), \"\", CONCATENATE(SCM9Prod,\"/\",SCM9Plant))","v":""},null,null,{"$f":"IF(ISBLANK(H39), \"\", K39/(SCM9SG*62.4))","v":""},null,""]
[null,null,{"$f":"IF(ISBLANK(Admix1), \"\", CONCATENATE(Admix1, \":\"))","v":""},null,{"$f":"IF(ISBLANK(Admix1), \"\", IF(VLOOKUP(Admix1, DATA_Tables!D29:E36, 2)<>0,VLOOKUP(Admix1, DATA_Tables!D29:E36, 2),\"\"))","v":""},{"$f":"IF(AND(ISBLANK(Admix1Prod), ISBLANK(Admix1Name)), \"\", CONCATENATE(Admix1Prod,\"/\",Admix1Name))","v":""},null,null,{"$f":"IF(ISBLANK(H40), \"\", (H40*$K$30/100)*0.00104437934)","v":""},null,{"$f":"IF(ISBLANK(H40),\"\",(I40*62.4*(1-(Admix1Sol/100))))","v":""}]
[null,null,{"$f":"IF(ISBLANK(Admix2), \"\", CONCATENATE(Admix2, \":\"))","v":""},null,{"$f":"IF(ISBLANK(Admix2), \"\", IF(VLOOKUP(Admix2, DATA_Tables!D29:E36, 2)<>0,VLOOKUP(Admix2, DATA_Tables!D29:E36, 2),\"\"))","v":""},{"$f":"IF(AND(ISBLANK(Admix2Prod), ISBLANK(Admix2Name)), \"\", CONCATENATE(Admix2Prod,\"/\",Admix2Name))","v":""},null,null,"",null,{"$f":"IF(ISBLANK(Field310),\"\",(I41*62.4*(1-(Admix2Sol/100))))","v":""}]
[null,null,{"$f":"IF(ISBLANK(Admix3), \"\", CONCATENATE(Admix3,\":\"))","v":""},null,{"$f":"IF(ISBLANK(Admix3), \"\", IF(VLOOKUP(Admix3, DATA_Tables!D29:E36, 2)<>0,VLOOKUP(Admix3, DATA_Tables!D29:E36, 2),\"\"))","v":""},{"$f":"IF(AND(ISBLANK(Admix3Prod), ISBLANK(Admix3Name)), \"\", CONCATENATE(Admix3Prod,\"/\",Admix3Name))","v":""},null,null,"",null,{"$f":"IF(ISBLANK(Field311),\"\",(I42*62.4*(1-(Admix3Sol/100))))","v":""}]
[null,null,{"$f":"IF(ISBLANK(Admix4), \"\", CONCATENATE(Admix4,\":\"))","v":""},null,{"$f":"IF(ISBLANK(Admix4), \"\", IF(VLOOKUP(Admix4, DATA_Tables!D29:E36, 2)<>0,VLOOKUP(Admix4, DATA_Tables!D29:E36, 2),\"\"))","v":""},{"$f":"IF(AND(ISBLANK(Admix4Prod), ISBLANK(Admix4Name)), \"\",CONCATENATE(Admix4Prod,\"/\",Admix4Name))","v":""},null,null,"",null,{"$f":"IF(ISBLANK(Field312),\"\",(I43*62.4*(1-(Admix4Sol/100))))","v":""}]
[null,null,{"$f":"IF(ISBLANK(Admix5), \"\", CONCATENATE(Admix5,\":\"))","v":""},null,{"$f":"IF(ISBLANK(Admix5), \"\", IF(VLOOKUP(Admix5, DATA_Tables!D29:E36, 2)<>0,VLOOKUP(Admix5, DATA_Tables!D29:E36, 2),\"\"))","v":""},{"$f":"IF(AND(ISBLANK(Admix5Prod), ISBLANK(Admix5Name)), \"\", CONCATENATE(Admix5Prod,\"/\",Admix5Name))","v":""},null,null,"",null,{"$f":"IF(ISBLANK(Field313),\"\",(I44*62.4*(1-(Admix5Sol/100))))","v":""}]
[null,null,{"$f":"IF(ISBLANK(Admix6), \"\", CONCATENATE(Admix6,\":\"))","v":""},null,{"$f":"IF(ISBLANK(Admix6), \"\", IF(VLOOKUP(Admix6, DATA_Tables!D29:E36, 2)<>0,VLOOKUP(Admix6, DATA_Tables!D29:E36, 2),\"\"))","v":""},{"$f":"IF(AND(ISBLANK(Admix6Prod), ISBLANK(Admix6Name)), \"\", CONCATENATE(Admix6Prod,\"/\",Admix6Name))","v":""},null,null,"",null,{"$f":"IF(ISBLANK(Field314),\"\",(I45*62.4*(1-(Admix6Sol/100))))","v":""}]
[null,null,{"$f":"IF(ISBLANK(Admix7), \"\", CONCATENATE(Admix7,\":\"))","v":""},null,{"$f":"IF(ISBLANK(Admix7), \"\", IF(VLOOKUP(Admix7, DATA_Tables!D29:E36, 2)<>0,VLOOKUP(Admix7, DATA_Tables!D29:E36, 2),\"\"))","v":""},{"$f":"IF(AND(ISBLANK(Admix7Prod), ISBLANK(Admix7Name)), \"\", CONCATENATE(Admix7Prod,\"/\",Admix7Name))","v":""},null,null,"",null,{"$f":"IF(ISBLANK(Field315),\"\",(I46*62.4*(1-(Admix7Sol/100))))","v":""}]
[null,null,{"$f":"IF(ISBLANK(Admix8), \"\", CONCATENATE(Admix8,\":\"))","v":""},null,{"$f":"IF(ISBLANK(Admix8), \"\", IF(VLOOKUP(Admix8, DATA_Tables!D29:E36, 2)<>0,VLOOKUP(Admix8, DATA_Tables!D29:E36, 2),\"\"))","v":""},{"$f":"IF(AND(ISBLANK(Admix8Prod), ISBLANK(Admix8Name)), \"\", CONCATENATE(Admix8Prod,\"/\",Admix8Name))","v":""},null,null,"",null,{"$f":"IF(ISBLANK(Field316),\"\",(I47*62.4*(1-(Admix8Sol/100))))","v":""}]
[null,null,{"$f":"IF(ISBLANK(Admix9),\"\", CONCATENATE(Admix9,\":\"))","v":""},null,{"$f":"IF(ISBLANK(Admix9), \"\", IF(VLOOKUP(Admix9, DATA_Tables!D29:E36, 2)<>0,VLOOKUP(Admix9, DATA_Tables!D29:E36, 2),\"\"))","v":""},{"$f":"IF(AND(ISBLANK(Admix9Prod), ISBLANK(Admix9Name)), \"\", CONCATENATE(Admix9Prod,\"/\",Admix9Name))","v":""},null,null,"",null,{"$f":"IF(ISBLANK(Field317),\"\",(I48*62.4*(1-(Admix9Sol/100))))","v":""}]
[null,null,"Paste Volume = Total (water + cm):",null,null,null,null,null,{"$f":"IF(ISERROR(SUM(I29,I30,I40:J48)), \"\", SUM(I29,I30,I40:J48))","v":0},null,{"$f":"IF(ISERROR(SUM(K29:K30)),\"\",SUM(K29:K30))","v":0}]
[null,"Air","Entrapped air:",null,null,null,null,{"$f":"IF(ISBLANK(InputEntrAir), IF(ISNUMBER(ApproxEntrAir), ApproxEntrAir, 0), InputEntrAir)","v":0},{"$f":"H50*27/100","v":0}]
[null,null,"Target Total Air Content:",null,null,null,null,{"$f":"IF(AND(SpecAir=\"Yes\", ISNUMBER(TargetAir)), TargetAir, IF(SpecAir=\"Yes\", 3, IF(AND(SpecAir=\"\", AirUsed=\"Yes\"), TargetAir,0)))","v":0},{"$f":"H51*27/100","v":0}]
[null,null,"Air + Paste Volume:",null,null,null,null,null,{"$f":"SUM(I49:J51)","v":0}]
[null,"Misc.","Fibers:",null,null,{"$f":"IF(AND(ISBLANK(FiberProd), ISBLANK(FiberName)), \"\", CONCATENATE(FiberProd,\"/\", FiberName))","v":""},null,null,{"$f":"IF(OR(ISBLANK(K53),K53=0),\"\",IF(ISERROR(K53/(FiberSG*62.4)),\"Matl properties!!\",K53/(FiberSG*62.4)))","v":""}]
[null,null,{"$f":"IF(ISBLANK(OtherMat), \"\", CONCATENATE(OtherMat,\":\"))","v":""},null,null,{"$f":"IF(AND(ISBLANK(OtherMatProd), ISBLANK(OtherMatName)), \"\",CONCATENATE(OtherMatProd,\"/\", OtherMatName))","v":""},null,null,{"$f":"IF(OR(ISBLANK(K54),K54=0),\"\",IF(ISERROR(K54/(OtherMatSG*62.4)), \"Matl properties!!\", K54/(OtherMatSG*62.4)))","v":""}]
[null,"Optimized Gradation","Total Aggregate Volume:",null,null,null,null,{"$f":"SUM(H56:H61)","v":0},{"$f":"SUM(I56:J61)","v":{"$error":"#DIV/0!"}},null,{"$f":"SUM(K56:K61)","v":0},"Wt. FM OptGrade"]
[null,null,"Coarse Aggregate 1:",null,{"$f":"IF(ISBLANK('Matl Properties'!I9),\"\",'Matl Properties'!I9)","v":""},{"$f":"IF(AND(ISBLANK('Matl Properties'!E9), ISBLANK('Matl Properties'!G9)), \"\",CONCATENATE('Matl Properties'!E9,\"/\", 'Matl Properties'!G9))","v":""},null,{"$f":"IF(OR(ISBLANK(Agg1Percent), ISERROR(Agg1Percent)), 0,Agg1Percent*100)","v":0},{"$f":"IF(OR(ISERROR(K56),K56=\"\"),\"\",K56/(62.4*'Matl Properties'!K9))","v":""},null,{"$f":"IF(OR(H56=\"\",H56=0), \"\", IF(AND($H$19=\"\", $H$20=\"\"), \"\", IF($H$20=\"\", (H56/SUM($H$56:$H$59))*ROUND($H$19, 2)*27*Agg1UW, (H56/SUM($H$56:$H$59))*ROUND($H$20, 2)*27*Agg1UW)))","v":""},{"$f":"IF(H60=0,Agg5FM,IF(ISERROR(((H60*Agg5FM)+(H61*Agg6FM))/(H60+H61)), \"\", ((H60*Agg5FM)+(H61*Agg6FM))/(H60+H61)))","v":0}]
[null,null,"Coarse Aggregate 2:",null,{"$f":"IF(ISBLANK('Matl Properties'!I10),\"\",'Matl Properties'!I10)","v":""},{"$f":"IF(AND(ISBLANK('Matl Properties'!E10), ISBLANK('Matl Properties'!G10)), \"\",CONCATENATE('Matl Properties'!E10,\"/\", 'Matl Properties'!G10))","v":""},null,{"$f":"IF(OR(ISBLANK(Agg2Percent), ISERROR(Agg2Percent)), 0, Agg2Percent*100)","v":0},{"$f":"IF(OR(ISERROR(K57),K57=\"\"),\"\",K57/(62.4*'Matl Properties'!K10))","v":""},null,{"$f":"IF(OR(H57=\"\",H57=0), \"\", IF(AND($H$19=\"\", $H$20=\"\"), \"\", IF($H$20=\"\", (H57/SUM($H$56:$H$59))*ROUND($H$19, 2)*27*Agg2UW, (H57/SUM($H$56:$H$59))*ROUND($H$20, 2)*27*Agg2UW)))","v":""},"Wt. FM NonOptGrade"]
[null,null,"Intermediate Aggregate 1:",null,{"$f":"IF(ISBLANK('Matl Properties'!I11),\"\",'Matl Properties'!I11)","v":""},{"$f":"IF(AND(ISBLANK('Matl Properties'!E11), ISBLANK('Matl Properties'!G11)), \"\",CONCATENATE('Matl Properties'!E11,\"/\", 'Matl Properties'!G11))","v":""},null,{"$f":"IF(OR(ISBLANK(Agg3Percent), ISERROR(Agg3Percent)), 0, Agg3Percent*100)","v":0},{"$f":"IF(OR(ISERROR(K58),K58=\"\"),\"\",K58/(62.4*'Matl Properties'!K11))","v":""},null,{"$f":"IF(OR(H58=\"\",H58=0), \"\", IF(AND($H$19=\"\", $H$20=\"\"), \"\", IF($H$20=\"\", (H58/SUM($H$56:$H$59))*ROUND($H$19, 2)*27*Agg3UW, (H58/SUM($H$56:$H$59))*ROUND($H$20, 2)*27*Agg3UW)))","v":""},{"$f":"IF(ISBLANK(H67),Agg5FM,IF(ISERROR(((H67*Agg5FM)+(H68*Agg6FM))/(H67+H68)), \"\", ((H67*Agg5FM)+(H68*Agg6FM))/(H67+H68)))","v":0}]
[null,null,"Intermediate Aggregate 2:",null,{"$f":"IF(ISBLANK('Matl Properties'!I12),\"\",'Matl Properties'!I12)","v":""},{"$f":"IF(AND(ISBLANK('Matl Properties'!E12), ISBLANK('Matl Properties'!G12)), \"\",CONCATENATE('Matl Properties'!E12,\"/\", 'Matl Properties'!G12))","v":""},null,{"$f":"IF(OR(ISBLANK(Agg4Percent), ISERROR(Agg4Percent)), 0, Agg4Percent*100)","v":0},{"$f":"IF(OR(ISERROR(K59),K59=\"\"),\"\",K59/(62.4*'Matl Properties'!K12))","v":""},null,{"$f":"IF(OR(H59=\"\",H59=0), \"\", IF(AND($H$19=\"\", $H$20=\"\"), \"\", IF($H$20=\"\", (H59/SUM($H$56:$H$59))*ROUND($H$19, 2)*27*Agg4UW, (H59/SUM($H$56:$H$59))*ROUND($H$20, 2)*27*Agg4UW)))","v":""}]
[null,null,"Fine Aggregate 1:",null,null,{"$f":"IF(AND(ISBLANK('Matl Properties'!E13), ISBLANK('Matl Properties'!G13)), \"\",CONCATENATE('Matl Properties'!E13,\"/\", 'Matl Properties'!G13))","v":""},null,{"$f":"IF(OR(ISBLANK(Agg5Percent), ISERROR(Agg5Percent)), 0, Agg5Percent*100)","v":0},{"$f":"IF(H60=\"\",\"\",(27-SUM($I$52:$J$54,$I$56:$J$59))*(H60/SUM($H$60:$H$61)))","v":{"$error":"#DIV/0!"}},null,{"$f":"IF(OR(H60=\"\",H60=0),\"\",IF(ISERROR(I60*62.4*Agg5SG), 0, I60*62.4*Agg5SG))","v":""}]
[null,null,"Fine Aggregate 2:",null,null,{"$f":"IF(AND(ISBLANK('Matl Properties'!E14), ISBLANK('Matl Properties'!G14)), \"\",CONCATENATE('Matl Properties'!E14,\"/\", 'Matl Properties'!G14))","v":""},null,{"$f":"IF(OR(ISBLANK(Agg6Percent), ISERROR(Agg6Percent)), 0, Agg6Percent*100)","v":0},{"$f":"IF(H61=\"\",\"\",(27-SUM($I$52:$J$54,$I$56:$J$59))*(H61/SUM($H$60:$H$61)))","v":{"$error":"#DIV/0!"}},null,{"$f":"IF(OR(H61=\"\",H61=0),\"\",IF(ISERROR(I61*62.4*Agg6SG), 0, I61*62.4*Agg6SG))","v":""}]
[null,"Non Optimized Gradation","Total Aggregate Volume:",null,null,{"$f":"IF(Class<>\"Class CO\", \"\", CONCATENATE(\"Coarse Aggregate Factor = \", ROUND((IF(ISBLANK(Field320),0,(K63*(Field320/SUM(H63:H64))/(27*'Matl Properties'!L9)))+IF(ISBLANK('Matl Properties'!L10), 0, K64*(Field321/SUM(H63:H64))/(27*'Matl Properties'!L10))), 3)))","v":""},null,null,{"$f":"SUM(I63:J68)","v":0},null,{"$f":"SUM(K63:K68)","v":0}]
[null,null,"Coarse Aggregate 1:",null,{"$f":"IF(ISBLANK('Matl Properties'!I9),\"\",'Matl Properties'!I9)","v":""},{"$f":"IF(AND(ISBLANK('Matl Properties'!E9), ISBLANK('Matl Properties'!G9)), \"\", CONCATENATE('Matl Properties'!E9,\"/\", 'Matl Properties'!G9))","v":""},null,null,{"$f":"IF(K63=\"\", \"\", K63/(62.4*'Matl Properties'!K9))","v":""},null,{"$f":"IF(OR(H63=\"\",H63=0),\"\",IF(AND($H$20=\"\",$H$19=\"\"),\"\",IF($H$20=\"\",(H63/SUM($H$63:$H$66))*ROUND($H$19,2)*27*Agg1UW,(H63/SUM($H$63:$H$66))*ROUND($H$20,2)*27*Agg1UW)))","v":""}]
[null,null,"Coarse Aggregate 2:",null,{"$f":"IF(ISBLANK('Matl Properties'!I10),\"\",'Matl Properties'!I10)","v":""},{"$f":"IF(AND(ISBLANK('Matl Properties'!E10), ISBLANK('Matl Properties'!G10)), \"\", CONCATENATE('Matl Properties'!E10,\"/\", 'Matl Properties'!G10))","v":""},null,null,{"$f":"IF(K64=\"\", \"\", K64/(62.4*'Matl Properties'!K10))","v":""},null,{"$f":"IF(OR(H64=\"\",H64=0),\"\",IF(AND($H$20=\"\",$H$19=\"\"),\"\",IF($H$20=\"\",(H64/SUM($H$63:$H$66))*ROUND($H$19,2)*27*Agg2UW,(H64/SUM($H$63:$H$66))*ROUND($H$20,2)*27*Agg2UW)))","v":""}]
[null,null,"Intermediate Aggregate 1:",null,{"$f":"IF(ISBLANK('Matl Properties'!I11),\"\",'Matl Properties'!I11)","v":""},{"$f":"IF(AND(ISBLANK('Matl Properties'!E11), ISBLANK('Matl Properties'!G11)), \"\", CONCATENATE('Matl Properties'!E11,\"/\", 'Matl Properties'!G11))","v":""},null,null,{"$f":"IF(K65=\"\", \"\", K65/(62.4*'Matl Properties'!K11))","v":""},null,{"$f":"IF(OR(H65=\"\",H65=0),\"\",IF(AND($H$20=\"\",$H$19=\"\"),\"\",IF($H$20=\"\",(H65/SUM($H$63:$H$66))*ROUND($H$19,2)*27*Agg3UW,(H65/SUM($H$63:$H$66))*ROUND($H$20,2)*27*Agg3UW)))","v":""}]
[null,null,"Intermediate Aggregate 2:",null,{"$f":"IF(ISBLANK('Matl Properties'!I12),\"\",'Matl Properties'!I12)","v":""},{"$f":"IF(AND(ISBLANK('Matl Properties'!E12), ISBLANK('Matl Properties'!G12)), \"\", CONCATENATE('Matl Properties'!E12,\"/\", 'Matl Properties'!G12))","v":""},null,null,{"$f":"IF(K66=\"\", \"\", K66/(62.4*'Matl Properties'!K12))","v":""},null,{"$f":"IF(OR(H66=\"\",H66=0),\"\",IF(AND($H$20=\"\",$H$19=\"\"),\"\",IF($H$20=\"\",(H66/SUM($H$63:$H$66))*ROUND($H$19,2)*27*Agg4UW,(H66/SUM($H$63:$H$66))*ROUND($H$20,2)*27*Agg4UW)))","v":""}]
[null,null,"Fine Aggregate 1:",null,null,{"$f":"IF(AND(ISBLANK('Matl Properties'!E13), ISBLANK('Matl Properties'!G13)), \"\", CONCATENATE('Matl Properties'!E13,\"/\", 'Matl Properties'!G13))","v":""},null,null,{"$f":"IF(H67=\"\",\"\",(27-SUM($I$52:$J$54,$I$63:$J$66))*(H67/SUM($H$67:$H$68)))","v":""},null,{"$f":"IF(OR(H67=\"\",H67=0),\"\",IF(ISERROR(I67*62.4*Agg4SG), 0, I67*62.4*Agg5SG))","v":""}]
[null,null,"Fine Aggregate 2:",null,null,{"$f":"IF(AND(ISBLANK('Matl Properties'!E14), ISBLANK('Matl Properties'!G14)), \"\", CONCATENATE('Matl Properties'!E14,\"/\", 'Matl Properties'!G14))","v":""},null,null,{"$f":"IF(H68=\"\",\"\",(27-SUM($I$52:$J$54,$I$63:$J$66))*(H68/SUM($H$67:$H$68)))","v":""},null,{"$f":"IF(OR(H68=\"\",H68=0),\"\",IF(ISERROR(I68*62.4*Agg6SG), 0, I68*62.4*Agg6SG))","v":""}]
[null,"*Input admixture dosages in fl.oz/100 lb. cementitious material.",null,null,null,null,null,null,null,null,{"$f":"IF(OptGrade=\"Yes\", SUM(K55,K53:K54,K49), SUM(K62,K53:K54,K49))","v":0}]
[null,{"$f":"IF(OR(ISBLANK(SpecYear),SpecYear=2024),IF(TotCemSSDACI=0,\"\",IF(AND(MDOption=4,TotCemSSDACI=DesignMaxCement,SUMIF(E32:E39,\"Coal Ash\",ACIpct_dos)<=CAsh,SUMIF(E32:E39,\"Natural Pozzolan\",ACIpct_dos)<=FAsh,SUMIF(E32:E39,\"Slag Cement\",ACIpct_dos)<=Slag,SUMIF(E32:E39,\"Silica Fume\",ACIpct_dos)<=SF),MDOCheck,IF(AND(TotCemSSDACI=DesignMaxCement,SUMIF(E32:E39,\"Coal Ash\",ACIpct_dos)=CAsh,SUMIF(E32:E39,\"Natural Pozzolan\",ACIpct_dos)=FAsh,SUMIF(E32:E39,\"Slag Cement\",ACIpct_dos)=Slag,SUMIF(E32:E39,\"Silica Fume\",ACIpct_dos)=SF),MDOCheck,\"The SCM proportions listed in this mix design do not match the proportions listed in the Air Entrainment and Mix Design Options sheet.\"))),\"\")","v":""}]
[]
[null,{"$f":"IF(Class=\"Class P\", 'Project Summary'!B26, \"\")","v":""}]

{"sheet":"Batch Weights","index":9,"n_rows":37,"n_cols":15,"rows_kept":37,"cut":false,"hidden":true,"merged":[[22,1,22,3],[21,1,21,3],[20,1,20,3],[23,8,23,9],[24,5,24,6],[24,8,24,9],[21,5,21,6],[21,8,21,9],[22,5,22,6],[22,8,22,9],[20,5,20,6],[20,8,20,9],[23,5,23,6],[31,1,31,3],[30,1,30,3],[29,1,29,3],[28,1,28,3],[27,1,27,3],[26,1,26,3],[25,1,25,3],[24,1,24,3],[23,1,23,3],[27,5,27,6],[27,8,27,9],[25,5,25,6],[25,8,25,9],[26,5,26,6],[26,8,26,9],[30,5,30,6],[30,8,30,9],[31,5,31,6],[31,8,31,9],[28,5,28,6],[28,8,28,9],[29,5,29,6],[29,8,29,9],[5,12,5,13],[8,10,8,11],[8,1,8,3],[18,1,18,3],[17,1,17,3],[8,12,8,13],[10,1,10,3],[9,1,9,3],[15,5,15,6],[15,8,15,9],[16,5,16,6],[16,8,16,9],[16,1,16,3],[15,1,15,3],[14,1,14,3],[13,1,13,3],[35,5,35,6],[35,8,35,9],[35,1,35,3],[34,1,34,3],[32,5,32,6],[32,8,32,9],[33,5,33,6],[33,8,33,9],[33,1,33,3],[32,1,32,3],[34,5,34,6],[34,8,34,9],[12,1,12,3],[11,1,11,3],[19,1,19,3],[17,5,17,6],[17,8,17,9],[18,5,18,6],[18,8,18,9],[19,5,19,6],[19,8,19,9],[5,8,5,9],[6,8,6,9],[13,5,13,6],[13,8,13,9],[14,5,14,6],[14,8,14,9],[9,5,9,6],[9,8,9,9],[10,5,10,6],[10,8,10,9],[8,5,8,6],[8,8,8,9],[11,5,11,6],[11,8,11,9],[12,5,12,6],[12,8,12,9]]}
[]
[null,"TEXAS DEPARTMENT OF TRANSPORTATION"]
[null,"HYDRAULIC CEMENT CONCRETE MIX DESIGN & CONTROL"]
[null,"Batch Weights"]
[]
[null,null,"Aggregate:","Coarse Agg. 1","Coarse Agg. 2","Interm. Agg. 1","Interm. Agg. 2","Fine Agg. 1","Fine Agg. 2",null,null,null,"Batch Size"]
[null,null,"Moisture Content, %:"]
[]
[null,"Mix Component",null,null,"Type/Class/Grade","Producer/Source",null,"% of Dosage","SSD Weight\nlb (fl.oz.)/CY",null,"MC Weight lb (fl.oz.)/CY",null,{"$f":"IF(AND(M7<>\"\", N7<>\"\"), CONCATENATE(\"Batch Weights for \", M7, \" \", N7), \"\")","v":""}]
[null,"Basic Water Demand:",null,null,null,{"$f":"IF(MDInput=\"Existing Design\", IF(OR(ISBLANK('DryBatchWeights - Existing'!F9), 'DryBatchWeights - Existing'!F9=\"\"), \"\", 'DryBatchWeights - Existing'!F9), IF(OR(ISBLANK('DryBatchWeights - ACI211'!F29),'DryBatchWeights - ACI211'!F29=\"\"), \"\", 'DryBatchWeights - ACI211'!F29))","v":""},null,null,{"$f":"IF(MDInput=\"Existing Design\", IF(OR(ISBLANK('DryBatchWeights - Existing'!K9), 'DryBatchWeights - Existing'!K9=0), \"\", 'DryBatchWeights - Existing'!K9), IF(OR(ISBLANK('DryBatchWeights - ACI211'!K29), 'DryBatchWeights - ACI211'!K29=0), \"\", 'DryBatchWeights - ACI211'!K29))","v":""},null,{"$f":"IF(ISERROR(I10+SUM(O31:O36)),\"\",I10+SUM(O31:O36))","v":""},"lb",{"$f":"IF(K10=\"\", \"\", IF($N$7=\"cu.ft.\", K10*$M$7/27, IF($N$7=\"cu.yd.\", K10*$M$7, \"\")))","v":""},{"$f":"IF($M$9=\"\", \"\", \"lb\")","v":""}]
[null,"Hydraulic cement:",null,null,{"$f":"IF(ISBLANK('Matl Properties'!I18), \"\", 'Matl Properties'!I18)","v":""},{"$f":"IF(AND(ISBLANK(HC1Prod), ISBLANK(HC1Plant)), \"\", CONCATENATE(HC1Prod,\"/\",HC1Plant))","v":""},null,{"$f":"IF(MDInput=\"Existing Design\", IF(OR(ISBLANK('DryBatchWeights - Existing'!H11), 'DryBatchWeights - Existing'!H11=\"\"), \"\", 'DryBatchWeights - Existing'!H11), IF(OR(ISBLANK('DryBatchWeights - ACI211'!H31), 'DryBatchWeights - ACI211'!H31=\"\"), \"\", 'DryBatchWeights - ACI211'!H31))","v":""},{"$f":"IF(MDInput=\"Existing Design\", IF(OR(ISBLANK('DryBatchWeights - Existing'!K11), 'DryBatchWeights - Existing'!K11=0), \"\", 'DryBatchWeights - Existing'!K11), IF(OR(ISBLANK('DryBatchWeights - ACI211'!K31), 'DryBatchWeights - ACI211'!K31=0), \"\", 'DryBatchWeights - ACI211'!K31))","v":""},null,{"$f":"I11","v":""},"lb","",{"$f":"IF($M$9=\"\", \"\", \"lb\")","v":""}]
[null,{"$f":"IF(ISBLANK(Cementitious2), \"\", CONCATENATE(Cementitious2,\":\"))","v":""},null,null,{"$f":"IF(ISBLANK('Matl Properties'!I19), \"\", 'Matl Properties'!I19)","v":""},{"$f":"IF(AND(ISBLANK(SCM2Prod), ISBLANK(SCM2Plant)), \"\", CONCATENATE(SCM2Prod,\"/\",SCM2Plant))","v":""},null,{"$f":"IF(MDInput=\"Existing Design\", IF(OR(ISBLANK('DryBatchWeights - Existing'!H12), 'DryBatchWeights - Existing'!H12=\"\"), \"\", 'DryBatchWeights - Existing'!H12), IF(OR(ISBLANK('DryBatchWeights - ACI211'!H32), 'DryBatchWeights - ACI211'!H32=\"\"), \"\", 'DryBatchWeights - ACI211'!H32))","v":""},{"$f":"IF(MDInput=\"Existing Design\", IF(OR(ISBLANK('DryBatchWeights - Existing'!K12), 'DryBatchWeights - Existing'!K12=0), \"\", 'DryBatchWeights - Existing'!K12), IF(OR(ISBLANK('DryBatchWeights - ACI211'!K32), 'DryBatchWeights - ACI211'!K32=0), \"\", 'DryBatchWeights - ACI211'!K32))","v":""},null,{"$f":"I12","v":""},"lb","",""]
[null,{"$f":"IF(ISBLANK(Cementitious3), \"\", CONCATENATE(Cementitious3,\":\"))","v":""},null,null,{"$f":"IF(ISBLANK('Matl Properties'!I20), \"\", 'Matl Properties'!I20)","v":""},{"$f":"IF(AND(ISBLANK(SCM3Prod), ISBLANK(SCM3Plant)), \"\", CONCATENATE(SCM3Prod,\"/\",SCM3Plant))","v":""},null,{"$f":"IF(MDInput=\"Existing Design\", IF(OR(ISBLANK('DryBatchWeights - Existing'!H13), 'DryBatchWeights - Existing'!H13=\"\"), \"\", 'DryBatchWeights - Existing'!H13), IF(OR(ISBLANK('DryBatchWeights - ACI211'!H33), 'DryBatchWeights - ACI211'!H33=\"\"), \"\", 'DryBatchWeights - ACI211'!H33))","v":""},{"$f":"IF(MDInput=\"Existing Design\", IF(OR(ISBLANK('DryBatchWeights - Existing'!K13), 'DryBatchWeights - Existing'!K13=0), \"\", 'DryBatchWeights - Existing'!K13), IF(OR(ISBLANK('DryBatchWeights - ACI211'!K33), 'DryBatchWeights - ACI211'!K33=0), \"\", 'DryBatchWeights - ACI211'!K33))","v":""},null,"","lb","",""]
[null,{"$f":"IF(ISBLANK(Cementitious4), \"\", CONCATENATE(Cementitious4,\":\"))","v":""},null,null,{"$f":"IF(ISBLANK('Matl Properties'!I21), \"\", 'Matl Properties'!I21)","v":""},{"$f":"IF(AND(ISBLANK(SCM4Prod), ISBLANK(SCM4Plant)), \"\",CONCATENATE(SCM4Prod,\"/\",SCM4Plant))","v":""},null,{"$f":"IF(MDInput=\"Existing Design\", IF(OR(ISBLANK('DryBatchWeights - Existing'!H14), 'DryBatchWeights - Existing'!H14=\"\"), \"\", 'DryBatchWeights - Existing'!H14), IF(OR(ISBLANK('DryBatchWeights - ACI211'!H34), 'DryBatchWeights - ACI211'!H34=\"\"), \"\", 'DryBatchWeights - ACI211'!H34))","v":""},{"$f":"IF(MDInput=\"Existing Design\", IF(OR(ISBLANK('DryBatchWeights - Existing'!K14), 'DryBatchWeights - Existing'!K14=0), \"\", 'DryBatchWeights - Existing'!K14), IF(OR(ISBLANK('DryBatchWeights - ACI211'!K34), 'DryBatchWeights - ACI211'!K34=0), \"\", 'DryBatchWeights - ACI211'!K34))","v":""},null,"","lb",{"$f":"IF(K14=\"\", \"\", IF($N$7=\"cu.ft.\", K14*$M$7/27, IF($N$7=\"cu.yd.\", K14*$M$7, \"\")))","v":""},""]
[null,{"$f":"IF(ISBLANK(Cementitious5), \"\", CONCATENATE(Cementitious5,\":\"))","v":""},null,null,{"$f":"IF(ISBLANK('Matl Properties'!I22), \"\", 'Matl Properties'!I22)","v":""},{"$f":"IF(AND(ISBLANK(SCM5Prod), ISBLANK(SCM5Plant)), \"\", CONCATENATE(SCM5Prod,\"/\",SCM5Plant))","v":""},null,{"$f":"IF(MDInput=\"Existing Design\", IF(OR(ISBLANK('DryBatchWeights - Existing'!H15), 'DryBatchWeights - Existing'!H15=\"\"), \"\", 'DryBatchWeights - Existing'!H15), IF(OR(ISBLANK('DryBatchWeights - ACI211'!H35), 'DryBatchWeights - ACI211'!H35=\"\"), \"\", 'DryBatchWeights - ACI211'!H35))","v":""},{"$f":"IF(MDInput=\"Existing Design\", IF(OR(ISBLANK('DryBatchWeights - Existing'!K15), 'DryBatchWeights - Existing'!K15=0), \"\", 'DryBatchWeights - Existing'!K15), IF(OR(ISBLANK('DryBatchWeights - ACI211'!K35), 'DryBatchWeights - ACI211'!K35=0), \"\", 'DryBatchWeights - ACI211'!K35))","v":""},null,"","lb",{"$f":"IF(K15=\"\", \"\", IF($N$7=\"cu.ft.\", K15*$M$7/27, IF($N$7=\"cu.yd.\", K15*$M$7, \"\")))","v":""},""]
[null,{"$f":"IF(ISBLANK(Cementitious6), \"\", CONCATENATE(Cementitious6,\":\"))","v":""},null,null,{"$f":"IF(ISBLANK('Matl Properties'!I23), \"\", 'Matl Properties'!I23)","v":""},{"$f":"IF(AND(ISBLANK(SCM6Prod), ISBLANK(SCM6Plant)), \"\", CONCATENATE(SCM6Prod,\"/\",SCM6Plant))","v":""},null,{"$f":"IF(MDInput=\"Existing Design\", IF(OR(ISBLANK('DryBatchWeights - Existing'!H16), 'DryBatchWeights - Existing'!H16=\"\"), \"\", 'DryBatchWeights - Existing'!H16), IF(OR(ISBLANK('DryBatchWeights - ACI211'!H36), 'DryBatchWeights - ACI211'!H36=\"\"), \"\", 'DryBatchWeights - ACI211'!H36))","v":""},{"$f":"IF(MDInput=\"Existing Design\", IF(OR(ISBLANK('DryBatchWeights - Existing'!K16), 'DryBatchWeights - Existing'!K16=0), \"\", 'DryBatchWeights - Existing'!K16), IF(OR(ISBLANK('DryBatchWeights - ACI211'!K36), 'DryBatchWeights - ACI211'!K36=0), \"\", 'DryBatchWeights - ACI211'!K36))","v":""},null,"","lb","",""]
[null,{"$f":"IF(ISBLANK(Cementitious7), \"\", CONCATENATE(Cementitious7,\":\"))","v":""},null,null,{"$f":"IF(ISBLANK('Matl Properties'!I24), \"\", 'Matl Properties'!I24)","v":""},{"$f":"IF(AND(ISBLANK(SCM7Prod), ISBLANK(SCM7Plant)), \"\", CONCATENATE(SCM7Prod,\"/\",SCM7Plant))","v":""},null,{"$f":"IF(MDInput=\"Existing Design\", IF(OR(ISBLANK('DryBatchWeights - Existing'!H17), 'DryBatchWeights - Existing'!H17=\"\"), \"\", 'DryBatchWeights - Existing'!H17), IF(OR(ISBLANK('DryBatchWeights - ACI211'!H37), 'DryBatchWeights - ACI211'!H37=\"\"), \"\", 'DryBatchWeights - ACI211'!H37))","v":""},{"$f":"IF(MDInput=\"Existing Design\", IF(OR(ISBLANK('DryBatchWeights - Existing'!K17), 'DryBatchWeights - Existing'!K17=0), \"\", 'DryBatchWeights - Existing'!K17), IF(OR(ISBLANK('DryBatchWeights - ACI211'!K37), 'DryBatchWeights - ACI211'!K37=0), \"\", 'DryBatchWeights - ACI211'!K37))","v":""},null,"","lb","",""]
[null,{"$f":"IF(ISBLANK(Cementitious8), \"\", CONCATENATE(Cementitious8,\":\"))","v":""},null,null,{"$f":"IF(ISBLANK('Matl Properties'!I25), \"\", 'Matl Properties'!I25)","v":""},{"$f":"IF(AND(ISBLANK(SCM8Prod), ISBLANK(SCM8Plant)), \"\", CONCATENATE(SCM8Prod,\"/\",SCM8Plant))","v":""},null,{"$f":"IF(MDInput=\"Existing Design\", IF(OR(ISBLANK('DryBatchWeights - Existing'!H18), 'DryBatchWeights - Existing'!H18=\"\"), \"\", 'DryBatchWeights - Existing'!H18), IF(OR(ISBLANK('DryBatchWeights - ACI211'!H38), 'DryBatchWeights - ACI211'!H38=\"\"), \"\", 'DryBatchWeights - ACI211'!H38))","v":""},{"$f":"IF(MDInput=\"Existing Design\", IF(OR(ISBLANK('DryBatchWeights - Existing'!K18), 'DryBatchWeights - Existing'!K18=0), \"\", 'DryBatchWeights - Existing'!K18), IF(OR(ISBLANK('DryBatchWeights - ACI211'!K38), 'DryBatchWeights - ACI211'!K38=0), \"\", 'DryBatchWeights - ACI211'!K38))","v":""},null,"","lb","",""]
[null,{"$f":"IF(ISBLANK(Cementitious9), \"\", CONCATENATE(Cementitious9, \":\"))","v":""},null,null,{"$f":"IF(ISBLANK('Matl Properties'!I26), \"\", 'Matl Properties'!I26)","v":""},{"$f":"IF(AND(ISBLANK(SCM9Prod), ISBLANK(SCM9Plant)), \"\", CONCATENATE(SCM9Prod,\"/\",SCM9Plant))","v":""},null,{"$f":"IF(MDInput=\"Existing Design\", IF(OR(ISBLANK('DryBatchWeights - Existing'!H19), 'DryBatchWeights - Existing'!H19=\"\"), \"\", 'DryBatchWeights - Existing'!H19), IF(OR(ISBLANK('DryBatchWeights - ACI211'!H39), 'DryBatchWeights - ACI211'!H39=\"\"), \"\", 'DryBatchWeights - ACI211'!H39))","v":""},{"$f":"IF(MDInput=\"Existing Design\", IF(OR(ISBLANK('DryBatchWeights - Existing'!K19), 'DryBatchWeights - Existing'!K19=0), \"\", 'DryBatchWeights - Existing'!K19), IF(OR(ISBLANK('DryBatchWeights - ACI211'!K39), 'DryBatchWeights - ACI211'!K39=0), \"\", 'DryBatchWeights - ACI211'!K39))","v":""},null,"","lb","",""]
[null,{"$f":"IF(ISBLANK(Admix1), \"\", CONCATENATE(Admix1, \":\"))","v":""},null,null,{"$f":"IF(ISBLANK(Admix1), \"\", IF(VLOOKUP(Admix1, DATA_Tables!D29:E36, 2)<>0,VLOOKUP(Admix1, DATA_Tables!D29:E36, 2), \"\"))","v":""},{"$f":"IF(AND(ISBLANK(Admix1Prod), ISBLANK(Admix1Name)), \"\", CONCATENATE(Admix1Prod,\"/\",Admix1Name))","v":""},null,{"$f":"IF(MDInput=\"Existing Design\", IF(OR(ISBLANK('DryBatchWeights - Existing'!H20), 'DryBatchWeights - Existing'!H20=\"\"), \"\", 'DryBatchWeights - Existing'!H20), IF(OR(ISBLANK('DryBatchWeights - ACI211'!H40), 'DryBatchWeights - ACI211'!H40=\"\"), \"\", 'DryBatchWeights - ACI211'!H40))","v":""},{"$f":"IF(MDInput=\"Existing Design\", IF(OR(ISBLANK('DryBatchWeights - Existing'!I20), 'DryBatchWeights - Existing'!I20=\"\"), \"\", CONCATENATE(\"(\", ROUND('DryBatchWeights - Existing'!I20/0.00104437934,2), \")\")), IF(OR(ISBLANK('DryBatchWeights - ACI211'!I40), 'DryBatchWeights - ACI211'!I40=\"\"), \"\", CONCATENATE(\"(\", ROUND('DryBatchWeights - ACI211'!I40/0.00104437934,2), \")\")))","v":""},null,"","oz",{"$f":"IFERROR(IF($N$7=\"cu.ft.\", CONCATENATE(\"(\", ROUND(ABS(K20*$M$7/27), 2), \")\"), IF($N$7=\"cu.yd.\", CONCATENATE(\"(\",ROUND(ABS(K20*$M$7), 2),\")\"), \"\")),\"\")","v":""},{"$f":"IF($M$9=\"\", \"\", \"oz\")","v":""}]
[null,{"$f":"IF(ISBLANK(Admix2), \"\", CONCATENATE(Admix2, \":\"))","v":""},null,null,{"$f":"IF(ISBLANK(Admix2), \"\", IF(VLOOKUP(Admix2, DATA_Tables!D29:E36, 2)<>0,VLOOKUP(Admix2, DATA_Tables!D29:E36, 2), \"\"))","v":""},{"$f":"IF(AND(ISBLANK(Admix2Prod), ISBLANK(Admix2Name)), \"\", CONCATENATE(Admix2Prod,\"/\",Admix2Name))","v":""},null,{"$f":"IF(MDInput=\"Existing Design\", IF(OR(ISBLANK('DryBatchWeights - Existing'!H21), 'DryBatchWeights - Existing'!H21=\"\"), \"\", 'DryBatchWeights - Existing'!H21), IF(OR(ISBLANK('DryBatchWeights - ACI211'!H41), 'DryBatchWeights - ACI211'!H41=\"\"), \"\", 'DryBatchWeights - ACI211'!H41))","v":""},{"$f":"IF(MDInput=\"Existing Design\", IF(OR(ISBLANK('DryBatchWeights - Existing'!I21), 'DryBatchWeights - Existing'!I21=\"\"), \"\", CONCATENATE(\"(\", ROUND('DryBatchWeights - Existing'!I21/0.00104437934,2), \")\")), IF(OR(ISBLANK('DryBatchWeights - ACI211'!I41), 'DryBatchWeights - ACI211'!I41=\"\"), \"\", CONCATENATE(\"(\", ROUND('DryBatchWeights - ACI211'!I41/0.00104437934,2), \")\")))","v":""},null,"","oz",{"$f":"IFERROR(IF($N$7=\"cu.ft.\",CONCATENATE(\"(\",ROUND(ABS(K21*$M$7/27),2),\")\"),IF($N$7=\"cu.yd.\",CONCATENATE(\"(\",ROUND(ABS(K21*$M$7),2),\")\"),\"\")),\"\")","v":""},{"$f":"IF($M$9=\"\", \"\", \"oz\")","v":""}]
[null,{"$f":"IF(ISBLANK(Admix3), \"\", CONCATENATE(Admix3,\":\"))","v":""},null,null,{"$f":"IF(ISBLANK(Admix3), \"\", IF(VLOOKUP(Admix3, DATA_Tables!D29:E36, 2)<>0,VLOOKUP(Admix3, DATA_Tables!D29:E36, 2), \"\"))","v":""},{"$f":"IF(AND(ISBLANK(Admix3Prod), ISBLANK(Admix3Name)), \"\", CONCATENATE(Admix3Prod,\"/\",Admix3Name))","v":""},null,{"$f":"IF(MDInput=\"Existing Design\", IF(OR(ISBLANK('DryBatchWeights - Existing'!H22), 'DryBatchWeights - Existing'!H22=\"\"), \"\", 'DryBatchWeights - Existing'!H22), IF(OR(ISBLANK('DryBatchWeights - ACI211'!H42), 'DryBatchWeights - ACI211'!H42=\"\"), \"\", 'DryBatchWeights - ACI211'!H42))","v":""},{"$f":"IF(MDInput=\"Existing Design\", IF(OR(ISBLANK('DryBatchWeights - Existing'!I22), 'DryBatchWeights - Existing'!I22=\"\"), \"\", CONCATENATE(\"(\", ROUND('DryBatchWeights - Existing'!I22/0.00104437934,2), \")\")), IF(OR(ISBLANK('DryBatchWeights - ACI211'!I42), 'DryBatchWeights - ACI211'!I42=\"\"), \"\", CONCATENATE(\"(\", ROUND('DryBatchWeights - ACI211'!I42/0.00104437934,2), \")\")))","v":""},null,"","oz","",""]
[null,{"$f":"IF(ISBLANK(Admix4), \"\", CONCATENATE(Admix4,\":\"))","v":""},null,null,{"$f":"IF(ISBLANK(Admix4), \"\", IF(VLOOKUP(Admix4, DATA_Tables!D29:E36, 2)<>0,VLOOKUP(Admix4, DATA_Tables!D29:E36, 2), \"\"))","v":""},{"$f":"IF(AND(ISBLANK(Admix4Prod), ISBLANK(Admix4Name)), \"\", CONCATENATE(Admix4Prod,\"/\",Admix4Name))","v":""},null,{"$f":"IF(MDInput=\"Existing Design\", IF(OR(ISBLANK('DryBatchWeights - Existing'!H23), 'DryBatchWeights - Existing'!H23=\"\"), \"\", 'DryBatchWeights - Existing'!H23), IF(OR(ISBLANK('DryBatchWeights - ACI211'!H43), 'DryBatchWeights - ACI211'!H43=\"\"), \"\", 'DryBatchWeights - ACI211'!H43))","v":""},{"$f":"IF(MDInput=\"Existing Design\", IF(OR(ISBLANK('DryBatchWeights - Existing'!I23), 'DryBatchWeights - Existing'!I23=\"\"), \"\", CONCATENATE(\"(\", ROUND('DryBatchWeights - Existing'!I23/0.00104437934,2), \")\")), IF(OR(ISBLANK('DryBatchWeights - ACI211'!I43), 'DryBatchWeights - ACI211'!I43=\"\"), \"\", CONCATENATE(\"(\", ROUND('DryBatchWeights - ACI211'!I43/0.00104437934,2), \")\")))","v":""},null,"","oz","",""]
[null,{"$f":"IF(ISBLANK(Admix5), \"\", CONCATENATE(Admix5,\":\"))","v":""},null,null,{"$f":"IF(ISBLANK(Admix5), \"\", IF(VLOOKUP(Admix5, DATA_Tables!D29:E36, 2)<>0,VLOOKUP(Admix5, DATA_Tables!D29:E36, 2), \"\"))","v":""},{"$f":"IF(AND(ISBLANK(Admix5Prod), ISBLANK(Admix5Name)), \"\", CONCATENATE(Admix5Prod,\"/\",Admix5Name))","v":""},null,{"$f":"IF(MDInput=\"Existing Design\", IF(OR(ISBLANK('DryBatchWeights - Existing'!H24), 'DryBatchWeights - Existing'!H24=\"\"), \"\", 'DryBatchWeights - Existing'!H24), IF(OR(ISBLANK('DryBatchWeights - ACI211'!H44), 'DryBatchWeights - ACI211'!H44=\"\"), \"\", 'DryBatchWeights - ACI211'!H44))","v":""},{"$f":"IF(MDInput=\"Existing Design\", IF(OR(ISBLANK('DryBatchWeights - Existing'!I24), 'DryBatchWeights - Existing'!I24=\"\"), \"\", CONCATENATE(\"(\", ROUND('DryBatchWeights - Existing'!I24/0.00104437934,2), \")\")), IF(OR(ISBLANK('DryBatchWeights - ACI211'!I44), 'DryBatchWeights - ACI211'!I44=\"\"), \"\", CONCATENATE(\"(\", ROUND('DryBatchWeights - ACI211'!I44/0.00104437934,2), \")\")))","v":""},null,"","oz","",""]
[null,{"$f":"IF(ISBLANK(Admix6), \"\", CONCATENATE(Admix6,\":\"))","v":""},null,null,{"$f":"IF(ISBLANK(Admix6), \"\", IF(VLOOKUP(Admix6, DATA_Tables!D29:E36, 2)<>0,VLOOKUP(Admix6, DATA_Tables!D29:E36, 2), \"\"))","v":""},{"$f":"IF(AND(ISBLANK(Admix6Prod), ISBLANK(Admix6Name)), \"\", CONCATENATE(Admix6Prod,\"/\",Admix6Name))","v":""},null,{"$f":"IF(MDInput=\"Existing Design\", IF(OR(ISBLANK('DryBatchWeights - Existing'!H25), 'DryBatchWeights - Existing'!H25=\"\"), \"\", 'DryBatchWeights - Existing'!H25), IF(OR(ISBLANK('DryBatchWeights - ACI211'!H45), 'DryBatchWeights - ACI211'!H45=\"\"), \"\", 'DryBatchWeights - ACI211'!H45))","v":""},{"$f":"IF(MDInput=\"Existing Design\", IF(OR(ISBLANK('DryBatchWeights - Existing'!I25), 'DryBatchWeights - Existing'!I25=\"\"), \"\", CONCATENATE(\"(\", ROUND('DryBatchWeights - Existing'!I25/0.00104437934,2), \")\")), IF(OR(ISBLANK('DryBatchWeights - ACI211'!I45), 'DryBatchWeights - ACI211'!I45=\"\"), \"\", CONCATENATE(\"(\", ROUND('DryBatchWeights - ACI211'!I45/0.00104437934,2), \")\")))","v":""},null,"","oz","",""]
[null,{"$f":"IF(ISBLANK(Admix7), \"\", CONCATENATE(Admix7,\":\"))","v":""},null,null,{"$f":"IF(ISBLANK(Admix7), \"\", IF(VLOOKUP(Admix7, DATA_Tables!D29:E36, 2)<>0,VLOOKUP(Admix7, DATA_Tables!D29:E36, 2), \"\"))","v":""},{"$f":"IF(AND(ISBLANK(Admix7Prod), ISBLANK(Admix7Name)), \"\", CONCATENATE(Admix7Prod,\"/\",Admix7Name))","v":""},null,{"$f":"IF(MDInput=\"Existing Design\", IF(OR(ISBLANK('DryBatchWeights - Existing'!H26), 'DryBatchWeights - Existing'!H26=\"\"), \"\", 'DryBatchWeights - Existing'!H26), IF(OR(ISBLANK('DryBatchWeights - ACI211'!H46), 'DryBatchWeights - ACI211'!H46=\"\"), \"\", 'DryBatchWeights - ACI211'!H46))","v":""},{"$f":"IF(MDInput=\"Existing Design\", IF(OR(ISBLANK('DryBatchWeights - Existing'!I26), 'DryBatchWeights - Existing'!I26=\"\"), \"\", CONCATENATE(\"(\", ROUND('DryBatchWeights - Existing'!I26/0.00104437934,2), \")\")), IF(OR(ISBLANK('DryBatchWeights - ACI211'!I46), 'DryBatchWeights - ACI211'!I46=\"\"), \"\", CONCATENATE(\"(\", ROUND('DryBatchWeights - ACI211'!I46/0.00104437934,2), \")\")))","v":""},null,"","oz","",""]
[null,{"$f":"IF(ISBLANK(Admix8), \"\", CONCATENATE(Admix8,\":\"))","v":""},null,null,{"$f":"IF(ISBLANK(Admix8), \"\", IF(VLOOKUP(Admix8, DATA_Tables!D29:E36, 2)<>0,VLOOKUP(Admix8, DATA_Tables!D29:E36, 2), \"\"))","v":""},{"$f":"IF(AND(ISBLANK(Admix8Prod), ISBLANK(Admix8Name)), \"\", CONCATENATE(Admix8Prod,\"/\",Admix8Name))","v":""},null,{"$f":"IF(MDInput=\"Existing Design\", IF(OR(ISBLANK('DryBatchWeights - Existing'!H27), 'DryBatchWeights - Existing'!H27=\"\"), \"\", 'DryBatchWeights - Existing'!H27), IF(OR(ISBLANK('DryBatchWeights - ACI211'!H47), 'DryBatchWeights - ACI211'!H47=\"\"), \"\", 'DryBatchWeights - ACI211'!H47))","v":""},{"$f":"IF(MDInput=\"Existing Design\", IF(OR(ISBLANK('DryBatchWeights - Existing'!I27), 'DryBatchWeights - Existing'!I27=\"\"), \"\", CONCATENATE(\"(\", ROUND('DryBatchWeights - Existing'!I27/0.00104437934,2), \")\")), IF(OR(ISBLANK('DryBatchWeights - ACI211'!I47), 'DryBatchWeights - ACI211'!I47=\"\"), \"\", CONCATENATE(\"(\", ROUND('DryBatchWeights - ACI211'!I47/0.00104437934,2), \")\")))","v":""},null,"","oz","",""]
[null,{"$f":"IF(ISBLANK(Admix9),\"\", CONCATENATE(Admix9,\":\"))","v":""},null,null,{"$f":"IF(ISBLANK(Admix9), \"\", IF(VLOOKUP(Admix9, DATA_Tables!D29:E36, 2)<>0,VLOOKUP(Admix9, DATA_Tables!D29:E36, 2), \"\"))","v":""},{"$f":"IF(AND(ISBLANK(Admix9Prod), ISBLANK(Admix9Name)), \"\", CONCATENATE(Admix9Prod,\"/\",Admix9Name))","v":""},null,{"$f":"IF(MDInput=\"Existing Design\", IF(OR(ISBLANK('DryBatchWeights - Existing'!H28), 'DryBatchWeights - Existing'!H28=\"\"), \"\", 'DryBatchWeights - Existing'!H28), IF(OR(ISBLANK('DryBatchWeights - ACI211'!H48), 'DryBatchWeights - ACI211'!H48=\"\"), \"\", 'DryBatchWeights - ACI211'!H48))","v":""},{"$f":"IF(MDInput=\"Existing Design\", IF(OR(ISBLANK('DryBatchWeights - Existing'!I28), 'DryBatchWeights - Existing'!I28=\"\"), \"\", CONCATENATE(\"(\", ROUND('DryBatchWeights - Existing'!I28/0.00104437934,2), \")\")), IF(OR(ISBLANK('DryBatchWeights - ACI211'!I48), 'DryBatchWeights - ACI211'!I48=\"\"), \"\", CONCATENATE(\"(\", ROUND('DryBatchWeights - ACI211'!I48/0.00104437934,2), \")\")))","v":""},null,"","oz","",""]
[null,"Fibers:",null,null,null,{"$f":"IF(AND(ISBLANK(FiberProd), ISBLANK(FiberName)), \"\",CONCATENATE(FiberProd,\"/\", FiberName))","v":""},null,null,{"$f":"IF(MDInput=\"Existing Design\", IF(OR(ISBLANK('DryBatchWeights - Existing'!K33), 'DryBatchWeights - Existing'!K33=0), \"\", 'DryBatchWeights - Existing'!K33), IF(OR(ISBLANK('DryBatchWeights - ACI211'!K53), 'DryBatchWeights - ACI211'!K53=0), \"\", 'DryBatchWeights - ACI211'!K53))","v":""},null,"","lb","",""]
[null,{"$f":"IF(ISBLANK(OtherMat), \"\", CONCATENATE(OtherMat,\":\"))","v":""},null,null,null,{"$f":"IF(AND(ISBLANK(OtherMatProd), ISBLANK(OtherMatName)), \"\", CONCATENATE(OtherMatProd,\"/\", OtherMatName))","v":""},null,null,{"$f":"IF(MDInput=\"Existing Design\", IF(OR(ISBLANK('DryBatchWeights - Existing'!K34), 'DryBatchWeights - Existing'!K34=0), \"\", 'DryBatchWeights - Existing'!K34), IF(OR(ISBLANK('DryBatchWeights - ACI211'!K54), 'DryBatchWeights - ACI211'!K54=0), \"\", 'DryBatchWeights - ACI211'!K54))","v":""},null,"","lb","",""]
[null,"Coarse Aggregate 1:",null,null,{"$f":"IF(ISBLANK('Matl Properties'!I9),\"\",'Matl Properties'!I9)","v":""},{"$f":"IF(AND(ISBLANK(Agg1Prod), ISBLANK(Agg1Pit)), \"\", CONCATENATE(Agg1Prod,\"/\", Agg1Pit))","v":""},null,{"$f":"IF(MDInput=\"Existing Design\", IF(OptGrade=\"Yes\", IF(OR(ISBLANK('DryBatchWeights - Existing'!H36), 'DryBatchWeights - Existing'!H36=\"\"), \"\", 'DryBatchWeights - Existing'!H36), IF(OR(ISBLANK('DryBatchWeights - Existing'!H43), 'DryBatchWeights - Existing'!H43=\"\"), \"\", 'DryBatchWeights - Existing'!H43)), IF(OptGrade=\"Yes\", IF(OR(ISBLANK('DryBatchWeights - ACI211'!H56), 'DryBatchWeights - ACI211'!H56=\"\"), \"\", 'DryBatchWeights - ACI211'!H56), IF(OR(ISBLANK('DryBatchWeights - ACI211'!H63), 'DryBatchWeights - ACI211'!H63=\"\"), \"\", 'DryBatchWeights - ACI211'!H63)))","v":""},{"$f":"IF(MDInput=\"Existing Design\", IF(OptGrade=\"Yes\", IF(OR(ISBLANK('DryBatchWeights - Existing'!K36), 'DryBatchWeights - Existing'!K36=\"\", 'DryBatchWeights - Existing'!K36=0), \"\", 'DryBatchWeights - Existing'!K36), IF(OR(ISBLANK('DryBatchWeights - Existing'!K43), 'DryBatchWeights - Existing'!K43=\"\", 'DryBatchWeights - Existing'!K43=0), \"\", 'DryBatchWeights - Existing'!K43)), IF(OptGrade=\"Yes\", IF(OR(ISBLANK('DryBatchWeights - ACI211'!K56), 'DryBatchWeights - ACI211'!K56=\"\", 'DryBatchWeights - ACI211'!K56=0), \"\", 'DryBatchWeights - ACI211'!K56), IF(OR(ISBLANK('DryBatchWeights - ACI211'!K63), 'DryBatchWeights - ACI211'!K63=\"\", 'DryBatchWeights - ACI211'!K63=0), \"\", 'DryBatchWeights - ACI211'!K63)))","v":""},null,{"$f":"IF(ISERROR(I31*(1+($D$7/100))/(1+(Agg1Abs/100))), \"\", I31*(1+($D$7/100))/(1+(Agg1Abs/100)))","v":""},"lb",{"$f":"IF(K31=\"\", \"\", IF($N$7=\"cu.ft.\", K31*$M$7/27, IF($N$7=\"cu.yd.\", K31*$M$7, \"\")))","v":""},"",{"$f":"IF(ISNUMBER(K31), I31-K31, 0)","v":0}]
[null,"Coarse Aggregate 2:",null,null,{"$f":"IF(ISBLANK('Matl Properties'!I10),\"\",'Matl Properties'!I10)","v":""},{"$f":"IF(AND(ISBLANK(Agg2Prod), ISBLANK(Agg2Pit)), \"\", CONCATENATE(Agg2Prod,\"/\", Agg2Pit))","v":""},null,{"$f":"IF(MDInput=\"Existing Design\", IF(OptGrade=\"Yes\", IF(OR(ISBLANK('DryBatchWeights - Existing'!H37), 'DryBatchWeights - Existing'!H37=\"\"), \"\", 'DryBatchWeights - Existing'!H37), IF(OR(ISBLANK('DryBatchWeights - Existing'!H44), 'DryBatchWeights - Existing'!H44=\"\"), \"\", 'DryBatchWeights - Existing'!H44)), IF(OptGrade=\"Yes\", IF(OR(ISBLANK('DryBatchWeights - ACI211'!H57), 'DryBatchWeights - ACI211'!H57=\"\"), \"\", 'DryBatchWeights - ACI211'!H57), IF(OR(ISBLANK('DryBatchWeights - ACI211'!H64), 'DryBatchWeights - ACI211'!H64=\"\"), \"\", 'DryBatchWeights - ACI211'!H64)))","v":""},{"$f":"IF(MDInput=\"Existing Design\", IF(OptGrade=\"Yes\", IF(OR(ISBLANK('DryBatchWeights - Existing'!K37), 'DryBatchWeights - Existing'!K37=\"\", 'DryBatchWeights - Existing'!K37=0), \"\", 'DryBatchWeights - Existing'!K37), IF(OR(ISBLANK('DryBatchWeights - Existing'!K44), 'DryBatchWeights - Existing'!K44=\"\", 'DryBatchWeights - Existing'!K44=0), \"\", 'DryBatchWeights - Existing'!K44)), IF(OptGrade=\"Yes\", IF(OR(ISBLANK('DryBatchWeights - ACI211'!K57), 'DryBatchWeights - ACI211'!K57=\"\", 'DryBatchWeights - ACI211'!K57=0), \"\", 'DryBatchWeights - ACI211'!K57), IF(OR(ISBLANK('DryBatchWeights - ACI211'!K64), 'DryBatchWeights - ACI211'!K64=\"\", 'DryBatchWeights - ACI211'!K64=0), \"\", 'DryBatchWeights - ACI211'!K64)))","v":""},null,{"$f":"IF(ISERROR(I32*(1+($E$7/100))/(1+(Agg2Abs/100))), \"\", I32*(1+($E$7/100))/(1+(Agg2Abs/100)))","v":""},"lb","","",0]
[null,"Intermediate Aggregate 1:",null,null,{"$f":"IF(ISBLANK('Matl Properties'!I11),\"\",'Matl Properties'!I11)","v":""},{"$f":"IF(AND(ISBLANK(Agg3Prod), ISBLANK(Agg3Pit)), \"\", CONCATENATE(Agg3Prod,\"/\", Agg3Pit))","v":""},null,{"$f":"IF(MDInput=\"Existing Design\", IF(OptGrade=\"Yes\", IF(OR(ISBLANK('DryBatchWeights - Existing'!H38), 'DryBatchWeights - Existing'!H38=\"\"), \"\", 'DryBatchWeights - Existing'!H38), IF(OR(ISBLANK('DryBatchWeights - Existing'!H45), 'DryBatchWeights - Existing'!H45=\"\"), \"\", 'DryBatchWeights - Existing'!H45)), IF(OptGrade=\"Yes\", IF(OR(ISBLANK('DryBatchWeights - ACI211'!H58), 'DryBatchWeights - ACI211'!H58=\"\"), \"\", 'DryBatchWeights - ACI211'!H58), IF(OR(ISBLANK('DryBatchWeights - ACI211'!H65), 'DryBatchWeights - ACI211'!H65=\"\"), \"\", 'DryBatchWeights - ACI211'!H65)))","v":""},{"$f":"IF(MDInput=\"Existing Design\", IF(OptGrade=\"Yes\", IF(OR(ISBLANK('DryBatchWeights - Existing'!K38), 'DryBatchWeights - Existing'!K38=\"\", 'DryBatchWeights - Existing'!K38=0), \"\", 'DryBatchWeights - Existing'!K38), IF(OR(ISBLANK('DryBatchWeights - Existing'!K45),'DryBatchWeights - Existing'!K45=\"\",  'DryBatchWeights - Existing'!K45=0), \"\", 'DryBatchWeights - Existing'!K45)), IF(OptGrade=\"Yes\", IF(OR(ISBLANK('DryBatchWeights - ACI211'!K58), 'DryBatchWeights - ACI211'!K58=\"\", 'DryBatchWeights - ACI211'!K58=0), \"\", 'DryBatchWeights - ACI211'!K58), IF(OR(ISBLANK('DryBatchWeights - ACI211'!K65),  'DryBatchWeights - ACI211'!K65=\"\", 'DryBatchWeights - ACI211'!K65=0),\"\", 'DryBatchWeights - ACI211'!K65)))","v":""},null,{"$f":"IF(ISERROR(I33*(1+($F$7/100))/(1+(Agg3Abs/100))), \"\", I33*(1+($F$7/100))/(1+(Agg3Abs/100)))","v":""},"lb","","",0]
[null,"Intermediate Aggregate 2:",null,null,{"$f":"IF(ISBLANK('Matl Properties'!I12),\"\",'Matl Properties'!I12)","v":""},{"$f":"IF(AND(ISBLANK(Agg4Prod), ISBLANK(Agg4Pit)), \"\", CONCATENATE(Agg4Prod,\"/\", Agg4Pit))","v":""},null,{"$f":"IF(MDInput=\"Existing Design\", IF(OptGrade=\"Yes\", IF(OR(ISBLANK('DryBatchWeights - Existing'!H39), 'DryBatchWeights - Existing'!H39=\"\"), \"\", 'DryBatchWeights - Existing'!H39), IF(OR(ISBLANK('DryBatchWeights - Existing'!H46), 'DryBatchWeights - Existing'!H46=\"\"), \"\", 'DryBatchWeights - Existing'!H46)), IF(OptGrade=\"Yes\", IF(OR(ISBLANK('DryBatchWeights - ACI211'!H59), 'DryBatchWeights - ACI211'!H59=\"\"), \"\", 'DryBatchWeights - ACI211'!H59), IF(OR(ISBLANK('DryBatchWeights - ACI211'!H66), 'DryBatchWeights - ACI211'!H66=\"\"), \"\", 'DryBatchWeights - ACI211'!H66)))","v":""},{"$f":"IF(MDInput=\"Existing Design\", IF(OptGrade=\"Yes\", IF(OR(ISBLANK('DryBatchWeights - Existing'!K39), 'DryBatchWeights - Existing'!K39=\"\", 'DryBatchWeights - Existing'!K39=0), \"\", 'DryBatchWeights - Existing'!K39), IF(OR(ISBLANK('DryBatchWeights - Existing'!K46),'DryBatchWeights - Existing'!K46=\"\",  'DryBatchWeights - Existing'!K46=0), \"\", 'DryBatchWeights - Existing'!K46)), IF(OptGrade=\"Yes\", IF(OR(ISBLANK('DryBatchWeights - ACI211'!K59), 'DryBatchWeights - ACI211'!K59=\"\", 'DryBatchWeights - ACI211'!K59=0), \"\", 'DryBatchWeights - ACI211'!K59), IF(OR(ISBLANK('DryBatchWeights - ACI211'!K66),  'DryBatchWeights - ACI211'!K66=\"\", 'DryBatchWeights - ACI211'!K66=0), \"\", 'DryBatchWeights - ACI211'!K66)))","v":""},null,{"$f":"IF(ISERROR(I34*(1+($G$7/100))/(1+(Agg4Abs/100))), \"\", I34*(1+($G$7/100))/(1+(Agg4Abs/100)))","v":""},"lb","","",0]
[null,"Fine Aggregate 1:",null,null,null,{"$f":"IF(AND(ISBLANK(Agg5Prod), ISBLANK(Agg5Pit)), \"\", CONCATENATE(Agg5Prod,\"/\", Agg5Pit))","v":""},null,{"$f":"IF(MDInput=\"Existing Design\", IF(OptGrade=\"Yes\", IF(OR(ISBLANK('DryBatchWeights - Existing'!H40), 'DryBatchWeights - Existing'!H40=\"\"), \"\", 'DryBatchWeights - Existing'!H40), IF(OR(ISBLANK('DryBatchWeights - Existing'!H47), 'DryBatchWeights - Existing'!H47=\"\"), \"\", 'DryBatchWeights - Existing'!H47)), IF(OptGrade=\"Yes\", IF(OR(ISBLANK('DryBatchWeights - ACI211'!H60), 'DryBatchWeights - ACI211'!H60=\"\"), \"\", 'DryBatchWeights - ACI211'!H60), IF(OR(ISBLANK('DryBatchWeights - ACI211'!H67), 'DryBatchWeights - ACI211'!H67=\"\"), \"\", 'DryBatchWeights - ACI211'!H67)))","v":""},{"$f":"IF(MDInput=\"Existing Design\", IF(OptGrade=\"Yes\", IF(OR(ISBLANK('DryBatchWeights - Existing'!K40), 'DryBatchWeights - Existing'!K40=\"\", 'DryBatchWeights - Existing'!K40=0),\"\", 'DryBatchWeights - Existing'!K40), IF(OR(ISBLANK('DryBatchWeights - Existing'!K47),'DryBatchWeights - Existing'!K47=\"\",  'DryBatchWeights - Existing'!K47=0), \"\", 'DryBatchWeights - Existing'!K47)), IF(OptGrade=\"Yes\", IF(OR(ISBLANK('DryBatchWeights - ACI211'!K60), 'DryBatchWeights - ACI211'!K60=\"\", 'DryBatchWeights - ACI211'!K60=0),\"\", 'DryBatchWeights - ACI211'!K60), IF(OR(ISBLANK('DryBatchWeights - ACI211'!K67),  'DryBatchWeights - ACI211'!K67=\"\", 'DryBatchWeights - ACI211'!K67=0), \"\", 'DryBatchWeights - ACI211'!K67)))","v":""},null,{"$f":"IF(ISERROR(I35*(1+($H$7/100))/(1+(Agg5Abs/100))), \"\", I35*(1+($H$7/100))/(1+(Agg5Abs/100)))","v":""},"lb","","",0]
[null,{"$f":"IF(Field24=\"Yes\", \"Lightweight Aggregate:\", \"Fine Aggregate 2:\")","v":"Fine Aggregate 2:"},null,null,null,{"$f":"IF(AND(ISBLANK(Agg6Prod), ISBLANK(Agg6Pit)), \"\", CONCATENATE(Agg6Prod,\"/\", Agg6Pit))","v":""},null,{"$f":"IF(MDInput=\"Existing Design\", IF(OptGrade=\"Yes\", IF(OR(ISBLANK('DryBatchWeights - Existing'!H41), 'DryBatchWeights - Existing'!H41=\"\"), \"\", 'DryBatchWeights - Existing'!H41), IF(OR(ISBLANK('DryBatchWeights - Existing'!H48), 'DryBatchWeights - Existing'!H48=\"\"), \"\", 'DryBatchWeights - Existing'!H48)), IF(OptGrade=\"Yes\", IF(OR(ISBLANK('DryBatchWeights - ACI211'!H61), 'DryBatchWeights - ACI211'!H61=\"\"), \"\", 'DryBatchWeights - ACI211'!H61), IF(OR(ISBLANK('DryBatchWeights - ACI211'!H68), 'DryBatchWeights - ACI211'!H68=\"\"), \"\", 'DryBatchWeights - ACI211'!H68)))","v":""},{"$f":"IF(MDInput=\"Existing Design\", IF(OptGrade=\"Yes\", IF(OR(ISBLANK('DryBatchWeights - Existing'!K41), 'DryBatchWeights - Existing'!K41=\"\", 'DryBatchWeights - Existing'!K41=0), \"\", 'DryBatchWeights - Existing'!K41), IF(OR(ISBLANK('DryBatchWeights - Existing'!K48),'DryBatchWeights - Existing'!K48=\"\",  'DryBatchWeights - Existing'!K48=0), \"\", 'DryBatchWeights - Existing'!K48)), IF(OptGrade=\"Yes\", IF(OR(ISBLANK('DryBatchWeights - ACI211'!K61), 'DryBatchWeights - ACI211'!K61=\"\", 'DryBatchWeights - ACI211'!K61=0), \"\", 'DryBatchWeights - ACI211'!K61), IF(OR(ISBLANK('DryBatchWeights - ACI211'!K68),  'DryBatchWeights - ACI211'!K68=\"\", 'DryBatchWeights - ACI211'!K68=0), \"\", 'DryBatchWeights - ACI211'!K68)))","v":""},null,{"$f":"IF(ISERROR(I36*(1+($I$7/100))/(1+(Agg6Abs/100))), \"\", I36*(1+($I$7/100))/(1+(Agg6Abs/100)))","v":""},"lb","","",0]
[null,"*Admixture dosages in fl.oz/100 lb. cementitious material"]

{"sheet":"Trial Batch Results","index":10,"n_rows":73,"n_cols":13,"rows_kept":73,"cut":false,"hidden":true,"merged":[[16,2,16,3],[16,6,16,7],[70,1,71,7],[7,6,7,8],[8,6,8,8],[9,6,9,8],[10,6,10,8],[11,6,11,8],[12,6,12,8],[13,6,13,8],[14,6,14,8],[17,2,17,3],[17,6,17,7],[18,6,18,7],[19,6,19,7],[21,1,21,4],[21,6,21,9],[22,1,22,4],[22,6,22,9],[23,1,23,3],[23,6,23,8],[24,1,24,3],[24,6,24,8],[29,1,29,12],[30,4,30,6],[31,4,31,6],[32,1,32,12],[25,1,25,3],[25,6,25,8],[26,1,26,3],[26,6,26,8],[27,1,27,3],[27,6,27,8],[35,3,37,3],[35,8,35,9],[35,12,37,12],[36,8,36,9],[37,8,37,9],[38,3,40,3],[38,8,38,9],[44,3,46,3],[44,8,44,9],[38,12,40,12],[39,8,39,9],[40,8,40,9],[41,3,43,3],[41,8,41,9],[41,12,43,12],[42,8,42,9],[43,8,43,9],[44,12,46,12],[45,8,45,9],[46,8,46,9],[57,1,57,11],[59,1,59,11],[47,1,49,9],[47,10,47,11],[48,10,48,11],[49,10,49,11],[60,2,61,2],[60,3,61,3],[60,4,61,4],[60,5,61,5],[60,6,61,6],[60,8,61,9],[60,10,61,10],[60,11,61,11],[62,3,63,3],[62,8,62,9],[62,11,63,11],[63,8,63,9],[68,3,69,3],[68,8,68,9],[68,11,69,11],[69,8,69,9],[64,3,65,3],[64,8,64,9],[64,11,65,11],[65,8,65,9],[66,3,67,3],[66,8,66,9],[66,11,67,11],[67,8,67,9]]}
[]
[null,"TEXAS DEPARTMENT OF TRANSPORTATION"]
[null,"HYDRAULIC CEMENT CONCRETE MIX DESIGN & CONTROL"]
[null,"Trial Batch Results"]
[]
[null,null,null,"Are these results for SCC?"]
[]
[null,"Test",null,null,"Test Method","Result","Acceptable?"]
[null,null,null,"Slump Flow for Precast Concrete:","ASTM C1611",null,{"$f":"IF(F9=\"\", \"\", IF(AND(F9>=22,F9<=27),\"Yes\",\"No. Requires Engineer approval.\"))","v":""}]
[null,null,null,"Slump Flow for Drilled Shafts:","ASTM C1611",null,{"$f":"IF(F10=\"\",\"\",IF(AND(F10>=19,F10<=24),\"Yes\",\"No. Requires Engineer approval.\"))","v":""}]
[null,null,null,"T50, sec:","ASTM C1611",null,{"$f":"IF(F11=\"\", \"\", IF(AND(F11>=2, F11<=7), \"Yes\", \"No\"))","v":""}]
[null,null,null,"VSI Rating:","ASTM C1611",null,{"$f":"IF(F12=\"\", \"\", IF(AND(F12>=0, F12<=1), \"Yes\", \"No\"))","v":""}]
[null,null,null,"Passing Ability, in.:","ASTM C1621",null,{"$f":"IF(F13=\"\", \"\", IF(F13<=2, \"Yes\", \"No\"))","v":""}]
[null,null,null,"Segregation Column, %:","ASTM C1610",null,{"$f":"IF(F14=\"\", \"\", IF(F14<=10, \"Yes\", \"No\"))","v":""}]
[null,null,null,"Bleeding, %:","ASTM C232",null,{"$f":"IF(F15=\"\", \"\", IF(F15<=2.5, \"Yes\", \"No\"))","v":""}]
[]
[null,null,"Slump",null,null,null,"Temperature"]
[null,null,"Tex-415-A (ASTM C143)",null,null,null,"Tex-422-A (ASTM C1064)"]
[null,null,"Design Slump, in.","Trial Batch Slump, in.",null,null,"Temperature, °F"]
[null,null,{"$f":"IF(MDInput=\"Existing Design\", IF(OR(ISBLANK(DesignSlump), DesignSlump=\"\"), \"No slump entered.\", DesignSlump), IF(OR(ISBLANK(ACI211TargetSlump), ACI211TargetSlump=\"\"), \"No slump entered.\", ACI211TargetSlump))","v":"No slump entered."}]
[]
[null,"Air Content",null,null,null,null,"Unit Weight"]
[null,null,null,null,null,null,"Tex-417-A (ASTM C138)"]
[null,"Design Air, %:",null,null,0,null,"Design Unit Weight, lb/cu.ft.:",null,null,{"$f":"IF(AND('DryBatchWeights - ACI211'!K69=0, 'DryBatchWeights - Existing'!K49=0), \"\", IF(MDInput=\"Existing Design\", 'DryBatchWeights - Existing'!K49/'DryBatchWeights - Existing'!I50, 'DryBatchWeights - ACI211'!K69/27))","v":""}]
[null,{"$f":"IF(B23=\"\", \"\", IF(B23=\"Tex-414-A (ASTM C173)\", \"Water Level Reading, %:\", \"Uncorrected Air Content, %:\"))","v":""},null,null,null,null,"Mass of bucket, lb.:"]
[null,{"$f":"IF(B23=\"\",\"\",IF(B23=\"Tex-414-A (ASTM C173)\",\"*Calibrated Cups of Water, Cups:\",\"Agg. Correction Factor, %:\"))","v":""},null,null,null,null,"Volumn of bucket, cu.ft.:"]
[null,{"$f":"IF(B23=\"\", \"\", IF(B23=\"Tex-414-A (ASTM C173)\", \"Amt. of Isopropyl Alcohol, Pints:\", \"\"))","v":""},null,null,null,null,"Mass of concrete filled bucket, lb.:"]
[null,{"$f":"IF(B23=\"\", \"\", IF(B23=\"Tex-414-A (ASTM C173)\", \"Air Content, %\", \"Corrected Air Content, %:\"))","v":""},null,null,{"$f":"IF(ISERROR(IF(B23=\"Tex-414-A (ASTM C173)\",ROUND(((E25+E26-VLOOKUP(ROUND(E27,0),DATA_Tables!G29:J33,4))/25),2)*25,ROUND(E25-E26,1))),\"\",IF(B23:E23=\"Tex-414-A (ASTM C173)\",ROUND(((E25+E26-VLOOKUP(ROUND(E27,0),DATA_Tables!G29:J33,4))/25),2)*25,ROUND(E25-E26,1)))","v":0},null,"Unit Weight of concrete, lb/cu.ft.:",null,null,{"$f":"IF(ISERROR((J27-J25)/J26), \"\", (J27-J25)/J26)","v":""}]
[null,{"$f":"IF(B23=\"Tex-414-A (ASTM C173)\",\"* Only necessary if the air content is greater than the 9% range of the meter.\",\"\")","v":""}]
[null,"Compressive Strength"]
[null,null,null,null,"Minimum 28-day Design Strength, psi:",null,null,{"$f":"IF(AND(SpecDesignStrength=\"\",MinDesignStrength=\"Note 8\"),\"No Strength Input\",IF(AND(ISNUMBER(SpecDesignStrength),ISNUMBER(MinDesignStrength)),IF(SpecDesignStrength>MinDesignStrength,SpecDesignStrength,MinDesignStrength),IF(ISNUMBER(SpecDesignStrength),SpecDesignStrength,MinDesignStrength)))","v":""}]
[null,null,null,null,"Minimum 28-day Target Strength, psi:"]
[null,"Test Method Tex-418-A (ASTM C39)"]
[]
[null,null,"Cylinder Number","Age","Diameter of Cylinder","Length of Cylinder,\nin.","Length to Diameter Ratio","Maximum Load,\nlbs.","Failure Type",null,"Correction Factor","Compressive Strength,\npsi","Average Compressive Strength,\npsi"]
[null,1,null,null,null,null,{"$f":"IF(ISERROR((F36/E36)),\"\",(F36/E36))","v":""},null,null,null,{"$f":"IF(G36=\"\",\"\",IF(G36<1,\"CHK SIZES\",IF(G36>2.1,1,VLOOKUP(G36,DATA_Tables!N2:O112,2))))","v":""},{"$f":"IF(G36=\"\",\"\",ROUND(K36*(H36/(0.7854*E36*E36)),-1))","v":""},{"$f":"IF(AND(L36=\"\", L37=\"\", L38=\"\"), \"\", ROUND(AVERAGE(L36:L38), -1))","v":""}]
[null,2,null,null,null,null,{"$f":"IF(ISERROR((F37/E37)),\"\",(F37/E37))","v":""},null,null,null,{"$f":"IF(G37=\"\",\"\",IF(G37<1,\"CHK SIZES\",IF(G37>2.1,1,VLOOKUP(G37,DATA_Tables!N3:O113,2))))","v":""},{"$f":"IF(G37=\"\",\"\",ROUND(K37*(H37/(0.7854*E37*E37)),-1))","v":""}]
[null,3,null,null,null,null,"",null,null,null,{"$f":"IF(G38=\"\",\"\",IF(G38<1,\"CHK SIZES\",IF(G38>2.1,1,VLOOKUP(G38,DATA_Tables!N4:O114,2))))","v":""},""]
[null,4,null,null,null,null,"",null,null,null,{"$f":"IF(G39=\"\",\"\",IF(G39<1,\"CHK SIZES\",IF(G39>2.1,1,VLOOKUP(G39,DATA_Tables!N5:O115,2))))","v":""},"",{"$f":"IF(AND(L39=\"\", L40=\"\", L41=\"\"), \"\", ROUND(AVERAGE(L39:L41), -1))","v":""}]
[null,5,null,null,null,null,"",null,null,null,{"$f":"IF(G40=\"\",\"\",IF(G40<1,\"CHK SIZES\",IF(G40>2.1,1,VLOOKUP(G40,DATA_Tables!N6:O116,2))))","v":""},""]
[null,6,null,null,null,null,"",null,null,null,{"$f":"IF(G41=\"\",\"\",IF(G41<1,\"CHK SIZES\",IF(G41>2.1,1,VLOOKUP(G41,DATA_Tables!N7:O117,2))))","v":""},""]
[null,7,null,"7-Day",null,null,"",null,null,null,{"$f":"IF(G42=\"\",\"\",IF(G42<1,\"CHK SIZES\",IF(G42>2.1,1,VLOOKUP(G42,DATA_Tables!N8:O118,2))))","v":""},"",{"$f":"IF(AND(L42=\"\", L43=\"\", L44=\"\"), \"\", ROUND(AVERAGE(L42:L44), -1))","v":""}]
[null,8,null,null,null,null,"",null,null,null,{"$f":"IF(G43=\"\",\"\",IF(G43<1,\"CHK SIZES\",IF(G43>2.1,1,VLOOKUP(G43,DATA_Tables!N9:O119,2))))","v":""},""]
[null,9,null,null,null,null,"",null,null,null,{"$f":"IF(G44=\"\",\"\",IF(G44<1,\"CHK SIZES\",IF(G44>2.1,1,VLOOKUP(G44,DATA_Tables!N10:O120,2))))","v":""},""]
[null,10,null,"28-Day",null,null,"",null,null,null,{"$f":"IF(G45=\"\",\"\",IF(G45<1,\"CHK SIZES\",IF(G45>2.1,1,VLOOKUP(G45,DATA_Tables!N11:O121,2))))","v":""},"",{"$f":"IF(AND(L45=\"\", L46=\"\", L47=\"\"), \"\", ROUND(AVERAGE(L45:L47), -1))","v":""}]
[null,11,null,null,null,null,"",null,null,null,{"$f":"IF(G46=\"\",\"\",IF(G46<1,\"CHK SIZES\",IF(G46>2.1,1,VLOOKUP(G46,DATA_Tables!N12:O122,2))))","v":""},""]
[null,12,null,null,null,null,"",null,null,null,{"$f":"IF(G47=\"\",\"\",IF(G47<1,\"CHK SIZES\",IF(G47>2.1,1,VLOOKUP(G47,DATA_Tables!N13:O123,2))))","v":""},""]
[null,"Note: Item 421 only requires one set of design strength specimens, consisting of two specimens per set, at 7-day, 28-day, and at least one additional age. Additional age and additional specimen per age are optional.",null,null,null,null,null,null,null,null,{"$f":"IF(M36=\"\", \"\", CONCATENATE(D36, \"-day Target Value:\"))","v":""},null,{"$f":"IF(ISERROR(H31*M36/M45), \"\", ROUND(H31*M36/M45, -1))","v":""}]
[null,null,null,null,null,null,null,null,null,null,{"$f":"IF(M39=\"\", \"\", CONCATENATE(D39, \"-day Target Value:\"))","v":""},null,{"$f":"IF(ISERROR(H31*M39/M45), \"\", ROUND(H31*M39/M45, -1))","v":""}]
[null,null,null,null,null,null,null,null,null,null,"7-day Target Value:",null,{"$f":"IF(ISERROR(H31*M42/M45), \"\", ROUND(H31*M42/M45, -1))","v":""}]
[]
[]
[]
[]
[]
[]
[]
[null,"Flexural Strength"]
[null,null,null,null,null,null,"Minimum 28-day Flexural Strength, psi:",570]
[null,"Tex-448-A"]
[null,null,"Beam Number","Age,\nDays","Width of Beam,\nin.","Depth of Beam,\nin.","Span Length,\nin.","Max Recording,","*Failure Location,\nin.",null,"Modulus of Rupture,\npsi","Average Modulus of Rupture,\npsi"]
[]
[null,1,null,null,null,null,{"$f":"IF(E63=\"\", \"\", 18)","v":""},null,null,null,{"$f":"IF(ISERROR(IF(I63>(G63*0.05),\"RETEST\",IF($H$62=\"(lbs)\",IF(I63=0,((H63*G63)/(E63*F63^2)),(3*H63*I63)/(E63*F63^2)),IF(I63=0,(((H63*6^3/G63)*G63)/(E63*F63^2)),(3*(H63*6^3/G63)*(G63/3-I63))/(E63*F63^2))))),\"\",IF(I63>(G63*0.05),\"RETEST\",IF(H62=\"(lbs)\",IF(I63=0,((H63*G63)/(E63*F63^2)),(3*H63*I63)/(E63*F63^2)),IF(I63=0,(((H63*6^3/G63)*G63)/(E63*F63^2)),(3*(H63*6^3/G63)*(G63/3-I63))/(E63*F63^2)))))","v":""},{"$f":"IF(AND(K63=\"\", K64=\"\"), \"\", ROUND(AVERAGE(K63:K64), -1))","v":""}]
[null,2,null,null,null,null,{"$f":"IF(E64=\"\", \"\", 18)","v":""},null,null,null,{"$f":"IF(ISERROR(IF(I64>(G64*0.05),\"RETEST\",IF($H$62=\"(lbs)\",IF(I64=0,((H64*G64)/(E64*F64^2)),(3*H64*I64)/(E64*F64^2)),IF(I64=0,(((H64*6^3/G64)*G64)/(E64*F64^2)),(3*(H64*6^3/G64)*(G64/3-I64))/(E64*F64^2))))),\"\",IF(I64>(G64*0.05),\"RETEST\",IF(H63=\"(lbs)\",IF(I64=0,((H64*G64)/(E64*F64^2)),(3*H64*I64)/(E64*F64^2)),IF(I64=0,(((H64*6^3/G64)*G64)/(E64*F64^2)),(3*(H64*6^3/G64)*(G64/3-I64))/(E64*F64^2)))))","v":""}]
[null,3,null,null,null,null,"",null,null,null,"",{"$f":"IF(AND(K65=\"\", K66=\"\"), \"\", ROUND(AVERAGE(K65:K66), -1))","v":""}]
[null,4,null,null,null,null,"",null,null,null,""]
[null,5,null,"7-Day",null,null,"",null,null,null,"",{"$f":"IF(AND(K67=\"\", K68=\"\"), \"\", ROUND(AVERAGE(K67:K68), -1))","v":""}]
[null,6,null,null,null,null,"",null,null,null,""]
[null,7,null,"28-Day",null,null,"",null,null,null,"",{"$f":"IF(AND(K69=\"\", K70=\"\"), \"\", ROUND(AVERAGE(K69:K70), -1))","v":""}]
[null,8,null,null,null,null,"",null,null,null,""]
[null,"* When outside the middel 1/3, distance from the line of the fracture to the nearest support measured on the tension surface of the beam.",null,null,null,null,null,null,null,null,{"$f":"IF(L63=\"\", \"\", CONCATENATE(Field405, \"-day Target Value:\"))","v":""},{"$f":"IF(ISERROR(H59*L63/L69), \"\", ROUND(H59*L63/L69, -1))","v":""}]
[null,null,null,null,null,null,null,null,null,null,{"$f":"IF(L65=\"\", \"\", CONCATENATE(Field416, \"-day Target Value:\"))","v":""},{"$f":"IF(ISERROR(H59*L65/L69), \"\", ROUND(H59*L65/L69, -1))","v":""}]
[null,null,null,null,null,null,null,null,null,null,"7-day Target Value:",{"$f":"IF(ISERROR(H59*L67/L69), \"\", ROUND(H59*L67/L69, -1))","v":""}]

{"sheet":"DATA_Lists","index":11,"n_rows":46,"n_cols":24,"rows_kept":46,"cut":false,"hidden":true,"merged":[]}
["Concrete Classes",null,null,null,null,null,"Concrete Class on Plans",null,"CAG 1","CAG 2","CAG 3","CAG 4","CAG 5","CAG 6","CAG 7","CAG 8","CAG 9","CAG 10","Class CAG",null,null,null,null,{"$f":"IF((AND(SUMIF(I14:I27,\"Fly Ash - C\",EDSCMOnly)=CAsh,SUMIF(I14:I27,\"Fly Ash - F\",EDSCMOnly)=FAsh,SUMIF(I14:I27,\"MFFA\",EDSCMOnly)=Slag,SUMIF(I14:I27,\"Slag Cement\",EDSCMOnly)=MFFA,SUMIF(I14:I27,\"UFFA\",EDSCMOnly)=UFFA,SUMIF(I14:I27,\"Metakaolin\",EDSCMOnly)=MK,SUMIF(I14:I27,\"Silica Fume\",EDSCMOnly)=SF)=TRUE),MDOCheck,\"The SCM proportions listed in this mix design do not match the proportions listed in the Air Entrainment and Mix Design Options sheet.\")","v":"Mix design option not selected."}]
["Class A",null,null,null,null,null,{"$f":"IF(Class=\"Class X (HPC)\", CONCATENATE(A2, \" (HPC)\"), IF(Class=\"Class X (SRC)\", CONCATENATE(A2, \" (SRC)\"), \"\"))","v":""},null,"Grade 1","Grade 2","Grade 1","Grade 2","Grade 3","Grade 2","Grade 6","Grade 6","Grade 4","Note 8",{"$f":"IF(OR(ISBLANK(SpecYear), SpecYear=2024), \"Grade 1\", \"\")","v":"Grade 1"}]
["Class B",null,null,null,null,null,"",null,"Grade 2","Grade 3","Grade 2","Grade 3","Grade 4","Grade 3",null,"Grade 7","Grade 5",null,{"$f":"IF(OR(ISBLANK(SpecYear), SpecYear=2024), \"Grade 2\", \"\")","v":"Grade 2"}]
["Class C",null,null,null,null,null,"",null,"Grade 3","Grade 4","Grade 3","Grade 4","Grade 5",null,null,"Grade 8","Grade 6",null,{"$f":"IF(OR(ISBLANK(SpecYear), SpecYear=2024), \"Grade 3\", \"\")","v":"Grade 3"}]
["Class CO",null,null,null,null,null,"",null,"Grade 4","Grade 5","Grade 4","Grade 5","Grade 6",null,null,null,null,null,{"$f":"IF(OR(ISBLANK(SpecYear), SpecYear=2024), \"Grade 4\", \"\")","v":"Grade 4"}]
["Class E",null,null,null,null,null,"",null,"Grade 8","Grade 6","Grade 5",null,null,null,null,null,null,null,{"$f":"IF(OR(ISBLANK(SpecYear), SpecYear=2024), \"Grade 5\", \"\")","v":"Grade 5"}]
["Class F",null,null,null,null,null,"",null,null,"Grade 7","Grade 6",null,null,null,null,null,null,null,{"$f":"IF(OR(ISBLANK(SpecYear), SpecYear=2024), \"Grade 6\", \"\")","v":"Grade 6"}]
["Class H",null,null,null,null,null,"",null,null,null,null,null,null,null,null,null,null,null,{"$f":"IF(OR(ISBLANK(SpecYear), SpecYear=2024), \"Grade 7\", \"\")","v":"Grade 7"}]
["Class HES",null,null,null,null,null,"",null,null,null,null,null,null,null,null,null,null,null,{"$f":"IF(OR(ISBLANK(SpecYear), SpecYear=2024), \"Grade 8\", \"\")","v":"Grade 8"}]
["Class K",null,null,null,null,null,""]
["Class LMC",null,null,null,null,null,"",null,"CT 1","CT 2","CT 2*","CT 3","CT 3*","CT 4","CT 5","CT 5*","Class CT","Cement Type"]
["Class P",null,null,null,null,null,"",null,"Type I","Type I","Type I","Type I","Type I","Type I","Type IP","Type IL",{"$f":"IF(OR(Class=\"Class A\",Class=\"Class B\",Class=\"Class E\",Class=\"Class P\"),IF(ISBLANK(I12),\"\",I12),IF(OR(Class=\"Class C\",Class=\"Class F\",Class=\"Class S\",Class=\"Class CO\",Class=\"Class LMC\",Class=\"Class SS\"),IF(ISBLANK(J12),\"\",J12),IF(OR(Class=\"Class H\",Class=\"Class K\",Class=\"Class X (HPC)\"),IF(ISBLANK(M12),\"\",M12),IF(Class=\"Class HES\",IF(ISBLANK(N12),\"\",N12),IF(Class=\"Class X (SRC)\",IF(ISBLANK(O12),\"\",O12),\"\")))))","v":""},{"$f":"IF(OR(ISBLANK(SpecYear), SpecYear=2024), \"Type I\", \"\")","v":"Type I"}]
["Class S",null,null,null,null,null,"",null,"Type IL","Type IP","Type IL","Type IP","Type IL","Type IL","Type IS","Type IP","",{"$f":"IF(OR(ISBLANK(SpecYear),SpecYear=2024),\"Type IL\",\"\")","v":"Type IL"}]
["Class SS",null,null,null,null,null,"",null,"Type IP","Type IS","Type IP","Type IS","Type IP","Type I/II","Type IT","Type IS","",{"$f":"IF(OR(ISBLANK(SpecYear),SpecYear=2024),IF(Class=\"Class X (SRC)\",\"Type IL (MS)\",IF(Class=\"Class HES\",\"Type I/II\",\"Type IP\")),\"\")","v":"Type IP"}]
["Class X (HPC)",null,null,null,null,null,null,null,"Type IS","Type IT","Type IS","Type IT","Type IS","Type II","Type I/II","Type IT","",{"$f":"IF(OR(ISBLANK(SpecYear),SpecYear=2024),IF(Class=\"Class X (SRC)\",\"Type IL (HS)\",IF(Class=\"Class HES\",\"Type II\",\"Type IS\")),\"\")","v":"Type IS"}]
["Class X (SRC)",null,null,null,null,null,"Cementitious Materials",{"$f":"\"\"","v":""},"Type IT","Type I/II","Type IT","Type I/II","Type IT","Type III","Type II","Type I/II","",{"$f":"IF(OR(ISBLANK(SpecYear),SpecYear=2024),IF(Class=\"Class X (SRC)\",\"Type IP\",IF(Class=\"Class HES\",\"Type III\",\"Type IT\")),\"\")","v":"Type IT"}]
[null,null,null,null,null,null,"Hydraulic cement",{"$f":"\"\"","v":""},"Type I/II","Type II","Type I/II","Type II","Type I/II","Other","Type V","Type II","",{"$f":"IF(OR(ISBLANK(SpecYear),SpecYear=2024),IF(Class=\"Class X (SRC)\",\"Type IS\",IF(Class=\"Class HES\",\"\",\"Type I/II\")),\"\")","v":"Type I/II"}]
["Testing Requirements",null,null,"To Air&MixDesign sheet",null,{"$f":"\"\"","v":""},"Coal Ash",{"$f":"\"\"","v":""},"Type II","Type V","Type II","Type III","Type II",null,"Other","Type V","",{"$f":"IF(OR(ISBLANK(SpecYear),SpecYear=2024),IF(Class=\"Class X (SRC)\",\"Type IT (MS)\",IF(Class=\"Class HES\",\"\",\"Type II\")),\"\")","v":"Type II"}]
["■   Determine the dosage of SCMs needed to limit the 14-day expansion of each aggrgate to 0.10% when tested individually in accordance with ASTM C 1567.",null,null,{"$f":"IF(OR(ISBLANK(SpecYear),SpecYear=2024),A19,\"\")","v":"■   Determine the dosage of SCMs needed to limit the 14-day expansion of each aggrgate to 0.10% when tested individually in accordance with ASTM C 1567."},null,{"$f":"\"\"","v":""},null,{"$f":"\"\"","v":""},"Type V",null,"Type V","Type V","Type III",null,null,"Other","",{"$f":"IF(OR(ISBLANK(SpecYear),SpecYear=2024),IF(Class=\"Class X (SRC)\",\"Type IT (HS)\",IF(Class=\"Class HES\",\"\",IF(OR(Class=\"Class H\",Class=\"Class K\",Class=\"Class X (HPC)\"),\"Type III\",\"Type V\"))),\"\")","v":"Type V"}]
["■   Determine the dosage of SCMs needed to limit the 14-day expansion of coarse and intermediate aggregate to 0.10% when tested individually in accordance with ASTM C 1567.",null,null,{"$f":"IF(OR(ISBLANK(SpecYear),SpecYear=2024),A20,\"\")","v":"■   Determine the dosage of SCMs needed to limit the 14-day expansion of coarse and intermediate aggregate to 0.10% when tested individually in accordance with ASTM C 1567."},null,{"$f":"\"\"","v":""},"Slag cement",{"$f":"\"\"","v":""},null,null,null,null,"Type V",null,null,null,"",{"$f":"IF(OR(ISBLANK(SpecYear),SpecYear=2024),IF(Class=\"Class X (SRC)\",\"Type I/II\",IF(OR(Class=\"Class H\",Class=\"Class K\",Class=\"Class X (HPC)\"),\"Type V\",\"\")),\"\")","v":""}]
["■   Determine the dosage of SCMs needed to limit the 14-day expansion of each fine aggregate to 0.10% when tested in accordance with ASTM C 1567.",null,null,{"$f":"IF(OR(ISBLANK(SpecYear),SpecYear=2024),A21,\"\")","v":"■   Determine the dosage of SCMs needed to limit the 14-day expansion of each fine aggregate to 0.10% when tested in accordance with ASTM C 1567."},null,{"$f":"\"\"","v":""},"Silica fume",{"$f":"\"\"","v":""},null,null,null,null,null,null,null,null,null,{"$f":"IF(OR(ISBLANK(SpecYear),SpecYear=2024),IF(Class=\"Class X (SRC)\",\"Type II\",\"\"),\"\")","v":""}]
[null,null,null,null,null,null,"UFFA",{"$f":"\"\"","v":""},null,null,null,null,null,null,null,null,null,{"$f":"IF(OR(ISBLANK(SpecYear),SpecYear=2024),IF(Class=\"Class X (SRC)\",\"Type III\",\"\"),\"\")","v":""}]
["Prescriptive Mix Design Options",null,null,"To Air&MixDesign Sheet",null,{"$f":"\"\"","v":""},"MFFA",{"$f":"\"\"","v":""},null,null,null,null,null,null,null,null,null,{"$f":"IF(OR(ISBLANK(SpecYear), SpecYear=2024), IF(Class=\"Class X (SRC)\", \"Type III (MS)\", \"\"), \"\")","v":""}]
["No prescriptive mix design options available. Select \"Testing Requirements\".",null,null,{"$f":"IF(OR(ISBLANK(SpecYear),SpecYear=2024),A24,\"\")","v":"No prescriptive mix design options available. Select \"Testing Requirements\"."},null,{"$f":"\"\"","v":""},"Natural Pozzolan",{"$f":"\"\"","v":""},null,null,null,null,null,null,null,null,null,{"$f":"IF(OR(ISBLANK(SpecYear), SpecYear=2024), IF(Class=\"Class X (SRC)\", \"Type V\", \"\"), \"\")","v":""}]
["■   Use the minimum replacement listed in the Coal Ash MPL or\n■   When Option 8 is listed on the MPL, use a minimum of 40% coal ash with a maximum CaO content of 25% or\n■   Use any ternary combination which replaces 35% to 50% of cement.",null,null,{"$f":"IF(OR(ISBLANK(SpecYear),SpecYear=2024),A25,\"\")","v":"■   Use the minimum replacement listed in the Coal Ash MPL or\n■   When Option 8 is listed on the MPL, use a minimum of 40% coal ash with a maximum CaO content of 25% or\n■   Use any ternary combination which replaces 35% to 50% of cement."},null,{"$f":"\"\"","v":""},"Other Pozzolan"]
["■   Use a minimum of 20% of any coal ash or\n■   Use any ternary combination which replaces 20% to 50% of cement.",null,null,{"$f":"IF(OR(ISBLANK(SpecYear),SpecYear=2024),A26,\"\")","v":"■   Use a minimum of 20% of any coal ash or\n■   Use any ternary combination which replaces 20% to 50% of cement."},null,{"$f":"\"\"","v":""}]
[null,null,null,null,null,null,null,null,"MDO 1","MDO 2","MDO 2*","MDO 3","MDO 3*","MDO 4","MDO 4*","MDO 5","Class MDO","MDO"]
["Admixtures",null,null,null,null,{"$f":"\"\"","v":""},null,null,1,1,1,1,1,1,1,1,{"$f":"IF(OR(Class=\"Class A\",Class=\"Class B\"),IF(ISBLANK(I28),\"\",I28),IF(OR(Class=\"Class C\",Class=\"Class E\",Class=\"Class F\",Class=\"Class S\",Class=\"Class P\",Class=\"Class CO\",Class=\"Class LMC\",Class=\"Class SS\",Class=\"Class K\"),IF(ISBLANK(J28),\"\",J28),IF(Class=\"Class H\",IF(ISBLANK(L28),\"\",L28),IF(Class=\"Class X (HPC)\",IF(ISBLANK(N28),\"\",N28),IF(Class=\"Class X (SRC)\",IF(ISBLANK(P28),\"\",P28),\"\")))))","v":""},{"$f":"IF(Class=\"Class HES\", \"\", IF(OR(ISBLANK(SpecYear), SpecYear=2024), 1, \"\"))","v":1}]
["Air entrainer",null,null,null,null,{"$f":"\"\"","v":""},null,null,2,2,2,2,2,2,2,2,"",{"$f":"IF(Class=\"Class HES\", \"\", IF(OR(ISBLANK(SpecYear), SpecYear=2024), 2, \"\"))","v":2}]
["Type A: Water reducer",null,null,null,null,{"$f":"\"\"","v":""},null,null,4,3,3,3,3,3,3,3,"",{"$f":"IF(Class=\"Class HES\", \"\", IF(OR(ISBLANK(SpecYear), SpecYear=2024), IF(OR(Class=\"Class A\", Class=\"Class B\"), 4, 3), \"\"))","v":3}]
["Type B: Set retarder",null,null,null,null,{"$f":"\"\"","v":""},null,null,7,4,4,4,4,4,4,4,"",{"$f":"IF(Class=\"Class HES\", \"\", IF(OR(ISBLANK(SpecYear), SpecYear=2024), IF(OR(Class=\"Class A\", Class=\"Class B\"), 7, 4), \"\"))","v":4}]
["Type C: Accelerator",null,null,null,null,{"$f":"\"\"","v":""},null,null,null,5,6,5,"6 (CIP Only)",5,8,"7 (Items 462, 464, 465 only)","",{"$f":"IF(Class=\"Class HES\",\"\",IF(OR(ISBLANK(SpecYear),SpecYear=2024),IF(Class=\"Class X (HPC)\",8,IF(Class=\"Class X (SRC)\",7,IF(OR(Class=\"Class A\", Class=\"Class B\"),\"\", 6))),\"\"))","v":6}]
["Type D: Water reducing retarder",null,null,null,null,{"$f":"\"\"","v":""},null,null,null,6,7,null,"7 (CIP Only)",8,null,null,"",{"$f":"IF(Class=\"Class HES\",\"\",IF(OR(ISBLANK(SpecYear),SpecYear=2024),IF(OR(Class=\"Class A\",Class=\"Class B\",Class=\"Class X (HPC)\",Class=\"Class X (SRC)\"),\"\",7),\"\"))","v":7}]
["Type F: High-range water reducer",null,null,null,null,{"$f":"\"\"","v":""},null,null,null,7,8,null,"8 (CIP Only)",null,null,null,"",{"$f":"IF(Class=\"Class HES\",\"\",IF(OR(ISBLANK(SpecYear),SpecYear=2024),IF(OR(Class=\"Class A\",Class=\"Class B\",Class=\"Class X (HPC)\",Class=\"Class X (SRC)\"),\"\",8),\"\"))","v":8}]
["Type G: High-range water reducing retarder",null,null,null,null,{"$f":"\"\"","v":""},null,null,null,8,null,null,null,null,null,null,""]
["Other",null,null,null,null,{"$f":"\"\"","v":""}]
[null,null,null,null,null,null,"Cementitious Materials","Cementitious Materials",null,"Cementitious Materials"]
[null,null,null,null,null,null,"Hydraulic cement","Hydraulic cement","Hydraulic cement",{"$f":"IF(ISBLANK(I38), \"\", I38)","v":"Hydraulic cement"}]
[null,null,null,null,null,null,"Fly Ash - C","Fly Ash","Coal Ash","Coal Ash"]
[null,null,null,null,null,null,"Fly Ash - F","Slag cement","Natural Pozzolan","Natural Pozzolan"]
[null,null,null,null,null,null,"Slag cement","Silica fume","Slag cement","Slag cement"]
[null,null,null,null,null,null,"Silica fume","Metakaolin","Silica fume","Silica fume"]
[null,null,null,null,null,null,"UFFA","Other Pozzolan","Other Pozzolan","Other Pozzolan"]
[null,null,null,null,null,null,"MFFA",null,null,""]
[null,null,null,null,null,null,"Metakaolin",null,null,""]
[null,null,null,null,null,null,"Other Pozzolan",null,null,""]

{"sheet":"DATA_Tables","index":12,"n_rows":112,"n_cols":29,"rows_kept":112,"cut":false,"hidden":true,"merged":[[25,6,25,9],[26,6,26,8],[26,9,27,9]]}
["General Usage","Slump Min.",{"$f":"\"\"","v":""},"Concrete Class","Design Strength, Min. f'c (psi)","Maximum w/c Ratio","General Usage","Exceptions to Mix Design Options","Exceptions 421009","Exceptions 421010","Exceptions 421012","Exceptions 421000",null,"Length to Diameter Ratio","Correction Factor",null,null,null,null,null,null,null,null,null,null,null,null,null,{"$f":"+ff(1)","v":true}]
["Anchors","As approved",{"$f":"\"\"","v":""},"Class A",3000,0.6,"Curb, gutter, curb & gutter, concrete retards, sidewalks, driveways, back-up walls, anchors, non-reinforced drilled shafts","■   When the cement content does not exceed 520 lb./cu.yd., Class C fly ash may be used instead of Class F fly ash.","■   When the cementitious material content does not exceed 520 lb./cu.yd., any fly ash listed in the MPL may be used at a cement replacement of 20% to 50%.","■   When the cementitious material content does not exceed 520 lb./cu.yd., any fly ash listed in the MPL may be used at a cement replacement of 20% to 50%.","■   When the cementitious material content does not exceed 520 lb./cu.yd., any coal ash or natural pozzolan listed in the MPL may be used at a cement replacement of 20% to 50%.","■   When the cementitious material content does not exceed 520 lb./cu.yd., any coal ash or natural pozzolan listed in the MPL may be used at a cement replacement of 20% to 50%.\n■   Limit the alkali loading to 4.0 lb/cu.yd. or less when using Option 7.",null,1,0.87]
["Approach slabs",{"$f":"IF(OR(ISBLANK(SpecYear), SpecYear=2024), \"3 - 6\",\"\")","v":"3 - 6"},{"$f":"\"\"","v":""},"Class B",2000,0.6,"Riprap, traffic signal controller foundations, small roadside signs, anchors","■   When the cement content does not exceed 520 lb./cu.yd., Class C fly ash may be used instead of Class F fly ash.","■   When the cementitious material content does not exceed 520 lb./cu.yd., any fly ash listed in the MPL may be used at a cement replacement of 20% to 50%.","■   When the cementitious material content does not exceed 520 lb./cu.yd., any fly ash listed in the MPL may be used at a cement replacement of 20% to 50%.","■   When the cementitious material content does not exceed 520 lb./cu.yd., any coal ash or natural pozzolan listed in the MPL may be used at a cement replacement of 20% to 50%.","■   When the cementitious material content does not exceed 520 lb./cu.yd., any coal ash or natural pozzolan listed in the MPL may be used at a cement replacement of 20% to 50%.\n■   Limit the alkali loading to 4.0 lb/cu.yd. or less when using Option 7.",null,1.01,0.87239999999999995]
["Bridge railing",{"$f":"IF(OR(ISBLANK(SpecYear), SpecYear=2024), \"4 - 6\",\"\")","v":"4 - 6"},{"$f":"\"\"","v":""},"Class C",3600,0.45,"Drilled shafts, bridge substructure, bridge railing, culverts except top slab of direct traffic culverts, headwalls, wing walls, inlets, manholes, concrete traffic barrier (cast-in-place)","No exceptions","No exceptions","No exceptions","No exceptions","No exceptions",null,1.02,0.87480000000000002]
["Bridge slabs",{"$f":"IF(OR(ISBLANK(SpecYear), SpecYear=2024), \"3 - 6\", \"\")","v":"3 - 6"},{"$f":"\"\"","v":""},"Class CO",4600,0.4,"Bridge deck concrete overlay","No exceptions","No exceptions","No exceptions","No exceptions","No exceptions",null,1.03,0.87719999999999998]
["Caps",{"$f":"IF(OR(ISBLANK(SpecYear), SpecYear=2024), \"3 - 7\", \"\")","v":"3 - 7"},{"$f":"\"\"","v":""},"Class E",3000,0.5,"Seal concrete","■   When the cement content does not exceed 520 lb./cu.yd., Class C fly ash may be used instead of Class F fly ash.","■   When the cementitious material content does not exceed 520 lb./cu.yd., any fly ash listed in the MPL may be used at a cement replacement of 20% to 50%.","■   When the cementitious material content does not exceed 520 lb./cu.yd., any fly ash listed in the MPL may be used at a cement replacement of 20% to 50%.","■   When the cementitious material content does not exceed 520 lb./cu.yd., any coal ash or natural pozzolan listed in the MPL may be used at a cement replacement of 20% to 50%.","■   When the cementitious material content does not exceed 520 lb./cu.yd., any coal ash or natural pozzolan listed in the MPL may be used at a cement replacement of 20% to 50%.\n■   Limit the alkali loading to 4.0 lb/cu.yd. or less when using Option 7.",null,1.04,8.9599999999999999E-2]
["Columns",{"$f":"IF(OR(ISBLANK(SpecYear), SpecYear=2024), \"3 - 7\",\"\")","v":"3 - 7"},{"$f":"\"\"","v":""},"Class F","Note 8",0.45,"Railroad structures, occasionally for bridge piers, columns, bents, post-tension members","No exceptions","No exceptions","No exceptions","No exceptions","No exceptions",null,1.05,0.88200000000000001]
["Concrete overlays",{"$f":"IF(OR(ISBLANK(SpecYear), SpecYear=2024), \"3 - 6\", \"\")","v":"3 - 6"},{"$f":"\"\"","v":""},"Class H","Note 8",0.45,"Precast concrete, post-tension members","■   Do not use Type III cement in mass placement concrete.\n■   Up to 20% of blended cement may be replaced with listed SCMs when Option 4 is used for precast concrete.","■   Do not use Type III cement in mass placement concrete.\n■   Up to 20% of blended cement may be replaced with listed SCMs when Option 4 is used for precast concrete.\n■   Options 6, 7, & 8 allowed for cast-in-place Class H concrete.","■   Mix design options 1-8 allowed for cast-in-place concrete and the following precast elements unless otherwise stated int he plans: bridge deck panels, retaining wall systems, coping, sound walls, wall columns, traffic rail, traffic barrier, long/arch span culvers, and precast concrete products included in Item 462, Item 464, and Item 465.\n■   Do not use Type III cement in mass placement concrete.\n■   Up to 20% of blended cement may be replaced with listed SCMs when Option 4 is used for precast concrete.\n■   Options 6 & 7 allowed for cast-in-place Class H concrete.","■   Mix design options 1-8 allowed for cast-in-place concrete and the following precast elements unless otherwise stated int he plans: bridge deck panels, retaining wall systems, coping, sound walls, wall columns, traffic rail, traffic barrier, long/arch span culvers, and precast concrete products included in Item 462, Item 464, and Item 465.\n■   Do not use Type III cement in mass placement concrete.\n■   Up to 20% of blended cement may be replaced with listed SCMs when Option 4 is used for precast concrete.\n■   Options 6 & 7 allowed for cast-in-place Class H concrete.","■   Mix design options 1-8 allowed for cast-in-place concrete and the following precast elements unless otherwise stated int he plans: bridge deck panels, retaining wall systems, coping, sound walls, wall columns, traffic rail, traffic barrier, long/arch span culvers, and precast concrete products included in Item 462, Item 464, and Item 465.\n■   Do not use Type III cement in mass placement concrete.",null,1.06,0.88439999999999996]
["Concrete pavement (formed)",{"$f":"IF(OR(ISBLANK(SpecYear), SpecYear=2024), \"4 - 6\", \"\")","v":"4 - 6"},{"$f":"\"\"","v":""},"Class HES","Note 8",0.45,"Concrete pavement, concrete pavement repair","■   Mix design options do not apply.\n■   700 lb. of cement per cu.yd. limit does not apply.","■   Mix design options do not apply.\n■   700 lb. of cement per cu.yd. limit does not apply.","■   Mix design options do not apply.\n■   700 lb. of cement per cu.yd. limit does not apply.","■   Mix design options do not apply.\n■   700 lb. of cement per cu.yd. limit does not apply.","■   Mix design options do not apply.\n■   700 lb. of cement per cu.yd. limit does not apply.",null,1.07,0.88680000000000003]
["Concrete pavement (slip-formed)","As approved",{"$f":"\"\"","v":""},"Class K","Note 8",0.4,{"$f":"IF(OR(ISBLANK(SpecYear), SpecYear=2024), \"Bridge Repair\", \"Note 8\")","v":"Bridge Repair"},"No exceptions","No exceptions","No exceptions","No exceptions","No exceptions",null,1.08,0.88919999999999999]
["Concrete pavement repair","As approved",{"$f":"\"\"","v":""},"Class LMC",4000,0.4,"latex-modified concrete overlay","No exceptions","No exceptions","No exceptions","No exceptions","No exceptions",null,1.0900000000000001,0.89159999999999995]
["Concrete repair","As approved",{"$f":"\"\"","v":""},"Class P",4000,0.5,"Concrete Pavement","■   When the cement content does not exceed 520 lb./cu.yd., Class C fly ash may be used instead of Class F fly ash.","■   When the cementitious material content does not exceed 520 lb./cu.yd., any fly ash listed in the MPL may be used at a cement replacement of 20% to 50%.","■   When the cementitious material content does not exceed 520 lb./cu.yd., any fly ash listed in the MPL may be used at a cement replacement of 20% to 50%.","■   When the cementitious material content does not exceed 520 lb./cu.yd., any coal ash or natural pozzolan listed in the MPL may be used at a cement replacement of 20% to 50%.","■   When the cementitious material content does not exceed 520 lb./cu.yd., any coal ash or natural pozzolan listed in the MPL may be used at a cement replacement of 20% to 50%.",null,1.1000000000000001,0.89400000000000002]
["Concrete retards","As approved",{"$f":"\"\"","v":""},"Class S",4000,0.45,"Bridge slabs, top slabs of direct traffic culverts, approach slabs","No exceptions","No exceptions","No exceptions","No exceptions","No exceptions",null,1.1100000000000001,0.89639999999999997]
["Concrete traffic barrier",{"$f":"IF(OR(ISBLANK(SpecYear), SpecYear=2024), \"4 - 6\", \"\")","v":"4 - 6"},{"$f":"\"\"","v":""},"Class SS",3600,0.45,"Slurry displacement shafts, underwater drilled shafts","■   Use a minimum cement content of 658 lb./cu.yd. of concrete.","■   Use a minimum cement content of 658 lb./cu.yd. of concrete.\n■   Limit the alkali loading to 4.0 lb./cu.yd. or less when using Option 7.","■   Use a minimum cement content of 658 lb./cu.yd. of concrete.\n■   Limit the alkali loading to 4.0 lb./cu.yd. or less when using Option 7.","■   Use a minimum cement content of 658 lb./cu.yd. of concrete.\n■   Limit the alkali loading to 4.0 lb./cu.yd. or less when using Option 7.","■   Use a minimum cement content of 658 lb./cu.yd. of concrete.\n■   Limit the alkali loading to 4.0 lb./cu.yd. or less when using Option 7.",null,1.1200000000000001,0.89880000000000004]
["Culverts",{"$f":"IF(OR(ISBLANK(SpecYear), SpecYear=2024), \"4 - 6\", \"\")","v":"4 - 6"},{"$f":"\"\"","v":""},"Class X (HPC)","Choose a Plan Class",0.45,"N/A","■   Maximum fly ash replacement for Option 1 and 3 may be increased to 45%.\n■   Up to 20% of a blended cement may be replaced with listed SCMs for Option 4.\n■   Do not use Option 8 for precast concrete.","■   Maximum fly ash replacement for Option 3 may be increased to 50%.\n■   Up to 20% of a blended cement may be replaced with listed SCMs for Option 4.\n■   Do not use Option 8 for precast concrete.","■   Maximum fly ash replacement for Option 3 may be increased to 50%.\n■   Up to 20% of a blended cement may be replaced with listed SCMs for Option 4.\n■   Do not use Option 8 for precast concrete.","■   Maximum coal ash replacement for Option 3 may be increased to 50%.\n■   Up to 20% of a blended cement may be replaced with listed SCMs for Option 4.\n■   Do not use Option 8 for precast concrete.","No exceptions",null,1.1299999999999999,0.9012]
["Curb","As approved",{"$f":"\"\"","v":""},"Class X (SRC)","Choose a Plan Class",0.45,"N/A","■   Do not use Class C fly ash.\n■   Type III-MS may be used where allowed.\n■   Type I and Type III cements may be used with Options 1-3 with a maximum w/cm of 0.40.\n■   Up to 20% of blended cement may be replaced with listed SCMs when Option 4 is used for precast concrete.\n■   Do not use Option 7 for precast concrete.","■   When using fly ash, only use fly ashes allowed for SRC as listed in the Fly Ash MPL.\n■   Type III-MS may be used where allowed.\n■   Type I and Type III cements may be used when fly ashes allowed for SRC as listed in the Fly Ash MPL are used, and with a maximum w/cm of 0.40.\n■   Up to 20% of blended cement may be replaced with listed SCMs when Option 4 is used for precast concrete.\n■   Do not use Option 7 for precast concrete.","■   When using fly ash, only use fly ashes allowed for SRC as listed in the Fly Ash MPL.\n■   Type III-MS may be used where allowed.\n■   Type I and Type III cements may be used when fly ashes allowed for SRC as listed in the Fly Ash MPL are used, and with a maximum w/cm of 0.40.\n■   Up to 20% of blended cement may be replaced with listed SCMs when Option 4 is used for precast concrete.\n■   Use Option 7 for precast concrete where allowed.","■   When using coal ash, only use coal ashes allowed for SRC as listed in the Fly Ash MPL.\n■   Type III-MS may be used where allowed.\n■   Type I, Type IL,  and Type III cements may be used when natural pozzolans are used or when coal ashes allowed for SRC as listed in the Coal Ash MPL are used, and with a maximum w/cm of 0.40.\n■   Up to 20% of blended cement may be replaced with listed SCMs when Option 4 is used for precast concrete.\n■   Use Option 7 for precast concrete where allowed.","■   When using coal ash, only use coal ashes allowed for SRC as listed in the Fly Ash MPL.\n■   Type III-MS may be used where allowed.\n■   Type I, Type IL,  and Type III cements may be used when natural pozzolans are used or when coal ashes allowed for SRC as listed in the Coal Ash MPL are used, and with a maximum w/cm of 0.40.\n■   Use Option 7 for precast concrete where allowed.",null,1.1399999999999999,0.90359999999999996]
["Curb and gutter","As approved",{"$f":"\"\"","v":""},null,null,null,null,null,null,null,null,null,null,1.1499999999999999,0.90600000000000003]
["Drilled shafts","See Item 416, \"Drilled Shaft Foundations\"",{"$f":"\"\"","v":""},"Aggregate Grade","Nom. Max. Agg. Size",{"$f":"\"\"","v":""},"Nom. Max. Agg. Size","Entrapped Air",{"$f":"\"\"","v":""},null,null,null,null,1.1599999999999999,0.90839999999999999]
["Driveways","As approved",{"$f":"\"\"","v":""},"Grade 1",2,{"$f":"\"\"","v":""},0.375,3,{"$f":"\"\"","v":""},null,null,null,null,1.17,0.91080000000000005]
["Gutter","As approved",{"$f":"\"\"","v":""},"Grade 2",1.5,{"$f":"\"\"","v":""},0.5,2.5,{"$f":"\"\"","v":""},null,null,null,null,1.18,0.91320000000000001]
["Inlets",{"$f":"IF(OR(ISBLANK(SpecYear), SpecYear=2024), \"4 - 6\", \"\")","v":"4 - 6"},{"$f":"\"\"","v":""},"Grade 3",1.5,{"$f":"\"\"","v":""},0.75,2,{"$f":"\"\"","v":""},null,null,null,null,1.19,0.91559999999999997]
["Latex-modified concrte for bridge deck overlays",{"$f":"IF(OR(ISBLANK(SpecYear), SpecYear=2024), \"3 - 8\",\"\")","v":"3 - 8"},{"$f":"\"\"","v":""},"Grade 4",1,{"$f":"\"\"","v":""},1,1.5,{"$f":"\"\"","v":""},null,null,null,null,1.2,0.91800000000000004]
["Manholes",{"$f":"IF(OR(ISBLANK(SpecYear), SpecYear=2024), \"4 - 6\", \"\")","v":"4 - 6"},{"$f":"\"\"","v":""},"Grade 5",0.75,{"$f":"\"\"","v":""},1.5,1,{"$f":"\"\"","v":""},null,null,null,null,1.21,0.9204]
["Piers",{"$f":"IF(OR(ISBLANK(SpecYear), SpecYear=2024), \"3 - 7\", \"\")","v":"3 - 7"},{"$f":"\"\"","v":""},"Grade 6",0.5,{"$f":"\"\"","v":""},2,0.5,{"$f":"\"\"","v":""},null,null,null,null,1.22,0.92279999999999995]
["Precast concrete",{"$f":"IF(OR(ISBLANK(SpecYear), SpecYear=2024), \"4 - 9\", \"\")","v":"4 - 9"},{"$f":"\"\"","v":""},"Grade 7",0.375,{"$f":"\"\"","v":""},{"$f":"\"\"","v":""},null,null,null,null,null,null,1.23,0.92520000000000002]
["Riprap","As approved",{"$f":"\"\"","v":""},"Grade 8",0.375,{"$f":"\"\"","v":""},"Tex-414-A Correction Factor Table",null,null,null,null,null,null,1.24,0.92759999999999998]
["Seal concrete","4 to 5-1/2",{"$f":"\"\"","v":""},null,null,null,"70% Isopropyl Alcohol Used",null,null,"Correction Factor",null,null,null,1.25,0.93]
["Sidewalk","As approved",{"$f":"\"\"","v":""},"Admixture","Class",{"$f":"\"\"","v":""},"Pints","Ounces","Liters",null,null,null,null,1.26,0.93120000000000003]
["Slurry displaced drill shafts","See Item 416, \"Drilled Shaft Foundations\"",{"$f":"\"\"","v":""},"Air entrainer","AEA",{"$f":"\"\"","v":""},1,16,0.5,0,null,null,null,1.27,0.93240000000000001]
["Small roadside sign foundations","As approved",{"$f":"\"\"","v":""},"Other",null,{"$f":"\"\"","v":""},2,32,0.9,0,null,null,null,1.28,0.93359999999999999]
["Top slabs of direct traffic culverts",{"$f":"IF(OR(ISBLANK(SpecYear), SpecYear=2024), \"3 - 6\", \"\")","v":"3 - 6"},{"$f":"\"\"","v":""},"Type A: Water reducer","Type A",{"$f":"\"\"","v":""},3,48,1.4,0.25,null,null,null,1.29,0.93479999999999996]
["Underwater concrete placements","6 - 8-1/2",{"$f":"\"\"","v":""},"Type B: Set retarder","Type B",{"$f":"\"\"","v":""},4,64,1.9,0.5,null,null,null,1.3,0.93600000000000005]
["Underwater drilled shafts","See Item 416, \"Drilled Shaft Foundations\"",{"$f":"\"\"","v":""},"Type C: Accelerator","Type C",{"$f":"\"\"","v":""},5,80,2.4,0.75,null,null,null,1.31,0.93720000000000003]
["Walls (less than 9 in. thick)",{"$f":"IF(OR(ISBLANK(SpecYear), SpecYear=2024), \"4 - 6\",\"\")","v":"4 - 6"},{"$f":"\"\"","v":""},"Type D: Water reducing retarder","Type D",{"$f":"\"\"","v":""},null,null,null,null,null,null,null,1.32,0.93840000000000001]
["Walls (over 9 in. thick)",{"$f":"IF(OR(ISBLANK(SpecYear), SpecYear=2024), \"3 - 7\",\"\")","v":"3 - 7"},{"$f":"\"\"","v":""},"Type F: High-range water reducer","Type F",{"$f":"\"\"","v":""},null,null,null,null,null,null,null,1.33,0.93959999999999999]
[null,null,null,"Type G: High-range water reducing retarder","Type G",{"$f":"\"\"","v":""},null,null,null,null,null,null,null,1.34,0.94079999999999997]
[null,null,null,null,null,null,null,null,null,null,null,null,null,1.35,0.94199999999999995]
[null,null,null,null,null,null,null,null,null,null,null,null,null,1.36,0.94320000000000004]
[null,null,null,null,null,null,null,null,null,null,null,null,null,1.37,0.94440000000000002]
[null,null,null,null,null,null,null,null,null,null,null,null,null,1.38,0.9456]
[null,null,null,null,null,null,null,null,null,null,null,null,null,1.39,0.94679999999999997]
[null,null,null,null,null,null,null,null,null,null,null,null,null,1.4,0.94799999999999995]
[null,null,null,null,null,null,null,null,null,null,null,null,null,1.41,0.94920000000000004]
[null,null,null,null,null,null,null,null,null,null,null,null,null,1.42,0.95040000000000002]
[null,null,null,null,null,null,null,null,null,null,null,null,null,1.43,0.9516]
[null,null,null,null,null,null,null,null,null,null,null,null,null,1.44,0.95279999999999998]
[null,null,null,null,null,null,null,null,null,null,null,null,null,1.45,0.95399999999999996]
[null,null,null,null,null,null,null,null,null,null,null,null,null,1.46,0.95520000000000005]
[null,null,null,null,null,null,null,null,null,null,null,null,null,1.47,0.95640000000000003]
[null,null,null,null,null,null,null,null,null,null,null,null,null,1.48,0.95760000000000001]
[null,null,null,null,null,null,null,null,null,null,null,null,null,1.49,0.95879999999999999]
[null,null,null,null,null,null,null,null,null,null,null,null,null,1.5,0.96]
[null,null,null,null,null,null,null,null,null,null,null,null,null,1.51,0.96079999999999999]
[null,null,null,null,null,null,null,null,null,null,null,null,null,1.52,0.96160000000000001]
[null,null,null,null,null,null,null,null,null,null,null,null,null,1.53,0.96240000000000003]
[null,null,null,null,null,null,null,null,null,null,null,null,null,1.54,0.96319999999999995]
[null,null,null,null,null,null,null,null,null,null,null,null,null,1.55,0.96399999999999997]
[null,null,null,null,null,null,null,null,null,null,null,null,null,1.56,0.96479999999999999]
[null,null,null,null,null,null,null,null,null,null,null,null,null,1.57,0.96560000000000001]
[null,null,null,null,null,null,null,null,null,null,null,null,null,1.58,0.96640000000000004]
[null,null,null,null,null,null,null,null,null,null,null,null,null,1.59,0.96719999999999995]
[null,null,null,null,null,null,null,null,null,null,null,null,null,1.6,0.96799999999999997]
[null,null,null,null,null,null,null,null,null,null,null,null,null,1.61,0.96879999999999999]
[null,null,null,null,null,null,null,null,null,null,null,null,null,1.62,0.96960000000000002]
[null,null,null,null,null,null,null,null,null,null,null,null,null,1.63,0.97040000000000004]
[null,null,null,null,null,null,null,null,null,null,null,null,null,1.64,0.97119999999999995]
[null,null,null,null,null,null,null,null,null,null,null,null,null,1.65,0.97199999999999998]
[null,null,null,null,null,null,null,null,null,null,null,null,null,1.66,0.9728]
[null,null,null,null,null,null,null,null,null,null,null,null,null,1.67,0.97360000000000002]
[null,null,null,null,null,null,null,null,null,null,null,null,null,1.68,0.97440000000000004]
[null,null,null,null,null,null,null,null,null,null,null,null,null,1.69,0.97519999999999996]
[null,null,null,null,null,null,null,null,null,null,null,null,null,1.7,0.97599999999999998]
[null,null,null,null,null,null,null,null,null,null,null,null,null,1.71,0.9768]
[null,null,null,null,null,null,null,null,null,null,null,null,null,1.72,0.97760000000000002]
[null,null,null,null,null,null,null,null,null,null,null,null,null,1.73,0.97840000000000005]
[null,null,null,null,null,null,null,null,null,null,null,null,null,1.74,0.97919999999999996]
[null,null,null,null,null,null,null,null,null,null,null,null,null,1.75,0.98]
[null,null,null,null,null,null,null,null,null,null,null,null,null,1.76,1]
[null,null,null,null,null,null,null,null,null,null,null,null,null,1.77,1]
[null,null,null,null,null,null,null,null,null,null,null,null,null,1.78,1]
[null,null,null,null,null,null,null,null,null,null,null,null,null,1.79,1]
[null,null,null,null,null,null,null,null,null,null,null,null,null,1.8,1]
[null,null,null,null,null,null,null,null,null,null,null,null,null,1.81,1]
[null,null,null,null,null,null,null,null,null,null,null,null,null,1.82,1]
[null,null,null,null,null,null,null,null,null,null,null,null,null,1.83,1]
[null,null,null,null,null,null,null,null,null,null,null,null,null,1.84,1]
[null,null,null,null,null,null,null,null,null,null,null,null,null,1.85,1]
[null,null,null,null,null,null,null,null,null,null,null,null,null,1.86,1]
[null,null,null,null,null,null,null,null,null,null,null,null,null,1.87,1]
[null,null,null,null,null,null,null,null,null,null,null,null,null,1.88,1]
[null,null,null,null,null,null,null,null,null,null,null,null,null,1.89,1]
[null,null,null,null,null,null,null,null,null,null,null,null,null,1.9,1]
[null,null,null,null,null,null,null,null,null,null,null,null,null,1.91,1]
[null,null,null,null,null,null,null,null,null,null,null,null,null,1.92,1]
[null,null,null,null,null,null,null,null,null,null,null,null,null,1.93,1]
[null,null,null,null,null,null,null,null,null,null,null,null,null,1.94,1]
[null,null,null,null,null,null,null,null,null,null,null,null,null,1.95,1]
[null,null,null,null,null,null,null,null,null,null,null,null,null,1.96,1]
[null,null,null,null,null,null,null,null,null,null,null,null,null,1.97,1]
[null,null,null,null,null,null,null,null,null,null,null,null,null,1.98,1]
[null,null,null,null,null,null,null,null,null,null,null,null,null,1.99,1]
[null,null,null,null,null,null,null,null,null,null,null,null,null,2,1]
[null,null,null,null,null,null,null,null,null,null,null,null,null,2.0099999999999998,1]
[null,null,null,null,null,null,null,null,null,null,null,null,null,2.02,1]
[null,null,null,null,null,null,null,null,null,null,null,null,null,2.0299999999999998,1]
[null,null,null,null,null,null,null,null,null,null,null,null,null,2.04,1]
[null,null,null,null,null,null,null,null,null,null,null,null,null,2.0499999999999998,1]
[null,null,null,null,null,null,null,null,null,null,null,null,null,2.06,1]
[null,null,null,null,null,null,null,null,null,null,null,null,null,2.0699999999999998,1]
[null,null,null,null,null,null,null,null,null,null,null,null,null,2.08,1]
[null,null,null,null,null,null,null,null,null,null,null,null,null,2.09,1]
[null,null,null,null,null,null,null,null,null,null,null,null,null,2.1,1]

{"sheet":"RX","index":13,"n_rows":1032,"n_cols":9,"rows_kept":1032,"cut":false,"hidden":true,"merged":[]}
[{"$f":"COUNTA(A3:A9982)","v":1030}]
["Fld_nbr","Value","DESC_1","DESC_2","DESC_3","DESC_4","DESC_5","DESC_6","DESC_7"]
[1,{"$f":"IF(Field1=\"\",\"\",Field1)","v":""},{"$f":"General!$B$23","v":"Remarks:"}]
[2,{"$f":"IF(General!$E$18=\"\",\"\",General!$E$18)","v":""},{"$f":"General!$D$18","v":"COURSE\\LIFT:"}]
[3,{"$f":"IF(General!D20=\"\",\"\",General!D20)","v":""},{"$f":"General!$B$5","v":"General"},{"$f":"General!C20","v":"Plant:"}]
[4,{"$f":"IF(General!G20=\"\",\"\",General!G20)","v":""},{"$f":"General!$B$5","v":"General"},{"$f":"General!F20","v":"Design #:"}]
[5,{"$f":"IF(General!K20=\"\",\"\",General!K20)","v":""},{"$f":"General!$B$5","v":"General"},{"$f":"General!J20","v":"Date:"}]
[6,{"$f":"IF(Field1=\"\",\"\",Field1)","v":""},{"$f":"General!$B$5","v":"General"},{"$f":"General!B23","v":"Remarks:"}]
[7,{"$f":"IF('Project Summary'!F8=\"\",\"\",'Project Summary'!F8)","v":""},{"$f":"'Project Summary'!$B$4","v":"Project Summary"},{"$f":"'Project Summary'!$B$7","v":"Project Summary"},{"$f":"'Project Summary'!B8","v":"Concrete Class on Plans:"}]
[8,{"$f":"IF('Project Summary'!F9=\"\",\"\",'Project Summary'!F9)","v":""},{"$f":"'Project Summary'!$B$4","v":"Project Summary"},{"$f":"'Project Summary'!$B$7","v":"Project Summary"},{"$f":"'Project Summary'!B9","v":"General Usage (Note 1):"}]
[9,{"$f":"IF('Project Summary'!F10=\"\",\"\",'Project Summary'!F10)","v":""},{"$f":"'Project Summary'!$B$4","v":"Project Summary"},{"$f":"'Project Summary'!$B$7","v":"Project Summary"},{"$f":"'Project Summary'!B10","v":"Design Strength, Min. 28-day f'c (psi):"}]
[10,{"$f":"IF('Project Summary'!F11=\"\",\"\",'Project Summary'!F11)","v":""},{"$f":"'Project Summary'!$B$4","v":"Project Summary"},{"$f":"'Project Summary'!$B$7","v":"Project Summary"},{"$f":"'Project Summary'!B11","v":"Specified Design Strength, Min. 28-day f'c (psi):"}]
[11,{"$f":"IF('Project Summary'!F12=\"\",\"\",'Project Summary'!F12)","v":""},{"$f":"'Project Summary'!$B$4","v":"Project Summary"},{"$f":"'Project Summary'!$B$7","v":"Project Summary"},{"$f":"'Project Summary'!B12","v":"Max. W/C Ratio:"}]
[12,{"$f":"IF('Project Summary'!F13=\"\",\"\",'Project Summary'!F13)","v":""},{"$f":"'Project Summary'!$B$4","v":"Project Summary"},{"$f":"'Project Summary'!$B$7","v":"Project Summary"},{"$f":"'Project Summary'!B13","v":"Optimized Gradation Design?:"}]
[13,{"$f":"IF('Project Summary'!F15=\"\",\"\",'Project Summary'!F15)","v":""},{"$f":"'Project Summary'!$B$4","v":"Project Summary"},{"$f":"'Project Summary'!$B$7","v":"Project Summary"},{"$f":"'Project Summary'!B15","v":"Acceptable Coarse Aggregate Grades:"}]
[14,{"$f":"IF('Project Summary'!F16=\"\",\"\",'Project Summary'!F16)","v":""},{"$f":"'Project Summary'!$B$4","v":"Project Summary"},{"$f":"'Project Summary'!$B$7","v":"Project Summary"},{"$f":"'Project Summary'!B16","v":"Acceptable Cement Types:"}]
[15,{"$f":"IF('Project Summary'!F17=\"\",\"\",'Project Summary'!F17)","v":""},{"$f":"'Project Summary'!$B$4","v":"Project Summary"},{"$f":"'Project Summary'!$B$7","v":"Project Summary"},{"$f":"'Project Summary'!B17","v":"Available Mix Design Options:"}]
[16,{"$f":"IF('Project Summary'!F18=\"\",\"\",'Project Summary'!F18)","v":"Choose a General Usage"},{"$f":"'Project Summary'!$B$4","v":"Project Summary"},{"$f":"'Project Summary'!$B$7","v":"Project Summary"},{"$f":"'Project Summary'!B18","v":"Acceptable Slump Range:"}]
[17,{"$f":"IF('Project Summary'!F19=\"\",\"\",'Project Summary'!F19)","v":""},{"$f":"'Project Summary'!$B$4","v":"Project Summary"},{"$f":"'Project Summary'!$B$7","v":"Project Summary"},{"$f":"'Project Summary'!B19","v":"Design Slump Range:"}]
[18,{"$f":"IF('Project Summary'!F21=\"\",\"\",'Project Summary'!F21)","v":""},{"$f":"'Project Summary'!$B$4","v":"Project Summary"},{"$f":"'Project Summary'!$B$7","v":"Project Summary"},{"$f":"'Project Summary'!B21","v":"Mix Design Input: "}]
[19,{"$f":"IF('Water&Cement'!F7=\"\",\"\",'Water&Cement'!F7)","v":"Concrete Class not selected."},{"$f":"'Water&Cement'!$B$4","v":"W/C and Cement Content"},{"$f":"'Water&Cement'!$B$6","v":"W/C or W/CM"},{"$f":"'Water&Cement'!B7","v":"Max. w/c or w/cm based on concrete class:"}]
[20,{"$f":"IF('Water&Cement'!F8=\"\",\"\",'Water&Cement'!F8)","v":""},{"$f":"'Water&Cement'!$B$4","v":"W/C and Cement Content"},{"$f":"'Water&Cement'!$B$6","v":"W/C or W/CM"},{"$f":"'Water&Cement'!B8","v":"Specified max. w/c or w/cm if different from above*:"}]
[21,{"$f":"IF('Water&Cement'!F9=\"\",\"\",'Water&Cement'!F9)","v":"Concrete Class not selected."},{"$f":"'Water&Cement'!$B$4","v":"W/C and Cement Content"},{"$f":"'Water&Cement'!$B$6","v":"W/C or W/CM"},{"$f":"'Water&Cement'!B9","v":"Mix design w/c or w/cm: "}]
[22,{"$f":"IF('Water&Cement'!F10=\"\",\"\",'Water&Cement'!F10)","v":""},{"$f":"'Water&Cement'!$B$4","v":"W/C and Cement Content"},{"$f":"'Water&Cement'!$B$6","v":"W/C or W/CM"},{"$f":"'Water&Cement'!B10","v":"Mix design input not selected."}]
[23,{"$f":"IF('Water&Cement'!F11=\"\",\"\",'Water&Cement'!F11)","v":700},{"$f":"'Water&Cement'!$B$4","v":"W/C and Cement Content"},{"$f":"'Water&Cement'!$B$6","v":"W/C or W/CM"},{"$f":"'Water&Cement'!B11","v":"Mix design max. cementitious material content, (lb./cu.yd.):"}]
[24,{"$f":"IF('Air&MixDesignOptions'!F7=\"\",\"\",'Air&MixDesignOptions'!F7)","v":""},{"$f":"'Air&MixDesignOptions'!$B$4","v":"Air Entrainment and Mix Design Options"},{"$f":"'Air&MixDesignOptions'!$B$6","v":"Air-Entrainment"},{"$f":"'Air&MixDesignOptions'!B7","v":"Specified Air-Entrainment?:"}]
[25,{"$f":"IF('Air&MixDesignOptions'!F8=\"\",\"\",'Air&MixDesignOptions'!F8)","v":""},{"$f":"'Air&MixDesignOptions'!$B$4","v":"Air Entrainment and Mix Design Options"},{"$f":"'Air&MixDesignOptions'!$B$6","v":"Air-Entrainment"},{"$f":"'Air&MixDesignOptions'!B8","v":"Air-Entrainer Used?:"}]
[26,{"$f":"IF('Air&MixDesignOptions'!F9=\"\",\"\",'Air&MixDesignOptions'!F9)","v":"0.0"},{"$f":"'Air&MixDesignOptions'!$B$4","v":"Air Entrainment and Mix Design Options"},{"$f":"'Air&MixDesignOptions'!$B$6","v":"Air-Entrainment"},{"$f":"'Air&MixDesignOptions'!B9","v":"Specified total air content, (%):"}]
[27,{"$f":"IF('Air&MixDesignOptions'!F10=\"\",\"\",'Air&MixDesignOptions'!F10)","v":""},{"$f":"'Air&MixDesignOptions'!$B$4","v":"Air Entrainment and Mix Design Options"},{"$f":"'Air&MixDesignOptions'!$B$6","v":"Air-Entrainment"},{"$f":"'Air&MixDesignOptions'!B10","v":"Target entrained air content, (%):"}]
[28,{"$f":"IF('Air&MixDesignOptions'!F11=\"\",\"\",'Air&MixDesignOptions'!F11)","v":"Coarse Aggregate Grade not selected."},{"$f":"'Air&MixDesignOptions'!$B$4","v":"Air Entrainment and Mix Design Options"},{"$f":"'Air&MixDesignOptions'!$B$6","v":"Air-Entrainment"},{"$f":"'Air&MixDesignOptions'!B11","v":"Nominal maximum aggregate size from Project Summary, (in.):"}]
[29,{"$f":"IF('Air&MixDesignOptions'!F12=\"\",\"\",'Air&MixDesignOptions'!F12)","v":""},{"$f":"'Air&MixDesignOptions'!$B$4","v":"Air Entrainment and Mix Design Options"},{"$f":"'Air&MixDesignOptions'!$B$6","v":"Air-Entrainment"},{"$f":"'Air&MixDesignOptions'!B12","v":"Nominal maximum aggregate size, (in.):"}]
[30,{"$f":"IF('Air&MixDesignOptions'!F13=\"\",\"\",'Air&MixDesignOptions'!F13)","v":0},{"$f":"'Air&MixDesignOptions'!$B$4","v":"Air Entrainment and Mix Design Options"},{"$f":"'Air&MixDesignOptions'!$B$6","v":"Air-Entrainment"},{"$f":"'Air&MixDesignOptions'!B13","v":"Approximate entrapped air content, (%):"}]
[31,{"$f":"IF('Air&MixDesignOptions'!F14=\"\",\"\",'Air&MixDesignOptions'!F14)","v":""},{"$f":"'Air&MixDesignOptions'!$B$4","v":"Air Entrainment and Mix Design Options"},{"$f":"'Air&MixDesignOptions'!$B$6","v":"Air-Entrainment"},{"$f":"'Air&MixDesignOptions'!B14","v":"Entrapped air content different from above, (%):"}]
[32,{"$f":"IF('Air&MixDesignOptions'!F18=\"\",\"\",'Air&MixDesignOptions'!F18)","v":"Mix design option not selected."},{"$f":"'Air&MixDesignOptions'!$B$4","v":"Air Entrainment and Mix Design Options"},{"$f":"'Air&MixDesignOptions'!$B$17","v":"Mix Design Option"},{"$f":"'Air&MixDesignOptions'!B18","v":"Mix Design Option:"}]
[33,{"$f":"IF('Air&MixDesignOptions'!F19=\"\",\"\",'Air&MixDesignOptions'!F19)","v":""},{"$f":"'Air&MixDesignOptions'!$B$4","v":"Air Entrainment and Mix Design Options"},{"$f":"'Air&MixDesignOptions'!$B$17","v":"Mix Design Option"},{"$f":"'Air&MixDesignOptions'!B19","v":"No mix design requirements."}]
[34,{"$f":"IF('Air&MixDesignOptions'!F20=\"\",\"\",'Air&MixDesignOptions'!F20)","v":""},{"$f":"'Air&MixDesignOptions'!$B$4","v":"Air Entrainment and Mix Design Options"},{"$f":"'Air&MixDesignOptions'!$B$17","v":"Mix Design Option"},{"$f":"'Air&MixDesignOptions'!B20","v":"Coal ash,(% cement replaced):"}]
[35,{"$f":"IF('Air&MixDesignOptions'!F21=\"\",\"\",'Air&MixDesignOptions'!F21)","v":""},{"$f":"'Air&MixDesignOptions'!$B$4","v":"Air Entrainment and Mix Design Options"},{"$f":"'Air&MixDesignOptions'!$B$17","v":"Mix Design Option"},{"$f":"'Air&MixDesignOptions'!B21","v":"Natural Pozzolan, (% cement replaced):"}]
[36,{"$f":"IF('Air&MixDesignOptions'!F22=\"\",\"\",'Air&MixDesignOptions'!F22)","v":""},{"$f":"'Air&MixDesignOptions'!$B$4","v":"Air Entrainment and Mix Design Options"},{"$f":"'Air&MixDesignOptions'!$B$17","v":"Mix Design Option"},{"$f":"'Air&MixDesignOptions'!B22","v":"Slag cement, (% cement replaced):"}]
[37,{"$f":"IF('Air&MixDesignOptions'!F23=\"\",\"\",'Air&MixDesignOptions'!F23)","v":""},{"$f":"'Air&MixDesignOptions'!$B$4","v":"Air Entrainment and Mix Design Options"},{"$f":"'Air&MixDesignOptions'!$B$17","v":"Mix Design Option"},{"$f":"'Air&MixDesignOptions'!B23","v":"Historical, no entry"}]
[38,{"$f":"IF('Air&MixDesignOptions'!F24=\"\",\"\",'Air&MixDesignOptions'!F24)","v":""},{"$f":"'Air&MixDesignOptions'!$B$4","v":"Air Entrainment and Mix Design Options"},{"$f":"'Air&MixDesignOptions'!$B$17","v":"Mix Design Option"},{"$f":"'Air&MixDesignOptions'!B24","v":"Historical, no entry"}]
[39,{"$f":"IF('Air&MixDesignOptions'!F25=\"\",\"\",'Air&MixDesignOptions'!F25)","v":""},{"$f":"'Air&MixDesignOptions'!$B$4","v":"Air Entrainment and Mix Design Options"},{"$f":"'Air&MixDesignOptions'!$B$17","v":"Mix Design Option"},{"$f":"'Air&MixDesignOptions'!B25","v":"Historical, no entry"}]
[40,{"$f":"IF('Air&MixDesignOptions'!F26=\"\",\"\",'Air&MixDesignOptions'!F26)","v":""},{"$f":"'Air&MixDesignOptions'!$B$4","v":"Air Entrainment and Mix Design Options"},{"$f":"'Air&MixDesignOptions'!$B$17","v":"Mix Design Option"},{"$f":"'Air&MixDesignOptions'!B26","v":"Silica Fume, (% cement replaced):"}]
[41,{"$f":"IF('Air&MixDesignOptions'!F27=\"\",\"\",'Air&MixDesignOptions'!F27)","v":""},{"$f":"'Air&MixDesignOptions'!$B$4","v":"Air Entrainment and Mix Design Options"},{"$f":"'Air&MixDesignOptions'!$B$17","v":"Mix Design Option"},{"$f":"'Air&MixDesignOptions'!B27","v":"Lithium dosage testing required. See Tex-471-A."}]
[42,{"$f":"IF('Air&MixDesignOptions'!F28=\"\",\"\",'Air&MixDesignOptions'!F28)","v":""},{"$f":"'Air&MixDesignOptions'!$B$4","v":"Air Entrainment and Mix Design Options"},{"$f":"'Air&MixDesignOptions'!$B$17","v":"Mix Design Option"},{"$f":"'Air&MixDesignOptions'!B28","v":"Max. Na2Oeq in cement (%)*:"}]
[43,{"$f":"IF('Air&MixDesignOptions'!F30=\"\",\"\",'Air&MixDesignOptions'!F30)","v":3.5},{"$f":"'Air&MixDesignOptions'!$B$4","v":"Air Entrainment and Mix Design Options"},{"$f":"'Air&MixDesignOptions'!$B$17","v":"Mix Design Option"},{"$f":"'Air&MixDesignOptions'!B30","v":"Max. Allowable Alkali Loading,\n(lb./cu.yd.):"}]
[44,{"$f":"IF('Air&MixDesignOptions'!F31=\"\",\"\",'Air&MixDesignOptions'!F31)","v":""},{"$f":"'Air&MixDesignOptions'!$B$4","v":"Air Entrainment and Mix Design Options"},{"$f":"'Air&MixDesignOptions'!$B$17","v":"Mix Design Option"},{"$f":"'Air&MixDesignOptions'!B31","v":"Total Alkalis - max. design cement content, (lb./cu.yd.):"}]
[45,{"$f":"IF('Air&MixDesignOptions'!F32=\"\",\"\",'Air&MixDesignOptions'!F32)","v":""},{"$f":"'Air&MixDesignOptions'!$B$4","v":"Air Entrainment and Mix Design Options"},{"$f":"'Air&MixDesignOptions'!$B$17","v":"Mix Design Option"},{"$f":"'Air&MixDesignOptions'!B32","v":"ASTM C 1260, C 1567, C 1293 testing required."}]
[46,{"$f":"IF('Air&MixDesignOptions'!F33=\"\",\"\",'Air&MixDesignOptions'!F33)","v":""},{"$f":"'Air&MixDesignOptions'!$B$4","v":"Air Entrainment and Mix Design Options"},{"$f":"'Air&MixDesignOptions'!$B$17","v":"Mix Design Option"},{"$f":"'Air&MixDesignOptions'!B33","v":"Fine Agg. ASTM C 1260 Expansion, (%):"}]
[47,{"$f":"IF('Air&MixDesignOptions'!F34=\"\",\"\",'Air&MixDesignOptions'!F34)","v":""},{"$f":"'Air&MixDesignOptions'!$B$4","v":"Air Entrainment and Mix Design Options"},{"$f":"'Air&MixDesignOptions'!$B$17","v":"Mix Design Option"},{"$f":"'Air&MixDesignOptions'!B34","v":"Coarse Agg. ASTM C 1260 Expansion, (%):"}]
[48,{"$f":"IF('Air&MixDesignOptions'!F35=\"\",\"\",'Air&MixDesignOptions'!F35)","v":""},{"$f":"'Air&MixDesignOptions'!$B$4","v":"Air Entrainment and Mix Design Options"},{"$f":"'Air&MixDesignOptions'!$B$17","v":"Mix Design Option"},{"$f":"'Air&MixDesignOptions'!B35","v":"Coarse Agg. ASTM C 1293 Expansion, (%):"}]
[49,{"$f":"IF('Air&MixDesignOptions'!F36=\"\",\"\",'Air&MixDesignOptions'!F36)","v":""},{"$f":"'Air&MixDesignOptions'!$B$4","v":"Air Entrainment and Mix Design Options"},{"$f":"'Air&MixDesignOptions'!$B$17","v":"Mix Design Option"},{"$f":"'Air&MixDesignOptions'!B36","v":"Testing Requirements or Prescriptive Mix Design Options?:"}]
[50,{"$f":"IF('Air&MixDesignOptions'!F37=\"\",\"\",'Air&MixDesignOptions'!F37)","v":""},{"$f":"'Air&MixDesignOptions'!$B$4","v":"Air Entrainment and Mix Design Options"},{"$f":"'Air&MixDesignOptions'!$B$17","v":"Mix Design Option"},{"$f":"'Air&MixDesignOptions'!B37","v":""}]
[51,{"$f":"IF('Matl Properties'!E9=\"\",\"\",'Matl Properties'!E9)","v":""},{"$f":"'Matl Properties'!$B$4","v":"Material Properties"},{"$f":"'Matl Properties'!$B$6","v":"Aggregate Properties (from laboratory testing)"},{"$f":"'Matl Properties'!B9","v":"Coarse Aggregate 1:"},{"$f":"'Matl Properties'!$E$7","v":"Producer*"}]
[52,{"$f":"IF('Matl Properties'!G9=\"\",\"\",'Matl Properties'!G9)","v":""},{"$f":"'Matl Properties'!$B$4","v":"Material Properties"},{"$f":"'Matl Properties'!$B$6","v":"Aggregate Properties (from laboratory testing)"},{"$f":"'Matl Properties'!B9","v":"Coarse Aggregate 1:"},{"$f":"'Matl Properties'!$G$7","v":"Pit*"}]
[53,{"$f":"IF('Matl Properties'!I9=\"\",\"\",'Matl Properties'!I9)","v":""},{"$f":"'Matl Properties'!$B$4","v":"Material Properties"},{"$f":"'Matl Properties'!$B$6","v":"Aggregate Properties (from laboratory testing)"},{"$f":"'Matl Properties'!B9","v":"Coarse Aggregate 1:"},{"$f":"'Matl Properties'!$I$7","v":"Grade*"}]
[54,{"$f":"IF('Matl Properties'!K9=\"\",\"\",'Matl Properties'!K9)","v":""},{"$f":"'Matl Properties'!$B$4","v":"Material Properties"},{"$f":"'Matl Properties'!$B$6","v":"Aggregate Properties (from laboratory testing)"},{"$f":"'Matl Properties'!B9","v":"Coarse Aggregate 1:"},{"$f":"'Matl Properties'!$K$7","v":"Specific Gravity (SSD)*"}]
[55,{"$f":"IF('Matl Properties'!L9=\"\",\"\",'Matl Properties'!L9)","v":""},{"$f":"'Matl Properties'!$B$4","v":"Material Properties"},{"$f":"'Matl Properties'!$B$6","v":"Aggregate Properties (from laboratory testing)"},{"$f":"'Matl Properties'!B9","v":"Coarse Aggregate 1:"},{"$f":"'Matl Properties'!$L$7","v":"Rodded Unit Weight (UDRY)*"}]
[56,{"$f":"IF('Matl Properties'!N9=\"\",\"\",'Matl Properties'!N9)","v":""},{"$f":"'Matl Properties'!$B$4","v":"Material Properties"},{"$f":"'Matl Properties'!$B$6","v":"Aggregate Properties (from laboratory testing)"},{"$f":"'Matl Properties'!B9","v":"Coarse Aggregate 1:"},{"$f":"'Matl Properties'!$N$7","v":"Absorption (%)*"}]
[57,{"$f":"IF('Matl Properties'!O9=\"\",\"\",'Matl Properties'!O9)","v":""},{"$f":"'Matl Properties'!$B$4","v":"Material Properties"},{"$f":"'Matl Properties'!$B$6","v":"Aggregate Properties (from laboratory testing)"},{"$f":"'Matl Properties'!B9","v":"Coarse Aggregate 1:"},{"$f":"'Matl Properties'!$O$7","v":"Unit Weight (SSD)"}]
[58,{"$f":"IF('Matl Properties'!E10=\"\",\"\",'Matl Properties'!E10)","v":""},{"$f":"'Matl Properties'!$B$4","v":"Material Properties"},{"$f":"'Matl Properties'!$B$6","v":"Aggregate Properties (from laboratory testing)"},{"$f":"'Matl Properties'!B10","v":"Coarse Aggregate 2:"},{"$f":"'Matl Properties'!$E$7","v":"Producer*"}]
[59,{"$f":"IF('Matl Properties'!G10=\"\",\"\",'Matl Properties'!G10)","v":""},{"$f":"'Matl Properties'!$B$4","v":"Material Properties"},{"$f":"'Matl Properties'!$B$6","v":"Aggregate Properties (from laboratory testing)"},{"$f":"'Matl Properties'!B10","v":"Coarse Aggregate 2:"},{"$f":"'Matl Properties'!$G$7","v":"Pit*"}]
[60,{"$f":"IF('Matl Properties'!I10=\"\",\"\",'Matl Properties'!I10)","v":""},{"$f":"'Matl Properties'!$B$4","v":"Material Properties"},{"$f":"'Matl Properties'!$B$6","v":"Aggregate Properties (from laboratory testing)"},{"$f":"'Matl Properties'!B10","v":"Coarse Aggregate 2:"},{"$f":"'Matl Properties'!$I$7","v":"Grade*"}]
[61,{"$f":"IF('Matl Properties'!K10=\"\",\"\",'Matl Properties'!K10)","v":""},{"$f":"'Matl Properties'!$B$4","v":"Material Properties"},{"$f":"'Matl Properties'!$B$6","v":"Aggregate Properties (from laboratory testing)"},{"$f":"'Matl Properties'!B10","v":"Coarse Aggregate 2:"},{"$f":"'Matl Properties'!$K$7","v":"Specific Gravity (SSD)*"}]
[62,{"$f":"IF('Matl Properties'!L10=\"\",\"\",'Matl Properties'!L10)","v":""},{"$f":"'Matl Properties'!$B$4","v":"Material Properties"},{"$f":"'Matl Properties'!$B$6","v":"Aggregate Properties (from laboratory testing)"},{"$f":"'Matl Properties'!B10","v":"Coarse Aggregate 2:"},{"$f":"'Matl Properties'!$L$7","v":"Rodded Unit Weight (UDRY)*"}]
[63,{"$f":"IF('Matl Properties'!N10=\"\",\"\",'Matl Properties'!N10)","v":""},{"$f":"'Matl Properties'!$B$4","v":"Material Properties"},{"$f":"'Matl Properties'!$B$6","v":"Aggregate Properties (from laboratory testing)"},{"$f":"'Matl Properties'!B10","v":"Coarse Aggregate 2:"},{"$f":"'Matl Properties'!$N$7","v":"Absorption (%)*"}]
[64,{"$f":"IF('Matl Properties'!O10=\"\",\"\",'Matl Properties'!O10)","v":""},{"$f":"'Matl Properties'!$B$4","v":"Material Properties"},{"$f":"'Matl Properties'!$B$6","v":"Aggregate Properties (from laboratory testing)"},{"$f":"'Matl Properties'!B10","v":"Coarse Aggregate 2:"},{"$f":"'Matl Properties'!$O$7","v":"Unit Weight (SSD)"}]
[65,{"$f":"IF('Matl Properties'!E11=\"\",\"\",'Matl Properties'!E11)","v":""},{"$f":"'Matl Properties'!$B$4","v":"Material Properties"},{"$f":"'Matl Properties'!$B$6","v":"Aggregate Properties (from laboratory testing)"},{"$f":"'Matl Properties'!B11","v":"Intermediate Aggregate 1:"},{"$f":"'Matl Properties'!$E$7","v":"Producer*"}]
[66,{"$f":"IF('Matl Properties'!G11=\"\",\"\",'Matl Properties'!G11)","v":""},{"$f":"'Matl Properties'!$B$4","v":"Material Properties"},{"$f":"'Matl Properties'!$B$6","v":"Aggregate Properties (from laboratory testing)"},{"$f":"'Matl Properties'!B11","v":"Intermediate Aggregate 1:"},{"$f":"'Matl Properties'!$G$7","v":"Pit*"}]
[67,{"$f":"IF('Matl Properties'!I11=\"\",\"\",'Matl Properties'!I11)","v":""},{"$f":"'Matl Properties'!$B$4","v":"Material Properties"},{"$f":"'Matl Properties'!$B$6","v":"Aggregate Properties (from laboratory testing)"},{"$f":"'Matl Properties'!B11","v":"Intermediate Aggregate 1:"},{"$f":"'Matl Properties'!$I$7","v":"Grade*"}]
[68,{"$f":"IF('Matl Properties'!K11=\"\",\"\",'Matl Properties'!K11)","v":""},{"$f":"'Matl Properties'!$B$4","v":"Material Properties"},{"$f":"'Matl Properties'!$B$6","v":"Aggregate Properties (from laboratory testing)"},{"$f":"'Matl Properties'!B11","v":"Intermediate Aggregate 1:"},{"$f":"'Matl Properties'!$K$7","v":"Specific Gravity (SSD)*"}]
[69,{"$f":"IF('Matl Properties'!L11=\"\",\"\",'Matl Properties'!L11)","v":""},{"$f":"'Matl Properties'!$B$4","v":"Material Properties"},{"$f":"'Matl Properties'!$B$6","v":"Aggregate Properties (from laboratory testing)"},{"$f":"'Matl Properties'!B11","v":"Intermediate Aggregate 1:"},{"$f":"'Matl Properties'!$L$7","v":"Rodded Unit Weight (UDRY)*"}]
[70,{"$f":"IF('Matl Properties'!N11=\"\",\"\",'Matl Properties'!N11)","v":""},{"$f":"'Matl Properties'!$B$4","v":"Material Properties"},{"$f":"'Matl Properties'!$B$6","v":"Aggregate Properties (from laboratory testing)"},{"$f":"'Matl Properties'!B11","v":"Intermediate Aggregate 1:"},{"$f":"'Matl Properties'!$N$7","v":"Absorption (%)*"}]
[71,{"$f":"IF('Matl Properties'!O11=\"\",\"\",'Matl Properties'!O11)","v":""},{"$f":"'Matl Properties'!$B$4","v":"Material Properties"},{"$f":"'Matl Properties'!$B$6","v":"Aggregate Properties (from laboratory testing)"},{"$f":"'Matl Properties'!B11","v":"Intermediate Aggregate 1:"},{"$f":"'Matl Properties'!$O$7","v":"Unit Weight (SSD)"}]
[72,{"$f":"IF('Matl Properties'!E12=\"\",\"\",'Matl Properties'!E12)","v":""},{"$f":"'Matl Properties'!$B$4","v":"Material Properties"},{"$f":"'Matl Properties'!$B$6","v":"Aggregate Properties (from laboratory testing)"},{"$f":"'Matl Properties'!B12","v":"Intermediate Aggregate 2:"},{"$f":"'Matl Properties'!$E$7","v":"Producer*"}]
[73,{"$f":"IF('Matl Properties'!G12=\"\",\"\",'Matl Properties'!G12)","v":""},{"$f":"'Matl Properties'!$B$4","v":"Material Properties"},{"$f":"'Matl Properties'!$B$6","v":"Aggregate Properties (from laboratory testing)"},{"$f":"'Matl Properties'!B12","v":"Intermediate Aggregate 2:"},{"$f":"'Matl Properties'!$G$7","v":"Pit*"}]
[74,{"$f":"IF('Matl Properties'!I12=\"\",\"\",'Matl Properties'!I12)","v":""},{"$f":"'Matl Properties'!$B$4","v":"Material Properties"},{"$f":"'Matl Properties'!$B$6","v":"Aggregate Properties (from laboratory testing)"},{"$f":"'Matl Properties'!B12","v":"Intermediate Aggregate 2:"},{"$f":"'Matl Properties'!$I$7","v":"Grade*"}]
[75,{"$f":"IF('Matl Properties'!K12=\"\",\"\",'Matl Properties'!K12)","v":""},{"$f":"'Matl Properties'!$B$4","v":"Material Properties"},{"$f":"'Matl Properties'!$B$6","v":"Aggregate Properties (from laboratory testing)"},{"$f":"'Matl Properties'!B12","v":"Intermediate Aggregate 2:"},{"$f":"'Matl Properties'!$K$7","v":"Specific Gravity (SSD)*"}]
[76,{"$f":"IF('Matl Properties'!L12=\"\",\"\",'Matl Properties'!L12)","v":""},{"$f":"'Matl Properties'!$B$4","v":"Material Properties"},{"$f":"'Matl Properties'!$B$6","v":"Aggregate Properties (from laboratory testing)"},{"$f":"'Matl Properties'!B12","v":"Intermediate Aggregate 2:"},{"$f":"'Matl Properties'!$L$7","v":"Rodded Unit Weight (UDRY)*"}]
[77,{"$f":"IF('Matl Properties'!N12=\"\",\"\",'Matl Properties'!N12)","v":""},{"$f":"'Matl Properties'!$B$4","v":"Material Properties"},{"$f":"'Matl Properties'!$B$6","v":"Aggregate Properties (from laboratory testing)"},{"$f":"'Matl Properties'!B12","v":"Intermediate Aggregate 2:"},{"$f":"'Matl Properties'!$N$7","v":"Absorption (%)*"}]
[78,{"$f":"IF('Matl Properties'!O12=\"\",\"\",'Matl Properties'!O12)","v":""},{"$f":"'Matl Properties'!$B$4","v":"Material Properties"},{"$f":"'Matl Properties'!$B$6","v":"Aggregate Properties (from laboratory testing)"},{"$f":"'Matl Properties'!B12","v":"Intermediate Aggregate 2:"},{"$f":"'Matl Properties'!$O$7","v":"Unit Weight (SSD)"}]
[79,{"$f":"IF('Matl Properties'!E13=\"\",\"\",'Matl Properties'!E13)","v":""},{"$f":"'Matl Properties'!$B$4","v":"Material Properties"},{"$f":"'Matl Properties'!$B$6","v":"Aggregate Properties (from laboratory testing)"},{"$f":"'Matl Properties'!B13","v":"Fine Aggregate 1:"},{"$f":"'Matl Properties'!$E$7","v":"Producer*"}]
[80,{"$f":"IF('Matl Properties'!G13=\"\",\"\",'Matl Properties'!G13)","v":""},{"$f":"'Matl Properties'!$B$4","v":"Material Properties"},{"$f":"'Matl Properties'!$B$6","v":"Aggregate Properties (from laboratory testing)"},{"$f":"'Matl Properties'!B13","v":"Fine Aggregate 1:"},{"$f":"'Matl Properties'!$G$7","v":"Pit*"}]
[81,{"$f":"IF('Matl Properties'!K13=\"\",\"\",'Matl Properties'!K13)","v":""},{"$f":"'Matl Properties'!$B$4","v":"Material Properties"},{"$f":"'Matl Properties'!$B$6","v":"Aggregate Properties (from laboratory testing)"},{"$f":"'Matl Properties'!B13","v":"Fine Aggregate 1:"},{"$f":"'Matl Properties'!$K$7","v":"Specific Gravity (SSD)*"}]
[82,{"$f":"IF('Matl Properties'!M13=\"\",\"\",'Matl Properties'!M13)","v":""},{"$f":"'Matl Properties'!$B$4","v":"Material Properties"},{"$f":"'Matl Properties'!$B$6","v":"Aggregate Properties (from laboratory testing)"},{"$f":"'Matl Properties'!B13","v":"Fine Aggregate 1:"},{"$f":"'Matl Properties'!$M$7","v":"Fineness Modulus (FM)*"}]
[83,{"$f":"IF('Matl Properties'!N13=\"\",\"\",'Matl Properties'!N13)","v":""},{"$f":"'Matl Properties'!$B$4","v":"Material Properties"},{"$f":"'Matl Properties'!$B$6","v":"Aggregate Properties (from laboratory testing)"},{"$f":"'Matl Properties'!B13","v":"Fine Aggregate 1:"},{"$f":"'Matl Properties'!$N$7","v":"Absorption (%)*"}]
[84,{"$f":"IF('Matl Properties'!E14=\"\",\"\",'Matl Properties'!E14)","v":""},{"$f":"'Matl Properties'!$B$4","v":"Material Properties"},{"$f":"'Matl Properties'!$B$6","v":"Aggregate Properties (from laboratory testing)"},{"$f":"'Matl Properties'!B14","v":"Fine Aggregate 2:"},{"$f":"'Matl Properties'!$E$7","v":"Producer*"}]
[85,{"$f":"IF('Matl Properties'!G14=\"\",\"\",'Matl Properties'!G14)","v":""},{"$f":"'Matl Properties'!$B$4","v":"Material Properties"},{"$f":"'Matl Properties'!$B$6","v":"Aggregate Properties (from laboratory testing)"},{"$f":"'Matl Properties'!B14","v":"Fine Aggregate 2:"},{"$f":"'Matl Properties'!$G$7","v":"Pit*"}]
[86,{"$f":"IF('Matl Properties'!K14=\"\",\"\",'Matl Properties'!K14)","v":""},{"$f":"'Matl Properties'!$B$4","v":"Material Properties"},{"$f":"'Matl Properties'!$B$6","v":"Aggregate Properties (from laboratory testing)"},{"$f":"'Matl Properties'!B14","v":"Fine Aggregate 2:"},{"$f":"'Matl Properties'!$K$7","v":"Specific Gravity (SSD)*"}]
[87,{"$f":"IF('Matl Properties'!M14=\"\",\"\",'Matl Properties'!M14)","v":""},{"$f":"'Matl Properties'!$B$4","v":"Material Properties"},{"$f":"'Matl Properties'!$B$6","v":"Aggregate Properties (from laboratory testing)"},{"$f":"'Matl Properties'!B14","v":"Fine Aggregate 2:"},{"$f":"'Matl Properties'!$M$7","v":"Fineness Modulus (FM)*"}]
[88,{"$f":"IF('Matl Properties'!N14=\"\",\"\",'Matl Properties'!N14)","v":""},{"$f":"'Matl Properties'!$B$4","v":"Material Properties"},{"$f":"'Matl Properties'!$B$6","v":"Aggregate Properties (from laboratory testing)"},{"$f":"'Matl Properties'!B14","v":"Fine Aggregate 2:"},{"$f":"'Matl Properties'!$N$7","v":"Absorption (%)*"}]
[89,{"$f":"IF('Matl Properties'!E18=\"\",\"\",'Matl Properties'!E18)","v":""},{"$f":"'Matl Properties'!$B$4","v":"Material Properties"},{"$f":"'Matl Properties'!$B$16","v":"Cementitious Materials"},{"$f":"'Matl Properties'!$B$18","v":"Hydraulic cement"},{"$f":"'Matl Properties'!$E$17","v":"Producer*"}]
[90,{"$f":"IF('Matl Properties'!G18=\"\",\"\",'Matl Properties'!G18)","v":""},{"$f":"'Matl Properties'!$B$4","v":"Material Properties"},{"$f":"'Matl Properties'!$B$16","v":"Cementitious Materials"},{"$f":"'Matl Properties'!$B$18","v":"Hydraulic cement"},{"$f":"'Matl Properties'!$G$17","v":"Plant/Name*"}]
[91,{"$f":"IF('Matl Properties'!I18=\"\",\"\",'Matl Properties'!I18)","v":""},{"$f":"'Matl Properties'!$B$4","v":"Material Properties"},{"$f":"'Matl Properties'!$B$16","v":"Cementitious Materials"},{"$f":"'Matl Properties'!$B$18","v":"Hydraulic cement"},{"$f":"'Matl Properties'!$I$17","v":"Type/Class/Grade*"}]
[92,{"$f":"IF('Matl Properties'!K18=\"\",\"\",'Matl Properties'!K18)","v":""},{"$f":"'Matl Properties'!$B$4","v":"Material Properties"},{"$f":"'Matl Properties'!$B$16","v":"Cementitious Materials"},{"$f":"'Matl Properties'!$B$18","v":"Hydraulic cement"},{"$f":"'Matl Properties'!$K$17","v":"Specific Gravity*"}]
[93,{"$f":"IF('Matl Properties'!E19=\"\",\"\",'Matl Properties'!E19)","v":""},{"$f":"'Matl Properties'!$B$4","v":"Material Properties"},{"$f":"'Matl Properties'!$B$16","v":"Cementitious Materials"},{"$f":"'Matl Properties'!$B$19","v":0},{"$f":"'Matl Properties'!$E$17","v":"Producer*"}]
[94,{"$f":"IF('Matl Properties'!G19=\"\",\"\",'Matl Properties'!G19)","v":""},{"$f":"'Matl Properties'!$B$4","v":"Material Properties"},{"$f":"'Matl Properties'!$B$16","v":"Cementitious Materials"},{"$f":"'Matl Properties'!$B$19","v":0},{"$f":"'Matl Properties'!$G$17","v":"Plant/Name*"}]
[95,{"$f":"IF('Matl Properties'!I19=\"\",\"\",'Matl Properties'!I19)","v":""},{"$f":"'Matl Properties'!$B$4","v":"Material Properties"},{"$f":"'Matl Properties'!$B$16","v":"Cementitious Materials"},{"$f":"'Matl Properties'!$B$19","v":0},{"$f":"'Matl Properties'!$I$17","v":"Type/Class/Grade*"}]
[96,{"$f":"IF('Matl Properties'!K19=\"\",\"\",'Matl Properties'!K19)","v":""},{"$f":"'Matl Properties'!$B$4","v":"Material Properties"},{"$f":"'Matl Properties'!$B$16","v":"Cementitious Materials"},{"$f":"'Matl Properties'!$B$19","v":0},{"$f":"'Matl Properties'!$K$17","v":"Specific Gravity*"}]
[97,{"$f":"IF('Matl Properties'!E20=\"\",\"\",'Matl Properties'!E20)","v":""},{"$f":"'Matl Properties'!$B$4","v":"Material Properties"},{"$f":"'Matl Properties'!$B$16","v":"Cementitious Materials"},{"$f":"'Matl Properties'!$B$20","v":0},{"$f":"'Matl Properties'!$E$17","v":"Producer*"}]
[98,{"$f":"IF('Matl Properties'!G20=\"\",\"\",'Matl Properties'!G20)","v":""},{"$f":"'Matl Properties'!$B$4","v":"Material Properties"},{"$f":"'Matl Properties'!$B$16","v":"Cementitious Materials"},{"$f":"'Matl Properties'!$B$20","v":0},{"$f":"'Matl Properties'!$G$17","v":"Plant/Name*"}]
[99,{"$f":"IF('Matl Properties'!I20=\"\",\"\",'Matl Properties'!I20)","v":""},{"$f":"'Matl Properties'!$B$4","v":"Material Properties"},{"$f":"'Matl Properties'!$B$16","v":"Cementitious Materials"},{"$f":"'Matl Properties'!$B$20","v":0},{"$f":"'Matl Properties'!$I$17","v":"Type/Class/Grade*"}]
[100,{"$f":"IF('Matl Properties'!K20=\"\",\"\",'Matl Properties'!K20)","v":""},{"$f":"'Matl Properties'!$B$4","v":"Material Properties"},{"$f":"'Matl Properties'!$B$16","v":"Cementitious Materials"},{"$f":"'Matl Properties'!$B$20","v":0},{"$f":"'Matl Properties'!$K$17","v":"Specific Gravity*"}]
[101,{"$f":"IF('Matl Properties'!E21=\"\",\"\",'Matl Properties'!E21)","v":""},{"$f":"'Matl Properties'!$B$4","v":"Material Properties"},{"$f":"'Matl Properties'!$B$16","v":"Cementitious Materials"},{"$f":"'Matl Properties'!$B$21","v":0},{"$f":"'Matl Properties'!$E$17","v":"Producer*"}]
[102,{"$f":"IF('Matl Properties'!G21=\"\",\"\",'Matl Properties'!G21)","v":""},{"$f":"'Matl Properties'!$B$4","v":"Material Properties"},{"$f":"'Matl Properties'!$B$16","v":"Cementitious Materials"},{"$f":"'Matl Properties'!$B$21","v":0},{"$f":"'Matl Properties'!$G$17","v":"Plant/Name*"}]
[103,{"$f":"IF('Matl Properties'!I21=\"\",\"\",'Matl Properties'!I21)","v":""},{"$f":"'Matl Properties'!$B$4","v":"Material Properties"},{"$f":"'Matl Properties'!$B$16","v":"Cementitious Materials"},{"$f":"'Matl Properties'!$B$21","v":0},{"$f":"'Matl Properties'!$I$17","v":"Type/Class/Grade*"}]
[104,{"$f":"IF('Matl Properties'!K21=\"\",\"\",'Matl Properties'!K21)","v":""},{"$f":"'Matl Properties'!$B$4","v":"Material Properties"},{"$f":"'Matl Properties'!$B$16","v":"Cementitious Materials"},{"$f":"'Matl Properties'!$B$21","v":0},{"$f":"'Matl Properties'!$K$17","v":"Specific Gravity*"}]
[105,{"$f":"IF('Matl Properties'!E22=\"\",\"\",'Matl Properties'!E22)","v":""},{"$f":"'Matl Properties'!$B$4","v":"Material Properties"},{"$f":"'Matl Properties'!$B$16","v":"Cementitious Materials"},{"$f":"'Matl Properties'!$B$22","v":0},{"$f":"'Matl Properties'!$E$17","v":"Producer*"}]
[106,{"$f":"IF('Matl Properties'!G22=\"\",\"\",'Matl Properties'!G22)","v":""},{"$f":"'Matl Properties'!$B$4","v":"Material Properties"},{"$f":"'Matl Properties'!$B$16","v":"Cementitious Materials"},{"$f":"'Matl Properties'!$B$22","v":0},{"$f":"'Matl Properties'!$G$17","v":"Plant/Name*"}]
[107,{"$f":"IF('Matl Properties'!I22=\"\",\"\",'Matl Properties'!I22)","v":""},{"$f":"'Matl Properties'!$B$4","v":"Material Properties"},{"$f":"'Matl Properties'!$B$16","v":"Cementitious Materials"},{"$f":"'Matl Properties'!$B$22","v":0},{"$f":"'Matl Properties'!$I$17","v":"Type/Class/Grade*"}]
[108,{"$f":"IF('Matl Properties'!K22=\"\",\"\",'Matl Properties'!K22)","v":""},{"$f":"'Matl Properties'!$B$4","v":"Material Properties"},{"$f":"'Matl Properties'!$B$16","v":"Cementitious Materials"},{"$f":"'Matl Properties'!$B$22","v":0},{"$f":"'Matl Properties'!$K$17","v":"Specific Gravity*"}]
[109,{"$f":"IF('Matl Properties'!E23=\"\",\"\",'Matl Properties'!E23)","v":""},{"$f":"'Matl Properties'!$B$4","v":"Material Properties"},{"$f":"'Matl Properties'!$B$16","v":"Cementitious Materials"},{"$f":"'Matl Properties'!$B$23","v":0},{"$f":"'Matl Properties'!$E$17","v":"Producer*"}]
[110,{"$f":"IF('Matl Properties'!G23=\"\",\"\",'Matl Properties'!G23)","v":""},{"$f":"'Matl Properties'!$B$4","v":"Material Properties"},{"$f":"'Matl Properties'!$B$16","v":"Cementitious Materials"},{"$f":"'Matl Properties'!$B$23","v":0},{"$f":"'Matl Properties'!$G$17","v":"Plant/Name*"}]
[111,{"$f":"IF('Matl Properties'!I23=\"\",\"\",'Matl Properties'!I23)","v":""},{"$f":"'Matl Properties'!$B$4","v":"Material Properties"},{"$f":"'Matl Properties'!$B$16","v":"Cementitious Materials"},{"$f":"'Matl Properties'!$B$23","v":0},{"$f":"'Matl Properties'!$I$17","v":"Type/Class/Grade*"}]
[112,{"$f":"IF('Matl Properties'!K23=\"\",\"\",'Matl Properties'!K23)","v":""},{"$f":"'Matl Properties'!$B$4","v":"Material Properties"},{"$f":"'Matl Properties'!$B$16","v":"Cementitious Materials"},{"$f":"'Matl Properties'!$B$23","v":0},{"$f":"'Matl Properties'!$K$17","v":"Specific Gravity*"}]
[113,{"$f":"IF('Matl Properties'!E24=\"\",\"\",'Matl Properties'!E24)","v":""},{"$f":"'Matl Properties'!$B$4","v":"Material Properties"},{"$f":"'Matl Properties'!$B$16","v":"Cementitious Materials"},{"$f":"'Matl Properties'!$B$24","v":0},{"$f":"'Matl Properties'!$E$17","v":"Producer*"}]
[114,{"$f":"IF('Matl Properties'!G24=\"\",\"\",'Matl Properties'!G24)","v":""},{"$f":"'Matl Properties'!$B$4","v":"Material Properties"},{"$f":"'Matl Properties'!$B$16","v":"Cementitious Materials"},{"$f":"'Matl Properties'!$B$24","v":0},{"$f":"'Matl Properties'!$G$17","v":"Plant/Name*"}]
[115,{"$f":"IF('Matl Properties'!I24=\"\",\"\",'Matl Properties'!I24)","v":""},{"$f":"'Matl Properties'!$B$4","v":"Material Properties"},{"$f":"'Matl Properties'!$B$16","v":"Cementitious Materials"},{"$f":"'Matl Properties'!$B$24","v":0},{"$f":"'Matl Properties'!$I$17","v":"Type/Class/Grade*"}]
[116,{"$f":"IF('Matl Properties'!K24=\"\",\"\",'Matl Properties'!K24)","v":""},{"$f":"'Matl Properties'!$B$4","v":"Material Properties"},{"$f":"'Matl Properties'!$B$16","v":"Cementitious Materials"},{"$f":"'Matl Properties'!$B$24","v":0},{"$f":"'Matl Properties'!$K$17","v":"Specific Gravity*"}]
[117,{"$f":"IF('Matl Properties'!E25=\"\",\"\",'Matl Properties'!E25)","v":""},{"$f":"'Matl Properties'!$B$4","v":"Material Properties"},{"$f":"'Matl Properties'!$B$16","v":"Cementitious Materials"},{"$f":"'Matl Properties'!$B$25","v":0},{"$f":"'Matl Properties'!$E$17","v":"Producer*"}]
[118,{"$f":"IF('Matl Properties'!G25=\"\",\"\",'Matl Properties'!G25)","v":""},{"$f":"'Matl Properties'!$B$4","v":"Material Properties"},{"$f":"'Matl Properties'!$B$16","v":"Cementitious Materials"},{"$f":"'Matl Properties'!$B$25","v":0},{"$f":"'Matl Properties'!$G$17","v":"Plant/Name*"}]
[119,{"$f":"IF('Matl Properties'!I25=\"\",\"\",'Matl Properties'!I25)","v":""},{"$f":"'Matl Properties'!$B$4","v":"Material Properties"},{"$f":"'Matl Properties'!$B$16","v":"Cementitious Materials"},{"$f":"'Matl Properties'!$B$25","v":0},{"$f":"'Matl Properties'!$I$17","v":"Type/Class/Grade*"}]
[120,{"$f":"IF('Matl Properties'!K25=\"\",\"\",'Matl Properties'!K25)","v":""},{"$f":"'Matl Properties'!$B$4","v":"Material Properties"},{"$f":"'Matl Properties'!$B$16","v":"Cementitious Materials"},{"$f":"'Matl Properties'!$B$25","v":0},{"$f":"'Matl Properties'!$K$17","v":"Specific Gravity*"}]
[121,{"$f":"IF('Matl Properties'!E26=\"\",\"\",'Matl Properties'!E26)","v":""},{"$f":"'Matl Properties'!$B$4","v":"Material Properties"},{"$f":"'Matl Properties'!$B$16","v":"Cementitious Materials"},{"$f":"'Matl Properties'!$B$26","v":0},{"$f":"'Matl Properties'!$E$17","v":"Producer*"}]
[122,{"$f":"IF('Matl Properties'!G26=\"\",\"\",'Matl Properties'!G26)","v":""},{"$f":"'Matl Properties'!$B$4","v":"Material Properties"},{"$f":"'Matl Properties'!$B$16","v":"Cementitious Materials"},{"$f":"'Matl Properties'!$B$26","v":0},{"$f":"'Matl Properties'!$G$17","v":"Plant/Name*"}]
[123,{"$f":"IF('Matl Properties'!I26=\"\",\"\",'Matl Properties'!I26)","v":""},{"$f":"'Matl Properties'!$B$4","v":"Material Properties"},{"$f":"'Matl Properties'!$B$16","v":"Cementitious Materials"},{"$f":"'Matl Properties'!$B$26","v":0},{"$f":"'Matl Properties'!$I$17","v":"Type/Class/Grade*"}]
[124,{"$f":"IF('Matl Properties'!K26=\"\",\"\",'Matl Properties'!K26)","v":""},{"$f":"'Matl Properties'!$B$4","v":"Material Properties"},{"$f":"'Matl Properties'!$B$16","v":"Cementitious Materials"},{"$f":"'Matl Properties'!$B$26","v":0},{"$f":"'Matl Properties'!$K$17","v":"Specific Gravity*"}]
[125,{"$f":"IF('Matl Properties'!P18=\"\",\"\",'Matl Properties'!P18)","v":""},{"$f":"'Matl Properties'!$B$4","v":"Material Properties"},{"$f":"'Matl Properties'!$M$16","v":"Chemical Admixtures"},{"$f":"'Matl Properties'!$N$18","v":0},{"$f":"'Matl Properties'!$P$17","v":"Producer*"}]
[126,{"$f":"IF('Matl Properties'!R18=\"\",\"\",'Matl Properties'!R18)","v":""},{"$f":"'Matl Properties'!$B$4","v":"Material Properties"},{"$f":"'Matl Properties'!$M$16","v":"Chemical Admixtures"},{"$f":"'Matl Properties'!$N$18","v":0},{"$f":"'Matl Properties'!$R$17","v":"Name*"}]
[127,{"$f":"IF('Matl Properties'!T18=\"\",\"\",'Matl Properties'!T18)","v":""},{"$f":"'Matl Properties'!$B$4","v":"Material Properties"},{"$f":"'Matl Properties'!$M$16","v":"Chemical Admixtures"},{"$f":"'Matl Properties'!$N$18","v":0},{"$f":"'Matl Properties'!$T$17","v":"% Solids*"}]
[128,{"$f":"IF('Matl Properties'!P19=\"\",\"\",'Matl Properties'!P19)","v":""},{"$f":"'Matl Properties'!$B$4","v":"Material Properties"},{"$f":"'Matl Properties'!$M$16","v":"Chemical Admixtures"},{"$f":"'Matl Properties'!$N$19","v":0},{"$f":"'Matl Properties'!$P$17","v":"Producer*"}]
[129,{"$f":"IF('Matl Properties'!R19=\"\",\"\",'Matl Properties'!R19)","v":""},{"$f":"'Matl Properties'!$B$4","v":"Material Properties"},{"$f":"'Matl Properties'!$M$16","v":"Chemical Admixtures"},{"$f":"'Matl Properties'!$N$19","v":0},{"$f":"'Matl Properties'!$R$17","v":"Name*"}]
[130,{"$f":"IF('Matl Properties'!T19=\"\",\"\",'Matl Properties'!T19)","v":""},{"$f":"'Matl Properties'!$B$4","v":"Material Properties"},{"$f":"'Matl Properties'!$M$16","v":"Chemical Admixtures"},{"$f":"'Matl Properties'!$N$19","v":0},{"$f":"'Matl Properties'!$T$17","v":"% Solids*"}]
[131,{"$f":"IF('Matl Properties'!P20=\"\",\"\",'Matl Properties'!P20)","v":""},{"$f":"'Matl Properties'!$B$4","v":"Material Properties"},{"$f":"'Matl Properties'!$M$16","v":"Chemical Admixtures"},{"$f":"'Matl Properties'!$N$20","v":0},{"$f":"'Matl Properties'!$P$17","v":"Producer*"}]
[132,{"$f":"IF('Matl Properties'!R20=\"\",\"\",'Matl Properties'!R20)","v":""},{"$f":"'Matl Properties'!$B$4","v":"Material Properties"},{"$f":"'Matl Properties'!$M$16","v":"Chemical Admixtures"},{"$f":"'Matl Properties'!$N$20","v":0},{"$f":"'Matl Properties'!$R$17","v":"Name*"}]
[133,{"$f":"IF('Matl Properties'!T20=\"\",\"\",'Matl Properties'!T20)","v":""},{"$f":"'Matl Properties'!$B$4","v":"Material Properties"},{"$f":"'Matl Properties'!$M$16","v":"Chemical Admixtures"},{"$f":"'Matl Properties'!$N$20","v":0},{"$f":"'Matl Properties'!$T$17","v":"% Solids*"}]
[134,{"$f":"IF('Matl Properties'!P21=\"\",\"\",'Matl Properties'!P21)","v":""},{"$f":"'Matl Properties'!$B$4","v":"Material Properties"},{"$f":"'Matl Properties'!$M$16","v":"Chemical Admixtures"},{"$f":"'Matl Properties'!$N$21","v":0},{"$f":"'Matl Properties'!$P$17","v":"Producer*"}]
[135,{"$f":"IF('Matl Properties'!R21=\"\",\"\",'Matl Properties'!R21)","v":""},{"$f":"'Matl Properties'!$B$4","v":"Material Properties"},{"$f":"'Matl Properties'!$M$16","v":"Chemical Admixtures"},{"$f":"'Matl Properties'!$N$21","v":0},{"$f":"'Matl Properties'!$R$17","v":"Name*"}]
[136,{"$f":"IF('Matl Properties'!T21=\"\",\"\",'Matl Properties'!T21)","v":""},{"$f":"'Matl Properties'!$B$4","v":"Material Properties"},{"$f":"'Matl Properties'!$M$16","v":"Chemical Admixtures"},{"$f":"'Matl Properties'!$N$21","v":0},{"$f":"'Matl Properties'!$T$17","v":"% Solids*"}]
[137,{"$f":"IF('Matl Properties'!P22=\"\",\"\",'Matl Properties'!P22)","v":""},{"$f":"'Matl Properties'!$B$4","v":"Material Properties"},{"$f":"'Matl Properties'!$M$16","v":"Chemical Admixtures"},{"$f":"'Matl Properties'!$N$22","v":0},{"$f":"'Matl Properties'!$P$17","v":"Producer*"}]
[138,{"$f":"IF('Matl Properties'!R22=\"\",\"\",'Matl Properties'!R22)","v":""},{"$f":"'Matl Properties'!$B$4","v":"Material Properties"},{"$f":"'Matl Properties'!$M$16","v":"Chemical Admixtures"},{"$f":"'Matl Properties'!$N$22","v":0},{"$f":"'Matl Properties'!$R$17","v":"Name*"}]
[139,{"$f":"IF('Matl Properties'!T22=\"\",\"\",'Matl Properties'!T22)","v":""},{"$f":"'Matl Properties'!$B$4","v":"Material Properties"},{"$f":"'Matl Properties'!$M$16","v":"Chemical Admixtures"},{"$f":"'Matl Properties'!$N$22","v":0},{"$f":"'Matl Properties'!$T$17","v":"% Solids*"}]
[140,{"$f":"IF('Matl Properties'!P23=\"\",\"\",'Matl Properties'!P23)","v":""},{"$f":"'Matl Properties'!$B$4","v":"Material Properties"},{"$f":"'Matl Properties'!$M$16","v":"Chemical Admixtures"},{"$f":"'Matl Properties'!$N$23","v":0},{"$f":"'Matl Properties'!$P$17","v":"Producer*"}]
[141,{"$f":"IF('Matl Properties'!R23=\"\",\"\",'Matl Properties'!R23)","v":""},{"$f":"'Matl Properties'!$B$4","v":"Material Properties"},{"$f":"'Matl Properties'!$M$16","v":"Chemical Admixtures"},{"$f":"'Matl Properties'!$N$23","v":0},{"$f":"'Matl Properties'!$R$17","v":"Name*"}]
[142,{"$f":"IF('Matl Properties'!T23=\"\",\"\",'Matl Properties'!T23)","v":""},{"$f":"'Matl Properties'!$B$4","v":"Material Properties"},{"$f":"'Matl Properties'!$M$16","v":"Chemical Admixtures"},{"$f":"'Matl Properties'!$N$23","v":0},{"$f":"'Matl Properties'!$T$17","v":"% Solids*"}]
[143,{"$f":"IF('Matl Properties'!P24=\"\",\"\",'Matl Properties'!P24)","v":""},{"$f":"'Matl Properties'!$B$4","v":"Material Properties"},{"$f":"'Matl Properties'!$M$16","v":"Chemical Admixtures"},{"$f":"'Matl Properties'!$N$24","v":0},{"$f":"'Matl Properties'!$P$17","v":"Producer*"}]
[144,{"$f":"IF('Matl Properties'!R24=\"\",\"\",'Matl Properties'!R24)","v":""},{"$f":"'Matl Properties'!$B$4","v":"Material Properties"},{"$f":"'Matl Properties'!$M$16","v":"Chemical Admixtures"},{"$f":"'Matl Properties'!$N$24","v":0},{"$f":"'Matl Properties'!$R$17","v":"Name*"}]
[145,{"$f":"IF('Matl Properties'!T24=\"\",\"\",'Matl Properties'!T24)","v":""},{"$f":"'Matl Properties'!$B$4","v":"Material Properties"},{"$f":"'Matl Properties'!$M$16","v":"Chemical Admixtures"},{"$f":"'Matl Properties'!$N$24","v":0},{"$f":"'Matl Properties'!$T$17","v":"% Solids*"}]
[146,{"$f":"IF('Matl Properties'!P25=\"\",\"\",'Matl Properties'!P25)","v":""},{"$f":"'Matl Properties'!$B$4","v":"Material Properties"},{"$f":"'Matl Properties'!$M$16","v":"Chemical Admixtures"},{"$f":"'Matl Properties'!$N$25","v":0},{"$f":"'Matl Properties'!$P$17","v":"Producer*"}]
[147,{"$f":"IF('Matl Properties'!R25=\"\",\"\",'Matl Properties'!R25)","v":""},{"$f":"'Matl Properties'!$B$4","v":"Material Properties"},{"$f":"'Matl Properties'!$M$16","v":"Chemical Admixtures"},{"$f":"'Matl Properties'!$N$25","v":0},{"$f":"'Matl Properties'!$R$17","v":"Name*"}]
[148,{"$f":"IF('Matl Properties'!T25=\"\",\"\",'Matl Properties'!T25)","v":""},{"$f":"'Matl Properties'!$B$4","v":"Material Properties"},{"$f":"'Matl Properties'!$M$16","v":"Chemical Admixtures"},{"$f":"'Matl Properties'!$N$25","v":0},{"$f":"'Matl Properties'!$T$17","v":"% Solids*"}]
[149,{"$f":"IF('Matl Properties'!P26=\"\",\"\",'Matl Properties'!P26)","v":""},{"$f":"'Matl Properties'!$B$4","v":"Material Properties"},{"$f":"'Matl Properties'!$M$16","v":"Chemical Admixtures"},{"$f":"'Matl Properties'!$N$26","v":0},{"$f":"'Matl Properties'!$P$17","v":"Producer*"}]
[150,{"$f":"IF('Matl Properties'!R26=\"\",\"\",'Matl Properties'!R26)","v":""},{"$f":"'Matl Properties'!$B$4","v":"Material Properties"},{"$f":"'Matl Properties'!$M$16","v":"Chemical Admixtures"},{"$f":"'Matl Properties'!$N$26","v":0},{"$f":"'Matl Properties'!$R$17","v":"Name*"}]
[151,{"$f":"IF('Matl Properties'!T26=\"\",\"\",'Matl Properties'!T26)","v":""},{"$f":"'Matl Properties'!$B$4","v":"Material Properties"},{"$f":"'Matl Properties'!$M$16","v":"Chemical Admixtures"},{"$f":"'Matl Properties'!$N$26","v":0},{"$f":"'Matl Properties'!$T$17","v":"% Solids*"}]
[152,{"$f":"IF('Matl Properties'!D30=\"\",\"\",'Matl Properties'!D30)","v":""},{"$f":"'Matl Properties'!$B$4","v":"Material Properties"},{"$f":"'Matl Properties'!$B$28","v":"Other Materials"},{"$f":"'Matl Properties'!$B$30","v":"Fibers"},{"$f":"'Matl Properties'!$D$29","v":"Producer*"}]
[153,{"$f":"IF('Matl Properties'!F30=\"\",\"\",'Matl Properties'!F30)","v":""},{"$f":"'Matl Properties'!$B$4","v":"Material Properties"},{"$f":"'Matl Properties'!$B$28","v":"Other Materials"},{"$f":"'Matl Properties'!$B$30","v":"Fibers"},{"$f":"'Matl Properties'!$F$29","v":"Name*"}]
[154,{"$f":"IF('Matl Properties'!H30=\"\",\"\",'Matl Properties'!H30)","v":""},{"$f":"'Matl Properties'!$B$4","v":"Material Properties"},{"$f":"'Matl Properties'!$B$28","v":"Other Materials"},{"$f":"'Matl Properties'!$B$30","v":"Fibers"},{"$f":"'Matl Properties'!$H$29","v":"Specific Gravity*"}]
[155,{"$f":"IF('Matl Properties'!D31=\"\",\"\",'Matl Properties'!D31)","v":""},{"$f":"'Matl Properties'!$B$4","v":"Material Properties"},{"$f":"'Matl Properties'!$B$28","v":"Other Materials"},{"$f":"'Matl Properties'!$B$31","v":0},{"$f":"'Matl Properties'!$D$29","v":"Producer*"}]
[156,{"$f":"IF('Matl Properties'!F31=\"\",\"\",'Matl Properties'!F31)","v":""},{"$f":"'Matl Properties'!$B$4","v":"Material Properties"},{"$f":"'Matl Properties'!$B$28","v":"Other Materials"},{"$f":"'Matl Properties'!$B$31","v":0},{"$f":"'Matl Properties'!$F$29","v":"Name*"}]
[157,{"$f":"IF('Matl Properties'!H31=\"\",\"\",'Matl Properties'!H31)","v":""},{"$f":"'Matl Properties'!$B$4","v":"Material Properties"},{"$f":"'Matl Properties'!$B$28","v":"Other Materials"},{"$f":"'Matl Properties'!$B$31","v":0},{"$f":"'Matl Properties'!$H$29","v":"Specific Gravity*"}]
[158,{"$f":"IF('Optimized Gradation'!D10=\"\",\"\",'Optimized Gradation'!D10)","v":""},{"$f":"'Optimized Gradation'!$B$6","v":"Optimized Gradation"},{"$f":"'Optimized Gradation'!$B$8","v":"Sieve Analysis"},{"$f":"'Optimized Gradation'!$D$9","v":"Coarse Agg. 1\n% Passing"},{"$f":"'Optimized Gradation'!B10","v":"2 1/2 in"}]
[159,{"$f":"IF('Optimized Gradation'!D11=\"\",\"\",'Optimized Gradation'!D11)","v":""},{"$f":"'Optimized Gradation'!$B$6","v":"Optimized Gradation"},{"$f":"'Optimized Gradation'!$B$8","v":"Sieve Analysis"},{"$f":"'Optimized Gradation'!$D$9","v":"Coarse Agg. 1\n% Passing"},{"$f":"'Optimized Gradation'!B11","v":"2 in"}]
[160,{"$f":"IF('Optimized Gradation'!D12=\"\",\"\",'Optimized Gradation'!D12)","v":""},{"$f":"'Optimized Gradation'!$B$6","v":"Optimized Gradation"},{"$f":"'Optimized Gradation'!$B$8","v":"Sieve Analysis"},{"$f":"'Optimized Gradation'!$D$9","v":"Coarse Agg. 1\n% Passing"},{"$f":"'Optimized Gradation'!B12","v":"1 1/2 in"}]
[161,{"$f":"IF('Optimized Gradation'!D13=\"\",\"\",'Optimized Gradation'!D13)","v":""},{"$f":"'Optimized Gradation'!$B$6","v":"Optimized Gradation"},{"$f":"'Optimized Gradation'!$B$8","v":"Sieve Analysis"},{"$f":"'Optimized Gradation'!$D$9","v":"Coarse Agg. 1\n% Passing"},{"$f":"'Optimized Gradation'!B13","v":"1 in"}]
[162,{"$f":"IF('Optimized Gradation'!D14=\"\",\"\",'Optimized Gradation'!D14)","v":""},{"$f":"'Optimized Gradation'!$B$6","v":"Optimized Gradation"},{"$f":"'Optimized Gradation'!$B$8","v":"Sieve Analysis"},{"$f":"'Optimized Gradation'!$D$9","v":"Coarse Agg. 1\n% Passing"},{"$f":"'Optimized Gradation'!B14","v":"3/4 in"}]
[163,{"$f":"IF('Optimized Gradation'!D15=\"\",\"\",'Optimized Gradation'!D15)","v":""},{"$f":"'Optimized Gradation'!$B$6","v":"Optimized Gradation"},{"$f":"'Optimized Gradation'!$B$8","v":"Sieve Analysis"},{"$f":"'Optimized Gradation'!$D$9","v":"Coarse Agg. 1\n% Passing"},{"$f":"'Optimized Gradation'!B15","v":"1/2 in"}]
[164,{"$f":"IF('Optimized Gradation'!D16=\"\",\"\",'Optimized Gradation'!D16)","v":""},{"$f":"'Optimized Gradation'!$B$6","v":"Optimized Gradation"},{"$f":"'Optimized Gradation'!$B$8","v":"Sieve Analysis"},{"$f":"'Optimized Gradation'!$D$9","v":"Coarse Agg. 1\n% Passing"},{"$f":"'Optimized Gradation'!B16","v":"3/8 in"}]
[165,{"$f":"IF('Optimized Gradation'!D17=\"\",\"\",'Optimized Gradation'!D17)","v":""},{"$f":"'Optimized Gradation'!$B$6","v":"Optimized Gradation"},{"$f":"'Optimized Gradation'!$B$8","v":"Sieve Analysis"},{"$f":"'Optimized Gradation'!$D$9","v":"Coarse Agg. 1\n% Passing"},{"$f":"'Optimized Gradation'!B17","v":"No. 4"}]
[166,{"$f":"IF('Optimized Gradation'!D18=\"\",\"\",'Optimized Gradation'!D18)","v":""},{"$f":"'Optimized Gradation'!$B$6","v":"Optimized Gradation"},{"$f":"'Optimized Gradation'!$B$8","v":"Sieve Analysis"},{"$f":"'Optimized Gradation'!$D$9","v":"Coarse Agg. 1\n% Passing"},{"$f":"'Optimized Gradation'!B18","v":"No. 8"}]
[167,{"$f":"IF('Optimized Gradation'!D19=\"\",\"\",'Optimized Gradation'!D19)","v":""},{"$f":"'Optimized Gradation'!$B$6","v":"Optimized Gradation"},{"$f":"'Optimized Gradation'!$B$8","v":"Sieve Analysis"},{"$f":"'Optimized Gradation'!$D$9","v":"Coarse Agg. 1\n% Passing"},{"$f":"'Optimized Gradation'!B19","v":"No. 16"}]
[168,{"$f":"IF('Optimized Gradation'!D20=\"\",\"\",'Optimized Gradation'!D20)","v":""},{"$f":"'Optimized Gradation'!$B$6","v":"Optimized Gradation"},{"$f":"'Optimized Gradation'!$B$8","v":"Sieve Analysis"},{"$f":"'Optimized Gradation'!$D$9","v":"Coarse Agg. 1\n% Passing"},{"$f":"'Optimized Gradation'!B20","v":"No. 30"}]
[169,{"$f":"IF('Optimized Gradation'!D21=\"\",\"\",'Optimized Gradation'!D21)","v":""},{"$f":"'Optimized Gradation'!$B$6","v":"Optimized Gradation"},{"$f":"'Optimized Gradation'!$B$8","v":"Sieve Analysis"},{"$f":"'Optimized Gradation'!$D$9","v":"Coarse Agg. 1\n% Passing"},{"$f":"'Optimized Gradation'!B21","v":"No. 50"}]
[170,{"$f":"IF('Optimized Gradation'!D22=\"\",\"\",'Optimized Gradation'!D22)","v":""},{"$f":"'Optimized Gradation'!$B$6","v":"Optimized Gradation"},{"$f":"'Optimized Gradation'!$B$8","v":"Sieve Analysis"},{"$f":"'Optimized Gradation'!$D$9","v":"Coarse Agg. 1\n% Passing"},{"$f":"'Optimized Gradation'!B22","v":"No. 100"}]
[171,{"$f":"IF('Optimized Gradation'!D23=\"\",\"\",'Optimized Gradation'!D23)","v":""},{"$f":"'Optimized Gradation'!$B$6","v":"Optimized Gradation"},{"$f":"'Optimized Gradation'!$B$8","v":"Sieve Analysis"},{"$f":"'Optimized Gradation'!$D$9","v":"Coarse Agg. 1\n% Passing"},{"$f":"'Optimized Gradation'!B23","v":"No. 200"}]
[172,{"$f":"IF('Optimized Gradation'!D24=\"\",\"\",'Optimized Gradation'!D24)","v":""},{"$f":"'Optimized Gradation'!$B$6","v":"Optimized Gradation"},{"$f":"'Optimized Gradation'!$B$8","v":"Sieve Analysis"},{"$f":"'Optimized Gradation'!$D$9","v":"Coarse Agg. 1\n% Passing"},{"$f":"'Optimized Gradation'!B24","v":"Pan"}]
[173,{"$f":"IF('Optimized Gradation'!D25=\"\",\"\",'Optimized Gradation'!D25)","v":""},{"$f":"'Optimized Gradation'!$B$6","v":"Optimized Gradation"},{"$f":"'Optimized Gradation'!$B$8","v":"Sieve Analysis"},{"$f":"'Optimized Gradation'!$D$9","v":"Coarse Agg. 1\n% Passing"},{"$f":"'Optimized Gradation'!B25","v":"Percent  of Total Agg."}]
[174,{"$f":"IF('Optimized Gradation'!E10=\"\",\"\",'Optimized Gradation'!E10)","v":""},{"$f":"'Optimized Gradation'!$B$6","v":"Optimized Gradation"},{"$f":"'Optimized Gradation'!$B$8","v":"Sieve Analysis"},{"$f":"'Optimized Gradation'!$E$9","v":"Coarse Agg. 2\n% Passing"},{"$f":"'Optimized Gradation'!B10","v":"2 1/2 in"}]
[175,{"$f":"IF('Optimized Gradation'!E11=\"\",\"\",'Optimized Gradation'!E11)","v":""},{"$f":"'Optimized Gradation'!$B$6","v":"Optimized Gradation"},{"$f":"'Optimized Gradation'!$B$8","v":"Sieve Analysis"},{"$f":"'Optimized Gradation'!$E$9","v":"Coarse Agg. 2\n% Passing"},{"$f":"'Optimized Gradation'!B11","v":"2 in"}]
[176,{"$f":"IF('Optimized Gradation'!E12=\"\",\"\",'Optimized Gradation'!E12)","v":""},{"$f":"'Optimized Gradation'!$B$6","v":"Optimized Gradation"},{"$f":"'Optimized Gradation'!$B$8","v":"Sieve Analysis"},{"$f":"'Optimized Gradation'!$E$9","v":"Coarse Agg. 2\n% Passing"},{"$f":"'Optimized Gradation'!B12","v":"1 1/2 in"}]
[177,{"$f":"IF('Optimized Gradation'!E13=\"\",\"\",'Optimized Gradation'!E13)","v":""},{"$f":"'Optimized Gradation'!$B$6","v":"Optimized Gradation"},{"$f":"'Optimized Gradation'!$B$8","v":"Sieve Analysis"},{"$f":"'Optimized Gradation'!$E$9","v":"Coarse Agg. 2\n% Passing"},{"$f":"'Optimized Gradation'!B13","v":"1 in"}]
[178,{"$f":"IF('Optimized Gradation'!E14=\"\",\"\",'Optimized Gradation'!E14)","v":""},{"$f":"'Optimized Gradation'!$B$6","v":"Optimized Gradation"},{"$f":"'Optimized Gradation'!$B$8","v":"Sieve Analysis"},{"$f":"'Optimized Gradation'!$E$9","v":"Coarse Agg. 2\n% Passing"},{"$f":"'Optimized Gradation'!B14","v":"3/4 in"}]
[179,{"$f":"IF('Optimized Gradation'!E15=\"\",\"\",'Optimized Gradation'!E15)","v":""},{"$f":"'Optimized Gradation'!$B$6","v":"Optimized Gradation"},{"$f":"'Optimized Gradation'!$B$8","v":"Sieve Analysis"},{"$f":"'Optimized Gradation'!$E$9","v":"Coarse Agg. 2\n% Passing"},{"$f":"'Optimized Gradation'!B15","v":"1/2 in"}]
[180,{"$f":"IF('Optimized Gradation'!E16=\"\",\"\",'Optimized Gradation'!E16)","v":""},{"$f":"'Optimized Gradation'!$B$6","v":"Optimized Gradation"},{"$f":"'Optimized Gradation'!$B$8","v":"Sieve Analysis"},{"$f":"'Optimized Gradation'!$E$9","v":"Coarse Agg. 2\n% Passing"},{"$f":"'Optimized Gradation'!B16","v":"3/8 in"}]
[181,{"$f":"IF('Optimized Gradation'!E17=\"\",\"\",'Optimized Gradation'!E17)","v":""},{"$f":"'Optimized Gradation'!$B$6","v":"Optimized Gradation"},{"$f":"'Optimized Gradation'!$B$8","v":"Sieve Analysis"},{"$f":"'Optimized Gradation'!$E$9","v":"Coarse Agg. 2\n% Passing"},{"$f":"'Optimized Gradation'!B17","v":"No. 4"}]
[182,{"$f":"IF('Optimized Gradation'!E18=\"\",\"\",'Optimized Gradation'!E18)","v":""},{"$f":"'Optimized Gradation'!$B$6","v":"Optimized Gradation"},{"$f":"'Optimized Gradation'!$B$8","v":"Sieve Analysis"},{"$f":"'Optimized Gradation'!$E$9","v":"Coarse Agg. 2\n% Passing"},{"$f":"'Optimized Gradation'!B18","v":"No. 8"}]
[183,{"$f":"IF('Optimized Gradation'!E19=\"\",\"\",'Optimized Gradation'!E19)","v":""},{"$f":"'Optimized Gradation'!$B$6","v":"Optimized Gradation"},{"$f":"'Optimized Gradation'!$B$8","v":"Sieve Analysis"},{"$f":"'Optimized Gradation'!$E$9","v":"Coarse Agg. 2\n% Passing"},{"$f":"'Optimized Gradation'!B19","v":"No. 16"}]
[184,{"$f":"IF('Optimized Gradation'!E20=\"\",\"\",'Optimized Gradation'!E20)","v":""},{"$f":"'Optimized Gradation'!$B$6","v":"Optimized Gradation"},{"$f":"'Optimized Gradation'!$B$8","v":"Sieve Analysis"},{"$f":"'Optimized Gradation'!$E$9","v":"Coarse Agg. 2\n% Passing"},{"$f":"'Optimized Gradation'!B20","v":"No. 30"}]
[185,{"$f":"IF('Optimized Gradation'!E21=\"\",\"\",'Optimized Gradation'!E21)","v":""},{"$f":"'Optimized Gradation'!$B$6","v":"Optimized Gradation"},{"$f":"'Optimized Gradation'!$B$8","v":"Sieve Analysis"},{"$f":"'Optimized Gradation'!$E$9","v":"Coarse Agg. 2\n% Passing"},{"$f":"'Optimized Gradation'!B21","v":"No. 50"}]
[186,{"$f":"IF('Optimized Gradation'!E22=\"\",\"\",'Optimized Gradation'!E22)","v":""},{"$f":"'Optimized Gradation'!$B$6","v":"Optimized Gradation"},{"$f":"'Optimized Gradation'!$B$8","v":"Sieve Analysis"},{"$f":"'Optimized Gradation'!$E$9","v":"Coarse Agg. 2\n% Passing"},{"$f":"'Optimized Gradation'!B22","v":"No. 100"}]
[187,{"$f":"IF('Optimized Gradation'!E23=\"\",\"\",'Optimized Gradation'!E23)","v":""},{"$f":"'Optimized Gradation'!$B$6","v":"Optimized Gradation"},{"$f":"'Optimized Gradation'!$B$8","v":"Sieve Analysis"},{"$f":"'Optimized Gradation'!$E$9","v":"Coarse Agg. 2\n% Passing"},{"$f":"'Optimized Gradation'!B23","v":"No. 200"}]
[188,{"$f":"IF('Optimized Gradation'!E24=\"\",\"\",'Optimized Gradation'!E24)","v":""},{"$f":"'Optimized Gradation'!$B$6","v":"Optimized Gradation"},{"$f":"'Optimized Gradation'!$B$8","v":"Sieve Analysis"},{"$f":"'Optimized Gradation'!$E$9","v":"Coarse Agg. 2\n% Passing"},{"$f":"'Optimized Gradation'!B24","v":"Pan"}]
[189,{"$f":"IF('Optimized Gradation'!E25=\"\",\"\",'Optimized Gradation'!E25)","v":""},{"$f":"'Optimized Gradation'!$B$6","v":"Optimized Gradation"},{"$f":"'Optimized Gradation'!$B$8","v":"Sieve Analysis"},{"$f":"'Optimized Gradation'!$E$9","v":"Coarse Agg. 2\n% Passing"},{"$f":"'Optimized Gradation'!B25","v":"Percent  of Total Agg."}]
[190,{"$f":"IF('Optimized Gradation'!F10=\"\",\"\",'Optimized Gradation'!F10)","v":""},{"$f":"'Optimized Gradation'!$B$6","v":"Optimized Gradation"},{"$f":"'Optimized Gradation'!$B$8","v":"Sieve Analysis"},{"$f":"'Optimized Gradation'!$F$9","v":"Intermediate Agg. 1\n% Passing"},{"$f":"'Optimized Gradation'!B10","v":"2 1/2 in"}]
[191,{"$f":"IF('Optimized Gradation'!F11=\"\",\"\",'Optimized Gradation'!F11)","v":""},{"$f":"'Optimized Gradation'!$B$6","v":"Optimized Gradation"},{"$f":"'Optimized Gradation'!$B$8","v":"Sieve Analysis"},{"$f":"'Optimized Gradation'!$F$9","v":"Intermediate Agg. 1\n% Passing"},{"$f":"'Optimized Gradation'!B11","v":"2 in"}]
[192,{"$f":"IF('Optimized Gradation'!F12=\"\",\"\",'Optimized Gradation'!F12)","v":""},{"$f":"'Optimized Gradation'!$B$6","v":"Optimized Gradation"},{"$f":"'Optimized Gradation'!$B$8","v":"Sieve Analysis"},{"$f":"'Optimized Gradation'!$F$9","v":"Intermediate Agg. 1\n% Passing"},{"$f":"'Optimized Gradation'!B12","v":"1 1/2 in"}]
[193,{"$f":"IF('Optimized Gradation'!F13=\"\",\"\",'Optimized Gradation'!F13)","v":""},{"$f":"'Optimized Gradation'!$B$6","v":"Optimized Gradation"},{"$f":"'Optimized Gradation'!$B$8","v":"Sieve Analysis"},{"$f":"'Optimized Gradation'!$F$9","v":"Intermediate Agg. 1\n% Passing"},{"$f":"'Optimized Gradation'!B13","v":"1 in"}]
[194,{"$f":"IF('Optimized Gradation'!F14=\"\",\"\",'Optimized Gradation'!F14)","v":""},{"$f":"'Optimized Gradation'!$B$6","v":"Optimized Gradation"},{"$f":"'Optimized Gradation'!$B$8","v":"Sieve Analysis"},{"$f":"'Optimized Gradation'!$F$9","v":"Intermediate Agg. 1\n% Passing"},{"$f":"'Optimized Gradation'!B14","v":"3/4 in"}]
[195,{"$f":"IF('Optimized Gradation'!F15=\"\",\"\",'Optimized Gradation'!F15)","v":""},{"$f":"'Optimized Gradation'!$B$6","v":"Optimized Gradation"},{"$f":"'Optimized Gradation'!$B$8","v":"Sieve Analysis"},{"$f":"'Optimized Gradation'!$F$9","v":"Intermediate Agg. 1\n% Passing"},{"$f":"'Optimized Gradation'!B15","v":"1/2 in"}]
[196,{"$f":"IF('Optimized Gradation'!F16=\"\",\"\",'Optimized Gradation'!F16)","v":""},{"$f":"'Optimized Gradation'!$B$6","v":"Optimized Gradation"},{"$f":"'Optimized Gradation'!$B$8","v":"Sieve Analysis"},{"$f":"'Optimized Gradation'!$F$9","v":"Intermediate Agg. 1\n% Passing"},{"$f":"'Optimized Gradation'!B16","v":"3/8 in"}]
[197,{"$f":"IF('Optimized Gradation'!F17=\"\",\"\",'Optimized Gradation'!F17)","v":""},{"$f":"'Optimized Gradation'!$B$6","v":"Optimized Gradation"},{"$f":"'Optimized Gradation'!$B$8","v":"Sieve Analysis"},{"$f":"'Optimized Gradation'!$F$9","v":"Intermediate Agg. 1\n% Passing"},{"$f":"'Optimized Gradation'!B17","v":"No. 4"}]
[198,{"$f":"IF('Optimized Gradation'!F18=\"\",\"\",'Optimized Gradation'!F18)","v":""},{"$f":"'Optimized Gradation'!$B$6","v":"Optimized Gradation"},{"$f":"'Optimized Gradation'!$B$8","v":"Sieve Analysis"},{"$f":"'Optimized Gradation'!$F$9","v":"Intermediate Agg. 1\n% Passing"},{"$f":"'Optimized Gradation'!B18","v":"No. 8"}]
[199,{"$f":"IF('Optimized Gradation'!F19=\"\",\"\",'Optimized Gradation'!F19)","v":""},{"$f":"'Optimized Gradation'!$B$6","v":"Optimized Gradation"},{"$f":"'Optimized Gradation'!$B$8","v":"Sieve Analysis"},{"$f":"'Optimized Gradation'!$F$9","v":"Intermediate Agg. 1\n% Passing"},{"$f":"'Optimized Gradation'!B19","v":"No. 16"}]
[200,{"$f":"IF('Optimized Gradation'!F20=\"\",\"\",'Optimized Gradation'!F20)","v":""},{"$f":"'Optimized Gradation'!$B$6","v":"Optimized Gradation"},{"$f":"'Optimized Gradation'!$B$8","v":"Sieve Analysis"},{"$f":"'Optimized Gradation'!$F$9","v":"Intermediate Agg. 1\n% Passing"},{"$f":"'Optimized Gradation'!B20","v":"No. 30"}]
[201,{"$f":"IF('Optimized Gradation'!F21=\"\",\"\",'Optimized Gradation'!F21)","v":""},{"$f":"'Optimized Gradation'!$B$6","v":"Optimized Gradation"},{"$f":"'Optimized Gradation'!$B$8","v":"Sieve Analysis"},{"$f":"'Optimized Gradation'!$F$9","v":"Intermediate Agg. 1\n% Passing"},{"$f":"'Optimized Gradation'!B21","v":"No. 50"}]
[202,{"$f":"IF('Optimized Gradation'!F22=\"\",\"\",'Optimized Gradation'!F22)","v":""},{"$f":"'Optimized Gradation'!$B$6","v":"Optimized Gradation"},{"$f":"'Optimized Gradation'!$B$8","v":"Sieve Analysis"},{"$f":"'Optimized Gradation'!$F$9","v":"Intermediate Agg. 1\n% Passing"},{"$f":"'Optimized Gradation'!B22","v":"No. 100"}]
[203,{"$f":"IF('Optimized Gradation'!F23=\"\",\"\",'Optimized Gradation'!F23)","v":""},{"$f":"'Optimized Gradation'!$B$6","v":"Optimized Gradation"},{"$f":"'Optimized Gradation'!$B$8","v":"Sieve Analysis"},{"$f":"'Optimized Gradation'!$F$9","v":"Intermediate Agg. 1\n% Passing"},{"$f":"'Optimized Gradation'!B23","v":"No. 200"}]
[204,{"$f":"IF('Optimized Gradation'!F24=\"\",\"\",'Optimized Gradation'!F24)","v":""},{"$f":"'Optimized Gradation'!$B$6","v":"Optimized Gradation"},{"$f":"'Optimized Gradation'!$B$8","v":"Sieve Analysis"},{"$f":"'Optimized Gradation'!$F$9","v":"Intermediate Agg. 1\n% Passing"},{"$f":"'Optimized Gradation'!B24","v":"Pan"}]
[205,{"$f":"IF('Optimized Gradation'!F25=\"\",\"\",'Optimized Gradation'!F25)","v":""},{"$f":"'Optimized Gradation'!$B$6","v":"Optimized Gradation"},{"$f":"'Optimized Gradation'!$B$8","v":"Sieve Analysis"},{"$f":"'Optimized Gradation'!$F$9","v":"Intermediate Agg. 1\n% Passing"},{"$f":"'Optimized Gradation'!B25","v":"Percent  of Total Agg."}]
[206,{"$f":"IF('Optimized Gradation'!G10=\"\",\"\",'Optimized Gradation'!G10)","v":""},{"$f":"'Optimized Gradation'!$B$6","v":"Optimized Gradation"},{"$f":"'Optimized Gradation'!$B$8","v":"Sieve Analysis"},{"$f":"'Optimized Gradation'!$G$9","v":"Intermediate Agg. 2\n% Passing"},{"$f":"'Optimized Gradation'!B10","v":"2 1/2 in"}]
[207,{"$f":"IF('Optimized Gradation'!G11=\"\",\"\",'Optimized Gradation'!G11)","v":""},{"$f":"'Optimized Gradation'!$B$6","v":"Optimized Gradation"},{"$f":"'Optimized Gradation'!$B$8","v":"Sieve Analysis"},{"$f":"'Optimized Gradation'!$G$9","v":"Intermediate Agg. 2\n% Passing"},{"$f":"'Optimized Gradation'!B11","v":"2 in"}]
[208,{"$f":"IF('Optimized Gradation'!G12=\"\",\"\",'Optimized Gradation'!G12)","v":""},{"$f":"'Optimized Gradation'!$B$6","v":"Optimized Gradation"},{"$f":"'Optimized Gradation'!$B$8","v":"Sieve Analysis"},{"$f":"'Optimized Gradation'!$G$9","v":"Intermediate Agg. 2\n% Passing"},{"$f":"'Optimized Gradation'!B12","v":"1 1/2 in"}]
[209,{"$f":"IF('Optimized Gradation'!G13=\"\",\"\",'Optimized Gradation'!G13)","v":""},{"$f":"'Optimized Gradation'!$B$6","v":"Optimized Gradation"},{"$f":"'Optimized Gradation'!$B$8","v":"Sieve Analysis"},{"$f":"'Optimized Gradation'!$G$9","v":"Intermediate Agg. 2\n% Passing"},{"$f":"'Optimized Gradation'!B13","v":"1 in"}]
[210,{"$f":"IF('Optimized Gradation'!G14=\"\",\"\",'Optimized Gradation'!G14)","v":""},{"$f":"'Optimized Gradation'!$B$6","v":"Optimized Gradation"},{"$f":"'Optimized Gradation'!$B$8","v":"Sieve Analysis"},{"$f":"'Optimized Gradation'!$G$9","v":"Intermediate Agg. 2\n% Passing"},{"$f":"'Optimized Gradation'!B14","v":"3/4 in"}]
[211,{"$f":"IF('Optimized Gradation'!G15=\"\",\"\",'Optimized Gradation'!G15)","v":""},{"$f":"'Optimized Gradation'!$B$6","v":"Optimized Gradation"},{"$f":"'Optimized Gradation'!$B$8","v":"Sieve Analysis"},{"$f":"'Optimized Gradation'!$G$9","v":"Intermediate Agg. 2\n% Passing"},{"$f":"'Optimized Gradation'!B15","v":"1/2 in"}]
[212,{"$f":"IF('Optimized Gradation'!G16=\"\",\"\",'Optimized Gradation'!G16)","v":""},{"$f":"'Optimized Gradation'!$B$6","v":"Optimized Gradation"},{"$f":"'Optimized Gradation'!$B$8","v":"Sieve Analysis"},{"$f":"'Optimized Gradation'!$G$9","v":"Intermediate Agg. 2\n% Passing"},{"$f":"'Optimized Gradation'!B16","v":"3/8 in"}]
[213,{"$f":"IF('Optimized Gradation'!G17=\"\",\"\",'Optimized Gradation'!G17)","v":""},{"$f":"'Optimized Gradation'!$B$6","v":"Optimized Gradation"},{"$f":"'Optimized Gradation'!$B$8","v":"Sieve Analysis"},{"$f":"'Optimized Gradation'!$G$9","v":"Intermediate Agg. 2\n% Passing"},{"$f":"'Optimized Gradation'!B17","v":"No. 4"}]
[214,{"$f":"IF('Optimized Gradation'!G18=\"\",\"\",'Optimized Gradation'!G18)","v":""},{"$f":"'Optimized Gradation'!$B$6","v":"Optimized Gradation"},{"$f":"'Optimized Gradation'!$B$8","v":"Sieve Analysis"},{"$f":"'Optimized Gradation'!$G$9","v":"Intermediate Agg. 2\n% Passing"},{"$f":"'Optimized Gradation'!B18","v":"No. 8"}]
[215,{"$f":"IF('Optimized Gradation'!G19=\"\",\"\",'Optimized Gradation'!G19)","v":""},{"$f":"'Optimized Gradation'!$B$6","v":"Optimized Gradation"},{"$f":"'Optimized Gradation'!$B$8","v":"Sieve Analysis"},{"$f":"'Optimized Gradation'!$G$9","v":"Intermediate Agg. 2\n% Passing"},{"$f":"'Optimized Gradation'!B19","v":"No. 16"}]
[216,{"$f":"IF('Optimized Gradation'!G20=\"\",\"\",'Optimized Gradation'!G20)","v":""},{"$f":"'Optimized Gradation'!$B$6","v":"Optimized Gradation"},{"$f":"'Optimized Gradation'!$B$8","v":"Sieve Analysis"},{"$f":"'Optimized Gradation'!$G$9","v":"Intermediate Agg. 2\n% Passing"},{"$f":"'Optimized Gradation'!B20","v":"No. 30"}]
[217,{"$f":"IF('Optimized Gradation'!G21=\"\",\"\",'Optimized Gradation'!G21)","v":""},{"$f":"'Optimized Gradation'!$B$6","v":"Optimized Gradation"},{"$f":"'Optimized Gradation'!$B$8","v":"Sieve Analysis"},{"$f":"'Optimized Gradation'!$G$9","v":"Intermediate Agg. 2\n% Passing"},{"$f":"'Optimized Gradation'!B21","v":"No. 50"}]
[218,{"$f":"IF('Optimized Gradation'!G22=\"\",\"\",'Optimized Gradation'!G22)","v":""},{"$f":"'Optimized Gradation'!$B$6","v":"Optimized Gradation"},{"$f":"'Optimized Gradation'!$B$8","v":"Sieve Analysis"},{"$f":"'Optimized Gradation'!$G$9","v":"Intermediate Agg. 2\n% Passing"},{"$f":"'Optimized Gradation'!B22","v":"No. 100"}]
[219,{"$f":"IF('Optimized Gradation'!G23=\"\",\"\",'Optimized Gradation'!G23)","v":""},{"$f":"'Optimized Gradation'!$B$6","v":"Optimized Gradation"},{"$f":"'Optimized Gradation'!$B$8","v":"Sieve Analysis"},{"$f":"'Optimized Gradation'!$G$9","v":"Intermediate Agg. 2\n% Passing"},{"$f":"'Optimized Gradation'!B23","v":"No. 200"}]
[220,{"$f":"IF('Optimized Gradation'!G24=\"\",\"\",'Optimized Gradation'!G24)","v":""},{"$f":"'Optimized Gradation'!$B$6","v":"Optimized Gradation"},{"$f":"'Optimized Gradation'!$B$8","v":"Sieve Analysis"},{"$f":"'Optimized Gradation'!$G$9","v":"Intermediate Agg. 2\n% Passing"},{"$f":"'Optimized Gradation'!B24","v":"Pan"}]
[221,{"$f":"IF('Optimized Gradation'!G25=\"\",\"\",'Optimized Gradation'!G25)","v":""},{"$f":"'Optimized Gradation'!$B$6","v":"Optimized Gradation"},{"$f":"'Optimized Gradation'!$B$8","v":"Sieve Analysis"},{"$f":"'Optimized Gradation'!$G$9","v":"Intermediate Agg. 2\n% Passing"},{"$f":"'Optimized Gradation'!B25","v":"Percent  of Total Agg."}]
[222,{"$f":"IF('Optimized Gradation'!H10=\"\",\"\",'Optimized Gradation'!H10)","v":""},{"$f":"'Optimized Gradation'!$B$6","v":"Optimized Gradation"},{"$f":"'Optimized Gradation'!$B$8","v":"Sieve Analysis"},{"$f":"'Optimized Gradation'!$H$9","v":"Fine Agg. 1 % Passing"},{"$f":"'Optimized Gradation'!B10","v":"2 1/2 in"}]
[223,{"$f":"IF('Optimized Gradation'!H11=\"\",\"\",'Optimized Gradation'!H11)","v":""},{"$f":"'Optimized Gradation'!$B$6","v":"Optimized Gradation"},{"$f":"'Optimized Gradation'!$B$8","v":"Sieve Analysis"},{"$f":"'Optimized Gradation'!$H$9","v":"Fine Agg. 1 % Passing"},{"$f":"'Optimized Gradation'!B11","v":"2 in"}]
[224,{"$f":"IF('Optimized Gradation'!H12=\"\",\"\",'Optimized Gradation'!H12)","v":""},{"$f":"'Optimized Gradation'!$B$6","v":"Optimized Gradation"},{"$f":"'Optimized Gradation'!$B$8","v":"Sieve Analysis"},{"$f":"'Optimized Gradation'!$H$9","v":"Fine Agg. 1 % Passing"},{"$f":"'Optimized Gradation'!B12","v":"1 1/2 in"}]
[225,{"$f":"IF('Optimized Gradation'!H13=\"\",\"\",'Optimized Gradation'!H13)","v":""},{"$f":"'Optimized Gradation'!$B$6","v":"Optimized Gradation"},{"$f":"'Optimized Gradation'!$B$8","v":"Sieve Analysis"},{"$f":"'Optimized Gradation'!$H$9","v":"Fine Agg. 1 % Passing"},{"$f":"'Optimized Gradation'!B13","v":"1 in"}]
[226,{"$f":"IF('Optimized Gradation'!H14=\"\",\"\",'Optimized Gradation'!H14)","v":""},{"$f":"'Optimized Gradation'!$B$6","v":"Optimized Gradation"},{"$f":"'Optimized Gradation'!$B$8","v":"Sieve Analysis"},{"$f":"'Optimized Gradation'!$H$9","v":"Fine Agg. 1 % Passing"},{"$f":"'Optimized Gradation'!B14","v":"3/4 in"}]
[227,{"$f":"IF('Optimized Gradation'!H15=\"\",\"\",'Optimized Gradation'!H15)","v":""},{"$f":"'Optimized Gradation'!$B$6","v":"Optimized Gradation"},{"$f":"'Optimized Gradation'!$B$8","v":"Sieve Analysis"},{"$f":"'Optimized Gradation'!$H$9","v":"Fine Agg. 1 % Passing"},{"$f":"'Optimized Gradation'!B15","v":"1/2 in"}]
[228,{"$f":"IF('Optimized Gradation'!H16=\"\",\"\",'Optimized Gradation'!H16)","v":""},{"$f":"'Optimized Gradation'!$B$6","v":"Optimized Gradation"},{"$f":"'Optimized Gradation'!$B$8","v":"Sieve Analysis"},{"$f":"'Optimized Gradation'!$H$9","v":"Fine Agg. 1 % Passing"},{"$f":"'Optimized Gradation'!B16","v":"3/8 in"}]
[229,{"$f":"IF('Optimized Gradation'!H17=\"\",\"\",'Optimized Gradation'!H17)","v":""},{"$f":"'Optimized Gradation'!$B$6","v":"Optimized Gradation"},{"$f":"'Optimized Gradation'!$B$8","v":"Sieve Analysis"},{"$f":"'Optimized Gradation'!$H$9","v":"Fine Agg. 1 % Passing"},{"$f":"'Optimized Gradation'!B17","v":"No. 4"}]
[230,{"$f":"IF('Optimized Gradation'!H18=\"\",\"\",'Optimized Gradation'!H18)","v":""},{"$f":"'Optimized Gradation'!$B$6","v":"Optimized Gradation"},{"$f":"'Optimized Gradation'!$B$8","v":"Sieve Analysis"},{"$f":"'Optimized Gradation'!$H$9","v":"Fine Agg. 1 % Passing"},{"$f":"'Optimized Gradation'!B18","v":"No. 8"}]
[231,{"$f":"IF('Optimized Gradation'!H19=\"\",\"\",'Optimized Gradation'!H19)","v":""},{"$f":"'Optimized Gradation'!$B$6","v":"Optimized Gradation"},{"$f":"'Optimized Gradation'!$B$8","v":"Sieve Analysis"},{"$f":"'Optimized Gradation'!$H$9","v":"Fine Agg. 1 % Passing"},{"$f":"'Optimized Gradation'!B19","v":"No. 16"}]
[232,{"$f":"IF('Optimized Gradation'!H20=\"\",\"\",'Optimized Gradation'!H20)","v":""},{"$f":"'Optimized Gradation'!$B$6","v":"Optimized Gradation"},{"$f":"'Optimized Gradation'!$B$8","v":"Sieve Analysis"},{"$f":"'Optimized Gradation'!$H$9","v":"Fine Agg. 1 % Passing"},{"$f":"'Optimized Gradation'!B20","v":"No. 30"}]
[233,{"$f":"IF('Optimized Gradation'!H21=\"\",\"\",'Optimized Gradation'!H21)","v":""},{"$f":"'Optimized Gradation'!$B$6","v":"Optimized Gradation"},{"$f":"'Optimized Gradation'!$B$8","v":"Sieve Analysis"},{"$f":"'Optimized Gradation'!$H$9","v":"Fine Agg. 1 % Passing"},{"$f":"'Optimized Gradation'!B21","v":"No. 50"}]
[234,{"$f":"IF('Optimized Gradation'!H22=\"\",\"\",'Optimized Gradation'!H22)","v":""},{"$f":"'Optimized Gradation'!$B$6","v":"Optimized Gradation"},{"$f":"'Optimized Gradation'!$B$8","v":"Sieve Analysis"},{"$f":"'Optimized Gradation'!$H$9","v":"Fine Agg. 1 % Passing"},{"$f":"'Optimized Gradation'!B22","v":"No. 100"}]
[235,{"$f":"IF('Optimized Gradation'!H23=\"\",\"\",'Optimized Gradation'!H23)","v":""},{"$f":"'Optimized Gradation'!$B$6","v":"Optimized Gradation"},{"$f":"'Optimized Gradation'!$B$8","v":"Sieve Analysis"},{"$f":"'Optimized Gradation'!$H$9","v":"Fine Agg. 1 % Passing"},{"$f":"'Optimized Gradation'!B23","v":"No. 200"}]
[236,{"$f":"IF('Optimized Gradation'!H24=\"\",\"\",'Optimized Gradation'!H24)","v":""},{"$f":"'Optimized Gradation'!$B$6","v":"Optimized Gradation"},{"$f":"'Optimized Gradation'!$B$8","v":"Sieve Analysis"},{"$f":"'Optimized Gradation'!$H$9","v":"Fine Agg. 1 % Passing"},{"$f":"'Optimized Gradation'!B24","v":"Pan"}]
[237,{"$f":"IF('Optimized Gradation'!H25=\"\",\"\",'Optimized Gradation'!H25)","v":""},{"$f":"'Optimized Gradation'!$B$6","v":"Optimized Gradation"},{"$f":"'Optimized Gradation'!$B$8","v":"Sieve Analysis"},{"$f":"'Optimized Gradation'!$H$9","v":"Fine Agg. 1 % Passing"},{"$f":"'Optimized Gradation'!B25","v":"Percent  of Total Agg."}]
[238,{"$f":"IF('Optimized Gradation'!I10=\"\",\"\",'Optimized Gradation'!I10)","v":""},{"$f":"'Optimized Gradation'!$B$6","v":"Optimized Gradation"},{"$f":"'Optimized Gradation'!$B$8","v":"Sieve Analysis"},{"$f":"'Optimized Gradation'!$I$9","v":"Fine Agg. 2 % Passing"},{"$f":"'Optimized Gradation'!B10","v":"2 1/2 in"}]
[239,{"$f":"IF('Optimized Gradation'!I11=\"\",\"\",'Optimized Gradation'!I11)","v":""},{"$f":"'Optimized Gradation'!$B$6","v":"Optimized Gradation"},{"$f":"'Optimized Gradation'!$B$8","v":"Sieve Analysis"},{"$f":"'Optimized Gradation'!$I$9","v":"Fine Agg. 2 % Passing"},{"$f":"'Optimized Gradation'!B11","v":"2 in"}]
[240,{"$f":"IF('Optimized Gradation'!I12=\"\",\"\",'Optimized Gradation'!I12)","v":""},{"$f":"'Optimized Gradation'!$B$6","v":"Optimized Gradation"},{"$f":"'Optimized Gradation'!$B$8","v":"Sieve Analysis"},{"$f":"'Optimized Gradation'!$I$9","v":"Fine Agg. 2 % Passing"},{"$f":"'Optimized Gradation'!B12","v":"1 1/2 in"}]
[241,{"$f":"IF('Optimized Gradation'!I13=\"\",\"\",'Optimized Gradation'!I13)","v":""},{"$f":"'Optimized Gradation'!$B$6","v":"Optimized Gradation"},{"$f":"'Optimized Gradation'!$B$8","v":"Sieve Analysis"},{"$f":"'Optimized Gradation'!$I$9","v":"Fine Agg. 2 % Passing"},{"$f":"'Optimized Gradation'!B13","v":"1 in"}]
[242,{"$f":"IF('Optimized Gradation'!I14=\"\",\"\",'Optimized Gradation'!I14)","v":""},{"$f":"'Optimized Gradation'!$B$6","v":"Optimized Gradation"},{"$f":"'Optimized Gradation'!$B$8","v":"Sieve Analysis"},{"$f":"'Optimized Gradation'!$I$9","v":"Fine Agg. 2 % Passing"},{"$f":"'Optimized Gradation'!B14","v":"3/4 in"}]
[243,{"$f":"IF('Optimized Gradation'!I15=\"\",\"\",'Optimized Gradation'!I15)","v":""},{"$f":"'Optimized Gradation'!$B$6","v":"Optimized Gradation"},{"$f":"'Optimized Gradation'!$B$8","v":"Sieve Analysis"},{"$f":"'Optimized Gradation'!$I$9","v":"Fine Agg. 2 % Passing"},{"$f":"'Optimized Gradation'!B15","v":"1/2 in"}]
[244,{"$f":"IF('Optimized Gradation'!I16=\"\",\"\",'Optimized Gradation'!I16)","v":""},{"$f":"'Optimized Gradation'!$B$6","v":"Optimized Gradation"},{"$f":"'Optimized Gradation'!$B$8","v":"Sieve Analysis"},{"$f":"'Optimized Gradation'!$I$9","v":"Fine Agg. 2 % Passing"},{"$f":"'Optimized Gradation'!B16","v":"3/8 in"}]
[245,{"$f":"IF('Optimized Gradation'!I17=\"\",\"\",'Optimized Gradation'!I17)","v":""},{"$f":"'Optimized Gradation'!$B$6","v":"Optimized Gradation"},{"$f":"'Optimized Gradation'!$B$8","v":"Sieve Analysis"},{"$f":"'Optimized Gradation'!$I$9","v":"Fine Agg. 2 % Passing"},{"$f":"'Optimized Gradation'!B17","v":"No. 4"}]
[246,{"$f":"IF('Optimized Gradation'!I18=\"\",\"\",'Optimized Gradation'!I18)","v":""},{"$f":"'Optimized Gradation'!$B$6","v":"Optimized Gradation"},{"$f":"'Optimized Gradation'!$B$8","v":"Sieve Analysis"},{"$f":"'Optimized Gradation'!$I$9","v":"Fine Agg. 2 % Passing"},{"$f":"'Optimized Gradation'!B18","v":"No. 8"}]
[247,{"$f":"IF('Optimized Gradation'!I19=\"\",\"\",'Optimized Gradation'!I19)","v":""},{"$f":"'Optimized Gradation'!$B$6","v":"Optimized Gradation"},{"$f":"'Optimized Gradation'!$B$8","v":"Sieve Analysis"},{"$f":"'Optimized Gradation'!$I$9","v":"Fine Agg. 2 % Passing"},{"$f":"'Optimized Gradation'!B19","v":"No. 16"}]
[248,{"$f":"IF('Optimized Gradation'!I20=\"\",\"\",'Optimized Gradation'!I20)","v":""},{"$f":"'Optimized Gradation'!$B$6","v":"Optimized Gradation"},{"$f":"'Optimized Gradation'!$B$8","v":"Sieve Analysis"},{"$f":"'Optimized Gradation'!$I$9","v":"Fine Agg. 2 % Passing"},{"$f":"'Optimized Gradation'!B20","v":"No. 30"}]
[249,{"$f":"IF('Optimized Gradation'!I21=\"\",\"\",'Optimized Gradation'!I21)","v":""},{"$f":"'Optimized Gradation'!$B$6","v":"Optimized Gradation"},{"$f":"'Optimized Gradation'!$B$8","v":"Sieve Analysis"},{"$f":"'Optimized Gradation'!$I$9","v":"Fine Agg. 2 % Passing"},{"$f":"'Optimized Gradation'!B21","v":"No. 50"}]
[250,{"$f":"IF('Optimized Gradation'!I22=\"\",\"\",'Optimized Gradation'!I22)","v":""},{"$f":"'Optimized Gradation'!$B$6","v":"Optimized Gradation"},{"$f":"'Optimized Gradation'!$B$8","v":"Sieve Analysis"},{"$f":"'Optimized Gradation'!$I$9","v":"Fine Agg. 2 % Passing"},{"$f":"'Optimized Gradation'!B22","v":"No. 100"}]
[251,{"$f":"IF('Optimized Gradation'!I23=\"\",\"\",'Optimized Gradation'!I23)","v":""},{"$f":"'Optimized Gradation'!$B$6","v":"Optimized Gradation"},{"$f":"'Optimized Gradation'!$B$8","v":"Sieve Analysis"},{"$f":"'Optimized Gradation'!$I$9","v":"Fine Agg. 2 % Passing"},{"$f":"'Optimized Gradation'!B23","v":"No. 200"}]
[252,{"$f":"IF('Optimized Gradation'!I24=\"\",\"\",'Optimized Gradation'!I24)","v":""},{"$f":"'Optimized Gradation'!$B$6","v":"Optimized Gradation"},{"$f":"'Optimized Gradation'!$B$8","v":"Sieve Analysis"},{"$f":"'Optimized Gradation'!$I$9","v":"Fine Agg. 2 % Passing"},{"$f":"'Optimized Gradation'!B24","v":"Pan"}]
[253,{"$f":"IF('Optimized Gradation'!I25=\"\",\"\",'Optimized Gradation'!I25)","v":""},{"$f":"'Optimized Gradation'!$B$6","v":"Optimized Gradation"},{"$f":"'Optimized Gradation'!$B$8","v":"Sieve Analysis"},{"$f":"'Optimized Gradation'!$I$9","v":"Fine Agg. 2 % Passing"},{"$f":"'Optimized Gradation'!B25","v":"Percent  of Total Agg."}]
[254,{"$f":"IF('Optimized Gradation'!J10=\"\",\"\",'Optimized Gradation'!J10)","v":0},{"$f":"'Optimized Gradation'!$B$6","v":"Optimized Gradation"},{"$f":"'Optimized Gradation'!$B$8","v":"Sieve Analysis"},{"$f":"'Optimized Gradation'!$J$9","v":"Combined % Passing"},{"$f":"'Optimized Gradation'!B10","v":"2 1/2 in"}]
[255,{"$f":"IF('Optimized Gradation'!J11=\"\",\"\",'Optimized Gradation'!J11)","v":0},{"$f":"'Optimized Gradation'!$B$6","v":"Optimized Gradation"},{"$f":"'Optimized Gradation'!$B$8","v":"Sieve Analysis"},{"$f":"'Optimized Gradation'!$J$9","v":"Combined % Passing"},{"$f":"'Optimized Gradation'!B11","v":"2 in"}]
[256,{"$f":"IF('Optimized Gradation'!J12=\"\",\"\",'Optimized Gradation'!J12)","v":0},{"$f":"'Optimized Gradation'!$B$6","v":"Optimized Gradation"},{"$f":"'Optimized Gradation'!$B$8","v":"Sieve Analysis"},{"$f":"'Optimized Gradation'!$J$9","v":"Combined % Passing"},{"$f":"'Optimized Gradation'!B12","v":"1 1/2 in"}]
[257,{"$f":"IF('Optimized Gradation'!J13=\"\",\"\",'Optimized Gradation'!J13)","v":0},{"$f":"'Optimized Gradation'!$B$6","v":"Optimized Gradation"},{"$f":"'Optimized Gradation'!$B$8","v":"Sieve Analysis"},{"$f":"'Optimized Gradation'!$J$9","v":"Combined % Passing"},{"$f":"'Optimized Gradation'!B13","v":"1 in"}]
[258,{"$f":"IF('Optimized Gradation'!J14=\"\",\"\",'Optimized Gradation'!J14)","v":0},{"$f":"'Optimized Gradation'!$B$6","v":"Optimized Gradation"},{"$f":"'Optimized Gradation'!$B$8","v":"Sieve Analysis"},{"$f":"'Optimized Gradation'!$J$9","v":"Combined % Passing"},{"$f":"'Optimized Gradation'!B14","v":"3/4 in"}]
[259,{"$f":"IF('Optimized Gradation'!J15=\"\",\"\",'Optimized Gradation'!J15)","v":0},{"$f":"'Optimized Gradation'!$B$6","v":"Optimized Gradation"},{"$f":"'Optimized Gradation'!$B$8","v":"Sieve Analysis"},{"$f":"'Optimized Gradation'!$J$9","v":"Combined % Passing"},{"$f":"'Optimized Gradation'!B15","v":"1/2 in"}]
[260,{"$f":"IF('Optimized Gradation'!J16=\"\",\"\",'Optimized Gradation'!J16)","v":0},{"$f":"'Optimized Gradation'!$B$6","v":"Optimized Gradation"},{"$f":"'Optimized Gradation'!$B$8","v":"Sieve Analysis"},{"$f":"'Optimized Gradation'!$J$9","v":"Combined % Passing"},{"$f":"'Optimized Gradation'!B16","v":"3/8 in"}]
[261,{"$f":"IF('Optimized Gradation'!J17=\"\",\"\",'Optimized Gradation'!J17)","v":0},{"$f":"'Optimized Gradation'!$B$6","v":"Optimized Gradation"},{"$f":"'Optimized Gradation'!$B$8","v":"Sieve Analysis"},{"$f":"'Optimized Gradation'!$J$9","v":"Combined % Passing"},{"$f":"'Optimized Gradation'!B17","v":"No. 4"}]
[262,{"$f":"IF('Optimized Gradation'!J18=\"\",\"\",'Optimized Gradation'!J18)","v":0},{"$f":"'Optimized Gradation'!$B$6","v":"Optimized Gradation"},{"$f":"'Optimized Gradation'!$B$8","v":"Sieve Analysis"},{"$f":"'Optimized Gradation'!$J$9","v":"Combined % Passing"},{"$f":"'Optimized Gradation'!B18","v":"No. 8"}]
[263,{"$f":"IF('Optimized Gradation'!J19=\"\",\"\",'Optimized Gradation'!J19)","v":0},{"$f":"'Optimized Gradation'!$B$6","v":"Optimized Gradation"},{"$f":"'Optimized Gradation'!$B$8","v":"Sieve Analysis"},{"$f":"'Optimized Gradation'!$J$9","v":"Combined % Passing"},{"$f":"'Optimized Gradation'!B19","v":"No. 16"}]
[264,{"$f":"IF('Optimized Gradation'!J20=\"\",\"\",'Optimized Gradation'!J20)","v":0},{"$f":"'Optimized Gradation'!$B$6","v":"Optimized Gradation"},{"$f":"'Optimized Gradation'!$B$8","v":"Sieve Analysis"},{"$f":"'Optimized Gradation'!$J$9","v":"Combined % Passing"},{"$f":"'Optimized Gradation'!B20","v":"No. 30"}]
[265,{"$f":"IF('Optimized Gradation'!J21=\"\",\"\",'Optimized Gradation'!J21)","v":0},{"$f":"'Optimized Gradation'!$B$6","v":"Optimized Gradation"},{"$f":"'Optimized Gradation'!$B$8","v":"Sieve Analysis"},{"$f":"'Optimized Gradation'!$J$9","v":"Combined % Passing"},{"$f":"'Optimized Gradation'!B21","v":"No. 50"}]
[266,{"$f":"IF('Optimized Gradation'!J22=\"\",\"\",'Optimized Gradation'!J22)","v":0},{"$f":"'Optimized Gradation'!$B$6","v":"Optimized Gradation"},{"$f":"'Optimized Gradation'!$B$8","v":"Sieve Analysis"},{"$f":"'Optimized Gradation'!$J$9","v":"Combined % Passing"},{"$f":"'Optimized Gradation'!B22","v":"No. 100"}]
[267,{"$f":"IF('Optimized Gradation'!J23=\"\",\"\",'Optimized Gradation'!J23)","v":0},{"$f":"'Optimized Gradation'!$B$6","v":"Optimized Gradation"},{"$f":"'Optimized Gradation'!$B$8","v":"Sieve Analysis"},{"$f":"'Optimized Gradation'!$J$9","v":"Combined % Passing"},{"$f":"'Optimized Gradation'!B23","v":"No. 200"}]
[268,{"$f":"IF('Optimized Gradation'!J24=\"\",\"\",'Optimized Gradation'!J24)","v":0},{"$f":"'Optimized Gradation'!$B$6","v":"Optimized Gradation"},{"$f":"'Optimized Gradation'!$B$8","v":"Sieve Analysis"},{"$f":"'Optimized Gradation'!$J$9","v":"Combined % Passing"},{"$f":"'Optimized Gradation'!B24","v":"Pan"}]
[269,{"$f":"IF('Optimized Gradation'!K10=\"\",\"\",'Optimized Gradation'!K10)","v":100},{"$f":"'Optimized Gradation'!$B$6","v":"Optimized Gradation"},{"$f":"'Optimized Gradation'!$B$8","v":"Sieve Analysis"},{"$f":"'Optimized Gradation'!$K$9","v":"Combined Cumulative % Retained"},{"$f":"'Optimized Gradation'!B10","v":"2 1/2 in"}]
[270,{"$f":"IF('Optimized Gradation'!K11=\"\",\"\",'Optimized Gradation'!K11)","v":100},{"$f":"'Optimized Gradation'!$B$6","v":"Optimized Gradation"},{"$f":"'Optimized Gradation'!$B$8","v":"Sieve Analysis"},{"$f":"'Optimized Gradation'!$K$9","v":"Combined Cumulative % Retained"},{"$f":"'Optimized Gradation'!B11","v":"2 in"}]
[271,{"$f":"IF('Optimized Gradation'!K12=\"\",\"\",'Optimized Gradation'!K12)","v":100},{"$f":"'Optimized Gradation'!$B$6","v":"Optimized Gradation"},{"$f":"'Optimized Gradation'!$B$8","v":"Sieve Analysis"},{"$f":"'Optimized Gradation'!$K$9","v":"Combined Cumulative % Retained"},{"$f":"'Optimized Gradation'!B12","v":"1 1/2 in"}]
[272,{"$f":"IF('Optimized Gradation'!K13=\"\",\"\",'Optimized Gradation'!K13)","v":100},{"$f":"'Optimized Gradation'!$B$6","v":"Optimized Gradation"},{"$f":"'Optimized Gradation'!$B$8","v":"Sieve Analysis"},{"$f":"'Optimized Gradation'!$K$9","v":"Combined Cumulative % Retained"},{"$f":"'Optimized Gradation'!B13","v":"1 in"}]
[273,{"$f":"IF('Optimized Gradation'!K14=\"\",\"\",'Optimized Gradation'!K14)","v":100},{"$f":"'Optimized Gradation'!$B$6","v":"Optimized Gradation"},{"$f":"'Optimized Gradation'!$B$8","v":"Sieve Analysis"},{"$f":"'Optimized Gradation'!$K$9","v":"Combined Cumulative % Retained"},{"$f":"'Optimized Gradation'!B14","v":"3/4 in"}]
[274,{"$f":"IF('Optimized Gradation'!K15=\"\",\"\",'Optimized Gradation'!K15)","v":100},{"$f":"'Optimized Gradation'!$B$6","v":"Optimized Gradation"},{"$f":"'Optimized Gradation'!$B$8","v":"Sieve Analysis"},{"$f":"'Optimized Gradation'!$K$9","v":"Combined Cumulative % Retained"},{"$f":"'Optimized Gradation'!B15","v":"1/2 in"}]
[275,{"$f":"IF('Optimized Gradation'!K16=\"\",\"\",'Optimized Gradation'!K16)","v":100},{"$f":"'Optimized Gradation'!$B$6","v":"Optimized Gradation"},{"$f":"'Optimized Gradation'!$B$8","v":"Sieve Analysis"},{"$f":"'Optimized Gradation'!$K$9","v":"Combined Cumulative % Retained"},{"$f":"'Optimized Gradation'!B16","v":"3/8 in"}]
[276,{"$f":"IF('Optimized Gradation'!K17=\"\",\"\",'Optimized Gradation'!K17)","v":100},{"$f":"'Optimized Gradation'!$B$6","v":"Optimized Gradation"},{"$f":"'Optimized Gradation'!$B$8","v":"Sieve Analysis"},{"$f":"'Optimized Gradation'!$K$9","v":"Combined Cumulative % Retained"},{"$f":"'Optimized Gradation'!B17","v":"No. 4"}]
[277,{"$f":"IF('Optimized Gradation'!K18=\"\",\"\",'Optimized Gradation'!K18)","v":100},{"$f":"'Optimized Gradation'!$B$6","v":"Optimized Gradation"},{"$f":"'Optimized Gradation'!$B$8","v":"Sieve Analysis"},{"$f":"'Optimized Gradation'!$K$9","v":"Combined Cumulative % Retained"},{"$f":"'Optimized Gradation'!B18","v":"No. 8"}]
[278,{"$f":"IF('Optimized Gradation'!K19=\"\",\"\",'Optimized Gradation'!K19)","v":100},{"$f":"'Optimized Gradation'!$B$6","v":"Optimized Gradation"},{"$f":"'Optimized Gradation'!$B$8","v":"Sieve Analysis"},{"$f":"'Optimized Gradation'!$K$9","v":"Combined Cumulative % Retained"},{"$f":"'Optimized Gradation'!B19","v":"No. 16"}]
[279,{"$f":"IF('Optimized Gradation'!K20=\"\",\"\",'Optimized Gradation'!K20)","v":100},{"$f":"'Optimized Gradation'!$B$6","v":"Optimized Gradation"},{"$f":"'Optimized Gradation'!$B$8","v":"Sieve Analysis"},{"$f":"'Optimized Gradation'!$K$9","v":"Combined Cumulative % Retained"},{"$f":"'Optimized Gradation'!B20","v":"No. 30"}]
[280,{"$f":"IF('Optimized Gradation'!K21=\"\",\"\",'Optimized Gradation'!K21)","v":100},{"$f":"'Optimized Gradation'!$B$6","v":"Optimized Gradation"},{"$f":"'Optimized Gradation'!$B$8","v":"Sieve Analysis"},{"$f":"'Optimized Gradation'!$K$9","v":"Combined Cumulative % Retained"},{"$f":"'Optimized Gradation'!B21","v":"No. 50"}]
[281,{"$f":"IF('Optimized Gradation'!K22=\"\",\"\",'Optimized Gradation'!K22)","v":100},{"$f":"'Optimized Gradation'!$B$6","v":"Optimized Gradation"},{"$f":"'Optimized Gradation'!$B$8","v":"Sieve Analysis"},{"$f":"'Optimized Gradation'!$K$9","v":"Combined Cumulative % Retained"},{"$f":"'Optimized Gradation'!B22","v":"No. 100"}]
[282,{"$f":"IF('Optimized Gradation'!K23=\"\",\"\",'Optimized Gradation'!K23)","v":100},{"$f":"'Optimized Gradation'!$B$6","v":"Optimized Gradation"},{"$f":"'Optimized Gradation'!$B$8","v":"Sieve Analysis"},{"$f":"'Optimized Gradation'!$K$9","v":"Combined Cumulative % Retained"},{"$f":"'Optimized Gradation'!B23","v":"No. 200"}]
[283,{"$f":"IF('Optimized Gradation'!K24=\"\",\"\",'Optimized Gradation'!K24)","v":100},{"$f":"'Optimized Gradation'!$B$6","v":"Optimized Gradation"},{"$f":"'Optimized Gradation'!$B$8","v":"Sieve Analysis"},{"$f":"'Optimized Gradation'!$K$9","v":"Combined Cumulative % Retained"},{"$f":"'Optimized Gradation'!B24","v":"Pan"}]
[284,{"$f":"IF('Optimized Gradation'!L10=\"\",\"\",'Optimized Gradation'!L10)","v":100},{"$f":"'Optimized Gradation'!$B$6","v":"Optimized Gradation"},{"$f":"'Optimized Gradation'!$B$8","v":"Sieve Analysis"},{"$f":"'Optimized Gradation'!$L$9","v":"Combined % Retained"},{"$f":"'Optimized Gradation'!B10","v":"2 1/2 in"}]
[285,{"$f":"IF('Optimized Gradation'!L11=\"\",\"\",'Optimized Gradation'!L11)","v":0},{"$f":"'Optimized Gradation'!$B$6","v":"Optimized Gradation"},{"$f":"'Optimized Gradation'!$B$8","v":"Sieve Analysis"},{"$f":"'Optimized Gradation'!$L$9","v":"Combined % Retained"},{"$f":"'Optimized Gradation'!B11","v":"2 in"}]
[286,{"$f":"IF('Optimized Gradation'!L12=\"\",\"\",'Optimized Gradation'!L12)","v":0},{"$f":"'Optimized Gradation'!$B$6","v":"Optimized Gradation"},{"$f":"'Optimized Gradation'!$B$8","v":"Sieve Analysis"},{"$f":"'Optimized Gradation'!$L$9","v":"Combined % Retained"},{"$f":"'Optimized Gradation'!B12","v":"1 1/2 in"}]
[287,{"$f":"IF('Optimized Gradation'!L13=\"\",\"\",'Optimized Gradation'!L13)","v":0},{"$f":"'Optimized Gradation'!$B$6","v":"Optimized Gradation"},{"$f":"'Optimized Gradation'!$B$8","v":"Sieve Analysis"},{"$f":"'Optimized Gradation'!$L$9","v":"Combined % Retained"},{"$f":"'Optimized Gradation'!B13","v":"1 in"}]
[288,{"$f":"IF('Optimized Gradation'!L14=\"\",\"\",'Optimized Gradation'!L14)","v":0},{"$f":"'Optimized Gradation'!$B$6","v":"Optimized Gradation"},{"$f":"'Optimized Gradation'!$B$8","v":"Sieve Analysis"},{"$f":"'Optimized Gradation'!$L$9","v":"Combined % Retained"},{"$f":"'Optimized Gradation'!B14","v":"3/4 in"}]
[289,{"$f":"IF('Optimized Gradation'!L15=\"\",\"\",'Optimized Gradation'!L15)","v":0},{"$f":"'Optimized Gradation'!$B$6","v":"Optimized Gradation"},{"$f":"'Optimized Gradation'!$B$8","v":"Sieve Analysis"},{"$f":"'Optimized Gradation'!$L$9","v":"Combined % Retained"},{"$f":"'Optimized Gradation'!B15","v":"1/2 in"}]
[290,{"$f":"IF('Optimized Gradation'!L16=\"\",\"\",'Optimized Gradation'!L16)","v":0},{"$f":"'Optimized Gradation'!$B$6","v":"Optimized Gradation"},{"$f":"'Optimized Gradation'!$B$8","v":"Sieve Analysis"},{"$f":"'Optimized Gradation'!$L$9","v":"Combined % Retained"},{"$f":"'Optimized Gradation'!B16","v":"3/8 in"}]
[291,{"$f":"IF('Optimized Gradation'!L17=\"\",\"\",'Optimized Gradation'!L17)","v":0},{"$f":"'Optimized Gradation'!$B$6","v":"Optimized Gradation"},{"$f":"'Optimized Gradation'!$B$8","v":"Sieve Analysis"},{"$f":"'Optimized Gradation'!$L$9","v":"Combined % Retained"},{"$f":"'Optimized Gradation'!B17","v":"No. 4"}]
[292,{"$f":"IF('Optimized Gradation'!L18=\"\",\"\",'Optimized Gradation'!L18)","v":0},{"$f":"'Optimized Gradation'!$B$6","v":"Optimized Gradation"},{"$f":"'Optimized Gradation'!$B$8","v":"Sieve Analysis"},{"$f":"'Optimized Gradation'!$L$9","v":"Combined % Retained"},{"$f":"'Optimized Gradation'!B18","v":"No. 8"}]
[293,{"$f":"IF('Optimized Gradation'!L19=\"\",\"\",'Optimized Gradation'!L19)","v":0},{"$f":"'Optimized Gradation'!$B$6","v":"Optimized Gradation"},{"$f":"'Optimized Gradation'!$B$8","v":"Sieve Analysis"},{"$f":"'Optimized Gradation'!$L$9","v":"Combined % Retained"},{"$f":"'Optimized Gradation'!B19","v":"No. 16"}]
[294,{"$f":"IF('Optimized Gradation'!L20=\"\",\"\",'Optimized Gradation'!L20)","v":0},{"$f":"'Optimized Gradation'!$B$6","v":"Optimized Gradation"},{"$f":"'Optimized Gradation'!$B$8","v":"Sieve Analysis"},{"$f":"'Optimized Gradation'!$L$9","v":"Combined % Retained"},{"$f":"'Optimized Gradation'!B20","v":"No. 30"}]
[295,{"$f":"IF('Optimized Gradation'!L21=\"\",\"\",'Optimized Gradation'!L21)","v":0},{"$f":"'Optimized Gradation'!$B$6","v":"Optimized Gradation"},{"$f":"'Optimized Gradation'!$B$8","v":"Sieve Analysis"},{"$f":"'Optimized Gradation'!$L$9","v":"Combined % Retained"},{"$f":"'Optimized Gradation'!B21","v":"No. 50"}]
[296,{"$f":"IF('Optimized Gradation'!L22=\"\",\"\",'Optimized Gradation'!L22)","v":0},{"$f":"'Optimized Gradation'!$B$6","v":"Optimized Gradation"},{"$f":"'Optimized Gradation'!$B$8","v":"Sieve Analysis"},{"$f":"'Optimized Gradation'!$L$9","v":"Combined % Retained"},{"$f":"'Optimized Gradation'!B22","v":"No. 100"}]
[297,{"$f":"IF('Optimized Gradation'!L23=\"\",\"\",'Optimized Gradation'!L23)","v":0},{"$f":"'Optimized Gradation'!$B$6","v":"Optimized Gradation"},{"$f":"'Optimized Gradation'!$B$8","v":"Sieve Analysis"},{"$f":"'Optimized Gradation'!$L$9","v":"Combined % Retained"},{"$f":"'Optimized Gradation'!B23","v":"No. 200"}]
[298,{"$f":"IF('Optimized Gradation'!L24=\"\",\"\",'Optimized Gradation'!L24)","v":0},{"$f":"'Optimized Gradation'!$B$6","v":"Optimized Gradation"},{"$f":"'Optimized Gradation'!$B$8","v":"Sieve Analysis"},{"$f":"'Optimized Gradation'!$L$9","v":"Combined % Retained"},{"$f":"'Optimized Gradation'!B24","v":"Pan"}]
[299,{"$f":"IF('DryBatchWeights - Existing'!F9=\"\",\"\",'DryBatchWeights - Existing'!F9)","v":""},{"$f":"'DryBatchWeights - Existing'!$B$6","v":"Dry Batch Weights - Existing"},{"$f":"'DryBatchWeights - Existing'!$B$9","v":"Paste"},{"$f":"'DryBatchWeights - Existing'!$C$9","v":"Basic Water Demand:"},{"$f":"'DryBatchWeights - Existing'!F8","v":"Producer/Source"}]
[300,{"$f":"IF('DryBatchWeights - Existing'!I9=\"\",\"\",'DryBatchWeights - Existing'!I9)","v":0},{"$f":"'DryBatchWeights - Existing'!$B$6","v":"Dry Batch Weights - Existing"},{"$f":"'DryBatchWeights - Existing'!$B$9","v":"Paste"},{"$f":"'DryBatchWeights - Existing'!$C$9","v":"Basic Water Demand:"},{"$f":"'DryBatchWeights - Existing'!I8","v":"Absolute Vol. (ft3)"}]
[301,{"$f":"IF('DryBatchWeights - Existing'!K9=\"\",\"\",'DryBatchWeights - Existing'!K9)","v":""},{"$f":"'DryBatchWeights - Existing'!$B$6","v":"Dry Batch Weights - Existing"},{"$f":"'DryBatchWeights - Existing'!$B$9","v":"Paste"},{"$f":"'DryBatchWeights - Existing'!$C$9","v":"Basic Water Demand:"},{"$f":"'DryBatchWeights - Existing'!K8","v":"SSD Weight (lbs/CY)"}]
[302,{"$f":"IF('DryBatchWeights - Existing'!I10=\"\",\"\",'DryBatchWeights - Existing'!I10)","v":0},{"$f":"'DryBatchWeights - Existing'!$B$6","v":"Dry Batch Weights - Existing"},{"$f":"'DryBatchWeights - Existing'!$B$9","v":"Paste"},{"$f":"'DryBatchWeights - Existing'!$C$10","v":"Total Cementitious:"},{"$f":"'DryBatchWeights - Existing'!I8","v":"Absolute Vol. (ft3)"}]
[303,{"$f":"IF('DryBatchWeights - Existing'!K10=\"\",\"\",'DryBatchWeights - Existing'!K10)","v":0},{"$f":"'DryBatchWeights - Existing'!$B$6","v":"Dry Batch Weights - Existing"},{"$f":"'DryBatchWeights - Existing'!$B$9","v":"Paste"},{"$f":"'DryBatchWeights - Existing'!$C$10","v":"Total Cementitious:"},{"$f":"'DryBatchWeights - Existing'!K8","v":"SSD Weight (lbs/CY)"}]
[304,{"$f":"IF('DryBatchWeights - Existing'!E11=\"\",\"\",'DryBatchWeights - Existing'!E11)","v":""},{"$f":"'DryBatchWeights - Existing'!$B$6","v":"Dry Batch Weights - Existing"},{"$f":"'DryBatchWeights - Existing'!$B$9","v":"Paste"},{"$f":"'DryBatchWeights - Existing'!$C$11","v":"Hydraulic cement:"},{"$f":"'DryBatchWeights - Existing'!$E$8","v":"Type/Class/Grade"}]
[305,{"$f":"IF('DryBatchWeights - Existing'!F11=\"\",\"\",'DryBatchWeights - Existing'!F11)","v":""},{"$f":"'DryBatchWeights - Existing'!$B$6","v":"Dry Batch Weights - Existing"},{"$f":"'DryBatchWeights - Existing'!$B$9","v":"Paste"},{"$f":"'DryBatchWeights - Existing'!$C$11","v":"Hydraulic cement:"},{"$f":"'DryBatchWeights - Existing'!$F$8","v":"Producer/Source"}]
[306,{"$f":"IF('DryBatchWeights - Existing'!H11=\"\",\"\",'DryBatchWeights - Existing'!H11)","v":""},{"$f":"'DryBatchWeights - Existing'!$B$6","v":"Dry Batch Weights - Existing"},{"$f":"'DryBatchWeights - Existing'!$B$9","v":"Paste"},{"$f":"'DryBatchWeights - Existing'!$C$11","v":"Hydraulic cement:"},{"$f":"'DryBatchWeights - Existing'!$H$8","v":"% of Dosage*"}]
[307,{"$f":"IF('DryBatchWeights - Existing'!I11=\"\",\"\",'DryBatchWeights - Existing'!I11)","v":""},{"$f":"'DryBatchWeights - Existing'!$B$6","v":"Dry Batch Weights - Existing"},{"$f":"'DryBatchWeights - Existing'!$B$9","v":"Paste"},{"$f":"'DryBatchWeights - Existing'!$C$11","v":"Hydraulic cement:"},{"$f":"'DryBatchWeights - Existing'!$I$8","v":"Absolute Vol. (ft3)"}]
[308,{"$f":"IF('DryBatchWeights - Existing'!K11=\"\",\"\",'DryBatchWeights - Existing'!K11)","v":""},{"$f":"'DryBatchWeights - Existing'!$B$6","v":"Dry Batch Weights - Existing"},{"$f":"'DryBatchWeights - Existing'!$B$9","v":"Paste"},{"$f":"'DryBatchWeights - Existing'!$C$11","v":"Hydraulic cement:"},{"$f":"'DryBatchWeights - Existing'!$K$8","v":"SSD Weight (lbs/CY)"}]
[309,{"$f":"IF('DryBatchWeights - Existing'!E12=\"\",\"\",'DryBatchWeights - Existing'!E12)","v":""},{"$f":"'DryBatchWeights - Existing'!$B$6","v":"Dry Batch Weights - Existing"},{"$f":"'DryBatchWeights - Existing'!$B$9","v":"Paste"},{"$f":"'DryBatchWeights - Existing'!$C$12","v":""},{"$f":"'DryBatchWeights - Existing'!$E$8","v":"Type/Class/Grade"}]
[310,{"$f":"IF('DryBatchWeights - Existing'!F12=\"\",\"\",'DryBatchWeights - Existing'!F12)","v":""},{"$f":"'DryBatchWeights - Existing'!$B$6","v":"Dry Batch Weights - Existing"},{"$f":"'DryBatchWeights - Existing'!$B$9","v":"Paste"},{"$f":"'DryBatchWeights - Existing'!$C$12","v":""},{"$f":"'DryBatchWeights - Existing'!$F$8","v":"Producer/Source"}]
[311,{"$f":"IF('DryBatchWeights - Existing'!H12=\"\",\"\",'DryBatchWeights - Existing'!H12)","v":""},{"$f":"'DryBatchWeights - Existing'!$B$6","v":"Dry Batch Weights - Existing"},{"$f":"'DryBatchWeights - Existing'!$B$9","v":"Paste"},{"$f":"'DryBatchWeights - Existing'!$C$12","v":""},{"$f":"'DryBatchWeights - Existing'!$H$8","v":"% of Dosage*"}]
[312,{"$f":"IF('DryBatchWeights - Existing'!I12=\"\",\"\",'DryBatchWeights - Existing'!I12)","v":""},{"$f":"'DryBatchWeights - Existing'!$B$6","v":"Dry Batch Weights - Existing"},{"$f":"'DryBatchWeights - Existing'!$B$9","v":"Paste"},{"$f":"'DryBatchWeights - Existing'!$C$12","v":""},{"$f":"'DryBatchWeights - Existing'!$I$8","v":"Absolute Vol. (ft3)"}]
[313,{"$f":"IF('DryBatchWeights - Existing'!K12=\"\",\"\",'DryBatchWeights - Existing'!K12)","v":""},{"$f":"'DryBatchWeights - Existing'!$B$6","v":"Dry Batch Weights - Existing"},{"$f":"'DryBatchWeights - Existing'!$B$9","v":"Paste"},{"$f":"'DryBatchWeights - Existing'!$C$12","v":""},{"$f":"'DryBatchWeights - Existing'!$K$8","v":"SSD Weight (lbs/CY)"}]
[314,{"$f":"IF('DryBatchWeights - Existing'!E13=\"\",\"\",'DryBatchWeights - Existing'!E13)","v":""},{"$f":"'DryBatchWeights - Existing'!$B$6","v":"Dry Batch Weights - Existing"},{"$f":"'DryBatchWeights - Existing'!$B$9","v":"Paste"},{"$f":"'DryBatchWeights - Existing'!$C$13","v":""},{"$f":"'DryBatchWeights - Existing'!$E$8","v":"Type/Class/Grade"}]
[315,{"$f":"IF('DryBatchWeights - Existing'!F13=\"\",\"\",'DryBatchWeights - Existing'!F13)","v":""},{"$f":"'DryBatchWeights - Existing'!$B$6","v":"Dry Batch Weights - Existing"},{"$f":"'DryBatchWeights - Existing'!$B$9","v":"Paste"},{"$f":"'DryBatchWeights - Existing'!$C$13","v":""},{"$f":"'DryBatchWeights - Existing'!$F$8","v":"Producer/Source"}]
[316,{"$f":"IF('DryBatchWeights - Existing'!H13=\"\",\"\",'DryBatchWeights - Existing'!H13)","v":""},{"$f":"'DryBatchWeights - Existing'!$B$6","v":"Dry Batch Weights - Existing"},{"$f":"'DryBatchWeights - Existing'!$B$9","v":"Paste"},{"$f":"'DryBatchWeights - Existing'!$C$13","v":""},{"$f":"'DryBatchWeights - Existing'!$H$8","v":"% of Dosage*"}]
[317,{"$f":"IF('DryBatchWeights - Existing'!I13=\"\",\"\",'DryBatchWeights - Existing'!I13)","v":""},{"$f":"'DryBatchWeights - Existing'!$B$6","v":"Dry Batch Weights - Existing"},{"$f":"'DryBatchWeights - Existing'!$B$9","v":"Paste"},{"$f":"'DryBatchWeights - Existing'!$C$13","v":""},{"$f":"'DryBatchWeights - Existing'!$I$8","v":"Absolute Vol. (ft3)"}]
[318,{"$f":"IF('DryBatchWeights - Existing'!K13=\"\",\"\",'DryBatchWeights - Existing'!K13)","v":""},{"$f":"'DryBatchWeights - Existing'!$B$6","v":"Dry Batch Weights - Existing"},{"$f":"'DryBatchWeights - Existing'!$B$9","v":"Paste"},{"$f":"'DryBatchWeights - Existing'!$C$13","v":""},{"$f":"'DryBatchWeights - Existing'!$K$8","v":"SSD Weight (lbs/CY)"}]
[319,{"$f":"IF('DryBatchWeights - Existing'!E14=\"\",\"\",'DryBatchWeights - Existing'!E14)","v":""},{"$f":"'DryBatchWeights - Existing'!$B$6","v":"Dry Batch Weights - Existing"},{"$f":"'DryBatchWeights - Existing'!$B$9","v":"Paste"},{"$f":"'DryBatchWeights - Existing'!$C$14","v":""},{"$f":"'DryBatchWeights - Existing'!$E$8","v":"Type/Class/Grade"}]
[320,{"$f":"IF('DryBatchWeights - Existing'!F14=\"\",\"\",'DryBatchWeights - Existing'!F14)","v":""},{"$f":"'DryBatchWeights - Existing'!$B$6","v":"Dry Batch Weights - Existing"},{"$f":"'DryBatchWeights - Existing'!$B$9","v":"Paste"},{"$f":"'DryBatchWeights - Existing'!$C$14","v":""},{"$f":"'DryBatchWeights - Existing'!$F$8","v":"Producer/Source"}]
[321,{"$f":"IF('DryBatchWeights - Existing'!H14=\"\",\"\",'DryBatchWeights - Existing'!H14)","v":""},{"$f":"'DryBatchWeights - Existing'!$B$6","v":"Dry Batch Weights - Existing"},{"$f":"'DryBatchWeights - Existing'!$B$9","v":"Paste"},{"$f":"'DryBatchWeights - Existing'!$C$14","v":""},{"$f":"'DryBatchWeights - Existing'!$H$8","v":"% of Dosage*"}]
[322,{"$f":"IF('DryBatchWeights - Existing'!I14=\"\",\"\",'DryBatchWeights - Existing'!I14)","v":""},{"$f":"'DryBatchWeights - Existing'!$B$6","v":"Dry Batch Weights - Existing"},{"$f":"'DryBatchWeights - Existing'!$B$9","v":"Paste"},{"$f":"'DryBatchWeights - Existing'!$C$14","v":""},{"$f":"'DryBatchWeights - Existing'!$I$8","v":"Absolute Vol. (ft3)"}]
[323,{"$f":"IF('DryBatchWeights - Existing'!K14=\"\",\"\",'DryBatchWeights - Existing'!K14)","v":""},{"$f":"'DryBatchWeights - Existing'!$B$6","v":"Dry Batch Weights - Existing"},{"$f":"'DryBatchWeights - Existing'!$B$9","v":"Paste"},{"$f":"'DryBatchWeights - Existing'!$C$14","v":""},{"$f":"'DryBatchWeights - Existing'!$K$8","v":"SSD Weight (lbs/CY)"}]
[324,{"$f":"IF('DryBatchWeights - Existing'!E15=\"\",\"\",'DryBatchWeights - Existing'!E15)","v":""},{"$f":"'DryBatchWeights - Existing'!$B$6","v":"Dry Batch Weights - Existing"},{"$f":"'DryBatchWeights - Existing'!$B$9","v":"Paste"},{"$f":"'DryBatchWeights - Existing'!$C$15","v":""},{"$f":"'DryBatchWeights - Existing'!$E$8","v":"Type/Class/Grade"}]
[325,{"$f":"IF('DryBatchWeights - Existing'!F15=\"\",\"\",'DryBatchWeights - Existing'!F15)","v":""},{"$f":"'DryBatchWeights - Existing'!$B$6","v":"Dry Batch Weights - Existing"},{"$f":"'DryBatchWeights - Existing'!$B$9","v":"Paste"},{"$f":"'DryBatchWeights - Existing'!$C$15","v":""},{"$f":"'DryBatchWeights - Existing'!$F$8","v":"Producer/Source"}]
[326,{"$f":"IF('DryBatchWeights - Existing'!H15=\"\",\"\",'DryBatchWeights - Existing'!H15)","v":""},{"$f":"'DryBatchWeights - Existing'!$B$6","v":"Dry Batch Weights - Existing"},{"$f":"'DryBatchWeights - Existing'!$B$9","v":"Paste"},{"$f":"'DryBatchWeights - Existing'!$C$15","v":""},{"$f":"'DryBatchWeights - Existing'!$H$8","v":"% of Dosage*"}]
[327,{"$f":"IF('DryBatchWeights - Existing'!I15=\"\",\"\",'DryBatchWeights - Existing'!I15)","v":""},{"$f":"'DryBatchWeights - Existing'!$B$6","v":"Dry Batch Weights - Existing"},{"$f":"'DryBatchWeights - Existing'!$B$9","v":"Paste"},{"$f":"'DryBatchWeights - Existing'!$C$15","v":""},{"$f":"'DryBatchWeights - Existing'!$I$8","v":"Absolute Vol. (ft3)"}]
[328,{"$f":"IF('DryBatchWeights - Existing'!K15=\"\",\"\",'DryBatchWeights - Existing'!K15)","v":""},{"$f":"'DryBatchWeights - Existing'!$B$6","v":"Dry Batch Weights - Existing"},{"$f":"'DryBatchWeights - Existing'!$B$9","v":"Paste"},{"$f":"'DryBatchWeights - Existing'!$C$15","v":""},{"$f":"'DryBatchWeights - Existing'!$K$8","v":"SSD Weight (lbs/CY)"}]
[329,{"$f":"IF('DryBatchWeights - Existing'!E16=\"\",\"\",'DryBatchWeights - Existing'!E16)","v":""},{"$f":"'DryBatchWeights - Existing'!$B$6","v":"Dry Batch Weights - Existing"},{"$f":"'DryBatchWeights - Existing'!$B$9","v":"Paste"},{"$f":"'DryBatchWeights - Existing'!$C$16","v":""},{"$f":"'DryBatchWeights - Existing'!$E$8","v":"Type/Class/Grade"}]
[330,{"$f":"IF('DryBatchWeights - Existing'!F16=\"\",\"\",'DryBatchWeights - Existing'!F16)","v":""},{"$f":"'DryBatchWeights - Existing'!$B$6","v":"Dry Batch Weights - Existing"},{"$f":"'DryBatchWeights - Existing'!$B$9","v":"Paste"},{"$f":"'DryBatchWeights - Existing'!$C$16","v":""},{"$f":"'DryBatchWeights - Existing'!$F$8","v":"Producer/Source"}]
[331,{"$f":"IF('DryBatchWeights - Existing'!H16=\"\",\"\",'DryBatchWeights - Existing'!H16)","v":""},{"$f":"'DryBatchWeights - Existing'!$B$6","v":"Dry Batch Weights - Existing"},{"$f":"'DryBatchWeights - Existing'!$B$9","v":"Paste"},{"$f":"'DryBatchWeights - Existing'!$C$16","v":""},{"$f":"'DryBatchWeights - Existing'!$H$8","v":"% of Dosage*"}]
[332,{"$f":"IF('DryBatchWeights - Existing'!I16=\"\",\"\",'DryBatchWeights - Existing'!I16)","v":""},{"$f":"'DryBatchWeights - Existing'!$B$6","v":"Dry Batch Weights - Existing"},{"$f":"'DryBatchWeights - Existing'!$B$9","v":"Paste"},{"$f":"'DryBatchWeights - Existing'!$C$16","v":""},{"$f":"'DryBatchWeights - Existing'!$I$8","v":"Absolute Vol. (ft3)"}]
[333,{"$f":"IF('DryBatchWeights - Existing'!K16=\"\",\"\",'DryBatchWeights - Existing'!K16)","v":""},{"$f":"'DryBatchWeights - Existing'!$B$6","v":"Dry Batch Weights - Existing"},{"$f":"'DryBatchWeights - Existing'!$B$9","v":"Paste"},{"$f":"'DryBatchWeights - Existing'!$C$16","v":""},{"$f":"'DryBatchWeights - Existing'!$K$8","v":"SSD Weight (lbs/CY)"}]
[334,{"$f":"IF('DryBatchWeights - Existing'!E17=\"\",\"\",'DryBatchWeights - Existing'!E17)","v":""},{"$f":"'DryBatchWeights - Existing'!$B$6","v":"Dry Batch Weights - Existing"},{"$f":"'DryBatchWeights - Existing'!$B$9","v":"Paste"},{"$f":"'DryBatchWeights - Existing'!$C$17","v":""},{"$f":"'DryBatchWeights - Existing'!$E$8","v":"Type/Class/Grade"}]
[335,{"$f":"IF('DryBatchWeights - Existing'!F17=\"\",\"\",'DryBatchWeights - Existing'!F17)","v":""},{"$f":"'DryBatchWeights - Existing'!$B$6","v":"Dry Batch Weights - Existing"},{"$f":"'DryBatchWeights - Existing'!$B$9","v":"Paste"},{"$f":"'DryBatchWeights - Existing'!$C$17","v":""},{"$f":"'DryBatchWeights - Existing'!$F$8","v":"Producer/Source"}]
[336,{"$f":"IF('DryBatchWeights - Existing'!H17=\"\",\"\",'DryBatchWeights - Existing'!H17)","v":""},{"$f":"'DryBatchWeights - Existing'!$B$6","v":"Dry Batch Weights - Existing"},{"$f":"'DryBatchWeights - Existing'!$B$9","v":"Paste"},{"$f":"'DryBatchWeights - Existing'!$C$17","v":""},{"$f":"'DryBatchWeights - Existing'!$H$8","v":"% of Dosage*"}]
[337,{"$f":"IF('DryBatchWeights - Existing'!I17=\"\",\"\",'DryBatchWeights - Existing'!I17)","v":""},{"$f":"'DryBatchWeights - Existing'!$B$6","v":"Dry Batch Weights - Existing"},{"$f":"'DryBatchWeights - Existing'!$B$9","v":"Paste"},{"$f":"'DryBatchWeights - Existing'!$C$17","v":""},{"$f":"'DryBatchWeights - Existing'!$I$8","v":"Absolute Vol. (ft3)"}]
[338,{"$f":"IF('DryBatchWeights - Existing'!K17=\"\",\"\",'DryBatchWeights - Existing'!K17)","v":""},{"$f":"'DryBatchWeights - Existing'!$B$6","v":"Dry Batch Weights - Existing"},{"$f":"'DryBatchWeights - Existing'!$B$9","v":"Paste"},{"$f":"'DryBatchWeights - Existing'!$C$17","v":""},{"$f":"'DryBatchWeights - Existing'!$K$8","v":"SSD Weight (lbs/CY)"}]
[339,{"$f":"IF('DryBatchWeights - Existing'!E18=\"\",\"\",'DryBatchWeights - Existing'!E18)","v":""},{"$f":"'DryBatchWeights - Existing'!$B$6","v":"Dry Batch Weights - Existing"},{"$f":"'DryBatchWeights - Existing'!$B$9","v":"Paste"},{"$f":"'DryBatchWeights - Existing'!$C$18","v":""},{"$f":"'DryBatchWeights - Existing'!$E$8","v":"Type/Class/Grade"}]
[340,{"$f":"IF('DryBatchWeights - Existing'!F18=\"\",\"\",'DryBatchWeights - Existing'!F18)","v":""},{"$f":"'DryBatchWeights - Existing'!$B$6","v":"Dry Batch Weights - Existing"},{"$f":"'DryBatchWeights - Existing'!$B$9","v":"Paste"},{"$f":"'DryBatchWeights - Existing'!$C$18","v":""},{"$f":"'DryBatchWeights - Existing'!$F$8","v":"Producer/Source"}]
[341,{"$f":"IF('DryBatchWeights - Existing'!H18=\"\",\"\",'DryBatchWeights - Existing'!H18)","v":""},{"$f":"'DryBatchWeights - Existing'!$B$6","v":"Dry Batch Weights - Existing"},{"$f":"'DryBatchWeights - Existing'!$B$9","v":"Paste"},{"$f":"'DryBatchWeights - Existing'!$C$18","v":""},{"$f":"'DryBatchWeights - Existing'!$H$8","v":"% of Dosage*"}]
[342,{"$f":"IF('DryBatchWeights - Existing'!I18=\"\",\"\",'DryBatchWeights - Existing'!I18)","v":""},{"$f":"'DryBatchWeights - Existing'!$B$6","v":"Dry Batch Weights - Existing"},{"$f":"'DryBatchWeights - Existing'!$B$9","v":"Paste"},{"$f":"'DryBatchWeights - Existing'!$C$18","v":""},{"$f":"'DryBatchWeights - Existing'!$I$8","v":"Absolute Vol. (ft3)"}]
[343,{"$f":"IF('DryBatchWeights - Existing'!K18=\"\",\"\",'DryBatchWeights - Existing'!K18)","v":""},{"$f":"'DryBatchWeights - Existing'!$B$6","v":"Dry Batch Weights - Existing"},{"$f":"'DryBatchWeights - Existing'!$B$9","v":"Paste"},{"$f":"'DryBatchWeights - Existing'!$C$18","v":""},{"$f":"'DryBatchWeights - Existing'!$K$8","v":"SSD Weight (lbs/CY)"}]
[344,{"$f":"IF('DryBatchWeights - Existing'!E19=\"\",\"\",'DryBatchWeights - Existing'!E19)","v":""},{"$f":"'DryBatchWeights - Existing'!$B$6","v":"Dry Batch Weights - Existing"},{"$f":"'DryBatchWeights - Existing'!$B$9","v":"Paste"},{"$f":"'DryBatchWeights - Existing'!$C$19","v":""},{"$f":"'DryBatchWeights - Existing'!$E$8","v":"Type/Class/Grade"}]
[345,{"$f":"IF('DryBatchWeights - Existing'!F19=\"\",\"\",'DryBatchWeights - Existing'!F19)","v":""},{"$f":"'DryBatchWeights - Existing'!$B$6","v":"Dry Batch Weights - Existing"},{"$f":"'DryBatchWeights - Existing'!$B$9","v":"Paste"},{"$f":"'DryBatchWeights - Existing'!$C$19","v":""},{"$f":"'DryBatchWeights - Existing'!$F$8","v":"Producer/Source"}]
[346,{"$f":"IF('DryBatchWeights - Existing'!H19=\"\",\"\",'DryBatchWeights - Existing'!H19)","v":""},{"$f":"'DryBatchWeights - Existing'!$B$6","v":"Dry Batch Weights - Existing"},{"$f":"'DryBatchWeights - Existing'!$B$9","v":"Paste"},{"$f":"'DryBatchWeights - Existing'!$C$19","v":""},{"$f":"'DryBatchWeights - Existing'!$H$8","v":"% of Dosage*"}]
[347,{"$f":"IF('DryBatchWeights - Existing'!I19=\"\",\"\",'DryBatchWeights - Existing'!I19)","v":""},{"$f":"'DryBatchWeights - Existing'!$B$6","v":"Dry Batch Weights - Existing"},{"$f":"'DryBatchWeights - Existing'!$B$9","v":"Paste"},{"$f":"'DryBatchWeights - Existing'!$C$19","v":""},{"$f":"'DryBatchWeights - Existing'!$I$8","v":"Absolute Vol. (ft3)"}]
[348,{"$f":"IF('DryBatchWeights - Existing'!K19=\"\",\"\",'DryBatchWeights - Existing'!K19)","v":""},{"$f":"'DryBatchWeights - Existing'!$B$6","v":"Dry Batch Weights - Existing"},{"$f":"'DryBatchWeights - Existing'!$B$9","v":"Paste"},{"$f":"'DryBatchWeights - Existing'!$C$19","v":""},{"$f":"'DryBatchWeights - Existing'!$K$8","v":"SSD Weight (lbs/CY)"}]
[349,{"$f":"IF('DryBatchWeights - Existing'!E20=\"\",\"\",'DryBatchWeights - Existing'!E20)","v":""},{"$f":"'DryBatchWeights - Existing'!$B$6","v":"Dry Batch Weights - Existing"},{"$f":"'DryBatchWeights - Existing'!$B$9","v":"Paste"},{"$f":"'DryBatchWeights - Existing'!$C$20","v":""},{"$f":"'DryBatchWeights - Existing'!$E$8","v":"Type/Class/Grade"}]
[350,{"$f":"IF('DryBatchWeights - Existing'!F20=\"\",\"\",'DryBatchWeights - Existing'!F20)","v":""},{"$f":"'DryBatchWeights - Existing'!$B$6","v":"Dry Batch Weights - Existing"},{"$f":"'DryBatchWeights - Existing'!$B$9","v":"Paste"},{"$f":"'DryBatchWeights - Existing'!$C$20","v":""},{"$f":"'DryBatchWeights - Existing'!$F$8","v":"Producer/Source"}]
[351,{"$f":"IF('DryBatchWeights - Existing'!H20=\"\",\"\",'DryBatchWeights - Existing'!H20)","v":""},{"$f":"'DryBatchWeights - Existing'!$B$6","v":"Dry Batch Weights - Existing"},{"$f":"'DryBatchWeights - Existing'!$B$9","v":"Paste"},{"$f":"'DryBatchWeights - Existing'!$C$20","v":""},{"$f":"'DryBatchWeights - Existing'!$H$8","v":"% of Dosage*"}]
[352,{"$f":"IF('DryBatchWeights - Existing'!I20=\"\",\"\",'DryBatchWeights - Existing'!I20)","v":""},{"$f":"'DryBatchWeights - Existing'!$B$6","v":"Dry Batch Weights - Existing"},{"$f":"'DryBatchWeights - Existing'!$B$9","v":"Paste"},{"$f":"'DryBatchWeights - Existing'!$C$20","v":""},{"$f":"'DryBatchWeights - Existing'!$I$8","v":"Absolute Vol. (ft3)"}]
[353,{"$f":"IF('DryBatchWeights - Existing'!K20=\"\",\"\",'DryBatchWeights - Existing'!K20)","v":""},{"$f":"'DryBatchWeights - Existing'!$B$6","v":"Dry Batch Weights - Existing"},{"$f":"'DryBatchWeights - Existing'!$B$9","v":"Paste"},{"$f":"'DryBatchWeights - Existing'!$C$20","v":""},{"$f":"'DryBatchWeights - Existing'!$K$8","v":"SSD Weight (lbs/CY)"}]
[354,{"$f":"IF('DryBatchWeights - Existing'!E21=\"\",\"\",'DryBatchWeights - Existing'!E21)","v":""},{"$f":"'DryBatchWeights - Existing'!$B$6","v":"Dry Batch Weights - Existing"},{"$f":"'DryBatchWeights - Existing'!$B$9","v":"Paste"},{"$f":"'DryBatchWeights - Existing'!$C$21","v":""},{"$f":"'DryBatchWeights - Existing'!$E$8","v":"Type/Class/Grade"}]
[355,{"$f":"IF('DryBatchWeights - Existing'!F21=\"\",\"\",'DryBatchWeights - Existing'!F21)","v":""},{"$f":"'DryBatchWeights - Existing'!$B$6","v":"Dry Batch Weights - Existing"},{"$f":"'DryBatchWeights - Existing'!$B$9","v":"Paste"},{"$f":"'DryBatchWeights - Existing'!$C$21","v":""},{"$f":"'DryBatchWeights - Existing'!$F$8","v":"Producer/Source"}]
[356,{"$f":"IF('DryBatchWeights - Existing'!H21=\"\",\"\",'DryBatchWeights - Existing'!H21)","v":""},{"$f":"'DryBatchWeights - Existing'!$B$6","v":"Dry Batch Weights - Existing"},{"$f":"'DryBatchWeights - Existing'!$B$9","v":"Paste"},{"$f":"'DryBatchWeights - Existing'!$C$21","v":""},{"$f":"'DryBatchWeights - Existing'!$H$8","v":"% of Dosage*"}]
[357,{"$f":"IF('DryBatchWeights - Existing'!I21=\"\",\"\",'DryBatchWeights - Existing'!I21)","v":""},{"$f":"'DryBatchWeights - Existing'!$B$6","v":"Dry Batch Weights - Existing"},{"$f":"'DryBatchWeights - Existing'!$B$9","v":"Paste"},{"$f":"'DryBatchWeights - Existing'!$C$21","v":""},{"$f":"'DryBatchWeights - Existing'!$I$8","v":"Absolute Vol. (ft3)"}]
[358,{"$f":"IF('DryBatchWeights - Existing'!K21=\"\",\"\",'DryBatchWeights - Existing'!K21)","v":""},{"$f":"'DryBatchWeights - Existing'!$B$6","v":"Dry Batch Weights - Existing"},{"$f":"'DryBatchWeights - Existing'!$B$9","v":"Paste"},{"$f":"'DryBatchWeights - Existing'!$C$21","v":""},{"$f":"'DryBatchWeights - Existing'!$K$8","v":"SSD Weight (lbs/CY)"}]
[359,{"$f":"IF('DryBatchWeights - Existing'!E22=\"\",\"\",'DryBatchWeights - Existing'!E22)","v":""},{"$f":"'DryBatchWeights - Existing'!$B$6","v":"Dry Batch Weights - Existing"},{"$f":"'DryBatchWeights - Existing'!$B$9","v":"Paste"},{"$f":"'DryBatchWeights - Existing'!$C$22","v":""},{"$f":"'DryBatchWeights - Existing'!$E$8","v":"Type/Class/Grade"}]
[360,{"$f":"IF('DryBatchWeights - Existing'!F22=\"\",\"\",'DryBatchWeights - Existing'!F22)","v":""},{"$f":"'DryBatchWeights - Existing'!$B$6","v":"Dry Batch Weights - Existing"},{"$f":"'DryBatchWeights - Existing'!$B$9","v":"Paste"},{"$f":"'DryBatchWeights - Existing'!$C$22","v":""},{"$f":"'DryBatchWeights - Existing'!$F$8","v":"Producer/Source"}]
[361,{"$f":"IF('DryBatchWeights - Existing'!H22=\"\",\"\",'DryBatchWeights - Existing'!H22)","v":""},{"$f":"'DryBatchWeights - Existing'!$B$6","v":"Dry Batch Weights - Existing"},{"$f":"'DryBatchWeights - Existing'!$B$9","v":"Paste"},{"$f":"'DryBatchWeights - Existing'!$C$22","v":""},{"$f":"'DryBatchWeights - Existing'!$H$8","v":"% of Dosage*"}]
[362,{"$f":"IF('DryBatchWeights - Existing'!I22=\"\",\"\",'DryBatchWeights - Existing'!I22)","v":""},{"$f":"'DryBatchWeights - Existing'!$B$6","v":"Dry Batch Weights - Existing"},{"$f":"'DryBatchWeights - Existing'!$B$9","v":"Paste"},{"$f":"'DryBatchWeights - Existing'!$C$22","v":""},{"$f":"'DryBatchWeights - Existing'!$I$8","v":"Absolute Vol. (ft3)"}]
[363,{"$f":"IF('DryBatchWeights - Existing'!K22=\"\",\"\",'DryBatchWeights - Existing'!K22)","v":""},{"$f":"'DryBatchWeights - Existing'!$B$6","v":"Dry Batch Weights - Existing"},{"$f":"'DryBatchWeights - Existing'!$B$9","v":"Paste"},{"$f":"'DryBatchWeights - Existing'!$C$22","v":""},{"$f":"'DryBatchWeights - Existing'!$K$8","v":"SSD Weight (lbs/CY)"}]
[364,{"$f":"IF('DryBatchWeights - Existing'!E23=\"\",\"\",'DryBatchWeights - Existing'!E23)","v":""},{"$f":"'DryBatchWeights - Existing'!$B$6","v":"Dry Batch Weights - Existing"},{"$f":"'DryBatchWeights - Existing'!$B$9","v":"Paste"},{"$f":"'DryBatchWeights - Existing'!$C$23","v":""},{"$f":"'DryBatchWeights - Existing'!$E$8","v":"Type/Class/Grade"}]
[365,{"$f":"IF('DryBatchWeights - Existing'!F23=\"\",\"\",'DryBatchWeights - Existing'!F23)","v":""},{"$f":"'DryBatchWeights - Existing'!$B$6","v":"Dry Batch Weights - Existing"},{"$f":"'DryBatchWeights - Existing'!$B$9","v":"Paste"},{"$f":"'DryBatchWeights - Existing'!$C$23","v":""},{"$f":"'DryBatchWeights - Existing'!$F$8","v":"Producer/Source"}]
[366,{"$f":"IF('DryBatchWeights - Existing'!H23=\"\",\"\",'DryBatchWeights - Existing'!H23)","v":""},{"$f":"'DryBatchWeights - Existing'!$B$6","v":"Dry Batch Weights - Existing"},{"$f":"'DryBatchWeights - Existing'!$B$9","v":"Paste"},{"$f":"'DryBatchWeights - Existing'!$C$23","v":""},{"$f":"'DryBatchWeights - Existing'!$H$8","v":"% of Dosage*"}]
[367,{"$f":"IF('DryBatchWeights - Existing'!I23=\"\",\"\",'DryBatchWeights - Existing'!I23)","v":""},{"$f":"'DryBatchWeights - Existing'!$B$6","v":"Dry Batch Weights - Existing"},{"$f":"'DryBatchWeights - Existing'!$B$9","v":"Paste"},{"$f":"'DryBatchWeights - Existing'!$C$23","v":""},{"$f":"'DryBatchWeights - Existing'!$I$8","v":"Absolute Vol. (ft3)"}]
[368,{"$f":"IF('DryBatchWeights - Existing'!K23=\"\",\"\",'DryBatchWeights - Existing'!K23)","v":""},{"$f":"'DryBatchWeights - Existing'!$B$6","v":"Dry Batch Weights - Existing"},{"$f":"'DryBatchWeights - Existing'!$B$9","v":"Paste"},{"$f":"'DryBatchWeights - Existing'!$C$23","v":""},{"$f":"'DryBatchWeights - Existing'!$K$8","v":"SSD Weight (lbs/CY)"}]
[369,{"$f":"IF('DryBatchWeights - Existing'!E24=\"\",\"\",'DryBatchWeights - Existing'!E24)","v":""},{"$f":"'DryBatchWeights - Existing'!$B$6","v":"Dry Batch Weights - Existing"},{"$f":"'DryBatchWeights - Existing'!$B$9","v":"Paste"},{"$f":"'DryBatchWeights - Existing'!$C$24","v":""},{"$f":"'DryBatchWeights - Existing'!$E$8","v":"Type/Class/Grade"}]
[370,{"$f":"IF('DryBatchWeights - Existing'!F24=\"\",\"\",'DryBatchWeights - Existing'!F24)","v":""},{"$f":"'DryBatchWeights - Existing'!$B$6","v":"Dry Batch Weights - Existing"},{"$f":"'DryBatchWeights - Existing'!$B$9","v":"Paste"},{"$f":"'DryBatchWeights - Existing'!$C$24","v":""},{"$f":"'DryBatchWeights - Existing'!$F$8","v":"Producer/Source"}]
[371,{"$f":"IF('DryBatchWeights - Existing'!H24=\"\",\"\",'DryBatchWeights - Existing'!H24)","v":""},{"$f":"'DryBatchWeights - Existing'!$B$6","v":"Dry Batch Weights - Existing"},{"$f":"'DryBatchWeights - Existing'!$B$9","v":"Paste"},{"$f":"'DryBatchWeights - Existing'!$C$24","v":""},{"$f":"'DryBatchWeights - Existing'!$H$8","v":"% of Dosage*"}]
[372,{"$f":"IF('DryBatchWeights - Existing'!I24=\"\",\"\",'DryBatchWeights - Existing'!I24)","v":""},{"$f":"'DryBatchWeights - Existing'!$B$6","v":"Dry Batch Weights - Existing"},{"$f":"'DryBatchWeights - Existing'!$B$9","v":"Paste"},{"$f":"'DryBatchWeights - Existing'!$C$24","v":""},{"$f":"'DryBatchWeights - Existing'!$I$8","v":"Absolute Vol. (ft3)"}]
[373,{"$f":"IF('DryBatchWeights - Existing'!K24=\"\",\"\",'DryBatchWeights - Existing'!K24)","v":""},{"$f":"'DryBatchWeights - Existing'!$B$6","v":"Dry Batch Weights - Existing"},{"$f":"'DryBatchWeights - Existing'!$B$9","v":"Paste"},{"$f":"'DryBatchWeights - Existing'!$C$24","v":""},{"$f":"'DryBatchWeights - Existing'!$K$8","v":"SSD Weight (lbs/CY)"}]
[374,{"$f":"IF('DryBatchWeights - Existing'!E25=\"\",\"\",'DryBatchWeights - Existing'!E25)","v":""},{"$f":"'DryBatchWeights - Existing'!$B$6","v":"Dry Batch Weights - Existing"},{"$f":"'DryBatchWeights - Existing'!$B$9","v":"Paste"},{"$f":"'DryBatchWeights - Existing'!$C$25","v":""},{"$f":"'DryBatchWeights - Existing'!$E$8","v":"Type/Class/Grade"}]
[375,{"$f":"IF('DryBatchWeights - Existing'!F25=\"\",\"\",'DryBatchWeights - Existing'!F25)","v":""},{"$f":"'DryBatchWeights - Existing'!$B$6","v":"Dry Batch Weights - Existing"},{"$f":"'DryBatchWeights - Existing'!$B$9","v":"Paste"},{"$f":"'DryBatchWeights - Existing'!$C$25","v":""},{"$f":"'DryBatchWeights - Existing'!$F$8","v":"Producer/Source"}]
[376,{"$f":"IF('DryBatchWeights - Existing'!H25=\"\",\"\",'DryBatchWeights - Existing'!H25)","v":""},{"$f":"'DryBatchWeights - Existing'!$B$6","v":"Dry Batch Weights - Existing"},{"$f":"'DryBatchWeights - Existing'!$B$9","v":"Paste"},{"$f":"'DryBatchWeights - Existing'!$C$25","v":""},{"$f":"'DryBatchWeights - Existing'!$H$8","v":"% of Dosage*"}]
[377,{"$f":"IF('DryBatchWeights - Existing'!I25=\"\",\"\",'DryBatchWeights - Existing'!I25)","v":""},{"$f":"'DryBatchWeights - Existing'!$B$6","v":"Dry Batch Weights - Existing"},{"$f":"'DryBatchWeights - Existing'!$B$9","v":"Paste"},{"$f":"'DryBatchWeights - Existing'!$C$25","v":""},{"$f":"'DryBatchWeights - Existing'!$I$8","v":"Absolute Vol. (ft3)"}]
[378,{"$f":"IF('DryBatchWeights - Existing'!K25=\"\",\"\",'DryBatchWeights - Existing'!K25)","v":""},{"$f":"'DryBatchWeights - Existing'!$B$6","v":"Dry Batch Weights - Existing"},{"$f":"'DryBatchWeights - Existing'!$B$9","v":"Paste"},{"$f":"'DryBatchWeights - Existing'!$C$25","v":""},{"$f":"'DryBatchWeights - Existing'!$K$8","v":"SSD Weight (lbs/CY)"}]
[379,{"$f":"IF('DryBatchWeights - Existing'!E26=\"\",\"\",'DryBatchWeights - Existing'!E26)","v":""},{"$f":"'DryBatchWeights - Existing'!$B$6","v":"Dry Batch Weights - Existing"},{"$f":"'DryBatchWeights - Existing'!$B$9","v":"Paste"},{"$f":"'DryBatchWeights - Existing'!$C$26","v":""},{"$f":"'DryBatchWeights - Existing'!$E$8","v":"Type/Class/Grade"}]
[380,{"$f":"IF('DryBatchWeights - Existing'!F26=\"\",\"\",'DryBatchWeights - Existing'!F26)","v":""},{"$f":"'DryBatchWeights - Existing'!$B$6","v":"Dry Batch Weights - Existing"},{"$f":"'DryBatchWeights - Existing'!$B$9","v":"Paste"},{"$f":"'DryBatchWeights - Existing'!$C$26","v":""},{"$f":"'DryBatchWeights - Existing'!$F$8","v":"Producer/Source"}]
[381,{"$f":"IF('DryBatchWeights - Existing'!H26=\"\",\"\",'DryBatchWeights - Existing'!H26)","v":""},{"$f":"'DryBatchWeights - Existing'!$B$6","v":"Dry Batch Weights - Existing"},{"$f":"'DryBatchWeights - Existing'!$B$9","v":"Paste"},{"$f":"'DryBatchWeights - Existing'!$C$26","v":""},{"$f":"'DryBatchWeights - Existing'!$H$8","v":"% of Dosage*"}]
[382,{"$f":"IF('DryBatchWeights - Existing'!I26=\"\",\"\",'DryBatchWeights - Existing'!I26)","v":""},{"$f":"'DryBatchWeights - Existing'!$B$6","v":"Dry Batch Weights - Existing"},{"$f":"'DryBatchWeights - Existing'!$B$9","v":"Paste"},{"$f":"'DryBatchWeights - Existing'!$C$26","v":""},{"$f":"'DryBatchWeights - Existing'!$I$8","v":"Absolute Vol. (ft3)"}]
[383,{"$f":"IF('DryBatchWeights - Existing'!K26=\"\",\"\",'DryBatchWeights - Existing'!K26)","v":""},{"$f":"'DryBatchWeights - Existing'!$B$6","v":"Dry Batch Weights - Existing"},{"$f":"'DryBatchWeights - Existing'!$B$9","v":"Paste"},{"$f":"'DryBatchWeights - Existing'!$C$26","v":""},{"$f":"'DryBatchWeights - Existing'!$K$8","v":"SSD Weight (lbs/CY)"}]
[384,{"$f":"IF('DryBatchWeights - Existing'!E27=\"\",\"\",'DryBatchWeights - Existing'!E27)","v":""},{"$f":"'DryBatchWeights - Existing'!$B$6","v":"Dry Batch Weights - Existing"},{"$f":"'DryBatchWeights - Existing'!$B$9","v":"Paste"},{"$f":"'DryBatchWeights - Existing'!$C$27","v":""},{"$f":"'DryBatchWeights - Existing'!$E$8","v":"Type/Class/Grade"}]
[385,{"$f":"IF('DryBatchWeights - Existing'!F27=\"\",\"\",'DryBatchWeights - Existing'!F27)","v":""},{"$f":"'DryBatchWeights - Existing'!$B$6","v":"Dry Batch Weights - Existing"},{"$f":"'DryBatchWeights - Existing'!$B$9","v":"Paste"},{"$f":"'DryBatchWeights - Existing'!$C$27","v":""},{"$f":"'DryBatchWeights - Existing'!$F$8","v":"Producer/Source"}]
[386,{"$f":"IF('DryBatchWeights - Existing'!H27=\"\",\"\",'DryBatchWeights - Existing'!H27)","v":""},{"$f":"'DryBatchWeights - Existing'!$B$6","v":"Dry Batch Weights - Existing"},{"$f":"'DryBatchWeights - Existing'!$B$9","v":"Paste"},{"$f":"'DryBatchWeights - Existing'!$C$27","v":""},{"$f":"'DryBatchWeights - Existing'!$H$8","v":"% of Dosage*"}]
[387,{"$f":"IF('DryBatchWeights - Existing'!I27=\"\",\"\",'DryBatchWeights - Existing'!I27)","v":""},{"$f":"'DryBatchWeights - Existing'!$B$6","v":"Dry Batch Weights - Existing"},{"$f":"'DryBatchWeights - Existing'!$B$9","v":"Paste"},{"$f":"'DryBatchWeights - Existing'!$C$27","v":""},{"$f":"'DryBatchWeights - Existing'!$I$8","v":"Absolute Vol. (ft3)"}]
[388,{"$f":"IF('DryBatchWeights - Existing'!K27=\"\",\"\",'DryBatchWeights - Existing'!K27)","v":""},{"$f":"'DryBatchWeights - Existing'!$B$6","v":"Dry Batch Weights - Existing"},{"$f":"'DryBatchWeights - Existing'!$B$9","v":"Paste"},{"$f":"'DryBatchWeights - Existing'!$C$27","v":""},{"$f":"'DryBatchWeights - Existing'!$K$8","v":"SSD Weight (lbs/CY)"}]
[389,{"$f":"IF('DryBatchWeights - Existing'!E28=\"\",\"\",'DryBatchWeights - Existing'!E28)","v":""},{"$f":"'DryBatchWeights - Existing'!$B$6","v":"Dry Batch Weights - Existing"},{"$f":"'DryBatchWeights - Existing'!$B$9","v":"Paste"},{"$f":"'DryBatchWeights - Existing'!$C$28","v":""},{"$f":"'DryBatchWeights - Existing'!$E$8","v":"Type/Class/Grade"}]
[390,{"$f":"IF('DryBatchWeights - Existing'!F28=\"\",\"\",'DryBatchWeights - Existing'!F28)","v":""},{"$f":"'DryBatchWeights - Existing'!$B$6","v":"Dry Batch Weights - Existing"},{"$f":"'DryBatchWeights - Existing'!$B$9","v":"Paste"},{"$f":"'DryBatchWeights - Existing'!$C$28","v":""},{"$f":"'DryBatchWeights - Existing'!$F$8","v":"Producer/Source"}]
[391,{"$f":"IF('DryBatchWeights - Existing'!H28=\"\",\"\",'DryBatchWeights - Existing'!H28)","v":""},{"$f":"'DryBatchWeights - Existing'!$B$6","v":"Dry Batch Weights - Existing"},{"$f":"'DryBatchWeights - Existing'!$B$9","v":"Paste"},{"$f":"'DryBatchWeights - Existing'!$C$28","v":""},{"$f":"'DryBatchWeights - Existing'!$H$8","v":"% of Dosage*"}]
[392,{"$f":"IF('DryBatchWeights - Existing'!I28=\"\",\"\",'DryBatchWeights - Existing'!I28)","v":""},{"$f":"'DryBatchWeights - Existing'!$B$6","v":"Dry Batch Weights - Existing"},{"$f":"'DryBatchWeights - Existing'!$B$9","v":"Paste"},{"$f":"'DryBatchWeights - Existing'!$C$28","v":""},{"$f":"'DryBatchWeights - Existing'!$I$8","v":"Absolute Vol. (ft3)"}]
[393,{"$f":"IF('DryBatchWeights - Existing'!K28=\"\",\"\",'DryBatchWeights - Existing'!K28)","v":""},{"$f":"'DryBatchWeights - Existing'!$B$6","v":"Dry Batch Weights - Existing"},{"$f":"'DryBatchWeights - Existing'!$B$9","v":"Paste"},{"$f":"'DryBatchWeights - Existing'!$C$28","v":""},{"$f":"'DryBatchWeights - Existing'!$K$8","v":"SSD Weight (lbs/CY)"}]
[394,{"$f":"IF('DryBatchWeights - Existing'!I29=\"\",\"\",'DryBatchWeights - Existing'!I29)","v":0},{"$f":"'DryBatchWeights - Existing'!$B$6","v":"Dry Batch Weights - Existing"},{"$f":"'DryBatchWeights - Existing'!$B$9","v":"Paste"},{"$f":"'DryBatchWeights - Existing'!$C$29","v":"Paste Volume = Total (water + cm):"},{"$f":"'DryBatchWeights - Existing'!I8","v":"Absolute Vol. (ft3)"}]
[395,{"$f":"IF('DryBatchWeights - Existing'!K29=\"\",\"\",'DryBatchWeights - Existing'!K29)","v":0},{"$f":"'DryBatchWeights - Existing'!$B$6","v":"Dry Batch Weights - Existing"},{"$f":"'DryBatchWeights - Existing'!$B$9","v":"Paste"},{"$f":"'DryBatchWeights - Existing'!$C$29","v":"Paste Volume = Total (water + cm):"},{"$f":"'DryBatchWeights - Existing'!$K$8","v":"SSD Weight (lbs/CY)"}]
[396,{"$f":"IF('DryBatchWeights - Existing'!H30=\"\",\"\",'DryBatchWeights - Existing'!H30)","v":0},{"$f":"'DryBatchWeights - Existing'!$B$6","v":"Dry Batch Weights - Existing"},{"$f":"'DryBatchWeights - Existing'!$B$30","v":"Air"},{"$f":"'DryBatchWeights - Existing'!C30","v":"Entrapped air:"},{"$f":"'DryBatchWeights - Existing'!$H$8","v":"% of Dosage*"}]
[397,{"$f":"IF('DryBatchWeights - Existing'!I30=\"\",\"\",'DryBatchWeights - Existing'!I30)","v":0},{"$f":"'DryBatchWeights - Existing'!$B$6","v":"Dry Batch Weights - Existing"},{"$f":"'DryBatchWeights - Existing'!$B$30","v":"Air"},{"$f":"'DryBatchWeights - Existing'!C30","v":"Entrapped air:"},{"$f":"'DryBatchWeights - Existing'!$I$8","v":"Absolute Vol. (ft3)"}]
[398,{"$f":"IF('DryBatchWeights - Existing'!H31=\"\",\"\",'DryBatchWeights - Existing'!H31)","v":0},{"$f":"'DryBatchWeights - Existing'!$B$6","v":"Dry Batch Weights - Existing"},{"$f":"'DryBatchWeights - Existing'!$B$30","v":"Air"},{"$f":"'DryBatchWeights - Existing'!C31","v":"Target Total Air Content:"},{"$f":"'DryBatchWeights - Existing'!$H$8","v":"% of Dosage*"}]
[399,{"$f":"IF('DryBatchWeights - Existing'!I31=\"\",\"\",'DryBatchWeights - Existing'!I31)","v":0},{"$f":"'DryBatchWeights - Existing'!$B$6","v":"Dry Batch Weights - Existing"},{"$f":"'DryBatchWeights - Existing'!$B$30","v":"Air"},{"$f":"'DryBatchWeights - Existing'!C31","v":"Target Total Air Content:"},{"$f":"'DryBatchWeights - Existing'!$I$8","v":"Absolute Vol. (ft3)"}]
[400,{"$f":"IF('DryBatchWeights - Existing'!I32=\"\",\"\",'DryBatchWeights - Existing'!I32)","v":0},{"$f":"'DryBatchWeights - Existing'!$B$6","v":"Dry Batch Weights - Existing"},{"$f":"'DryBatchWeights - Existing'!$B$30","v":"Air"},{"$f":"'DryBatchWeights - Existing'!C32","v":"Air + Paste Volume:"},{"$f":"'DryBatchWeights - Existing'!$I$8","v":"Absolute Vol. (ft3)"}]
[401,{"$f":"IF('DryBatchWeights - Existing'!F33=\"\",\"\",'DryBatchWeights - Existing'!F33)","v":""},{"$f":"'DryBatchWeights - Existing'!$B$6","v":"Dry Batch Weights - Existing"},{"$f":"'DryBatchWeights - Existing'!$B$33","v":"Misc."},{"$f":"'DryBatchWeights - Existing'!C33","v":"Fibers:"},{"$f":"'DryBatchWeights - Existing'!$F$8","v":"Producer/Source"}]
[402,{"$f":"IF('DryBatchWeights - Existing'!I33=\"\",\"\",'DryBatchWeights - Existing'!I33)","v":""},{"$f":"'DryBatchWeights - Existing'!$B$6","v":"Dry Batch Weights - Existing"},{"$f":"'DryBatchWeights - Existing'!$B$33","v":"Misc."},{"$f":"'DryBatchWeights - Existing'!C33","v":"Fibers:"},{"$f":"'DryBatchWeights - Existing'!$I$8","v":"Absolute Vol. (ft3)"}]
[403,{"$f":"IF('DryBatchWeights - Existing'!K33=\"\",\"\",'DryBatchWeights - Existing'!K33)","v":""},{"$f":"'DryBatchWeights - Existing'!$B$6","v":"Dry Batch Weights - Existing"},{"$f":"'DryBatchWeights - Existing'!$B$33","v":"Misc."},{"$f":"'DryBatchWeights - Existing'!C33","v":"Fibers:"},{"$f":"'DryBatchWeights - Existing'!$K$8","v":"SSD Weight (lbs/CY)"}]
[404,{"$f":"IF('DryBatchWeights - Existing'!F34=\"\",\"\",'DryBatchWeights - Existing'!F34)","v":""},{"$f":"'DryBatchWeights - Existing'!$B$6","v":"Dry Batch Weights - Existing"},{"$f":"'DryBatchWeights - Existing'!$B$33","v":"Misc."},{"$f":"'DryBatchWeights - Existing'!C34","v":""},{"$f":"'DryBatchWeights - Existing'!$F$8","v":"Producer/Source"}]
[405,{"$f":"IF('DryBatchWeights - Existing'!I34=\"\",\"\",'DryBatchWeights - Existing'!I34)","v":""},{"$f":"'DryBatchWeights - Existing'!$B$6","v":"Dry Batch Weights - Existing"},{"$f":"'DryBatchWeights - Existing'!$B$33","v":"Misc."},{"$f":"'DryBatchWeights - Existing'!C34","v":""},{"$f":"'DryBatchWeights - Existing'!$I$8","v":"Absolute Vol. (ft3)"}]
[406,{"$f":"IF('DryBatchWeights - Existing'!K34=\"\",\"\",'DryBatchWeights - Existing'!K34)","v":""},{"$f":"'DryBatchWeights - Existing'!$B$6","v":"Dry Batch Weights - Existing"},{"$f":"'DryBatchWeights - Existing'!$B$33","v":"Misc."},{"$f":"'DryBatchWeights - Existing'!C34","v":""},{"$f":"'DryBatchWeights - Existing'!$K$8","v":"SSD Weight (lbs/CY)"}]
[407,{"$f":"IF('DryBatchWeights - Existing'!H35=\"\",\"\",'DryBatchWeights - Existing'!H35)","v":0},{"$f":"'DryBatchWeights - Existing'!$B$6","v":"Dry Batch Weights - Existing"},{"$f":"'DryBatchWeights - Existing'!$B$35","v":"Optimized Gradation"},{"$f":"'DryBatchWeights - Existing'!$C$35","v":"Total Aggregate Volume:"},{"$f":"'DryBatchWeights - Existing'!H8","v":"% of Dosage*"}]
[408,{"$f":"IF('DryBatchWeights - Existing'!I35=\"\",\"\",'DryBatchWeights - Existing'!I35)","v":27},{"$f":"'DryBatchWeights - Existing'!$B$6","v":"Dry Batch Weights - Existing"},{"$f":"'DryBatchWeights - Existing'!$B$35","v":"Optimized Gradation"},{"$f":"'DryBatchWeights - Existing'!$C$35","v":"Total Aggregate Volume:"},{"$f":"'DryBatchWeights - Existing'!I8","v":"Absolute Vol. (ft3)"}]
[409,{"$f":"IF('DryBatchWeights - Existing'!K35=\"\",\"\",'DryBatchWeights - Existing'!K35)","v":""},{"$f":"'DryBatchWeights - Existing'!$B$6","v":"Dry Batch Weights - Existing"},{"$f":"'DryBatchWeights - Existing'!$B$35","v":"Optimized Gradation"},{"$f":"'DryBatchWeights - Existing'!$C$35","v":"Total Aggregate Volume:"},{"$f":"'DryBatchWeights - Existing'!K8","v":"SSD Weight (lbs/CY)"}]
[410,{"$f":"IF('DryBatchWeights - Existing'!E36=\"\",\"\",'DryBatchWeights - Existing'!E36)","v":""},{"$f":"'DryBatchWeights - Existing'!$B$6","v":"Dry Batch Weights - Existing"},{"$f":"'DryBatchWeights - Existing'!$B$35","v":"Optimized Gradation"},{"$f":"'DryBatchWeights - Existing'!C36","v":"Coarse Aggregate 1:"},{"$f":"'DryBatchWeights - Existing'!$E$8","v":"Type/Class/Grade"}]
[411,{"$f":"IF('DryBatchWeights - Existing'!F36=\"\",\"\",'DryBatchWeights - Existing'!F36)","v":""},{"$f":"'DryBatchWeights - Existing'!$B$6","v":"Dry Batch Weights - Existing"},{"$f":"'DryBatchWeights - Existing'!$B$35","v":"Optimized Gradation"},{"$f":"'DryBatchWeights - Existing'!$C$36","v":"Coarse Aggregate 1:"},{"$f":"'DryBatchWeights - Existing'!$F$8","v":"Producer/Source"}]
[412,{"$f":"IF('DryBatchWeights - Existing'!H36=\"\",\"\",'DryBatchWeights - Existing'!H36)","v":""},{"$f":"'DryBatchWeights - Existing'!$B$6","v":"Dry Batch Weights - Existing"},{"$f":"'DryBatchWeights - Existing'!$B$35","v":"Optimized Gradation"},{"$f":"'DryBatchWeights - Existing'!$C$36","v":"Coarse Aggregate 1:"},{"$f":"'DryBatchWeights - Existing'!$H$8","v":"% of Dosage*"}]
[413,{"$f":"IF('DryBatchWeights - Existing'!I36=\"\",\"\",'DryBatchWeights - Existing'!I36)","v":""},{"$f":"'DryBatchWeights - Existing'!$B$6","v":"Dry Batch Weights - Existing"},{"$f":"'DryBatchWeights - Existing'!$B$35","v":"Optimized Gradation"},{"$f":"'DryBatchWeights - Existing'!$C$36","v":"Coarse Aggregate 1:"},{"$f":"'DryBatchWeights - Existing'!$I$8","v":"Absolute Vol. (ft3)"}]
[414,{"$f":"IF('DryBatchWeights - Existing'!K36=\"\",\"\",'DryBatchWeights - Existing'!K36)","v":""},{"$f":"'DryBatchWeights - Existing'!$B$6","v":"Dry Batch Weights - Existing"},{"$f":"'DryBatchWeights - Existing'!$B$35","v":"Optimized Gradation"},{"$f":"'DryBatchWeights - Existing'!$C$36","v":"Coarse Aggregate 1:"},{"$f":"'DryBatchWeights - Existing'!$K$8","v":"SSD Weight (lbs/CY)"}]
[415,{"$f":"IF('DryBatchWeights - Existing'!E37=\"\",\"\",'DryBatchWeights - Existing'!E37)","v":""},{"$f":"'DryBatchWeights - Existing'!$B$6","v":"Dry Batch Weights - Existing"},{"$f":"'DryBatchWeights - Existing'!$B$35","v":"Optimized Gradation"},{"$f":"'DryBatchWeights - Existing'!C37","v":"Coarse Aggregate 2:"},{"$f":"'DryBatchWeights - Existing'!$E$8","v":"Type/Class/Grade"}]
[416,{"$f":"IF('DryBatchWeights - Existing'!F37=\"\",\"\",'DryBatchWeights - Existing'!F37)","v":""},{"$f":"'DryBatchWeights - Existing'!$B$6","v":"Dry Batch Weights - Existing"},{"$f":"'DryBatchWeights - Existing'!$B$35","v":"Optimized Gradation"},{"$f":"'DryBatchWeights - Existing'!$C$37","v":"Coarse Aggregate 2:"},{"$f":"'DryBatchWeights - Existing'!$F$8","v":"Producer/Source"}]
[417,{"$f":"IF('DryBatchWeights - Existing'!H37=\"\",\"\",'DryBatchWeights - Existing'!H37)","v":""},{"$f":"'DryBatchWeights - Existing'!$B$6","v":"Dry Batch Weights - Existing"},{"$f":"'DryBatchWeights - Existing'!$B$35","v":"Optimized Gradation"},{"$f":"'DryBatchWeights - Existing'!$C$37","v":"Coarse Aggregate 2:"},{"$f":"'DryBatchWeights - Existing'!$H$8","v":"% of Dosage*"}]
[418,{"$f":"IF('DryBatchWeights - Existing'!I37=\"\",\"\",'DryBatchWeights - Existing'!I37)","v":""},{"$f":"'DryBatchWeights - Existing'!$B$6","v":"Dry Batch Weights - Existing"},{"$f":"'DryBatchWeights - Existing'!$B$35","v":"Optimized Gradation"},{"$f":"'DryBatchWeights - Existing'!$C$37","v":"Coarse Aggregate 2:"},{"$f":"'DryBatchWeights - Existing'!$I$8","v":"Absolute Vol. (ft3)"}]
[419,{"$f":"IF('DryBatchWeights - Existing'!K37=\"\",\"\",'DryBatchWeights - Existing'!K37)","v":""},{"$f":"'DryBatchWeights - Existing'!$B$6","v":"Dry Batch Weights - Existing"},{"$f":"'DryBatchWeights - Existing'!$B$35","v":"Optimized Gradation"},{"$f":"'DryBatchWeights - Existing'!$C$37","v":"Coarse Aggregate 2:"},{"$f":"'DryBatchWeights - Existing'!$K$8","v":"SSD Weight (lbs/CY)"}]
[420,{"$f":"IF('DryBatchWeights - Existing'!E38=\"\",\"\",'DryBatchWeights - Existing'!E38)","v":""},{"$f":"'DryBatchWeights - Existing'!$B$6","v":"Dry Batch Weights - Existing"},{"$f":"'DryBatchWeights - Existing'!$B$35","v":"Optimized Gradation"},{"$f":"'DryBatchWeights - Existing'!C38","v":"Intermediate Aggregate 1:"},{"$f":"'DryBatchWeights - Existing'!$E$8","v":"Type/Class/Grade"}]
[421,{"$f":"IF('DryBatchWeights - Existing'!F38=\"\",\"\",'DryBatchWeights - Existing'!F38)","v":""},{"$f":"'DryBatchWeights - Existing'!$B$6","v":"Dry Batch Weights - Existing"},{"$f":"'DryBatchWeights - Existing'!$B$35","v":"Optimized Gradation"},{"$f":"'DryBatchWeights - Existing'!$C$38","v":"Intermediate Aggregate 1:"},{"$f":"'DryBatchWeights - Existing'!$F$8","v":"Producer/Source"}]
[422,{"$f":"IF('DryBatchWeights - Existing'!H38=\"\",\"\",'DryBatchWeights - Existing'!H38)","v":""},{"$f":"'DryBatchWeights - Existing'!$B$6","v":"Dry Batch Weights - Existing"},{"$f":"'DryBatchWeights - Existing'!$B$35","v":"Optimized Gradation"},{"$f":"'DryBatchWeights - Existing'!$C$38","v":"Intermediate Aggregate 1:"},{"$f":"'DryBatchWeights - Existing'!$H$8","v":"% of Dosage*"}]
[423,{"$f":"IF('DryBatchWeights - Existing'!I38=\"\",\"\",'DryBatchWeights - Existing'!I38)","v":""},{"$f":"'DryBatchWeights - Existing'!$B$6","v":"Dry Batch Weights - Existing"},{"$f":"'DryBatchWeights - Existing'!$B$35","v":"Optimized Gradation"},{"$f":"'DryBatchWeights - Existing'!$C$38","v":"Intermediate Aggregate 1:"},{"$f":"'DryBatchWeights - Existing'!$I$8","v":"Absolute Vol. (ft3)"}]
[424,{"$f":"IF('DryBatchWeights - Existing'!K38=\"\",\"\",'DryBatchWeights - Existing'!K38)","v":""},{"$f":"'DryBatchWeights - Existing'!$B$6","v":"Dry Batch Weights - Existing"},{"$f":"'DryBatchWeights - Existing'!$B$35","v":"Optimized Gradation"},{"$f":"'DryBatchWeights - Existing'!$C$38","v":"Intermediate Aggregate 1:"},{"$f":"'DryBatchWeights - Existing'!$K$8","v":"SSD Weight (lbs/CY)"}]
[425,{"$f":"IF('DryBatchWeights - Existing'!E39=\"\",\"\",'DryBatchWeights - Existing'!E39)","v":""},{"$f":"'DryBatchWeights - Existing'!$B$6","v":"Dry Batch Weights - Existing"},{"$f":"'DryBatchWeights - Existing'!$B$35","v":"Optimized Gradation"},{"$f":"'DryBatchWeights - Existing'!C39","v":"Intermediate Aggregate 2:"},{"$f":"'DryBatchWeights - Existing'!$E$8","v":"Type/Class/Grade"}]
[426,{"$f":"IF('DryBatchWeights - Existing'!F39=\"\",\"\",'DryBatchWeights - Existing'!F39)","v":""},{"$f":"'DryBatchWeights - Existing'!$B$6","v":"Dry Batch Weights - Existing"},{"$f":"'DryBatchWeights - Existing'!$B$35","v":"Optimized Gradation"},{"$f":"'DryBatchWeights - Existing'!$C$39","v":"Intermediate Aggregate 2:"},{"$f":"'DryBatchWeights - Existing'!$F$8","v":"Producer/Source"}]
[427,{"$f":"IF('DryBatchWeights - Existing'!H39=\"\",\"\",'DryBatchWeights - Existing'!H39)","v":""},{"$f":"'DryBatchWeights - Existing'!$B$6","v":"Dry Batch Weights - Existing"},{"$f":"'DryBatchWeights - Existing'!$B$35","v":"Optimized Gradation"},{"$f":"'DryBatchWeights - Existing'!$C$39","v":"Intermediate Aggregate 2:"},{"$f":"'DryBatchWeights - Existing'!$H$8","v":"% of Dosage*"}]
[428,{"$f":"IF('DryBatchWeights - Existing'!I39=\"\",\"\",'DryBatchWeights - Existing'!I39)","v":""},{"$f":"'DryBatchWeights - Existing'!$B$6","v":"Dry Batch Weights - Existing"},{"$f":"'DryBatchWeights - Existing'!$B$35","v":"Optimized Gradation"},{"$f":"'DryBatchWeights - Existing'!$C$39","v":"Intermediate Aggregate 2:"},{"$f":"'DryBatchWeights - Existing'!$I$8","v":"Absolute Vol. (ft3)"}]
[429,{"$f":"IF('DryBatchWeights - Existing'!K39=\"\",\"\",'DryBatchWeights - Existing'!K39)","v":""},{"$f":"'DryBatchWeights - Existing'!$B$6","v":"Dry Batch Weights - Existing"},{"$f":"'DryBatchWeights - Existing'!$B$35","v":"Optimized Gradation"},{"$f":"'DryBatchWeights - Existing'!$C$39","v":"Intermediate Aggregate 2:"},{"$f":"'DryBatchWeights - Existing'!$K$8","v":"SSD Weight (lbs/CY)"}]
[430,{"$f":"IF('DryBatchWeights - Existing'!F40=\"\",\"\",'DryBatchWeights - Existing'!F40)","v":""},{"$f":"'DryBatchWeights - Existing'!$B$6","v":"Dry Batch Weights - Existing"},{"$f":"'DryBatchWeights - Existing'!$B$35","v":"Optimized Gradation"},{"$f":"'DryBatchWeights - Existing'!$C$40","v":"Fine Aggregate 1:"},{"$f":"'DryBatchWeights - Existing'!$F$8","v":"Producer/Source"}]
[431,{"$f":"IF('DryBatchWeights - Existing'!H40=\"\",\"\",'DryBatchWeights - Existing'!H40)","v":""},{"$f":"'DryBatchWeights - Existing'!$B$6","v":"Dry Batch Weights - Existing"},{"$f":"'DryBatchWeights - Existing'!$B$35","v":"Optimized Gradation"},{"$f":"'DryBatchWeights - Existing'!$C$40","v":"Fine Aggregate 1:"},{"$f":"'DryBatchWeights - Existing'!$H$8","v":"% of Dosage*"}]
[432,{"$f":"IF('DryBatchWeights - Existing'!I40=\"\",\"\",'DryBatchWeights - Existing'!I40)","v":""},{"$f":"'DryBatchWeights - Existing'!$B$6","v":"Dry Batch Weights - Existing"},{"$f":"'DryBatchWeights - Existing'!$B$35","v":"Optimized Gradation"},{"$f":"'DryBatchWeights - Existing'!$C$40","v":"Fine Aggregate 1:"},{"$f":"'DryBatchWeights - Existing'!$I$8","v":"Absolute Vol. (ft3)"}]
[433,{"$f":"IF('DryBatchWeights - Existing'!K40=\"\",\"\",'DryBatchWeights - Existing'!K40)","v":""},{"$f":"'DryBatchWeights - Existing'!$B$6","v":"Dry Batch Weights - Existing"},{"$f":"'DryBatchWeights - Existing'!$B$35","v":"Optimized Gradation"},{"$f":"'DryBatchWeights - Existing'!$C$40","v":"Fine Aggregate 1:"},{"$f":"'DryBatchWeights - Existing'!$K$8","v":"SSD Weight (lbs/CY)"}]
[434,{"$f":"IF('DryBatchWeights - Existing'!F41=\"\",\"\",'DryBatchWeights - Existing'!F41)","v":""},{"$f":"'DryBatchWeights - Existing'!$B$6","v":"Dry Batch Weights - Existing"},{"$f":"'DryBatchWeights - Existing'!$B$35","v":"Optimized Gradation"},{"$f":"'DryBatchWeights - Existing'!$C$41","v":"Fine Aggregate 2:"},{"$f":"'DryBatchWeights - Existing'!$F$8","v":"Producer/Source"}]
[435,{"$f":"IF('DryBatchWeights - Existing'!H41=\"\",\"\",'DryBatchWeights - Existing'!H41)","v":""},{"$f":"'DryBatchWeights - Existing'!$B$6","v":"Dry Batch Weights - Existing"},{"$f":"'DryBatchWeights - Existing'!$B$35","v":"Optimized Gradation"},{"$f":"'DryBatchWeights - Existing'!$C$41","v":"Fine Aggregate 2:"},{"$f":"'DryBatchWeights - Existing'!$H$8","v":"% of Dosage*"}]
[436,{"$f":"IF('DryBatchWeights - Existing'!I41=\"\",\"\",'DryBatchWeights - Existing'!I41)","v":""},{"$f":"'DryBatchWeights - Existing'!$B$6","v":"Dry Batch Weights - Existing"},{"$f":"'DryBatchWeights - Existing'!$B$35","v":"Optimized Gradation"},{"$f":"'DryBatchWeights - Existing'!$C$41","v":"Fine Aggregate 2:"},{"$f":"'DryBatchWeights - Existing'!$I$8","v":"Absolute Vol. (ft3)"}]
[437,{"$f":"IF('DryBatchWeights - Existing'!K41=\"\",\"\",'DryBatchWeights - Existing'!K41)","v":""},{"$f":"'DryBatchWeights - Existing'!$B$6","v":"Dry Batch Weights - Existing"},{"$f":"'DryBatchWeights - Existing'!$B$35","v":"Optimized Gradation"},{"$f":"'DryBatchWeights - Existing'!$C$41","v":"Fine Aggregate 2:"},{"$f":"'DryBatchWeights - Existing'!$K$8","v":"SSD Weight (lbs/CY)"}]
[438,{"$f":"IF('DryBatchWeights - Existing'!H42=\"\",\"\",'DryBatchWeights - Existing'!H42)","v":""},{"$f":"'DryBatchWeights - Existing'!$B$6","v":"Dry Batch Weights - Existing"},{"$f":"'DryBatchWeights - Existing'!$B$42","v":"Non Optimized Gradation"},{"$f":"'DryBatchWeights - Existing'!$C$42","v":"Total Aggregate Volume:"},{"$f":"'DryBatchWeights - Existing'!H8","v":"% of Dosage*"}]
[439,{"$f":"IF('DryBatchWeights - Existing'!I42=\"\",\"\",'DryBatchWeights - Existing'!I42)","v":""},{"$f":"'DryBatchWeights - Existing'!$B$6","v":"Dry Batch Weights - Existing"},{"$f":"'DryBatchWeights - Existing'!$B$42","v":"Non Optimized Gradation"},{"$f":"'DryBatchWeights - Existing'!$C$42","v":"Total Aggregate Volume:"},{"$f":"'DryBatchWeights - Existing'!I8","v":"Absolute Vol. (ft3)"}]
[440,{"$f":"IF('DryBatchWeights - Existing'!K42=\"\",\"\",'DryBatchWeights - Existing'!K42)","v":""},{"$f":"'DryBatchWeights - Existing'!$B$6","v":"Dry Batch Weights - Existing"},{"$f":"'DryBatchWeights - Existing'!$B$42","v":"Non Optimized Gradation"},{"$f":"'DryBatchWeights - Existing'!$C$42","v":"Total Aggregate Volume:"},{"$f":"'DryBatchWeights - Existing'!K8","v":"SSD Weight (lbs/CY)"}]
[441,{"$f":"IF('DryBatchWeights - Existing'!E43=\"\",\"\",'DryBatchWeights - Existing'!E43)","v":""},{"$f":"'DryBatchWeights - Existing'!$B$6","v":"Dry Batch Weights - Existing"},{"$f":"'DryBatchWeights - Existing'!$B$42","v":"Non Optimized Gradation"},{"$f":"'DryBatchWeights - Existing'!C43","v":"Coarse Aggregate 1:"},{"$f":"'DryBatchWeights - Existing'!$E$8","v":"Type/Class/Grade"}]
[442,{"$f":"IF('DryBatchWeights - Existing'!F43=\"\",\"\",'DryBatchWeights - Existing'!F43)","v":""},{"$f":"'DryBatchWeights - Existing'!$B$6","v":"Dry Batch Weights - Existing"},{"$f":"'DryBatchWeights - Existing'!$B$42","v":"Non Optimized Gradation"},{"$f":"'DryBatchWeights - Existing'!$C$43","v":"Coarse Aggregate 1:"},{"$f":"'DryBatchWeights - Existing'!$F$8","v":"Producer/Source"}]
[443,{"$f":"IF('DryBatchWeights - Existing'!H43=\"\",\"\",'DryBatchWeights - Existing'!H43)","v":""},{"$f":"'DryBatchWeights - Existing'!$B$6","v":"Dry Batch Weights - Existing"},{"$f":"'DryBatchWeights - Existing'!$B$42","v":"Non Optimized Gradation"},{"$f":"'DryBatchWeights - Existing'!$C$43","v":"Coarse Aggregate 1:"},{"$f":"'DryBatchWeights - Existing'!$H$8","v":"% of Dosage*"}]
[444,{"$f":"IF('DryBatchWeights - Existing'!I43=\"\",\"\",'DryBatchWeights - Existing'!I43)","v":""},{"$f":"'DryBatchWeights - Existing'!$B$6","v":"Dry Batch Weights - Existing"},{"$f":"'DryBatchWeights - Existing'!$B$42","v":"Non Optimized Gradation"},{"$f":"'DryBatchWeights - Existing'!$C$43","v":"Coarse Aggregate 1:"},{"$f":"'DryBatchWeights - Existing'!$I$8","v":"Absolute Vol. (ft3)"}]
[445,{"$f":"IF('DryBatchWeights - Existing'!K43=\"\",\"\",'DryBatchWeights - Existing'!K43)","v":""},{"$f":"'DryBatchWeights - Existing'!$B$6","v":"Dry Batch Weights - Existing"},{"$f":"'DryBatchWeights - Existing'!$B$42","v":"Non Optimized Gradation"},{"$f":"'DryBatchWeights - Existing'!$C$43","v":"Coarse Aggregate 1:"},{"$f":"'DryBatchWeights - Existing'!$K$8","v":"SSD Weight (lbs/CY)"}]
[446,{"$f":"IF('DryBatchWeights - Existing'!E44=\"\",\"\",'DryBatchWeights - Existing'!E44)","v":""},{"$f":"'DryBatchWeights - Existing'!$B$6","v":"Dry Batch Weights - Existing"},{"$f":"'DryBatchWeights - Existing'!$B$42","v":"Non Optimized Gradation"},{"$f":"'DryBatchWeights - Existing'!C44","v":"Coarse Aggregate 2:"},{"$f":"'DryBatchWeights - Existing'!$E$8","v":"Type/Class/Grade"}]
[447,{"$f":"IF('DryBatchWeights - Existing'!F44=\"\",\"\",'DryBatchWeights - Existing'!F44)","v":""},{"$f":"'DryBatchWeights - Existing'!$B$6","v":"Dry Batch Weights - Existing"},{"$f":"'DryBatchWeights - Existing'!$B$42","v":"Non Optimized Gradation"},{"$f":"'DryBatchWeights - Existing'!$C$44","v":"Coarse Aggregate 2:"},{"$f":"'DryBatchWeights - Existing'!$F$8","v":"Producer/Source"}]
[448,{"$f":"IF('DryBatchWeights - Existing'!H44=\"\",\"\",'DryBatchWeights - Existing'!H44)","v":""},{"$f":"'DryBatchWeights - Existing'!$B$6","v":"Dry Batch Weights - Existing"},{"$f":"'DryBatchWeights - Existing'!$B$42","v":"Non Optimized Gradation"},{"$f":"'DryBatchWeights - Existing'!$C$44","v":"Coarse Aggregate 2:"},{"$f":"'DryBatchWeights - Existing'!$H$8","v":"% of Dosage*"}]
[449,{"$f":"IF('DryBatchWeights - Existing'!I44=\"\",\"\",'DryBatchWeights - Existing'!I44)","v":""},{"$f":"'DryBatchWeights - Existing'!$B$6","v":"Dry Batch Weights - Existing"},{"$f":"'DryBatchWeights - Existing'!$B$42","v":"Non Optimized Gradation"},{"$f":"'DryBatchWeights - Existing'!$C$44","v":"Coarse Aggregate 2:"},{"$f":"'DryBatchWeights - Existing'!$I$8","v":"Absolute Vol. (ft3)"}]
[450,{"$f":"IF('DryBatchWeights - Existing'!K44=\"\",\"\",'DryBatchWeights - Existing'!K44)","v":""},{"$f":"'DryBatchWeights - Existing'!$B$6","v":"Dry Batch Weights - Existing"},{"$f":"'DryBatchWeights - Existing'!$B$42","v":"Non Optimized Gradation"},{"$f":"'DryBatchWeights - Existing'!$C$44","v":"Coarse Aggregate 2:"},{"$f":"'DryBatchWeights - Existing'!$K$8","v":"SSD Weight (lbs/CY)"}]
[451,{"$f":"IF('DryBatchWeights - Existing'!E45=\"\",\"\",'DryBatchWeights - Existing'!E45)","v":""},{"$f":"'DryBatchWeights - Existing'!$B$6","v":"Dry Batch Weights - Existing"},{"$f":"'DryBatchWeights - Existing'!$B$42","v":"Non Optimized Gradation"},{"$f":"'DryBatchWeights - Existing'!C45","v":"Intermediate Aggregate 1:"},{"$f":"'DryBatchWeights - Existing'!$E$8","v":"Type/Class/Grade"}]
[452,{"$f":"IF('DryBatchWeights - Existing'!F45=\"\",\"\",'DryBatchWeights - Existing'!F45)","v":""},{"$f":"'DryBatchWeights - Existing'!$B$6","v":"Dry Batch Weights - Existing"},{"$f":"'DryBatchWeights - Existing'!$B$42","v":"Non Optimized Gradation"},{"$f":"'DryBatchWeights - Existing'!$C$45","v":"Intermediate Aggregate 1:"},{"$f":"'DryBatchWeights - Existing'!$F$8","v":"Producer/Source"}]
[453,{"$f":"IF('DryBatchWeights - Existing'!H45=\"\",\"\",'DryBatchWeights - Existing'!H45)","v":""},{"$f":"'DryBatchWeights - Existing'!$B$6","v":"Dry Batch Weights - Existing"},{"$f":"'DryBatchWeights - Existing'!$B$42","v":"Non Optimized Gradation"},{"$f":"'DryBatchWeights - Existing'!$C$45","v":"Intermediate Aggregate 1:"},{"$f":"'DryBatchWeights - Existing'!$H$8","v":"% of Dosage*"}]
[454,{"$f":"IF('DryBatchWeights - Existing'!I45=\"\",\"\",'DryBatchWeights - Existing'!I45)","v":""},{"$f":"'DryBatchWeights - Existing'!$B$6","v":"Dry Batch Weights - Existing"},{"$f":"'DryBatchWeights - Existing'!$B$42","v":"Non Optimized Gradation"},{"$f":"'DryBatchWeights - Existing'!$C$45","v":"Intermediate Aggregate 1:"},{"$f":"'DryBatchWeights - Existing'!$I$8","v":"Absolute Vol. (ft3)"}]
[455,{"$f":"IF('DryBatchWeights - Existing'!K45=\"\",\"\",'DryBatchWeights - Existing'!K45)","v":""},{"$f":"'DryBatchWeights - Existing'!$B$6","v":"Dry Batch Weights - Existing"},{"$f":"'DryBatchWeights - Existing'!$B$42","v":"Non Optimized Gradation"},{"$f":"'DryBatchWeights - Existing'!$C$45","v":"Intermediate Aggregate 1:"},{"$f":"'DryBatchWeights - Existing'!$K$8","v":"SSD Weight (lbs/CY)"}]
[456,{"$f":"IF('DryBatchWeights - Existing'!E46=\"\",\"\",'DryBatchWeights - Existing'!E46)","v":""},{"$f":"'DryBatchWeights - Existing'!$B$6","v":"Dry Batch Weights - Existing"},{"$f":"'DryBatchWeights - Existing'!$B$42","v":"Non Optimized Gradation"},{"$f":"'DryBatchWeights - Existing'!C46","v":"Intermediate Aggregate 2:"},{"$f":"'DryBatchWeights - Existing'!$E$8","v":"Type/Class/Grade"}]
[457,{"$f":"IF('DryBatchWeights - Existing'!F46=\"\",\"\",'DryBatchWeights - Existing'!F46)","v":""},{"$f":"'DryBatchWeights - Existing'!$B$6","v":"Dry Batch Weights - Existing"},{"$f":"'DryBatchWeights - Existing'!$B$42","v":"Non Optimized Gradation"},{"$f":"'DryBatchWeights - Existing'!$C$46","v":"Intermediate Aggregate 2:"},{"$f":"'DryBatchWeights - Existing'!$F$8","v":"Producer/Source"}]
[458,{"$f":"IF('DryBatchWeights - Existing'!H46=\"\",\"\",'DryBatchWeights - Existing'!H46)","v":""},{"$f":"'DryBatchWeights - Existing'!$B$6","v":"Dry Batch Weights - Existing"},{"$f":"'DryBatchWeights - Existing'!$B$42","v":"Non Optimized Gradation"},{"$f":"'DryBatchWeights - Existing'!$C$46","v":"Intermediate Aggregate 2:"},{"$f":"'DryBatchWeights - Existing'!$H$8","v":"% of Dosage*"}]
[459,{"$f":"IF('DryBatchWeights - Existing'!I46=\"\",\"\",'DryBatchWeights - Existing'!I46)","v":""},{"$f":"'DryBatchWeights - Existing'!$B$6","v":"Dry Batch Weights - Existing"},{"$f":"'DryBatchWeights - Existing'!$B$42","v":"Non Optimized Gradation"},{"$f":"'DryBatchWeights - Existing'!$C$46","v":"Intermediate Aggregate 2:"},{"$f":"'DryBatchWeights - Existing'!$I$8","v":"Absolute Vol. (ft3)"}]
[460,{"$f":"IF('DryBatchWeights - Existing'!K46=\"\",\"\",'DryBatchWeights - Existing'!K46)","v":""},{"$f":"'DryBatchWeights - Existing'!$B$6","v":"Dry Batch Weights - Existing"},{"$f":"'DryBatchWeights - Existing'!$B$42","v":"Non Optimized Gradation"},{"$f":"'DryBatchWeights - Existing'!$C$46","v":"Intermediate Aggregate 2:"},{"$f":"'DryBatchWeights - Existing'!$K$8","v":"SSD Weight (lbs/CY)"}]
[461,{"$f":"IF('DryBatchWeights - Existing'!F47=\"\",\"\",'DryBatchWeights - Existing'!F47)","v":""},{"$f":"'DryBatchWeights - Existing'!$B$6","v":"Dry Batch Weights - Existing"},{"$f":"'DryBatchWeights - Existing'!$B$42","v":"Non Optimized Gradation"},{"$f":"'DryBatchWeights - Existing'!$C$47","v":"Fine Aggregate 1:"},{"$f":"'DryBatchWeights - Existing'!$F$8","v":"Producer/Source"}]
[462,{"$f":"IF('DryBatchWeights - Existing'!H47=\"\",\"\",'DryBatchWeights - Existing'!H47)","v":""},{"$f":"'DryBatchWeights - Existing'!$B$6","v":"Dry Batch Weights - Existing"},{"$f":"'DryBatchWeights - Existing'!$B$42","v":"Non Optimized Gradation"},{"$f":"'DryBatchWeights - Existing'!$C$47","v":"Fine Aggregate 1:"},{"$f":"'DryBatchWeights - Existing'!$H$8","v":"% of Dosage*"}]
[463,{"$f":"IF('DryBatchWeights - Existing'!I47=\"\",\"\",'DryBatchWeights - Existing'!I47)","v":""},{"$f":"'DryBatchWeights - Existing'!$B$6","v":"Dry Batch Weights - Existing"},{"$f":"'DryBatchWeights - Existing'!$B$42","v":"Non Optimized Gradation"},{"$f":"'DryBatchWeights - Existing'!$C$47","v":"Fine Aggregate 1:"},{"$f":"'DryBatchWeights - Existing'!$I$8","v":"Absolute Vol. (ft3)"}]
[464,{"$f":"IF('DryBatchWeights - Existing'!K47=\"\",\"\",'DryBatchWeights - Existing'!K47)","v":""},{"$f":"'DryBatchWeights - Existing'!$B$6","v":"Dry Batch Weights - Existing"},{"$f":"'DryBatchWeights - Existing'!$B$42","v":"Non Optimized Gradation"},{"$f":"'DryBatchWeights - Existing'!$C$47","v":"Fine Aggregate 1:"},{"$f":"'DryBatchWeights - Existing'!$K$8","v":"SSD Weight (lbs/CY)"}]
[465,{"$f":"IF('DryBatchWeights - Existing'!F48=\"\",\"\",'DryBatchWeights - Existing'!F48)","v":""},{"$f":"'DryBatchWeights - Existing'!$B$6","v":"Dry Batch Weights - Existing"},{"$f":"'DryBatchWeights - Existing'!$B$42","v":"Non Optimized Gradation"},{"$f":"'DryBatchWeights - Existing'!$C$48","v":"Fine Aggregate 2:"},{"$f":"'DryBatchWeights - Existing'!$F$8","v":"Producer/Source"}]
[466,{"$f":"IF('DryBatchWeights - Existing'!H48=\"\",\"\",'DryBatchWeights - Existing'!H48)","v":""},{"$f":"'DryBatchWeights - Existing'!$B$6","v":"Dry Batch Weights - Existing"},{"$f":"'DryBatchWeights - Existing'!$B$42","v":"Non Optimized Gradation"},{"$f":"'DryBatchWeights - Existing'!$C$48","v":"Fine Aggregate 2:"},{"$f":"'DryBatchWeights - Existing'!$H$8","v":"% of Dosage*"}]
[467,{"$f":"IF('DryBatchWeights - Existing'!I48=\"\",\"\",'DryBatchWeights - Existing'!I48)","v":""},{"$f":"'DryBatchWeights - Existing'!$B$6","v":"Dry Batch Weights - Existing"},{"$f":"'DryBatchWeights - Existing'!$B$42","v":"Non Optimized Gradation"},{"$f":"'DryBatchWeights - Existing'!$C$48","v":"Fine Aggregate 2:"},{"$f":"'DryBatchWeights - Existing'!$I$8","v":"Absolute Vol. (ft3)"}]
[468,{"$f":"IF('DryBatchWeights - Existing'!K48=\"\",\"\",'DryBatchWeights - Existing'!K48)","v":""},{"$f":"'DryBatchWeights - Existing'!$B$6","v":"Dry Batch Weights - Existing"},{"$f":"'DryBatchWeights - Existing'!$B$42","v":"Non Optimized Gradation"},{"$f":"'DryBatchWeights - Existing'!$C$48","v":"Fine Aggregate 2:"},{"$f":"'DryBatchWeights - Existing'!$K$8","v":"SSD Weight (lbs/CY)"}]
[469,{"$f":"IF('DryBatchWeights - ACI211'!H8=\"\",\"\",'DryBatchWeights - ACI211'!H8)","v":""},{"$f":"'DryBatchWeights - ACI211'!$B$4","v":"Dry Batch Weights - ACI 211"},{"$f":"'DryBatchWeights - ACI211'!$B$6","v":"Water Adjustment"},{"$f":"'DryBatchWeights - ACI211'!E8","v":"Aggregate shape & texture"}]
[470,{"$f":"IF('DryBatchWeights - ACI211'!H9=\"\",\"\",'DryBatchWeights - ACI211'!H9)","v":""},{"$f":"'DryBatchWeights - ACI211'!$B$4","v":"Dry Batch Weights - ACI 211"},{"$f":"'DryBatchWeights - ACI211'!$B$6","v":"Water Adjustment"},{"$f":"'DryBatchWeights - ACI211'!E9","v":"Optimized aggregate gradation"}]
[471,{"$f":"IF('DryBatchWeights - ACI211'!H10=\"\",\"\",'DryBatchWeights - ACI211'!H10)","v":""},{"$f":"'DryBatchWeights - ACI211'!$B$4","v":"Dry Batch Weights - ACI 211"},{"$f":"'DryBatchWeights - ACI211'!$B$6","v":"Water Adjustment"},{"$f":"'DryBatchWeights - ACI211'!E10","v":"Air entraining admixture"}]
[472,{"$f":"IF('DryBatchWeights - ACI211'!H11=\"\",\"\",'DryBatchWeights - ACI211'!H11)","v":""},{"$f":"'DryBatchWeights - ACI211'!$B$4","v":"Dry Batch Weights - ACI 211"},{"$f":"'DryBatchWeights - ACI211'!$B$6","v":"Water Adjustment"},{"$f":"'DryBatchWeights - ACI211'!E11","v":"Normal range water reducing admixture"}]
[473,{"$f":"IF('DryBatchWeights - ACI211'!H12=\"\",\"\",'DryBatchWeights - ACI211'!H12)","v":""},{"$f":"'DryBatchWeights - ACI211'!$B$4","v":"Dry Batch Weights - ACI 211"},{"$f":"'DryBatchWeights - ACI211'!$B$6","v":"Water Adjustment"},{"$f":"'DryBatchWeights - ACI211'!E12","v":"High-range water reducer (HRWR)"}]
[474,{"$f":"IF('DryBatchWeights - ACI211'!H13=\"\",\"\",'DryBatchWeights - ACI211'!H13)","v":""},{"$f":"'DryBatchWeights - ACI211'!$B$4","v":"Dry Batch Weights - ACI 211"},{"$f":"'DryBatchWeights - ACI211'!$B$6","v":"Water Adjustment"},{"$f":"'DryBatchWeights - ACI211'!E13","v":"Mineral admixtures, fly ash to silica fume"}]
[475,{"$f":"IF('DryBatchWeights - ACI211'!H14=\"\",\"\",'DryBatchWeights - ACI211'!H14)","v":""},{"$f":"'DryBatchWeights - ACI211'!$B$4","v":"Dry Batch Weights - ACI 211"},{"$f":"'DryBatchWeights - ACI211'!$B$6","v":"Water Adjustment"},{"$f":"'DryBatchWeights - ACI211'!E14","v":"Other factors: w/c, cement fineness, temperature"}]
[476,{"$f":"IF('DryBatchWeights - ACI211'!H15=\"\",\"\",'DryBatchWeights - ACI211'!H15)","v":""},{"$f":"'DryBatchWeights - ACI211'!$B$4","v":"Dry Batch Weights - ACI 211"},{"$f":"'DryBatchWeights - ACI211'!$B$6","v":"Water Adjustment"},{"$f":"'DryBatchWeights - ACI211'!G15","v":"Cumulative adjustment percentage, %:"}]
[477,{"$f":"IF('DryBatchWeights - ACI211'!H16=\"\",\"\",'DryBatchWeights - ACI211'!H16)","v":1},{"$f":"'DryBatchWeights - ACI211'!$B$4","v":"Dry Batch Weights - ACI 211"},{"$f":"'DryBatchWeights - ACI211'!$B$6","v":"Water Adjustment"},{"$f":"'DryBatchWeights - ACI211'!G16","v":"Water Adjustment Factor:"}]
[478,{"$f":"IF('DryBatchWeights - ACI211'!H19=\"\",\"\",'DryBatchWeights - ACI211'!H19)","v":0.45909999999999995},{"$f":"'DryBatchWeights - ACI211'!$B$4","v":"Dry Batch Weights - ACI 211"},{"$f":"'DryBatchWeights - ACI211'!$B$18","v":"Coarse Aggregate Factor"},{"$f":"'DryBatchWeights - ACI211'!G19","v":"Calculated Coarse Aggregate Factor, CAF (based on inputted material properties):"}]
[479,{"$f":"IF('DryBatchWeights - ACI211'!H20=\"\",\"\",'DryBatchWeights - ACI211'!H20)","v":""},{"$f":"'DryBatchWeights - ACI211'!$B$4","v":"Dry Batch Weights - ACI 211"},{"$f":"'DryBatchWeights - ACI211'!$B$18","v":"Coarse Aggregate Factor"},{"$f":"'DryBatchWeights - ACI211'!G20","v":"Specified Coarse Aggregate Factor, CAF:"}]
[480,{"$f":"IF('DryBatchWeights - ACI211'!F29=\"\",\"\",'DryBatchWeights - ACI211'!F29)","v":""},{"$f":"'DryBatchWeights - ACI211'!$B$4","v":"Dry Batch Weights - ACI 211"},{"$f":"'DryBatchWeights - ACI211'!$B$27","v":"ACI 211 Mix Design"},{"$f":"'DryBatchWeights - ACI211'!$B$29","v":"Paste"},{"$f":"'DryBatchWeights - ACI211'!$C$29","v":"Basic Water Demand:"},{"$f":"'DryBatchWeights - ACI211'!F28","v":"Producer/Source"}]
[481,{"$f":"IF('DryBatchWeights - ACI211'!I29=\"\",\"\",'DryBatchWeights - ACI211'!I29)","v":0},{"$f":"'DryBatchWeights - ACI211'!$B$4","v":"Dry Batch Weights - ACI 211"},{"$f":"'DryBatchWeights - ACI211'!$B$27","v":"ACI 211 Mix Design"},{"$f":"'DryBatchWeights - ACI211'!$B$29","v":"Paste"},{"$f":"'DryBatchWeights - ACI211'!$C$29","v":"Basic Water Demand:"},{"$f":"'DryBatchWeights - ACI211'!I28","v":"Absolute Vol. (ft3)"}]
[482,{"$f":"IF('DryBatchWeights - ACI211'!K29=\"\",\"\",'DryBatchWeights - ACI211'!K29)","v":0},{"$f":"'DryBatchWeights - ACI211'!$B$4","v":"Dry Batch Weights - ACI 211"},{"$f":"'DryBatchWeights - ACI211'!$B$27","v":"ACI 211 Mix Design"},{"$f":"'DryBatchWeights - ACI211'!$B$29","v":"Paste"},{"$f":"'DryBatchWeights - ACI211'!$C$29","v":"Basic Water Demand:"},{"$f":"'DryBatchWeights - ACI211'!K28","v":"SSD Weight (lbs/CY)"}]
[483,{"$f":"IF('DryBatchWeights - ACI211'!I30=\"\",\"\",'DryBatchWeights - ACI211'!I30)","v":0},{"$f":"'DryBatchWeights - ACI211'!$B$4","v":"Dry Batch Weights - ACI 211"},{"$f":"'DryBatchWeights - ACI211'!$B$27","v":"ACI 211 Mix Design"},{"$f":"'DryBatchWeights - ACI211'!$B$29","v":"Paste"},{"$f":"'DryBatchWeights - ACI211'!$C$30","v":"Total Cementitious:"},{"$f":"'DryBatchWeights - ACI211'!I28","v":"Absolute Vol. (ft3)"}]
[484,{"$f":"IF('DryBatchWeights - ACI211'!K30=\"\",\"\",'DryBatchWeights - ACI211'!K30)","v":0},{"$f":"'DryBatchWeights - ACI211'!$B$4","v":"Dry Batch Weights - ACI 211"},{"$f":"'DryBatchWeights - ACI211'!$B$27","v":"ACI 211 Mix Design"},{"$f":"'DryBatchWeights - ACI211'!$B$29","v":"Paste"},{"$f":"'DryBatchWeights - ACI211'!$C$30","v":"Total Cementitious:"},{"$f":"'DryBatchWeights - ACI211'!K28","v":"SSD Weight (lbs/CY)"}]
[485,{"$f":"IF('DryBatchWeights - ACI211'!E31=\"\",\"\",'DryBatchWeights - ACI211'!E31)","v":""},{"$f":"'DryBatchWeights - ACI211'!$B$4","v":"Dry Batch Weights - ACI 211"},{"$f":"'DryBatchWeights - ACI211'!$B$27","v":"ACI 211 Mix Design"},{"$f":"'DryBatchWeights - ACI211'!$B$29","v":"Paste"},{"$f":"'DryBatchWeights - ACI211'!$C$31","v":"Hydraulic cement:"},{"$f":"'DryBatchWeights - ACI211'!$E$28","v":"Type/Class/Grade"}]
[486,{"$f":"IF('DryBatchWeights - ACI211'!F31=\"\",\"\",'DryBatchWeights - ACI211'!F31)","v":""},{"$f":"'DryBatchWeights - ACI211'!$B$4","v":"Dry Batch Weights - ACI 211"},{"$f":"'DryBatchWeights - ACI211'!$B$27","v":"ACI 211 Mix Design"},{"$f":"'DryBatchWeights - ACI211'!$B$29","v":"Paste"},{"$f":"'DryBatchWeights - ACI211'!$C$31","v":"Hydraulic cement:"},{"$f":"'DryBatchWeights - ACI211'!$F$28","v":"Producer/Source"}]
[487,{"$f":"IF('DryBatchWeights - ACI211'!H31=\"\",\"\",'DryBatchWeights - ACI211'!H31)","v":""},{"$f":"'DryBatchWeights - ACI211'!$B$4","v":"Dry Batch Weights - ACI 211"},{"$f":"'DryBatchWeights - ACI211'!$B$27","v":"ACI 211 Mix Design"},{"$f":"'DryBatchWeights - ACI211'!$B$29","v":"Paste"},{"$f":"'DryBatchWeights - ACI211'!$C$31","v":"Hydraulic cement:"},{"$f":"'DryBatchWeights - ACI211'!$H$28","v":"% or\nDosage"}]
[488,{"$f":"IF('DryBatchWeights - ACI211'!I31=\"\",\"\",'DryBatchWeights - ACI211'!I31)","v":""},{"$f":"'DryBatchWeights - ACI211'!$B$4","v":"Dry Batch Weights - ACI 211"},{"$f":"'DryBatchWeights - ACI211'!$B$27","v":"ACI 211 Mix Design"},{"$f":"'DryBatchWeights - ACI211'!$B$29","v":"Paste"},{"$f":"'DryBatchWeights - ACI211'!$C$31","v":"Hydraulic cement:"},{"$f":"'DryBatchWeights - ACI211'!$I$28","v":"Absolute Vol. (ft3)"}]
[489,{"$f":"IF('DryBatchWeights - ACI211'!K31=\"\",\"\",'DryBatchWeights - ACI211'!K31)","v":""},{"$f":"'DryBatchWeights - ACI211'!$B$4","v":"Dry Batch Weights - ACI 211"},{"$f":"'DryBatchWeights - ACI211'!$B$27","v":"ACI 211 Mix Design"},{"$f":"'DryBatchWeights - ACI211'!$B$29","v":"Paste"},{"$f":"'DryBatchWeights - ACI211'!$C$31","v":"Hydraulic cement:"},{"$f":"'DryBatchWeights - ACI211'!$K$28","v":"SSD Weight (lbs/CY)"}]
[490,{"$f":"IF('DryBatchWeights - ACI211'!E32=\"\",\"\",'DryBatchWeights - ACI211'!E32)","v":""},{"$f":"'DryBatchWeights - ACI211'!$B$4","v":"Dry Batch Weights - ACI 211"},{"$f":"'DryBatchWeights - ACI211'!$B$27","v":"ACI 211 Mix Design"},{"$f":"'DryBatchWeights - ACI211'!$B$29","v":"Paste"},{"$f":"'DryBatchWeights - ACI211'!$C$32","v":""},{"$f":"'DryBatchWeights - ACI211'!$E$28","v":"Type/Class/Grade"}]
[491,{"$f":"IF('DryBatchWeights - ACI211'!F32=\"\",\"\",'DryBatchWeights - ACI211'!F32)","v":""},{"$f":"'DryBatchWeights - ACI211'!$B$4","v":"Dry Batch Weights - ACI 211"},{"$f":"'DryBatchWeights - ACI211'!$B$27","v":"ACI 211 Mix Design"},{"$f":"'DryBatchWeights - ACI211'!$B$29","v":"Paste"},{"$f":"'DryBatchWeights - ACI211'!$C$32","v":""},{"$f":"'DryBatchWeights - ACI211'!$F$28","v":"Producer/Source"}]
[492,{"$f":"IF('DryBatchWeights - ACI211'!H32=\"\",\"\",'DryBatchWeights - ACI211'!H32)","v":""},{"$f":"'DryBatchWeights - ACI211'!$B$4","v":"Dry Batch Weights - ACI 211"},{"$f":"'DryBatchWeights - ACI211'!$B$27","v":"ACI 211 Mix Design"},{"$f":"'DryBatchWeights - ACI211'!$B$29","v":"Paste"},{"$f":"'DryBatchWeights - ACI211'!$C$32","v":""},{"$f":"'DryBatchWeights - ACI211'!$H$28","v":"% or\nDosage"}]
[493,{"$f":"IF('DryBatchWeights - ACI211'!I32=\"\",\"\",'DryBatchWeights - ACI211'!I32)","v":""},{"$f":"'DryBatchWeights - ACI211'!$B$4","v":"Dry Batch Weights - ACI 211"},{"$f":"'DryBatchWeights - ACI211'!$B$27","v":"ACI 211 Mix Design"},{"$f":"'DryBatchWeights - ACI211'!$B$29","v":"Paste"},{"$f":"'DryBatchWeights - ACI211'!$C$32","v":""},{"$f":"'DryBatchWeights - ACI211'!$I$28","v":"Absolute Vol. (ft3)"}]
[494,{"$f":"IF('DryBatchWeights - ACI211'!K32=\"\",\"\",'DryBatchWeights - ACI211'!K32)","v":""},{"$f":"'DryBatchWeights - ACI211'!$B$4","v":"Dry Batch Weights - ACI 211"},{"$f":"'DryBatchWeights - ACI211'!$B$27","v":"ACI 211 Mix Design"},{"$f":"'DryBatchWeights - ACI211'!$B$29","v":"Paste"},{"$f":"'DryBatchWeights - ACI211'!$C$32","v":""},{"$f":"'DryBatchWeights - ACI211'!$K$28","v":"SSD Weight (lbs/CY)"}]
[495,{"$f":"IF('DryBatchWeights - ACI211'!E33=\"\",\"\",'DryBatchWeights - ACI211'!E33)","v":""},{"$f":"'DryBatchWeights - ACI211'!$B$4","v":"Dry Batch Weights - ACI 211"},{"$f":"'DryBatchWeights - ACI211'!$B$27","v":"ACI 211 Mix Design"},{"$f":"'DryBatchWeights - ACI211'!$B$29","v":"Paste"},{"$f":"'DryBatchWeights - ACI211'!$C$33","v":""},{"$f":"'DryBatchWeights - ACI211'!$E$28","v":"Type/Class/Grade"}]
[496,{"$f":"IF('DryBatchWeights - ACI211'!F33=\"\",\"\",'DryBatchWeights - ACI211'!F33)","v":""},{"$f":"'DryBatchWeights - ACI211'!$B$4","v":"Dry Batch Weights - ACI 211"},{"$f":"'DryBatchWeights - ACI211'!$B$27","v":"ACI 211 Mix Design"},{"$f":"'DryBatchWeights - ACI211'!$B$29","v":"Paste"},{"$f":"'DryBatchWeights - ACI211'!$C$33","v":""},{"$f":"'DryBatchWeights - ACI211'!$F$28","v":"Producer/Source"}]
[497,{"$f":"IF('DryBatchWeights - ACI211'!H33=\"\",\"\",'DryBatchWeights - ACI211'!H33)","v":""},{"$f":"'DryBatchWeights - ACI211'!$B$4","v":"Dry Batch Weights - ACI 211"},{"$f":"'DryBatchWeights - ACI211'!$B$27","v":"ACI 211 Mix Design"},{"$f":"'DryBatchWeights - ACI211'!$B$29","v":"Paste"},{"$f":"'DryBatchWeights - ACI211'!$C$33","v":""},{"$f":"'DryBatchWeights - ACI211'!$H$28","v":"% or\nDosage"}]
[498,{"$f":"IF('DryBatchWeights - ACI211'!I33=\"\",\"\",'DryBatchWeights - ACI211'!I33)","v":""},{"$f":"'DryBatchWeights - ACI211'!$B$4","v":"Dry Batch Weights - ACI 211"},{"$f":"'DryBatchWeights - ACI211'!$B$27","v":"ACI 211 Mix Design"},{"$f":"'DryBatchWeights - ACI211'!$B$29","v":"Paste"},{"$f":"'DryBatchWeights - ACI211'!$C$33","v":""},{"$f":"'DryBatchWeights - ACI211'!$I$28","v":"Absolute Vol. (ft3)"}]
[499,{"$f":"IF('DryBatchWeights - ACI211'!K33=\"\",\"\",'DryBatchWeights - ACI211'!K33)","v":""},{"$f":"'DryBatchWeights - ACI211'!$B$4","v":"Dry Batch Weights - ACI 211"},{"$f":"'DryBatchWeights - ACI211'!$B$27","v":"ACI 211 Mix Design"},{"$f":"'DryBatchWeights - ACI211'!$B$29","v":"Paste"},{"$f":"'DryBatchWeights - ACI211'!$C$33","v":""},{"$f":"'DryBatchWeights - ACI211'!$K$28","v":"SSD Weight (lbs/CY)"}]
[500,{"$f":"IF('DryBatchWeights - ACI211'!E34=\"\",\"\",'DryBatchWeights - ACI211'!E34)","v":""},{"$f":"'DryBatchWeights - ACI211'!$B$4","v":"Dry Batch Weights - ACI 211"},{"$f":"'DryBatchWeights - ACI211'!$B$27","v":"ACI 211 Mix Design"},{"$f":"'DryBatchWeights - ACI211'!$B$29","v":"Paste"},{"$f":"'DryBatchWeights - ACI211'!$C$34","v":""},{"$f":"'DryBatchWeights - ACI211'!$E$28","v":"Type/Class/Grade"}]
[501,{"$f":"IF('DryBatchWeights - ACI211'!F34=\"\",\"\",'DryBatchWeights - ACI211'!F34)","v":""},{"$f":"'DryBatchWeights - ACI211'!$B$4","v":"Dry Batch Weights - ACI 211"},{"$f":"'DryBatchWeights - ACI211'!$B$27","v":"ACI 211 Mix Design"},{"$f":"'DryBatchWeights - ACI211'!$B$29","v":"Paste"},{"$f":"'DryBatchWeights - ACI211'!$C$34","v":""},{"$f":"'DryBatchWeights - ACI211'!$F$28","v":"Producer/Source"}]
[502,{"$f":"IF('DryBatchWeights - ACI211'!H34=\"\",\"\",'DryBatchWeights - ACI211'!H34)","v":""},{"$f":"'DryBatchWeights - ACI211'!$B$4","v":"Dry Batch Weights - ACI 211"},{"$f":"'DryBatchWeights - ACI211'!$B$27","v":"ACI 211 Mix Design"},{"$f":"'DryBatchWeights - ACI211'!$B$29","v":"Paste"},{"$f":"'DryBatchWeights - ACI211'!$C$34","v":""},{"$f":"'DryBatchWeights - ACI211'!$H$28","v":"% or\nDosage"}]
[503,{"$f":"IF('DryBatchWeights - ACI211'!I34=\"\",\"\",'DryBatchWeights - ACI211'!I34)","v":""},{"$f":"'DryBatchWeights - ACI211'!$B$4","v":"Dry Batch Weights - ACI 211"},{"$f":"'DryBatchWeights - ACI211'!$B$27","v":"ACI 211 Mix Design"},{"$f":"'DryBatchWeights - ACI211'!$B$29","v":"Paste"},{"$f":"'DryBatchWeights - ACI211'!$C$34","v":""},{"$f":"'DryBatchWeights - ACI211'!$I$28","v":"Absolute Vol. (ft3)"}]
[504,{"$f":"IF('DryBatchWeights - ACI211'!K34=\"\",\"\",'DryBatchWeights - ACI211'!K34)","v":""},{"$f":"'DryBatchWeights - ACI211'!$B$4","v":"Dry Batch Weights - ACI 211"},{"$f":"'DryBatchWeights - ACI211'!$B$27","v":"ACI 211 Mix Design"},{"$f":"'DryBatchWeights - ACI211'!$B$29","v":"Paste"},{"$f":"'DryBatchWeights - ACI211'!$C$34","v":""},{"$f":"'DryBatchWeights - ACI211'!$K$28","v":"SSD Weight (lbs/CY)"}]
[505,{"$f":"IF('DryBatchWeights - ACI211'!E35=\"\",\"\",'DryBatchWeights - ACI211'!E35)","v":""},{"$f":"'DryBatchWeights - ACI211'!$B$4","v":"Dry Batch Weights - ACI 211"},{"$f":"'DryBatchWeights - ACI211'!$B$27","v":"ACI 211 Mix Design"},{"$f":"'DryBatchWeights - ACI211'!$B$29","v":"Paste"},{"$f":"'DryBatchWeights - ACI211'!$C$35","v":""},{"$f":"'DryBatchWeights - ACI211'!$E$28","v":"Type/Class/Grade"}]
[506,{"$f":"IF('DryBatchWeights - ACI211'!F35=\"\",\"\",'DryBatchWeights - ACI211'!F35)","v":""},{"$f":"'DryBatchWeights - ACI211'!$B$4","v":"Dry Batch Weights - ACI 211"},{"$f":"'DryBatchWeights - ACI211'!$B$27","v":"ACI 211 Mix Design"},{"$f":"'DryBatchWeights - ACI211'!$B$29","v":"Paste"},{"$f":"'DryBatchWeights - ACI211'!$C$35","v":""},{"$f":"'DryBatchWeights - ACI211'!$F$28","v":"Producer/Source"}]
[507,{"$f":"IF('DryBatchWeights - ACI211'!H35=\"\",\"\",'DryBatchWeights - ACI211'!H35)","v":""},{"$f":"'DryBatchWeights - ACI211'!$B$4","v":"Dry Batch Weights - ACI 211"},{"$f":"'DryBatchWeights - ACI211'!$B$27","v":"ACI 211 Mix Design"},{"$f":"'DryBatchWeights - ACI211'!$B$29","v":"Paste"},{"$f":"'DryBatchWeights - ACI211'!$C$35","v":""},{"$f":"'DryBatchWeights - ACI211'!$H$28","v":"% or\nDosage"}]
[508,{"$f":"IF('DryBatchWeights - ACI211'!I35=\"\",\"\",'DryBatchWeights - ACI211'!I35)","v":""},{"$f":"'DryBatchWeights - ACI211'!$B$4","v":"Dry Batch Weights - ACI 211"},{"$f":"'DryBatchWeights - ACI211'!$B$27","v":"ACI 211 Mix Design"},{"$f":"'DryBatchWeights - ACI211'!$B$29","v":"Paste"},{"$f":"'DryBatchWeights - ACI211'!$C$35","v":""},{"$f":"'DryBatchWeights - ACI211'!$I$28","v":"Absolute Vol. (ft3)"}]
[509,{"$f":"IF('DryBatchWeights - ACI211'!K35=\"\",\"\",'DryBatchWeights - ACI211'!K35)","v":""},{"$f":"'DryBatchWeights - ACI211'!$B$4","v":"Dry Batch Weights - ACI 211"},{"$f":"'DryBatchWeights - ACI211'!$B$27","v":"ACI 211 Mix Design"},{"$f":"'DryBatchWeights - ACI211'!$B$29","v":"Paste"},{"$f":"'DryBatchWeights - ACI211'!$C$35","v":""},{"$f":"'DryBatchWeights - ACI211'!$K$28","v":"SSD Weight (lbs/CY)"}]
[510,{"$f":"IF('DryBatchWeights - ACI211'!E36=\"\",\"\",'DryBatchWeights - ACI211'!E36)","v":""},{"$f":"'DryBatchWeights - ACI211'!$B$4","v":"Dry Batch Weights - ACI 211"},{"$f":"'DryBatchWeights - ACI211'!$B$27","v":"ACI 211 Mix Design"},{"$f":"'DryBatchWeights - ACI211'!$B$29","v":"Paste"},{"$f":"'DryBatchWeights - ACI211'!$C$36","v":""},{"$f":"'DryBatchWeights - ACI211'!$E$28","v":"Type/Class/Grade"}]
[511,{"$f":"IF('DryBatchWeights - ACI211'!F36=\"\",\"\",'DryBatchWeights - ACI211'!F36)","v":""},{"$f":"'DryBatchWeights - ACI211'!$B$4","v":"Dry Batch Weights - ACI 211"},{"$f":"'DryBatchWeights - ACI211'!$B$27","v":"ACI 211 Mix Design"},{"$f":"'DryBatchWeights - ACI211'!$B$29","v":"Paste"},{"$f":"'DryBatchWeights - ACI211'!$C$36","v":""},{"$f":"'DryBatchWeights - ACI211'!$F$28","v":"Producer/Source"}]
[512,{"$f":"IF('DryBatchWeights - ACI211'!H36=\"\",\"\",'DryBatchWeights - ACI211'!H36)","v":""},{"$f":"'DryBatchWeights - ACI211'!$B$4","v":"Dry Batch Weights - ACI 211"},{"$f":"'DryBatchWeights - ACI211'!$B$27","v":"ACI 211 Mix Design"},{"$f":"'DryBatchWeights - ACI211'!$B$29","v":"Paste"},{"$f":"'DryBatchWeights - ACI211'!$C$36","v":""},{"$f":"'DryBatchWeights - ACI211'!$H$28","v":"% or\nDosage"}]
[513,{"$f":"IF('DryBatchWeights - ACI211'!I36=\"\",\"\",'DryBatchWeights - ACI211'!I36)","v":""},{"$f":"'DryBatchWeights - ACI211'!$B$4","v":"Dry Batch Weights - ACI 211"},{"$f":"'DryBatchWeights - ACI211'!$B$27","v":"ACI 211 Mix Design"},{"$f":"'DryBatchWeights - ACI211'!$B$29","v":"Paste"},{"$f":"'DryBatchWeights - ACI211'!$C$36","v":""},{"$f":"'DryBatchWeights - ACI211'!$I$28","v":"Absolute Vol. (ft3)"}]
[514,{"$f":"IF('DryBatchWeights - ACI211'!K36=\"\",\"\",'DryBatchWeights - ACI211'!K36)","v":""},{"$f":"'DryBatchWeights - ACI211'!$B$4","v":"Dry Batch Weights - ACI 211"},{"$f":"'DryBatchWeights - ACI211'!$B$27","v":"ACI 211 Mix Design"},{"$f":"'DryBatchWeights - ACI211'!$B$29","v":"Paste"},{"$f":"'DryBatchWeights - ACI211'!$C$36","v":""},{"$f":"'DryBatchWeights - ACI211'!$K$28","v":"SSD Weight (lbs/CY)"}]
[515,{"$f":"IF('DryBatchWeights - ACI211'!E37=\"\",\"\",'DryBatchWeights - ACI211'!E37)","v":""},{"$f":"'DryBatchWeights - ACI211'!$B$4","v":"Dry Batch Weights - ACI 211"},{"$f":"'DryBatchWeights - ACI211'!$B$27","v":"ACI 211 Mix Design"},{"$f":"'DryBatchWeights - ACI211'!$B$29","v":"Paste"},{"$f":"'DryBatchWeights - ACI211'!$C$37","v":""},{"$f":"'DryBatchWeights - ACI211'!$E$28","v":"Type/Class/Grade"}]
[516,{"$f":"IF('DryBatchWeights - ACI211'!F37=\"\",\"\",'DryBatchWeights - ACI211'!F37)","v":""},{"$f":"'DryBatchWeights - ACI211'!$B$4","v":"Dry Batch Weights - ACI 211"},{"$f":"'DryBatchWeights - ACI211'!$B$27","v":"ACI 211 Mix Design"},{"$f":"'DryBatchWeights - ACI211'!$B$29","v":"Paste"},{"$f":"'DryBatchWeights - ACI211'!$C$37","v":""},{"$f":"'DryBatchWeights - ACI211'!$F$28","v":"Producer/Source"}]
[517,{"$f":"IF('DryBatchWeights - ACI211'!H37=\"\",\"\",'DryBatchWeights - ACI211'!H37)","v":""},{"$f":"'DryBatchWeights - ACI211'!$B$4","v":"Dry Batch Weights - ACI 211"},{"$f":"'DryBatchWeights - ACI211'!$B$27","v":"ACI 211 Mix Design"},{"$f":"'DryBatchWeights - ACI211'!$B$29","v":"Paste"},{"$f":"'DryBatchWeights - ACI211'!$C$37","v":""},{"$f":"'DryBatchWeights - ACI211'!$H$28","v":"% or\nDosage"}]
[518,{"$f":"IF('DryBatchWeights - ACI211'!I37=\"\",\"\",'DryBatchWeights - ACI211'!I37)","v":""},{"$f":"'DryBatchWeights - ACI211'!$B$4","v":"Dry Batch Weights - ACI 211"},{"$f":"'DryBatchWeights - ACI211'!$B$27","v":"ACI 211 Mix Design"},{"$f":"'DryBatchWeights - ACI211'!$B$29","v":"Paste"},{"$f":"'DryBatchWeights - ACI211'!$C$37","v":""},{"$f":"'DryBatchWeights - ACI211'!$I$28","v":"Absolute Vol. (ft3)"}]
[519,{"$f":"IF('DryBatchWeights - ACI211'!K37=\"\",\"\",'DryBatchWeights - ACI211'!K37)","v":""},{"$f":"'DryBatchWeights - ACI211'!$B$4","v":"Dry Batch Weights - ACI 211"},{"$f":"'DryBatchWeights - ACI211'!$B$27","v":"ACI 211 Mix Design"},{"$f":"'DryBatchWeights - ACI211'!$B$29","v":"Paste"},{"$f":"'DryBatchWeights - ACI211'!$C$37","v":""},{"$f":"'DryBatchWeights - ACI211'!$K$28","v":"SSD Weight (lbs/CY)"}]
[520,{"$f":"IF('DryBatchWeights - ACI211'!E38=\"\",\"\",'DryBatchWeights - ACI211'!E38)","v":""},{"$f":"'DryBatchWeights - ACI211'!$B$4","v":"Dry Batch Weights - ACI 211"},{"$f":"'DryBatchWeights - ACI211'!$B$27","v":"ACI 211 Mix Design"},{"$f":"'DryBatchWeights - ACI211'!$B$29","v":"Paste"},{"$f":"'DryBatchWeights - ACI211'!$C$38","v":""},{"$f":"'DryBatchWeights - ACI211'!$E$28","v":"Type/Class/Grade"}]
[521,{"$f":"IF('DryBatchWeights - ACI211'!F38=\"\",\"\",'DryBatchWeights - ACI211'!F38)","v":""},{"$f":"'DryBatchWeights - ACI211'!$B$4","v":"Dry Batch Weights - ACI 211"},{"$f":"'DryBatchWeights - ACI211'!$B$27","v":"ACI 211 Mix Design"},{"$f":"'DryBatchWeights - ACI211'!$B$29","v":"Paste"},{"$f":"'DryBatchWeights - ACI211'!$C$38","v":""},{"$f":"'DryBatchWeights - ACI211'!$F$28","v":"Producer/Source"}]
[522,{"$f":"IF('DryBatchWeights - ACI211'!H38=\"\",\"\",'DryBatchWeights - ACI211'!H38)","v":""},{"$f":"'DryBatchWeights - ACI211'!$B$4","v":"Dry Batch Weights - ACI 211"},{"$f":"'DryBatchWeights - ACI211'!$B$27","v":"ACI 211 Mix Design"},{"$f":"'DryBatchWeights - ACI211'!$B$29","v":"Paste"},{"$f":"'DryBatchWeights - ACI211'!$C$38","v":""},{"$f":"'DryBatchWeights - ACI211'!$H$28","v":"% or\nDosage"}]
[523,{"$f":"IF('DryBatchWeights - ACI211'!I38=\"\",\"\",'DryBatchWeights - ACI211'!I38)","v":""},{"$f":"'DryBatchWeights - ACI211'!$B$4","v":"Dry Batch Weights - ACI 211"},{"$f":"'DryBatchWeights - ACI211'!$B$27","v":"ACI 211 Mix Design"},{"$f":"'DryBatchWeights - ACI211'!$B$29","v":"Paste"},{"$f":"'DryBatchWeights - ACI211'!$C$38","v":""},{"$f":"'DryBatchWeights - ACI211'!$I$28","v":"Absolute Vol. (ft3)"}]
[524,{"$f":"IF('DryBatchWeights - ACI211'!K38=\"\",\"\",'DryBatchWeights - ACI211'!K38)","v":""},{"$f":"'DryBatchWeights - ACI211'!$B$4","v":"Dry Batch Weights - ACI 211"},{"$f":"'DryBatchWeights - ACI211'!$B$27","v":"ACI 211 Mix Design"},{"$f":"'DryBatchWeights - ACI211'!$B$29","v":"Paste"},{"$f":"'DryBatchWeights - ACI211'!$C$38","v":""},{"$f":"'DryBatchWeights - ACI211'!$K$28","v":"SSD Weight (lbs/CY)"}]
[525,{"$f":"IF('DryBatchWeights - ACI211'!E39=\"\",\"\",'DryBatchWeights - ACI211'!E39)","v":""},{"$f":"'DryBatchWeights - ACI211'!$B$4","v":"Dry Batch Weights - ACI 211"},{"$f":"'DryBatchWeights - ACI211'!$B$27","v":"ACI 211 Mix Design"},{"$f":"'DryBatchWeights - ACI211'!$B$29","v":"Paste"},{"$f":"'DryBatchWeights - ACI211'!$C$39","v":""},{"$f":"'DryBatchWeights - ACI211'!$E$28","v":"Type/Class/Grade"}]
[526,{"$f":"IF('DryBatchWeights - ACI211'!F39=\"\",\"\",'DryBatchWeights - ACI211'!F39)","v":""},{"$f":"'DryBatchWeights - ACI211'!$B$4","v":"Dry Batch Weights - ACI 211"},{"$f":"'DryBatchWeights - ACI211'!$B$27","v":"ACI 211 Mix Design"},{"$f":"'DryBatchWeights - ACI211'!$B$29","v":"Paste"},{"$f":"'DryBatchWeights - ACI211'!$C$39","v":""},{"$f":"'DryBatchWeights - ACI211'!$F$28","v":"Producer/Source"}]
[527,{"$f":"IF('DryBatchWeights - ACI211'!H39=\"\",\"\",'DryBatchWeights - ACI211'!H39)","v":""},{"$f":"'DryBatchWeights - ACI211'!$B$4","v":"Dry Batch Weights - ACI 211"},{"$f":"'DryBatchWeights - ACI211'!$B$27","v":"ACI 211 Mix Design"},{"$f":"'DryBatchWeights - ACI211'!$B$29","v":"Paste"},{"$f":"'DryBatchWeights - ACI211'!$C$39","v":""},{"$f":"'DryBatchWeights - ACI211'!$H$28","v":"% or\nDosage"}]
[528,{"$f":"IF('DryBatchWeights - ACI211'!I39=\"\",\"\",'DryBatchWeights - ACI211'!I39)","v":""},{"$f":"'DryBatchWeights - ACI211'!$B$4","v":"Dry Batch Weights - ACI 211"},{"$f":"'DryBatchWeights - ACI211'!$B$27","v":"ACI 211 Mix Design"},{"$f":"'DryBatchWeights - ACI211'!$B$29","v":"Paste"},{"$f":"'DryBatchWeights - ACI211'!$C$39","v":""},{"$f":"'DryBatchWeights - ACI211'!$I$28","v":"Absolute Vol. (ft3)"}]
[529,{"$f":"IF('DryBatchWeights - ACI211'!K39=\"\",\"\",'DryBatchWeights - ACI211'!K39)","v":""},{"$f":"'DryBatchWeights - ACI211'!$B$4","v":"Dry Batch Weights - ACI 211"},{"$f":"'DryBatchWeights - ACI211'!$B$27","v":"ACI 211 Mix Design"},{"$f":"'DryBatchWeights - ACI211'!$B$29","v":"Paste"},{"$f":"'DryBatchWeights - ACI211'!$C$39","v":""},{"$f":"'DryBatchWeights - ACI211'!$K$28","v":"SSD Weight (lbs/CY)"}]
[530,{"$f":"IF('DryBatchWeights - ACI211'!E40=\"\",\"\",'DryBatchWeights - ACI211'!E40)","v":""},{"$f":"'DryBatchWeights - ACI211'!$B$4","v":"Dry Batch Weights - ACI 211"},{"$f":"'DryBatchWeights - ACI211'!$B$27","v":"ACI 211 Mix Design"},{"$f":"'DryBatchWeights - ACI211'!$B$29","v":"Paste"},{"$f":"'DryBatchWeights - ACI211'!$C$40","v":""},{"$f":"'DryBatchWeights - ACI211'!$E$28","v":"Type/Class/Grade"}]
[531,{"$f":"IF('DryBatchWeights - ACI211'!F40=\"\",\"\",'DryBatchWeights - ACI211'!F40)","v":""},{"$f":"'DryBatchWeights - ACI211'!$B$4","v":"Dry Batch Weights - ACI 211"},{"$f":"'DryBatchWeights - ACI211'!$B$27","v":"ACI 211 Mix Design"},{"$f":"'DryBatchWeights - ACI211'!$B$29","v":"Paste"},{"$f":"'DryBatchWeights - ACI211'!$C$40","v":""},{"$f":"'DryBatchWeights - ACI211'!$F$28","v":"Producer/Source"}]
[532,{"$f":"IF('DryBatchWeights - ACI211'!H40=\"\",\"\",'DryBatchWeights - ACI211'!H40)","v":""},{"$f":"'DryBatchWeights - ACI211'!$B$4","v":"Dry Batch Weights - ACI 211"},{"$f":"'DryBatchWeights - ACI211'!$B$27","v":"ACI 211 Mix Design"},{"$f":"'DryBatchWeights - ACI211'!$B$29","v":"Paste"},{"$f":"'DryBatchWeights - ACI211'!$C$40","v":""},{"$f":"'DryBatchWeights - ACI211'!$H$28","v":"% or\nDosage"}]
[533,{"$f":"IF('DryBatchWeights - ACI211'!I40=\"\",\"\",'DryBatchWeights - ACI211'!I40)","v":""},{"$f":"'DryBatchWeights - ACI211'!$B$4","v":"Dry Batch Weights - ACI 211"},{"$f":"'DryBatchWeights - ACI211'!$B$27","v":"ACI 211 Mix Design"},{"$f":"'DryBatchWeights - ACI211'!$B$29","v":"Paste"},{"$f":"'DryBatchWeights - ACI211'!$C$40","v":""},{"$f":"'DryBatchWeights - ACI211'!$I$28","v":"Absolute Vol. (ft3)"}]
[534,{"$f":"IF('DryBatchWeights - ACI211'!K40=\"\",\"\",'DryBatchWeights - ACI211'!K40)","v":""},{"$f":"'DryBatchWeights - ACI211'!$B$4","v":"Dry Batch Weights - ACI 211"},{"$f":"'DryBatchWeights - ACI211'!$B$27","v":"ACI 211 Mix Design"},{"$f":"'DryBatchWeights - ACI211'!$B$29","v":"Paste"},{"$f":"'DryBatchWeights - ACI211'!$C$40","v":""},{"$f":"'DryBatchWeights - ACI211'!$K$28","v":"SSD Weight (lbs/CY)"}]
[535,{"$f":"IF('DryBatchWeights - ACI211'!E41=\"\",\"\",'DryBatchWeights - ACI211'!E41)","v":""},{"$f":"'DryBatchWeights - ACI211'!$B$4","v":"Dry Batch Weights - ACI 211"},{"$f":"'DryBatchWeights - ACI211'!$B$27","v":"ACI 211 Mix Design"},{"$f":"'DryBatchWeights - ACI211'!$B$29","v":"Paste"},{"$f":"'DryBatchWeights - ACI211'!$C$41","v":""},{"$f":"'DryBatchWeights - ACI211'!$E$28","v":"Type/Class/Grade"}]
[536,{"$f":"IF('DryBatchWeights - ACI211'!F41=\"\",\"\",'DryBatchWeights - ACI211'!F41)","v":""},{"$f":"'DryBatchWeights - ACI211'!$B$4","v":"Dry Batch Weights - ACI 211"},{"$f":"'DryBatchWeights - ACI211'!$B$27","v":"ACI 211 Mix Design"},{"$f":"'DryBatchWeights - ACI211'!$B$29","v":"Paste"},{"$f":"'DryBatchWeights - ACI211'!$C$41","v":""},{"$f":"'DryBatchWeights - ACI211'!$F$28","v":"Producer/Source"}]
[537,{"$f":"IF('DryBatchWeights - ACI211'!H41=\"\",\"\",'DryBatchWeights - ACI211'!H41)","v":""},{"$f":"'DryBatchWeights - ACI211'!$B$4","v":"Dry Batch Weights - ACI 211"},{"$f":"'DryBatchWeights - ACI211'!$B$27","v":"ACI 211 Mix Design"},{"$f":"'DryBatchWeights - ACI211'!$B$29","v":"Paste"},{"$f":"'DryBatchWeights - ACI211'!$C$41","v":""},{"$f":"'DryBatchWeights - ACI211'!$H$28","v":"% or\nDosage"}]
[538,{"$f":"IF('DryBatchWeights - ACI211'!I41=\"\",\"\",'DryBatchWeights - ACI211'!I41)","v":""},{"$f":"'DryBatchWeights - ACI211'!$B$4","v":"Dry Batch Weights - ACI 211"},{"$f":"'DryBatchWeights - ACI211'!$B$27","v":"ACI 211 Mix Design"},{"$f":"'DryBatchWeights - ACI211'!$B$29","v":"Paste"},{"$f":"'DryBatchWeights - ACI211'!$C$41","v":""},{"$f":"'DryBatchWeights - ACI211'!$I$28","v":"Absolute Vol. (ft3)"}]
[539,{"$f":"IF('DryBatchWeights - ACI211'!K41=\"\",\"\",'DryBatchWeights - ACI211'!K41)","v":""},{"$f":"'DryBatchWeights - ACI211'!$B$4","v":"Dry Batch Weights - ACI 211"},{"$f":"'DryBatchWeights - ACI211'!$B$27","v":"ACI 211 Mix Design"},{"$f":"'DryBatchWeights - ACI211'!$B$29","v":"Paste"},{"$f":"'DryBatchWeights - ACI211'!$C$41","v":""},{"$f":"'DryBatchWeights - ACI211'!$K$28","v":"SSD Weight (lbs/CY)"}]
[540,{"$f":"IF('DryBatchWeights - ACI211'!E42=\"\",\"\",'DryBatchWeights - ACI211'!E42)","v":""},{"$f":"'DryBatchWeights - ACI211'!$B$4","v":"Dry Batch Weights - ACI 211"},{"$f":"'DryBatchWeights - ACI211'!$B$27","v":"ACI 211 Mix Design"},{"$f":"'DryBatchWeights - ACI211'!$B$29","v":"Paste"},{"$f":"'DryBatchWeights - ACI211'!$C$42","v":""},{"$f":"'DryBatchWeights - ACI211'!$E$28","v":"Type/Class/Grade"}]
[541,{"$f":"IF('DryBatchWeights - ACI211'!F42=\"\",\"\",'DryBatchWeights - ACI211'!F42)","v":""},{"$f":"'DryBatchWeights - ACI211'!$B$4","v":"Dry Batch Weights - ACI 211"},{"$f":"'DryBatchWeights - ACI211'!$B$27","v":"ACI 211 Mix Design"},{"$f":"'DryBatchWeights - ACI211'!$B$29","v":"Paste"},{"$f":"'DryBatchWeights - ACI211'!$C$42","v":""},{"$f":"'DryBatchWeights - ACI211'!$F$28","v":"Producer/Source"}]
[542,{"$f":"IF('DryBatchWeights - ACI211'!H42=\"\",\"\",'DryBatchWeights - ACI211'!H42)","v":""},{"$f":"'DryBatchWeights - ACI211'!$B$4","v":"Dry Batch Weights - ACI 211"},{"$f":"'DryBatchWeights - ACI211'!$B$27","v":"ACI 211 Mix Design"},{"$f":"'DryBatchWeights - ACI211'!$B$29","v":"Paste"},{"$f":"'DryBatchWeights - ACI211'!$C$42","v":""},{"$f":"'DryBatchWeights - ACI211'!$H$28","v":"% or\nDosage"}]
[543,{"$f":"IF('DryBatchWeights - ACI211'!I42=\"\",\"\",'DryBatchWeights - ACI211'!I42)","v":""},{"$f":"'DryBatchWeights - ACI211'!$B$4","v":"Dry Batch Weights - ACI 211"},{"$f":"'DryBatchWeights - ACI211'!$B$27","v":"ACI 211 Mix Design"},{"$f":"'DryBatchWeights - ACI211'!$B$29","v":"Paste"},{"$f":"'DryBatchWeights - ACI211'!$C$42","v":""},{"$f":"'DryBatchWeights - ACI211'!$I$28","v":"Absolute Vol. (ft3)"}]
[544,{"$f":"IF('DryBatchWeights - ACI211'!K42=\"\",\"\",'DryBatchWeights - ACI211'!K42)","v":""},{"$f":"'DryBatchWeights - ACI211'!$B$4","v":"Dry Batch Weights - ACI 211"},{"$f":"'DryBatchWeights - ACI211'!$B$27","v":"ACI 211 Mix Design"},{"$f":"'DryBatchWeights - ACI211'!$B$29","v":"Paste"},{"$f":"'DryBatchWeights - ACI211'!$C$42","v":""},{"$f":"'DryBatchWeights - ACI211'!$K$28","v":"SSD Weight (lbs/CY)"}]
[545,{"$f":"IF('DryBatchWeights - ACI211'!E43=\"\",\"\",'DryBatchWeights - ACI211'!E43)","v":""},{"$f":"'DryBatchWeights - ACI211'!$B$4","v":"Dry Batch Weights - ACI 211"},{"$f":"'DryBatchWeights - ACI211'!$B$27","v":"ACI 211 Mix Design"},{"$f":"'DryBatchWeights - ACI211'!$B$29","v":"Paste"},{"$f":"'DryBatchWeights - ACI211'!$C$43","v":""},{"$f":"'DryBatchWeights - ACI211'!$E$28","v":"Type/Class/Grade"}]
[546,{"$f":"IF('DryBatchWeights - ACI211'!F43=\"\",\"\",'DryBatchWeights - ACI211'!F43)","v":""},{"$f":"'DryBatchWeights - ACI211'!$B$4","v":"Dry Batch Weights - ACI 211"},{"$f":"'DryBatchWeights - ACI211'!$B$27","v":"ACI 211 Mix Design"},{"$f":"'DryBatchWeights - ACI211'!$B$29","v":"Paste"},{"$f":"'DryBatchWeights - ACI211'!$C$43","v":""},{"$f":"'DryBatchWeights - ACI211'!$F$28","v":"Producer/Source"}]
[547,{"$f":"IF('DryBatchWeights - ACI211'!H43=\"\",\"\",'DryBatchWeights - ACI211'!H43)","v":""},{"$f":"'DryBatchWeights - ACI211'!$B$4","v":"Dry Batch Weights - ACI 211"},{"$f":"'DryBatchWeights - ACI211'!$B$27","v":"ACI 211 Mix Design"},{"$f":"'DryBatchWeights - ACI211'!$B$29","v":"Paste"},{"$f":"'DryBatchWeights - ACI211'!$C$43","v":""},{"$f":"'DryBatchWeights - ACI211'!$H$28","v":"% or\nDosage"}]
[548,{"$f":"IF('DryBatchWeights - ACI211'!I43=\"\",\"\",'DryBatchWeights - ACI211'!I43)","v":""},{"$f":"'DryBatchWeights - ACI211'!$B$4","v":"Dry Batch Weights - ACI 211"},{"$f":"'DryBatchWeights - ACI211'!$B$27","v":"ACI 211 Mix Design"},{"$f":"'DryBatchWeights - ACI211'!$B$29","v":"Paste"},{"$f":"'DryBatchWeights - ACI211'!$C$43","v":""},{"$f":"'DryBatchWeights - ACI211'!$I$28","v":"Absolute Vol. (ft3)"}]
[549,{"$f":"IF('DryBatchWeights - ACI211'!K43=\"\",\"\",'DryBatchWeights - ACI211'!K43)","v":""},{"$f":"'DryBatchWeights - ACI211'!$B$4","v":"Dry Batch Weights - ACI 211"},{"$f":"'DryBatchWeights - ACI211'!$B$27","v":"ACI 211 Mix Design"},{"$f":"'DryBatchWeights - ACI211'!$B$29","v":"Paste"},{"$f":"'DryBatchWeights - ACI211'!$C$43","v":""},{"$f":"'DryBatchWeights - ACI211'!$K$28","v":"SSD Weight (lbs/CY)"}]
[550,{"$f":"IF('DryBatchWeights - ACI211'!E44=\"\",\"\",'DryBatchWeights - ACI211'!E44)","v":""},{"$f":"'DryBatchWeights - ACI211'!$B$4","v":"Dry Batch Weights - ACI 211"},{"$f":"'DryBatchWeights - ACI211'!$B$27","v":"ACI 211 Mix Design"},{"$f":"'DryBatchWeights - ACI211'!$B$29","v":"Paste"},{"$f":"'DryBatchWeights - ACI211'!$C$44","v":""},{"$f":"'DryBatchWeights - ACI211'!$E$28","v":"Type/Class/Grade"}]
[551,{"$f":"IF('DryBatchWeights - ACI211'!F44=\"\",\"\",'DryBatchWeights - ACI211'!F44)","v":""},{"$f":"'DryBatchWeights - ACI211'!$B$4","v":"Dry Batch Weights - ACI 211"},{"$f":"'DryBatchWeights - ACI211'!$B$27","v":"ACI 211 Mix Design"},{"$f":"'DryBatchWeights - ACI211'!$B$29","v":"Paste"},{"$f":"'DryBatchWeights - ACI211'!$C$44","v":""},{"$f":"'DryBatchWeights - ACI211'!$F$28","v":"Producer/Source"}]
[552,{"$f":"IF('DryBatchWeights - ACI211'!H44=\"\",\"\",'DryBatchWeights - ACI211'!H44)","v":""},{"$f":"'DryBatchWeights - ACI211'!$B$4","v":"Dry Batch Weights - ACI 211"},{"$f":"'DryBatchWeights - ACI211'!$B$27","v":"ACI 211 Mix Design"},{"$f":"'DryBatchWeights - ACI211'!$B$29","v":"Paste"},{"$f":"'DryBatchWeights - ACI211'!$C$44","v":""},{"$f":"'DryBatchWeights - ACI211'!$H$28","v":"% or\nDosage"}]
[553,{"$f":"IF('DryBatchWeights - ACI211'!I44=\"\",\"\",'DryBatchWeights - ACI211'!I44)","v":""},{"$f":"'DryBatchWeights - ACI211'!$B$4","v":"Dry Batch Weights - ACI 211"},{"$f":"'DryBatchWeights - ACI211'!$B$27","v":"ACI 211 Mix Design"},{"$f":"'DryBatchWeights - ACI211'!$B$29","v":"Paste"},{"$f":"'DryBatchWeights - ACI211'!$C$44","v":""},{"$f":"'DryBatchWeights - ACI211'!$I$28","v":"Absolute Vol. (ft3)"}]
[554,{"$f":"IF('DryBatchWeights - ACI211'!K44=\"\",\"\",'DryBatchWeights - ACI211'!K44)","v":""},{"$f":"'DryBatchWeights - ACI211'!$B$4","v":"Dry Batch Weights - ACI 211"},{"$f":"'DryBatchWeights - ACI211'!$B$27","v":"ACI 211 Mix Design"},{"$f":"'DryBatchWeights - ACI211'!$B$29","v":"Paste"},{"$f":"'DryBatchWeights - ACI211'!$C$44","v":""},{"$f":"'DryBatchWeights - ACI211'!$K$28","v":"SSD Weight (lbs/CY)"}]
[555,{"$f":"IF('DryBatchWeights - ACI211'!E45=\"\",\"\",'DryBatchWeights - ACI211'!E45)","v":""},{"$f":"'DryBatchWeights - ACI211'!$B$4","v":"Dry Batch Weights - ACI 211"},{"$f":"'DryBatchWeights - ACI211'!$B$27","v":"ACI 211 Mix Design"},{"$f":"'DryBatchWeights - ACI211'!$B$29","v":"Paste"},{"$f":"'DryBatchWeights - ACI211'!$C$45","v":""},{"$f":"'DryBatchWeights - ACI211'!$E$28","v":"Type/Class/Grade"}]
[556,{"$f":"IF('DryBatchWeights - ACI211'!F45=\"\",\"\",'DryBatchWeights - ACI211'!F45)","v":""},{"$f":"'DryBatchWeights - ACI211'!$B$4","v":"Dry Batch Weights - ACI 211"},{"$f":"'DryBatchWeights - ACI211'!$B$27","v":"ACI 211 Mix Design"},{"$f":"'DryBatchWeights - ACI211'!$B$29","v":"Paste"},{"$f":"'DryBatchWeights - ACI211'!$C$45","v":""},{"$f":"'DryBatchWeights - ACI211'!$F$28","v":"Producer/Source"}]
[557,{"$f":"IF('DryBatchWeights - ACI211'!H45=\"\",\"\",'DryBatchWeights - ACI211'!H45)","v":""},{"$f":"'DryBatchWeights - ACI211'!$B$4","v":"Dry Batch Weights - ACI 211"},{"$f":"'DryBatchWeights - ACI211'!$B$27","v":"ACI 211 Mix Design"},{"$f":"'DryBatchWeights - ACI211'!$B$29","v":"Paste"},{"$f":"'DryBatchWeights - ACI211'!$C$45","v":""},{"$f":"'DryBatchWeights - ACI211'!$H$28","v":"% or\nDosage"}]
[558,{"$f":"IF('DryBatchWeights - ACI211'!I45=\"\",\"\",'DryBatchWeights - ACI211'!I45)","v":""},{"$f":"'DryBatchWeights - ACI211'!$B$4","v":"Dry Batch Weights - ACI 211"},{"$f":"'DryBatchWeights - ACI211'!$B$27","v":"ACI 211 Mix Design"},{"$f":"'DryBatchWeights - ACI211'!$B$29","v":"Paste"},{"$f":"'DryBatchWeights - ACI211'!$C$45","v":""},{"$f":"'DryBatchWeights - ACI211'!$I$28","v":"Absolute Vol. (ft3)"}]
[559,{"$f":"IF('DryBatchWeights - ACI211'!K45=\"\",\"\",'DryBatchWeights - ACI211'!K45)","v":""},{"$f":"'DryBatchWeights - ACI211'!$B$4","v":"Dry Batch Weights - ACI 211"},{"$f":"'DryBatchWeights - ACI211'!$B$27","v":"ACI 211 Mix Design"},{"$f":"'DryBatchWeights - ACI211'!$B$29","v":"Paste"},{"$f":"'DryBatchWeights - ACI211'!$C$45","v":""},{"$f":"'DryBatchWeights - ACI211'!$K$28","v":"SSD Weight (lbs/CY)"}]
[560,{"$f":"IF('DryBatchWeights - ACI211'!E46=\"\",\"\",'DryBatchWeights - ACI211'!E46)","v":""},{"$f":"'DryBatchWeights - ACI211'!$B$4","v":"Dry Batch Weights - ACI 211"},{"$f":"'DryBatchWeights - ACI211'!$B$27","v":"ACI 211 Mix Design"},{"$f":"'DryBatchWeights - ACI211'!$B$29","v":"Paste"},{"$f":"'DryBatchWeights - ACI211'!$C$46","v":""},{"$f":"'DryBatchWeights - ACI211'!$E$28","v":"Type/Class/Grade"}]
[561,{"$f":"IF('DryBatchWeights - ACI211'!F46=\"\",\"\",'DryBatchWeights - ACI211'!F46)","v":""},{"$f":"'DryBatchWeights - ACI211'!$B$4","v":"Dry Batch Weights - ACI 211"},{"$f":"'DryBatchWeights - ACI211'!$B$27","v":"ACI 211 Mix Design"},{"$f":"'DryBatchWeights - ACI211'!$B$29","v":"Paste"},{"$f":"'DryBatchWeights - ACI211'!$C$46","v":""},{"$f":"'DryBatchWeights - ACI211'!$F$28","v":"Producer/Source"}]
[562,{"$f":"IF('DryBatchWeights - ACI211'!H46=\"\",\"\",'DryBatchWeights - ACI211'!H46)","v":""},{"$f":"'DryBatchWeights - ACI211'!$B$4","v":"Dry Batch Weights - ACI 211"},{"$f":"'DryBatchWeights - ACI211'!$B$27","v":"ACI 211 Mix Design"},{"$f":"'DryBatchWeights - ACI211'!$B$29","v":"Paste"},{"$f":"'DryBatchWeights - ACI211'!$C$46","v":""},{"$f":"'DryBatchWeights - ACI211'!$H$28","v":"% or\nDosage"}]
[563,{"$f":"IF('DryBatchWeights - ACI211'!I46=\"\",\"\",'DryBatchWeights - ACI211'!I46)","v":""},{"$f":"'DryBatchWeights - ACI211'!$B$4","v":"Dry Batch Weights - ACI 211"},{"$f":"'DryBatchWeights - ACI211'!$B$27","v":"ACI 211 Mix Design"},{"$f":"'DryBatchWeights - ACI211'!$B$29","v":"Paste"},{"$f":"'DryBatchWeights - ACI211'!$C$46","v":""},{"$f":"'DryBatchWeights - ACI211'!$I$28","v":"Absolute Vol. (ft3)"}]
[564,{"$f":"IF('DryBatchWeights - ACI211'!K46=\"\",\"\",'DryBatchWeights - ACI211'!K46)","v":""},{"$f":"'DryBatchWeights - ACI211'!$B$4","v":"Dry Batch Weights - ACI 211"},{"$f":"'DryBatchWeights - ACI211'!$B$27","v":"ACI 211 Mix Design"},{"$f":"'DryBatchWeights - ACI211'!$B$29","v":"Paste"},{"$f":"'DryBatchWeights - ACI211'!$C$46","v":""},{"$f":"'DryBatchWeights - ACI211'!$K$28","v":"SSD Weight (lbs/CY)"}]
[565,{"$f":"IF('DryBatchWeights - ACI211'!E47=\"\",\"\",'DryBatchWeights - ACI211'!E47)","v":""},{"$f":"'DryBatchWeights - ACI211'!$B$4","v":"Dry Batch Weights - ACI 211"},{"$f":"'DryBatchWeights - ACI211'!$B$27","v":"ACI 211 Mix Design"},{"$f":"'DryBatchWeights - ACI211'!$B$29","v":"Paste"},{"$f":"'DryBatchWeights - ACI211'!$C$47","v":""},{"$f":"'DryBatchWeights - ACI211'!$E$28","v":"Type/Class/Grade"}]
[566,{"$f":"IF('DryBatchWeights - ACI211'!F47=\"\",\"\",'DryBatchWeights - ACI211'!F47)","v":""},{"$f":"'DryBatchWeights - ACI211'!$B$4","v":"Dry Batch Weights - ACI 211"},{"$f":"'DryBatchWeights - ACI211'!$B$27","v":"ACI 211 Mix Design"},{"$f":"'DryBatchWeights - ACI211'!$B$29","v":"Paste"},{"$f":"'DryBatchWeights - ACI211'!$C$47","v":""},{"$f":"'DryBatchWeights - ACI211'!$F$28","v":"Producer/Source"}]
[567,{"$f":"IF('DryBatchWeights - ACI211'!H47=\"\",\"\",'DryBatchWeights - ACI211'!H47)","v":""},{"$f":"'DryBatchWeights - ACI211'!$B$4","v":"Dry Batch Weights - ACI 211"},{"$f":"'DryBatchWeights - ACI211'!$B$27","v":"ACI 211 Mix Design"},{"$f":"'DryBatchWeights - ACI211'!$B$29","v":"Paste"},{"$f":"'DryBatchWeights - ACI211'!$C$47","v":""},{"$f":"'DryBatchWeights - ACI211'!$H$28","v":"% or\nDosage"}]
[568,{"$f":"IF('DryBatchWeights - ACI211'!I47=\"\",\"\",'DryBatchWeights - ACI211'!I47)","v":""},{"$f":"'DryBatchWeights - ACI211'!$B$4","v":"Dry Batch Weights - ACI 211"},{"$f":"'DryBatchWeights - ACI211'!$B$27","v":"ACI 211 Mix Design"},{"$f":"'DryBatchWeights - ACI211'!$B$29","v":"Paste"},{"$f":"'DryBatchWeights - ACI211'!$C$47","v":""},{"$f":"'DryBatchWeights - ACI211'!$I$28","v":"Absolute Vol. (ft3)"}]
[569,{"$f":"IF('DryBatchWeights - ACI211'!K47=\"\",\"\",'DryBatchWeights - ACI211'!K47)","v":""},{"$f":"'DryBatchWeights - ACI211'!$B$4","v":"Dry Batch Weights - ACI 211"},{"$f":"'DryBatchWeights - ACI211'!$B$27","v":"ACI 211 Mix Design"},{"$f":"'DryBatchWeights - ACI211'!$B$29","v":"Paste"},{"$f":"'DryBatchWeights - ACI211'!$C$47","v":""},{"$f":"'DryBatchWeights - ACI211'!$K$28","v":"SSD Weight (lbs/CY)"}]
[570,{"$f":"IF('DryBatchWeights - ACI211'!E48=\"\",\"\",'DryBatchWeights - ACI211'!E48)","v":""},{"$f":"'DryBatchWeights - ACI211'!$B$4","v":"Dry Batch Weights - ACI 211"},{"$f":"'DryBatchWeights - ACI211'!$B$27","v":"ACI 211 Mix Design"},{"$f":"'DryBatchWeights - ACI211'!$B$29","v":"Paste"},{"$f":"'DryBatchWeights - ACI211'!$C$48","v":""},{"$f":"'DryBatchWeights - ACI211'!$E$28","v":"Type/Class/Grade"}]
[571,{"$f":"IF('DryBatchWeights - ACI211'!F48=\"\",\"\",'DryBatchWeights - ACI211'!F48)","v":""},{"$f":"'DryBatchWeights - ACI211'!$B$4","v":"Dry Batch Weights - ACI 211"},{"$f":"'DryBatchWeights - ACI211'!$B$27","v":"ACI 211 Mix Design"},{"$f":"'DryBatchWeights - ACI211'!$B$29","v":"Paste"},{"$f":"'DryBatchWeights - ACI211'!$C$48","v":""},{"$f":"'DryBatchWeights - ACI211'!$F$28","v":"Producer/Source"}]
[572,{"$f":"IF('DryBatchWeights - ACI211'!H48=\"\",\"\",'DryBatchWeights - ACI211'!H48)","v":""},{"$f":"'DryBatchWeights - ACI211'!$B$4","v":"Dry Batch Weights - ACI 211"},{"$f":"'DryBatchWeights - ACI211'!$B$27","v":"ACI 211 Mix Design"},{"$f":"'DryBatchWeights - ACI211'!$B$29","v":"Paste"},{"$f":"'DryBatchWeights - ACI211'!$C$48","v":""},{"$f":"'DryBatchWeights - ACI211'!$H$28","v":"% or\nDosage"}]
[573,{"$f":"IF('DryBatchWeights - ACI211'!I48=\"\",\"\",'DryBatchWeights - ACI211'!I48)","v":""},{"$f":"'DryBatchWeights - ACI211'!$B$4","v":"Dry Batch Weights - ACI 211"},{"$f":"'DryBatchWeights - ACI211'!$B$27","v":"ACI 211 Mix Design"},{"$f":"'DryBatchWeights - ACI211'!$B$29","v":"Paste"},{"$f":"'DryBatchWeights - ACI211'!$C$48","v":""},{"$f":"'DryBatchWeights - ACI211'!$I$28","v":"Absolute Vol. (ft3)"}]
[574,{"$f":"IF('DryBatchWeights - ACI211'!K48=\"\",\"\",'DryBatchWeights - ACI211'!K48)","v":""},{"$f":"'DryBatchWeights - ACI211'!$B$4","v":"Dry Batch Weights - ACI 211"},{"$f":"'DryBatchWeights - ACI211'!$B$27","v":"ACI 211 Mix Design"},{"$f":"'DryBatchWeights - ACI211'!$B$29","v":"Paste"},{"$f":"'DryBatchWeights - ACI211'!$C$48","v":""},{"$f":"'DryBatchWeights - ACI211'!$K$28","v":"SSD Weight (lbs/CY)"}]
[575,{"$f":"IF('DryBatchWeights - ACI211'!I49=\"\",\"\",'DryBatchWeights - ACI211'!I49)","v":0},{"$f":"'DryBatchWeights - ACI211'!$B$4","v":"Dry Batch Weights - ACI 211"},{"$f":"'DryBatchWeights - ACI211'!$B$27","v":"ACI 211 Mix Design"},{"$f":"'DryBatchWeights - ACI211'!$B$29","v":"Paste"},{"$f":"'DryBatchWeights - ACI211'!C49","v":"Paste Volume = Total (water + cm):"},{"$f":"'DryBatchWeights - ACI211'!I28","v":"Absolute Vol. (ft3)"}]
[576,{"$f":"IF('DryBatchWeights - ACI211'!K49=\"\",\"\",'DryBatchWeights - ACI211'!K49)","v":0},{"$f":"'DryBatchWeights - ACI211'!$B$4","v":"Dry Batch Weights - ACI 211"},{"$f":"'DryBatchWeights - ACI211'!$B$27","v":"ACI 211 Mix Design"},{"$f":"'DryBatchWeights - ACI211'!$B$29","v":"Paste"},{"$f":"'DryBatchWeights - ACI211'!C50","v":"Entrapped air:"},{"$f":"'DryBatchWeights - ACI211'!K28","v":"SSD Weight (lbs/CY)"}]
[577,{"$f":"IF('DryBatchWeights - ACI211'!H50=\"\",\"\",'DryBatchWeights - ACI211'!H50)","v":0},{"$f":"'DryBatchWeights - ACI211'!$B$4","v":"Dry Batch Weights - ACI 211"},{"$f":"'DryBatchWeights - ACI211'!$B$27","v":"ACI 211 Mix Design"},{"$f":"'DryBatchWeights - ACI211'!$B$50","v":"Air"},{"$f":"'DryBatchWeights - ACI211'!C50","v":"Entrapped air:"},{"$f":"'DryBatchWeights - ACI211'!$H$28","v":"% or\nDosage"}]
[578,{"$f":"IF('DryBatchWeights - ACI211'!H51=\"\",\"\",'DryBatchWeights - ACI211'!H51)","v":0},{"$f":"'DryBatchWeights - ACI211'!$B$4","v":"Dry Batch Weights - ACI 211"},{"$f":"'DryBatchWeights - ACI211'!$B$27","v":"ACI 211 Mix Design"},{"$f":"'DryBatchWeights - ACI211'!$B$50","v":"Air"},{"$f":"'DryBatchWeights - ACI211'!C51","v":"Target Total Air Content:"},{"$f":"'DryBatchWeights - ACI211'!$H$28","v":"% or\nDosage"}]
[579,{"$f":"IF('DryBatchWeights - ACI211'!I50=\"\",\"\",'DryBatchWeights - ACI211'!I50)","v":0},{"$f":"'DryBatchWeights - ACI211'!$B$4","v":"Dry Batch Weights - ACI 211"},{"$f":"'DryBatchWeights - ACI211'!$B$27","v":"ACI 211 Mix Design"},{"$f":"'DryBatchWeights - ACI211'!$B$50","v":"Air"},{"$f":"'DryBatchWeights - ACI211'!C50","v":"Entrapped air:"},{"$f":"'DryBatchWeights - ACI211'!$I$28","v":"Absolute Vol. (ft3)"}]
[580,{"$f":"IF('DryBatchWeights - ACI211'!I51=\"\",\"\",'DryBatchWeights - ACI211'!I51)","v":0},{"$f":"'DryBatchWeights - ACI211'!$B$4","v":"Dry Batch Weights - ACI 211"},{"$f":"'DryBatchWeights - ACI211'!$B$27","v":"ACI 211 Mix Design"},{"$f":"'DryBatchWeights - ACI211'!$B$50","v":"Air"},{"$f":"'DryBatchWeights - ACI211'!C51","v":"Target Total Air Content:"},{"$f":"'DryBatchWeights - ACI211'!$I$28","v":"Absolute Vol. (ft3)"}]
[581,{"$f":"IF('DryBatchWeights - ACI211'!I52=\"\",\"\",'DryBatchWeights - ACI211'!I52)","v":0},{"$f":"'DryBatchWeights - ACI211'!$B$4","v":"Dry Batch Weights - ACI 211"},{"$f":"'DryBatchWeights - ACI211'!$B$27","v":"ACI 211 Mix Design"},{"$f":"'DryBatchWeights - ACI211'!$B$50","v":"Air"},{"$f":"'DryBatchWeights - ACI211'!C52","v":"Air + Paste Volume:"},{"$f":"'DryBatchWeights - ACI211'!$I$28","v":"Absolute Vol. (ft3)"}]
[582,{"$f":"IF('DryBatchWeights - ACI211'!F53=\"\",\"\",'DryBatchWeights - ACI211'!F53)","v":""},{"$f":"'DryBatchWeights - ACI211'!$B$4","v":"Dry Batch Weights - ACI 211"},{"$f":"'DryBatchWeights - ACI211'!$B$27","v":"ACI 211 Mix Design"},{"$f":"'DryBatchWeights - ACI211'!$B$53","v":"Misc."},{"$f":"'DryBatchWeights - ACI211'!C53","v":"Fibers:"},{"$f":"'DryBatchWeights - ACI211'!$F$28","v":"Producer/Source"}]
[583,{"$f":"IF('DryBatchWeights - ACI211'!F54=\"\",\"\",'DryBatchWeights - ACI211'!F54)","v":""},{"$f":"'DryBatchWeights - ACI211'!$B$4","v":"Dry Batch Weights - ACI 211"},{"$f":"'DryBatchWeights - ACI211'!$B$27","v":"ACI 211 Mix Design"},{"$f":"'DryBatchWeights - ACI211'!$B$53","v":"Misc."},{"$f":"'DryBatchWeights - ACI211'!C54","v":""},{"$f":"'DryBatchWeights - ACI211'!$F$28","v":"Producer/Source"}]
[584,{"$f":"IF('DryBatchWeights - ACI211'!I53=\"\",\"\",'DryBatchWeights - ACI211'!I53)","v":""},{"$f":"'DryBatchWeights - ACI211'!$B$4","v":"Dry Batch Weights - ACI 211"},{"$f":"'DryBatchWeights - ACI211'!$B$27","v":"ACI 211 Mix Design"},{"$f":"'DryBatchWeights - ACI211'!$B$53","v":"Misc."},{"$f":"'DryBatchWeights - ACI211'!C53","v":"Fibers:"},{"$f":"'DryBatchWeights - ACI211'!$I$28","v":"Absolute Vol. (ft3)"}]
[585,{"$f":"IF('DryBatchWeights - ACI211'!I54=\"\",\"\",'DryBatchWeights - ACI211'!I54)","v":""},{"$f":"'DryBatchWeights - ACI211'!$B$4","v":"Dry Batch Weights - ACI 211"},{"$f":"'DryBatchWeights - ACI211'!$B$27","v":"ACI 211 Mix Design"},{"$f":"'DryBatchWeights - ACI211'!$B$53","v":"Misc."},{"$f":"'DryBatchWeights - ACI211'!C54","v":""},{"$f":"'DryBatchWeights - ACI211'!$I$28","v":"Absolute Vol. (ft3)"}]
[586,{"$f":"IF('DryBatchWeights - ACI211'!K53=\"\",\"\",'DryBatchWeights - ACI211'!K53)","v":""},{"$f":"'DryBatchWeights - ACI211'!$B$4","v":"Dry Batch Weights - ACI 211"},{"$f":"'DryBatchWeights - ACI211'!$B$27","v":"ACI 211 Mix Design"},{"$f":"'DryBatchWeights - ACI211'!$B$53","v":"Misc."},{"$f":"'DryBatchWeights - ACI211'!C53","v":"Fibers:"},{"$f":"'DryBatchWeights - ACI211'!$K$28","v":"SSD Weight (lbs/CY)"}]
[587,{"$f":"IF('DryBatchWeights - ACI211'!K54=\"\",\"\",'DryBatchWeights - ACI211'!K54)","v":""},{"$f":"'DryBatchWeights - ACI211'!$B$4","v":"Dry Batch Weights - ACI 211"},{"$f":"'DryBatchWeights - ACI211'!$B$27","v":"ACI 211 Mix Design"},{"$f":"'DryBatchWeights - ACI211'!$B$53","v":"Misc."},{"$f":"'DryBatchWeights - ACI211'!C54","v":""},{"$f":"'DryBatchWeights - ACI211'!$K$28","v":"SSD Weight (lbs/CY)"}]
[588,{"$f":"IF('DryBatchWeights - ACI211'!H55=\"\",\"\",'DryBatchWeights - ACI211'!H55)","v":0},{"$f":"'DryBatchWeights - ACI211'!$B$4","v":"Dry Batch Weights - ACI 211"},{"$f":"'DryBatchWeights - ACI211'!$B$27","v":"ACI 211 Mix Design"},{"$f":"'DryBatchWeights - ACI211'!$B$55","v":"Optimized Gradation"},{"$f":"'DryBatchWeights - ACI211'!$C$55","v":"Total Aggregate Volume:"},{"$f":"'DryBatchWeights - ACI211'!H28","v":"% or\nDosage"}]
[589,{"$f":"IFERROR(IF('DryBatchWeights - ACI211'!I55=\"\",\"\",'DryBatchWeights - ACI211'!I55),\"\")","v":""},{"$f":"'DryBatchWeights - ACI211'!$B$4","v":"Dry Batch Weights - ACI 211"},{"$f":"'DryBatchWeights - ACI211'!$B$27","v":"ACI 211 Mix Design"},{"$f":"'DryBatchWeights - ACI211'!$B$55","v":"Optimized Gradation"},{"$f":"'DryBatchWeights - ACI211'!$C$55","v":"Total Aggregate Volume:"},{"$f":"'DryBatchWeights - ACI211'!I28","v":"Absolute Vol. (ft3)"}]
[590,{"$f":"IF('DryBatchWeights - ACI211'!K55=\"\",\"\",'DryBatchWeights - ACI211'!K55)","v":0},{"$f":"'DryBatchWeights - ACI211'!$B$4","v":"Dry Batch Weights - ACI 211"},{"$f":"'DryBatchWeights - ACI211'!$B$27","v":"ACI 211 Mix Design"},{"$f":"'DryBatchWeights - ACI211'!$B$55","v":"Optimized Gradation"},{"$f":"'DryBatchWeights - ACI211'!$C$55","v":"Total Aggregate Volume:"},{"$f":"'DryBatchWeights - ACI211'!K28","v":"SSD Weight (lbs/CY)"}]
[591,{"$f":"IF('DryBatchWeights - ACI211'!E56=\"\",\"\",'DryBatchWeights - ACI211'!E56)","v":""},{"$f":"'DryBatchWeights - ACI211'!$B$4","v":"Dry Batch Weights - ACI 211"},{"$f":"'DryBatchWeights - ACI211'!$B$27","v":"ACI 211 Mix Design"},{"$f":"'DryBatchWeights - ACI211'!$B$55","v":"Optimized Gradation"},{"$f":"'DryBatchWeights - ACI211'!C56","v":"Coarse Aggregate 1:"},{"$f":"'DryBatchWeights - ACI211'!$E$28","v":"Type/Class/Grade"}]
[592,{"$f":"IF('DryBatchWeights - ACI211'!F56=\"\",\"\",'DryBatchWeights - ACI211'!F56)","v":""},{"$f":"'DryBatchWeights - ACI211'!$B$4","v":"Dry Batch Weights - ACI 211"},{"$f":"'DryBatchWeights - ACI211'!$B$27","v":"ACI 211 Mix Design"},{"$f":"'DryBatchWeights - ACI211'!$B$55","v":"Optimized Gradation"},{"$f":"'DryBatchWeights - ACI211'!$C$56","v":"Coarse Aggregate 1:"},{"$f":"'DryBatchWeights - ACI211'!$F$28","v":"Producer/Source"}]
[593,{"$f":"IF('DryBatchWeights - ACI211'!H56=\"\",\"\",'DryBatchWeights - ACI211'!H56)","v":0},{"$f":"'DryBatchWeights - ACI211'!$B$4","v":"Dry Batch Weights - ACI 211"},{"$f":"'DryBatchWeights - ACI211'!$B$27","v":"ACI 211 Mix Design"},{"$f":"'DryBatchWeights - ACI211'!$B$55","v":"Optimized Gradation"},{"$f":"'DryBatchWeights - ACI211'!$C$56","v":"Coarse Aggregate 1:"},{"$f":"'DryBatchWeights - ACI211'!$H$28","v":"% or\nDosage"}]
[594,{"$f":"IF('DryBatchWeights - ACI211'!I56=\"\",\"\",'DryBatchWeights - ACI211'!I56)","v":""},{"$f":"'DryBatchWeights - ACI211'!$B$4","v":"Dry Batch Weights - ACI 211"},{"$f":"'DryBatchWeights - ACI211'!$B$27","v":"ACI 211 Mix Design"},{"$f":"'DryBatchWeights - ACI211'!$B$55","v":"Optimized Gradation"},{"$f":"'DryBatchWeights - ACI211'!$C$56","v":"Coarse Aggregate 1:"},{"$f":"'DryBatchWeights - ACI211'!$I$28","v":"Absolute Vol. (ft3)"}]
[595,{"$f":"IF('DryBatchWeights - ACI211'!K56=\"\",\"\",'DryBatchWeights - ACI211'!K56)","v":""},{"$f":"'DryBatchWeights - ACI211'!$B$4","v":"Dry Batch Weights - ACI 211"},{"$f":"'DryBatchWeights - ACI211'!$B$27","v":"ACI 211 Mix Design"},{"$f":"'DryBatchWeights - ACI211'!$B$55","v":"Optimized Gradation"},{"$f":"'DryBatchWeights - ACI211'!$C$56","v":"Coarse Aggregate 1:"},{"$f":"'DryBatchWeights - ACI211'!$K$28","v":"SSD Weight (lbs/CY)"}]
[596,{"$f":"IF('DryBatchWeights - ACI211'!E57=\"\",\"\",'DryBatchWeights - ACI211'!E57)","v":""},{"$f":"'DryBatchWeights - ACI211'!$B$4","v":"Dry Batch Weights - ACI 211"},{"$f":"'DryBatchWeights - ACI211'!$B$27","v":"ACI 211 Mix Design"},{"$f":"'DryBatchWeights - ACI211'!$B$55","v":"Optimized Gradation"},{"$f":"'DryBatchWeights - ACI211'!C57","v":"Coarse Aggregate 2:"},{"$f":"'DryBatchWeights - ACI211'!$E$28","v":"Type/Class/Grade"}]
[597,{"$f":"IF('DryBatchWeights - ACI211'!F57=\"\",\"\",'DryBatchWeights - ACI211'!F57)","v":""},{"$f":"'DryBatchWeights - ACI211'!$B$4","v":"Dry Batch Weights - ACI 211"},{"$f":"'DryBatchWeights - ACI211'!$B$27","v":"ACI 211 Mix Design"},{"$f":"'DryBatchWeights - ACI211'!$B$55","v":"Optimized Gradation"},{"$f":"'DryBatchWeights - ACI211'!$C$57","v":"Coarse Aggregate 2:"},{"$f":"'DryBatchWeights - ACI211'!$F$28","v":"Producer/Source"}]
[598,{"$f":"IF('DryBatchWeights - ACI211'!H57=\"\",\"\",'DryBatchWeights - ACI211'!H57)","v":0},{"$f":"'DryBatchWeights - ACI211'!$B$4","v":"Dry Batch Weights - ACI 211"},{"$f":"'DryBatchWeights - ACI211'!$B$27","v":"ACI 211 Mix Design"},{"$f":"'DryBatchWeights - ACI211'!$B$55","v":"Optimized Gradation"},{"$f":"'DryBatchWeights - ACI211'!$C$57","v":"Coarse Aggregate 2:"},{"$f":"'DryBatchWeights - ACI211'!$H$28","v":"% or\nDosage"}]
[599,{"$f":"IF('DryBatchWeights - ACI211'!I57=\"\",\"\",'DryBatchWeights - ACI211'!I57)","v":""},{"$f":"'DryBatchWeights - ACI211'!$B$4","v":"Dry Batch Weights - ACI 211"},{"$f":"'DryBatchWeights - ACI211'!$B$27","v":"ACI 211 Mix Design"},{"$f":"'DryBatchWeights - ACI211'!$B$55","v":"Optimized Gradation"},{"$f":"'DryBatchWeights - ACI211'!$C$57","v":"Coarse Aggregate 2:"},{"$f":"'DryBatchWeights - ACI211'!$I$28","v":"Absolute Vol. (ft3)"}]
[600,{"$f":"IF('DryBatchWeights - ACI211'!K57=\"\",\"\",'DryBatchWeights - ACI211'!K57)","v":""},{"$f":"'DryBatchWeights - ACI211'!$B$4","v":"Dry Batch Weights - ACI 211"},{"$f":"'DryBatchWeights - ACI211'!$B$27","v":"ACI 211 Mix Design"},{"$f":"'DryBatchWeights - ACI211'!$B$55","v":"Optimized Gradation"},{"$f":"'DryBatchWeights - ACI211'!$C$57","v":"Coarse Aggregate 2:"},{"$f":"'DryBatchWeights - ACI211'!$K$28","v":"SSD Weight (lbs/CY)"}]
[601,{"$f":"IF('DryBatchWeights - ACI211'!E58=\"\",\"\",'DryBatchWeights - ACI211'!E58)","v":""},{"$f":"'DryBatchWeights - ACI211'!$B$4","v":"Dry Batch Weights - ACI 211"},{"$f":"'DryBatchWeights - ACI211'!$B$27","v":"ACI 211 Mix Design"},{"$f":"'DryBatchWeights - ACI211'!$B$55","v":"Optimized Gradation"},{"$f":"'DryBatchWeights - ACI211'!C58","v":"Intermediate Aggregate 1:"},{"$f":"'DryBatchWeights - ACI211'!$E$28","v":"Type/Class/Grade"}]
[602,{"$f":"IF('DryBatchWeights - ACI211'!F58=\"\",\"\",'DryBatchWeights - ACI211'!F58)","v":""},{"$f":"'DryBatchWeights - ACI211'!$B$4","v":"Dry Batch Weights - ACI 211"},{"$f":"'DryBatchWeights - ACI211'!$B$27","v":"ACI 211 Mix Design"},{"$f":"'DryBatchWeights - ACI211'!$B$55","v":"Optimized Gradation"},{"$f":"'DryBatchWeights - ACI211'!$C$58","v":"Intermediate Aggregate 1:"},{"$f":"'DryBatchWeights - ACI211'!$F$28","v":"Producer/Source"}]
[603,{"$f":"IF('DryBatchWeights - ACI211'!H58=\"\",\"\",'DryBatchWeights - ACI211'!H58)","v":0},{"$f":"'DryBatchWeights - ACI211'!$B$4","v":"Dry Batch Weights - ACI 211"},{"$f":"'DryBatchWeights - ACI211'!$B$27","v":"ACI 211 Mix Design"},{"$f":"'DryBatchWeights - ACI211'!$B$55","v":"Optimized Gradation"},{"$f":"'DryBatchWeights - ACI211'!$C$58","v":"Intermediate Aggregate 1:"},{"$f":"'DryBatchWeights - ACI211'!$H$28","v":"% or\nDosage"}]
[604,{"$f":"IF('DryBatchWeights - ACI211'!I58=\"\",\"\",'DryBatchWeights - ACI211'!I58)","v":""},{"$f":"'DryBatchWeights - ACI211'!$B$4","v":"Dry Batch Weights - ACI 211"},{"$f":"'DryBatchWeights - ACI211'!$B$27","v":"ACI 211 Mix Design"},{"$f":"'DryBatchWeights - ACI211'!$B$55","v":"Optimized Gradation"},{"$f":"'DryBatchWeights - ACI211'!$C$58","v":"Intermediate Aggregate 1:"},{"$f":"'DryBatchWeights - ACI211'!$I$28","v":"Absolute Vol. (ft3)"}]
[605,{"$f":"IF('DryBatchWeights - ACI211'!K58=\"\",\"\",'DryBatchWeights - ACI211'!K58)","v":""},{"$f":"'DryBatchWeights - ACI211'!$B$4","v":"Dry Batch Weights - ACI 211"},{"$f":"'DryBatchWeights - ACI211'!$B$27","v":"ACI 211 Mix Design"},{"$f":"'DryBatchWeights - ACI211'!$B$55","v":"Optimized Gradation"},{"$f":"'DryBatchWeights - ACI211'!$C$58","v":"Intermediate Aggregate 1:"},{"$f":"'DryBatchWeights - ACI211'!$K$28","v":"SSD Weight (lbs/CY)"}]
[606,{"$f":"IF('DryBatchWeights - ACI211'!E59=\"\",\"\",'DryBatchWeights - ACI211'!E59)","v":""},{"$f":"'DryBatchWeights - ACI211'!$B$4","v":"Dry Batch Weights - ACI 211"},{"$f":"'DryBatchWeights - ACI211'!$B$27","v":"ACI 211 Mix Design"},{"$f":"'DryBatchWeights - ACI211'!$B$55","v":"Optimized Gradation"},{"$f":"'DryBatchWeights - ACI211'!C59","v":"Intermediate Aggregate 2:"},{"$f":"'DryBatchWeights - ACI211'!$E$28","v":"Type/Class/Grade"}]
[607,{"$f":"IF('DryBatchWeights - ACI211'!F59=\"\",\"\",'DryBatchWeights - ACI211'!F59)","v":""},{"$f":"'DryBatchWeights - ACI211'!$B$4","v":"Dry Batch Weights - ACI 211"},{"$f":"'DryBatchWeights - ACI211'!$B$27","v":"ACI 211 Mix Design"},{"$f":"'DryBatchWeights - ACI211'!$B$55","v":"Optimized Gradation"},{"$f":"'DryBatchWeights - ACI211'!$C$59","v":"Intermediate Aggregate 2:"},{"$f":"'DryBatchWeights - ACI211'!$F$28","v":"Producer/Source"}]
[608,{"$f":"IF('DryBatchWeights - ACI211'!H59=\"\",\"\",'DryBatchWeights - ACI211'!H59)","v":0},{"$f":"'DryBatchWeights - ACI211'!$B$4","v":"Dry Batch Weights - ACI 211"},{"$f":"'DryBatchWeights - ACI211'!$B$27","v":"ACI 211 Mix Design"},{"$f":"'DryBatchWeights - ACI211'!$B$55","v":"Optimized Gradation"},{"$f":"'DryBatchWeights - ACI211'!$C$59","v":"Intermediate Aggregate 2:"},{"$f":"'DryBatchWeights - ACI211'!$H$28","v":"% or\nDosage"}]
[609,{"$f":"IF('DryBatchWeights - ACI211'!I59=\"\",\"\",'DryBatchWeights - ACI211'!I59)","v":""},{"$f":"'DryBatchWeights - ACI211'!$B$4","v":"Dry Batch Weights - ACI 211"},{"$f":"'DryBatchWeights - ACI211'!$B$27","v":"ACI 211 Mix Design"},{"$f":"'DryBatchWeights - ACI211'!$B$55","v":"Optimized Gradation"},{"$f":"'DryBatchWeights - ACI211'!$C$59","v":"Intermediate Aggregate 2:"},{"$f":"'DryBatchWeights - ACI211'!$I$28","v":"Absolute Vol. (ft3)"}]
[610,{"$f":"IF('DryBatchWeights - ACI211'!K59=\"\",\"\",'DryBatchWeights - ACI211'!K59)","v":""},{"$f":"'DryBatchWeights - ACI211'!$B$4","v":"Dry Batch Weights - ACI 211"},{"$f":"'DryBatchWeights - ACI211'!$B$27","v":"ACI 211 Mix Design"},{"$f":"'DryBatchWeights - ACI211'!$B$55","v":"Optimized Gradation"},{"$f":"'DryBatchWeights - ACI211'!$C$59","v":"Intermediate Aggregate 2:"},{"$f":"'DryBatchWeights - ACI211'!$K$28","v":"SSD Weight (lbs/CY)"}]
[611,{"$f":"IF('DryBatchWeights - ACI211'!F60=\"\",\"\",'DryBatchWeights - ACI211'!F60)","v":""},{"$f":"'DryBatchWeights - ACI211'!$B$4","v":"Dry Batch Weights - ACI 211"},{"$f":"'DryBatchWeights - ACI211'!$B$27","v":"ACI 211 Mix Design"},{"$f":"'DryBatchWeights - ACI211'!$B$55","v":"Optimized Gradation"},{"$f":"'DryBatchWeights - ACI211'!$C$60","v":"Fine Aggregate 1:"},{"$f":"'DryBatchWeights - ACI211'!$F$28","v":"Producer/Source"}]
[612,{"$f":"IF('DryBatchWeights - ACI211'!H60=\"\",\"\",'DryBatchWeights - ACI211'!H60)","v":0},{"$f":"'DryBatchWeights - ACI211'!$B$4","v":"Dry Batch Weights - ACI 211"},{"$f":"'DryBatchWeights - ACI211'!$B$27","v":"ACI 211 Mix Design"},{"$f":"'DryBatchWeights - ACI211'!$B$55","v":"Optimized Gradation"},{"$f":"'DryBatchWeights - ACI211'!$C$60","v":"Fine Aggregate 1:"},{"$f":"'DryBatchWeights - ACI211'!$H$28","v":"% or\nDosage"}]
[613,{"$f":"IFERROR(IF('DryBatchWeights - ACI211'!I60=\"\",\"\",'DryBatchWeights - ACI211'!I60),\"\")","v":""},{"$f":"'DryBatchWeights - ACI211'!$B$4","v":"Dry Batch Weights - ACI 211"},{"$f":"'DryBatchWeights - ACI211'!$B$27","v":"ACI 211 Mix Design"},{"$f":"'DryBatchWeights - ACI211'!$B$55","v":"Optimized Gradation"},{"$f":"'DryBatchWeights - ACI211'!$C$60","v":"Fine Aggregate 1:"},{"$f":"'DryBatchWeights - ACI211'!$I$28","v":"Absolute Vol. (ft3)"}]
[614,{"$f":"IF('DryBatchWeights - ACI211'!K60=\"\",\"\",'DryBatchWeights - ACI211'!K60)","v":""},{"$f":"'DryBatchWeights - ACI211'!$B$4","v":"Dry Batch Weights - ACI 211"},{"$f":"'DryBatchWeights - ACI211'!$B$27","v":"ACI 211 Mix Design"},{"$f":"'DryBatchWeights - ACI211'!$B$55","v":"Optimized Gradation"},{"$f":"'DryBatchWeights - ACI211'!$C$60","v":"Fine Aggregate 1:"},{"$f":"'DryBatchWeights - ACI211'!$K$28","v":"SSD Weight (lbs/CY)"}]
[615,{"$f":"IF('DryBatchWeights - ACI211'!F61=\"\",\"\",'DryBatchWeights - ACI211'!F61)","v":""},{"$f":"'DryBatchWeights - ACI211'!$B$4","v":"Dry Batch Weights - ACI 211"},{"$f":"'DryBatchWeights - ACI211'!$B$27","v":"ACI 211 Mix Design"},{"$f":"'DryBatchWeights - ACI211'!$B$55","v":"Optimized Gradation"},{"$f":"'DryBatchWeights - ACI211'!$C$61","v":"Fine Aggregate 2:"},{"$f":"'DryBatchWeights - ACI211'!$F$28","v":"Producer/Source"}]
[616,{"$f":"IF('DryBatchWeights - ACI211'!H61=\"\",\"\",'DryBatchWeights - ACI211'!H61)","v":0},{"$f":"'DryBatchWeights - ACI211'!$B$4","v":"Dry Batch Weights - ACI 211"},{"$f":"'DryBatchWeights - ACI211'!$B$27","v":"ACI 211 Mix Design"},{"$f":"'DryBatchWeights - ACI211'!$B$55","v":"Optimized Gradation"},{"$f":"'DryBatchWeights - ACI211'!$C$61","v":"Fine Aggregate 2:"},{"$f":"'DryBatchWeights - ACI211'!$H$28","v":"% or\nDosage"}]
[617,{"$f":"IFERROR(IF('DryBatchWeights - ACI211'!I61=\"\",\"\",'DryBatchWeights - ACI211'!I61),\"\")","v":""},{"$f":"'DryBatchWeights - ACI211'!$B$4","v":"Dry Batch Weights - ACI 211"},{"$f":"'DryBatchWeights - ACI211'!$B$27","v":"ACI 211 Mix Design"},{"$f":"'DryBatchWeights - ACI211'!$B$55","v":"Optimized Gradation"},{"$f":"'DryBatchWeights - ACI211'!$C$61","v":"Fine Aggregate 2:"},{"$f":"'DryBatchWeights - ACI211'!$I$28","v":"Absolute Vol. (ft3)"}]
[618,{"$f":"IF('DryBatchWeights - ACI211'!K61=\"\",\"\",'DryBatchWeights - ACI211'!K61)","v":""},{"$f":"'DryBatchWeights - ACI211'!$B$4","v":"Dry Batch Weights - ACI 211"},{"$f":"'DryBatchWeights - ACI211'!$B$27","v":"ACI 211 Mix Design"},{"$f":"'DryBatchWeights - ACI211'!$B$55","v":"Optimized Gradation"},{"$f":"'DryBatchWeights - ACI211'!$C$61","v":"Fine Aggregate 2:"},{"$f":"'DryBatchWeights - ACI211'!$K$28","v":"SSD Weight (lbs/CY)"}]
[619,{"$f":"IF('DryBatchWeights - ACI211'!I62=\"\",\"\",'DryBatchWeights - ACI211'!I62)","v":0},{"$f":"'DryBatchWeights - ACI211'!$B$4","v":"Dry Batch Weights - ACI 211"},{"$f":"'DryBatchWeights - ACI211'!$B$27","v":"ACI 211 Mix Design"},{"$f":"'DryBatchWeights - ACI211'!$B$62","v":"Non Optimized Gradation"},{"$f":"'DryBatchWeights - ACI211'!$C$62","v":"Total Aggregate Volume:"},{"$f":"'DryBatchWeights - ACI211'!I28","v":"Absolute Vol. (ft3)"}]
[620,{"$f":"IF('DryBatchWeights - ACI211'!K62=\"\",\"\",'DryBatchWeights - ACI211'!K62)","v":0},{"$f":"'DryBatchWeights - ACI211'!$B$4","v":"Dry Batch Weights - ACI 211"},{"$f":"'DryBatchWeights - ACI211'!$B$27","v":"ACI 211 Mix Design"},{"$f":"'DryBatchWeights - ACI211'!$B$62","v":"Non Optimized Gradation"},{"$f":"'DryBatchWeights - ACI211'!$C$62","v":"Total Aggregate Volume:"},{"$f":"'DryBatchWeights - ACI211'!K28","v":"SSD Weight (lbs/CY)"}]
[621,{"$f":"IF('DryBatchWeights - ACI211'!E63=\"\",\"\",'DryBatchWeights - ACI211'!E63)","v":""},{"$f":"'DryBatchWeights - ACI211'!$B$4","v":"Dry Batch Weights - ACI 211"},{"$f":"'DryBatchWeights - ACI211'!$B$27","v":"ACI 211 Mix Design"},{"$f":"'DryBatchWeights - ACI211'!$B$62","v":"Non Optimized Gradation"},{"$f":"'DryBatchWeights - ACI211'!C63","v":"Coarse Aggregate 1:"},{"$f":"'DryBatchWeights - ACI211'!$E$28","v":"Type/Class/Grade"}]
[622,{"$f":"IF('DryBatchWeights - ACI211'!F63=\"\",\"\",'DryBatchWeights - ACI211'!F63)","v":""},{"$f":"'DryBatchWeights - ACI211'!$B$4","v":"Dry Batch Weights - ACI 211"},{"$f":"'DryBatchWeights - ACI211'!$B$27","v":"ACI 211 Mix Design"},{"$f":"'DryBatchWeights - ACI211'!$B$62","v":"Non Optimized Gradation"},{"$f":"'DryBatchWeights - ACI211'!$C$63","v":"Coarse Aggregate 1:"},{"$f":"'DryBatchWeights - ACI211'!$F$28","v":"Producer/Source"}]
[623,{"$f":"IF('DryBatchWeights - ACI211'!H63=\"\",\"\",'DryBatchWeights - ACI211'!H63)","v":""},{"$f":"'DryBatchWeights - ACI211'!$B$4","v":"Dry Batch Weights - ACI 211"},{"$f":"'DryBatchWeights - ACI211'!$B$27","v":"ACI 211 Mix Design"},{"$f":"'DryBatchWeights - ACI211'!$B$62","v":"Non Optimized Gradation"},{"$f":"'DryBatchWeights - ACI211'!$C$63","v":"Coarse Aggregate 1:"},{"$f":"'DryBatchWeights - ACI211'!$H$28","v":"% or\nDosage"}]
[624,{"$f":"IF('DryBatchWeights - ACI211'!I63=\"\",\"\",'DryBatchWeights - ACI211'!I63)","v":""},{"$f":"'DryBatchWeights - ACI211'!$B$4","v":"Dry Batch Weights - ACI 211"},{"$f":"'DryBatchWeights - ACI211'!$B$27","v":"ACI 211 Mix Design"},{"$f":"'DryBatchWeights - ACI211'!$B$62","v":"Non Optimized Gradation"},{"$f":"'DryBatchWeights - ACI211'!$C$63","v":"Coarse Aggregate 1:"},{"$f":"'DryBatchWeights - ACI211'!$I$28","v":"Absolute Vol. (ft3)"}]
[625,{"$f":"IF('DryBatchWeights - ACI211'!K63=\"\",\"\",'DryBatchWeights - ACI211'!K63)","v":""},{"$f":"'DryBatchWeights - ACI211'!$B$4","v":"Dry Batch Weights - ACI 211"},{"$f":"'DryBatchWeights - ACI211'!$B$27","v":"ACI 211 Mix Design"},{"$f":"'DryBatchWeights - ACI211'!$B$62","v":"Non Optimized Gradation"},{"$f":"'DryBatchWeights - ACI211'!$C$63","v":"Coarse Aggregate 1:"},{"$f":"'DryBatchWeights - ACI211'!$K$28","v":"SSD Weight (lbs/CY)"}]
[626,{"$f":"IF('DryBatchWeights - ACI211'!E64=\"\",\"\",'DryBatchWeights - ACI211'!E64)","v":""},{"$f":"'DryBatchWeights - ACI211'!$B$4","v":"Dry Batch Weights - ACI 211"},{"$f":"'DryBatchWeights - ACI211'!$B$27","v":"ACI 211 Mix Design"},{"$f":"'DryBatchWeights - ACI211'!$B$62","v":"Non Optimized Gradation"},{"$f":"'DryBatchWeights - ACI211'!C64","v":"Coarse Aggregate 2:"},{"$f":"'DryBatchWeights - ACI211'!$E$28","v":"Type/Class/Grade"}]
[627,{"$f":"IF('DryBatchWeights - ACI211'!F64=\"\",\"\",'DryBatchWeights - ACI211'!F64)","v":""},{"$f":"'DryBatchWeights - ACI211'!$B$4","v":"Dry Batch Weights - ACI 211"},{"$f":"'DryBatchWeights - ACI211'!$B$27","v":"ACI 211 Mix Design"},{"$f":"'DryBatchWeights - ACI211'!$B$62","v":"Non Optimized Gradation"},{"$f":"'DryBatchWeights - ACI211'!$C$64","v":"Coarse Aggregate 2:"},{"$f":"'DryBatchWeights - ACI211'!$F$28","v":"Producer/Source"}]
[628,{"$f":"IF('DryBatchWeights - ACI211'!H64=\"\",\"\",'DryBatchWeights - ACI211'!H64)","v":""},{"$f":"'DryBatchWeights - ACI211'!$B$4","v":"Dry Batch Weights - ACI 211"},{"$f":"'DryBatchWeights - ACI211'!$B$27","v":"ACI 211 Mix Design"},{"$f":"'DryBatchWeights - ACI211'!$B$62","v":"Non Optimized Gradation"},{"$f":"'DryBatchWeights - ACI211'!$C$64","v":"Coarse Aggregate 2:"},{"$f":"'DryBatchWeights - ACI211'!$H$28","v":"% or\nDosage"}]
[629,{"$f":"IF('DryBatchWeights - ACI211'!I64=\"\",\"\",'DryBatchWeights - ACI211'!I64)","v":""},{"$f":"'DryBatchWeights - ACI211'!$B$4","v":"Dry Batch Weights - ACI 211"},{"$f":"'DryBatchWeights - ACI211'!$B$27","v":"ACI 211 Mix Design"},{"$f":"'DryBatchWeights - ACI211'!$B$62","v":"Non Optimized Gradation"},{"$f":"'DryBatchWeights - ACI211'!$C$64","v":"Coarse Aggregate 2:"},{"$f":"'DryBatchWeights - ACI211'!$I$28","v":"Absolute Vol. (ft3)"}]
[630,{"$f":"IF('DryBatchWeights - ACI211'!K64=\"\",\"\",'DryBatchWeights - ACI211'!K64)","v":""},{"$f":"'DryBatchWeights - ACI211'!$B$4","v":"Dry Batch Weights - ACI 211"},{"$f":"'DryBatchWeights - ACI211'!$B$27","v":"ACI 211 Mix Design"},{"$f":"'DryBatchWeights - ACI211'!$B$62","v":"Non Optimized Gradation"},{"$f":"'DryBatchWeights - ACI211'!$C$64","v":"Coarse Aggregate 2:"},{"$f":"'DryBatchWeights - ACI211'!$K$28","v":"SSD Weight (lbs/CY)"}]
[631,{"$f":"IF('DryBatchWeights - ACI211'!E65=\"\",\"\",'DryBatchWeights - ACI211'!E65)","v":""},{"$f":"'DryBatchWeights - ACI211'!$B$4","v":"Dry Batch Weights - ACI 211"},{"$f":"'DryBatchWeights - ACI211'!$B$27","v":"ACI 211 Mix Design"},{"$f":"'DryBatchWeights - ACI211'!$B$62","v":"Non Optimized Gradation"},{"$f":"'DryBatchWeights - ACI211'!C65","v":"Intermediate Aggregate 1:"},{"$f":"'DryBatchWeights - ACI211'!$E$28","v":"Type/Class/Grade"}]
[632,{"$f":"IF('DryBatchWeights - ACI211'!F65=\"\",\"\",'DryBatchWeights - ACI211'!F65)","v":""},{"$f":"'DryBatchWeights - ACI211'!$B$4","v":"Dry Batch Weights - ACI 211"},{"$f":"'DryBatchWeights - ACI211'!$B$27","v":"ACI 211 Mix Design"},{"$f":"'DryBatchWeights - ACI211'!$B$62","v":"Non Optimized Gradation"},{"$f":"'DryBatchWeights - ACI211'!$C$65","v":"Intermediate Aggregate 1:"},{"$f":"'DryBatchWeights - ACI211'!$F$28","v":"Producer/Source"}]
[633,{"$f":"IF('DryBatchWeights - ACI211'!H65=\"\",\"\",'DryBatchWeights - ACI211'!H65)","v":""},{"$f":"'DryBatchWeights - ACI211'!$B$4","v":"Dry Batch Weights - ACI 211"},{"$f":"'DryBatchWeights - ACI211'!$B$27","v":"ACI 211 Mix Design"},{"$f":"'DryBatchWeights - ACI211'!$B$62","v":"Non Optimized Gradation"},{"$f":"'DryBatchWeights - ACI211'!$C$65","v":"Intermediate Aggregate 1:"},{"$f":"'DryBatchWeights - ACI211'!$H$28","v":"% or\nDosage"}]
[634,{"$f":"IF('DryBatchWeights - ACI211'!I65=\"\",\"\",'DryBatchWeights - ACI211'!I65)","v":""},{"$f":"'DryBatchWeights - ACI211'!$B$4","v":"Dry Batch Weights - ACI 211"},{"$f":"'DryBatchWeights - ACI211'!$B$27","v":"ACI 211 Mix Design"},{"$f":"'DryBatchWeights - ACI211'!$B$62","v":"Non Optimized Gradation"},{"$f":"'DryBatchWeights - ACI211'!$C$65","v":"Intermediate Aggregate 1:"},{"$f":"'DryBatchWeights - ACI211'!$I$28","v":"Absolute Vol. (ft3)"}]
[635,{"$f":"IF('DryBatchWeights - ACI211'!K65=\"\",\"\",'DryBatchWeights - ACI211'!K65)","v":""},{"$f":"'DryBatchWeights - ACI211'!$B$4","v":"Dry Batch Weights - ACI 211"},{"$f":"'DryBatchWeights - ACI211'!$B$27","v":"ACI 211 Mix Design"},{"$f":"'DryBatchWeights - ACI211'!$B$62","v":"Non Optimized Gradation"},{"$f":"'DryBatchWeights - ACI211'!$C$65","v":"Intermediate Aggregate 1:"},{"$f":"'DryBatchWeights - ACI211'!$K$28","v":"SSD Weight (lbs/CY)"}]
[636,{"$f":"IF('DryBatchWeights - ACI211'!E66=\"\",\"\",'DryBatchWeights - ACI211'!E66)","v":""},{"$f":"'DryBatchWeights - ACI211'!$B$4","v":"Dry Batch Weights - ACI 211"},{"$f":"'DryBatchWeights - ACI211'!$B$27","v":"ACI 211 Mix Design"},{"$f":"'DryBatchWeights - ACI211'!$B$62","v":"Non Optimized Gradation"},{"$f":"'DryBatchWeights - ACI211'!C66","v":"Intermediate Aggregate 2:"},{"$f":"'DryBatchWeights - ACI211'!$E$28","v":"Type/Class/Grade"}]
[637,{"$f":"IF('DryBatchWeights - ACI211'!F66=\"\",\"\",'DryBatchWeights - ACI211'!F66)","v":""},{"$f":"'DryBatchWeights - ACI211'!$B$4","v":"Dry Batch Weights - ACI 211"},{"$f":"'DryBatchWeights - ACI211'!$B$27","v":"ACI 211 Mix Design"},{"$f":"'DryBatchWeights - ACI211'!$B$62","v":"Non Optimized Gradation"},{"$f":"'DryBatchWeights - ACI211'!$C$66","v":"Intermediate Aggregate 2:"},{"$f":"'DryBatchWeights - ACI211'!$F$28","v":"Producer/Source"}]
[638,{"$f":"IF('DryBatchWeights - ACI211'!H66=\"\",\"\",'DryBatchWeights - ACI211'!H66)","v":""},{"$f":"'DryBatchWeights - ACI211'!$B$4","v":"Dry Batch Weights - ACI 211"},{"$f":"'DryBatchWeights - ACI211'!$B$27","v":"ACI 211 Mix Design"},{"$f":"'DryBatchWeights - ACI211'!$B$62","v":"Non Optimized Gradation"},{"$f":"'DryBatchWeights - ACI211'!$C$66","v":"Intermediate Aggregate 2:"},{"$f":"'DryBatchWeights - ACI211'!$H$28","v":"% or\nDosage"}]
[639,{"$f":"IF('DryBatchWeights - ACI211'!I66=\"\",\"\",'DryBatchWeights - ACI211'!I66)","v":""},{"$f":"'DryBatchWeights - ACI211'!$B$4","v":"Dry Batch Weights - ACI 211"},{"$f":"'DryBatchWeights - ACI211'!$B$27","v":"ACI 211 Mix Design"},{"$f":"'DryBatchWeights - ACI211'!$B$62","v":"Non Optimized Gradation"},{"$f":"'DryBatchWeights - ACI211'!$C$66","v":"Intermediate Aggregate 2:"},{"$f":"'DryBatchWeights - ACI211'!$I$28","v":"Absolute Vol. (ft3)"}]
[640,{"$f":"IF('DryBatchWeights - ACI211'!K66=\"\",\"\",'DryBatchWeights - ACI211'!K66)","v":""},{"$f":"'DryBatchWeights - ACI211'!$B$4","v":"Dry Batch Weights - ACI 211"},{"$f":"'DryBatchWeights - ACI211'!$B$27","v":"ACI 211 Mix Design"},{"$f":"'DryBatchWeights - ACI211'!$B$62","v":"Non Optimized Gradation"},{"$f":"'DryBatchWeights - ACI211'!$C$66","v":"Intermediate Aggregate 2:"},{"$f":"'DryBatchWeights - ACI211'!$K$28","v":"SSD Weight (lbs/CY)"}]
[641,{"$f":"IF('DryBatchWeights - ACI211'!F67=\"\",\"\",'DryBatchWeights - ACI211'!F67)","v":""},{"$f":"'DryBatchWeights - ACI211'!$B$4","v":"Dry Batch Weights - ACI 211"},{"$f":"'DryBatchWeights - ACI211'!$B$27","v":"ACI 211 Mix Design"},{"$f":"'DryBatchWeights - ACI211'!$B$62","v":"Non Optimized Gradation"},{"$f":"'DryBatchWeights - ACI211'!$C$67","v":"Fine Aggregate 1:"},{"$f":"'DryBatchWeights - ACI211'!$F$28","v":"Producer/Source"}]
[642,{"$f":"IF('DryBatchWeights - ACI211'!H67=\"\",\"\",'DryBatchWeights - ACI211'!H67)","v":""},{"$f":"'DryBatchWeights - ACI211'!$B$4","v":"Dry Batch Weights - ACI 211"},{"$f":"'DryBatchWeights - ACI211'!$B$27","v":"ACI 211 Mix Design"},{"$f":"'DryBatchWeights - ACI211'!$B$62","v":"Non Optimized Gradation"},{"$f":"'DryBatchWeights - ACI211'!$C$67","v":"Fine Aggregate 1:"},{"$f":"'DryBatchWeights - ACI211'!$H$28","v":"% or\nDosage"}]
[643,{"$f":"IF('DryBatchWeights - ACI211'!I67=\"\",\"\",'DryBatchWeights - ACI211'!I67)","v":""},{"$f":"'DryBatchWeights - ACI211'!$B$4","v":"Dry Batch Weights - ACI 211"},{"$f":"'DryBatchWeights - ACI211'!$B$27","v":"ACI 211 Mix Design"},{"$f":"'DryBatchWeights - ACI211'!$B$62","v":"Non Optimized Gradation"},{"$f":"'DryBatchWeights - ACI211'!$C$67","v":"Fine Aggregate 1:"},{"$f":"'DryBatchWeights - ACI211'!$I$28","v":"Absolute Vol. (ft3)"}]
[644,{"$f":"IF('DryBatchWeights - ACI211'!K67=\"\",\"\",'DryBatchWeights - ACI211'!K67)","v":""},{"$f":"'DryBatchWeights - ACI211'!$B$4","v":"Dry Batch Weights - ACI 211"},{"$f":"'DryBatchWeights - ACI211'!$B$27","v":"ACI 211 Mix Design"},{"$f":"'DryBatchWeights - ACI211'!$B$62","v":"Non Optimized Gradation"},{"$f":"'DryBatchWeights - ACI211'!$C$67","v":"Fine Aggregate 1:"},{"$f":"'DryBatchWeights - ACI211'!$K$28","v":"SSD Weight (lbs/CY)"}]
[645,{"$f":"IF('DryBatchWeights - ACI211'!F68=\"\",\"\",'DryBatchWeights - ACI211'!F68)","v":""},{"$f":"'DryBatchWeights - ACI211'!$B$4","v":"Dry Batch Weights - ACI 211"},{"$f":"'DryBatchWeights - ACI211'!$B$27","v":"ACI 211 Mix Design"},{"$f":"'DryBatchWeights - ACI211'!$B$62","v":"Non Optimized Gradation"},{"$f":"'DryBatchWeights - ACI211'!$C$68","v":"Fine Aggregate 2:"},{"$f":"'DryBatchWeights - ACI211'!$F$28","v":"Producer/Source"}]
[646,{"$f":"IF('DryBatchWeights - ACI211'!H68=\"\",\"\",'DryBatchWeights - ACI211'!H68)","v":""},{"$f":"'DryBatchWeights - ACI211'!$B$4","v":"Dry Batch Weights - ACI 211"},{"$f":"'DryBatchWeights - ACI211'!$B$27","v":"ACI 211 Mix Design"},{"$f":"'DryBatchWeights - ACI211'!$B$62","v":"Non Optimized Gradation"},{"$f":"'DryBatchWeights - ACI211'!$C$68","v":"Fine Aggregate 2:"},{"$f":"'DryBatchWeights - ACI211'!$H$28","v":"% or\nDosage"}]
[647,{"$f":"IF('DryBatchWeights - ACI211'!I68=\"\",\"\",'DryBatchWeights - ACI211'!I68)","v":""},{"$f":"'DryBatchWeights - ACI211'!$B$4","v":"Dry Batch Weights - ACI 211"},{"$f":"'DryBatchWeights - ACI211'!$B$27","v":"ACI 211 Mix Design"},{"$f":"'DryBatchWeights - ACI211'!$B$62","v":"Non Optimized Gradation"},{"$f":"'DryBatchWeights - ACI211'!$C$68","v":"Fine Aggregate 2:"},{"$f":"'DryBatchWeights - ACI211'!$I$28","v":"Absolute Vol. (ft3)"}]
[648,{"$f":"IF('DryBatchWeights - ACI211'!K68=\"\",\"\",'DryBatchWeights - ACI211'!K68)","v":""},{"$f":"'DryBatchWeights - ACI211'!$B$4","v":"Dry Batch Weights - ACI 211"},{"$f":"'DryBatchWeights - ACI211'!$B$27","v":"ACI 211 Mix Design"},{"$f":"'DryBatchWeights - ACI211'!$B$62","v":"Non Optimized Gradation"},{"$f":"'DryBatchWeights - ACI211'!$C$68","v":"Fine Aggregate 2:"},{"$f":"'DryBatchWeights - ACI211'!$K$28","v":"SSD Weight (lbs/CY)"}]
[649,{"$f":"IF('Batch Weights'!D7=\"\",\"\",'Batch Weights'!D7)","v":""},{"$f":"'Batch Weights'!$B$4","v":"Batch Weights"},{"$f":"'Batch Weights'!D6","v":"Coarse Agg. 1"},{"$f":"'Batch Weights'!$C$7","v":"Moisture Content, %:"}]
[650,{"$f":"IF('Batch Weights'!E7=\"\",\"\",'Batch Weights'!E7)","v":""},{"$f":"'Batch Weights'!$B$4","v":"Batch Weights"},{"$f":"'Batch Weights'!E6","v":"Coarse Agg. 2"},{"$f":"'Batch Weights'!$C$7","v":"Moisture Content, %:"}]
[651,{"$f":"IF('Batch Weights'!F7=\"\",\"\",'Batch Weights'!F7)","v":""},{"$f":"'Batch Weights'!$B$4","v":"Batch Weights"},{"$f":"'Batch Weights'!F6","v":"Interm. Agg. 1"},{"$f":"'Batch Weights'!$C$7","v":"Moisture Content, %:"}]
[652,{"$f":"IF('Batch Weights'!G7=\"\",\"\",'Batch Weights'!G7)","v":""},{"$f":"'Batch Weights'!$B$4","v":"Batch Weights"},{"$f":"'Batch Weights'!G6","v":"Interm. Agg. 2"},{"$f":"'Batch Weights'!$C$7","v":"Moisture Content, %:"}]
[653,{"$f":"IF('Batch Weights'!H7=\"\",\"\",'Batch Weights'!H7)","v":""},{"$f":"'Batch Weights'!$B$4","v":"Batch Weights"},{"$f":"'Batch Weights'!H6","v":"Fine Agg. 1"},{"$f":"'Batch Weights'!$C$7","v":"Moisture Content, %:"}]
[654,{"$f":"IF('Batch Weights'!I7=\"\",\"\",'Batch Weights'!I7)","v":""},{"$f":"'Batch Weights'!$B$4","v":"Batch Weights"},{"$f":"'Batch Weights'!I6","v":"Fine Agg. 2"},{"$f":"'Batch Weights'!$C$7","v":"Moisture Content, %:"}]
[655,{"$f":"IF('Batch Weights'!M7=\"\",\"\",'Batch Weights'!M7)","v":""},{"$f":"'Batch Weights'!$B$4","v":"Batch Weights"},{"$f":"'Batch Weights'!$M$6","v":"Batch Size"}]
[656,{"$f":"IF('Batch Weights'!N7=\"\",\"\",'Batch Weights'!N7)","v":""},{"$f":"'Batch Weights'!$B$4","v":"Batch Weights"},{"$f":"'Batch Weights'!$M$6","v":"Batch Size"}]
[657,{"$f":"IF('Batch Weights'!K10=\"\",\"\",'Batch Weights'!K10)","v":""},{"$f":"'Batch Weights'!$B$4","v":"Batch Weights"},{"$f":"'Batch Weights'!B10","v":"Basic Water Demand:"},{"$f":"'Batch Weights'!$K$9","v":"MC Weight lb (fl.oz.)/CY"}]
[658,{"$f":"IF('Batch Weights'!K11=\"\",\"\",'Batch Weights'!K11)","v":""},{"$f":"'Batch Weights'!$B$4","v":"Batch Weights"},{"$f":"'Batch Weights'!B11","v":"Hydraulic cement:"},{"$f":"'Batch Weights'!$K$9","v":"MC Weight lb (fl.oz.)/CY"}]
[659,{"$f":"IF('Batch Weights'!K12=\"\",\"\",'Batch Weights'!K12)","v":""},{"$f":"'Batch Weights'!$B$4","v":"Batch Weights"},{"$f":"'Batch Weights'!B12","v":""},{"$f":"'Batch Weights'!$K$9","v":"MC Weight lb (fl.oz.)/CY"}]
[660,{"$f":"IF('Batch Weights'!K13=\"\",\"\",'Batch Weights'!K13)","v":""},{"$f":"'Batch Weights'!$B$4","v":"Batch Weights"},{"$f":"'Batch Weights'!B13","v":""},{"$f":"'Batch Weights'!$K$9","v":"MC Weight lb (fl.oz.)/CY"}]
[661,{"$f":"IF('Batch Weights'!K14=\"\",\"\",'Batch Weights'!K14)","v":""},{"$f":"'Batch Weights'!$B$4","v":"Batch Weights"},{"$f":"'Batch Weights'!B14","v":""},{"$f":"'Batch Weights'!$K$9","v":"MC Weight lb (fl.oz.)/CY"}]
[662,{"$f":"IF('Batch Weights'!K15=\"\",\"\",'Batch Weights'!K15)","v":""},{"$f":"'Batch Weights'!$B$4","v":"Batch Weights"},{"$f":"'Batch Weights'!B15","v":""},{"$f":"'Batch Weights'!$K$9","v":"MC Weight lb (fl.oz.)/CY"}]
[663,{"$f":"IF('Batch Weights'!K16=\"\",\"\",'Batch Weights'!K16)","v":""},{"$f":"'Batch Weights'!$B$4","v":"Batch Weights"},{"$f":"'Batch Weights'!B16","v":""},{"$f":"'Batch Weights'!$K$9","v":"MC Weight lb (fl.oz.)/CY"}]
[664,{"$f":"IF('Batch Weights'!K17=\"\",\"\",'Batch Weights'!K17)","v":""},{"$f":"'Batch Weights'!$B$4","v":"Batch Weights"},{"$f":"'Batch Weights'!B17","v":""},{"$f":"'Batch Weights'!$K$9","v":"MC Weight lb (fl.oz.)/CY"}]
[665,{"$f":"IF('Batch Weights'!K18=\"\",\"\",'Batch Weights'!K18)","v":""},{"$f":"'Batch Weights'!$B$4","v":"Batch Weights"},{"$f":"'Batch Weights'!B18","v":""},{"$f":"'Batch Weights'!$K$9","v":"MC Weight lb (fl.oz.)/CY"}]
[666,{"$f":"IF('Batch Weights'!K19=\"\",\"\",'Batch Weights'!K19)","v":""},{"$f":"'Batch Weights'!$B$4","v":"Batch Weights"},{"$f":"'Batch Weights'!B19","v":""},{"$f":"'Batch Weights'!$K$9","v":"MC Weight lb (fl.oz.)/CY"}]
[667,{"$f":"IF('Batch Weights'!K20=\"\",\"\",'Batch Weights'!K20)","v":""},{"$f":"'Batch Weights'!$B$4","v":"Batch Weights"},{"$f":"'Batch Weights'!B20","v":""},{"$f":"'Batch Weights'!$K$9","v":"MC Weight lb (fl.oz.)/CY"}]
[668,{"$f":"IF('Batch Weights'!K21=\"\",\"\",'Batch Weights'!K21)","v":""},{"$f":"'Batch Weights'!$B$4","v":"Batch Weights"},{"$f":"'Batch Weights'!B21","v":""},{"$f":"'Batch Weights'!$K$9","v":"MC Weight lb (fl.oz.)/CY"}]
[669,{"$f":"IF('Batch Weights'!K22=\"\",\"\",'Batch Weights'!K22)","v":""},{"$f":"'Batch Weights'!$B$4","v":"Batch Weights"},{"$f":"'Batch Weights'!B22","v":""},{"$f":"'Batch Weights'!$K$9","v":"MC Weight lb (fl.oz.)/CY"}]
[670,{"$f":"IF('Batch Weights'!K23=\"\",\"\",'Batch Weights'!K23)","v":""},{"$f":"'Batch Weights'!$B$4","v":"Batch Weights"},{"$f":"'Batch Weights'!B23","v":""},{"$f":"'Batch Weights'!$K$9","v":"MC Weight lb (fl.oz.)/CY"}]
[671,{"$f":"IF('Batch Weights'!K24=\"\",\"\",'Batch Weights'!K24)","v":""},{"$f":"'Batch Weights'!$B$4","v":"Batch Weights"},{"$f":"'Batch Weights'!B24","v":""},{"$f":"'Batch Weights'!$K$9","v":"MC Weight lb (fl.oz.)/CY"}]
[672,{"$f":"IF('Batch Weights'!K25=\"\",\"\",'Batch Weights'!K25)","v":""},{"$f":"'Batch Weights'!$B$4","v":"Batch Weights"},{"$f":"'Batch Weights'!B25","v":""},{"$f":"'Batch Weights'!$K$9","v":"MC Weight lb (fl.oz.)/CY"}]
[673,{"$f":"IF('Batch Weights'!K26=\"\",\"\",'Batch Weights'!K26)","v":""},{"$f":"'Batch Weights'!$B$4","v":"Batch Weights"},{"$f":"'Batch Weights'!B26","v":""},{"$f":"'Batch Weights'!$K$9","v":"MC Weight lb (fl.oz.)/CY"}]
[674,{"$f":"IF('Batch Weights'!K27=\"\",\"\",'Batch Weights'!K27)","v":""},{"$f":"'Batch Weights'!$B$4","v":"Batch Weights"},{"$f":"'Batch Weights'!B27","v":""},{"$f":"'Batch Weights'!$K$9","v":"MC Weight lb (fl.oz.)/CY"}]
[675,{"$f":"IF('Batch Weights'!K28=\"\",\"\",'Batch Weights'!K28)","v":""},{"$f":"'Batch Weights'!$B$4","v":"Batch Weights"},{"$f":"'Batch Weights'!B28","v":""},{"$f":"'Batch Weights'!$K$9","v":"MC Weight lb (fl.oz.)/CY"}]
[676,{"$f":"IF('Batch Weights'!K29=\"\",\"\",'Batch Weights'!K29)","v":""},{"$f":"'Batch Weights'!$B$4","v":"Batch Weights"},{"$f":"'Batch Weights'!B29","v":"Fibers:"},{"$f":"'Batch Weights'!$K$9","v":"MC Weight lb (fl.oz.)/CY"}]
[677,{"$f":"IF('Batch Weights'!K30=\"\",\"\",'Batch Weights'!K30)","v":""},{"$f":"'Batch Weights'!$B$4","v":"Batch Weights"},{"$f":"'Batch Weights'!B30","v":""},{"$f":"'Batch Weights'!$K$9","v":"MC Weight lb (fl.oz.)/CY"}]
[678,{"$f":"IF('Batch Weights'!K31=\"\",\"\",'Batch Weights'!K31)","v":""},{"$f":"'Batch Weights'!$B$4","v":"Batch Weights"},{"$f":"'Batch Weights'!B31","v":"Coarse Aggregate 1:"},{"$f":"'Batch Weights'!$K$9","v":"MC Weight lb (fl.oz.)/CY"}]
[679,{"$f":"IF('Batch Weights'!K32=\"\",\"\",'Batch Weights'!K32)","v":""},{"$f":"'Batch Weights'!$B$4","v":"Batch Weights"},{"$f":"'Batch Weights'!B32","v":"Coarse Aggregate 2:"},{"$f":"'Batch Weights'!$K$9","v":"MC Weight lb (fl.oz.)/CY"}]
[680,{"$f":"IF('Batch Weights'!K33=\"\",\"\",'Batch Weights'!K33)","v":""},{"$f":"'Batch Weights'!$B$4","v":"Batch Weights"},{"$f":"'Batch Weights'!B33","v":"Intermediate Aggregate 1:"},{"$f":"'Batch Weights'!$K$9","v":"MC Weight lb (fl.oz.)/CY"}]
[681,{"$f":"IF('Batch Weights'!K34=\"\",\"\",'Batch Weights'!K34)","v":""},{"$f":"'Batch Weights'!$B$4","v":"Batch Weights"},{"$f":"'Batch Weights'!B34","v":"Intermediate Aggregate 2:"},{"$f":"'Batch Weights'!$K$9","v":"MC Weight lb (fl.oz.)/CY"}]
[682,{"$f":"IF('Batch Weights'!K35=\"\",\"\",'Batch Weights'!K35)","v":""},{"$f":"'Batch Weights'!$B$4","v":"Batch Weights"},{"$f":"'Batch Weights'!B35","v":"Fine Aggregate 1:"},{"$f":"'Batch Weights'!$K$9","v":"MC Weight lb (fl.oz.)/CY"}]
[683,{"$f":"IF('Batch Weights'!K36=\"\",\"\",'Batch Weights'!K36)","v":""},{"$f":"'Batch Weights'!$B$4","v":"Batch Weights"},{"$f":"'Batch Weights'!B36","v":"Fine Aggregate 2:"},{"$f":"'Batch Weights'!$K$9","v":"MC Weight lb (fl.oz.)/CY"}]
[684,{"$f":"IF('Batch Weights'!M10=\"\",\"\",'Batch Weights'!M10)","v":""},{"$f":"'Batch Weights'!$B$4","v":"Batch Weights"},{"$f":"'Batch Weights'!B10","v":"Basic Water Demand:"},{"$f":"'Batch Weights'!M9","v":""}]
[685,{"$f":"IF('Batch Weights'!M11=\"\",\"\",'Batch Weights'!M11)","v":""},{"$f":"'Batch Weights'!$B$4","v":"Batch Weights"},{"$f":"'Batch Weights'!B11","v":"Hydraulic cement:"},{"$f":"'Batch Weights'!M10","v":""}]
[686,{"$f":"IF('Batch Weights'!M12=\"\",\"\",'Batch Weights'!M12)","v":""},{"$f":"'Batch Weights'!$B$4","v":"Batch Weights"},{"$f":"'Batch Weights'!B12","v":""},{"$f":"'Batch Weights'!M11","v":""}]
[687,{"$f":"IF('Batch Weights'!M13=\"\",\"\",'Batch Weights'!M13)","v":""},{"$f":"'Batch Weights'!$B$4","v":"Batch Weights"},{"$f":"'Batch Weights'!B13","v":""},{"$f":"'Batch Weights'!M12","v":""}]
[688,{"$f":"IF('Batch Weights'!M14=\"\",\"\",'Batch Weights'!M14)","v":""},{"$f":"'Batch Weights'!$B$4","v":"Batch Weights"},{"$f":"'Batch Weights'!B14","v":""},{"$f":"'Batch Weights'!M13","v":""}]
[689,{"$f":"IF('Batch Weights'!M15=\"\",\"\",'Batch Weights'!M15)","v":""},{"$f":"'Batch Weights'!$B$4","v":"Batch Weights"},{"$f":"'Batch Weights'!B15","v":""},{"$f":"'Batch Weights'!M14","v":""}]
[690,{"$f":"IF('Batch Weights'!M16=\"\",\"\",'Batch Weights'!M16)","v":""},{"$f":"'Batch Weights'!$B$4","v":"Batch Weights"},{"$f":"'Batch Weights'!B16","v":""},{"$f":"'Batch Weights'!M15","v":""}]
[691,{"$f":"IF('Batch Weights'!M17=\"\",\"\",'Batch Weights'!M17)","v":""},{"$f":"'Batch Weights'!$B$4","v":"Batch Weights"},{"$f":"'Batch Weights'!B17","v":""},{"$f":"'Batch Weights'!M16","v":""}]
[692,{"$f":"IF('Batch Weights'!M18=\"\",\"\",'Batch Weights'!M18)","v":""},{"$f":"'Batch Weights'!$B$4","v":"Batch Weights"},{"$f":"'Batch Weights'!B18","v":""},{"$f":"'Batch Weights'!M17","v":""}]
[693,{"$f":"IF('Batch Weights'!M19=\"\",\"\",'Batch Weights'!M19)","v":""},{"$f":"'Batch Weights'!$B$4","v":"Batch Weights"},{"$f":"'Batch Weights'!B19","v":""},{"$f":"'Batch Weights'!M18","v":""}]
[694,{"$f":"IF('Batch Weights'!M20=\"\",\"\",'Batch Weights'!M20)","v":""},{"$f":"'Batch Weights'!$B$4","v":"Batch Weights"},{"$f":"'Batch Weights'!B20","v":""},{"$f":"'Batch Weights'!M19","v":""}]
[695,{"$f":"IF('Batch Weights'!M21=\"\",\"\",'Batch Weights'!M21)","v":""},{"$f":"'Batch Weights'!$B$4","v":"Batch Weights"},{"$f":"'Batch Weights'!B21","v":""},{"$f":"'Batch Weights'!M20","v":""}]
[696,{"$f":"IF('Batch Weights'!M22=\"\",\"\",'Batch Weights'!M22)","v":""},{"$f":"'Batch Weights'!$B$4","v":"Batch Weights"},{"$f":"'Batch Weights'!B22","v":""},{"$f":"'Batch Weights'!M21","v":""}]
[697,{"$f":"IF('Batch Weights'!M23=\"\",\"\",'Batch Weights'!M23)","v":""},{"$f":"'Batch Weights'!$B$4","v":"Batch Weights"},{"$f":"'Batch Weights'!B23","v":""},{"$f":"'Batch Weights'!M22","v":""}]
[698,{"$f":"IF('Batch Weights'!M24=\"\",\"\",'Batch Weights'!M24)","v":""},{"$f":"'Batch Weights'!$B$4","v":"Batch Weights"},{"$f":"'Batch Weights'!B24","v":""},{"$f":"'Batch Weights'!M23","v":""}]
[699,{"$f":"IF('Batch Weights'!M25=\"\",\"\",'Batch Weights'!M25)","v":""},{"$f":"'Batch Weights'!$B$4","v":"Batch Weights"},{"$f":"'Batch Weights'!B25","v":""},{"$f":"'Batch Weights'!M24","v":""}]
[700,{"$f":"IF('Batch Weights'!M26=\"\",\"\",'Batch Weights'!M26)","v":""},{"$f":"'Batch Weights'!$B$4","v":"Batch Weights"},{"$f":"'Batch Weights'!B26","v":""},{"$f":"'Batch Weights'!M25","v":""}]
[701,{"$f":"IF('Batch Weights'!M27=\"\",\"\",'Batch Weights'!M27)","v":""},{"$f":"'Batch Weights'!$B$4","v":"Batch Weights"},{"$f":"'Batch Weights'!B27","v":""},{"$f":"'Batch Weights'!M26","v":""}]
[702,{"$f":"IF('Batch Weights'!M28=\"\",\"\",'Batch Weights'!M28)","v":""},{"$f":"'Batch Weights'!$B$4","v":"Batch Weights"},{"$f":"'Batch Weights'!B28","v":""},{"$f":"'Batch Weights'!M27","v":""}]
[703,{"$f":"IF('Batch Weights'!M29=\"\",\"\",'Batch Weights'!M29)","v":""},{"$f":"'Batch Weights'!$B$4","v":"Batch Weights"},{"$f":"'Batch Weights'!B29","v":"Fibers:"},{"$f":"'Batch Weights'!M28","v":""}]
[704,{"$f":"IF('Batch Weights'!M30=\"\",\"\",'Batch Weights'!M30)","v":""},{"$f":"'Batch Weights'!$B$4","v":"Batch Weights"},{"$f":"'Batch Weights'!B30","v":""},{"$f":"'Batch Weights'!M29","v":""}]
[705,{"$f":"IF('Batch Weights'!M31=\"\",\"\",'Batch Weights'!M31)","v":""},{"$f":"'Batch Weights'!$B$4","v":"Batch Weights"},{"$f":"'Batch Weights'!B31","v":"Coarse Aggregate 1:"},{"$f":"'Batch Weights'!M30","v":""}]
[706,{"$f":"IF('Batch Weights'!M32=\"\",\"\",'Batch Weights'!M32)","v":""},{"$f":"'Batch Weights'!$B$4","v":"Batch Weights"},{"$f":"'Batch Weights'!B32","v":"Coarse Aggregate 2:"},{"$f":"'Batch Weights'!M31","v":""}]
[707,{"$f":"IF('Batch Weights'!M33=\"\",\"\",'Batch Weights'!M33)","v":""},{"$f":"'Batch Weights'!$B$4","v":"Batch Weights"},{"$f":"'Batch Weights'!B33","v":"Intermediate Aggregate 1:"},{"$f":"'Batch Weights'!M32","v":""}]
[708,{"$f":"IF('Batch Weights'!M34=\"\",\"\",'Batch Weights'!M34)","v":""},{"$f":"'Batch Weights'!$B$4","v":"Batch Weights"},{"$f":"'Batch Weights'!B34","v":"Intermediate Aggregate 2:"},{"$f":"'Batch Weights'!M33","v":""}]
[709,{"$f":"IF('Batch Weights'!M35=\"\",\"\",'Batch Weights'!M35)","v":""},{"$f":"'Batch Weights'!$B$4","v":"Batch Weights"},{"$f":"'Batch Weights'!B35","v":"Fine Aggregate 1:"},{"$f":"'Batch Weights'!M34","v":""}]
[710,{"$f":"IF('Batch Weights'!M36=\"\",\"\",'Batch Weights'!M36)","v":""},{"$f":"'Batch Weights'!$B$4","v":"Batch Weights"},{"$f":"'Batch Weights'!B36","v":"Fine Aggregate 2:"},{"$f":"'Batch Weights'!M35","v":""}]
[711,{"$f":"IF('Trial Batch Results'!E6=\"\",\"\",'Trial Batch Results'!E6)","v":""},{"$f":"'Trial Batch Results'!$B$4","v":"Trial Batch Results"},{"$f":"'Trial Batch Results'!D6","v":"Are these results for SCC?"}]
[712,{"$f":"IF('Trial Batch Results'!F9=\"\",\"\",'Trial Batch Results'!F9)","v":""},{"$f":"'Trial Batch Results'!$B$4","v":"Trial Batch Results"},{"$f":"'Trial Batch Results'!D9","v":"Slump Flow for Precast Concrete:"},{"$f":"'Trial Batch Results'!G8","v":"Acceptable?"}]
[713,{"$f":"IF('Trial Batch Results'!F10=\"\",\"\",'Trial Batch Results'!F10)","v":""},{"$f":"'Trial Batch Results'!$B$4","v":"Trial Batch Results"},{"$f":"'Trial Batch Results'!D10","v":"Slump Flow for Drilled Shafts:"},{"$f":"'Trial Batch Results'!G8","v":"Acceptable?"}]
[714,{"$f":"IF('Trial Batch Results'!F11=\"\",\"\",'Trial Batch Results'!F11)","v":""},{"$f":"'Trial Batch Results'!$B$4","v":"Trial Batch Results"},{"$f":"'Trial Batch Results'!D11","v":"T50, sec:"},{"$f":"'Trial Batch Results'!G8","v":"Acceptable?"}]
[715,{"$f":"IF('Trial Batch Results'!F12=\"\",\"\",'Trial Batch Results'!F12)","v":""},{"$f":"'Trial Batch Results'!$B$4","v":"Trial Batch Results"},{"$f":"'Trial Batch Results'!D12","v":"VSI Rating:"},{"$f":"'Trial Batch Results'!G8","v":"Acceptable?"}]
[716,{"$f":"IF('Trial Batch Results'!F13=\"\",\"\",'Trial Batch Results'!F13)","v":""},{"$f":"'Trial Batch Results'!$B$4","v":"Trial Batch Results"},{"$f":"'Trial Batch Results'!D13","v":"Passing Ability, in.:"},{"$f":"'Trial Batch Results'!G8","v":"Acceptable?"}]
[717,{"$f":"IF('Trial Batch Results'!F14=\"\",\"\",'Trial Batch Results'!F14)","v":""},{"$f":"'Trial Batch Results'!$B$4","v":"Trial Batch Results"},{"$f":"'Trial Batch Results'!D14","v":"Segregation Column, %:"},{"$f":"'Trial Batch Results'!G8","v":"Acceptable?"}]
[718,{"$f":"IF('Trial Batch Results'!F15=\"\",\"\",'Trial Batch Results'!F15)","v":""},{"$f":"'Trial Batch Results'!$B$4","v":"Trial Batch Results"},{"$f":"'Trial Batch Results'!D15","v":"Bleeding, %:"},{"$f":"'Trial Batch Results'!G8","v":"Acceptable?"}]
[719,{"$f":"IF('Trial Batch Results'!D20=\"\",\"\",'Trial Batch Results'!D20)","v":""},{"$f":"'Trial Batch Results'!$B$4","v":"Trial Batch Results"},{"$f":"'Trial Batch Results'!C17","v":"Slump"},{"$f":"'Trial Batch Results'!D19","v":"Trial Batch Slump, in."}]
[720,{"$f":"IF('Trial Batch Results'!G20=\"\",\"\",'Trial Batch Results'!G20)","v":""},{"$f":"'Trial Batch Results'!$B$4","v":"Trial Batch Results"},{"$f":"'Trial Batch Results'!G17","v":"Temperature"},{"$f":"'Trial Batch Results'!G19","v":"Temperature, °F"}]
[721,{"$f":"IF('Trial Batch Results'!B23=\"\",\"\",'Trial Batch Results'!B23)","v":""},{"$f":"'Trial Batch Results'!$B$4","v":"Trial Batch Results"},{"$f":"'Trial Batch Results'!B22","v":"Air Content"}]
[722,{"$f":"IF('Trial Batch Results'!E24=\"\",\"\",'Trial Batch Results'!E24)","v":0},{"$f":"'Trial Batch Results'!$B$4","v":"Trial Batch Results"},{"$f":"'Trial Batch Results'!$B$22","v":"Air Content"},{"$f":"'Trial Batch Results'!B24","v":"Design Air, %:"}]
[723,{"$f":"IF('Trial Batch Results'!E25=\"\",\"\",'Trial Batch Results'!E25)","v":""},{"$f":"'Trial Batch Results'!$B$4","v":"Trial Batch Results"},{"$f":"'Trial Batch Results'!$B$22","v":"Air Content"},{"$f":"'Trial Batch Results'!B25","v":""}]
[724,{"$f":"IF('Trial Batch Results'!E26=\"\",\"\",'Trial Batch Results'!E26)","v":""},{"$f":"'Trial Batch Results'!$B$4","v":"Trial Batch Results"},{"$f":"'Trial Batch Results'!$B$22","v":"Air Content"},{"$f":"'Trial Batch Results'!B26","v":""}]
[725,{"$f":"IF('Trial Batch Results'!E27=\"\",\"\",'Trial Batch Results'!E27)","v":""},{"$f":"'Trial Batch Results'!$B$4","v":"Trial Batch Results"},{"$f":"'Trial Batch Results'!$B$22","v":"Air Content"},{"$f":"'Trial Batch Results'!B27","v":""}]
[726,{"$f":"IF('Trial Batch Results'!E28=\"\",\"\",'Trial Batch Results'!E28)","v":0},{"$f":"'Trial Batch Results'!$B$4","v":"Trial Batch Results"},{"$f":"'Trial Batch Results'!$B$22","v":"Air Content"},{"$f":"'Trial Batch Results'!B28","v":""}]
[727,{"$f":"IF('Trial Batch Results'!J24=\"\",\"\",'Trial Batch Results'!J24)","v":""},{"$f":"'Trial Batch Results'!$B$4","v":"Trial Batch Results"},{"$f":"'Trial Batch Results'!$G$22","v":"Unit Weight"},{"$f":"'Trial Batch Results'!G24","v":"Design Unit Weight, lb/cu.ft.:"}]
[728,{"$f":"IF('Trial Batch Results'!J25=\"\",\"\",'Trial Batch Results'!J25)","v":""},{"$f":"'Trial Batch Results'!$B$4","v":"Trial Batch Results"},{"$f":"'Trial Batch Results'!$G$22","v":"Unit Weight"},{"$f":"'Trial Batch Results'!G25","v":"Mass of bucket, lb.:"}]
[729,{"$f":"IF('Trial Batch Results'!J26=\"\",\"\",'Trial Batch Results'!J26)","v":""},{"$f":"'Trial Batch Results'!$B$4","v":"Trial Batch Results"},{"$f":"'Trial Batch Results'!$G$22","v":"Unit Weight"},{"$f":"'Trial Batch Results'!G26","v":"Volumn of bucket, cu.ft.:"}]
[730,{"$f":"IF('Trial Batch Results'!J27=\"\",\"\",'Trial Batch Results'!J27)","v":""},{"$f":"'Trial Batch Results'!$B$4","v":"Trial Batch Results"},{"$f":"'Trial Batch Results'!$G$22","v":"Unit Weight"},{"$f":"'Trial Batch Results'!G27","v":"Mass of concrete filled bucket, lb.:"}]
[731,{"$f":"IF('Trial Batch Results'!J28=\"\",\"\",'Trial Batch Results'!J28)","v":""},{"$f":"'Trial Batch Results'!$B$4","v":"Trial Batch Results"},{"$f":"'Trial Batch Results'!$G$22","v":"Unit Weight"},{"$f":"'Trial Batch Results'!G28","v":"Unit Weight of concrete, lb/cu.ft.:"}]
[732,{"$f":"IF('Trial Batch Results'!C36=\"\",\"\",'Trial Batch Results'!C36)","v":""},{"$f":"'Trial Batch Results'!$B$4","v":"Trial Batch Results"},{"$f":"'Trial Batch Results'!$B$30","v":"Compressive Strength"},{"$f":"'Trial Batch Results'!$C$35","v":"Cylinder Number"},{"$f":"'Trial Batch Results'!$B$36","v":1}]
[733,{"$f":"IF('Trial Batch Results'!D36=\"\",\"\",'Trial Batch Results'!D36)","v":""},{"$f":"'Trial Batch Results'!$B$4","v":"Trial Batch Results"},{"$f":"'Trial Batch Results'!$B$30","v":"Compressive Strength"},{"$f":"'Trial Batch Results'!$D$35","v":"Age"},{"$f":"'Trial Batch Results'!$B$36","v":1}]
[734,{"$f":"IF('Trial Batch Results'!E36=\"\",\"\",'Trial Batch Results'!E36)","v":""},{"$f":"'Trial Batch Results'!$B$4","v":"Trial Batch Results"},{"$f":"'Trial Batch Results'!$B$30","v":"Compressive Strength"},{"$f":"'Trial Batch Results'!$E$35","v":"Diameter of Cylinder"},{"$f":"'Trial Batch Results'!$B$36","v":1}]
[735,{"$f":"IF('Trial Batch Results'!F36=\"\",\"\",'Trial Batch Results'!F36)","v":""},{"$f":"'Trial Batch Results'!$B$4","v":"Trial Batch Results"},{"$f":"'Trial Batch Results'!$B$30","v":"Compressive Strength"},{"$f":"'Trial Batch Results'!$F$35","v":"Length of Cylinder,\nin."},{"$f":"'Trial Batch Results'!$B$36","v":1}]
[736,{"$f":"IF('Trial Batch Results'!G36=\"\",\"\",'Trial Batch Results'!G36)","v":""},{"$f":"'Trial Batch Results'!$B$4","v":"Trial Batch Results"},{"$f":"'Trial Batch Results'!$B$30","v":"Compressive Strength"},{"$f":"'Trial Batch Results'!$G$35","v":"Length to Diameter Ratio"},{"$f":"'Trial Batch Results'!$B$36","v":1}]
[737,{"$f":"IF('Trial Batch Results'!H36=\"\",\"\",'Trial Batch Results'!H36)","v":""},{"$f":"'Trial Batch Results'!$B$4","v":"Trial Batch Results"},{"$f":"'Trial Batch Results'!$B$30","v":"Compressive Strength"},{"$f":"'Trial Batch Results'!$H$35","v":"Maximum Load,\nlbs."},{"$f":"'Trial Batch Results'!$B$36","v":1}]
[738,{"$f":"IF('Trial Batch Results'!I36=\"\",\"\",'Trial Batch Results'!I36)","v":""},{"$f":"'Trial Batch Results'!$B$4","v":"Trial Batch Results"},{"$f":"'Trial Batch Results'!$B$30","v":"Compressive Strength"},{"$f":"'Trial Batch Results'!$I$35","v":"Failure Type"},{"$f":"'Trial Batch Results'!$B$36","v":1}]
[739,{"$f":"IF('Trial Batch Results'!K36=\"\",\"\",'Trial Batch Results'!K36)","v":""},{"$f":"'Trial Batch Results'!$B$4","v":"Trial Batch Results"},{"$f":"'Trial Batch Results'!$B$30","v":"Compressive Strength"},{"$f":"'Trial Batch Results'!$K$35","v":"Correction Factor"},{"$f":"'Trial Batch Results'!$B$36","v":1}]
[740,{"$f":"IF('Trial Batch Results'!L36=\"\",\"\",'Trial Batch Results'!L36)","v":""},{"$f":"'Trial Batch Results'!$B$4","v":"Trial Batch Results"},{"$f":"'Trial Batch Results'!$B$30","v":"Compressive Strength"},{"$f":"'Trial Batch Results'!$L$35","v":"Compressive Strength,\npsi"},{"$f":"'Trial Batch Results'!$B$36","v":1}]
[741,{"$f":"IF('Trial Batch Results'!M36=\"\",\"\",'Trial Batch Results'!M36)","v":""},{"$f":"'Trial Batch Results'!$B$4","v":"Trial Batch Results"},{"$f":"'Trial Batch Results'!$B$30","v":"Compressive Strength"},{"$f":"'Trial Batch Results'!$M$35","v":"Average Compressive Strength,\npsi"},{"$f":"'Trial Batch Results'!$B$36","v":1}]
[742,{"$f":"IF('Trial Batch Results'!C37=\"\",\"\",'Trial Batch Results'!C37)","v":""},{"$f":"'Trial Batch Results'!$B$4","v":"Trial Batch Results"},{"$f":"'Trial Batch Results'!$B$30","v":"Compressive Strength"},{"$f":"'Trial Batch Results'!$C$35","v":"Cylinder Number"},{"$f":"'Trial Batch Results'!$B$37","v":2}]
[743,{"$f":"IF('Trial Batch Results'!E37=\"\",\"\",'Trial Batch Results'!E37)","v":""},{"$f":"'Trial Batch Results'!$B$4","v":"Trial Batch Results"},{"$f":"'Trial Batch Results'!$B$30","v":"Compressive Strength"},{"$f":"'Trial Batch Results'!$E$35","v":"Diameter of Cylinder"},{"$f":"'Trial Batch Results'!$B$37","v":2}]
[744,{"$f":"IF('Trial Batch Results'!F37=\"\",\"\",'Trial Batch Results'!F37)","v":""},{"$f":"'Trial Batch Results'!$B$4","v":"Trial Batch Results"},{"$f":"'Trial Batch Results'!$B$30","v":"Compressive Strength"},{"$f":"'Trial Batch Results'!$F$35","v":"Length of Cylinder,\nin."},{"$f":"'Trial Batch Results'!$B$37","v":2}]
[745,{"$f":"IF('Trial Batch Results'!G37=\"\",\"\",'Trial Batch Results'!G37)","v":""},{"$f":"'Trial Batch Results'!$B$4","v":"Trial Batch Results"},{"$f":"'Trial Batch Results'!$B$30","v":"Compressive Strength"},{"$f":"'Trial Batch Results'!$G$35","v":"Length to Diameter Ratio"},{"$f":"'Trial Batch Results'!$B$37","v":2}]
[746,{"$f":"IF('Trial Batch Results'!H37=\"\",\"\",'Trial Batch Results'!H37)","v":""},{"$f":"'Trial Batch Results'!$B$4","v":"Trial Batch Results"},{"$f":"'Trial Batch Results'!$B$30","v":"Compressive Strength"},{"$f":"'Trial Batch Results'!$H$35","v":"Maximum Load,\nlbs."},{"$f":"'Trial Batch Results'!$B$37","v":2}]
[747,{"$f":"IF('Trial Batch Results'!I37=\"\",\"\",'Trial Batch Results'!I37)","v":""},{"$f":"'Trial Batch Results'!$B$4","v":"Trial Batch Results"},{"$f":"'Trial Batch Results'!$B$30","v":"Compressive Strength"},{"$f":"'Trial Batch Results'!$I$35","v":"Failure Type"},{"$f":"'Trial Batch Results'!$B$37","v":2}]
[748,{"$f":"IF('Trial Batch Results'!K37=\"\",\"\",'Trial Batch Results'!K37)","v":""},{"$f":"'Trial Batch Results'!$B$4","v":"Trial Batch Results"},{"$f":"'Trial Batch Results'!$B$30","v":"Compressive Strength"},{"$f":"'Trial Batch Results'!$K$35","v":"Correction Factor"},{"$f":"'Trial Batch Results'!$B$37","v":2}]
[749,{"$f":"IF('Trial Batch Results'!L37=\"\",\"\",'Trial Batch Results'!L37)","v":""},{"$f":"'Trial Batch Results'!$B$4","v":"Trial Batch Results"},{"$f":"'Trial Batch Results'!$B$30","v":"Compressive Strength"},{"$f":"'Trial Batch Results'!$L$35","v":"Compressive Strength,\npsi"},{"$f":"'Trial Batch Results'!$B$37","v":2}]
[750,{"$f":"IF('Trial Batch Results'!C38=\"\",\"\",'Trial Batch Results'!C38)","v":""},{"$f":"'Trial Batch Results'!$B$4","v":"Trial Batch Results"},{"$f":"'Trial Batch Results'!$B$30","v":"Compressive Strength"},{"$f":"'Trial Batch Results'!$C$35","v":"Cylinder Number"},{"$f":"'Trial Batch Results'!$B$38","v":3}]
[751,{"$f":"IF('Trial Batch Results'!E38=\"\",\"\",'Trial Batch Results'!E38)","v":""},{"$f":"'Trial Batch Results'!$B$4","v":"Trial Batch Results"},{"$f":"'Trial Batch Results'!$B$30","v":"Compressive Strength"},{"$f":"'Trial Batch Results'!$E$35","v":"Diameter of Cylinder"},{"$f":"'Trial Batch Results'!$B$38","v":3}]
[752,{"$f":"IF('Trial Batch Results'!F38=\"\",\"\",'Trial Batch Results'!F38)","v":""},{"$f":"'Trial Batch Results'!$B$4","v":"Trial Batch Results"},{"$f":"'Trial Batch Results'!$B$30","v":"Compressive Strength"},{"$f":"'Trial Batch Results'!$F$35","v":"Length of Cylinder,\nin."},{"$f":"'Trial Batch Results'!$B$38","v":3}]
[753,{"$f":"IF('Trial Batch Results'!G38=\"\",\"\",'Trial Batch Results'!G38)","v":""},{"$f":"'Trial Batch Results'!$B$4","v":"Trial Batch Results"},{"$f":"'Trial Batch Results'!$B$30","v":"Compressive Strength"},{"$f":"'Trial Batch Results'!$G$35","v":"Length to Diameter Ratio"},{"$f":"'Trial Batch Results'!$B$38","v":3}]
[754,{"$f":"IF('Trial Batch Results'!H38=\"\",\"\",'Trial Batch Results'!H38)","v":""},{"$f":"'Trial Batch Results'!$B$4","v":"Trial Batch Results"},{"$f":"'Trial Batch Results'!$B$30","v":"Compressive Strength"},{"$f":"'Trial Batch Results'!$H$35","v":"Maximum Load,\nlbs."},{"$f":"'Trial Batch Results'!$B$38","v":3}]
[755,{"$f":"IF('Trial Batch Results'!I38=\"\",\"\",'Trial Batch Results'!I38)","v":""},{"$f":"'Trial Batch Results'!$B$4","v":"Trial Batch Results"},{"$f":"'Trial Batch Results'!$B$30","v":"Compressive Strength"},{"$f":"'Trial Batch Results'!$I$35","v":"Failure Type"},{"$f":"'Trial Batch Results'!$B$38","v":3}]
[756,{"$f":"IF('Trial Batch Results'!K38=\"\",\"\",'Trial Batch Results'!K38)","v":""},{"$f":"'Trial Batch Results'!$B$4","v":"Trial Batch Results"},{"$f":"'Trial Batch Results'!$B$30","v":"Compressive Strength"},{"$f":"'Trial Batch Results'!$K$35","v":"Correction Factor"},{"$f":"'Trial Batch Results'!$B$38","v":3}]
[757,{"$f":"IF('Trial Batch Results'!L38=\"\",\"\",'Trial Batch Results'!L38)","v":""},{"$f":"'Trial Batch Results'!$B$4","v":"Trial Batch Results"},{"$f":"'Trial Batch Results'!$B$30","v":"Compressive Strength"},{"$f":"'Trial Batch Results'!$L$35","v":"Compressive Strength,\npsi"},{"$f":"'Trial Batch Results'!$B$38","v":3}]
[758,{"$f":"IF('Trial Batch Results'!C39=\"\",\"\",'Trial Batch Results'!C39)","v":""},{"$f":"'Trial Batch Results'!$B$4","v":"Trial Batch Results"},{"$f":"'Trial Batch Results'!$B$30","v":"Compressive Strength"},{"$f":"'Trial Batch Results'!$C$35","v":"Cylinder Number"},{"$f":"'Trial Batch Results'!$B$39","v":4}]
[759,{"$f":"IF('Trial Batch Results'!D39=\"\",\"\",'Trial Batch Results'!D39)","v":""},{"$f":"'Trial Batch Results'!$B$4","v":"Trial Batch Results"},{"$f":"'Trial Batch Results'!$B$30","v":"Compressive Strength"},{"$f":"'Trial Batch Results'!$D$35","v":"Age"},{"$f":"'Trial Batch Results'!$B$39","v":4}]
[760,{"$f":"IF('Trial Batch Results'!E39=\"\",\"\",'Trial Batch Results'!E39)","v":""},{"$f":"'Trial Batch Results'!$B$4","v":"Trial Batch Results"},{"$f":"'Trial Batch Results'!$B$30","v":"Compressive Strength"},{"$f":"'Trial Batch Results'!$E$35","v":"Diameter of Cylinder"},{"$f":"'Trial Batch Results'!$B$39","v":4}]
[761,{"$f":"IF('Trial Batch Results'!F39=\"\",\"\",'Trial Batch Results'!F39)","v":""},{"$f":"'Trial Batch Results'!$B$4","v":"Trial Batch Results"},{"$f":"'Trial Batch Results'!$B$30","v":"Compressive Strength"},{"$f":"'Trial Batch Results'!$F$35","v":"Length of Cylinder,\nin."},{"$f":"'Trial Batch Results'!$B$39","v":4}]
[762,{"$f":"IF('Trial Batch Results'!G39=\"\",\"\",'Trial Batch Results'!G39)","v":""},{"$f":"'Trial Batch Results'!$B$4","v":"Trial Batch Results"},{"$f":"'Trial Batch Results'!$B$30","v":"Compressive Strength"},{"$f":"'Trial Batch Results'!$G$35","v":"Length to Diameter Ratio"},{"$f":"'Trial Batch Results'!$B$39","v":4}]
[763,{"$f":"IF('Trial Batch Results'!H39=\"\",\"\",'Trial Batch Results'!H39)","v":""},{"$f":"'Trial Batch Results'!$B$4","v":"Trial Batch Results"},{"$f":"'Trial Batch Results'!$B$30","v":"Compressive Strength"},{"$f":"'Trial Batch Results'!$H$35","v":"Maximum Load,\nlbs."},{"$f":"'Trial Batch Results'!$B$39","v":4}]
[764,{"$f":"IF('Trial Batch Results'!I39=\"\",\"\",'Trial Batch Results'!I39)","v":""},{"$f":"'Trial Batch Results'!$B$4","v":"Trial Batch Results"},{"$f":"'Trial Batch Results'!$B$30","v":"Compressive Strength"},{"$f":"'Trial Batch Results'!$I$35","v":"Failure Type"},{"$f":"'Trial Batch Results'!$B$39","v":4}]
[765,{"$f":"IF('Trial Batch Results'!K39=\"\",\"\",'Trial Batch Results'!K39)","v":""},{"$f":"'Trial Batch Results'!$B$4","v":"Trial Batch Results"},{"$f":"'Trial Batch Results'!$B$30","v":"Compressive Strength"},{"$f":"'Trial Batch Results'!$K$35","v":"Correction Factor"},{"$f":"'Trial Batch Results'!$B$39","v":4}]
[766,{"$f":"IF('Trial Batch Results'!L39=\"\",\"\",'Trial Batch Results'!L39)","v":""},{"$f":"'Trial Batch Results'!$B$4","v":"Trial Batch Results"},{"$f":"'Trial Batch Results'!$B$30","v":"Compressive Strength"},{"$f":"'Trial Batch Results'!$L$35","v":"Compressive Strength,\npsi"},{"$f":"'Trial Batch Results'!$B$39","v":4}]
[767,{"$f":"IF('Trial Batch Results'!M39=\"\",\"\",'Trial Batch Results'!M39)","v":""},{"$f":"'Trial Batch Results'!$B$4","v":"Trial Batch Results"},{"$f":"'Trial Batch Results'!$B$30","v":"Compressive Strength"},{"$f":"'Trial Batch Results'!$M$35","v":"Average Compressive Strength,\npsi"},{"$f":"'Trial Batch Results'!$B$39","v":4}]
[768,{"$f":"IF('Trial Batch Results'!C40=\"\",\"\",'Trial Batch Results'!C40)","v":""},{"$f":"'Trial Batch Results'!$B$4","v":"Trial Batch Results"},{"$f":"'Trial Batch Results'!$B$30","v":"Compressive Strength"},{"$f":"'Trial Batch Results'!$C$35","v":"Cylinder Number"},{"$f":"'Trial Batch Results'!$B$40","v":5}]
[769,{"$f":"IF('Trial Batch Results'!E40=\"\",\"\",'Trial Batch Results'!E40)","v":""},{"$f":"'Trial Batch Results'!$B$4","v":"Trial Batch Results"},{"$f":"'Trial Batch Results'!$B$30","v":"Compressive Strength"},{"$f":"'Trial Batch Results'!$E$35","v":"Diameter of Cylinder"},{"$f":"'Trial Batch Results'!$B$40","v":5}]
[770,{"$f":"IF('Trial Batch Results'!F40=\"\",\"\",'Trial Batch Results'!F40)","v":""},{"$f":"'Trial Batch Results'!$B$4","v":"Trial Batch Results"},{"$f":"'Trial Batch Results'!$B$30","v":"Compressive Strength"},{"$f":"'Trial Batch Results'!$F$35","v":"Length of Cylinder,\nin."},{"$f":"'Trial Batch Results'!$B$40","v":5}]
[771,{"$f":"IF('Trial Batch Results'!G40=\"\",\"\",'Trial Batch Results'!G40)","v":""},{"$f":"'Trial Batch Results'!$B$4","v":"Trial Batch Results"},{"$f":"'Trial Batch Results'!$B$30","v":"Compressive Strength"},{"$f":"'Trial Batch Results'!$G$35","v":"Length to Diameter Ratio"},{"$f":"'Trial Batch Results'!$B$40","v":5}]
[772,{"$f":"IF('Trial Batch Results'!H40=\"\",\"\",'Trial Batch Results'!H40)","v":""},{"$f":"'Trial Batch Results'!$B$4","v":"Trial Batch Results"},{"$f":"'Trial Batch Results'!$B$30","v":"Compressive Strength"},{"$f":"'Trial Batch Results'!$H$35","v":"Maximum Load,\nlbs."},{"$f":"'Trial Batch Results'!$B$40","v":5}]
[773,{"$f":"IF('Trial Batch Results'!I40=\"\",\"\",'Trial Batch Results'!I40)","v":""},{"$f":"'Trial Batch Results'!$B$4","v":"Trial Batch Results"},{"$f":"'Trial Batch Results'!$B$30","v":"Compressive Strength"},{"$f":"'Trial Batch Results'!$I$35","v":"Failure Type"},{"$f":"'Trial Batch Results'!$B$40","v":5}]
[774,{"$f":"IF('Trial Batch Results'!K40=\"\",\"\",'Trial Batch Results'!K40)","v":""},{"$f":"'Trial Batch Results'!$B$4","v":"Trial Batch Results"},{"$f":"'Trial Batch Results'!$B$30","v":"Compressive Strength"},{"$f":"'Trial Batch Results'!$K$35","v":"Correction Factor"},{"$f":"'Trial Batch Results'!$B$40","v":5}]
[775,{"$f":"IF('Trial Batch Results'!L40=\"\",\"\",'Trial Batch Results'!L40)","v":""},{"$f":"'Trial Batch Results'!$B$4","v":"Trial Batch Results"},{"$f":"'Trial Batch Results'!$B$30","v":"Compressive Strength"},{"$f":"'Trial Batch Results'!$L$35","v":"Compressive Strength,\npsi"},{"$f":"'Trial Batch Results'!$B$40","v":5}]
[776,{"$f":"IF('Trial Batch Results'!C41=\"\",\"\",'Trial Batch Results'!C41)","v":""},{"$f":"'Trial Batch Results'!$B$4","v":"Trial Batch Results"},{"$f":"'Trial Batch Results'!$B$30","v":"Compressive Strength"},{"$f":"'Trial Batch Results'!$C$35","v":"Cylinder Number"},{"$f":"'Trial Batch Results'!$B$41","v":6}]
[777,{"$f":"IF('Trial Batch Results'!E41=\"\",\"\",'Trial Batch Results'!E41)","v":""},{"$f":"'Trial Batch Results'!$B$4","v":"Trial Batch Results"},{"$f":"'Trial Batch Results'!$B$30","v":"Compressive Strength"},{"$f":"'Trial Batch Results'!$E$35","v":"Diameter of Cylinder"},{"$f":"'Trial Batch Results'!$B$41","v":6}]
[778,{"$f":"IF('Trial Batch Results'!F41=\"\",\"\",'Trial Batch Results'!F41)","v":""},{"$f":"'Trial Batch Results'!$B$4","v":"Trial Batch Results"},{"$f":"'Trial Batch Results'!$B$30","v":"Compressive Strength"},{"$f":"'Trial Batch Results'!$F$35","v":"Length of Cylinder,\nin."},{"$f":"'Trial Batch Results'!$B$41","v":6}]
[779,{"$f":"IF('Trial Batch Results'!G41=\"\",\"\",'Trial Batch Results'!G41)","v":""},{"$f":"'Trial Batch Results'!$B$4","v":"Trial Batch Results"},{"$f":"'Trial Batch Results'!$B$30","v":"Compressive Strength"},{"$f":"'Trial Batch Results'!$G$35","v":"Length to Diameter Ratio"},{"$f":"'Trial Batch Results'!$B$41","v":6}]
[780,{"$f":"IF('Trial Batch Results'!H41=\"\",\"\",'Trial Batch Results'!H41)","v":""},{"$f":"'Trial Batch Results'!$B$4","v":"Trial Batch Results"},{"$f":"'Trial Batch Results'!$B$30","v":"Compressive Strength"},{"$f":"'Trial Batch Results'!$H$35","v":"Maximum Load,\nlbs."},{"$f":"'Trial Batch Results'!$B$41","v":6}]
[781,{"$f":"IF('Trial Batch Results'!I41=\"\",\"\",'Trial Batch Results'!I41)","v":""},{"$f":"'Trial Batch Results'!$B$4","v":"Trial Batch Results"},{"$f":"'Trial Batch Results'!$B$30","v":"Compressive Strength"},{"$f":"'Trial Batch Results'!$I$35","v":"Failure Type"},{"$f":"'Trial Batch Results'!$B$41","v":6}]
[782,{"$f":"IF('Trial Batch Results'!K41=\"\",\"\",'Trial Batch Results'!K41)","v":""},{"$f":"'Trial Batch Results'!$B$4","v":"Trial Batch Results"},{"$f":"'Trial Batch Results'!$B$30","v":"Compressive Strength"},{"$f":"'Trial Batch Results'!$K$35","v":"Correction Factor"},{"$f":"'Trial Batch Results'!$B$41","v":6}]
[783,{"$f":"IF('Trial Batch Results'!L41=\"\",\"\",'Trial Batch Results'!L41)","v":""},{"$f":"'Trial Batch Results'!$B$4","v":"Trial Batch Results"},{"$f":"'Trial Batch Results'!$B$30","v":"Compressive Strength"},{"$f":"'Trial Batch Results'!$L$35","v":"Compressive Strength,\npsi"},{"$f":"'Trial Batch Results'!$B$41","v":6}]
[784,{"$f":"IF('Trial Batch Results'!C42=\"\",\"\",'Trial Batch Results'!C42)","v":""},{"$f":"'Trial Batch Results'!$B$4","v":"Trial Batch Results"},{"$f":"'Trial Batch Results'!$B$30","v":"Compressive Strength"},{"$f":"'Trial Batch Results'!$C$35","v":"Cylinder Number"},{"$f":"'Trial Batch Results'!$B$42","v":7}]
[785,{"$f":"IF('Trial Batch Results'!D42=\"\",\"\",'Trial Batch Results'!D42)","v":"7-Day"},{"$f":"'Trial Batch Results'!$B$4","v":"Trial Batch Results"},{"$f":"'Trial Batch Results'!$B$30","v":"Compressive Strength"},{"$f":"'Trial Batch Results'!$D$35","v":"Age"},{"$f":"'Trial Batch Results'!$B$42","v":7}]
[786,{"$f":"IF('Trial Batch Results'!E42=\"\",\"\",'Trial Batch Results'!E42)","v":""},{"$f":"'Trial Batch Results'!$B$4","v":"Trial Batch Results"},{"$f":"'Trial Batch Results'!$B$30","v":"Compressive Strength"},{"$f":"'Trial Batch Results'!$E$35","v":"Diameter of Cylinder"},{"$f":"'Trial Batch Results'!$B$42","v":7}]
[787,{"$f":"IF('Trial Batch Results'!F42=\"\",\"\",'Trial Batch Results'!F42)","v":""},{"$f":"'Trial Batch Results'!$B$4","v":"Trial Batch Results"},{"$f":"'Trial Batch Results'!$B$30","v":"Compressive Strength"},{"$f":"'Trial Batch Results'!$F$35","v":"Length of Cylinder,\nin."},{"$f":"'Trial Batch Results'!$B$42","v":7}]
[788,{"$f":"IF('Trial Batch Results'!G42=\"\",\"\",'Trial Batch Results'!G42)","v":""},{"$f":"'Trial Batch Results'!$B$4","v":"Trial Batch Results"},{"$f":"'Trial Batch Results'!$B$30","v":"Compressive Strength"},{"$f":"'Trial Batch Results'!$G$35","v":"Length to Diameter Ratio"},{"$f":"'Trial Batch Results'!$B$42","v":7}]
[789,{"$f":"IF('Trial Batch Results'!H42=\"\",\"\",'Trial Batch Results'!H42)","v":""},{"$f":"'Trial Batch Results'!$B$4","v":"Trial Batch Results"},{"$f":"'Trial Batch Results'!$B$30","v":"Compressive Strength"},{"$f":"'Trial Batch Results'!$H$35","v":"Maximum Load,\nlbs."},{"$f":"'Trial Batch Results'!$B$42","v":7}]
[790,{"$f":"IF('Trial Batch Results'!I42=\"\",\"\",'Trial Batch Results'!I42)","v":""},{"$f":"'Trial Batch Results'!$B$4","v":"Trial Batch Results"},{"$f":"'Trial Batch Results'!$B$30","v":"Compressive Strength"},{"$f":"'Trial Batch Results'!$I$35","v":"Failure Type"},{"$f":"'Trial Batch Results'!$B$42","v":7}]
[791,{"$f":"IF('Trial Batch Results'!K42=\"\",\"\",'Trial Batch Results'!K42)","v":""},{"$f":"'Trial Batch Results'!$B$4","v":"Trial Batch Results"},{"$f":"'Trial Batch Results'!$B$30","v":"Compressive Strength"},{"$f":"'Trial Batch Results'!$K$35","v":"Correction Factor"},{"$f":"'Trial Batch Results'!$B$42","v":7}]
[792,{"$f":"IF('Trial Batch Results'!L42=\"\",\"\",'Trial Batch Results'!L42)","v":""},{"$f":"'Trial Batch Results'!$B$4","v":"Trial Batch Results"},{"$f":"'Trial Batch Results'!$B$30","v":"Compressive Strength"},{"$f":"'Trial Batch Results'!$L$35","v":"Compressive Strength,\npsi"},{"$f":"'Trial Batch Results'!$B$42","v":7}]
[793,{"$f":"IF('Trial Batch Results'!M42=\"\",\"\",'Trial Batch Results'!M42)","v":""},{"$f":"'Trial Batch Results'!$B$4","v":"Trial Batch Results"},{"$f":"'Trial Batch Results'!$B$30","v":"Compressive Strength"},{"$f":"'Trial Batch Results'!$M$35","v":"Average Compressive Strength,\npsi"},{"$f":"'Trial Batch Results'!$B$42","v":7}]
[794,{"$f":"IF('Trial Batch Results'!E43=\"\",\"\",'Trial Batch Results'!E43)","v":""},{"$f":"'Trial Batch Results'!$B$4","v":"Trial Batch Results"},{"$f":"'Trial Batch Results'!$B$30","v":"Compressive Strength"},{"$f":"'Trial Batch Results'!$E$35","v":"Diameter of Cylinder"},{"$f":"'Trial Batch Results'!$B$43","v":8}]
[795,{"$f":"IF('Trial Batch Results'!F43=\"\",\"\",'Trial Batch Results'!F43)","v":""},{"$f":"'Trial Batch Results'!$B$4","v":"Trial Batch Results"},{"$f":"'Trial Batch Results'!$B$30","v":"Compressive Strength"},{"$f":"'Trial Batch Results'!$F$35","v":"Length of Cylinder,\nin."},{"$f":"'Trial Batch Results'!$B$43","v":8}]
[796,{"$f":"IF('Trial Batch Results'!G43=\"\",\"\",'Trial Batch Results'!G43)","v":""},{"$f":"'Trial Batch Results'!$B$4","v":"Trial Batch Results"},{"$f":"'Trial Batch Results'!$B$30","v":"Compressive Strength"},{"$f":"'Trial Batch Results'!$G$35","v":"Length to Diameter Ratio"},{"$f":"'Trial Batch Results'!$B$43","v":8}]
[797,{"$f":"IF('Trial Batch Results'!H43=\"\",\"\",'Trial Batch Results'!H43)","v":""},{"$f":"'Trial Batch Results'!$B$4","v":"Trial Batch Results"},{"$f":"'Trial Batch Results'!$B$30","v":"Compressive Strength"},{"$f":"'Trial Batch Results'!$H$35","v":"Maximum Load,\nlbs."},{"$f":"'Trial Batch Results'!$B$43","v":8}]
[798,{"$f":"IF('Trial Batch Results'!I43=\"\",\"\",'Trial Batch Results'!I43)","v":""},{"$f":"'Trial Batch Results'!$B$4","v":"Trial Batch Results"},{"$f":"'Trial Batch Results'!$B$30","v":"Compressive Strength"},{"$f":"'Trial Batch Results'!$I$35","v":"Failure Type"},{"$f":"'Trial Batch Results'!$B$43","v":8}]
[799,{"$f":"IF('Trial Batch Results'!K43=\"\",\"\",'Trial Batch Results'!K43)","v":""},{"$f":"'Trial Batch Results'!$B$4","v":"Trial Batch Results"},{"$f":"'Trial Batch Results'!$B$30","v":"Compressive Strength"},{"$f":"'Trial Batch Results'!$K$35","v":"Correction Factor"},{"$f":"'Trial Batch Results'!$B$43","v":8}]
[800,{"$f":"IF('Trial Batch Results'!L43=\"\",\"\",'Trial Batch Results'!L43)","v":""},{"$f":"'Trial Batch Results'!$B$4","v":"Trial Batch Results"},{"$f":"'Trial Batch Results'!$B$30","v":"Compressive Strength"},{"$f":"'Trial Batch Results'!$L$35","v":"Compressive Strength,\npsi"},{"$f":"'Trial Batch Results'!$B$43","v":8}]
[801,{"$f":"IF('Trial Batch Results'!C43=\"\",\"\",'Trial Batch Results'!C43)","v":""},{"$f":"'Trial Batch Results'!$B$4","v":"Trial Batch Results"},{"$f":"'Trial Batch Results'!$B$30","v":"Compressive Strength"},{"$f":"'Trial Batch Results'!$C$35","v":"Cylinder Number"},{"$f":"'Trial Batch Results'!$B$43","v":8}]
[802,{"$f":"IF('Trial Batch Results'!C44=\"\",\"\",'Trial Batch Results'!C44)","v":""},{"$f":"'Trial Batch Results'!$B$4","v":"Trial Batch Results"},{"$f":"'Trial Batch Results'!$B$30","v":"Compressive Strength"},{"$f":"'Trial Batch Results'!$C$35","v":"Cylinder Number"},{"$f":"'Trial Batch Results'!$B$44","v":9}]
[803,{"$f":"IF('Trial Batch Results'!E44=\"\",\"\",'Trial Batch Results'!E44)","v":""},{"$f":"'Trial Batch Results'!$B$4","v":"Trial Batch Results"},{"$f":"'Trial Batch Results'!$B$30","v":"Compressive Strength"},{"$f":"'Trial Batch Results'!$E$35","v":"Diameter of Cylinder"},{"$f":"'Trial Batch Results'!$B$44","v":9}]
[804,{"$f":"IF('Trial Batch Results'!F44=\"\",\"\",'Trial Batch Results'!F44)","v":""},{"$f":"'Trial Batch Results'!$B$4","v":"Trial Batch Results"},{"$f":"'Trial Batch Results'!$B$30","v":"Compressive Strength"},{"$f":"'Trial Batch Results'!$F$35","v":"Length of Cylinder,\nin."},{"$f":"'Trial Batch Results'!$B$44","v":9}]
[805,{"$f":"IF('Trial Batch Results'!G44=\"\",\"\",'Trial Batch Results'!G44)","v":""},{"$f":"'Trial Batch Results'!$B$4","v":"Trial Batch Results"},{"$f":"'Trial Batch Results'!$B$30","v":"Compressive Strength"},{"$f":"'Trial Batch Results'!$G$35","v":"Length to Diameter Ratio"},{"$f":"'Trial Batch Results'!$B$44","v":9}]
[806,{"$f":"IF('Trial Batch Results'!H44=\"\",\"\",'Trial Batch Results'!H44)","v":""},{"$f":"'Trial Batch Results'!$B$4","v":"Trial Batch Results"},{"$f":"'Trial Batch Results'!$B$30","v":"Compressive Strength"},{"$f":"'Trial Batch Results'!$H$35","v":"Maximum Load,\nlbs."},{"$f":"'Trial Batch Results'!$B$44","v":9}]
[807,{"$f":"IF('Trial Batch Results'!I44=\"\",\"\",'Trial Batch Results'!I44)","v":""},{"$f":"'Trial Batch Results'!$B$4","v":"Trial Batch Results"},{"$f":"'Trial Batch Results'!$B$30","v":"Compressive Strength"},{"$f":"'Trial Batch Results'!$I$35","v":"Failure Type"},{"$f":"'Trial Batch Results'!$B$44","v":9}]
[808,{"$f":"IF('Trial Batch Results'!K44=\"\",\"\",'Trial Batch Results'!K44)","v":""},{"$f":"'Trial Batch Results'!$B$4","v":"Trial Batch Results"},{"$f":"'Trial Batch Results'!$B$30","v":"Compressive Strength"},{"$f":"'Trial Batch Results'!$K$35","v":"Correction Factor"},{"$f":"'Trial Batch Results'!$B$44","v":9}]
[809,{"$f":"IF('Trial Batch Results'!L44=\"\",\"\",'Trial Batch Results'!L44)","v":""},{"$f":"'Trial Batch Results'!$B$4","v":"Trial Batch Results"},{"$f":"'Trial Batch Results'!$B$30","v":"Compressive Strength"},{"$f":"'Trial Batch Results'!$L$35","v":"Compressive Strength,\npsi"},{"$f":"'Trial Batch Results'!$B$44","v":9}]
[810,{"$f":"IF('Trial Batch Results'!C45=\"\",\"\",'Trial Batch Results'!C45)","v":""},{"$f":"'Trial Batch Results'!$B$4","v":"Trial Batch Results"},{"$f":"'Trial Batch Results'!$B$30","v":"Compressive Strength"},{"$f":"'Trial Batch Results'!$C$35","v":"Cylinder Number"},{"$f":"'Trial Batch Results'!$B$45","v":10}]
[811,{"$f":"IF('Trial Batch Results'!D45=\"\",\"\",'Trial Batch Results'!D45)","v":"28-Day"},{"$f":"'Trial Batch Results'!$B$4","v":"Trial Batch Results"},{"$f":"'Trial Batch Results'!$B$30","v":"Compressive Strength"},{"$f":"'Trial Batch Results'!$D$35","v":"Age"},{"$f":"'Trial Batch Results'!$B$45","v":10}]
[812,{"$f":"IF('Trial Batch Results'!E45=\"\",\"\",'Trial Batch Results'!E45)","v":""},{"$f":"'Trial Batch Results'!$B$4","v":"Trial Batch Results"},{"$f":"'Trial Batch Results'!$B$30","v":"Compressive Strength"},{"$f":"'Trial Batch Results'!$E$35","v":"Diameter of Cylinder"},{"$f":"'Trial Batch Results'!$B$45","v":10}]
[813,{"$f":"IF('Trial Batch Results'!F45=\"\",\"\",'Trial Batch Results'!F45)","v":""},{"$f":"'Trial Batch Results'!$B$4","v":"Trial Batch Results"},{"$f":"'Trial Batch Results'!$B$30","v":"Compressive Strength"},{"$f":"'Trial Batch Results'!$F$35","v":"Length of Cylinder,\nin."},{"$f":"'Trial Batch Results'!$B$45","v":10}]
[814,{"$f":"IF('Trial Batch Results'!G45=\"\",\"\",'Trial Batch Results'!G45)","v":""},{"$f":"'Trial Batch Results'!$B$4","v":"Trial Batch Results"},{"$f":"'Trial Batch Results'!$B$30","v":"Compressive Strength"},{"$f":"'Trial Batch Results'!$G$35","v":"Length to Diameter Ratio"},{"$f":"'Trial Batch Results'!$B$45","v":10}]
[815,{"$f":"IF('Trial Batch Results'!H45=\"\",\"\",'Trial Batch Results'!H45)","v":""},{"$f":"'Trial Batch Results'!$B$4","v":"Trial Batch Results"},{"$f":"'Trial Batch Results'!$B$30","v":"Compressive Strength"},{"$f":"'Trial Batch Results'!$H$35","v":"Maximum Load,\nlbs."},{"$f":"'Trial Batch Results'!$B$45","v":10}]
[816,{"$f":"IF('Trial Batch Results'!I45=\"\",\"\",'Trial Batch Results'!I45)","v":""},{"$f":"'Trial Batch Results'!$B$4","v":"Trial Batch Results"},{"$f":"'Trial Batch Results'!$B$30","v":"Compressive Strength"},{"$f":"'Trial Batch Results'!$I$35","v":"Failure Type"},{"$f":"'Trial Batch Results'!$B$45","v":10}]
[817,{"$f":"IF('Trial Batch Results'!K45=\"\",\"\",'Trial Batch Results'!K45)","v":""},{"$f":"'Trial Batch Results'!$B$4","v":"Trial Batch Results"},{"$f":"'Trial Batch Results'!$B$30","v":"Compressive Strength"},{"$f":"'Trial Batch Results'!$K$35","v":"Correction Factor"},{"$f":"'Trial Batch Results'!$B$45","v":10}]
[818,{"$f":"IF('Trial Batch Results'!L45=\"\",\"\",'Trial Batch Results'!L45)","v":""},{"$f":"'Trial Batch Results'!$B$4","v":"Trial Batch Results"},{"$f":"'Trial Batch Results'!$B$30","v":"Compressive Strength"},{"$f":"'Trial Batch Results'!$L$35","v":"Compressive Strength,\npsi"},{"$f":"'Trial Batch Results'!$B$45","v":10}]
[819,{"$f":"IF('Trial Batch Results'!M45=\"\",\"\",'Trial Batch Results'!M45)","v":""},{"$f":"'Trial Batch Results'!$B$4","v":"Trial Batch Results"},{"$f":"'Trial Batch Results'!$B$30","v":"Compressive Strength"},{"$f":"'Trial Batch Results'!$M$35","v":"Average Compressive Strength,\npsi"},{"$f":"'Trial Batch Results'!$B$45","v":10}]
[820,{"$f":"IF('Trial Batch Results'!C46=\"\",\"\",'Trial Batch Results'!C46)","v":""},{"$f":"'Trial Batch Results'!$B$4","v":"Trial Batch Results"},{"$f":"'Trial Batch Results'!$B$30","v":"Compressive Strength"},{"$f":"'Trial Batch Results'!$C$35","v":"Cylinder Number"},{"$f":"'Trial Batch Results'!$B$46","v":11}]
[821,{"$f":"IF('Trial Batch Results'!E46=\"\",\"\",'Trial Batch Results'!E46)","v":""},{"$f":"'Trial Batch Results'!$B$4","v":"Trial Batch Results"},{"$f":"'Trial Batch Results'!$B$30","v":"Compressive Strength"},{"$f":"'Trial Batch Results'!$E$35","v":"Diameter of Cylinder"},{"$f":"'Trial Batch Results'!$B$46","v":11}]
[822,{"$f":"IF('Trial Batch Results'!F46=\"\",\"\",'Trial Batch Results'!F46)","v":""},{"$f":"'Trial Batch Results'!$B$4","v":"Trial Batch Results"},{"$f":"'Trial Batch Results'!$B$30","v":"Compressive Strength"},{"$f":"'Trial Batch Results'!$F$35","v":"Length of Cylinder,\nin."},{"$f":"'Trial Batch Results'!$B$46","v":11}]
[823,{"$f":"IF('Trial Batch Results'!G46=\"\",\"\",'Trial Batch Results'!G46)","v":""},{"$f":"'Trial Batch Results'!$B$4","v":"Trial Batch Results"},{"$f":"'Trial Batch Results'!$B$30","v":"Compressive Strength"},{"$f":"'Trial Batch Results'!$G$35","v":"Length to Diameter Ratio"},{"$f":"'Trial Batch Results'!$B$46","v":11}]
[824,{"$f":"IF('Trial Batch Results'!H46=\"\",\"\",'Trial Batch Results'!H46)","v":""},{"$f":"'Trial Batch Results'!$B$4","v":"Trial Batch Results"},{"$f":"'Trial Batch Results'!$B$30","v":"Compressive Strength"},{"$f":"'Trial Batch Results'!$H$35","v":"Maximum Load,\nlbs."},{"$f":"'Trial Batch Results'!$B$46","v":11}]
[825,{"$f":"IF('Trial Batch Results'!I46=\"\",\"\",'Trial Batch Results'!I46)","v":""},{"$f":"'Trial Batch Results'!$B$4","v":"Trial Batch Results"},{"$f":"'Trial Batch Results'!$B$30","v":"Compressive Strength"},{"$f":"'Trial Batch Results'!$I$35","v":"Failure Type"},{"$f":"'Trial Batch Results'!$B$46","v":11}]
[826,{"$f":"IF('Trial Batch Results'!K46=\"\",\"\",'Trial Batch Results'!K46)","v":""},{"$f":"'Trial Batch Results'!$B$4","v":"Trial Batch Results"},{"$f":"'Trial Batch Results'!$B$30","v":"Compressive Strength"},{"$f":"'Trial Batch Results'!$K$35","v":"Correction Factor"},{"$f":"'Trial Batch Results'!$B$46","v":11}]
[827,{"$f":"IF('Trial Batch Results'!L46=\"\",\"\",'Trial Batch Results'!L46)","v":""},{"$f":"'Trial Batch Results'!$B$4","v":"Trial Batch Results"},{"$f":"'Trial Batch Results'!$B$30","v":"Compressive Strength"},{"$f":"'Trial Batch Results'!$L$35","v":"Compressive Strength,\npsi"},{"$f":"'Trial Batch Results'!$B$46","v":11}]
[828,{"$f":"IF('Trial Batch Results'!C47=\"\",\"\",'Trial Batch Results'!C47)","v":""},{"$f":"'Trial Batch Results'!$B$4","v":"Trial Batch Results"},{"$f":"'Trial Batch Results'!$B$30","v":"Compressive Strength"},{"$f":"'Trial Batch Results'!$C$35","v":"Cylinder Number"},{"$f":"'Trial Batch Results'!$B$47","v":12}]
[829,{"$f":"IF('Trial Batch Results'!E47=\"\",\"\",'Trial Batch Results'!E47)","v":""},{"$f":"'Trial Batch Results'!$B$4","v":"Trial Batch Results"},{"$f":"'Trial Batch Results'!$B$30","v":"Compressive Strength"},{"$f":"'Trial Batch Results'!$E$35","v":"Diameter of Cylinder"},{"$f":"'Trial Batch Results'!$B$47","v":12}]
[830,{"$f":"IF('Trial Batch Results'!F47=\"\",\"\",'Trial Batch Results'!F47)","v":""},{"$f":"'Trial Batch Results'!$B$4","v":"Trial Batch Results"},{"$f":"'Trial Batch Results'!$B$30","v":"Compressive Strength"},{"$f":"'Trial Batch Results'!$F$35","v":"Length of Cylinder,\nin."},{"$f":"'Trial Batch Results'!$B$47","v":12}]
[831,{"$f":"IF('Trial Batch Results'!G47=\"\",\"\",'Trial Batch Results'!G47)","v":""},{"$f":"'Trial Batch Results'!$B$4","v":"Trial Batch Results"},{"$f":"'Trial Batch Results'!$B$30","v":"Compressive Strength"},{"$f":"'Trial Batch Results'!$G$35","v":"Length to Diameter Ratio"},{"$f":"'Trial Batch Results'!$B$47","v":12}]
[832,{"$f":"IF('Trial Batch Results'!H47=\"\",\"\",'Trial Batch Results'!H47)","v":""},{"$f":"'Trial Batch Results'!$B$4","v":"Trial Batch Results"},{"$f":"'Trial Batch Results'!$B$30","v":"Compressive Strength"},{"$f":"'Trial Batch Results'!$H$35","v":"Maximum Load,\nlbs."},{"$f":"'Trial Batch Results'!$B$47","v":12}]
[833,{"$f":"IF('Trial Batch Results'!I47=\"\",\"\",'Trial Batch Results'!I47)","v":""},{"$f":"'Trial Batch Results'!$B$4","v":"Trial Batch Results"},{"$f":"'Trial Batch Results'!$B$30","v":"Compressive Strength"},{"$f":"'Trial Batch Results'!$I$35","v":"Failure Type"},{"$f":"'Trial Batch Results'!$B$47","v":12}]
[834,{"$f":"IF('Trial Batch Results'!K47=\"\",\"\",'Trial Batch Results'!K47)","v":""},{"$f":"'Trial Batch Results'!$B$4","v":"Trial Batch Results"},{"$f":"'Trial Batch Results'!$B$30","v":"Compressive Strength"},{"$f":"'Trial Batch Results'!$K$35","v":"Correction Factor"},{"$f":"'Trial Batch Results'!$B$47","v":12}]
[835,{"$f":"IF('Trial Batch Results'!L47=\"\",\"\",'Trial Batch Results'!L47)","v":""},{"$f":"'Trial Batch Results'!$B$4","v":"Trial Batch Results"},{"$f":"'Trial Batch Results'!$B$30","v":"Compressive Strength"},{"$f":"'Trial Batch Results'!$L$35","v":"Compressive Strength,\npsi"},{"$f":"'Trial Batch Results'!$B$47","v":12}]
[836,{"$f":"IF('Trial Batch Results'!M48=\"\",\"\",'Trial Batch Results'!M48)","v":""},{"$f":"'Trial Batch Results'!$B$4","v":"Trial Batch Results"},{"$f":"'Trial Batch Results'!$B$30","v":"Compressive Strength"},{"$f":"'Trial Batch Results'!$K$48","v":""}]
[837,{"$f":"IF('Trial Batch Results'!M49=\"\",\"\",'Trial Batch Results'!M49)","v":""},{"$f":"'Trial Batch Results'!$B$4","v":"Trial Batch Results"},{"$f":"'Trial Batch Results'!$B$30","v":"Compressive Strength"},{"$f":"'Trial Batch Results'!$K$49","v":""}]
[838,{"$f":"IF('Trial Batch Results'!M50=\"\",\"\",'Trial Batch Results'!M50)","v":""},{"$f":"'Trial Batch Results'!$B$4","v":"Trial Batch Results"},{"$f":"'Trial Batch Results'!$B$30","v":"Compressive Strength"},{"$f":"'Trial Batch Results'!$K$50","v":"7-day Target Value:"}]
[839,{"$f":"IF('Trial Batch Results'!C63=\"\",\"\",'Trial Batch Results'!C63)","v":""},{"$f":"'Trial Batch Results'!$B$4","v":"Trial Batch Results"},{"$f":"'Trial Batch Results'!$B$58","v":"Flexural Strength"},{"$f":"'Trial Batch Results'!$C$61","v":"Beam Number"},{"$f":"'Trial Batch Results'!$B$63","v":1}]
[840,{"$f":"IF('Trial Batch Results'!D63=\"\",\"\",'Trial Batch Results'!D63)","v":""},{"$f":"'Trial Batch Results'!$B$4","v":"Trial Batch Results"},{"$f":"'Trial Batch Results'!$B$58","v":"Flexural Strength"},{"$f":"'Trial Batch Results'!$D$61","v":"Age,\nDays"},{"$f":"'Trial Batch Results'!$B$63","v":1}]
[841,{"$f":"IF('Trial Batch Results'!E63=\"\",\"\",'Trial Batch Results'!E63)","v":""},{"$f":"'Trial Batch Results'!$B$4","v":"Trial Batch Results"},{"$f":"'Trial Batch Results'!$B$58","v":"Flexural Strength"},{"$f":"'Trial Batch Results'!$E$61","v":"Width of Beam,\nin."},{"$f":"'Trial Batch Results'!$B$63","v":1}]
[842,{"$f":"IF('Trial Batch Results'!F63=\"\",\"\",'Trial Batch Results'!F63)","v":""},{"$f":"'Trial Batch Results'!$B$4","v":"Trial Batch Results"},{"$f":"'Trial Batch Results'!$B$58","v":"Flexural Strength"},{"$f":"'Trial Batch Results'!$F$61","v":"Depth of Beam,\nin."},{"$f":"'Trial Batch Results'!$B$63","v":1}]
[843,{"$f":"IF('Trial Batch Results'!G63=\"\",\"\",'Trial Batch Results'!G63)","v":""},{"$f":"'Trial Batch Results'!$B$4","v":"Trial Batch Results"},{"$f":"'Trial Batch Results'!$B$58","v":"Flexural Strength"},{"$f":"'Trial Batch Results'!$G$61","v":"Span Length,\nin."},{"$f":"'Trial Batch Results'!$B$63","v":1}]
[844,{"$f":"IF('Trial Batch Results'!H63=\"\",\"\",'Trial Batch Results'!H63)","v":""},{"$f":"'Trial Batch Results'!$B$4","v":"Trial Batch Results"},{"$f":"'Trial Batch Results'!$B$58","v":"Flexural Strength"},{"$f":"'Trial Batch Results'!$H$61","v":"Max Recording,"},{"$f":"'Trial Batch Results'!$B$63","v":1}]
[845,{"$f":"IF('Trial Batch Results'!I63=\"\",\"\",'Trial Batch Results'!I63)","v":""},{"$f":"'Trial Batch Results'!$B$4","v":"Trial Batch Results"},{"$f":"'Trial Batch Results'!$B$58","v":"Flexural Strength"},{"$f":"'Trial Batch Results'!$I$61","v":"*Failure Location,\nin."},{"$f":"'Trial Batch Results'!$B$63","v":1}]
[846,{"$f":"IF('Trial Batch Results'!K63=\"\",\"\",'Trial Batch Results'!K63)","v":""},{"$f":"'Trial Batch Results'!$B$4","v":"Trial Batch Results"},{"$f":"'Trial Batch Results'!$B$58","v":"Flexural Strength"},{"$f":"'Trial Batch Results'!$K$61","v":"Modulus of Rupture,\npsi"},{"$f":"'Trial Batch Results'!$B$63","v":1}]
[847,{"$f":"IF('Trial Batch Results'!L63=\"\",\"\",'Trial Batch Results'!L63)","v":""},{"$f":"'Trial Batch Results'!$B$4","v":"Trial Batch Results"},{"$f":"'Trial Batch Results'!$B$58","v":"Flexural Strength"},{"$f":"'Trial Batch Results'!$L$61","v":"Average Modulus of Rupture,\npsi"},{"$f":"'Trial Batch Results'!$B$63","v":1}]
[848,{"$f":"IF('Trial Batch Results'!C64=\"\",\"\",'Trial Batch Results'!C64)","v":""},{"$f":"'Trial Batch Results'!$B$4","v":"Trial Batch Results"},{"$f":"'Trial Batch Results'!$B$58","v":"Flexural Strength"},{"$f":"'Trial Batch Results'!$C$61","v":"Beam Number"},{"$f":"'Trial Batch Results'!$B$64","v":2}]
[849,{"$f":"IF('Trial Batch Results'!E64=\"\",\"\",'Trial Batch Results'!E64)","v":""},{"$f":"'Trial Batch Results'!$B$4","v":"Trial Batch Results"},{"$f":"'Trial Batch Results'!$B$58","v":"Flexural Strength"},{"$f":"'Trial Batch Results'!$E$61","v":"Width of Beam,\nin."},{"$f":"'Trial Batch Results'!$B$64","v":2}]
[850,{"$f":"IF('Trial Batch Results'!F64=\"\",\"\",'Trial Batch Results'!F64)","v":""},{"$f":"'Trial Batch Results'!$B$4","v":"Trial Batch Results"},{"$f":"'Trial Batch Results'!$B$58","v":"Flexural Strength"},{"$f":"'Trial Batch Results'!$F$61","v":"Depth of Beam,\nin."},{"$f":"'Trial Batch Results'!$B$64","v":2}]
[851,{"$f":"IF('Trial Batch Results'!G64=\"\",\"\",'Trial Batch Results'!G64)","v":""},{"$f":"'Trial Batch Results'!$B$4","v":"Trial Batch Results"},{"$f":"'Trial Batch Results'!$B$58","v":"Flexural Strength"},{"$f":"'Trial Batch Results'!$G$61","v":"Span Length,\nin."},{"$f":"'Trial Batch Results'!$B$64","v":2}]
[852,{"$f":"IF('Trial Batch Results'!H64=\"\",\"\",'Trial Batch Results'!H64)","v":""},{"$f":"'Trial Batch Results'!$B$4","v":"Trial Batch Results"},{"$f":"'Trial Batch Results'!$B$58","v":"Flexural Strength"},{"$f":"'Trial Batch Results'!$H$61","v":"Max Recording,"},{"$f":"'Trial Batch Results'!$B$64","v":2}]
[853,{"$f":"IF('Trial Batch Results'!I64=\"\",\"\",'Trial Batch Results'!I64)","v":""},{"$f":"'Trial Batch Results'!$B$4","v":"Trial Batch Results"},{"$f":"'Trial Batch Results'!$B$58","v":"Flexural Strength"},{"$f":"'Trial Batch Results'!$I$61","v":"*Failure Location,\nin."},{"$f":"'Trial Batch Results'!$B$64","v":2}]
[854,{"$f":"IF('Trial Batch Results'!K64=\"\",\"\",'Trial Batch Results'!K64)","v":""},{"$f":"'Trial Batch Results'!$B$4","v":"Trial Batch Results"},{"$f":"'Trial Batch Results'!$B$58","v":"Flexural Strength"},{"$f":"'Trial Batch Results'!$K$61","v":"Modulus of Rupture,\npsi"},{"$f":"'Trial Batch Results'!$B$64","v":2}]
[855,{"$f":"IF('Trial Batch Results'!C65=\"\",\"\",'Trial Batch Results'!C65)","v":""},{"$f":"'Trial Batch Results'!$B$4","v":"Trial Batch Results"},{"$f":"'Trial Batch Results'!$B$58","v":"Flexural Strength"},{"$f":"'Trial Batch Results'!$C$61","v":"Beam Number"},{"$f":"'Trial Batch Results'!$B$65","v":3}]
[856,{"$f":"IF('Trial Batch Results'!D65=\"\",\"\",'Trial Batch Results'!D65)","v":""},{"$f":"'Trial Batch Results'!$B$4","v":"Trial Batch Results"},{"$f":"'Trial Batch Results'!$B$58","v":"Flexural Strength"},{"$f":"'Trial Batch Results'!$D$61","v":"Age,\nDays"},{"$f":"'Trial Batch Results'!$B$65","v":3}]
[857,{"$f":"IF('Trial Batch Results'!E65=\"\",\"\",'Trial Batch Results'!E65)","v":""},{"$f":"'Trial Batch Results'!$B$4","v":"Trial Batch Results"},{"$f":"'Trial Batch Results'!$B$58","v":"Flexural Strength"},{"$f":"'Trial Batch Results'!$E$61","v":"Width of Beam,\nin."},{"$f":"'Trial Batch Results'!$B$65","v":3}]
[858,{"$f":"IF('Trial Batch Results'!F65=\"\",\"\",'Trial Batch Results'!F65)","v":""},{"$f":"'Trial Batch Results'!$B$4","v":"Trial Batch Results"},{"$f":"'Trial Batch Results'!$B$58","v":"Flexural Strength"},{"$f":"'Trial Batch Results'!$F$61","v":"Depth of Beam,\nin."},{"$f":"'Trial Batch Results'!$B$65","v":3}]
[859,{"$f":"IF('Trial Batch Results'!G65=\"\",\"\",'Trial Batch Results'!G65)","v":""},{"$f":"'Trial Batch Results'!$B$4","v":"Trial Batch Results"},{"$f":"'Trial Batch Results'!$B$58","v":"Flexural Strength"},{"$f":"'Trial Batch Results'!$G$61","v":"Span Length,\nin."},{"$f":"'Trial Batch Results'!$B$65","v":3}]
[860,{"$f":"IF('Trial Batch Results'!H65=\"\",\"\",'Trial Batch Results'!H65)","v":""},{"$f":"'Trial Batch Results'!$B$4","v":"Trial Batch Results"},{"$f":"'Trial Batch Results'!$B$58","v":"Flexural Strength"},{"$f":"'Trial Batch Results'!$H$61","v":"Max Recording,"},{"$f":"'Trial Batch Results'!$B$65","v":3}]
[861,{"$f":"IF('Trial Batch Results'!I65=\"\",\"\",'Trial Batch Results'!I65)","v":""},{"$f":"'Trial Batch Results'!$B$4","v":"Trial Batch Results"},{"$f":"'Trial Batch Results'!$B$58","v":"Flexural Strength"},{"$f":"'Trial Batch Results'!$I$61","v":"*Failure Location,\nin."},{"$f":"'Trial Batch Results'!$B$65","v":3}]
[862,{"$f":"IF('Trial Batch Results'!K65=\"\",\"\",'Trial Batch Results'!K65)","v":""},{"$f":"'Trial Batch Results'!$B$4","v":"Trial Batch Results"},{"$f":"'Trial Batch Results'!$B$58","v":"Flexural Strength"},{"$f":"'Trial Batch Results'!$K$61","v":"Modulus of Rupture,\npsi"},{"$f":"'Trial Batch Results'!$B$65","v":3}]
[863,{"$f":"IF('Trial Batch Results'!L65=\"\",\"\",'Trial Batch Results'!L65)","v":""},{"$f":"'Trial Batch Results'!$B$4","v":"Trial Batch Results"},{"$f":"'Trial Batch Results'!$B$58","v":"Flexural Strength"},{"$f":"'Trial Batch Results'!$L$61","v":"Average Modulus of Rupture,\npsi"},{"$f":"'Trial Batch Results'!$B$65","v":3}]
[864,{"$f":"IF('Trial Batch Results'!C66=\"\",\"\",'Trial Batch Results'!C66)","v":""},{"$f":"'Trial Batch Results'!$B$4","v":"Trial Batch Results"},{"$f":"'Trial Batch Results'!$B$58","v":"Flexural Strength"},{"$f":"'Trial Batch Results'!$C$61","v":"Beam Number"},{"$f":"'Trial Batch Results'!$B$66","v":4}]
[865,{"$f":"IF('Trial Batch Results'!E66=\"\",\"\",'Trial Batch Results'!E66)","v":""},{"$f":"'Trial Batch Results'!$B$4","v":"Trial Batch Results"},{"$f":"'Trial Batch Results'!$B$58","v":"Flexural Strength"},{"$f":"'Trial Batch Results'!$E$61","v":"Width of Beam,\nin."},{"$f":"'Trial Batch Results'!$B$66","v":4}]
[866,{"$f":"IF('Trial Batch Results'!F66=\"\",\"\",'Trial Batch Results'!F66)","v":""},{"$f":"'Trial Batch Results'!$B$4","v":"Trial Batch Results"},{"$f":"'Trial Batch Results'!$B$58","v":"Flexural Strength"},{"$f":"'Trial Batch Results'!$F$61","v":"Depth of Beam,\nin."},{"$f":"'Trial Batch Results'!$B$66","v":4}]
[867,{"$f":"IF('Trial Batch Results'!G66=\"\",\"\",'Trial Batch Results'!G66)","v":""},{"$f":"'Trial Batch Results'!$B$4","v":"Trial Batch Results"},{"$f":"'Trial Batch Results'!$B$58","v":"Flexural Strength"},{"$f":"'Trial Batch Results'!$G$61","v":"Span Length,\nin."},{"$f":"'Trial Batch Results'!$B$66","v":4}]
[868,{"$f":"IF('Trial Batch Results'!H66=\"\",\"\",'Trial Batch Results'!H66)","v":""},{"$f":"'Trial Batch Results'!$B$4","v":"Trial Batch Results"},{"$f":"'Trial Batch Results'!$B$58","v":"Flexural Strength"},{"$f":"'Trial Batch Results'!$H$61","v":"Max Recording,"},{"$f":"'Trial Batch Results'!$B$66","v":4}]
[869,{"$f":"IF('Trial Batch Results'!I66=\"\",\"\",'Trial Batch Results'!I66)","v":""},{"$f":"'Trial Batch Results'!$B$4","v":"Trial Batch Results"},{"$f":"'Trial Batch Results'!$B$58","v":"Flexural Strength"},{"$f":"'Trial Batch Results'!$I$61","v":"*Failure Location,\nin."},{"$f":"'Trial Batch Results'!$B$66","v":4}]
[870,{"$f":"IF('Trial Batch Results'!K66=\"\",\"\",'Trial Batch Results'!K66)","v":""},{"$f":"'Trial Batch Results'!$B$4","v":"Trial Batch Results"},{"$f":"'Trial Batch Results'!$B$58","v":"Flexural Strength"},{"$f":"'Trial Batch Results'!$K$61","v":"Modulus of Rupture,\npsi"},{"$f":"'Trial Batch Results'!$B$66","v":4}]
[871,{"$f":"IF('Trial Batch Results'!C67=\"\",\"\",'Trial Batch Results'!C67)","v":""},{"$f":"'Trial Batch Results'!$B$4","v":"Trial Batch Results"},{"$f":"'Trial Batch Results'!$B$58","v":"Flexural Strength"},{"$f":"'Trial Batch Results'!$C$61","v":"Beam Number"},{"$f":"'Trial Batch Results'!$B$67","v":5}]
[872,{"$f":"IF('Trial Batch Results'!D67=\"\",\"\",'Trial Batch Results'!D67)","v":"7-Day"},{"$f":"'Trial Batch Results'!$B$4","v":"Trial Batch Results"},{"$f":"'Trial Batch Results'!$B$58","v":"Flexural Strength"},{"$f":"'Trial Batch Results'!$D$61","v":"Age,\nDays"},{"$f":"'Trial Batch Results'!$B$67","v":5}]
[873,{"$f":"IF('Trial Batch Results'!E67=\"\",\"\",'Trial Batch Results'!E67)","v":""},{"$f":"'Trial Batch Results'!$B$4","v":"Trial Batch Results"},{"$f":"'Trial Batch Results'!$B$58","v":"Flexural Strength"},{"$f":"'Trial Batch Results'!$E$61","v":"Width of Beam,\nin."},{"$f":"'Trial Batch Results'!$B$67","v":5}]
[874,{"$f":"IF('Trial Batch Results'!F67=\"\",\"\",'Trial Batch Results'!F67)","v":""},{"$f":"'Trial Batch Results'!$B$4","v":"Trial Batch Results"},{"$f":"'Trial Batch Results'!$B$58","v":"Flexural Strength"},{"$f":"'Trial Batch Results'!$F$61","v":"Depth of Beam,\nin."},{"$f":"'Trial Batch Results'!$B$67","v":5}]
[875,{"$f":"IF('Trial Batch Results'!G67=\"\",\"\",'Trial Batch Results'!G67)","v":""},{"$f":"'Trial Batch Results'!$B$4","v":"Trial Batch Results"},{"$f":"'Trial Batch Results'!$B$58","v":"Flexural Strength"},{"$f":"'Trial Batch Results'!$G$61","v":"Span Length,\nin."},{"$f":"'Trial Batch Results'!$B$67","v":5}]
[876,{"$f":"IF('Trial Batch Results'!H67=\"\",\"\",'Trial Batch Results'!H67)","v":""},{"$f":"'Trial Batch Results'!$B$4","v":"Trial Batch Results"},{"$f":"'Trial Batch Results'!$B$58","v":"Flexural Strength"},{"$f":"'Trial Batch Results'!$H$61","v":"Max Recording,"},{"$f":"'Trial Batch Results'!$B$67","v":5}]
[877,{"$f":"IF('Trial Batch Results'!I67=\"\",\"\",'Trial Batch Results'!I67)","v":""},{"$f":"'Trial Batch Results'!$B$4","v":"Trial Batch Results"},{"$f":"'Trial Batch Results'!$B$58","v":"Flexural Strength"},{"$f":"'Trial Batch Results'!$I$61","v":"*Failure Location,\nin."},{"$f":"'Trial Batch Results'!$B$67","v":5}]
[878,{"$f":"IF('Trial Batch Results'!K67=\"\",\"\",'Trial Batch Results'!K67)","v":""},{"$f":"'Trial Batch Results'!$B$4","v":"Trial Batch Results"},{"$f":"'Trial Batch Results'!$B$58","v":"Flexural Strength"},{"$f":"'Trial Batch Results'!$K$61","v":"Modulus of Rupture,\npsi"},{"$f":"'Trial Batch Results'!$B$67","v":5}]
[879,{"$f":"IF('Trial Batch Results'!L67=\"\",\"\",'Trial Batch Results'!L67)","v":""},{"$f":"'Trial Batch Results'!$B$4","v":"Trial Batch Results"},{"$f":"'Trial Batch Results'!$B$58","v":"Flexural Strength"},{"$f":"'Trial Batch Results'!L61","v":"Average Modulus of Rupture,\npsi"},{"$f":"'Trial Batch Results'!$B$67","v":5}]
[880,{"$f":"IF('Trial Batch Results'!C68=\"\",\"\",'Trial Batch Results'!C68)","v":""},{"$f":"'Trial Batch Results'!$B$4","v":"Trial Batch Results"},{"$f":"'Trial Batch Results'!$B$58","v":"Flexural Strength"},{"$f":"'Trial Batch Results'!$C$61","v":"Beam Number"},{"$f":"'Trial Batch Results'!$B$68","v":6}]
[881,{"$f":"IF('Trial Batch Results'!E68=\"\",\"\",'Trial Batch Results'!E68)","v":""},{"$f":"'Trial Batch Results'!$B$4","v":"Trial Batch Results"},{"$f":"'Trial Batch Results'!$B$58","v":"Flexural Strength"},{"$f":"'Trial Batch Results'!$E$61","v":"Width of Beam,\nin."},{"$f":"'Trial Batch Results'!$B$68","v":6}]
[882,{"$f":"IF('Trial Batch Results'!F68=\"\",\"\",'Trial Batch Results'!F68)","v":""},{"$f":"'Trial Batch Results'!$B$4","v":"Trial Batch Results"},{"$f":"'Trial Batch Results'!$B$58","v":"Flexural Strength"},{"$f":"'Trial Batch Results'!$F$61","v":"Depth of Beam,\nin."},{"$f":"'Trial Batch Results'!$B$68","v":6}]
[883,{"$f":"IF('Trial Batch Results'!G68=\"\",\"\",'Trial Batch Results'!G68)","v":""},{"$f":"'Trial Batch Results'!$B$4","v":"Trial Batch Results"},{"$f":"'Trial Batch Results'!$B$58","v":"Flexural Strength"},{"$f":"'Trial Batch Results'!$G$61","v":"Span Length,\nin."},{"$f":"'Trial Batch Results'!$B$68","v":6}]
[884,{"$f":"IF('Trial Batch Results'!H68=\"\",\"\",'Trial Batch Results'!H68)","v":""},{"$f":"'Trial Batch Results'!$B$4","v":"Trial Batch Results"},{"$f":"'Trial Batch Results'!$B$58","v":"Flexural Strength"},{"$f":"'Trial Batch Results'!$H$61","v":"Max Recording,"},{"$f":"'Trial Batch Results'!$B$68","v":6}]
[885,{"$f":"IF('Trial Batch Results'!I68=\"\",\"\",'Trial Batch Results'!I68)","v":""},{"$f":"'Trial Batch Results'!$B$4","v":"Trial Batch Results"},{"$f":"'Trial Batch Results'!$B$58","v":"Flexural Strength"},{"$f":"'Trial Batch Results'!$I$61","v":"*Failure Location,\nin."},{"$f":"'Trial Batch Results'!$B$68","v":6}]
[886,{"$f":"IF('Trial Batch Results'!K68=\"\",\"\",'Trial Batch Results'!K68)","v":""},{"$f":"'Trial Batch Results'!$B$4","v":"Trial Batch Results"},{"$f":"'Trial Batch Results'!$B$58","v":"Flexural Strength"},{"$f":"'Trial Batch Results'!$K$61","v":"Modulus of Rupture,\npsi"},{"$f":"'Trial Batch Results'!$B$68","v":6}]
[887,{"$f":"IF('Trial Batch Results'!C69=\"\",\"\",'Trial Batch Results'!C69)","v":""},{"$f":"'Trial Batch Results'!$B$4","v":"Trial Batch Results"},{"$f":"'Trial Batch Results'!$B$58","v":"Flexural Strength"},{"$f":"'Trial Batch Results'!$C$61","v":"Beam Number"},{"$f":"'Trial Batch Results'!$B$69","v":7}]
[888,{"$f":"IF('Trial Batch Results'!D69=\"\",\"\",'Trial Batch Results'!D69)","v":"28-Day"},{"$f":"'Trial Batch Results'!$B$4","v":"Trial Batch Results"},{"$f":"'Trial Batch Results'!$B$58","v":"Flexural Strength"},{"$f":"'Trial Batch Results'!$D$61","v":"Age,\nDays"},{"$f":"'Trial Batch Results'!$B$69","v":7}]
[889,{"$f":"IF('Trial Batch Results'!E69=\"\",\"\",'Trial Batch Results'!E69)","v":""},{"$f":"'Trial Batch Results'!$B$4","v":"Trial Batch Results"},{"$f":"'Trial Batch Results'!$B$58","v":"Flexural Strength"},{"$f":"'Trial Batch Results'!$E$61","v":"Width of Beam,\nin."},{"$f":"'Trial Batch Results'!$B$69","v":7}]
[890,{"$f":"IF('Trial Batch Results'!F69=\"\",\"\",'Trial Batch Results'!F69)","v":""},{"$f":"'Trial Batch Results'!$B$4","v":"Trial Batch Results"},{"$f":"'Trial Batch Results'!$B$58","v":"Flexural Strength"},{"$f":"'Trial Batch Results'!$F$61","v":"Depth of Beam,\nin."},{"$f":"'Trial Batch Results'!$B$69","v":7}]
[891,{"$f":"IF('Trial Batch Results'!G69=\"\",\"\",'Trial Batch Results'!G69)","v":""},{"$f":"'Trial Batch Results'!$B$4","v":"Trial Batch Results"},{"$f":"'Trial Batch Results'!$B$58","v":"Flexural Strength"},{"$f":"'Trial Batch Results'!$G$61","v":"Span Length,\nin."},{"$f":"'Trial Batch Results'!$B$69","v":7}]
[892,{"$f":"IF('Trial Batch Results'!H69=\"\",\"\",'Trial Batch Results'!H69)","v":""},{"$f":"'Trial Batch Results'!$B$4","v":"Trial Batch Results"},{"$f":"'Trial Batch Results'!$B$58","v":"Flexural Strength"},{"$f":"'Trial Batch Results'!$H$61","v":"Max Recording,"},{"$f":"'Trial Batch Results'!$B$69","v":7}]
[893,{"$f":"IF('Trial Batch Results'!I69=\"\",\"\",'Trial Batch Results'!I69)","v":""},{"$f":"'Trial Batch Results'!$B$4","v":"Trial Batch Results"},{"$f":"'Trial Batch Results'!$B$58","v":"Flexural Strength"},{"$f":"'Trial Batch Results'!$I$61","v":"*Failure Location,\nin."},{"$f":"'Trial Batch Results'!$B$69","v":7}]
[894,{"$f":"IF('Trial Batch Results'!K69=\"\",\"\",'Trial Batch Results'!K69)","v":""},{"$f":"'Trial Batch Results'!$B$4","v":"Trial Batch Results"},{"$f":"'Trial Batch Results'!$B$58","v":"Flexural Strength"},{"$f":"'Trial Batch Results'!$K$61","v":"Modulus of Rupture,\npsi"},{"$f":"'Trial Batch Results'!$B$69","v":7}]
[895,{"$f":"IF('Trial Batch Results'!L69=\"\",\"\",'Trial Batch Results'!L69)","v":""},{"$f":"'Trial Batch Results'!$B$4","v":"Trial Batch Results"},{"$f":"'Trial Batch Results'!$B$58","v":"Flexural Strength"},{"$f":"'Trial Batch Results'!L61","v":"Average Modulus of Rupture,\npsi"},{"$f":"'Trial Batch Results'!$B$69","v":7}]
[896,{"$f":"IF('Trial Batch Results'!C70=\"\",\"\",'Trial Batch Results'!C70)","v":""},{"$f":"'Trial Batch Results'!$B$4","v":"Trial Batch Results"},{"$f":"'Trial Batch Results'!$B$58","v":"Flexural Strength"},{"$f":"'Trial Batch Results'!$C$61","v":"Beam Number"},{"$f":"'Trial Batch Results'!$B$70","v":8}]
[897,{"$f":"IF('Trial Batch Results'!E70=\"\",\"\",'Trial Batch Results'!E70)","v":""},{"$f":"'Trial Batch Results'!$B$4","v":"Trial Batch Results"},{"$f":"'Trial Batch Results'!$B$58","v":"Flexural Strength"},{"$f":"'Trial Batch Results'!$E$61","v":"Width of Beam,\nin."},{"$f":"'Trial Batch Results'!$B$70","v":8}]
[898,{"$f":"IF('Trial Batch Results'!F70=\"\",\"\",'Trial Batch Results'!F70)","v":""},{"$f":"'Trial Batch Results'!$B$4","v":"Trial Batch Results"},{"$f":"'Trial Batch Results'!$B$58","v":"Flexural Strength"},{"$f":"'Trial Batch Results'!$F$61","v":"Depth of Beam,\nin."},{"$f":"'Trial Batch Results'!$B$70","v":8}]
[899,{"$f":"IF('Trial Batch Results'!G70=\"\",\"\",'Trial Batch Results'!G70)","v":""},{"$f":"'Trial Batch Results'!$B$4","v":"Trial Batch Results"},{"$f":"'Trial Batch Results'!$B$58","v":"Flexural Strength"},{"$f":"'Trial Batch Results'!$G$61","v":"Span Length,\nin."},{"$f":"'Trial Batch Results'!$B$70","v":8}]
[900,{"$f":"IF('Trial Batch Results'!H70=\"\",\"\",'Trial Batch Results'!H70)","v":""},{"$f":"'Trial Batch Results'!$B$4","v":"Trial Batch Results"},{"$f":"'Trial Batch Results'!$B$58","v":"Flexural Strength"},{"$f":"'Trial Batch Results'!$H$61","v":"Max Recording,"},{"$f":"'Trial Batch Results'!$B$70","v":8}]
[901,{"$f":"IF('Trial Batch Results'!I70=\"\",\"\",'Trial Batch Results'!I70)","v":""},{"$f":"'Trial Batch Results'!$B$4","v":"Trial Batch Results"},{"$f":"'Trial Batch Results'!$B$58","v":"Flexural Strength"},{"$f":"'Trial Batch Results'!$I$61","v":"*Failure Location,\nin."},{"$f":"'Trial Batch Results'!$B$70","v":8}]
[902,{"$f":"IF('Trial Batch Results'!K70=\"\",\"\",'Trial Batch Results'!K70)","v":""},{"$f":"'Trial Batch Results'!$B$4","v":"Trial Batch Results"},{"$f":"'Trial Batch Results'!$B$58","v":"Flexural Strength"},{"$f":"'Trial Batch Results'!$K$61","v":"Modulus of Rupture,\npsi"},{"$f":"'Trial Batch Results'!$B$70","v":8}]
[903,{"$f":"IF('Trial Batch Results'!L71=\"\",\"\",'Trial Batch Results'!L71)","v":""},{"$f":"'Trial Batch Results'!$B$4","v":"Trial Batch Results"},{"$f":"'Trial Batch Results'!$B$58","v":"Flexural Strength"},{"$f":"'Trial Batch Results'!K71","v":""}]
[904,{"$f":"IF('Trial Batch Results'!L72=\"\",\"\",'Trial Batch Results'!L72)","v":""},{"$f":"'Trial Batch Results'!$B$4","v":"Trial Batch Results"},{"$f":"'Trial Batch Results'!$B$58","v":"Flexural Strength"},{"$f":"'Trial Batch Results'!K72","v":""}]
[905,{"$f":"IF('Trial Batch Results'!L73=\"\",\"\",'Trial Batch Results'!L73)","v":""},{"$f":"'Trial Batch Results'!$B$4","v":"Trial Batch Results"},{"$f":"'Trial Batch Results'!$B$58","v":"Flexural Strength"},{"$f":"'Trial Batch Results'!K73","v":"7-day Target Value:"}]
[906,{"$f":"IF('Trial Batch Results'!H62=\"\",\"\",'Trial Batch Results'!H62)","v":""},{"$f":"'Trial Batch Results'!$B$4","v":"Trial Batch Results"},{"$f":"'Trial Batch Results'!$B$58","v":"Flexural Strength"},{"$f":"'Trial Batch Results'!H61","v":"Max Recording,"}]
[907,{"$f":"'Optimized Gradation'!J25","v":0},{"$f":"'Optimized Gradation'!B6","v":"Optimized Gradation"},{"$f":"'Optimized Gradation'!B25","v":"Percent  of Total Agg."}]
[908,{"$f":"'DryBatchWeights - Existing'!I50","v":0},{"$f":"'DryBatchWeights - Existing'!B6","v":"Dry Batch Weights - Existing"},{"$f":"'DryBatchWeights - Existing'!G50","v":"Total Input Volume, (ft3):"}]
[909,{"$f":"ACI211AggSize","v":0},{"$f":"'DryBatchWeights - ACI211'!B4","v":"Dry Batch Weights - ACI 211"},{"$f":"'DryBatchWeights - ACI211'!B18","v":"Coarse Aggregate Factor"},{"$f":"'DryBatchWeights - ACI211'!D22","v":"Nom. Max. Agg. Size, (inches):"}]
[910,{"$f":"'DryBatchWeights - ACI211'!E23","v":""},{"$f":"'DryBatchWeights - ACI211'!B4","v":"Dry Batch Weights - ACI 211"},{"$f":"'DryBatchWeights - ACI211'!B18","v":"Coarse Aggregate Factor"},{"$f":"'DryBatchWeights - ACI211'!D23","v":"Mix design target strength, (psi):"}]
[911,{"$f":"'DryBatchWeights - ACI211'!E24","v":" "},{"$f":"'DryBatchWeights - ACI211'!B4","v":"Dry Batch Weights - ACI 211"},{"$f":"'DryBatchWeights - ACI211'!B18","v":"Coarse Aggregate Factor"},{"$f":"'DryBatchWeights - ACI211'!D24","v":"Basic Water Demand, lb/CY:"}]
[912,{"$f":"'DryBatchWeights - ACI211'!E25","v":1},{"$f":"'DryBatchWeights - ACI211'!B4","v":"Dry Batch Weights - ACI 211"},{"$f":"'DryBatchWeights - ACI211'!B18","v":"Coarse Aggregate Factor"},{"$f":"'DryBatchWeights - ACI211'!D25","v":"Water Adjustment Factor:"}]
[913,{"$f":"ACI211TargetSlump","v":0},{"$f":"'DryBatchWeights - ACI211'!B4","v":"Dry Batch Weights - ACI 211"},{"$f":"'DryBatchWeights - ACI211'!B18","v":"Coarse Aggregate Factor"},{"$f":"'DryBatchWeights - ACI211'!G22","v":"Target slump, (inches):"}]
[914,{"$f":"'DryBatchWeights - ACI211'!H23","v":0},{"$f":"'DryBatchWeights - ACI211'!B4","v":"Dry Batch Weights - ACI 211"},{"$f":"'DryBatchWeights - ACI211'!B18","v":"Coarse Aggregate Factor"},{"$f":"'DryBatchWeights - ACI211'!G23","v":"Air Entrained?:"}]
[915,{"$f":"'DryBatchWeights - ACI211'!H24","v":"Unknown"},{"$f":"'DryBatchWeights - ACI211'!B4","v":"Dry Batch Weights - ACI 211"},{"$f":"'DryBatchWeights - ACI211'!B18","v":"Coarse Aggregate Factor"},{"$f":"'DryBatchWeights - ACI211'!G24","v":"Controlling w/c or w/cm:"}]
[916,{"$f":"'DryBatchWeights - ACI211'!H25","v":700},{"$f":"'DryBatchWeights - ACI211'!B4","v":"Dry Batch Weights - ACI 211"},{"$f":"'DryBatchWeights - ACI211'!B18","v":"Coarse Aggregate Factor"},{"$f":"'DryBatchWeights - ACI211'!G25","v":"Max. Cementitious content, lb/CY:"}]
[917,{"$f":"'DryBatchWeights - ACI211'!H30","v":""},{"$f":"'DryBatchWeights - ACI211'!B4","v":"Dry Batch Weights - ACI 211"},{"$f":"'DryBatchWeights - ACI211'!B27","v":"ACI 211 Mix Design"},{"$f":"'DryBatchWeights - ACI211'!C30","v":"Total Cementitious:"},{"$f":"'DryBatchWeights - ACI211'!H28","v":"% or\nDosage"}]
[918,{"$f":"IF(ISBLANK(Class),\"\",Class)","v":""},{"$f":"General!$B$5","v":"General"},{"$f":"General!$H$13","v":"CLASS:"}]
[919,{"$f":"IF('Trial Batch Results'!F9=\"\",\"\",'Trial Batch Results'!F9)","v":""},{"$f":"'Trial Batch Results'!$B$4","v":"Trial Batch Results"},{"$f":"'Trial Batch Results'!D9","v":"Slump Flow for Precast Concrete:"},{"$f":"'Trial Batch Results'!$F$8","v":"Result"}]
[920,{"$f":"IF('Trial Batch Results'!F10=\"\",\"\",'Trial Batch Results'!F10)","v":""},{"$f":"'Trial Batch Results'!$B$4","v":"Trial Batch Results"},{"$f":"'Trial Batch Results'!D10","v":"Slump Flow for Drilled Shafts:"},{"$f":"'Trial Batch Results'!$F$8","v":"Result"}]
[921,{"$f":"IF('Trial Batch Results'!F11=\"\",\"\",'Trial Batch Results'!F11)","v":""},{"$f":"'Trial Batch Results'!$B$4","v":"Trial Batch Results"},{"$f":"'Trial Batch Results'!D11","v":"T50, sec:"},{"$f":"'Trial Batch Results'!$F$8","v":"Result"}]
[922,{"$f":"IF('Trial Batch Results'!F12=\"\",\"\",'Trial Batch Results'!F12)","v":""},{"$f":"'Trial Batch Results'!$B$4","v":"Trial Batch Results"},{"$f":"'Trial Batch Results'!D12","v":"VSI Rating:"},{"$f":"'Trial Batch Results'!$F$8","v":"Result"}]
[923,{"$f":"IF('Trial Batch Results'!F13=\"\",\"\",'Trial Batch Results'!F13)","v":""},{"$f":"'Trial Batch Results'!$B$4","v":"Trial Batch Results"},{"$f":"'Trial Batch Results'!D13","v":"Passing Ability, in.:"},{"$f":"'Trial Batch Results'!$F$8","v":"Result"}]
[924,{"$f":"IF('Trial Batch Results'!F14=\"\",\"\",'Trial Batch Results'!F14)","v":""},{"$f":"'Trial Batch Results'!$B$4","v":"Trial Batch Results"},{"$f":"'Trial Batch Results'!D14","v":"Segregation Column, %:"},{"$f":"'Trial Batch Results'!$F$8","v":"Result"}]
[925,{"$f":"IF('Trial Batch Results'!F15=\"\",\"\",'Trial Batch Results'!F15)","v":""},{"$f":"'Trial Batch Results'!$B$4","v":"Trial Batch Results"},{"$f":"'Trial Batch Results'!D15","v":"Bleeding, %:"},{"$f":"'Trial Batch Results'!$F$8","v":"Result"}]
[926,{"$f":"IF('Project Summary'!F22=\"\",\"\",'Project Summary'!F22)","v":""},{"$f":"'Project Summary'!B4","v":"Project Summary"},{"$f":"'Project Summary'!B7","v":"Project Summary"},{"$f":"'Project Summary'!E22","v":"Internal Curing:"}]
[927,{"$f":"IF('Internal Curing'!D7=\"\",\"\",'Internal Curing'!D7)","v":""},{"$f":"'Internal Curing'!$B$4","v":"Internal Curing"},{"$f":"'Internal Curing'!$D$6","v":"Coarse Agg. 1"},{"$f":"'Internal Curing'!$C$7","v":"Moisture Content, %:"}]
[928,{"$f":"IF('Internal Curing'!E7=\"\",\"\",'Internal Curing'!E7)","v":""},{"$f":"'Internal Curing'!$B$4","v":"Internal Curing"},{"$f":"'Internal Curing'!E6","v":"Coarse Agg. 2"},{"$f":"'Internal Curing'!$C$7","v":"Moisture Content, %:"}]
[929,{"$f":"IF('Internal Curing'!F7=\"\",\"\",'Internal Curing'!F7)","v":""},{"$f":"'Internal Curing'!$B$4","v":"Internal Curing"},{"$f":"'Internal Curing'!F6","v":"Interm. Agg. 1"},{"$f":"'Internal Curing'!$C$7","v":"Moisture Content, %:"}]
[930,{"$f":"IF('Internal Curing'!G7=\"\",\"\",'Internal Curing'!G7)","v":""},{"$f":"'Internal Curing'!$B$4","v":"Internal Curing"},{"$f":"'Internal Curing'!G6","v":"Interm. Agg. 2"},{"$f":"'Internal Curing'!$C$7","v":"Moisture Content, %:"}]
[931,{"$f":"IF('Internal Curing'!H7=\"\",\"\",'Internal Curing'!H7)","v":""},{"$f":"'Internal Curing'!$B$4","v":"Internal Curing"},{"$f":"'Internal Curing'!H6","v":"Fine Agg. 1"},{"$f":"'Internal Curing'!$C$7","v":"Moisture Content, %:"}]
[932,{"$f":"IF('Internal Curing'!I7=\"\",\"\",'Internal Curing'!I7)","v":""},{"$f":"'Internal Curing'!$B$4","v":"Internal Curing"},{"$f":"'Internal Curing'!I6","v":"Fine Agg. 2"},{"$f":"'Internal Curing'!$C$7","v":"Moisture Content, %:"}]
[933,{"$f":"IF('Internal Curing'!M7=\"\",\"\",'Internal Curing'!M7)","v":""},{"$f":"'Internal Curing'!$B$4","v":"Internal Curing"},{"$f":"'Internal Curing'!M6","v":"Batch Size"}]
[934,{"$f":"IF('Internal Curing'!N7=\"\",\"\",'Internal Curing'!N7)","v":""},{"$f":"'Internal Curing'!$B$4","v":"Internal Curing"},{"$f":"'Internal Curing'!M6","v":"Batch Size"}]
[935,{"$f":"IF('Internal Curing'!I10=\"\",\"\",'Internal Curing'!I10)","v":0},{"$f":"'Internal Curing'!$B$4","v":"Internal Curing"},{"$f":"'Internal Curing'!B10","v":"Basic Water Demand:"},{"$f":"'Internal Curing'!$I$9","v":"SSD Weight\nlb (fl.oz.)/CY"}]
[936,{"$f":"IF('Internal Curing'!I11=\"\",\"\",'Internal Curing'!I11)","v":""},{"$f":"'Internal Curing'!$B$4","v":"Internal Curing"},{"$f":"'Internal Curing'!B11","v":"Hydraulic cement:"},{"$f":"'Internal Curing'!$I$9","v":"SSD Weight\nlb (fl.oz.)/CY"}]
[937,{"$f":"IF('Internal Curing'!I12=\"\",\"\",'Internal Curing'!I12)","v":""},{"$f":"'Internal Curing'!$B$4","v":"Internal Curing"},{"$f":"'Internal Curing'!B12","v":""},{"$f":"'Internal Curing'!$I$9","v":"SSD Weight\nlb (fl.oz.)/CY"}]
[938,{"$f":"IF('Internal Curing'!I13=\"\",\"\",'Internal Curing'!I13)","v":""},{"$f":"'Internal Curing'!$B$4","v":"Internal Curing"},{"$f":"'Internal Curing'!B13","v":""},{"$f":"'Internal Curing'!$I$9","v":"SSD Weight\nlb (fl.oz.)/CY"}]
[939,{"$f":"IF('Internal Curing'!I14=\"\",\"\",'Internal Curing'!I14)","v":""},{"$f":"'Internal Curing'!$B$4","v":"Internal Curing"},{"$f":"'Internal Curing'!B14","v":""},{"$f":"'Internal Curing'!$I$9","v":"SSD Weight\nlb (fl.oz.)/CY"}]
[940,{"$f":"IF('Internal Curing'!I15=\"\",\"\",'Internal Curing'!I15)","v":""},{"$f":"'Internal Curing'!$B$4","v":"Internal Curing"},{"$f":"'Internal Curing'!B15","v":""},{"$f":"'Internal Curing'!$I$9","v":"SSD Weight\nlb (fl.oz.)/CY"}]
[941,{"$f":"IF('Internal Curing'!I16=\"\",\"\",'Internal Curing'!I16)","v":""},{"$f":"'Internal Curing'!$B$4","v":"Internal Curing"},{"$f":"'Internal Curing'!B16","v":""},{"$f":"'Internal Curing'!$I$9","v":"SSD Weight\nlb (fl.oz.)/CY"}]
[942,{"$f":"IF('Internal Curing'!I17=\"\",\"\",'Internal Curing'!I17)","v":""},{"$f":"'Internal Curing'!$B$4","v":"Internal Curing"},{"$f":"'Internal Curing'!B17","v":""},{"$f":"'Internal Curing'!$I$9","v":"SSD Weight\nlb (fl.oz.)/CY"}]
[943,{"$f":"IF('Internal Curing'!I18=\"\",\"\",'Internal Curing'!I18)","v":""},{"$f":"'Internal Curing'!$B$4","v":"Internal Curing"},{"$f":"'Internal Curing'!B18","v":""},{"$f":"'Internal Curing'!$I$9","v":"SSD Weight\nlb (fl.oz.)/CY"}]
[944,{"$f":"IF('Internal Curing'!I19=\"\",\"\",'Internal Curing'!I19)","v":""},{"$f":"'Internal Curing'!$B$4","v":"Internal Curing"},{"$f":"'Internal Curing'!B19","v":""},{"$f":"'Internal Curing'!$I$9","v":"SSD Weight\nlb (fl.oz.)/CY"}]
[945,{"$f":"IF('Internal Curing'!I20=\"\",\"\",'Internal Curing'!I20)","v":""},{"$f":"'Internal Curing'!$B$4","v":"Internal Curing"},{"$f":"'Internal Curing'!B20","v":""},{"$f":"'Internal Curing'!$I$9","v":"SSD Weight\nlb (fl.oz.)/CY"}]
[946,{"$f":"IF('Internal Curing'!I21=\"\",\"\",'Internal Curing'!I21)","v":""},{"$f":"'Internal Curing'!$B$4","v":"Internal Curing"},{"$f":"'Internal Curing'!B21","v":""},{"$f":"'Internal Curing'!$I$9","v":"SSD Weight\nlb (fl.oz.)/CY"}]
[947,{"$f":"IF('Internal Curing'!I22=\"\",\"\",'Internal Curing'!I22)","v":""},{"$f":"'Internal Curing'!$B$4","v":"Internal Curing"},{"$f":"'Internal Curing'!B22","v":""},{"$f":"'Internal Curing'!$I$9","v":"SSD Weight\nlb (fl.oz.)/CY"}]
[948,{"$f":"IF('Internal Curing'!I23=\"\",\"\",'Internal Curing'!I23)","v":""},{"$f":"'Internal Curing'!$B$4","v":"Internal Curing"},{"$f":"'Internal Curing'!B23","v":""},{"$f":"'Internal Curing'!$I$9","v":"SSD Weight\nlb (fl.oz.)/CY"}]
[949,{"$f":"IF('Internal Curing'!I24=\"\",\"\",'Internal Curing'!I24)","v":""},{"$f":"'Internal Curing'!$B$4","v":"Internal Curing"},{"$f":"'Internal Curing'!B24","v":""},{"$f":"'Internal Curing'!$I$9","v":"SSD Weight\nlb (fl.oz.)/CY"}]
[950,{"$f":"IF('Internal Curing'!I25=\"\",\"\",'Internal Curing'!I25)","v":""},{"$f":"'Internal Curing'!$B$4","v":"Internal Curing"},{"$f":"'Internal Curing'!B25","v":""},{"$f":"'Internal Curing'!$I$9","v":"SSD Weight\nlb (fl.oz.)/CY"}]
[951,{"$f":"IF('Internal Curing'!I26=\"\",\"\",'Internal Curing'!I26)","v":""},{"$f":"'Internal Curing'!$B$4","v":"Internal Curing"},{"$f":"'Internal Curing'!B26","v":""},{"$f":"'Internal Curing'!$I$9","v":"SSD Weight\nlb (fl.oz.)/CY"}]
[952,{"$f":"IF('Internal Curing'!I27=\"\",\"\",'Internal Curing'!I27)","v":""},{"$f":"'Internal Curing'!$B$4","v":"Internal Curing"},{"$f":"'Internal Curing'!B27","v":""},{"$f":"'Internal Curing'!$I$9","v":"SSD Weight\nlb (fl.oz.)/CY"}]
[953,{"$f":"IF('Internal Curing'!I28=\"\",\"\",'Internal Curing'!I28)","v":""},{"$f":"'Internal Curing'!$B$4","v":"Internal Curing"},{"$f":"'Internal Curing'!B28","v":""},{"$f":"'Internal Curing'!$I$9","v":"SSD Weight\nlb (fl.oz.)/CY"}]
[954,{"$f":"IF('Internal Curing'!I29=\"\",\"\",'Internal Curing'!I29)","v":""},{"$f":"'Internal Curing'!$B$4","v":"Internal Curing"},{"$f":"'Internal Curing'!B29","v":"Fibers:"},{"$f":"'Internal Curing'!$I$9","v":"SSD Weight\nlb (fl.oz.)/CY"}]
[955,{"$f":"IF('Internal Curing'!I30=\"\",\"\",'Internal Curing'!I30)","v":""},{"$f":"'Internal Curing'!$B$4","v":"Internal Curing"},{"$f":"'Internal Curing'!B30","v":""},{"$f":"'Internal Curing'!$I$9","v":"SSD Weight\nlb (fl.oz.)/CY"}]
[956,{"$f":"IF('Internal Curing'!I31=\"\",\"\",'Internal Curing'!I31)","v":0},{"$f":"'Internal Curing'!$B$4","v":"Internal Curing"},{"$f":"'Internal Curing'!B31","v":"Coarse Aggregate 1:"},{"$f":"'Internal Curing'!$I$9","v":"SSD Weight\nlb (fl.oz.)/CY"}]
[957,{"$f":"IF('Internal Curing'!I32=\"\",\"\",'Internal Curing'!I32)","v":0},{"$f":"'Internal Curing'!$B$4","v":"Internal Curing"},{"$f":"'Internal Curing'!B32","v":"Coarse Aggregate 2:"},{"$f":"'Internal Curing'!$I$9","v":"SSD Weight\nlb (fl.oz.)/CY"}]
[958,{"$f":"IF('Internal Curing'!I33=\"\",\"\",'Internal Curing'!I33)","v":0},{"$f":"'Internal Curing'!$B$4","v":"Internal Curing"},{"$f":"'Internal Curing'!B33","v":"Intermediate Aggregate 1:"},{"$f":"'Internal Curing'!$I$9","v":"SSD Weight\nlb (fl.oz.)/CY"}]
[959,{"$f":"IF('Internal Curing'!I34=\"\",\"\",'Internal Curing'!I34)","v":0},{"$f":"'Internal Curing'!$B$4","v":"Internal Curing"},{"$f":"'Internal Curing'!B34","v":"Intermediate Aggregate 2:"},{"$f":"'Internal Curing'!$I$9","v":"SSD Weight\nlb (fl.oz.)/CY"}]
[960,{"$f":"IF('Internal Curing'!I35=\"\",\"\",'Internal Curing'!I35)","v":0},{"$f":"'Internal Curing'!$B$4","v":"Internal Curing"},{"$f":"'Internal Curing'!B35","v":"Fine Aggregate 1:"},{"$f":"'Internal Curing'!$I$9","v":"SSD Weight\nlb (fl.oz.)/CY"}]
[961,{"$f":"IF('Internal Curing'!I36=\"\",\"\",'Internal Curing'!I36)","v":""},{"$f":"'Internal Curing'!$B$4","v":"Internal Curing"},{"$f":"'Internal Curing'!B36","v":"Fine Aggregate 2:"},{"$f":"'Internal Curing'!$I$9","v":"SSD Weight\nlb (fl.oz.)/CY"}]
[962,{"$f":"IF('Internal Curing'!K10=\"\",\"\",'Internal Curing'!K10)","v":""},{"$f":"'Internal Curing'!$B$4","v":"Internal Curing"},{"$f":"'Internal Curing'!B10","v":"Basic Water Demand:"},{"$f":"'Internal Curing'!$K$9","v":"MC Weight lb (fl.oz.)/CY"}]
[963,{"$f":"IF('Internal Curing'!K11=\"\",\"\",'Internal Curing'!K11)","v":""},{"$f":"'Internal Curing'!$B$4","v":"Internal Curing"},{"$f":"'Internal Curing'!B11","v":"Hydraulic cement:"},{"$f":"'Internal Curing'!$K$9","v":"MC Weight lb (fl.oz.)/CY"}]
[964,{"$f":"IF('Internal Curing'!K12=\"\",\"\",'Internal Curing'!K12)","v":""},{"$f":"'Internal Curing'!$B$4","v":"Internal Curing"},{"$f":"'Internal Curing'!B12","v":""},{"$f":"'Internal Curing'!$K$9","v":"MC Weight lb (fl.oz.)/CY"}]
[965,{"$f":"IF('Internal Curing'!K13=\"\",\"\",'Internal Curing'!K13)","v":""},{"$f":"'Internal Curing'!$B$4","v":"Internal Curing"},{"$f":"'Internal Curing'!B13","v":""},{"$f":"'Internal Curing'!$K$9","v":"MC Weight lb (fl.oz.)/CY"}]
[966,{"$f":"IF('Internal Curing'!K14=\"\",\"\",'Internal Curing'!K14)","v":""},{"$f":"'Internal Curing'!$B$4","v":"Internal Curing"},{"$f":"'Internal Curing'!B14","v":""},{"$f":"'Internal Curing'!$K$9","v":"MC Weight lb (fl.oz.)/CY"}]
[967,{"$f":"IF('Internal Curing'!K15=\"\",\"\",'Internal Curing'!K15)","v":""},{"$f":"'Internal Curing'!$B$4","v":"Internal Curing"},{"$f":"'Internal Curing'!B15","v":""},{"$f":"'Internal Curing'!$K$9","v":"MC Weight lb (fl.oz.)/CY"}]
[968,{"$f":"IF('Internal Curing'!K16=\"\",\"\",'Internal Curing'!K16)","v":""},{"$f":"'Internal Curing'!$B$4","v":"Internal Curing"},{"$f":"'Internal Curing'!B16","v":""},{"$f":"'Internal Curing'!$K$9","v":"MC Weight lb (fl.oz.)/CY"}]
[969,{"$f":"IF('Internal Curing'!K17=\"\",\"\",'Internal Curing'!K17)","v":""},{"$f":"'Internal Curing'!$B$4","v":"Internal Curing"},{"$f":"'Internal Curing'!B17","v":""},{"$f":"'Internal Curing'!$K$9","v":"MC Weight lb (fl.oz.)/CY"}]
[970,{"$f":"IF('Internal Curing'!K18=\"\",\"\",'Internal Curing'!K18)","v":""},{"$f":"'Internal Curing'!$B$4","v":"Internal Curing"},{"$f":"'Internal Curing'!B18","v":""},{"$f":"'Internal Curing'!$K$9","v":"MC Weight lb (fl.oz.)/CY"}]
[971,{"$f":"IF('Internal Curing'!K19=\"\",\"\",'Internal Curing'!K19)","v":""},{"$f":"'Internal Curing'!$B$4","v":"Internal Curing"},{"$f":"'Internal Curing'!B19","v":""},{"$f":"'Internal Curing'!$K$9","v":"MC Weight lb (fl.oz.)/CY"}]
[972,{"$f":"IF('Internal Curing'!K20=\"\",\"\",'Internal Curing'!K20)","v":""},{"$f":"'Internal Curing'!$B$4","v":"Internal Curing"},{"$f":"'Internal Curing'!B20","v":""},{"$f":"'Internal Curing'!$K$9","v":"MC Weight lb (fl.oz.)/CY"}]
[973,{"$f":"IF('Internal Curing'!K21=\"\",\"\",'Internal Curing'!K21)","v":""},{"$f":"'Internal Curing'!$B$4","v":"Internal Curing"},{"$f":"'Internal Curing'!B21","v":""},{"$f":"'Internal Curing'!$K$9","v":"MC Weight lb (fl.oz.)/CY"}]
[974,{"$f":"IF('Internal Curing'!K22=\"\",\"\",'Internal Curing'!K22)","v":""},{"$f":"'Internal Curing'!$B$4","v":"Internal Curing"},{"$f":"'Internal Curing'!B22","v":""},{"$f":"'Internal Curing'!$K$9","v":"MC Weight lb (fl.oz.)/CY"}]
[975,{"$f":"IF('Internal Curing'!K23=\"\",\"\",'Internal Curing'!K23)","v":""},{"$f":"'Internal Curing'!$B$4","v":"Internal Curing"},{"$f":"'Internal Curing'!B23","v":""},{"$f":"'Internal Curing'!$K$9","v":"MC Weight lb (fl.oz.)/CY"}]
[976,{"$f":"IF('Internal Curing'!K24=\"\",\"\",'Internal Curing'!K24)","v":""},{"$f":"'Internal Curing'!$B$4","v":"Internal Curing"},{"$f":"'Internal Curing'!B24","v":""},{"$f":"'Internal Curing'!$K$9","v":"MC Weight lb (fl.oz.)/CY"}]
[977,{"$f":"IF('Internal Curing'!K25=\"\",\"\",'Internal Curing'!K25)","v":""},{"$f":"'Internal Curing'!$B$4","v":"Internal Curing"},{"$f":"'Internal Curing'!B25","v":""},{"$f":"'Internal Curing'!$K$9","v":"MC Weight lb (fl.oz.)/CY"}]
[978,{"$f":"IF('Internal Curing'!K26=\"\",\"\",'Internal Curing'!K26)","v":""},{"$f":"'Internal Curing'!$B$4","v":"Internal Curing"},{"$f":"'Internal Curing'!B26","v":""},{"$f":"'Internal Curing'!$K$9","v":"MC Weight lb (fl.oz.)/CY"}]
[979,{"$f":"IF('Internal Curing'!K27=\"\",\"\",'Internal Curing'!K27)","v":""},{"$f":"'Internal Curing'!$B$4","v":"Internal Curing"},{"$f":"'Internal Curing'!B27","v":""},{"$f":"'Internal Curing'!$K$9","v":"MC Weight lb (fl.oz.)/CY"}]
[980,{"$f":"IF('Internal Curing'!K28=\"\",\"\",'Internal Curing'!K28)","v":""},{"$f":"'Internal Curing'!$B$4","v":"Internal Curing"},{"$f":"'Internal Curing'!B28","v":""},{"$f":"'Internal Curing'!$K$9","v":"MC Weight lb (fl.oz.)/CY"}]
[981,{"$f":"IF('Internal Curing'!K29=\"\",\"\",'Internal Curing'!K29)","v":""},{"$f":"'Internal Curing'!$B$4","v":"Internal Curing"},{"$f":"'Internal Curing'!B29","v":"Fibers:"},{"$f":"'Internal Curing'!$K$9","v":"MC Weight lb (fl.oz.)/CY"}]
[982,{"$f":"IF('Internal Curing'!K30=\"\",\"\",'Internal Curing'!K30)","v":""},{"$f":"'Internal Curing'!$B$4","v":"Internal Curing"},{"$f":"'Internal Curing'!B30","v":""},{"$f":"'Internal Curing'!$K$9","v":"MC Weight lb (fl.oz.)/CY"}]
[983,{"$f":"IF('Internal Curing'!K31=\"\",\"\",'Internal Curing'!K31)","v":0},{"$f":"'Internal Curing'!$B$4","v":"Internal Curing"},{"$f":"'Internal Curing'!B31","v":"Coarse Aggregate 1:"},{"$f":"'Internal Curing'!$K$9","v":"MC Weight lb (fl.oz.)/CY"}]
[984,{"$f":"IF('Internal Curing'!K32=\"\",\"\",'Internal Curing'!K32)","v":0},{"$f":"'Internal Curing'!$B$4","v":"Internal Curing"},{"$f":"'Internal Curing'!B32","v":"Coarse Aggregate 2:"},{"$f":"'Internal Curing'!$K$9","v":"MC Weight lb (fl.oz.)/CY"}]
[985,{"$f":"IF('Internal Curing'!K33=\"\",\"\",'Internal Curing'!K33)","v":0},{"$f":"'Internal Curing'!$B$4","v":"Internal Curing"},{"$f":"'Internal Curing'!B33","v":"Intermediate Aggregate 1:"},{"$f":"'Internal Curing'!$K$9","v":"MC Weight lb (fl.oz.)/CY"}]
[986,{"$f":"IF('Internal Curing'!K34=\"\",\"\",'Internal Curing'!K34)","v":0},{"$f":"'Internal Curing'!$B$4","v":"Internal Curing"},{"$f":"'Internal Curing'!B34","v":"Intermediate Aggregate 2:"},{"$f":"'Internal Curing'!$K$9","v":"MC Weight lb (fl.oz.)/CY"}]
[987,{"$f":"IF('Internal Curing'!K35=\"\",\"\",'Internal Curing'!K35)","v":0},{"$f":"'Internal Curing'!$B$4","v":"Internal Curing"},{"$f":"'Internal Curing'!B35","v":"Fine Aggregate 1:"},{"$f":"'Internal Curing'!$K$9","v":"MC Weight lb (fl.oz.)/CY"}]
[988,{"$f":"IF('Internal Curing'!K36=\"\",\"\",'Internal Curing'!K36)","v":""},{"$f":"'Internal Curing'!$B$4","v":"Internal Curing"},{"$f":"'Internal Curing'!B36","v":"Fine Aggregate 2:"},{"$f":"'Internal Curing'!$K$9","v":"MC Weight lb (fl.oz.)/CY"}]
[989,{"$f":"IF('Internal Curing'!M10=\"\",\"\",'Internal Curing'!M10)","v":""},{"$f":"'Internal Curing'!$B$4","v":"Internal Curing"},{"$f":"'Internal Curing'!B10","v":"Basic Water Demand:"},{"$f":"'Internal Curing'!$M$9","v":""}]
[990,{"$f":"IF('Internal Curing'!M11=\"\",\"\",'Internal Curing'!M11)","v":""},{"$f":"'Internal Curing'!$B$4","v":"Internal Curing"},{"$f":"'Internal Curing'!B11","v":"Hydraulic cement:"},{"$f":"'Internal Curing'!$M$9","v":""}]
[991,{"$f":"IF('Internal Curing'!M12=\"\",\"\",'Internal Curing'!M12)","v":""},{"$f":"'Internal Curing'!$B$4","v":"Internal Curing"},{"$f":"'Internal Curing'!B12","v":""},{"$f":"'Internal Curing'!$M$9","v":""}]
[992,{"$f":"IF('Internal Curing'!M13=\"\",\"\",'Internal Curing'!M13)","v":""},{"$f":"'Internal Curing'!$B$4","v":"Internal Curing"},{"$f":"'Internal Curing'!B13","v":""},{"$f":"'Internal Curing'!$M$9","v":""}]
[993,{"$f":"IF('Internal Curing'!M14=\"\",\"\",'Internal Curing'!M14)","v":""},{"$f":"'Internal Curing'!$B$4","v":"Internal Curing"},{"$f":"'Internal Curing'!B14","v":""},{"$f":"'Internal Curing'!$M$9","v":""}]
[994,{"$f":"IF('Internal Curing'!M15=\"\",\"\",'Internal Curing'!M15)","v":""},{"$f":"'Internal Curing'!$B$4","v":"Internal Curing"},{"$f":"'Internal Curing'!B15","v":""},{"$f":"'Internal Curing'!$M$9","v":""}]
[995,{"$f":"IF('Internal Curing'!M16=\"\",\"\",'Internal Curing'!M16)","v":""},{"$f":"'Internal Curing'!$B$4","v":"Internal Curing"},{"$f":"'Internal Curing'!B16","v":""},{"$f":"'Internal Curing'!$M$9","v":""}]
[996,{"$f":"IF('Internal Curing'!M17=\"\",\"\",'Internal Curing'!M17)","v":""},{"$f":"'Internal Curing'!$B$4","v":"Internal Curing"},{"$f":"'Internal Curing'!B17","v":""},{"$f":"'Internal Curing'!$M$9","v":""}]
[997,{"$f":"IF('Internal Curing'!M18=\"\",\"\",'Internal Curing'!M18)","v":""},{"$f":"'Internal Curing'!$B$4","v":"Internal Curing"},{"$f":"'Internal Curing'!B18","v":""},{"$f":"'Internal Curing'!$M$9","v":""}]
[998,{"$f":"IF('Internal Curing'!M19=\"\",\"\",'Internal Curing'!M19)","v":""},{"$f":"'Internal Curing'!$B$4","v":"Internal Curing"},{"$f":"'Internal Curing'!B19","v":""},{"$f":"'Internal Curing'!$M$9","v":""}]
[999,{"$f":"IF('Internal Curing'!M20=\"\",\"\",'Internal Curing'!M20)","v":""},{"$f":"'Internal Curing'!$B$4","v":"Internal Curing"},{"$f":"'Internal Curing'!B20","v":""},{"$f":"'Internal Curing'!$M$9","v":""}]
[1000,{"$f":"IF('Internal Curing'!M21=\"\",\"\",'Internal Curing'!M21)","v":""},{"$f":"'Internal Curing'!$B$4","v":"Internal Curing"},{"$f":"'Internal Curing'!B21","v":""},{"$f":"'Internal Curing'!$M$9","v":""}]
[1001,{"$f":"IF('Internal Curing'!M22=\"\",\"\",'Internal Curing'!M22)","v":""},{"$f":"'Internal Curing'!$B$4","v":"Internal Curing"},{"$f":"'Internal Curing'!B22","v":""},{"$f":"'Internal Curing'!$M$9","v":""}]
[1002,{"$f":"IF('Internal Curing'!M23=\"\",\"\",'Internal Curing'!M23)","v":""},{"$f":"'Internal Curing'!$B$4","v":"Internal Curing"},{"$f":"'Internal Curing'!B23","v":""},{"$f":"'Internal Curing'!$M$9","v":""}]
[1003,{"$f":"IF('Internal Curing'!M24=\"\",\"\",'Internal Curing'!M24)","v":""},{"$f":"'Internal Curing'!$B$4","v":"Internal Curing"},{"$f":"'Internal Curing'!B24","v":""},{"$f":"'Internal Curing'!$M$9","v":""}]
[1004,{"$f":"IF('Internal Curing'!M25=\"\",\"\",'Internal Curing'!M25)","v":""},{"$f":"'Internal Curing'!$B$4","v":"Internal Curing"},{"$f":"'Internal Curing'!B25","v":""},{"$f":"'Internal Curing'!$M$9","v":""}]
[1005,{"$f":"IF('Internal Curing'!M26=\"\",\"\",'Internal Curing'!M26)","v":""},{"$f":"'Internal Curing'!$B$4","v":"Internal Curing"},{"$f":"'Internal Curing'!B26","v":""},{"$f":"'Internal Curing'!$M$9","v":""}]
[1006,{"$f":"IF('Internal Curing'!M27=\"\",\"\",'Internal Curing'!M27)","v":""},{"$f":"'Internal Curing'!$B$4","v":"Internal Curing"},{"$f":"'Internal Curing'!B27","v":""},{"$f":"'Internal Curing'!$M$9","v":""}]
[1007,{"$f":"IF('Internal Curing'!M28=\"\",\"\",'Internal Curing'!M28)","v":""},{"$f":"'Internal Curing'!$B$4","v":"Internal Curing"},{"$f":"'Internal Curing'!B28","v":""},{"$f":"'Internal Curing'!$M$9","v":""}]
[1008,{"$f":"IF('Internal Curing'!M29=\"\",\"\",'Internal Curing'!M29)","v":""},{"$f":"'Internal Curing'!$B$4","v":"Internal Curing"},{"$f":"'Internal Curing'!B29","v":"Fibers:"},{"$f":"'Internal Curing'!$M$9","v":""}]
[1009,{"$f":"IF('Internal Curing'!M30=\"\",\"\",'Internal Curing'!M30)","v":""},{"$f":"'Internal Curing'!$B$4","v":"Internal Curing"},{"$f":"'Internal Curing'!B30","v":""},{"$f":"'Internal Curing'!$M$9","v":""}]
[1010,{"$f":"IF('Internal Curing'!M31=\"\",\"\",'Internal Curing'!M31)","v":""},{"$f":"'Internal Curing'!$B$4","v":"Internal Curing"},{"$f":"'Internal Curing'!B31","v":"Coarse Aggregate 1:"},{"$f":"'Internal Curing'!$M$9","v":""}]
[1011,{"$f":"IF('Internal Curing'!M32=\"\",\"\",'Internal Curing'!M32)","v":""},{"$f":"'Internal Curing'!$B$4","v":"Internal Curing"},{"$f":"'Internal Curing'!B32","v":"Coarse Aggregate 2:"},{"$f":"'Internal Curing'!$M$9","v":""}]
[1012,{"$f":"IF('Internal Curing'!M33=\"\",\"\",'Internal Curing'!M33)","v":""},{"$f":"'Internal Curing'!$B$4","v":"Internal Curing"},{"$f":"'Internal Curing'!B33","v":"Intermediate Aggregate 1:"},{"$f":"'Internal Curing'!$M$9","v":""}]
[1013,{"$f":"IF('Internal Curing'!M34=\"\",\"\",'Internal Curing'!M34)","v":""},{"$f":"'Internal Curing'!$B$4","v":"Internal Curing"},{"$f":"'Internal Curing'!B34","v":"Intermediate Aggregate 2:"},{"$f":"'Internal Curing'!$M$9","v":""}]
[1014,{"$f":"IF('Internal Curing'!M35=\"\",\"\",'Internal Curing'!M35)","v":""},{"$f":"'Internal Curing'!$B$4","v":"Internal Curing"},{"$f":"'Internal Curing'!B35","v":"Fine Aggregate 1:"},{"$f":"'Internal Curing'!$M$9","v":""}]
[1015,{"$f":"IF('Internal Curing'!M36=\"\",\"\",'Internal Curing'!M36)","v":""},{"$f":"'Internal Curing'!$B$4","v":"Internal Curing"},{"$f":"'Internal Curing'!B36","v":"Fine Aggregate 2:"},{"$f":"'Internal Curing'!$M$9","v":""}]
[1016,{"$f":"IF('Internal Curing'!F41=\"\",\"\",'Internal Curing'!F41)","v":0},{"$f":"'Internal Curing'!$B$4","v":"Internal Curing"},{"$f":"'Internal Curing'!$D$40","v":"Internal Curing Properties"},{"$f":"'Internal Curing'!E41","v":"LWA Absorption:"}]
[1017,{"$f":"IF('Internal Curing'!F42=\"\",\"\",'Internal Curing'!F42)","v":0.85},{"$f":"'Internal Curing'!$B$4","v":"Internal Curing"},{"$f":"'Internal Curing'!$D$40","v":"Internal Curing Properties"},{"$f":"'Internal Curing'!E42","v":"LWA Desorption:"}]
[1018,{"$f":"IF('Internal Curing'!F43=\"\",\"\",'Internal Curing'!F43)","v":0},{"$f":"'Internal Curing'!$B$4","v":"Internal Curing"},{"$f":"'Internal Curing'!$D$40","v":"Internal Curing Properties"},{"$f":"'Internal Curing'!E43","v":"LWA PSD Specific Gravity:"}]
[1019,{"$f":"IF('Internal Curing'!F44=\"\",\"\",'Internal Curing'!F44)","v":0},{"$f":"'Internal Curing'!$B$4","v":"Internal Curing"},{"$f":"'Internal Curing'!$D$40","v":"Internal Curing Properties"},{"$f":"'Internal Curing'!E44","v":"Cement Factor:"}]
[1020,{"$f":"IF('Internal Curing'!F45=\"\",\"\",'Internal Curing'!F45)","v":7.0000000000000007E-2},{"$f":"'Internal Curing'!$B$4","v":"Internal Curing"},{"$f":"'Internal Curing'!$D$40","v":"Internal Curing Properties"},{"$f":"'Internal Curing'!E45","v":"Chemical Shrinkage:"}]
[1021,{"$f":"IF('Internal Curing'!F46=\"\",\"\",'Internal Curing'!F46)","v":""},{"$f":"'Internal Curing'!$B$4","v":"Internal Curing"},{"$f":"'Internal Curing'!$D$40","v":"Internal Curing Properties"},{"$f":"'Internal Curing'!E46","v":"Degree of Hydration:"}]
[1022,{"$f":"IF('Internal Curing'!F47=\"\",\"\",'Internal Curing'!F47)","v":""},{"$f":"'Internal Curing'!$B$4","v":"Internal Curing"},{"$f":"'Internal Curing'!$D$40","v":"Internal Curing Properties"},{"$f":"'Internal Curing'!E47","v":"PSD LWA Replacement:"}]
[1023,{"$f":"IF('Internal Curing'!F48=\"\",\"\",'Internal Curing'!F48)","v":""},{"$f":"'Internal Curing'!$B$4","v":"Internal Curing"},{"$f":"'Internal Curing'!$D$40","v":"Internal Curing Properties"},{"$f":"'Internal Curing'!E48","v":"SSD Sand Replaced:"}]
[1024,{"$f":"IF('Internal Curing'!G43=\"\",\"\",'Internal Curing'!G43)","v":""},{"$f":"'Internal Curing'!$B$4","v":"Internal Curing"},{"$f":"'Internal Curing'!$D$40","v":"Internal Curing Properties"},{"$f":"'Internal Curing'!E43","v":"LWA PSD Specific Gravity:"}]
[1025,{"$f":"IF('Project Summary'!D24=\"\",\"\",'Project Summary'!D24)","v":""},{"$f":"'Project Summary'!B7","v":"Project Summary"},{"$f":"'Project Summary'!C24","v":"Is this for CRCP?:"}]
[1026,{"$f":"IF('Project Summary'!G24=\"\",\"\",'Project Summary'!G24)","v":""},{"$f":"'Project Summary'!B7","v":"Project Summary"},{"$f":"'Project Summary'!F24","v":"Coarse Aggregate CoTE Value:"}]
[1027,{"$f":"IF('Project Summary'!K24=\"\",\"\",'Project Summary'!K24)","v":""},{"$f":"'Project Summary'!B7","v":"Project Summary"},{"$f":"'Project Summary'!J24","v":"Last Verified Date:"}]
[1028,{"$f":"IF(ISBLANK(General!D30), \"\", General!D30)","v":""},{"$f":"General!D28","v":"Tested By:"},{"$f":"General!C30","v":"HCCMXDES24"}]
[1029,{"$f":"IF(ISBLANK(General!G30), \"\", General!G30)","v":""},{"$f":"General!G28","v":"Tested Date:"},{"$f":"General!C30","v":"HCCMXDES24"}]
[1030,{"$f":"IF('Air&MixDesignOptions'!F29=\"\", \"\", 'Air&MixDesignOptions'!F29)","v":""},{"$f":"'Air&MixDesignOptions'!$B$4","v":"Air Entrainment and Mix Design Options"},{"$f":"'Air&MixDesignOptions'!$B$17","v":"Mix Design Option"},{"$f":"'Air&MixDesignOptions'!$B$29","v":"Limestone content of cement (%)*:"}]

{"sheet":"Internal Curing","index":14,"n_rows":48,"n_cols":14,"rows_kept":48,"cut":false,"hidden":true,"merged":[[35,1,35,3],[35,5,35,6],[35,8,35,9],[39,3,39,5],[33,1,33,3],[33,5,33,6],[33,8,33,9],[34,1,34,3],[34,5,34,6],[34,8,34,9],[31,1,31,3],[31,5,31,6],[31,8,31,9],[32,1,32,3],[32,5,32,6],[32,8,32,9],[29,1,29,3],[29,5,29,6],[29,8,29,9],[30,1,30,3],[30,5,30,6],[30,8,30,9],[27,1,27,3],[27,5,27,6],[27,8,27,9],[28,1,28,3],[28,5,28,6],[28,8,28,9],[25,1,25,3],[25,5,25,6],[25,8,25,9],[26,1,26,3],[26,5,26,6],[26,8,26,9],[23,1,23,3],[23,5,23,6],[23,8,23,9],[24,1,24,3],[24,5,24,6],[24,8,24,9],[21,1,21,3],[21,5,21,6],[21,8,21,9],[22,1,22,3],[22,5,22,6],[22,8,22,9],[19,1,19,3],[19,5,19,6],[19,8,19,9],[20,1,20,3],[20,5,20,6],[20,8,20,9],[17,1,17,3],[17,5,17,6],[17,8,17,9],[18,1,18,3],[18,5,18,6],[18,8,18,9],[15,1,15,3],[15,5,15,6],[15,8,15,9],[16,1,16,3],[16,5,16,6],[16,8,16,9],[13,1,13,3],[13,5,13,6],[13,8,13,9],[14,1,14,3],[14,5,14,6],[14,8,14,9],[11,1,11,3],[11,5,11,6],[11,8,11,9],[12,1,12,3],[12,5,12,6],[12,8,12,9],[9,1,9,3],[9,5,9,6],[9,8,9,9],[10,1,10,3],[10,5,10,6],[10,8,10,9],[5,8,5,9],[5,12,5,13],[6,8,6,9],[8,1,8,3],[8,5,8,6],[8,8,8,9],[8,10,8,11],[8,12,8,13]]}
[]
[null,"TEXAS DEPARTMENT OF TRANSPORTATION"]
[null,"HYDRAULIC CEMENT CONCRETE MIX DESIGN & CONTROL"]
[null,"Internal Curing"]
[]
[null,null,"Aggregate:","Coarse Agg. 1","Coarse Agg. 2","Interm. Agg. 1","Interm. Agg. 2","Fine Agg. 1",{"$f":"IF(Field24=\"Yes\", \"Lt. Wt. Agg.\", \"Fine Agg. 2\")","v":"Fine Agg. 2"},null,null,null,"Batch Size"]
[null,null,"Moisture Content, %:"]
[]
[null,"Mix Component",null,null,"Type/Class/Grade","Producer/Source",null,"% of Dosage","SSD Weight\nlb (fl.oz.)/CY",null,"MC Weight lb (fl.oz.)/CY",null,{"$f":"IF(AND(M7<>\"\", N7<>\"\"), CONCATENATE(\"Batch Weights for \", M7, \" \", N7), \"\")","v":""}]
[null,"Basic Water Demand:",null,null,null,{"$f":"IF(MDInput=\"Existing Design\", IF(OR(ISBLANK('DryBatchWeights - Existing'!F9), 'DryBatchWeights - Existing'!F9=\"\"), \"\", 'DryBatchWeights - Existing'!F9), IF(OR(ISBLANK('DryBatchWeights - ACI211'!F29),'DryBatchWeights - ACI211'!F29=\"\"), \"\", 'DryBatchWeights - ACI211'!F29))","v":""},null,null,{"$f":"IF(MDInput=\"Existing Design\", IF(OR(ISBLANK('DryBatchWeights - Existing'!K9), 'DryBatchWeights - Existing'!K9=\"\"), \"\", 'DryBatchWeights - Existing'!K9), IF(OR(ISBLANK('DryBatchWeights - ACI211'!K29), 'DryBatchWeights - ACI211'!K29=\"\"), \"\", 'DryBatchWeights - ACI211'!K29))","v":0},null,{"$f":"IF(ISERROR(I10+(I31-K31)+(I35-K35)+(I32-K32)+(I33-K33)+(I34-K34)+(I36-K36)),\"\",I10+(I31-K31)+(I35-K35)+(I32-K32)+(I33-K33)+(I34-K34)+(I36-K36))","v":""},"lb",{"$f":"IF(K10=\"\", \"\", IF($N$7=\"cu.ft.\", K10*$M$7/27, IF($N$7=\"cu.yd.\", K10*$M$7, \"\")))","v":""},{"$f":"IF($M$9=\"\", \"\", \"lb\")","v":""}]
[null,"Hydraulic cement:",null,null,{"$f":"IF(ISBLANK('Matl Properties'!I18), \"\", 'Matl Properties'!I18)","v":""},{"$f":"IF(AND(ISBLANK(HC1Prod), ISBLANK(HC1Plant)), \"\", CONCATENATE(HC1Prod,\"/\",HC1Plant))","v":""},null,{"$f":"IF(OR(ISBLANK(I11),I11=\"\"),\"\",ROUND(I11*100/SUM($I$11:$J$19),0))","v":""},{"$f":"IF(MDInput=\"Existing Design\", IF(OR(ISBLANK('DryBatchWeights - Existing'!K11), 'DryBatchWeights - Existing'!K11=\"\"), \"\", 'DryBatchWeights - Existing'!K11), IF(OR(ISBLANK('DryBatchWeights - ACI211'!K31), 'DryBatchWeights - ACI211'!K31=\"\"), \"\", 'DryBatchWeights - ACI211'!K31))","v":""},null,{"$f":"I11","v":""},"lb","",{"$f":"IF($M$9=\"\", \"\", \"lb\")","v":""}]
[null,{"$f":"IF(ISBLANK(Cementitious2), \"\", CONCATENATE(Cementitious2,\":\"))","v":""},null,null,{"$f":"IF(ISBLANK('Matl Properties'!I19), \"\", 'Matl Properties'!I19)","v":""},{"$f":"IF(AND(ISBLANK(SCM2Prod), ISBLANK(SCM2Plant)), \"\", CONCATENATE(SCM2Prod,\"/\",SCM2Plant))","v":""},null,"",{"$f":"IF(MDInput=\"Existing Design\", IF(OR(ISBLANK('DryBatchWeights - Existing'!K12), 'DryBatchWeights - Existing'!K12=\"\"), \"\", 'DryBatchWeights - Existing'!K12), IF(OR(ISBLANK('DryBatchWeights - ACI211'!K32), 'DryBatchWeights - ACI211'!K32=\"\"), \"\", 'DryBatchWeights - ACI211'!K32))","v":""},null,{"$f":"I12","v":""},"lb","",""]
[null,{"$f":"IF(ISBLANK(Cementitious3), \"\", CONCATENATE(Cementitious3,\":\"))","v":""},null,null,{"$f":"IF(ISBLANK('Matl Properties'!I20), \"\", 'Matl Properties'!I20)","v":""},{"$f":"IF(AND(ISBLANK(SCM3Prod), ISBLANK(SCM3Plant)), \"\", CONCATENATE(SCM3Prod,\"/\",SCM3Plant))","v":""},null,"",{"$f":"IF(MDInput=\"Existing Design\", IF(OR(ISBLANK('DryBatchWeights - Existing'!K13), 'DryBatchWeights - Existing'!K13=\"\"), \"\", 'DryBatchWeights - Existing'!K13), IF(OR(ISBLANK('DryBatchWeights - ACI211'!K33), 'DryBatchWeights - ACI211'!K33=\"\"), \"\", 'DryBatchWeights - ACI211'!K33))","v":""},null,"","lb","",""]
[null,{"$f":"IF(ISBLANK(Cementitious4), \"\", CONCATENATE(Cementitious4,\":\"))","v":""},null,null,{"$f":"IF(ISBLANK('Matl Properties'!I21), \"\", 'Matl Properties'!I21)","v":""},{"$f":"IF(AND(ISBLANK(SCM4Prod), ISBLANK(SCM4Plant)), \"\",CONCATENATE(SCM4Prod,\"/\",SCM4Plant))","v":""},null,"",{"$f":"IF(MDInput=\"Existing Design\", IF(OR(ISBLANK('DryBatchWeights - Existing'!K14), 'DryBatchWeights - Existing'!K14=\"\"), \"\", 'DryBatchWeights - Existing'!K14), IF(OR(ISBLANK('DryBatchWeights - ACI211'!K34), 'DryBatchWeights - ACI211'!K34=\"\"), \"\", 'DryBatchWeights - ACI211'!K34))","v":""},null,"","lb",{"$f":"IF(K14=\"\", \"\", IF($N$7=\"cu.ft.\", K14*$M$7/27, IF($N$7=\"cu.yd.\", K14*$M$7, \"\")))","v":""},""]
[null,{"$f":"IF(ISBLANK(Cementitious5), \"\", CONCATENATE(Cementitious5,\":\"))","v":""},null,null,{"$f":"IF(ISBLANK('Matl Properties'!I22), \"\", 'Matl Properties'!I22)","v":""},{"$f":"IF(AND(ISBLANK(SCM5Prod), ISBLANK(SCM5Plant)), \"\", CONCATENATE(SCM5Prod,\"/\",SCM5Plant))","v":""},null,"",{"$f":"IF(MDInput=\"Existing Design\", IF(OR(ISBLANK('DryBatchWeights - Existing'!K15), 'DryBatchWeights - Existing'!K15=\"\"), \"\", 'DryBatchWeights - Existing'!K15), IF(OR(ISBLANK('DryBatchWeights - ACI211'!K35), 'DryBatchWeights - ACI211'!K35=\"\"), \"\", 'DryBatchWeights - ACI211'!K35))","v":""},null,"","lb",{"$f":"IF(K15=\"\", \"\", IF($N$7=\"cu.ft.\", K15*$M$7/27, IF($N$7=\"cu.yd.\", K15*$M$7, \"\")))","v":""},""]
[null,{"$f":"IF(ISBLANK(Cementitious6), \"\", CONCATENATE(Cementitious6,\":\"))","v":""},null,null,{"$f":"IF(ISBLANK('Matl Properties'!I23), \"\", 'Matl Properties'!I23)","v":""},{"$f":"IF(AND(ISBLANK(SCM6Prod), ISBLANK(SCM6Plant)), \"\", CONCATENATE(SCM6Prod,\"/\",SCM6Plant))","v":""},null,"",{"$f":"IF(MDInput=\"Existing Design\", IF(OR(ISBLANK('DryBatchWeights - Existing'!K16), 'DryBatchWeights - Existing'!K16=\"\"), \"\", 'DryBatchWeights - Existing'!K16), IF(OR(ISBLANK('DryBatchWeights - ACI211'!K36), 'DryBatchWeights - ACI211'!K36=\"\"), \"\", 'DryBatchWeights - ACI211'!K36))","v":""},null,"","lb","",""]
[null,{"$f":"IF(ISBLANK(Cementitious7), \"\", CONCATENATE(Cementitious7,\":\"))","v":""},null,null,{"$f":"IF(ISBLANK('Matl Properties'!I24), \"\", 'Matl Properties'!I24)","v":""},{"$f":"IF(AND(ISBLANK(SCM7Prod), ISBLANK(SCM7Plant)), \"\", CONCATENATE(SCM7Prod,\"/\",SCM7Plant))","v":""},null,"",{"$f":"IF(MDInput=\"Existing Design\", IF(OR(ISBLANK('DryBatchWeights - Existing'!K17), 'DryBatchWeights - Existing'!K17=\"\"), \"\", 'DryBatchWeights - Existing'!K17), IF(OR(ISBLANK('DryBatchWeights - ACI211'!K37), 'DryBatchWeights - ACI211'!K37=\"\"), \"\", 'DryBatchWeights - ACI211'!K37))","v":""},null,"","lb","",""]
[null,{"$f":"IF(ISBLANK(Cementitious8), \"\", CONCATENATE(Cementitious8,\":\"))","v":""},null,null,{"$f":"IF(ISBLANK('Matl Properties'!I25), \"\", 'Matl Properties'!I25)","v":""},{"$f":"IF(AND(ISBLANK(SCM8Prod), ISBLANK(SCM8Plant)), \"\", CONCATENATE(SCM8Prod,\"/\",SCM8Plant))","v":""},null,"",{"$f":"IF(MDInput=\"Existing Design\", IF(OR(ISBLANK('DryBatchWeights - Existing'!K18), 'DryBatchWeights - Existing'!K18=\"\"), \"\", 'DryBatchWeights - Existing'!K18), IF(OR(ISBLANK('DryBatchWeights - ACI211'!K38), 'DryBatchWeights - ACI211'!K38=\"\"), \"\", 'DryBatchWeights - ACI211'!K38))","v":""},null,"","lb","",""]
[null,{"$f":"IF(ISBLANK(Cementitious9), \"\", CONCATENATE(Cementitious9, \":\"))","v":""},null,null,{"$f":"IF(ISBLANK('Matl Properties'!I26), \"\", 'Matl Properties'!I26)","v":""},{"$f":"IF(AND(ISBLANK(SCM9Prod), ISBLANK(SCM9Plant)), \"\", CONCATENATE(SCM9Prod,\"/\",SCM9Plant))","v":""},null,"",{"$f":"IF(MDInput=\"Existing Design\", IF(OR(ISBLANK('DryBatchWeights - Existing'!K19), 'DryBatchWeights - Existing'!K19=\"\"), \"\", 'DryBatchWeights - Existing'!K19), IF(OR(ISBLANK('DryBatchWeights - ACI211'!K39), 'DryBatchWeights - ACI211'!K39=\"\"), \"\", 'DryBatchWeights - ACI211'!K39))","v":""},null,"","lb","",""]
[null,{"$f":"IF(ISBLANK(Admix1), \"\", CONCATENATE(Admix1, \":\"))","v":""},null,null,{"$f":"IF(ISBLANK(Admix1), \"\", IF(VLOOKUP(Admix1, DATA_Tables!D29:E36, 2)<>0,VLOOKUP(Admix1, DATA_Tables!D29:E36, 2), \"\"))","v":""},{"$f":"IF(AND(ISBLANK(Admix1Prod), ISBLANK(Admix1Name)), \"\", CONCATENATE(Admix1Prod,\"/\",Admix1Name))","v":""},null,{"$f":"IF(MDInput=\"Existing Design\", IF(OR(ISBLANK('DryBatchWeights - Existing'!H20), 'DryBatchWeights - Existing'!H20=\"\"), \"\", 'DryBatchWeights - Existing'!H20), IF(OR(ISBLANK('DryBatchWeights - ACI211'!H40), 'DryBatchWeights - ACI211'!H40=\"\"), \"\", 'DryBatchWeights - ACI211'!H40))","v":""},{"$f":"IF(MDInput=\"Existing Design\", IF(OR(ISBLANK('DryBatchWeights - Existing'!I20), 'DryBatchWeights - Existing'!I20=\"\"), \"\", CONCATENATE(\"(\", ROUND('DryBatchWeights - Existing'!I20/0.00104437934,2), \")\")), IF(OR(ISBLANK('DryBatchWeights - ACI211'!I40), 'DryBatchWeights - ACI211'!I40=\"\"), \"\", CONCATENATE(\"(\", ROUND('DryBatchWeights - ACI211'!I40/0.00104437934,2), \")\")))","v":""},null,"","oz",{"$f":"IFERROR(IF($N$7=\"cu.ft.\", CONCATENATE(\"(\", ROUND(ABS(K20*$M$7/27), 2), \")\"), IF($N$7=\"cu.yd.\", CONCATENATE(\"(\",ROUND(ABS(K20*$M$7), 2),\")\"), \"\")),\"\")","v":""},{"$f":"IF($M$9=\"\", \"\", \"oz\")","v":""}]
[null,{"$f":"IF(ISBLANK(Admix2), \"\", CONCATENATE(Admix2, \":\"))","v":""},null,null,{"$f":"IF(ISBLANK(Admix2), \"\", IF(VLOOKUP(Admix2, DATA_Tables!D29:E36, 2)<>0,VLOOKUP(Admix2, DATA_Tables!D29:E36, 2), \"\"))","v":""},{"$f":"IF(AND(ISBLANK(Admix2Prod), ISBLANK(Admix2Name)), \"\", CONCATENATE(Admix2Prod,\"/\",Admix2Name))","v":""},null,{"$f":"IF(MDInput=\"Existing Design\", IF(OR(ISBLANK('DryBatchWeights - Existing'!H21), 'DryBatchWeights - Existing'!H21=\"\"), \"\", 'DryBatchWeights - Existing'!H21), IF(OR(ISBLANK('DryBatchWeights - ACI211'!H41), 'DryBatchWeights - ACI211'!H41=\"\"), \"\", 'DryBatchWeights - ACI211'!H41))","v":""},{"$f":"IF(MDInput=\"Existing Design\", IF(OR(ISBLANK('DryBatchWeights - Existing'!I21), 'DryBatchWeights - Existing'!I21=\"\"), \"\", CONCATENATE(\"(\", ROUND('DryBatchWeights - Existing'!I21/0.00104437934,2), \")\")), IF(OR(ISBLANK('DryBatchWeights - ACI211'!I41), 'DryBatchWeights - ACI211'!I41=\"\"), \"\", CONCATENATE(\"(\", ROUND('DryBatchWeights - ACI211'!I41/0.00104437934,2), \")\")))","v":""},null,"","oz",{"$f":"IFERROR(IF($N$7=\"cu.ft.\",CONCATENATE(\"(\",ROUND(ABS(K21*$M$7/27),2),\")\"),IF($N$7=\"cu.yd.\",CONCATENATE(\"(\",ROUND(ABS(K21*$M$7),2),\")\"),\"\")),\"\")","v":""},{"$f":"IF($M$9=\"\", \"\", \"oz\")","v":""}]
[null,{"$f":"IF(ISBLANK(Admix3), \"\", CONCATENATE(Admix3,\":\"))","v":""},null,null,{"$f":"IF(ISBLANK(Admix3), \"\", IF(VLOOKUP(Admix3, DATA_Tables!D29:E36, 2)<>0,VLOOKUP(Admix3, DATA_Tables!D29:E36, 2), \"\"))","v":""},{"$f":"IF(AND(ISBLANK(Admix3Prod), ISBLANK(Admix3Name)), \"\", CONCATENATE(Admix3Prod,\"/\",Admix3Name))","v":""},null,{"$f":"IF(MDInput=\"Existing Design\", IF(OR(ISBLANK('DryBatchWeights - Existing'!H22), 'DryBatchWeights - Existing'!H22=\"\"), \"\", 'DryBatchWeights - Existing'!H22), IF(OR(ISBLANK('DryBatchWeights - ACI211'!H42), 'DryBatchWeights - ACI211'!H42=\"\"), \"\", 'DryBatchWeights - ACI211'!H42))","v":""},{"$f":"IF(MDInput=\"Existing Design\", IF(OR(ISBLANK('DryBatchWeights - Existing'!I22), 'DryBatchWeights - Existing'!I22=\"\"), \"\", CONCATENATE(\"(\", ROUND('DryBatchWeights - Existing'!I22/0.00104437934,2), \")\")), IF(OR(ISBLANK('DryBatchWeights - ACI211'!I42), 'DryBatchWeights - ACI211'!I42=\"\"), \"\", CONCATENATE(\"(\", ROUND('DryBatchWeights - ACI211'!I42/0.00104437934,2), \")\")))","v":""},null,"","oz","",""]
[null,{"$f":"IF(ISBLANK(Admix4), \"\", CONCATENATE(Admix4,\":\"))","v":""},null,null,{"$f":"IF(ISBLANK(Admix4), \"\", IF(VLOOKUP(Admix4, DATA_Tables!D29:E36, 2)<>0,VLOOKUP(Admix4, DATA_Tables!D29:E36, 2), \"\"))","v":""},{"$f":"IF(AND(ISBLANK(Admix4Prod), ISBLANK(Admix4Name)), \"\", CONCATENATE(Admix4Prod,\"/\",Admix4Name))","v":""},null,{"$f":"IF(MDInput=\"Existing Design\", IF(OR(ISBLANK('DryBatchWeights - Existing'!H23), 'DryBatchWeights - Existing'!H23=\"\"), \"\", 'DryBatchWeights - Existing'!H23), IF(OR(ISBLANK('DryBatchWeights - ACI211'!H43), 'DryBatchWeights - ACI211'!H43=\"\"), \"\", 'DryBatchWeights - ACI211'!H43))","v":""},{"$f":"IF(MDInput=\"Existing Design\", IF(OR(ISBLANK('DryBatchWeights - Existing'!I23), 'DryBatchWeights - Existing'!I23=\"\"), \"\", CONCATENATE(\"(\", ROUND('DryBatchWeights - Existing'!I23/0.00104437934,2), \")\")), IF(OR(ISBLANK('DryBatchWeights - ACI211'!I43), 'DryBatchWeights - ACI211'!I43=\"\"), \"\", CONCATENATE(\"(\", ROUND('DryBatchWeights - ACI211'!I43/0.00104437934,2), \")\")))","v":""},null,"","oz","",""]
[null,{"$f":"IF(ISBLANK(Admix5), \"\", CONCATENATE(Admix5,\":\"))","v":""},null,null,{"$f":"IF(ISBLANK(Admix5), \"\", IF(VLOOKUP(Admix5, DATA_Tables!D29:E36, 2)<>0,VLOOKUP(Admix5, DATA_Tables!D29:E36, 2), \"\"))","v":""},{"$f":"IF(AND(ISBLANK(Admix5Prod), ISBLANK(Admix5Name)), \"\", CONCATENATE(Admix5Prod,\"/\",Admix5Name))","v":""},null,{"$f":"IF(MDInput=\"Existing Design\", IF(OR(ISBLANK('DryBatchWeights - Existing'!H24), 'DryBatchWeights - Existing'!H24=\"\"), \"\", 'DryBatchWeights - Existing'!H24), IF(OR(ISBLANK('DryBatchWeights - ACI211'!H44), 'DryBatchWeights - ACI211'!H44=\"\"), \"\", 'DryBatchWeights - ACI211'!H44))","v":""},{"$f":"IF(MDInput=\"Existing Design\", IF(OR(ISBLANK('DryBatchWeights - Existing'!I24), 'DryBatchWeights - Existing'!I24=\"\"), \"\", CONCATENATE(\"(\", ROUND('DryBatchWeights - Existing'!I24/0.00104437934,2), \")\")), IF(OR(ISBLANK('DryBatchWeights - ACI211'!I44), 'DryBatchWeights - ACI211'!I44=\"\"), \"\", CONCATENATE(\"(\", ROUND('DryBatchWeights - ACI211'!I44/0.00104437934,2), \")\")))","v":""},null,"","oz","",""]
[null,{"$f":"IF(ISBLANK(Admix6), \"\", CONCATENATE(Admix6,\":\"))","v":""},null,null,{"$f":"IF(ISBLANK(Admix6), \"\", IF(VLOOKUP(Admix6, DATA_Tables!D29:E36, 2)<>0,VLOOKUP(Admix6, DATA_Tables!D29:E36, 2), \"\"))","v":""},{"$f":"IF(AND(ISBLANK(Admix6Prod), ISBLANK(Admix6Name)), \"\", CONCATENATE(Admix6Prod,\"/\",Admix6Name))","v":""},null,{"$f":"IF(MDInput=\"Existing Design\", IF(OR(ISBLANK('DryBatchWeights - Existing'!H25), 'DryBatchWeights - Existing'!H25=\"\"), \"\", 'DryBatchWeights - Existing'!H25), IF(OR(ISBLANK('DryBatchWeights - ACI211'!H45), 'DryBatchWeights - ACI211'!H45=\"\"), \"\", 'DryBatchWeights - ACI211'!H45))","v":""},{"$f":"IF(MDInput=\"Existing Design\", IF(OR(ISBLANK('DryBatchWeights - Existing'!I25), 'DryBatchWeights - Existing'!I25=\"\"), \"\", CONCATENATE(\"(\", ROUND('DryBatchWeights - Existing'!I25/0.00104437934,2), \")\")), IF(OR(ISBLANK('DryBatchWeights - ACI211'!I45), 'DryBatchWeights - ACI211'!I45=\"\"), \"\", CONCATENATE(\"(\", ROUND('DryBatchWeights - ACI211'!I45/0.00104437934,2), \")\")))","v":""},null,"","oz","",""]
[null,{"$f":"IF(ISBLANK(Admix7), \"\", CONCATENATE(Admix7,\":\"))","v":""},null,null,{"$f":"IF(ISBLANK(Admix7), \"\", IF(VLOOKUP(Admix7, DATA_Tables!D29:E36, 2)<>0,VLOOKUP(Admix7, DATA_Tables!D29:E36, 2), \"\"))","v":""},{"$f":"IF(AND(ISBLANK(Admix7Prod), ISBLANK(Admix7Name)), \"\", CONCATENATE(Admix7Prod,\"/\",Admix7Name))","v":""},null,{"$f":"IF(MDInput=\"Existing Design\", IF(OR(ISBLANK('DryBatchWeights - Existing'!H26), 'DryBatchWeights - Existing'!H26=\"\"), \"\", 'DryBatchWeights - Existing'!H26), IF(OR(ISBLANK('DryBatchWeights - ACI211'!H46), 'DryBatchWeights - ACI211'!H46=\"\"), \"\", 'DryBatchWeights - ACI211'!H46))","v":""},{"$f":"IF(MDInput=\"Existing Design\", IF(OR(ISBLANK('DryBatchWeights - Existing'!I26), 'DryBatchWeights - Existing'!I26=\"\"), \"\", CONCATENATE(\"(\", ROUND('DryBatchWeights - Existing'!I26/0.00104437934,2), \")\")), IF(OR(ISBLANK('DryBatchWeights - ACI211'!I46), 'DryBatchWeights - ACI211'!I46=\"\"), \"\", CONCATENATE(\"(\", ROUND('DryBatchWeights - ACI211'!I46/0.00104437934,2), \")\")))","v":""},null,"","oz","",""]
[null,{"$f":"IF(ISBLANK(Admix8), \"\", CONCATENATE(Admix8,\":\"))","v":""},null,null,{"$f":"IF(ISBLANK(Admix8), \"\", IF(VLOOKUP(Admix8, DATA_Tables!D29:E36, 2)<>0,VLOOKUP(Admix8, DATA_Tables!D29:E36, 2), \"\"))","v":""},{"$f":"IF(AND(ISBLANK(Admix8Prod), ISBLANK(Admix8Name)), \"\", CONCATENATE(Admix8Prod,\"/\",Admix8Name))","v":""},null,{"$f":"IF(MDInput=\"Existing Design\", IF(OR(ISBLANK('DryBatchWeights - Existing'!H27), 'DryBatchWeights - Existing'!H27=\"\"), \"\", 'DryBatchWeights - Existing'!H27), IF(OR(ISBLANK('DryBatchWeights - ACI211'!H47), 'DryBatchWeights - ACI211'!H47=\"\"), \"\", 'DryBatchWeights - ACI211'!H47))","v":""},{"$f":"IF(MDInput=\"Existing Design\", IF(OR(ISBLANK('DryBatchWeights - Existing'!I27), 'DryBatchWeights - Existing'!I27=\"\"), \"\", CONCATENATE(\"(\", ROUND('DryBatchWeights - Existing'!I27/0.00104437934,2), \")\")), IF(OR(ISBLANK('DryBatchWeights - ACI211'!I47), 'DryBatchWeights - ACI211'!I47=\"\"), \"\", CONCATENATE(\"(\", ROUND('DryBatchWeights - ACI211'!I47/0.00104437934,2), \")\")))","v":""},null,"","oz","",""]
[null,{"$f":"IF(ISBLANK(Admix9),\"\", CONCATENATE(Admix9,\":\"))","v":""},null,null,{"$f":"IF(ISBLANK(Admix9), \"\", IF(VLOOKUP(Admix9, DATA_Tables!D29:E36, 2)<>0,VLOOKUP(Admix9, DATA_Tables!D29:E36, 2), \"\"))","v":""},{"$f":"IF(AND(ISBLANK(Admix9Prod), ISBLANK(Admix9Name)), \"\", CONCATENATE(Admix9Prod,\"/\",Admix9Name))","v":""},null,{"$f":"IF(MDInput=\"Existing Design\", IF(OR(ISBLANK('DryBatchWeights - Existing'!H28), 'DryBatchWeights - Existing'!H28=\"\"), \"\", 'DryBatchWeights - Existing'!H28), IF(OR(ISBLANK('DryBatchWeights - ACI211'!H48), 'DryBatchWeights - ACI211'!H48=\"\"), \"\", 'DryBatchWeights - ACI211'!H48))","v":""},{"$f":"IF(MDInput=\"Existing Design\", IF(OR(ISBLANK('DryBatchWeights - Existing'!I28), 'DryBatchWeights - Existing'!I28=\"\"), \"\", CONCATENATE(\"(\", ROUND('DryBatchWeights - Existing'!I28/0.00104437934,2), \")\")), IF(OR(ISBLANK('DryBatchWeights - ACI211'!I48), 'DryBatchWeights - ACI211'!I48=\"\"), \"\", CONCATENATE(\"(\", ROUND('DryBatchWeights - ACI211'!I48/0.00104437934,2), \")\")))","v":""},null,"","oz","",""]
[null,"Fibers:",null,null,null,{"$f":"IF(AND(ISBLANK(FiberProd), ISBLANK(FiberName)), \"\",CONCATENATE(FiberProd,\"/\", FiberName))","v":""},null,null,{"$f":"IF(MDInput=\"Existing Design\", IF(OR(ISBLANK('DryBatchWeights - Existing'!K33), 'DryBatchWeights - Existing'!K33=\"\"), \"\", 'DryBatchWeights - Existing'!K33), IF(OR(ISBLANK('DryBatchWeights - ACI211'!K53), 'DryBatchWeights - ACI211'!K53=\"\"), \"\", 'DryBatchWeights - ACI211'!K53))","v":""},null,"","lb","",""]
[null,{"$f":"IF(ISBLANK(OtherMat), \"\", CONCATENATE(OtherMat,\":\"))","v":""},null,null,null,{"$f":"IF(AND(ISBLANK(OtherMatProd), ISBLANK(OtherMatName)), \"\", CONCATENATE(OtherMatProd,\"/\", OtherMatName))","v":""},null,null,{"$f":"IF(MDInput=\"Existing Design\", IF(OR(ISBLANK('DryBatchWeights - Existing'!K34), 'DryBatchWeights - Existing'!K34=\"\"), \"\", 'DryBatchWeights - Existing'!K34), IF(OR(ISBLANK('DryBatchWeights - ACI211'!K54), 'DryBatchWeights - ACI211'!K54=\"\"), \"\", 'DryBatchWeights - ACI211'!K54))","v":""},null,"","lb","",""]
[null,"Coarse Aggregate 1:",null,null,{"$f":"IF(ISBLANK('Matl Properties'!I9),\"\",'Matl Properties'!I9)","v":""},{"$f":"IF(AND(ISBLANK(Agg1Prod), ISBLANK(Agg1Pit)), \"\", CONCATENATE(Agg1Prod,\"/\", Agg1Pit))","v":""},null,{"$f":"IF(I31=0,\"\",ROUND(I31*100/SUM($I$31:$J$36),0))","v":""},{"$f":"IF(MDInput=\"Existing Design\", IF(OptGrade=\"Yes\", IF(OR(ISBLANK('DryBatchWeights - Existing'!K36), 'DryBatchWeights - Existing'!K36=\"\"), 0, 'DryBatchWeights - Existing'!K36), IF(OR(ISBLANK('DryBatchWeights - Existing'!K43), 'DryBatchWeights - Existing'!K43=\"\"), 0, 'DryBatchWeights - Existing'!K43)), IF(OptGrade=\"Yes\", IF(OR(ISBLANK('DryBatchWeights - ACI211'!K56), 'DryBatchWeights - ACI211'!K56=\"\"), 0, 'DryBatchWeights - ACI211'!K56), IF(OR(ISBLANK('DryBatchWeights - ACI211'!K63), 'DryBatchWeights - ACI211'!K63=\"\"), 0, 'DryBatchWeights - ACI211'!K63)))","v":0},null,{"$f":"IF(ISERROR(I31*(1+($D$7/100))/(1+(Agg1Abs/100))), \"\", I31*(1+($D$7/100)-(Agg1Abs/100)))","v":0},"lb",{"$f":"IF(K31=\"\", \"\", IF($N$7=\"cu.ft.\", K31*$M$7/27, IF($N$7=\"cu.yd.\", K31*$M$7, \"\")))","v":""},""]
[null,"Coarse Aggregate 2:",null,null,{"$f":"IF(ISBLANK('Matl Properties'!I10),\"\",'Matl Properties'!I10)","v":""},{"$f":"IF(AND(ISBLANK(Agg2Prod), ISBLANK(Agg2Pit)), \"\", CONCATENATE(Agg2Prod,\"/\", Agg2Pit))","v":""},null,"",{"$f":"IF(MDInput=\"Existing Design\", IF(OptGrade=\"Yes\", IF(OR(ISBLANK('DryBatchWeights - Existing'!K37), 'DryBatchWeights - Existing'!K37=\"\"), 0, 'DryBatchWeights - Existing'!K37), IF(OR(ISBLANK('DryBatchWeights - Existing'!K44), 'DryBatchWeights - Existing'!K44=\"\"), 0, 'DryBatchWeights - Existing'!K44)), IF(OptGrade=\"Yes\", IF(OR(ISBLANK('DryBatchWeights - ACI211'!K57), 'DryBatchWeights - ACI211'!K57=\"\"), 0, 'DryBatchWeights - ACI211'!K57), IF(OR(ISBLANK('DryBatchWeights - ACI211'!K64), 'DryBatchWeights - ACI211'!K64=\"\"), 0, 'DryBatchWeights - ACI211'!K64)))","v":0},null,{"$f":"IF(ISERROR(I32*(1+($E$7/100))/(1+(Agg2Abs/100))), \"\", I32*(1+($E$7/100)-(Agg2Abs/100)))","v":0},"lb","",""]
[null,"Intermediate Aggregate 1:",null,null,{"$f":"IF(ISBLANK('Matl Properties'!I11),\"\",'Matl Properties'!I11)","v":""},{"$f":"IF(AND(ISBLANK(Agg3Prod), ISBLANK(Agg3Pit)), \"\", CONCATENATE(Agg3Prod,\"/\", Agg3Pit))","v":""},null,"",{"$f":"IF(MDInput=\"Existing Design\", IF(OptGrade=\"Yes\", IF(OR(ISBLANK('DryBatchWeights - Existing'!K38), 'DryBatchWeights - Existing'!K38=\"\"), 0, 'DryBatchWeights - Existing'!K38), IF(OR(ISBLANK('DryBatchWeights - Existing'!K45), 'DryBatchWeights - Existing'!K45=\"\"), 0, 'DryBatchWeights - Existing'!K45)), IF(OptGrade=\"Yes\", IF(OR(ISBLANK('DryBatchWeights - ACI211'!K58), 'DryBatchWeights - ACI211'!K58=\"\"), 0, 'DryBatchWeights - ACI211'!K58), IF(OR(ISBLANK('DryBatchWeights - ACI211'!K65), 'DryBatchWeights - ACI211'!K65=\"\"), 0, 'DryBatchWeights - ACI211'!K65)))","v":0},null,{"$f":"IF(ISERROR(I33*(1+($F$7/100))/(1+(Agg3Abs/100))), \"\", I33*(1+($F$7/100)-(Agg3Abs/100)))","v":0},"lb","",""]
[null,"Intermediate Aggregate 2:",null,null,{"$f":"IF(ISBLANK('Matl Properties'!I12),\"\",'Matl Properties'!I12)","v":""},{"$f":"IF(AND(ISBLANK(Agg4Prod), ISBLANK(Agg4Pit)), \"\", CONCATENATE(Agg4Prod,\"/\", Agg4Pit))","v":""},null,"",{"$f":"IF(MDInput=\"Existing Design\", IF(OptGrade=\"Yes\", IF(OR(ISBLANK('DryBatchWeights - Existing'!K39), 'DryBatchWeights - Existing'!K39=\"\"), 0, 'DryBatchWeights - Existing'!K39), IF(OR(ISBLANK('DryBatchWeights - Existing'!K46), 'DryBatchWeights - Existing'!K46=\"\"), 0, 'DryBatchWeights - Existing'!K46)), IF(OptGrade=\"Yes\", IF(OR(ISBLANK('DryBatchWeights - ACI211'!K59), 'DryBatchWeights - ACI211'!K59=\"\"), 0, 'DryBatchWeights - ACI211'!K59), IF(OR(ISBLANK('DryBatchWeights - ACI211'!K66), 'DryBatchWeights - ACI211'!K66=\"\"), 0, 'DryBatchWeights - ACI211'!K66)))","v":0},null,{"$f":"IF(ISERROR(I34*(1+($G$7/100))/(1+(Agg4Abs/100))), \"\", I34*(1+($G$7/100)-(Agg4Abs/100)))","v":0},"lb","",""]
[null,"Fine Aggregate 1:",null,null,null,{"$f":"IF(AND(ISBLANK(Agg5Prod), ISBLANK(Agg5Pit)), \"\", CONCATENATE(Agg5Prod,\"/\", Agg5Pit))","v":""},null,"",{"$f":"IF(MDInput=\"Existing Design\", IF(OptGrade=\"Yes\", IF(OR(ISBLANK('DryBatchWeights - Existing'!K40), 'DryBatchWeights - Existing'!K40=\"\"), 0, 'DryBatchWeights - Existing'!K40-F48), IF(OR(ISBLANK('DryBatchWeights - Existing'!K47), 'DryBatchWeights - Existing'!K47=\"\"), 0, 'DryBatchWeights - Existing'!K47-F48)), IF(OptGrade=\"Yes\", IF(OR(ISBLANK('DryBatchWeights - ACI211'!K60), 'DryBatchWeights - ACI211'!K60=\"\"), 0, 'DryBatchWeights - ACI211'!K60-F48), IF(OR(ISBLANK('DryBatchWeights - ACI211'!K67), 'DryBatchWeights - ACI211'!K67=\"\"), 0, 'DryBatchWeights - ACI211'!K67-F48)))","v":0},null,{"$f":"IF(ISERROR(I35*(1+($H$7/100))/(1+(Agg5Abs/100))), \"\", I35*(1+($H$7/100)-(Agg5Abs/100)))","v":0},"lb","",""]
[null,{"$f":"IF(Field24=\"Yes\", \"Lightweight Aggregate:\", \"Fine Aggregate 2:\")","v":"Fine Aggregate 2:"},null,null,null,{"$f":"IF(AND(ISBLANK(Agg6Prod), ISBLANK(Agg6Pit)), \"\", CONCATENATE(Agg6Prod,\"/\", Agg6Pit))","v":""},null,{"$f":"IF(OR(I36=\"\",I36=0),\"\",ROUND(I36*100/SUM($I$31:$J$36),0))","v":""},{"$f":"F47","v":""},null,{"$f":"IF(ISERROR(I36*(1+($I$7/100))/(1+(Agg6Abs/100))), \"\", I36*(1+($I$7/100)-(Agg6Abs/100)))","v":""},"lb","",""]
[null,"*Admixture dosages in fl.oz/100 lb. cementitious material"]
[]
[]
[null,null,null,"Internal Curing Properties"]
[null,null,null,null,"LWA Absorption:",{"$f":"Agg6Abs/100","v":0}]
[null,null,null,null,"LWA Desorption:",0.85]
[null,null,null,null,"LWA PSD Specific Gravity:",{"$f":"Agg6SG","v":0}]
[null,null,null,null,"Cement Factor:",{"$f":"SUM(I11:J19)","v":0}]
[null,null,null,null,"Chemical Shrinkage:",7.0000000000000007E-2]
[null,null,null,null,"Degree of Hydration:",{"$f":"IF(ISERROR((I10/F44)/0.36), \"\", IF((I10/F44)/0.36>1, 1,(I10/F44)/0.36))","v":""}]
[null,null,null,null,"PSD LWA Replacement:",{"$f":"IF(ISBLANK(G43),IF(ISERROR(((F44*F45*F46)/(F41*F42))*(1+F41)), \"\", ((F44*F45*F46)/(F41*F42))*(1+F41)),IF(ISERROR((G43/F43)*((F44*F45*F46)/(F41*F42))*(1+F41)), \"\", (G43/F43)*((F44*F45*F46)/(F41*F42))*(1+F41)))","v":""}]
[null,null,null,null,"SSD Sand Replaced:",{"$f":"IF(ISERROR(((F44*F45*F46)/(F41*F42))*(1+F41)*(Agg5SG/F43)), \"\", ((F44*F45*F46)/(F41*F42))*(1+F41)*(Agg5SG/F43))","v":""}]

{"sheet":"DATA_Revisions","index":15,"n_rows":49,"n_cols":4,"rows_kept":49,"cut":false,"hidden":true,"merged":[[6,2,7,2],[6,1,7,1],[6,3,7,3],[2,2,5,2],[2,3,5,3],[2,1,5,1]]}
[]
[null,"WHEN","WHAT","WHO"]
[null,"2015-12-23","Sheet: ACI 211 Proportions, Cell: K63, Action: Changed equation to =IF(OR(H63=\"\",H63=0),\"\",IF(AND($H$20=\"\",$H$19=\"\"),\"\",IF($H$20=\"\",(H63/SUM($H$63:$H$66))*ROUND($H$19,2)*27*Agg1UW,(H63/SUM($H$63:$H$66))*ROUND($H$20,2)*27*Agg1UW)))","R. Cano"]
[]
[]
[]
[null,"2015-12-23","Sheet: ACI 211 Proportions, Cell: K68, Action: Changed equation to =IF(OR(H68=\"\",H68=0),\"\",IF(ISERROR(I68*62.4*Agg6SG), 0, I68*62.4*Agg6SG))","R. Cano"]
[]
[null,"2016-03-01","Sheet: ACI 211 Proportions, Cells: E32:E39, Action: Changed equation to =IF(ISBLANK(Cementitious2),\"\",Cementitious2)","R. Cano"]
[null,"2016-03-01","Sheet: ACI 211 Proportions, Cell: B70, Action: Changed equation to =IF(TotCemSSDACI=0,\"\",IF((AND(SUMIF(E32:E39,\"Fly Ash - C\",ACIpct_dos)=CAsh,SUMIF(E32:E39,\"Fly Ash - F\",ACIpct_dos)=FAsh,SUMIF(E32:E39,\"MFFA\",ACIpct_dos)=Slag,SUMIF(E32:E39,\"Slag Cement\",ACIpct_dos)=MFFA,SUMIF(E32:E39,\"UFFA\",ACIpct_dos)=UFFA,SUMIF(E32:E39,\"Metakaolin\",ACIpct_dos)=MK,SUMIF(E32:E39,\"Silica Fume\",ACIpct_dos)=SF)=TRUE),MDOCheck,\"The SCM proportions listed in this mix design do not match the proportions listed in the Air Entrainment and Mix Design Options sheet.\"))","R. Cano"]
[null,"2016-03-01","Sheet: Air&MixDesignOptions, Section: Mix Design Option, Action: changed code to account for Class HES","R. Cano"]
[null,"2016-03-01","Sheet: ACI 211 Proportions, Cells: K40:K48, Action: Changed references in equation so that they correctly reference the Admixture solids on the Matl Properties sheet","R. Cano"]
[null,"2016-05-04","Sheet: ACI 211 Proportions, cells: K40:K48, Action: Changed equations to calculate for every admixture entry versus only calculating when volume greater than 1% of water content","R. Cano"]
[null,"2016-05-04","Sheet: ACI 211 Proportions, cell: L29, Action: Revised so that message appears when w/cm exceeds target as well as when w/cm exceeds specification max","R. Cano"]
[null,"2016-05-04","Sheet: ACI 211 Proportions, cell: K29, Action: Revised so that equation calculates water content including water contributed from admixtures","R. Cano"]
[null,"2016-05-04","Sheet: ACI 211 Proportions, cell: H30, Action: Revised so that equation calculates w/cm ratio including water contributed from admixtures","R. Cano"]
[null,"2016-05-04","Sheet: Existing Design, cell: L9, Action: Revised so that messages appears when w/cm exceed target as well as when w/cm exceeds specification max","R. Cano"]
[null,"2016-05-04","Sheet: Existing Design, cell: K20:K28, Action: Revised equations to calculate for every admixture entry versus only calculating when volume greater than 1% of water content","R. Cano"]
[null,"2016-08-17","Sheet: ACI 211 Proportions, cell: E23, Action: Revised so that equation accounts for situations where MinDesignStrength = \"Note 8\"","R. Cano"]
[null,"2016-08-17","Sheet: Air&MixDesignOptions, cell: F11, Action: Revised so that equation accounts for situations where Class = \"Class HES\" and Class = \"Class K\"","R. Cano"]
[null,"2016-08-17","Sheet: Air&MixDesignOptions, cells: F12:G12, Action: Revised conditional formatting so that when cell F11 reads \"As shown on the plans or specified\", cell F12 allows for input and G12 notifies user that F12 is required.","R. Cano"]
[null,"2016-08-19","Sheet: Trial Batch Results, cell: H31, Action: Revised so that equation accounts for situations where MinDesignStrength = \"Note 8\" (version controlled)","R. Cano"]
[null,"2016-08-19","Sheet: General, cell: G51, Action: added equation to populate version number when AuthorizedDate is after 8/19/2016","R. Cano"]
[null,"2016-12-20","Sheet: Existing Design, Action: Changed sheet name and cell B6 to \"DryBatchWeights - Existing\"","R. Cano"]
[null,"2016-12-20","Sheet: ACI 211 Proportioning, Action: Changed sheet name and cell B4 to \"DryBatchWeights - ACI211\"","R. Cano"]
[null,"2016-12-20","Sheet: DryBatchWeights - Existing, cell L9, Action: Revised so that equation accounts for situations where cell SpecMaxWC is empty","R. Cano"]
[null,"2016-12-20","Sheet: Optimized Gradation, cell: P12, Action: changed value from 0 to 3 (added version comparison)","R. Cano"]
[null,"2017-04-11","Sheet: DryBatchWeights - ACI211, cell: E22, Action: Revised so that equation calculates assigns appropriate NMAS for OAG, included version comparison","R. Cano"]
[null,"2017-05-05","Sheet: DryBatchWeights - ACI211, cell: E22, Action: Corrected parenthesis that was inhibiting calcuation.","R. Cano"]
[null,"2017-06-20","Sheet: DryBatchWeights - Existing, cell K35, Action: added equation to sum aggregate weights","R. Cano"]
[null,"2017-07-03","Sheet: DryBatchWeights - Existing, cell I50, Action: revised equation to include fiber volume","R. Cano"]
[null,"2018-02-22","Sheet: Air&MixDesignOptions, cell F29, Action: revised equation to account for increased Option 7 alkali loading limit for Class SS designs","R. Cano"]
[null,"2018-04-16","Sheet: Batch Weights, cells: H31:I36, Action: revised equation that prohibited population of optimized gradation weights from ACI 211 designs","R. Cano"]
[null,"2018-04-25","Sheet: Air&MixDesignOptions, VBA code, Action: included line of code to unhide SCM input cells when Option 8 - \"Prescriptive Mix Design\" is chosen. Fixes incorrect message on DryBatchWeights mix design sheet.","R. Cano"]
[null,"2018-09-05","Sheet: DryBatchWeights - Existing, cell: B51, Action: fixed MFFA/Slag mix up with version comparison","R. Cano"]
[null,"2018-09-05","Sheet: DryBatchWeights - ACI211, cell: B70, Action: fixed MFFA/slag mix up with version comparison","R. Cano"]
[null,"2018-12-27","Sheet: Air&MixDesignOptions, cells: F20:F26, Action: added data validation to limit input to numbers only","R. Cano"]
[null,"2018-11-09","Sheet: Project Summary, cell: E22:F22, Action: added row 22 to add internal curing option","R. Cano"]
[null,"2018-11-09","Sheet: Matl Properties, cells: D14:O14, Action: changed row heading to read \"Lightweight Aggregate\" and added conditional formatting to FM cell when Field456 = Yes","R. Cano"]
[null,"2018-11-09","Sheet: Batch Weights, cell: O31:O36, Action: added equations to calculate MC water difference and maintain \"\" cells","R. Cano"]
[null,"2018-11-09","Sheet: Batch Weights, cell K10, Action: Revised equation to include all aggregate weights","R. Cano"]
[null,"2018-11-09","Sheet: Internal Curing, Action: Added sheet to calculate batch weights for internal curing","R. Cano"]
[null,"2019-01-22","Sheet: Project Summary, Row: 24, Action: Added row and 3 input cells for coarse aggregate CoTE value tracking when Class P - CRCP is used","R. Cano"]
[null,"2019-01-22","Sheet: DryBatchWeights - Existing, Row: 54, Action: Added row and equation to output message based on CoTE inputs","R. Cano"]
[null,"2019-01-22","Sheet: DryBatchWeights - ACI211, Row: 72, Action: Added row and equation to output message based on CoTE inputs","R. Cano"]
[null,"2021-04-09","Workbook: Version 9, effective 04/16/21","R. Cano"]
[null,"2021-04-09","Sheet: Air&MixDesignOptions, Action: revised VBA code for Option 3 and 4 check. ","R. Cano"]
[null,"2021-04-09","Sheet: DryBatchWeights (both), Action: added informational calc for coarse aggregate factor based on design proportions for Class CO","R. Cano"]
[null,"2021-04-30","Sheet: Air&MixDesignOptions, cell: F18, Action: revised equation to return only MDO number","R. Cano"]