{"text_format":"1","workbook":"xlsx","n_sheets":4,"sheets":["SS-4216","Pipe materials","RX","Revisions"],"not_rendered":{"charts":0,"images":1,"macros":1,"external_links":0,"defined_names":136,"comments":1,"pivot_tables":0},"unopened":[],"bounds":{"document_bytes":16777216,"sheet_cells":100000,"rows_first":2000,"rows_last":500,"rows_between":2000,"halvings":0,"cell_chars":16384,"cell_head_chars":4096},"cells_cut":0,"cells_raw":0,"read":"whole","date_system":"1900"}

{"sheet":"SS-4216","index":0,"n_rows":58,"n_cols":11,"rows_kept":58,"cut":false,"hidden":false,"merged":[[45,1,45,11],[46,1,46,11],[11,3,11,4],[12,3,12,4],[13,3,13,8],[21,3,24,3],[21,4,24,4],[21,5,24,5],[21,6,24,6],[16,7,16,8],[12,7,12,8],[11,7,11,8],[16,3,16,4],[14,3,14,8],[15,3,15,8],[25,8,25,14],[0,0,0,1],[7,7,7,8],[10,7,10,8],[7,3,7,4],[8,3,8,4],[8,7,8,8],[10,3,10,4],[9,7,9,8],[9,3,9,4],[57,1,57,3],[53,6,53,8],[51,2,51,4],[49,2,49,4],[53,1,53,3],[50,2,50,4],[19,1,19,2],[18,5,18,6],[18,7,18,8],[18,3,18,4],[19,4,19,5],[19,6,19,8],[36,1,43,14],[21,1,24,1],[21,2,24,2],[21,7,24,7],[20,6,20,7],[21,8,24,14],[26,8,26,14],[27,8,27,14],[28,8,28,14],[29,8,29,14],[30,8,30,14],[31,8,31,14],[32,8,32,14],[33,8,33,14],[34,8,34,14]]}
["TxDOT Manuals >",null,null,"SS-4216"]
[null,"TEXAS DEPARTMENT OF TRANSPORTATION",null,null,null,null,null,null,null,null,92]
[null,null,null,null,null,null,null,null,null,null,1]
[null,null,null,null,null,null,null,null,null,null,"SS4216.xlsm::44999.444063"]
[null,{"$f":"UPPER(\"Thermoplastic pipe inspection\")","v":"THERMOPLASTIC PIPE INSPECTION"}]
[]
[null,null,null,null,null,null,null,null,{"$f":"\"SS4216 :: File Version: \" & TEXT(MID(sn,SEARCH(\"::\",sn,1)+2,20),\"mm/dd/yy hh:mm:ss\")","v":"SS4216 :: File Version: 03/14/23 10:39:27"}]
[null,null,"SAMPLE ID:",null,null,null,"SAMPLED DATE:"]
[null,null,"TEST NUMBER:",null,null,null,"LETTING DATE:"]
[null,null,"SAMPLE STATUS:",null,null,null,"CONTROLLING CSJ:"]
[null,null,"COUNTY:",null,null,null,"SPEC YEAR:"]
[null,null,"SAMPLED BY:",null,null,null,"SPEC ITEM:"]
[null,null,"SAMPLE LOCATION:",null,null,null,"SPECIAL PROVISION:"]
[null,null,"MATERIAL CODE:"]
[null,null,"MATERIAL NAME:"]
[null,null,"PRODUCER:"]
[null,null,"AREA ENGINEER:",null,null,null,"PROJECT MANAGER:"]
[]
[null,null,"STATION:",null,null,"DIST. FROM CL:"]
[null,"PIPE MATERIAL:",null,null,"MATERIAL PRODUCER:"]
[]
[null,"Pipe Size (in)","Pipe Run Location (Description)","Station Limits From","Station Limits To","95% Mandrel Test Pass*","92.5% Mandrel Test Pass ","Date Installed","Remarks"]
[]
[]
[]
[]
[]
[]
[]
[]
[]
[]
[]
[]
[]
[null,"Remarks:",{"$f":"NOW()","v":"2023-05-25T11:12:05.180"}]
[]
[]
[]
[]
[]
[]
[]
[]
[null,"Notes:"]
[null,"If the pipe run is 30 ft. or less in length, not under a public roadway, and the initial visual inspection did not indicate any deflection or other deficiencies, mandrel testing will be waived, unless otherwise noted."]
[null,"*Refer to section 4.1 of Item 4216 if 95% mandrel test does not pass for additional testing required."]
[]
[]
[null,"Inspector:","Inspected By:",null,null,"Inspection Date:"]
[null,"TxDOT"]
[null,"Contractor"]
[null,"Test Stamp Code:",null,null,"Omit Test:","Completed Date:","Reviewed By:"]
[]
[null,"Locked By:","TxDOT:","District:","Area:"]
[]
[null,"Authorized By:",null,null,"Authorized Date:"]
[null,null,null,null,null,1]

{"sheet":"Pipe materials","index":1,"n_rows":9,"n_cols":3,"rows_kept":9,"cut":false,"hidden":true,"merged":[]}
[]
[]
[null,"ADS N-12 HDPE Pipe","ADS HP Storm Polypropylene Pipe"]
[null,"Byram, MS","Ennis, TX"]
[null,"Ennis, TX","Harrisonville, MO"]
[null,"Harrisonville, MO","Mendota, IL "]
[null,"Mendota, IL ","Vicksburg, MS"]
[null,"Vicksburg, MS","Yoakum, TX"]
[null,"Yoakum, TX"]

{"sheet":"RX","index":2,"n_rows":95,"n_cols":9,"rows_kept":95,"cut":false,"hidden":true,"merged":[]}
[{"$f":"COUNT(A3:A500)","v":93}]
["Fld_nbr","Value","Desc_1","Desc_2","Desc_3","Desc_4","Desc_5","Desc_6","Desc_7"]
[1,{"$f":"IF('SS-4216'!D20<>\"\",'SS-4216'!D20,\"\")","v":""},{"$f":"IF('SS-4216'!B20<>\"\",'SS-4216'!B20,\"\")","v":"PIPE MATERIAL:"}]
[2,{"$f":"IF('SS-4216'!G20<>\"\",'SS-4216'!G20,\"\")","v":""},{"$f":"IF('SS-4216'!E20<>\"\",'SS-4216'!E20,\"\")","v":"MATERIAL PRODUCER:"}]
[3,{"$f":"IF('SS-4216'!B26<>\"\",'SS-4216'!B26,\"\")","v":""},{"$f":"IF('SS-4216'!$B$22<>\"\",'SS-4216'!$B$22,\"\")","v":"Pipe Size (in)"}]
[4,{"$f":"IF('SS-4216'!B27<>\"\",'SS-4216'!B27,\"\")","v":""},{"$f":"IF('SS-4216'!$B$22<>\"\",'SS-4216'!$B$22,\"\")","v":"Pipe Size (in)"}]
[5,{"$f":"IF('SS-4216'!B28<>\"\",'SS-4216'!B28,\"\")","v":""},{"$f":"IF('SS-4216'!$B$22<>\"\",'SS-4216'!$B$22,\"\")","v":"Pipe Size (in)"}]
[6,{"$f":"IF('SS-4216'!B29<>\"\",'SS-4216'!B29,\"\")","v":""},{"$f":"IF('SS-4216'!$B$22<>\"\",'SS-4216'!$B$22,\"\")","v":"Pipe Size (in)"}]
[7,{"$f":"IF('SS-4216'!B30<>\"\",'SS-4216'!B30,\"\")","v":""},{"$f":"IF('SS-4216'!$B$22<>\"\",'SS-4216'!$B$22,\"\")","v":"Pipe Size (in)"}]
[8,{"$f":"IF('SS-4216'!B31<>\"\",'SS-4216'!B31,\"\")","v":""},{"$f":"IF('SS-4216'!$B$22<>\"\",'SS-4216'!$B$22,\"\")","v":"Pipe Size (in)"}]
[9,{"$f":"IF('SS-4216'!B32<>\"\",'SS-4216'!B32,\"\")","v":""},{"$f":"IF('SS-4216'!$B$22<>\"\",'SS-4216'!$B$22,\"\")","v":"Pipe Size (in)"}]
[10,{"$f":"IF('SS-4216'!B33<>\"\",'SS-4216'!B33,\"\")","v":""},{"$f":"IF('SS-4216'!$B$22<>\"\",'SS-4216'!$B$22,\"\")","v":"Pipe Size (in)"}]
[11,{"$f":"IF('SS-4216'!B34<>\"\",'SS-4216'!B34,\"\")","v":""},{"$f":"IF('SS-4216'!$B$22<>\"\",'SS-4216'!$B$22,\"\")","v":"Pipe Size (in)"}]
[12,{"$f":"IF('SS-4216'!B35<>\"\",'SS-4216'!B35,\"\")","v":""},{"$f":"IF('SS-4216'!$B$22<>\"\",'SS-4216'!$B$22,\"\")","v":"Pipe Size (in)"}]
[13,{"$f":"IF('SS-4216'!C26<>\"\",'SS-4216'!C26,\"\")","v":""},{"$f":"IF('SS-4216'!$C$22<>\"\",'SS-4216'!$C$22,\"\")","v":"Pipe Run Location (Description)"}]
[14,{"$f":"IF('SS-4216'!C27<>\"\",'SS-4216'!C27,\"\")","v":""},{"$f":"IF('SS-4216'!$C$22<>\"\",'SS-4216'!$C$22,\"\")","v":"Pipe Run Location (Description)"}]
[15,{"$f":"IF('SS-4216'!C28<>\"\",'SS-4216'!C28,\"\")","v":""},{"$f":"IF('SS-4216'!$C$22<>\"\",'SS-4216'!$C$22,\"\")","v":"Pipe Run Location (Description)"}]
[16,{"$f":"IF('SS-4216'!C29<>\"\",'SS-4216'!C29,\"\")","v":""},{"$f":"IF('SS-4216'!$C$22<>\"\",'SS-4216'!$C$22,\"\")","v":"Pipe Run Location (Description)"}]
[17,{"$f":"IF('SS-4216'!C30<>\"\",'SS-4216'!C30,\"\")","v":""},{"$f":"IF('SS-4216'!$C$22<>\"\",'SS-4216'!$C$22,\"\")","v":"Pipe Run Location (Description)"}]
[18,{"$f":"IF('SS-4216'!C31<>\"\",'SS-4216'!C31,\"\")","v":""},{"$f":"IF('SS-4216'!$C$22<>\"\",'SS-4216'!$C$22,\"\")","v":"Pipe Run Location (Description)"}]
[19,{"$f":"IF('SS-4216'!C32<>\"\",'SS-4216'!C32,\"\")","v":""},{"$f":"IF('SS-4216'!$C$22<>\"\",'SS-4216'!$C$22,\"\")","v":"Pipe Run Location (Description)"}]
[20,{"$f":"IF('SS-4216'!C33<>\"\",'SS-4216'!C33,\"\")","v":""},{"$f":"IF('SS-4216'!$C$22<>\"\",'SS-4216'!$C$22,\"\")","v":"Pipe Run Location (Description)"}]
[21,{"$f":"IF('SS-4216'!C34<>\"\",'SS-4216'!C34,\"\")","v":""},{"$f":"IF('SS-4216'!$C$22<>\"\",'SS-4216'!$C$22,\"\")","v":"Pipe Run Location (Description)"}]
[22,{"$f":"IF('SS-4216'!C35<>\"\",'SS-4216'!C35,\"\")","v":""},{"$f":"IF('SS-4216'!$C$22<>\"\",'SS-4216'!$C$22,\"\")","v":"Pipe Run Location (Description)"}]
[23,{"$f":"IF('SS-4216'!D26<>\"\",'SS-4216'!D26,\"\")","v":""},{"$f":"IF('SS-4216'!$C$22<>\"\",'SS-4216'!$D$22,\"\")","v":"Station Limits From"}]
[24,{"$f":"IF('SS-4216'!D27<>\"\",'SS-4216'!D27,\"\")","v":""},{"$f":"IF('SS-4216'!$C$22<>\"\",'SS-4216'!$D$22,\"\")","v":"Station Limits From"}]
[25,{"$f":"IF('SS-4216'!D28<>\"\",'SS-4216'!D28,\"\")","v":""},{"$f":"IF('SS-4216'!$C$22<>\"\",'SS-4216'!$D$22,\"\")","v":"Station Limits From"}]
[26,{"$f":"IF('SS-4216'!D29<>\"\",'SS-4216'!D29,\"\")","v":""},{"$f":"IF('SS-4216'!$C$22<>\"\",'SS-4216'!$D$22,\"\")","v":"Station Limits From"}]
[27,{"$f":"IF('SS-4216'!D30<>\"\",'SS-4216'!D30,\"\")","v":""},{"$f":"IF('SS-4216'!$C$22<>\"\",'SS-4216'!$D$22,\"\")","v":"Station Limits From"}]
[28,{"$f":"IF('SS-4216'!D31<>\"\",'SS-4216'!D31,\"\")","v":""},{"$f":"IF('SS-4216'!$C$22<>\"\",'SS-4216'!$D$22,\"\")","v":"Station Limits From"}]
[29,{"$f":"IF('SS-4216'!D32<>\"\",'SS-4216'!D32,\"\")","v":""},{"$f":"IF('SS-4216'!$C$22<>\"\",'SS-4216'!$D$22,\"\")","v":"Station Limits From"}]
[30,{"$f":"IF('SS-4216'!D33<>\"\",'SS-4216'!D33,\"\")","v":""},{"$f":"IF('SS-4216'!$C$22<>\"\",'SS-4216'!$D$22,\"\")","v":"Station Limits From"}]
[31,{"$f":"IF('SS-4216'!D34<>\"\",'SS-4216'!D34,\"\")","v":""},{"$f":"IF('SS-4216'!$C$22<>\"\",'SS-4216'!$D$22,\"\")","v":"Station Limits From"}]
[32,{"$f":"IF('SS-4216'!D35<>\"\",'SS-4216'!D35,\"\")","v":""},{"$f":"IF('SS-4216'!$C$22<>\"\",'SS-4216'!$D$22,\"\")","v":"Station Limits From"}]
[33,{"$f":"IF('SS-4216'!E26<>\"\",'SS-4216'!E26,\"\")","v":""},{"$f":"IF('SS-4216'!$C$22<>\"\",'SS-4216'!$E$22,\"\")","v":"Station Limits To"}]
[34,{"$f":"IF('SS-4216'!E27<>\"\",'SS-4216'!E27,\"\")","v":""},{"$f":"IF('SS-4216'!$C$22<>\"\",'SS-4216'!$E$22,\"\")","v":"Station Limits To"}]
[35,{"$f":"IF('SS-4216'!E28<>\"\",'SS-4216'!E28,\"\")","v":""},{"$f":"IF('SS-4216'!$C$22<>\"\",'SS-4216'!$E$22,\"\")","v":"Station Limits To"}]
[36,{"$f":"IF('SS-4216'!E29<>\"\",'SS-4216'!E29,\"\")","v":""},{"$f":"IF('SS-4216'!$C$22<>\"\",'SS-4216'!$E$22,\"\")","v":"Station Limits To"}]
[37,{"$f":"IF('SS-4216'!E30<>\"\",'SS-4216'!E30,\"\")","v":""},{"$f":"IF('SS-4216'!$C$22<>\"\",'SS-4216'!$E$22,\"\")","v":"Station Limits To"}]
[38,{"$f":"IF('SS-4216'!E31<>\"\",'SS-4216'!E31,\"\")","v":""},{"$f":"IF('SS-4216'!$C$22<>\"\",'SS-4216'!$E$22,\"\")","v":"Station Limits To"}]
[39,{"$f":"IF('SS-4216'!E32<>\"\",'SS-4216'!E32,\"\")","v":""},{"$f":"IF('SS-4216'!$C$22<>\"\",'SS-4216'!$E$22,\"\")","v":"Station Limits To"}]
[40,{"$f":"IF('SS-4216'!E33<>\"\",'SS-4216'!E33,\"\")","v":""},{"$f":"IF('SS-4216'!$C$22<>\"\",'SS-4216'!$E$22,\"\")","v":"Station Limits To"}]
[41,{"$f":"IF('SS-4216'!E34<>\"\",'SS-4216'!E34,\"\")","v":""},{"$f":"IF('SS-4216'!$C$22<>\"\",'SS-4216'!$E$22,\"\")","v":"Station Limits To"}]
[42,{"$f":"IF('SS-4216'!E35<>\"\",'SS-4216'!E35,\"\")","v":""},{"$f":"IF('SS-4216'!$C$22<>\"\",'SS-4216'!$E$22,\"\")","v":"Station Limits To"}]
[43,{"$f":"IF('SS-4216'!F26<>\"\",'SS-4216'!F26,\"\")","v":""},{"$f":"IF('SS-4216'!$C$22<>\"\",'SS-4216'!$F$22,\"\")","v":"95% Mandrel Test Pass*"}]
[44,{"$f":"IF('SS-4216'!F27<>\"\",'SS-4216'!F27,\"\")","v":""},{"$f":"IF('SS-4216'!$C$22<>\"\",'SS-4216'!$F$22,\"\")","v":"95% Mandrel Test Pass*"}]
[45,{"$f":"IF('SS-4216'!F28<>\"\",'SS-4216'!F28,\"\")","v":""},{"$f":"IF('SS-4216'!$C$22<>\"\",'SS-4216'!$F$22,\"\")","v":"95% Mandrel Test Pass*"}]
[46,{"$f":"IF('SS-4216'!F29<>\"\",'SS-4216'!F29,\"\")","v":""},{"$f":"IF('SS-4216'!$C$22<>\"\",'SS-4216'!$F$22,\"\")","v":"95% Mandrel Test Pass*"}]
[47,{"$f":"IF('SS-4216'!F30<>\"\",'SS-4216'!F30,\"\")","v":""},{"$f":"IF('SS-4216'!$C$22<>\"\",'SS-4216'!$F$22,\"\")","v":"95% Mandrel Test Pass*"}]
[48,{"$f":"IF('SS-4216'!F31<>\"\",'SS-4216'!F31,\"\")","v":""},{"$f":"IF('SS-4216'!$C$22<>\"\",'SS-4216'!$F$22,\"\")","v":"95% Mandrel Test Pass*"}]
[49,{"$f":"IF('SS-4216'!F32<>\"\",'SS-4216'!F32,\"\")","v":""},{"$f":"IF('SS-4216'!$C$22<>\"\",'SS-4216'!$F$22,\"\")","v":"95% Mandrel Test Pass*"}]
[50,{"$f":"IF('SS-4216'!F33<>\"\",'SS-4216'!F33,\"\")","v":""},{"$f":"IF('SS-4216'!$C$22<>\"\",'SS-4216'!$F$22,\"\")","v":"95% Mandrel Test Pass*"}]
[51,{"$f":"IF('SS-4216'!F34<>\"\",'SS-4216'!F34,\"\")","v":""},{"$f":"IF('SS-4216'!$C$22<>\"\",'SS-4216'!$F$22,\"\")","v":"95% Mandrel Test Pass*"}]
[52,{"$f":"IF('SS-4216'!F35<>\"\",'SS-4216'!F35,\"\")","v":""},{"$f":"IF('SS-4216'!$C$22<>\"\",'SS-4216'!$F$22,\"\")","v":"95% Mandrel Test Pass*"}]
[53,{"$f":"IF('SS-4216'!G26<>\"\",'SS-4216'!G26,\"\")","v":""},{"$f":"IF('SS-4216'!$C$22<>\"\",'SS-4216'!$G$22,\"\")","v":"92.5% Mandrel Test Pass "}]
[54,{"$f":"IF('SS-4216'!G27<>\"\",'SS-4216'!G27,\"\")","v":""},{"$f":"IF('SS-4216'!$C$22<>\"\",'SS-4216'!$G$22,\"\")","v":"92.5% Mandrel Test Pass "}]
[55,{"$f":"IF('SS-4216'!G28<>\"\",'SS-4216'!G28,\"\")","v":""},{"$f":"IF('SS-4216'!$C$22<>\"\",'SS-4216'!$G$22,\"\")","v":"92.5% Mandrel Test Pass "}]
[56,{"$f":"IF('SS-4216'!G29<>\"\",'SS-4216'!G29,\"\")","v":""},{"$f":"IF('SS-4216'!$C$22<>\"\",'SS-4216'!$G$22,\"\")","v":"92.5% Mandrel Test Pass "}]
[57,{"$f":"IF('SS-4216'!G30<>\"\",'SS-4216'!G30,\"\")","v":""},{"$f":"IF('SS-4216'!$C$22<>\"\",'SS-4216'!$G$22,\"\")","v":"92.5% Mandrel Test Pass "}]
[58,{"$f":"IF('SS-4216'!G31<>\"\",'SS-4216'!G31,\"\")","v":""},{"$f":"IF('SS-4216'!$C$22<>\"\",'SS-4216'!$G$22,\"\")","v":"92.5% Mandrel Test Pass "}]
[59,{"$f":"IF('SS-4216'!G32<>\"\",'SS-4216'!G32,\"\")","v":""},{"$f":"IF('SS-4216'!$C$22<>\"\",'SS-4216'!$G$22,\"\")","v":"92.5% Mandrel Test Pass "}]
[60,{"$f":"IF('SS-4216'!G33<>\"\",'SS-4216'!G33,\"\")","v":""},{"$f":"IF('SS-4216'!$C$22<>\"\",'SS-4216'!$G$22,\"\")","v":"92.5% Mandrel Test Pass "}]
[61,{"$f":"IF('SS-4216'!G34<>\"\",'SS-4216'!G34,\"\")","v":""},{"$f":"IF('SS-4216'!$C$22<>\"\",'SS-4216'!$G$22,\"\")","v":"92.5% Mandrel Test Pass "}]
[62,{"$f":"IF('SS-4216'!G35<>\"\",'SS-4216'!G35,\"\")","v":""},{"$f":"IF('SS-4216'!$C$22<>\"\",'SS-4216'!$G$22,\"\")","v":"92.5% Mandrel Test Pass "}]
[63,{"$f":"IF('SS-4216'!H26<>\"\",'SS-4216'!H26,\"\")","v":""},{"$f":"IF('SS-4216'!$C$22<>\"\",'SS-4216'!$H$22,\"\")","v":"Date Installed"}]
[64,{"$f":"IF('SS-4216'!H27<>\"\",'SS-4216'!H27,\"\")","v":""},{"$f":"IF('SS-4216'!$C$22<>\"\",'SS-4216'!$H$22,\"\")","v":"Date Installed"}]
[65,{"$f":"IF('SS-4216'!H28<>\"\",'SS-4216'!H28,\"\")","v":""},{"$f":"IF('SS-4216'!$C$22<>\"\",'SS-4216'!$H$22,\"\")","v":"Date Installed"}]
[66,{"$f":"IF('SS-4216'!H29<>\"\",'SS-4216'!H29,\"\")","v":""},{"$f":"IF('SS-4216'!$C$22<>\"\",'SS-4216'!$H$22,\"\")","v":"Date Installed"}]
[67,{"$f":"IF('SS-4216'!H30<>\"\",'SS-4216'!H30,\"\")","v":""},{"$f":"IF('SS-4216'!$C$22<>\"\",'SS-4216'!$H$22,\"\")","v":"Date Installed"}]
[68,{"$f":"IF('SS-4216'!H31<>\"\",'SS-4216'!H31,\"\")","v":""},{"$f":"IF('SS-4216'!$C$22<>\"\",'SS-4216'!$H$22,\"\")","v":"Date Installed"}]
[69,{"$f":"IF('SS-4216'!H32<>\"\",'SS-4216'!H32,\"\")","v":""},{"$f":"IF('SS-4216'!$C$22<>\"\",'SS-4216'!$H$22,\"\")","v":"Date Installed"}]
[70,{"$f":"IF('SS-4216'!H33<>\"\",'SS-4216'!H33,\"\")","v":""},{"$f":"IF('SS-4216'!$C$22<>\"\",'SS-4216'!$H$22,\"\")","v":"Date Installed"}]
[71,{"$f":"IF('SS-4216'!H34<>\"\",'SS-4216'!H34,\"\")","v":""},{"$f":"IF('SS-4216'!$C$22<>\"\",'SS-4216'!$H$22,\"\")","v":"Date Installed"}]
[72,{"$f":"IF('SS-4216'!H35<>\"\",'SS-4216'!H35,\"\")","v":""},{"$f":"IF('SS-4216'!$C$22<>\"\",'SS-4216'!$H$22,\"\")","v":"Date Installed"}]
[73,{"$f":"IF('SS-4216'!I26<>\"\",'SS-4216'!I26,\"\")","v":""},{"$f":"IF('SS-4216'!$C$22<>\"\",'SS-4216'!$I$22,\"\")","v":"Remarks"}]
[74,{"$f":"IF('SS-4216'!I27<>\"\",'SS-4216'!I27,\"\")","v":""},{"$f":"IF('SS-4216'!$C$22<>\"\",'SS-4216'!$I$22,\"\")","v":"Remarks"}]
[75,{"$f":"IF('SS-4216'!I28<>\"\",'SS-4216'!I28,\"\")","v":""},{"$f":"IF('SS-4216'!$C$22<>\"\",'SS-4216'!$I$22,\"\")","v":"Remarks"}]
[76,{"$f":"IF('SS-4216'!I29<>\"\",'SS-4216'!I29,\"\")","v":""},{"$f":"IF('SS-4216'!$C$22<>\"\",'SS-4216'!$I$22,\"\")","v":"Remarks"}]
[77,{"$f":"IF('SS-4216'!I30<>\"\",'SS-4216'!I30,\"\")","v":""},{"$f":"IF('SS-4216'!$C$22<>\"\",'SS-4216'!$I$22,\"\")","v":"Remarks"}]
[78,{"$f":"IF('SS-4216'!I31<>\"\",'SS-4216'!I31,\"\")","v":""},{"$f":"IF('SS-4216'!$C$22<>\"\",'SS-4216'!$I$22,\"\")","v":"Remarks"}]
[79,{"$f":"IF('SS-4216'!I32<>\"\",'SS-4216'!I32,\"\")","v":""},{"$f":"IF('SS-4216'!$C$22<>\"\",'SS-4216'!$I$22,\"\")","v":"Remarks"}]
[80,{"$f":"IF('SS-4216'!I33<>\"\",'SS-4216'!I33,\"\")","v":""},{"$f":"IF('SS-4216'!$C$22<>\"\",'SS-4216'!$I$22,\"\")","v":"Remarks"}]
[81,{"$f":"IF('SS-4216'!I34<>\"\",'SS-4216'!I34,\"\")","v":""},{"$f":"IF('SS-4216'!$C$22<>\"\",'SS-4216'!$I$22,\"\")","v":"Remarks"}]
[82,{"$f":"IF('SS-4216'!I35<>\"\",'SS-4216'!I35,\"\")","v":""},{"$f":"IF('SS-4216'!$C$22<>\"\",'SS-4216'!$I$22,\"\")","v":"Remarks"}]
[83,{"$f":"IF('SS-4216'!C51<>\"\",'SS-4216'!C51,\"\")","v":""},{"$f":"IF('SS-4216'!B51<>\"\",'SS-4216'!B51,\"\")","v":"TxDOT"},{"$f":"'SS-4216'!C50","v":"Inspected By:"}]
[84,{"$f":"IF('SS-4216'!F51<>\"\",'SS-4216'!F51,\"\")","v":""},{"$f":"IF('SS-4216'!B51<>\"\",'SS-4216'!B51,\"\")","v":"TxDOT"},{"$f":"'SS-4216'!F50","v":"Inspection Date:"}]
[85,{"$f":"IF('SS-4216'!C52<>\"\",'SS-4216'!C52,\"\")","v":""},{"$f":"IF('SS-4216'!B52<>\"\",'SS-4216'!B52,\"\")","v":"Contractor"},{"$f":"'SS-4216'!C50","v":"Inspected By:"}]
[86,{"$f":"IF('SS-4216'!F52<>\"\",'SS-4216'!F52,\"\")","v":""},{"$f":"IF('SS-4216'!B52<>\"\",'SS-4216'!B52,\"\")","v":"Contractor"},{"$f":"'SS-4216'!F50","v":"Inspection Date:"}]
[87]
[88]
[89]
[90]
[91]
[92]
[93]

{"sheet":"Revisions","index":3,"n_rows":1,"n_cols":9,"rows_kept":1,"cut":false,"hidden":true,"merged":[[5,1,5,7],[6,1,6,7],[7,1,7,7],[8,1,8,7],[9,1,9,7],[5,8,5,9],[6,8,6,9],[7,8,7,9],[8,8,8,9],[9,8,9,9],[4,1,4,7],[0,1,0,7],[0,8,0,9],[1,1,1,7],[2,1,2,7],[3,1,3,7],[1,8,1,9],[2,8,2,9],[3,8,3,9],[4,8,4,9]]}
["Date","Description",null,null,null,null,null,null,"Performed by"]