{"text_format":"1","workbook":"xlsx","n_sheets":3,"sheets":["Tex-103-E","RX","Revisions"],"not_rendered":{"charts":0,"images":1,"macros":1,"external_links":0,"defined_names":1237,"comments":1,"pivot_tables":0},"unopened":[],"bounds":{"document_bytes":16777216,"sheet_cells":100000,"rows_first":2000,"rows_last":500,"rows_between":2000,"halvings":0,"cell_chars":16384,"cell_head_chars":4096},"cells_cut":0,"cells_raw":0,"read":"whole","date_system":"1900"}

{"sheet":"Tex-103-E","index":0,"n_rows":164,"n_cols":26,"rows_kept":164,"cut":false,"hidden":false,"merged":[[46,1,46,2],[46,3,46,8],[164,1,164,4],[12,13,12,14],[48,3,48,5],[55,1,55,4],[55,6,55,7],[55,8,55,11],[162,1,162,2],[12,1,12,4],[16,13,16,14],[16,9,16,12],[13,13,13,14],[18,11,18,12],[161,1,161,2],[54,6,54,7],[24,6,24,10],[25,6,25,10],[18,13,18,14],[39,1,39,14],[11,1,11,4],[18,9,18,10],[18,1,18,4],[15,1,15,4],[14,5,14,14],[15,5,15,14],[18,5,18,6],[18,7,18,8],[11,13,11,14],[12,9,12,12],[13,9,13,12],[16,5,16,8],[11,9,11,12],[16,1,16,4],[7,13,7,14],[10,13,10,14],[8,13,8,14],[7,9,7,12],[8,9,8,12],[9,9,9,12],[10,9,10,12],[9,13,9,14],[7,5,7,8],[8,5,8,8],[9,5,9,8],[10,5,10,8],[7,1,7,4],[8,1,8,4],[9,1,9,4],[10,1,10,4],[14,1,14,4],[13,1,13,4],[11,5,11,8],[12,5,12,8],[13,5,13,8],[51,1,51,2],[51,3,51,8],[53,1,53,2],[53,3,53,8],[26,6,26,10],[27,6,27,10],[29,6,29,10],[41,1,41,14],[49,3,49,8],[33,6,33,10],[49,1,49,2],[40,1,40,14],[31,6,31,10],[43,3,43,5],[44,1,44,2],[44,3,44,8]]}
["TxDOT Manuals >",null,null,"Tex-103-E"]
[null,"TEXAS DEPARTMENT OF TRANSPORTATION",null,null,null,null,null,null,null,null,null,null,null,null,null,null,null,null,null,null,null,null,null,null,null,23]
[null,null,null,null,null,null,null,null,null,null,null,null,null,null,null,null,null,null,null,null,null,null,null,null,null,5]
[null,null,null,null,null,null,null,null,null,null,null,null,null,null,null,null,null,null,null,null,null,null,null,null,null,"tx103.xlsm::45446.526574"]
[null,"MOISTURE CONTENT OF AGGREGATES",null,null,null,null,null,null,null,null,null,null,null,null,null,null,null,null,null,null,null,null,null,null,null,1119]
[null,"Tex-103-E  - Part I and II"]
[null,null,null,null,null,null,null,null,null,null,null,null,null,null,{"$f":"\"TX103 - File Version: \" & TEXT(MID(sn,SEARCH(\"::\",sn,1)+2,20),\"mm/dd/yy hh:mm:ss\")","v":"TX103 - File Version: 06/03/24 12:38:16"}]
[null,"SAMPLE ID:",null,null,null,null,null,null,null,"SAMPLED DATE:"]
[null,"TEST NUMBER:",null,null,null,null,null,null,null,"LETTING DATE:"]
[null,"SAMPLE STATUS:",null,null,null,null,null,null,null,"CONTROLLING CSJ:",null,null,null,""]
[null,"COUNTY:",null,null,null,null,null,null,null,"SPEC YEAR:"]
[null,"SAMPLED BY:",null,null,null,null,null,null,null,"SPEC ITEM:",null,null,null,""]
[null,"SAMPLE LOCATION:",null,null,null,null,null,null,null,"SPECIAL PROVISION:"]
[null,"MATERIAL CODE:",null,null,null,null,null,null,null,"GRADE:"]
[null,"MATERIAL NAME:"]
[null,"PRODUCER:",null,null,null,""]
[null,"AREA ENGINEER:",null,null,null,null,null,null,null,"PROJECT MANAGER:"]
[]
[null,"COURSE\\LIFT:",null,null,null,null,null,"STATION:",null,null,null,"DIST. FROM CL:"]
[]
[]
[]
[null,"Test Method Tex-103-E"]
[]
[null,null,null,null,null,null,"Dish No."]
[null,null,null,null,null,null,"Mass of Wet Sample + Tare (g):"]
[null,null,null,null,null,null,"Mass of Dry Sample + Tare (g):"]
[null,null,null,null,null,null,"Tare Mass (g):"]
[]
[null,null,null,null,null,null,"Moisture Content (%):",null,null,null,null,{"$f":"IF(AND(L26=\"\",L26=\"\",L26=\"\",L26=\"\"),\"\",IF(ISERROR(((L$26-L$27)/(L$27-L$28))*100),0,((L$26-L$27)/(L$27-L$28))*100))","v":""}]
[]
[null,null,null,null,null,null,"Wet Weight of Flex Base:"]
[]
[null,null,null,null,null,null,"Payable Weight in Vehicle:",null,null,null,null,{"$f":"IF(ISERROR($L32/(1+(L30/100))),\"\",$L32/(1+(L30/100)))","v":""}]
[]
[]
[]
[]
[null,"Remarks:",null,{"$f":"NOW()","v":"2024-06-03T12:38:16.890"}]
[]
[]
[]
[]
[null,"Sample Method:",null,"Sampled By:",null,null,null,null,null,"Sampled Date:"]
[null,"TX100"]
[]
[null,"TX400"]
[]
[null,"Test Method:",null,"Tested By:",null,null,null,null,null,"Tested Date:"]
[null,"TX103"]
[]
[null,"TX103PI"]
[]
[null,"TX103PII"]
[null,"Test Stamp Code:",null,null,null,"Omit Test:","Completed Date:",null,"Reviewed By:"]
[]
[]
[null,"TEST NUMBER","DISH NUMBER","MASS OF WET SAMPLE + TARE","MASS OF DRY SAMPLE + TARE","TARE MASS","MOISTURE CONTENT, (%)","WET WEIGHT OF FLEX BASE","PAYABLE WEIGHT IN VEHICLE","TX103 - TESTED BY","TEST DATE","STAMP CODE","OIMT INDICATOR","COMPLETE DATE","REMARKS"]
[]
[null,"SMPL_TST_NBR","DISH_NUMBER_7","MASS_OF_WET_SAMPLE_TARE_8","MASS_OF_DRY_SAMPLE_TARE_9","TARE_MASS_10",null,"WET_WEIGHT_CL2_FLEX_BASE_11",null,"TESTED_BY_TX103_12","TESTED_DATE_TX103_13","STMP_CD","OMIT_IND","ACTL_CMPL_DT","REMARKS_01","SMPL_ID","TST_METH","SPEC_YEAR_02","GRADE_04","SPECIAL_PROVISION_03","RVWR_UID","OLD_PRODUCER_05","COURSE_06","OLD_REVIEWED_BY_14","AUTOTEMPLATE_15"]
[{"$f":"IF(COUNTBLANK(C61:O61)=13,0,1)","v":0},"~AT001",null,null,null,null,{"$f":"IF(AND(C61=\"\",D61=\"\",E61=\"\",F61=\"\"),\"\",IF(ISERROR(((D61-E61)/(E61-IF(F61=\"\",$F$59,F61)))*100),0,((D61-E61)/(E61-IF(F61=\"\",$F$59,F61)))*100))","v":""},null,{"$f":"IF(ISERROR(IF(H61=\"\",$H$59,H61)/(1+(G61/100))),\"\",IF(H61=\"\",$H$59,H61)/(1+(G61/100)))","v":""},null,null,null,null,null,null,"A","TX103"]
[{"$f":"IF(COUNTBLANK(C62:O62)=13,0,1)","v":0},"~AT002",null,null,null,null,{"$f":"IF(AND(C62=\"\",D62=\"\",E62=\"\",F62=\"\"),\"\",IF(ISERROR(((D62-E62)/(E62-IF(F62=\"\",$F$59,F62)))*100),0,((D62-E62)/(E62-IF(F62=\"\",$F$59,F62)))*100))","v":""},null,{"$f":"IF(ISERROR(IF(H62=\"\",$H$59,H62)/(1+(G62/100))),\"\",IF(H62=\"\",$H$59,H62)/(1+(G62/100)))","v":""},null,null,null,null,null,null,"A","TX103"]
[0,"~AT003",null,null,null,null,"",null,"",null,null,null,null,null,null,"A","TX103"]
[0,"~AT004",null,null,null,null,"",null,"",null,null,null,null,null,null,"A","TX103"]
[0,"~AT005",null,null,null,null,"",null,"",null,null,null,null,null,null,"A","TX103"]
[0,"~AT006",null,null,null,null,"",null,"",null,null,null,null,null,null,"A","TX103"]
[0,"~AT007",null,null,null,null,"",null,"",null,null,null,null,null,null,"A","TX103"]
[0,"~AT008",null,null,null,null,"",null,"",null,null,null,null,null,null,"A","TX103"]
[0,"~AT009",null,null,null,null,"",null,"",null,null,null,null,null,null,"A","TX103"]
[0,"~AT010",null,null,null,null,"",null,"",null,null,null,null,null,null,"A","TX103"]
[0,"~AT011",null,null,null,null,"",null,"",null,null,null,null,null,null,"A","TX103"]
[0,"~AT012",null,null,null,null,"",null,"",null,null,null,null,null,null,"A","TX103"]
[0,"~AT013",null,null,null,null,"",null,"",null,null,null,null,null,null,"A","TX103"]
[0,"~AT014",null,null,null,null,"",null,"",null,null,null,null,null,null,"A","TX103"]
[0,"~AT015",null,null,null,null,"",null,"",null,null,null,null,null,null,"A","TX103"]
[0,"~AT016",null,null,null,null,"",null,"",null,null,null,null,null,null,"A","TX103"]
[0,"~AT017",null,null,null,null,"",null,"",null,null,null,null,null,null,"A","TX103"]
[0,"~AT018",null,null,null,null,"",null,"",null,null,null,null,null,null,"A","TX103"]
[0,"~AT019",null,null,null,null,"",null,"",null,null,null,null,null,null,"A","TX103"]
[0,"~AT020",null,null,null,null,"",null,"",null,null,null,null,null,null,"A","TX103"]
[0,"~AT021",null,null,null,null,"",null,"",null,null,null,null,null,null,"A","TX103"]
[0,"~AT022",null,null,null,null,"",null,"",null,null,null,null,null,null,"A","TX103"]
[0,"~AT023",null,null,null,null,"",null,"",null,null,null,null,null,null,"A","TX103"]
[0,"~AT024",null,null,null,null,"",null,"",null,null,null,null,null,null,"A","TX103"]
[0,"~AT025",null,null,null,null,"",null,"",null,null,null,null,null,null,"A","TX103"]
[0,"~AT026",null,null,null,null,"",null,"",null,null,null,null,null,null,"A","TX103"]
[0,"~AT027",null,null,null,null,"",null,"",null,null,null,null,null,null,"A","TX103"]
[0,"~AT028",null,null,null,null,"",null,"",null,null,null,null,null,null,"A","TX103"]
[0,"~AT029",null,null,null,null,"",null,"",null,null,null,null,null,null,"A","TX103"]
[0,"~AT030",null,null,null,null,"",null,"",null,null,null,null,null,null,"A","TX103"]
[0,"~AT031",null,null,null,null,"",null,"",null,null,null,null,null,null,"A","TX103"]
[0,"~AT032",null,null,null,null,"",null,"",null,null,null,null,null,null,"A","TX103"]
[0,"~AT033",null,null,null,null,"",null,"",null,null,null,null,null,null,"A","TX103"]
[0,"~AT034",null,null,null,null,"",null,"",null,null,null,null,null,null,"A","TX103"]
[0,"~AT035",null,null,null,null,"",null,"",null,null,null,null,null,null,"A","TX103"]
[0,"~AT036",null,null,null,null,"",null,"",null,null,null,null,null,null,"A","TX103"]
[0,"~AT037",null,null,null,null,"",null,"",null,null,null,null,null,null,"A","TX103"]
[0,"~AT038",null,null,null,null,"",null,"",null,null,null,null,null,null,"A","TX103"]
[0,"~AT039",null,null,null,null,"",null,"",null,null,null,null,null,null,"A","TX103"]
[0,"~AT040",null,null,null,null,"",null,"",null,null,null,null,null,null,"A","TX103"]
[0,"~AT041",null,null,null,null,"",null,"",null,null,null,null,null,null,"A","TX103"]
[0,"~AT042",null,null,null,null,"",null,"",null,null,null,null,null,null,"A","TX103"]
[0,"~AT043",null,null,null,null,"",null,"",null,null,null,null,null,null,"A","TX103"]
[0,"~AT044",null,null,null,null,"",null,"",null,null,null,null,null,null,"A","TX103"]
[0,"~AT045",null,null,null,null,"",null,"",null,null,null,null,null,null,"A","TX103"]
[0,"~AT046",null,null,null,null,"",null,"",null,null,null,null,null,null,"A","TX103"]
[0,"~AT047",null,null,null,null,"",null,"",null,null,null,null,null,null,"A","TX103"]
[0,"~AT048",null,null,null,null,"",null,"",null,null,null,null,null,null,"A","TX103"]
[0,"~AT049",null,null,null,null,"",null,"",null,null,null,null,null,null,"A","TX103"]
[0,"~AT050",null,null,null,null,"",null,"",null,null,null,null,null,null,"A","TX103"]
[0,"~AT051",null,null,null,null,"",null,"",null,null,null,null,null,null,"A","TX103"]
[0,"~AT052",null,null,null,null,"",null,"",null,null,null,null,null,null,"A","TX103"]
[0,"~AT053",null,null,null,null,"",null,"",null,null,null,null,null,null,"A","TX103"]
[0,"~AT054",null,null,null,null,"",null,"",null,null,null,null,null,null,"A","TX103"]
[0,"~AT055",null,null,null,null,"",null,"",null,null,null,null,null,null,"A","TX103"]
[0,"~AT056",null,null,null,null,"",null,"",null,null,null,null,null,null,"A","TX103"]
[0,"~AT057",null,null,null,null,"",null,"",null,null,null,null,null,null,"A","TX103"]
[0,"~AT058",null,null,null,null,"",null,"",null,null,null,null,null,null,"A","TX103"]
[0,"~AT059",null,null,null,null,"",null,"",null,null,null,null,null,null,"A","TX103"]
[0,"~AT060",null,null,null,null,"",null,"",null,null,null,null,null,null,"A","TX103"]
[0,"~AT061",null,null,null,null,"",null,"",null,null,null,null,null,null,"A","TX103"]
[0,"~AT062",null,null,null,null,"",null,"",null,null,null,null,null,null,"A","TX103"]
[0,"~AT063",null,null,null,null,"",null,"",null,null,null,null,null,null,"A","TX103"]
[0,"~AT064",null,null,null,null,"",null,"",null,null,null,null,null,null,"A","TX103"]
[0,"~AT065",null,null,null,null,"",null,"",null,null,null,null,null,null,"A","TX103"]
[{"$f":"IF(COUNTBLANK(C126:O126)=13,0,1)","v":0},"~AT066",null,null,null,null,{"$f":"IF(AND(C126=\"\",D126=\"\",E126=\"\",F126=\"\"),\"\",IF(ISERROR(((D126-E126)/(E126-IF(F126=\"\",$F$59,F126)))*100),0,((D126-E126)/(E126-IF(F126=\"\",$F$59,F126)))*100))","v":""},null,{"$f":"IF(ISERROR(IF(H126=\"\",$H$59,H126)/(1+(G126/100))),\"\",IF(H126=\"\",$H$59,H126)/(1+(G126/100)))","v":""},null,null,null,null,null,null,"A","TX103"]
[0,"~AT067",null,null,null,null,"",null,"",null,null,null,null,null,null,"A","TX103"]
[0,"~AT068",null,null,null,null,"",null,"",null,null,null,null,null,null,"A","TX103"]
[0,"~AT069",null,null,null,null,"",null,"",null,null,null,null,null,null,"A","TX103"]
[0,"~AT070",null,null,null,null,"",null,"",null,null,null,null,null,null,"A","TX103"]
[0,"~AT071",null,null,null,null,"",null,"",null,null,null,null,null,null,"A","TX103"]
[0,"~AT072",null,null,null,null,"",null,"",null,null,null,null,null,null,"A","TX103"]
[0,"~AT073",null,null,null,null,"",null,"",null,null,null,null,null,null,"A","TX103"]
[0,"~AT074",null,null,null,null,"",null,"",null,null,null,null,null,null,"A","TX103"]
[0,"~AT075",null,null,null,null,"",null,"",null,null,null,null,null,null,"A","TX103"]
[0,"~AT076",null,null,null,null,"",null,"",null,null,null,null,null,null,"A","TX103"]
[0,"~AT077",null,null,null,null,"",null,"",null,null,null,null,null,null,"A","TX103"]
[0,"~AT078",null,null,null,null,"",null,"",null,null,null,null,null,null,"A","TX103"]
[0,"~AT079",null,null,null,null,"",null,"",null,null,null,null,null,null,"A","TX103"]
[0,"~AT080",null,null,null,null,"",null,"",null,null,null,null,null,null,"A","TX103"]
[0,"~AT081",null,null,null,null,"",null,"",null,null,null,null,null,null,"A","TX103"]
[0,"~AT082",null,null,null,null,"",null,"",null,null,null,null,null,null,"A","TX103"]
[0,"~AT083",null,null,null,null,"",null,"",null,null,null,null,null,null,"A","TX103"]
[0,"~AT084",null,null,null,null,"",null,"",null,null,null,null,null,null,"A","TX103"]
[0,"~AT085",null,null,null,null,"",null,"",null,null,null,null,null,null,"A","TX103"]
[0,"~AT086",null,null,null,null,"",null,"",null,null,null,null,null,null,"A","TX103"]
[0,"~AT087",null,null,null,null,"",null,"",null,null,null,null,null,null,"A","TX103"]
[0,"~AT088",null,null,null,null,"",null,"",null,null,null,null,null,null,"A","TX103"]
[0,"~AT089",null,null,null,null,"",null,"",null,null,null,null,null,null,"A","TX103"]
[0,"~AT090",null,null,null,null,"",null,"",null,null,null,null,null,null,"A","TX103"]
[0,"~AT091",null,null,null,null,"",null,"",null,null,null,null,null,null,"A","TX103"]
[0,"~AT092",null,null,null,null,"",null,"",null,null,null,null,null,null,"A","TX103"]
[0,"~AT093",null,null,null,null,"",null,"",null,null,null,null,null,null,"A","TX103"]
[0,"~AT094",null,null,null,null,"",null,"",null,null,null,null,null,null,"A","TX103"]
[0,"~AT095",null,null,null,null,"",null,"",null,null,null,null,null,null,"A","TX103"]
[0,"~AT096",null,null,null,null,"",null,"",null,null,null,null,null,null,"A","TX103"]
[0,"~AT097",null,null,null,null,"",null,"",null,null,null,null,null,null,"A","TX103"]
[0,"~AT098",null,null,null,null,"",null,"",null,null,null,null,null,null,"A","TX103"]
[0,"~AT099",null,null,null,null,"",null,"",null,null,null,null,null,null,"A","TX103"]
[0,"~AT100",null,null,null,null,"",null,"",null,null,null,null,null,null,"A","TX103"]
[]
[null,"Locked By:",null,"TxDOT:","District:","Area:"]
[null,"",null,"","",""]
[null,"Authorized By:",null,null,null,"Authorized Date:"]

{"sheet":"RX","index":1,"n_rows":21,"n_cols":9,"rows_kept":21,"cut":false,"hidden":true,"merged":[]}
[19]
["Fld_nbr","Value","Desc_1","Desc_2","Desc_3","Desc_4","Desc_5","Desc_6","Desc_7"]
[1,{"$f":"IF('Tex-103-E'!$B$40=\"\",\"\",'Tex-103-E'!$B$40)","v":""},{"$f":"'Tex-103-E'!$B$39","v":"Remarks:"}]
[2,{"$f":"IF('Tex-103-E'!$F$19=\"\",\"\",'Tex-103-E'!$F$19)","v":""},{"$f":"IF('Tex-103-E'!$B$19=\"\",\"\",'Tex-103-E'!$B$19)","v":"COURSE\\LIFT:"}]
[3,{"$f":"IF('Tex-103-E'!$D$50=\"\",\"\",'Tex-103-E'!$D$50)","v":""},"Tested By ",{"$f":"IF('Tex-103-E'!$B$50=\"\",\"\",'Tex-103-E'!$B$50)","v":"TX103"}]
[4,{"$f":"IF('Tex-103-E'!$J$50=\"\",\"\",'Tex-103-E'!$J$50)","v":""},"Tested Date ",{"$f":"IF('Tex-103-E'!$B$50=\"\",\"\",'Tex-103-E'!$B$50)","v":"TX103"}]
[5,{"$f":"IF('Tex-103-E'!$L$25=\"\",\"\",'Tex-103-E'!$L$25)","v":""},{"$f":"IF('Tex-103-E'!$B$6=\"\",\"\",'Tex-103-E'!$B$6)","v":"Tex-103-E  - Part I and II"},{"$f":"IF('Tex-103-E'!$G$25=\"\",\"\",'Tex-103-E'!$G$25)","v":"Dish No."}]
[6,{"$f":"IF('Tex-103-E'!$L$26=\"\",\"\",'Tex-103-E'!$L$26)","v":""},{"$f":"IF('Tex-103-E'!$B$6=\"\",\"\",'Tex-103-E'!$B$6)","v":"Tex-103-E  - Part I and II"},{"$f":"IF('Tex-103-E'!$G$26=\"\",\"\",'Tex-103-E'!$G$26)","v":"Mass of Wet Sample + Tare (g):"}]
[7,{"$f":"IF('Tex-103-E'!$L$27=\"\",\"\",'Tex-103-E'!$L$27)","v":""},{"$f":"IF('Tex-103-E'!$B$6=\"\",\"\",'Tex-103-E'!$B$6)","v":"Tex-103-E  - Part I and II"},{"$f":"IF('Tex-103-E'!$G$27=\"\",\"\",'Tex-103-E'!$G$27)","v":"Mass of Dry Sample + Tare (g):"}]
[8,{"$f":"IF('Tex-103-E'!$L$28=\"\",\"\",'Tex-103-E'!$L$28)","v":""},{"$f":"IF('Tex-103-E'!$B$6=\"\",\"\",'Tex-103-E'!$B$6)","v":"Tex-103-E  - Part I and II"},{"$f":"IF('Tex-103-E'!$G$28=\"\",\"\",'Tex-103-E'!$G$28)","v":"Tare Mass (g):"}]
[9,{"$f":"IF('Tex-103-E'!$L$30=\"\",\"\",'Tex-103-E'!$L$30)","v":""},{"$f":"IF('Tex-103-E'!$B$6=\"\",\"\",'Tex-103-E'!$B$6)","v":"Tex-103-E  - Part I and II"},{"$f":"IF('Tex-103-E'!$G$30=\"\",\"\",'Tex-103-E'!$G$30)","v":"Moisture Content (%):"}]
[10,{"$f":"IF('Tex-103-E'!$L$32=\"\",\"\",'Tex-103-E'!$L$32)","v":""},{"$f":"IF('Tex-103-E'!$B$6=\"\",\"\",'Tex-103-E'!$B$6)","v":"Tex-103-E  - Part I and II"},{"$f":"IF('Tex-103-E'!$G$32=\"\",\"\",'Tex-103-E'!$G$32)","v":"Wet Weight of Flex Base:"}]
[11,{"$f":"IF('Tex-103-E'!$L$34=\"\",\"\",'Tex-103-E'!$L$34)","v":""},{"$f":"IF('Tex-103-E'!$B$6=\"\",\"\",'Tex-103-E'!$B$6)","v":"Tex-103-E  - Part I and II"},{"$f":"IF('Tex-103-E'!$G$34=\"\",\"\",'Tex-103-E'!$G$34)","v":"Payable Weight in Vehicle:"}]
[12,{"$f":"IF('Tex-103-E'!$D$52=\"\",\"\",'Tex-103-E'!$D$52)","v":""},"Tested By ",{"$f":"IF('Tex-103-E'!$B$52=\"\",\"\",'Tex-103-E'!$B$52)","v":"TX103PI"}]
[13,{"$f":"IF('Tex-103-E'!$J$52=\"\",\"\",'Tex-103-E'!$J$52)","v":""},"Tested Date ",{"$f":"IF('Tex-103-E'!$B$52=\"\",\"\",'Tex-103-E'!$B$52)","v":"TX103PI"}]
[14,{"$f":"IF('Tex-103-E'!$D$54=\"\",\"\",'Tex-103-E'!$D$54)","v":""},"Tested By ",{"$f":"IF('Tex-103-E'!$B$54=\"\",\"\",'Tex-103-E'!$B$54)","v":"TX103PII"}]
[15,{"$f":"IF('Tex-103-E'!$J$54=\"\",\"\",'Tex-103-E'!$J$54)","v":""},"Tested Date ",{"$f":"IF('Tex-103-E'!$B$54=\"\",\"\",'Tex-103-E'!$B$54)","v":"TX103PII"}]
[16,{"$f":"IF('Tex-103-E'!$D$45=\"\",\"\",'Tex-103-E'!$D$45)","v":""},"Sampled By ",{"$f":"IF('Tex-103-E'!$B$45=\"\",\"\",'Tex-103-E'!$B$45)","v":"TX100"}]
[17,{"$f":"IF('Tex-103-E'!$J$45=\"\",\"\",'Tex-103-E'!$J$45)","v":""},"Sampled Date ",{"$f":"IF('Tex-103-E'!$B$45=\"\",\"\",'Tex-103-E'!$B$45)","v":"TX100"}]
[18,{"$f":"IF('Tex-103-E'!$D$47=\"\",\"\",'Tex-103-E'!$D$47)","v":""},"Sampled By ",{"$f":"IF('Tex-103-E'!$B$47=\"\",\"\",'Tex-103-E'!$B$47)","v":"TX400"}]
[19,{"$f":"IF('Tex-103-E'!$J$47=\"\",\"\",'Tex-103-E'!$J$47)","v":""},"Sampled Date ",{"$f":"IF('Tex-103-E'!$B$47=\"\",\"\",'Tex-103-E'!$B$47)","v":"TX400"}]

{"sheet":"Revisions","index":2,"n_rows":2,"n_cols":11,"rows_kept":2,"cut":false,"hidden":true,"merged":[[36,1,36,9],[37,1,37,9],[38,1,38,9],[39,1,39,9],[30,1,30,9],[31,1,31,9],[34,1,34,9],[35,1,35,9],[32,1,32,9],[33,1,33,9],[29,1,29,9],[5,1,5,9],[0,1,0,9],[1,1,1,9],[2,1,2,9],[3,1,3,9],[4,1,4,9],[18,1,18,9],[19,1,19,9],[20,1,20,9],[21,1,21,9],[24,1,24,9],[25,1,25,9],[26,1,26,9],[27,1,27,9],[28,1,28,9],[22,1,22,9],[23,1,23,9],[17,1,17,9],[6,1,6,9],[7,1,7,9],[8,1,8,9],[9,1,9,9],[10,1,10,9],[11,1,11,9],[12,1,12,9],[13,1,13,9],[14,1,14,9],[15,1,15,9],[16,1,16,9]]}
["DATE","DESCRIPTION",null,null,null,null,null,null,null,null,"BY"]
["2016-10-06","Revove SDEWITT from code",null,null,null,null,null,null,null,null,"CPFEIFF"]