{"text_format":"1","workbook":"xlsx","n_sheets":5,"sheets":["Tex-110-E","RX","Cumulative Mechanical Analysis","GRADATIONS","spcyr"],"not_rendered":{"charts":2,"images":1,"macros":1,"external_links":0,"defined_names":173,"comments":1,"pivot_tables":0},"unopened":[{"sheet":"Cumulative Mechanical Analysis","index":2,"reason":"not_a_worksheet"}],"bounds":{"document_bytes":16777216,"sheet_cells":100000,"rows_first":2000,"rows_last":500,"rows_between":2000,"halvings":0,"cell_chars":16384,"cell_head_chars":4096},"cells_cut":0,"cells_raw":0,"read":"whole","date_system":"1900"}

{"sheet":"Tex-110-E","index":0,"n_rows":54,"n_cols":11,"rows_kept":54,"cut":false,"hidden":false,"merged":[[22,7,24,7],[40,1,40,8],[50,1,50,3],[22,3,24,3],[22,4,24,4],[48,2,48,4],[42,2,42,4],[41,2,41,4],[39,1,39,8],[36,1,38,8],[44,2,44,4],[54,1,54,3],[15,3,15,8],[0,0,0,1],[8,3,8,4],[7,3,7,4],[11,3,11,4],[22,5,24,5],[45,2,45,4],[22,1,24,1],[12,3,12,4],[13,3,13,4],[13,7,13,8],[12,7,12,8],[50,6,50,8],[46,2,46,4],[22,6,24,6],[7,7,7,8],[10,3,10,4],[9,7,9,8],[16,3,16,4],[9,3,9,4],[10,7,10,8],[11,7,11,8],[8,7,8,8],[16,7,16,8],[14,3,14,8]]}
["TxDOT Manuals >",null,null,"Tex-110-E"]
[null,"TEXAS DEPARTMENT OF TRANSPORTATION",null,null,null,null,null,null,null,null,60]
[null,null,null,null,null,null,null,null,null,null,4]
[null,null,null,null,null,null,null,null,null,null,"tx110.xlsm::45680.470162"]
[null,"PARTICLE SIZE ANALYSIS"]
[null,"Tex-110-E PART I"]
[null,null,null,null,null,null,null,null,{"$f":"\"TX110 - File Version: \" & TEXT(MID(sn,SEARCH(\"::\",sn,1)+2,20),\"mm/dd/yy hh:mm:ss\")","v":"TX110 - File Version: 01/23/25 11:17:02"}]
[null,null,"SAMPLE ID:",null,null,null,"SAMPLED DATE:"]
[null,null,"TEST NUMBER:",null,null,null,"LETTING DATE:"]
[null,null,"SAMPLE STATUS:",null,null,null,"CONTROLLING CSJ:"]
[null,null,"COUNTY:",null,null,null,"SPEC YEAR:"]
[null,null,"SAMPLED BY:",null,null,null,"SPEC ITEM:"]
[null,null,"SAMPLE LOCATION:",null,null,null,"SPECIAL PROVISION:"]
[null,null,"MATERIAL CODE:",null,null,null,"GRADE:",null,null,"choose spec year"," "]
[null,null,"MATERIAL NAME:"]
[null,null,"PRODUCER:"]
[null,null,"AREA ENGINEER:",null,null,null,"PROJECT MANAGER:"]
[]
[null,null,"COURSE\\LIFT:",null,"STATION:",null,null,"DIST. FROM CL:"]
[]
[null,"Particle Size Analysis - Tex-110-E"]
[]
[null,"Sieve Size",null,{"$f":"IF(C24= \"Percent Retained\", \"Percent Retained\",IF(C23=\"Cumulative\",\"Individual\",\"Cumulative\") & \" Weight Retained\")","v":"Cumulative Weight Retained"},"Cumulative Percent Retained","Lower Spec Limit %","Upper Spec Limit %","Within Master Grading"]
[null,null,{"$f":"IF(C23=\"\",\"Individual\",C23) & \" Weight Retained \" & C25","v":"Individual Weight Retained "}]
[]
[null,{"$f":"IFERROR(IF(Field4=\"AS\",INDEX(GradeAS2014,1,2),IF(Field4=\"BS\",INDEX(GradeBS2014,1,2),IF(Field4=\"CS\",INDEX(GradeCS2014,1,2),IF(Field4=\"DS\",INDEX(GradeDS2014,1,2),IF(ISERROR(IF(INDEX(INDIRECT(\"grade\"&Grade&SpecYear),1,IF(SpecYear=\"1995\",4,3))=0,\"\",INDEX(INDIRECT(\"grade\"&Grade&SpecYear),1,IF(SpecYear=\"1995\",4,3)))),\"\",IF(INDEX(INDIRECT(\"grade\"&Grade&SpecYear),1,IF(SpecYear=\"1995\",4,3))=0,\"\",INDEX(INDIRECT(\"grade\"&Grade&SpecYear),1,IF(SpecYear=\"1995\",4,3)))))))),\"\")","v":""},null,{"$f":"IF($C26=\"\",\"\",$C26)","v":""},{"$f":"IF($C26=\"\",\"\",IF(RetainedMethod=\"Cumulative\",C26/Total*100,D26/Total*100))","v":""},{"$f":"IF(ISERROR(INDEX(INDIRECT(\"grade\"&Grade&SpecYear),1,5)),\"\",INDEX(INDIRECT(\"grade\"&Grade&SpecYear),1,5))","v":""},{"$f":"IF(ISERROR(INDEX(INDIRECT(\"grade\"&Grade&SpecYear),1,6)),\"\",INDEX(INDIRECT(\"grade\"&Grade&SpecYear),1,6))","v":""},{"$f":"IF($C26=\"\",\"\",IF(AND($E26<=$G26,$E26>=$F26),\"Yes\",\"No\"))","v":""}]
[null,{"$f":"IFERROR(IF(Field4=\"AS\",INDEX(GradeAS2014,2,2),IF(Field4=\"BS\",INDEX(GradeBS2014,2,2),IF(Field4=\"CS\",INDEX(GradeCS2014,2,2),IF(Field4=\"DS\",INDEX(GradeDS2014,2,2),IF(ISERROR(IF(INDEX(INDIRECT(\"grade\"&Grade&SpecYear),2,IF(SpecYear=\"1995\",4,3))=0,\"\",INDEX(INDIRECT(\"grade\"&Grade&SpecYear),2,IF(SpecYear=\"1995\",4,3)))),\"\",IF(INDEX(INDIRECT(\"grade\"&Grade&SpecYear),2,IF(SpecYear=\"1995\",4,3))=0,\"\",INDEX(INDIRECT(\"grade\"&Grade&SpecYear),2,IF(SpecYear=\"1995\",4,3)))))))),\"\")","v":""},null,{"$f":"IF(C27=\"\",\"\",IF(RetainedMethod=\"Cumulative\",($C27-$C26),SUM($C$26:$C27)))","v":""},"",{"$f":"IF(ISERROR(INDEX(INDIRECT(\"grade\"&Grade&SpecYear),2,5)),\"\",INDEX(INDIRECT(\"grade\"&Grade&SpecYear),2,5))","v":""},{"$f":"IF(ISERROR(INDEX(INDIRECT(\"grade\"&Grade&SpecYear),2,6)),\"\",INDEX(INDIRECT(\"grade\"&Grade&SpecYear),2,6))","v":""},""]
[null,{"$f":"IFERROR(IF(Field4=\"AS\",INDEX(GradeAS2014,3,2),IF(Field4=\"BS\",INDEX(GradeBS2014,3,2),IF(Field4=\"CS\",INDEX(GradeCS2014,3,2),IF(Field4=\"DS\",INDEX(GradeDS2014,3,2),IF(ISERROR(IF(INDEX(INDIRECT(\"grade\"&Grade&SpecYear),3,IF(SpecYear=\"1995\",4,3))=0,\"\",INDEX(INDIRECT(\"grade\"&Grade&SpecYear),3,IF(SpecYear=\"1995\",4,3)))),\"\",IF(INDEX(INDIRECT(\"grade\"&Grade&SpecYear),3,IF(SpecYear=\"1995\",4,3))=0,\"\",INDEX(INDIRECT(\"grade\"&Grade&SpecYear),3,IF(SpecYear=\"1995\",4,3)))))))),\"\")","v":""},null,{"$f":"IF(C28=\"\",\"\",IF(RetainedMethod=\"Cumulative\",($C28-$C27),SUM($C$26:$C28)))","v":""},"",{"$f":"IF(ISERROR(INDEX(INDIRECT(\"grade\"&Grade&SpecYear),3,5)),\"\",INDEX(INDIRECT(\"grade\"&Grade&SpecYear),3,5))","v":""},{"$f":"IF(ISERROR(INDEX(INDIRECT(\"grade\"&Grade&SpecYear),3,6)),\"\",INDEX(INDIRECT(\"grade\"&Grade&SpecYear),3,6))","v":""},""]
[null,{"$f":"IFERROR(IF(Field4=\"AS\",INDEX(GradeAS2014,4,2),IF(Field4=\"BS\",INDEX(GradeBS2014,4,2),IF(Field4=\"CS\",INDEX(GradeCS2014,4,2),IF(Field4=\"DS\",INDEX(GradeDS2014,4,2),IF(ISERROR(IF(INDEX(INDIRECT(\"grade\"&Grade&SpecYear),4,IF(SpecYear=\"1995\",4,3))=0,\"\",INDEX(INDIRECT(\"grade\"&Grade&SpecYear),4,IF(SpecYear=\"1995\",4,3)))),\"\",IF(INDEX(INDIRECT(\"grade\"&Grade&SpecYear),4,IF(SpecYear=\"1995\",4,3))=0,\"\",INDEX(INDIRECT(\"grade\"&Grade&SpecYear),4,IF(SpecYear=\"1995\",4,3)))))))),\"\")","v":""},null,{"$f":"IF(C29=\"\",\"\",IF(RetainedMethod=\"Cumulative\",($C29-$C28),SUM($C$26:$C29)))","v":""},"",{"$f":"IF(ISERROR(INDEX(INDIRECT(\"grade\"&Grade&SpecYear),4,5)),\"\",INDEX(INDIRECT(\"grade\"&Grade&SpecYear),4,5))","v":""},{"$f":"IF(ISERROR(INDEX(INDIRECT(\"grade\"&Grade&SpecYear),4,6)),\"\",INDEX(INDIRECT(\"grade\"&Grade&SpecYear),4,6))","v":""},""]
[null,{"$f":"IFERROR(IF(Field4=\"AS\",INDEX(GradeAS2014,5,2),IF(Field4=\"BS\",INDEX(GradeBS2014,5,2),IF(Field4=\"CS\",INDEX(GradeCS2014,5,2),IF(Field4=\"DS\",INDEX(GradeDS2014,5,2),IF(ISERROR(IF(INDEX(INDIRECT(\"grade\"&Grade&SpecYear),5,IF(SpecYear=\"1995\",4,3))=0,\"\",INDEX(INDIRECT(\"grade\"&Grade&SpecYear),5,IF(SpecYear=\"1995\",4,3)))),\"\",IF(INDEX(INDIRECT(\"grade\"&Grade&SpecYear),5,IF(SpecYear=\"1995\",4,3))=0,\"\",INDEX(INDIRECT(\"grade\"&Grade&SpecYear),5,IF(SpecYear=\"1995\",4,3)))))))),\"\")","v":""},null,{"$f":"IF(C30=\"\",\"\",IF(RetainedMethod=\"Cumulative\",($C30-$C29),SUM($C$26:$C30)))","v":""},"",{"$f":"IF(ISERROR(INDEX(INDIRECT(\"grade\"&Grade&SpecYear),5,5)),\"\",INDEX(INDIRECT(\"grade\"&Grade&SpecYear),5,5))","v":""},{"$f":"IF(ISERROR(INDEX(INDIRECT(\"grade\"&Grade&SpecYear),5,6)),\"\",INDEX(INDIRECT(\"grade\"&Grade&SpecYear),5,6))","v":""},""]
[null,{"$f":"IF(ISERROR(IF(INDEX(INDIRECT(\"grade\"&Grade&SpecYear),6,IF(SpecYear=\"1995\",4,3))=0,\"\",INDEX(INDIRECT(\"grade\"&Grade&SpecYear),6,IF(SpecYear=\"1995\",4,3)))),\"\",IF(INDEX(INDIRECT(\"grade\"&Grade&SpecYear),6,IF(SpecYear=\"1995\",4,3))=0,\"\",INDEX(INDIRECT(\"grade\"&Grade&SpecYear),6,IF(SpecYear=\"1995\",4,3))))","v":""},null,{"$f":"IF(C31=\"\",\"\",IF(RetainedMethod=\"Cumulative\",($C31-$C30),SUM($C$26:$C31)))","v":""},"",{"$f":"IF(ISERROR(INDEX(INDIRECT(\"grade\"&Grade&SpecYear),6,5)),\"\",INDEX(INDIRECT(\"grade\"&Grade&SpecYear),6,5))","v":""},{"$f":"IF(ISERROR(INDEX(INDIRECT(\"grade\"&Grade&SpecYear),6,6)),\"\",INDEX(INDIRECT(\"grade\"&Grade&SpecYear),6,6))","v":""},""]
[null,{"$f":"IF(ISERROR(IF(INDEX(INDIRECT(\"grade\"&Grade&SpecYear),7,IF(SpecYear=\"1995\",4,3))=0,\"\",INDEX(INDIRECT(\"grade\"&Grade&SpecYear),7,IF(SpecYear=\"1995\",4,3)))),\"\",IF(INDEX(INDIRECT(\"grade\"&Grade&SpecYear),7,IF(SpecYear=\"1995\",4,3))=0,\"\",INDEX(INDIRECT(\"grade\"&Grade&SpecYear),7,IF(SpecYear=\"1995\",4,3))))","v":""},null,{"$f":"IF(C32=\"\",\"\",IF(RetainedMethod=\"Cumulative\",($C32-$C31),SUM($C$26:$C32)))","v":""},"",{"$f":"IF(ISERROR(INDEX(INDIRECT(\"grade\"&Grade&SpecYear),7,5)),\"\",INDEX(INDIRECT(\"grade\"&Grade&SpecYear),7,5))","v":""},{"$f":"IF(ISERROR(INDEX(INDIRECT(\"grade\"&Grade&SpecYear),7,6)),\"\",INDEX(INDIRECT(\"grade\"&Grade&SpecYear),7,6))","v":""},""]
[null,{"$f":"IF(RetainedMethod=\"cumulative\",\"Total:\",\"-\" & OFFSET(B33,-(COUNTBLANK(SieveSize)+1),0))","v":"-"}]
[null,"Total:",{"$f":"IF(SUM(SieveWeights)=0,\"\",IF(ISERROR(IF(RetainedMethod=\"Cumulative\",Pan,SUM(C26:C33))),\"\",IF(RetainedMethod=\"Cumulative\",Pan,SUM(C26:C33))))","v":""}]
[null,"Note- Use No. 4 sieve for determination of rock backfill as described in Item 0423.2.4."]
[null,"Remarks:",{"$f":"NOW()","v":"2025-02-05T14:08:28.860"}]
[]
[]
[]
[]
[]
[null,"Sample Method:","Sampled By:",null,null,"Sampled Date:"]
[null,"TX100"]
[]
[null,"TX400"]
[null,"Test Method:","Tested By:",null,null,"Tested Date:"]
[null,"TX110"]
[]
[null,"TX110PI"]
[null,"Test Stamp Code:",null,null,"Omit Test:","Completed Date:","Reviewed By:"]
[]
[null,"Locked By:","TxDOT:","District:","Area:"]
[]
[null,"Authorized By:",null,null,"Authorized Date:"]

{"sheet":"RX","index":1,"n_rows":56,"n_cols":9,"rows_kept":56,"cut":false,"hidden":true,"merged":[]}
[{"$f":"COUNTA(A3:A1048576)","v":54}]
["Fld_nbr","Value","Desc_1","Desc_2","Desc_3","Desc_4","Desc_5","Desc_6","Desc_7"]
[1,{"$f":"IF('Tex-110-E'!$B$37=\"\",\"\",'Tex-110-E'!$B$37)","v":""},{"$f":"'Tex-110-E'!$B$36","v":"Remarks:"}]
[2,{"$f":"IF('Tex-110-E'!$D$19=\"\",\"\",'Tex-110-E'!$D$19)","v":""},{"$f":"IF('Tex-110-E'!$C$19=\"\",\"\",'Tex-110-E'!$C$19)","v":"COURSE\\LIFT:"}]
[3,{"$f":"IF('Tex-110-E'!$C$47=\"\",\"\",'Tex-110-E'!$C$47)","v":""},"Tested By ",{"$f":"IF('Tex-110-E'!$B$47=\"\",\"\",'Tex-110-E'!$B$47)","v":"TX110"}]
[4,{"$f":"IF('Tex-110-E'!$F$47=\"\",\"\",'Tex-110-E'!$F$47)","v":""},"Tested Date ",{"$f":"IF('Tex-110-E'!$B$47=\"\",\"\",'Tex-110-E'!$B$47)","v":"TX110"}]
[5,{"$f":"IF('Tex-110-E'!$C$26=\"\",\"\",'Tex-110-E'!$C$26)","v":""},{"$f":"IF('Tex-110-E'!$B$6=\"\",\"\",'Tex-110-E'!$B$6)","v":"Tex-110-E PART I"},{"$f":"IF('Tex-110-E'!$C$24=\"\",\"\",'Tex-110-E'!$C$24)","v":"Individual Weight Retained "},{"$f":"IF('Tex-110-E'!$B$23=\"\",\"\",'Tex-110-E'!$B$23)","v":"Sieve Size"},{"$f":"IF('Tex-110-E'!$B$26=\"\",\"\",'Tex-110-E'!$B$26)","v":""}]
[6,{"$f":"IF('Tex-110-E'!$D$26=\"\",\"\",'Tex-110-E'!$D$26)","v":""},{"$f":"IF('Tex-110-E'!$B$6=\"\",\"\",'Tex-110-E'!$B$6)","v":"Tex-110-E PART I"},{"$f":"IF('Tex-110-E'!$D$23=\"\",\"\",'Tex-110-E'!$D$23)","v":"Cumulative Weight Retained"},{"$f":"IF('Tex-110-E'!$B$23=\"\",\"\",'Tex-110-E'!$B$23)","v":"Sieve Size"},{"$f":"IF('Tex-110-E'!$B$26=\"\",\"\",'Tex-110-E'!$B$26)","v":""}]
[7,{"$f":"IF('Tex-110-E'!$E$26=\"\",\"\",'Tex-110-E'!$E$26)","v":""},{"$f":"IF('Tex-110-E'!$B$6=\"\",\"\",'Tex-110-E'!$B$6)","v":"Tex-110-E PART I"},{"$f":"IF('Tex-110-E'!$E$23=\"\",\"\",'Tex-110-E'!$E$23)","v":"Cumulative Percent Retained"},{"$f":"IF('Tex-110-E'!$B$23=\"\",\"\",'Tex-110-E'!$B$23)","v":"Sieve Size"},{"$f":"IF('Tex-110-E'!$B$26=\"\",\"\",'Tex-110-E'!$B$26)","v":""}]
[8,{"$f":"IF('Tex-110-E'!$F$26=\"\",\"\",'Tex-110-E'!$F$26)","v":""},{"$f":"IF('Tex-110-E'!$B$6=\"\",\"\",'Tex-110-E'!$B$6)","v":"Tex-110-E PART I"},{"$f":"IF('Tex-110-E'!$F$23=\"\",\"\",'Tex-110-E'!$F$23)","v":"Lower Spec Limit %"},{"$f":"IF('Tex-110-E'!$B$23=\"\",\"\",'Tex-110-E'!$B$23)","v":"Sieve Size"},{"$f":"IF('Tex-110-E'!$B$26=\"\",\"\",'Tex-110-E'!$B$26)","v":""}]
[9,{"$f":"IF('Tex-110-E'!$G$26=\"\",\"\",'Tex-110-E'!$G$26)","v":""},{"$f":"IF('Tex-110-E'!$B$6=\"\",\"\",'Tex-110-E'!$B$6)","v":"Tex-110-E PART I"},{"$f":"IF('Tex-110-E'!$G$23=\"\",\"\",'Tex-110-E'!$G$23)","v":"Upper Spec Limit %"},{"$f":"IF('Tex-110-E'!$B$23=\"\",\"\",'Tex-110-E'!$B$23)","v":"Sieve Size"},{"$f":"IF('Tex-110-E'!$B$26=\"\",\"\",'Tex-110-E'!$B$26)","v":""}]
[10,{"$f":"IF('Tex-110-E'!$H$26=\"\",\"\",'Tex-110-E'!$H$26)","v":""},{"$f":"IF('Tex-110-E'!$B$6=\"\",\"\",'Tex-110-E'!$B$6)","v":"Tex-110-E PART I"},{"$f":"IF('Tex-110-E'!$H$23=\"\",\"\",'Tex-110-E'!$H$23)","v":"Within Master Grading"},{"$f":"IF('Tex-110-E'!$B$23=\"\",\"\",'Tex-110-E'!$B$23)","v":"Sieve Size"},{"$f":"IF('Tex-110-E'!$B$26=\"\",\"\",'Tex-110-E'!$B$26)","v":""}]
[11,{"$f":"IF('Tex-110-E'!$C$27=\"\",\"\",'Tex-110-E'!$C$27)","v":""},{"$f":"IF('Tex-110-E'!$B$6=\"\",\"\",'Tex-110-E'!$B$6)","v":"Tex-110-E PART I"},{"$f":"IF('Tex-110-E'!$C$24=\"\",\"\",'Tex-110-E'!$C$24)","v":"Individual Weight Retained "},{"$f":"IF('Tex-110-E'!$B$23=\"\",\"\",'Tex-110-E'!$B$23)","v":"Sieve Size"},{"$f":"IF('Tex-110-E'!$B$27=\"\",\"\",'Tex-110-E'!$B$27)","v":""}]
[12,{"$f":"IF('Tex-110-E'!$D$27=\"\",\"\",'Tex-110-E'!$D$27)","v":""},{"$f":"IF('Tex-110-E'!$B$6=\"\",\"\",'Tex-110-E'!$B$6)","v":"Tex-110-E PART I"},{"$f":"IF('Tex-110-E'!$D$23=\"\",\"\",'Tex-110-E'!$D$23)","v":"Cumulative Weight Retained"},{"$f":"IF('Tex-110-E'!$B$23=\"\",\"\",'Tex-110-E'!$B$23)","v":"Sieve Size"},{"$f":"IF('Tex-110-E'!$B$27=\"\",\"\",'Tex-110-E'!$B$27)","v":""}]
[13,{"$f":"IF('Tex-110-E'!$E$27=\"\",\"\",'Tex-110-E'!$E$27)","v":""},{"$f":"IF('Tex-110-E'!$B$6=\"\",\"\",'Tex-110-E'!$B$6)","v":"Tex-110-E PART I"},{"$f":"IF('Tex-110-E'!$E$23=\"\",\"\",'Tex-110-E'!$E$23)","v":"Cumulative Percent Retained"},{"$f":"IF('Tex-110-E'!$B$23=\"\",\"\",'Tex-110-E'!$B$23)","v":"Sieve Size"},{"$f":"IF('Tex-110-E'!$B$27=\"\",\"\",'Tex-110-E'!$B$27)","v":""}]
[14,{"$f":"IF('Tex-110-E'!$F$27=\"\",\"\",'Tex-110-E'!$F$27)","v":""},{"$f":"IF('Tex-110-E'!$B$6=\"\",\"\",'Tex-110-E'!$B$6)","v":"Tex-110-E PART I"},{"$f":"IF('Tex-110-E'!$F$23=\"\",\"\",'Tex-110-E'!$F$23)","v":"Lower Spec Limit %"},{"$f":"IF('Tex-110-E'!$B$23=\"\",\"\",'Tex-110-E'!$B$23)","v":"Sieve Size"},{"$f":"IF('Tex-110-E'!$B$27=\"\",\"\",'Tex-110-E'!$B$27)","v":""}]
[15,{"$f":"IF('Tex-110-E'!$G$27=\"\",\"\",'Tex-110-E'!$G$27)","v":""},{"$f":"IF('Tex-110-E'!$B$6=\"\",\"\",'Tex-110-E'!$B$6)","v":"Tex-110-E PART I"},{"$f":"IF('Tex-110-E'!$G$23=\"\",\"\",'Tex-110-E'!$G$23)","v":"Upper Spec Limit %"},{"$f":"IF('Tex-110-E'!$B$23=\"\",\"\",'Tex-110-E'!$B$23)","v":"Sieve Size"},{"$f":"IF('Tex-110-E'!$B$27=\"\",\"\",'Tex-110-E'!$B$27)","v":""}]
[16,{"$f":"IF('Tex-110-E'!$H$27=\"\",\"\",'Tex-110-E'!$H$27)","v":""},{"$f":"IF('Tex-110-E'!$B$6=\"\",\"\",'Tex-110-E'!$B$6)","v":"Tex-110-E PART I"},{"$f":"IF('Tex-110-E'!$H$23=\"\",\"\",'Tex-110-E'!$H$23)","v":"Within Master Grading"},{"$f":"IF('Tex-110-E'!$B$23=\"\",\"\",'Tex-110-E'!$B$23)","v":"Sieve Size"},{"$f":"IF('Tex-110-E'!$B$27=\"\",\"\",'Tex-110-E'!$B$27)","v":""}]
[17,{"$f":"IF('Tex-110-E'!$C$28=\"\",\"\",'Tex-110-E'!$C$28)","v":""},{"$f":"IF('Tex-110-E'!$B$6=\"\",\"\",'Tex-110-E'!$B$6)","v":"Tex-110-E PART I"},{"$f":"IF('Tex-110-E'!$C$24=\"\",\"\",'Tex-110-E'!$C$24)","v":"Individual Weight Retained "},{"$f":"IF('Tex-110-E'!$B$23=\"\",\"\",'Tex-110-E'!$B$23)","v":"Sieve Size"},{"$f":"IF('Tex-110-E'!$B$28=\"\",\"\",'Tex-110-E'!$B$28)","v":""}]
[18,{"$f":"IF('Tex-110-E'!$D$28=\"\",\"\",'Tex-110-E'!$D$28)","v":""},{"$f":"IF('Tex-110-E'!$B$6=\"\",\"\",'Tex-110-E'!$B$6)","v":"Tex-110-E PART I"},{"$f":"IF('Tex-110-E'!$D$23=\"\",\"\",'Tex-110-E'!$D$23)","v":"Cumulative Weight Retained"},{"$f":"IF('Tex-110-E'!$B$23=\"\",\"\",'Tex-110-E'!$B$23)","v":"Sieve Size"},{"$f":"IF('Tex-110-E'!$B$28=\"\",\"\",'Tex-110-E'!$B$28)","v":""}]
[19,{"$f":"IF('Tex-110-E'!$E$28=\"\",\"\",'Tex-110-E'!$E$28)","v":""},{"$f":"IF('Tex-110-E'!$B$6=\"\",\"\",'Tex-110-E'!$B$6)","v":"Tex-110-E PART I"},{"$f":"IF('Tex-110-E'!$E$23=\"\",\"\",'Tex-110-E'!$E$23)","v":"Cumulative Percent Retained"},{"$f":"IF('Tex-110-E'!$B$23=\"\",\"\",'Tex-110-E'!$B$23)","v":"Sieve Size"},{"$f":"IF('Tex-110-E'!$B$28=\"\",\"\",'Tex-110-E'!$B$28)","v":""}]
[20,{"$f":"IF('Tex-110-E'!$F$28=\"\",\"\",'Tex-110-E'!$F$28)","v":""},{"$f":"IF('Tex-110-E'!$B$6=\"\",\"\",'Tex-110-E'!$B$6)","v":"Tex-110-E PART I"},{"$f":"IF('Tex-110-E'!$F$23=\"\",\"\",'Tex-110-E'!$F$23)","v":"Lower Spec Limit %"},{"$f":"IF('Tex-110-E'!$B$23=\"\",\"\",'Tex-110-E'!$B$23)","v":"Sieve Size"},{"$f":"IF('Tex-110-E'!$B$28=\"\",\"\",'Tex-110-E'!$B$28)","v":""}]
[21,{"$f":"IF('Tex-110-E'!$G$28=\"\",\"\",'Tex-110-E'!$G$28)","v":""},{"$f":"IF('Tex-110-E'!$B$6=\"\",\"\",'Tex-110-E'!$B$6)","v":"Tex-110-E PART I"},{"$f":"IF('Tex-110-E'!$G$23=\"\",\"\",'Tex-110-E'!$G$23)","v":"Upper Spec Limit %"},{"$f":"IF('Tex-110-E'!$B$23=\"\",\"\",'Tex-110-E'!$B$23)","v":"Sieve Size"},{"$f":"IF('Tex-110-E'!$B$28=\"\",\"\",'Tex-110-E'!$B$28)","v":""}]
[22,{"$f":"IF('Tex-110-E'!$H$28=\"\",\"\",'Tex-110-E'!$H$28)","v":""},{"$f":"IF('Tex-110-E'!$B$6=\"\",\"\",'Tex-110-E'!$B$6)","v":"Tex-110-E PART I"},{"$f":"IF('Tex-110-E'!$H$23=\"\",\"\",'Tex-110-E'!$H$23)","v":"Within Master Grading"},{"$f":"IF('Tex-110-E'!$B$23=\"\",\"\",'Tex-110-E'!$B$23)","v":"Sieve Size"},{"$f":"IF('Tex-110-E'!$B$28=\"\",\"\",'Tex-110-E'!$B$28)","v":""}]
[23,{"$f":"IF('Tex-110-E'!$C$29=\"\",\"\",'Tex-110-E'!$C$29)","v":""},{"$f":"IF('Tex-110-E'!$B$6=\"\",\"\",'Tex-110-E'!$B$6)","v":"Tex-110-E PART I"},{"$f":"IF('Tex-110-E'!$C$24=\"\",\"\",'Tex-110-E'!$C$24)","v":"Individual Weight Retained "},{"$f":"IF('Tex-110-E'!$B$23=\"\",\"\",'Tex-110-E'!$B$23)","v":"Sieve Size"},{"$f":"IF('Tex-110-E'!$B$29=\"\",\"\",'Tex-110-E'!$B$29)","v":""}]
[24,{"$f":"IF('Tex-110-E'!$D$29=\"\",\"\",'Tex-110-E'!$D$29)","v":""},{"$f":"IF('Tex-110-E'!$B$6=\"\",\"\",'Tex-110-E'!$B$6)","v":"Tex-110-E PART I"},{"$f":"IF('Tex-110-E'!$D$23=\"\",\"\",'Tex-110-E'!$D$23)","v":"Cumulative Weight Retained"},{"$f":"IF('Tex-110-E'!$B$23=\"\",\"\",'Tex-110-E'!$B$23)","v":"Sieve Size"},{"$f":"IF('Tex-110-E'!$B$29=\"\",\"\",'Tex-110-E'!$B$29)","v":""}]
[25,{"$f":"IF('Tex-110-E'!$E$29=\"\",\"\",'Tex-110-E'!$E$29)","v":""},{"$f":"IF('Tex-110-E'!$B$6=\"\",\"\",'Tex-110-E'!$B$6)","v":"Tex-110-E PART I"},{"$f":"IF('Tex-110-E'!$E$23=\"\",\"\",'Tex-110-E'!$E$23)","v":"Cumulative Percent Retained"},{"$f":"IF('Tex-110-E'!$B$23=\"\",\"\",'Tex-110-E'!$B$23)","v":"Sieve Size"},{"$f":"IF('Tex-110-E'!$B$29=\"\",\"\",'Tex-110-E'!$B$29)","v":""}]
[26,{"$f":"IF('Tex-110-E'!$F$29=\"\",\"\",'Tex-110-E'!$F$29)","v":""},{"$f":"IF('Tex-110-E'!$B$6=\"\",\"\",'Tex-110-E'!$B$6)","v":"Tex-110-E PART I"},{"$f":"IF('Tex-110-E'!$F$23=\"\",\"\",'Tex-110-E'!$F$23)","v":"Lower Spec Limit %"},{"$f":"IF('Tex-110-E'!$B$23=\"\",\"\",'Tex-110-E'!$B$23)","v":"Sieve Size"},{"$f":"IF('Tex-110-E'!$B$29=\"\",\"\",'Tex-110-E'!$B$29)","v":""}]
[27,{"$f":"IF('Tex-110-E'!$G$29=\"\",\"\",'Tex-110-E'!$G$29)","v":""},{"$f":"IF('Tex-110-E'!$B$6=\"\",\"\",'Tex-110-E'!$B$6)","v":"Tex-110-E PART I"},{"$f":"IF('Tex-110-E'!$G$23=\"\",\"\",'Tex-110-E'!$G$23)","v":"Upper Spec Limit %"},{"$f":"IF('Tex-110-E'!$B$23=\"\",\"\",'Tex-110-E'!$B$23)","v":"Sieve Size"},{"$f":"IF('Tex-110-E'!$B$29=\"\",\"\",'Tex-110-E'!$B$29)","v":""}]
[28,{"$f":"IF('Tex-110-E'!$H$29=\"\",\"\",'Tex-110-E'!$H$29)","v":""},{"$f":"IF('Tex-110-E'!$B$6=\"\",\"\",'Tex-110-E'!$B$6)","v":"Tex-110-E PART I"},{"$f":"IF('Tex-110-E'!$H$23=\"\",\"\",'Tex-110-E'!$H$23)","v":"Within Master Grading"},{"$f":"IF('Tex-110-E'!$B$23=\"\",\"\",'Tex-110-E'!$B$23)","v":"Sieve Size"},{"$f":"IF('Tex-110-E'!$B$29=\"\",\"\",'Tex-110-E'!$B$29)","v":""}]
[29,{"$f":"IF('Tex-110-E'!$C$30=\"\",\"\",'Tex-110-E'!$C$30)","v":""},{"$f":"IF('Tex-110-E'!$B$6=\"\",\"\",'Tex-110-E'!$B$6)","v":"Tex-110-E PART I"},{"$f":"IF('Tex-110-E'!$C$24=\"\",\"\",'Tex-110-E'!$C$24)","v":"Individual Weight Retained "},{"$f":"IF('Tex-110-E'!$B$23=\"\",\"\",'Tex-110-E'!$B$23)","v":"Sieve Size"},{"$f":"IF('Tex-110-E'!$B$30=\"\",\"\",'Tex-110-E'!$B$30)","v":""}]
[30,{"$f":"IF('Tex-110-E'!$D$30=\"\",\"\",'Tex-110-E'!$D$30)","v":""},{"$f":"IF('Tex-110-E'!$B$6=\"\",\"\",'Tex-110-E'!$B$6)","v":"Tex-110-E PART I"},{"$f":"IF('Tex-110-E'!$D$23=\"\",\"\",'Tex-110-E'!$D$23)","v":"Cumulative Weight Retained"},{"$f":"IF('Tex-110-E'!$B$23=\"\",\"\",'Tex-110-E'!$B$23)","v":"Sieve Size"},{"$f":"IF('Tex-110-E'!$B$30=\"\",\"\",'Tex-110-E'!$B$30)","v":""}]
[31,{"$f":"IF('Tex-110-E'!$E$30=\"\",\"\",'Tex-110-E'!$E$30)","v":""},{"$f":"IF('Tex-110-E'!$B$6=\"\",\"\",'Tex-110-E'!$B$6)","v":"Tex-110-E PART I"},{"$f":"IF('Tex-110-E'!$E$23=\"\",\"\",'Tex-110-E'!$E$23)","v":"Cumulative Percent Retained"},{"$f":"IF('Tex-110-E'!$B$23=\"\",\"\",'Tex-110-E'!$B$23)","v":"Sieve Size"},{"$f":"IF('Tex-110-E'!$B$30=\"\",\"\",'Tex-110-E'!$B$30)","v":""}]
[32,{"$f":"IF('Tex-110-E'!$F$30=\"\",\"\",'Tex-110-E'!$F$30)","v":""},{"$f":"IF('Tex-110-E'!$B$6=\"\",\"\",'Tex-110-E'!$B$6)","v":"Tex-110-E PART I"},{"$f":"IF('Tex-110-E'!$F$23=\"\",\"\",'Tex-110-E'!$F$23)","v":"Lower Spec Limit %"},{"$f":"IF('Tex-110-E'!$B$23=\"\",\"\",'Tex-110-E'!$B$23)","v":"Sieve Size"},{"$f":"IF('Tex-110-E'!$B$30=\"\",\"\",'Tex-110-E'!$B$30)","v":""}]
[33,{"$f":"IF('Tex-110-E'!$G$30=\"\",\"\",'Tex-110-E'!$G$30)","v":""},{"$f":"IF('Tex-110-E'!$B$6=\"\",\"\",'Tex-110-E'!$B$6)","v":"Tex-110-E PART I"},{"$f":"IF('Tex-110-E'!$G$23=\"\",\"\",'Tex-110-E'!$G$23)","v":"Upper Spec Limit %"},{"$f":"IF('Tex-110-E'!$B$23=\"\",\"\",'Tex-110-E'!$B$23)","v":"Sieve Size"},{"$f":"IF('Tex-110-E'!$B$30=\"\",\"\",'Tex-110-E'!$B$30)","v":""}]
[34,{"$f":"IF('Tex-110-E'!$H$30=\"\",\"\",'Tex-110-E'!$H$30)","v":""},{"$f":"IF('Tex-110-E'!$B$6=\"\",\"\",'Tex-110-E'!$B$6)","v":"Tex-110-E PART I"},{"$f":"IF('Tex-110-E'!$H$23=\"\",\"\",'Tex-110-E'!$H$23)","v":"Within Master Grading"},{"$f":"IF('Tex-110-E'!$B$23=\"\",\"\",'Tex-110-E'!$B$23)","v":"Sieve Size"},{"$f":"IF('Tex-110-E'!$B$30=\"\",\"\",'Tex-110-E'!$B$30)","v":""}]
[35,{"$f":"IF('Tex-110-E'!$C$31=\"\",\"\",'Tex-110-E'!$C$31)","v":""},{"$f":"IF('Tex-110-E'!$B$6=\"\",\"\",'Tex-110-E'!$B$6)","v":"Tex-110-E PART I"},{"$f":"IF('Tex-110-E'!$C$24=\"\",\"\",'Tex-110-E'!$C$24)","v":"Individual Weight Retained "},{"$f":"IF('Tex-110-E'!$B$23=\"\",\"\",'Tex-110-E'!$B$23)","v":"Sieve Size"},{"$f":"IF('Tex-110-E'!$B$31=\"\",\"\",'Tex-110-E'!$B$31)","v":""}]
[36,{"$f":"IF('Tex-110-E'!$D$31=\"\",\"\",'Tex-110-E'!$D$31)","v":""},{"$f":"IF('Tex-110-E'!$B$6=\"\",\"\",'Tex-110-E'!$B$6)","v":"Tex-110-E PART I"},{"$f":"IF('Tex-110-E'!$D$23=\"\",\"\",'Tex-110-E'!$D$23)","v":"Cumulative Weight Retained"},{"$f":"IF('Tex-110-E'!$B$23=\"\",\"\",'Tex-110-E'!$B$23)","v":"Sieve Size"},{"$f":"IF('Tex-110-E'!$B$31=\"\",\"\",'Tex-110-E'!$B$31)","v":""}]
[37,{"$f":"IF('Tex-110-E'!$E$31=\"\",\"\",'Tex-110-E'!$E$31)","v":""},{"$f":"IF('Tex-110-E'!$B$6=\"\",\"\",'Tex-110-E'!$B$6)","v":"Tex-110-E PART I"},{"$f":"IF('Tex-110-E'!$E$23=\"\",\"\",'Tex-110-E'!$E$23)","v":"Cumulative Percent Retained"},{"$f":"IF('Tex-110-E'!$B$23=\"\",\"\",'Tex-110-E'!$B$23)","v":"Sieve Size"},{"$f":"IF('Tex-110-E'!$B$31=\"\",\"\",'Tex-110-E'!$B$31)","v":""}]
[38,{"$f":"IF('Tex-110-E'!$F$31=\"\",\"\",'Tex-110-E'!$F$31)","v":""},{"$f":"IF('Tex-110-E'!$B$6=\"\",\"\",'Tex-110-E'!$B$6)","v":"Tex-110-E PART I"},{"$f":"IF('Tex-110-E'!$F$23=\"\",\"\",'Tex-110-E'!$F$23)","v":"Lower Spec Limit %"},{"$f":"IF('Tex-110-E'!$B$23=\"\",\"\",'Tex-110-E'!$B$23)","v":"Sieve Size"},{"$f":"IF('Tex-110-E'!$B$31=\"\",\"\",'Tex-110-E'!$B$31)","v":""}]
[39,{"$f":"IF('Tex-110-E'!$G$31=\"\",\"\",'Tex-110-E'!$G$31)","v":""},{"$f":"IF('Tex-110-E'!$B$6=\"\",\"\",'Tex-110-E'!$B$6)","v":"Tex-110-E PART I"},{"$f":"IF('Tex-110-E'!$G$23=\"\",\"\",'Tex-110-E'!$G$23)","v":"Upper Spec Limit %"},{"$f":"IF('Tex-110-E'!$B$23=\"\",\"\",'Tex-110-E'!$B$23)","v":"Sieve Size"},{"$f":"IF('Tex-110-E'!$B$31=\"\",\"\",'Tex-110-E'!$B$31)","v":""}]
[40,{"$f":"IF('Tex-110-E'!$H$31=\"\",\"\",'Tex-110-E'!$H$31)","v":""},{"$f":"IF('Tex-110-E'!$B$6=\"\",\"\",'Tex-110-E'!$B$6)","v":"Tex-110-E PART I"},{"$f":"IF('Tex-110-E'!$H$23=\"\",\"\",'Tex-110-E'!$H$23)","v":"Within Master Grading"},{"$f":"IF('Tex-110-E'!$B$23=\"\",\"\",'Tex-110-E'!$B$23)","v":"Sieve Size"},{"$f":"IF('Tex-110-E'!$B$31=\"\",\"\",'Tex-110-E'!$B$31)","v":""}]
[41,{"$f":"IF('Tex-110-E'!$C$32=\"\",\"\",'Tex-110-E'!$C$32)","v":""},{"$f":"IF('Tex-110-E'!$B$6=\"\",\"\",'Tex-110-E'!$B$6)","v":"Tex-110-E PART I"},{"$f":"IF('Tex-110-E'!$C$24=\"\",\"\",'Tex-110-E'!$C$24)","v":"Individual Weight Retained "},{"$f":"IF('Tex-110-E'!$B$23=\"\",\"\",'Tex-110-E'!$B$23)","v":"Sieve Size"},{"$f":"IF('Tex-110-E'!$B$32=\"\",\"\",'Tex-110-E'!$B$32)","v":""}]
[42,{"$f":"IF('Tex-110-E'!$D$32=\"\",\"\",'Tex-110-E'!$D$32)","v":""},{"$f":"IF('Tex-110-E'!$B$6=\"\",\"\",'Tex-110-E'!$B$6)","v":"Tex-110-E PART I"},{"$f":"IF('Tex-110-E'!$D$23=\"\",\"\",'Tex-110-E'!$D$23)","v":"Cumulative Weight Retained"},{"$f":"IF('Tex-110-E'!$B$23=\"\",\"\",'Tex-110-E'!$B$23)","v":"Sieve Size"},{"$f":"IF('Tex-110-E'!$B$32=\"\",\"\",'Tex-110-E'!$B$32)","v":""}]
[43,{"$f":"IF('Tex-110-E'!$E$32=\"\",\"\",'Tex-110-E'!$E$32)","v":""},{"$f":"IF('Tex-110-E'!$B$6=\"\",\"\",'Tex-110-E'!$B$6)","v":"Tex-110-E PART I"},{"$f":"IF('Tex-110-E'!$E$23=\"\",\"\",'Tex-110-E'!$E$23)","v":"Cumulative Percent Retained"},{"$f":"IF('Tex-110-E'!$B$23=\"\",\"\",'Tex-110-E'!$B$23)","v":"Sieve Size"},{"$f":"IF('Tex-110-E'!$B$32=\"\",\"\",'Tex-110-E'!$B$32)","v":""}]
[44,{"$f":"IF('Tex-110-E'!$F$32=\"\",\"\",'Tex-110-E'!$F$32)","v":""},{"$f":"IF('Tex-110-E'!$B$6=\"\",\"\",'Tex-110-E'!$B$6)","v":"Tex-110-E PART I"},{"$f":"IF('Tex-110-E'!$F$23=\"\",\"\",'Tex-110-E'!$F$23)","v":"Lower Spec Limit %"},{"$f":"IF('Tex-110-E'!$B$23=\"\",\"\",'Tex-110-E'!$B$23)","v":"Sieve Size"},{"$f":"IF('Tex-110-E'!$B$32=\"\",\"\",'Tex-110-E'!$B$32)","v":""}]
[45,{"$f":"IF('Tex-110-E'!$G$32=\"\",\"\",'Tex-110-E'!$G$32)","v":""},{"$f":"IF('Tex-110-E'!$B$6=\"\",\"\",'Tex-110-E'!$B$6)","v":"Tex-110-E PART I"},{"$f":"IF('Tex-110-E'!$G$23=\"\",\"\",'Tex-110-E'!$G$23)","v":"Upper Spec Limit %"},{"$f":"IF('Tex-110-E'!$B$23=\"\",\"\",'Tex-110-E'!$B$23)","v":"Sieve Size"},{"$f":"IF('Tex-110-E'!$B$32=\"\",\"\",'Tex-110-E'!$B$32)","v":""}]
[46,{"$f":"IF('Tex-110-E'!$H$32=\"\",\"\",'Tex-110-E'!$H$32)","v":""},{"$f":"IF('Tex-110-E'!$B$6=\"\",\"\",'Tex-110-E'!$B$6)","v":"Tex-110-E PART I"},{"$f":"IF('Tex-110-E'!$H$23=\"\",\"\",'Tex-110-E'!$H$23)","v":"Within Master Grading"},{"$f":"IF('Tex-110-E'!$B$23=\"\",\"\",'Tex-110-E'!$B$23)","v":"Sieve Size"},{"$f":"IF('Tex-110-E'!$B$32=\"\",\"\",'Tex-110-E'!$B$32)","v":""}]
[47,{"$f":"IF('Tex-110-E'!$C$33=\"\",\"\",'Tex-110-E'!$C$33)","v":""},{"$f":"IF('Tex-110-E'!$B$6=\"\",\"\",'Tex-110-E'!$B$6)","v":"Tex-110-E PART I"},{"$f":"IF('Tex-110-E'!$C$24=\"\",\"\",'Tex-110-E'!$C$24)","v":"Individual Weight Retained "},{"$f":"IF('Tex-110-E'!$B$23=\"\",\"\",'Tex-110-E'!$B$23)","v":"Sieve Size"},{"$f":"IF('Tex-110-E'!$B$33=\"\",\"\",'Tex-110-E'!$B$33)","v":"-"}]
[48,{"$f":"IF('Tex-110-E'!$C$34=\"\",\"\",'Tex-110-E'!$C$34)","v":""},{"$f":"IF('Tex-110-E'!$B$6=\"\",\"\",'Tex-110-E'!$B$6)","v":"Tex-110-E PART I"},{"$f":"IF('Tex-110-E'!$C$24=\"\",\"\",'Tex-110-E'!$C$24)","v":"Individual Weight Retained "},{"$f":"IF('Tex-110-E'!$B$23=\"\",\"\",'Tex-110-E'!$B$23)","v":"Sieve Size"},{"$f":"IF('Tex-110-E'!$B$34=\"\",\"\",'Tex-110-E'!$B$34)","v":"Total:"}]
[49,{"$f":"IF('Tex-110-E'!$C$49=\"\",\"\",'Tex-110-E'!$C$49)","v":""},"Tested By ",{"$f":"IF('Tex-110-E'!$B$49=\"\",\"\",'Tex-110-E'!$B$49)","v":"TX110PI"}]
[50,{"$f":"IF('Tex-110-E'!$F$49=\"\",\"\",'Tex-110-E'!$F$49)","v":""},"Tested Date ",{"$f":"IF('Tex-110-E'!$B$49=\"\",\"\",'Tex-110-E'!$B$49)","v":"TX110PI"}]
[51,{"$f":"IF('Tex-110-E'!$C$43=\"\",\"\",'Tex-110-E'!$C$43)","v":""},"Sampled By",{"$f":"IF('Tex-110-E'!$B$43=\"\",\"\",'Tex-110-E'!$B$43)","v":"TX100"}]
[52,{"$f":"IF('Tex-110-E'!$F$43=\"\",\"\",'Tex-110-E'!$F$43)","v":""},"Sampled Date ",{"$f":"IF('Tex-110-E'!$B$43=\"\",\"\",'Tex-110-E'!$B$43)","v":"TX100"}]
[53,{"$f":"IF('Tex-110-E'!$C$45=\"\",\"\",'Tex-110-E'!$C$45)","v":""},"Sampled By",{"$f":"IF('Tex-110-E'!$B$45=\"\",\"\",'Tex-110-E'!$B$45)","v":"TX400"}]
[54,{"$f":"IF('Tex-110-E'!$F$45=\"\",\"\",'Tex-110-E'!$F$45)","v":""},"Sampled Date ",{"$f":"IF('Tex-110-E'!$B$45=\"\",\"\",'Tex-110-E'!$B$45)","v":"TX400"}]

{"sheet":"GRADATIONS","index":3,"n_rows":111,"n_cols":13,"rows_kept":111,"cut":false,"hidden":true,"merged":[[64,0,69,0],[70,0,73,0],[74,0,79,0],[11,7,15,7],[16,7,19,7],[20,7,22,7],[23,7,25,7],[47,0,52,0],[53,0,56,0],[57,0,62,0],[1,0,5,0],[14,0,16,0],[10,0,13,0],[6,0,9,0],[40,0,45,0],[27,0,31,0],[32,0,35,0],[36,0,39,0],[17,0,18,0],[19,0,25,0]]}
["Grade","Diameter size mm","\"1993\" Sieve Size","\"1995\" Sieve Size","Min","Max",null,"size","Cumulative Percent Retained","Cumulative Percent Passing"]
["GRADE 1",45,"1-3/4\"","45 mm",0,0,null,{"$f":"IF(ISERROR(INDEX(INDIRECT(\"grade\"&Grade&SpecYear),1,2)),\"\",INDEX(INDIRECT(\"grade\"&Grade&SpecYear),1,2))","v":""},{"$f":"'Tex-110-E'!E26","v":""},{"$f":"IF(I2=\"\",\"\",100-I2)","v":""}]
[null,22.4,"7/8\"","22.4 mm",10,35,null,{"$f":"IF(ISERROR(INDEX(INDIRECT(\"grade\"&Grade&SpecYear),2,2)),\"\",INDEX(INDIRECT(\"grade\"&Grade&SpecYear),2,2))","v":""},{"$f":"'Tex-110-E'!E27","v":""},""]
[null,9.5,"3/8\"","9.5 mm",30,50,null,{"$f":"IF(ISERROR(INDEX(INDIRECT(\"grade\"&Grade&SpecYear),3,2)),\"\",INDEX(INDIRECT(\"grade\"&Grade&SpecYear),3,2))","v":""},{"$f":"'Tex-110-E'!E28","v":""},""]
[null,4.75,"No. 4","4.75 mm",45,65,null,{"$f":"IF(ISERROR(INDEX(INDIRECT(\"grade\"&Grade&SpecYear),4,2)),\"\",INDEX(INDIRECT(\"grade\"&Grade&SpecYear),4,2))","v":""},{"$f":"'Tex-110-E'!E29","v":""},""]
[null,0.42499999999999999,"No. 40","425 µm",70,85,null,{"$f":"IF(ISERROR(INDEX(INDIRECT(\"grade\"&Grade&SpecYear),5,2)),\"\",INDEX(INDIRECT(\"grade\"&Grade&SpecYear),5,2))","v":""},{"$f":"'Tex-110-E'!E30","v":""},""]
["GRADE 2",63,"2-1/2\"","63 mm",0,0,null,{"$f":"IF(ISERROR(INDEX(INDIRECT(\"grade\"&Grade&SpecYear),6,2)),\"\",INDEX(INDIRECT(\"grade\"&Grade&SpecYear),6,2))","v":""},{"$f":"'Tex-110-E'!E31","v":""},""]
[null,45,"1-3/4\"","45 mm",0,10,null,{"$f":"IF(ISERROR(INDEX(INDIRECT(\"grade\"&Grade&SpecYear),7,2)),\"\",INDEX(INDIRECT(\"grade\"&Grade&SpecYear),7,2))","v":""},{"$f":"'Tex-110-E'!E32","v":""},""]
[null,4.75,"No. 4","4.75 mm",45,75]
[null,0.42499999999999999,"No. 40","425 µm",60,85]
["GRADE 3",63,"2-1/2\"","63 mm",0,0,null,"Type","Sieve Size",null,null,"Min","Min"]
[null,45,"1-3/4\"","45 mm",0,10,null,"AS","3\"",null,0,0,0]
[null,4.75,"No. 4","4.75 mm",30,75,null,null,"1/2\"",null,"50-100",50,100]
[null,0.42499999999999999,"No. 40","425 µm",50,85,null,null,"#4",null,85,0,100]
["GRADE 4",45,"1-3/4\"","45 mm",0,0,null,null,"#40",null,"85-100",85,100]
[null,4.75,"No. 4","4.75 mm",45,75,null,null,"#200",null,"95-100",95,100]
[null,0.42499999999999999,"No. 40","425 µm",50,85,null,"BS","3\"",null,0,0,0]
["GRADE 5",45,"1-3/4\"","45 mm",0,0,null,null,"#4",null,85,0,100]
[null,0.42499999999999999,"No. 40","425 µm",50,85,null,null,"#40",null,"40-100",40,100]
["Grade 6 User Input",null,null,null,null,null,null,null,"#200",null,"85-100",85,100]
[null,null,null,null,null,null,null,"CS","3\"",null,0,0,0]
[null,null,null,null,null,null,null,null,"#4",null,85,0,100]
[null,null,null,null,null,null,null,null,"#200",null,"75-100",75,100]
[null,null,null,null,null,null,null,"DS","3\"",null,0,0,0]
[null,null,null,null,null,null,null,null,"3/8\"",null,"85-100",85,100]
[null,null,null,null,null,null,null,null,"#200",null,"95-100",95,100]
[]
["GRADE 1",45,"1-3/4\"",null,0,0]
[null,22.4,"7/8\"",null,10,35]
[null,9.5,"3/8\"",null,30,50]
[null,4.75,"No. 4",null,45,65]
[null,0.42499999999999999,"No. 40",null,70,85]
["GRADE 2",63,"2-1/2\"",null,0,0]
[null,45,"1-3/4\"",null,0,10]
[null,4.75,"No. 4",null,45,75]
[null,0.42499999999999999,"No. 40",null,60,85]
["GRADE 3",63,"2-1/2\"",null,0,0]
[null,45,"1-3/4\"",null,0,10]
[null,4.75,"No. 4",null,45,75]
[null,0.42499999999999999,"No. 40",null,50,85]
["GRADE 5",63,"2-1/2\"",null,0,0]
[null,45,"1-3/4\"",null,0,5]
[null,22.4,"7/8\"",null,10,35]
[null,9.5,"3/8\"",null,35,65]
[null,4.75,"No. 4",null,45,75]
[null,0.42499999999999999,"No. 40",null,70,90]
[]
["GRADE 1 & 2",63,"2-1/2\"",null,0,0]
[null,45,"1-3/4\"",null,0,10]
[null,22.4,"7/8\"",null,10,35]
[null,9.5,"3/8\"",null,30,65]
[null,4.75,"No. 4",null,45,75]
[null,0.42499999999999999,"No. 40",null,65,90]
["GRADE 3",63,"2-1/2\"",null,0,0]
[null,45,"1-3/4\"",null,0,10]
[null,4.75,"No. 4",null,45,75]
[null,0.42499999999999999,"No. 40",null,50,85]
["GRADE 5",63,"2-1/2\"",null,0,0]
[null,45,"1-3/4\"",null,0,5]
[null,22.4,"7/8\"",null,10,35]
[null,9.5,"3/8\"",null,35,65]
[null,4.75,"No. 4",null,45,75]
[null,0.42499999999999999,"No. 40",null,70,90]
[]
["GRADE 1 & 2",63,"2-1/2\"",null,0,0]
[null,45,"1-3/4\"",null,0,10]
[null,22.4,"7/8\"",null,10,35]
[null,9.5,"3/8\"",null,30,65]
[null,4.75,"No. 4",null,45,75]
[null,0.42499999999999999,"No. 40",null,65,90]
["GRADE 3",63,"2-1/2\"",null,0,0]
[null,45,"1-3/4\"",null,0,10]
[null,4.75,"No. 4",null,45,75]
[null,0.42499999999999999,"No. 40",null,50,85]
["GRADE 5",63,"2-1/2\"",null,0,0]
[null,45,"1-3/4\"",null,0,5]
[null,22.4,"7/8\"",null,10,35]
[null,9.5,"3/8\"",null,35,65]
[null,4.75,"No. 4",null,45,75]
[null,0.42499999999999999,"No. 40",null,70,90]
[]
["Size","English","Metric","Selection"]
[152,"6\"","152 mm",{"$f":"IF(SpecYear=\"\",\"\",IF(SpecYear=\"1995\",C83,B83))","v":""}]
[76,"3\"","76 mm",""]
[63,"2-1/2\"","63 mm",""]
[50,"2\"","50 mm",""]
[45,"1-3/4\"","45 mm",""]
[37.5,"1-1/2\"","37.5 mm",""]
[31.5,"1-1/4\"","31.5 mm",""]
[25,"1\"","25 mm",""]
[22.4,"7/8\"","22.4 mm",""]
[19,"3/4\"","19 mm",""]
[16,"5/8\"","16 mm",""]
[12.5,"1/2\"","12.5 mm",""]
[11.2,"7/16\"","11.2 mm",""]
[9.5,"3/8\"","9.5 mm",""]
[8,"5/16\"","8 mm",""]
[6.3,"1/4\"","6.3 mm",""]
[4.75,"No. 4","4.75 mm",""]
[3.35,"No. 6","3.35 mm",""]
[2.36,"No. 8","2.36 mm",""]
[2,"No. 10","2 mm",""]
[1.4,"No. 14","1.4 mm",""]
[1.18,"No. 16","1.18 mm",""]
[0.85,"No. 20",".85 µm",""]
[0.6,"No. 30",".6 µm",""]
[0.42499999999999999,"No. 40",".425 µm",""]
[0.3,"No. 50",".3 µm",""]
[0.18,"No. 80",".18 µm",""]
[0.15,"No. 100",".15 µm",""]
[7.4999999999999997E-2,"No. 200",".075 µm",""]

{"sheet":"spcyr","index":4,"n_rows":7,"n_cols":6,"rows_kept":7,"cut":false,"hidden":true,"merged":[]}
["spec1993","spec1995","spec2004","spec2014","spec2024","item0423"]
["1","1","1","1","1","AS"]
["2","2","2","2","2","BS"]
[3,3,3,3,3,"CS"]
[4,4,"Shown_On_Plans","Shown_On_Plans","Shown_On_Plans","DS"]
[5,5,"5","5","5"]
["Shown_On_Plans","Shown_On_Plans"]