{"text_format":"1","workbook":"xlsx","n_sheets":5,"sheets":["Tex-110-E Part II","Analyst","Report","RX","spcyr"],"not_rendered":{"charts":2,"images":1,"macros":1,"external_links":1,"defined_names":104,"comments":1,"pivot_tables":0},"unopened":[],"bounds":{"document_bytes":16777216,"sheet_cells":100000,"rows_first":2000,"rows_last":500,"rows_between":2000,"halvings":0,"cell_chars":16384,"cell_head_chars":4096},"cells_cut":0,"cells_raw":0,"read":"whole","date_system":"1900"}

{"sheet":"Tex-110-E Part II","index":0,"n_rows":59,"n_cols":11,"rows_kept":59,"cut":false,"hidden":false,"merged":[[46,2,46,4],[48,2,48,4],[44,1,44,8],[34,5,34,6],[33,5,33,8],[32,7,32,8],[34,7,34,8],[43,1,43,8],[35,5,37,8],[36,3,36,4],[37,3,37,4],[36,1,36,2],[32,5,32,6],[35,1,35,2],[34,3,34,4],[34,1,34,2],[33,1,33,4],[35,3,35,4],[32,3,32,4],[37,1,37,2],[31,3,31,4],[23,5,23,6],[31,7,31,8],[30,7,30,8],[26,5,26,6],[27,5,27,6],[29,7,29,8],[28,5,28,6],[27,7,27,8],[23,3,23,4],[27,3,27,4],[30,5,30,6],[28,1,28,4],[24,5,24,6],[28,7,28,8],[24,3,24,4],[30,3,30,4],[22,3,22,4],[10,3,10,4],[11,3,11,4],[12,3,12,4],[14,3,14,8],[13,3,13,4],[21,3,21,4],[20,1,20,4],[20,5,20,8],[22,5,22,6],[25,3,25,4],[26,1,26,2],[26,3,26,4],[26,7,26,8],[22,1,22,2],[21,1,21,2],[24,1,24,2],[12,7,12,8],[21,7,21,8],[29,3,29,4],[23,1,23,2],[21,5,21,6],[59,1,59,3],[15,3,15,8],[16,3,16,4],[16,7,16,8],[27,1,27,2],[29,1,29,2],[55,1,55,3],[22,7,22,8],[55,6,55,8],[24,7,24,8],[31,1,31,2],[31,5,31,6],[32,1,32,2],[23,7,23,8],[53,2,53,4],[25,1,25,2],[4,1,4,8],[41,1,42,8],[51,2,51,4],[13,7,13,8],[7,7,7,8],[8,7,8,8],[7,3,7,4],[8,3,8,4],[9,3,9,4],[9,7,9,8],[10,7,10,8],[11,7,11,8],[25,7,25,8],[29,5,29,6],[25,5,25,6],[30,1,30,2]]}
["TxDOT Manuals >",null,null,"Tex-110-E"]
[null,"TEXAS DEPARTMENT OF TRANSPORTATION",null,null,null,null,null,null,null,null,44]
[null,null,null,null,null,null,null,null,null,null,4]
[null,null,null,null,null,null,null,null,null,null,"tx110p2.xlsm::45448.643032"]
[null,"Particle Size Analysis of Soil  "]
[null,"Tex-110-E, Part II"]
[null,null,null,null,null,null,null,null,{"$f":"\"File Version: \" & TEXT(MID(sn,SEARCH(\"::\",sn,1)+2,20),\"mm/dd/yy hh:mm:ss\")","v":"File Version: 06/05/24 15:25:58"}]
[null,null,"SAMPLE ID:",null,null,null,"SAMPLED DATE:"]
[null,null,"TEST NUMBER:",null,null,null,"LETTING DATE:"]
[null,null,"SAMPLE STATUS:",null,null,null,"CONTROLLING CSJ:"]
[null,null,"COUNTY:",null,null,null,"SPEC YEAR:"]
[null,null,"SAMPLED BY:",null,null,null,"SPEC ITEM:"]
[null,null,"SAMPLE LOCATION:",null,null,null,"SPECIAL PROVISION:"]
[null,null,"MATERIAL CODE:",null,null,null,"GRADE:",null,null,null," "]
[null,null,"MATERIAL NAME:"]
[null,null,"PRODUCER:"]
[null,null,"AREA ENGINEER:",null,null,null,"PROJECT MANAGER:"]
[]
[null,null,"COURSE\\LIFT:",null,"STATION:",null,null,"DIST. FROM CL:"]
[]
[null,"Sieve Analysis",null,null,null,"Hydrometer Analysis"]
[null,"Mass of Total Material (g)",null,null,null,"Starting Time"]
[null,"Individual Ret.75mm (3in)",null,null,null,"Hydrometer No"]
[null,"Individual Ret.50mm (2in)",null,null,null,"Weight Air Dry Sample(g)"]
[null,"Individual Ret.25mm (1in)",null,null,null,"Hyd. Reading at 2 Min"]
[null,"Individual Ret.No.4",null,null,null,"Hyd. Reading at 5 Min"]
[null,"Individual  Ret.No.10",null,null,null,"Hyd. Reading at 15 Min"]
[null,"Individual Ret.No.40",null,null,null,"Hyd. Reading at 30 Min"]
[null,"Hygroscopic Moisture PH",null,null,null,"Hyd. Reading at 60 Min"]
[null,"Dish No",null,null,null,"Hyd. Reading at 250 Min"]
[null,"Wet Weight (g)",null,null,null,"Hyd.Reading at 1440 Min"]
[null,"Dry Weight (g)",null,null,null,"Composite Correction"]
[null,"Tare Weight (g)",null,null,null,"Temp.Co"]
[null,"Specific Gravity Gs",null,null,null,"By Slaking and Washing (g)"]
[null,"Flask #",null,null,null,"Ret.No.200"]
[null,"Wt. of  Soil (w/ hygro)  (g)"]
[null,"Wt. of Flask + Water (g)"]
[null,"Wt. of Flask + Water + Soil (g)"]
[]
[]
[null,"Remarks:",{"$f":"NOW()","v":"2024-06-05T15:25:58.230"}]
[]
[]
[]
[]
[null,"Sample Method:","Sampled By:",null,null,"Sampled Date:"]
[null,"TX100"]
[]
[null,"TX400"]
[]
[null,"Test Method:","Tested By:",null,null,"Tested Date:"]
[null,"TX110"]
[]
[null,"TX110PII"]
[null,"Test Stamp Code:",null,null,"Omit Test:","Completed Date:","Reviewed By:"]
[]
[null,"Locked By:","TxDOT:","District:","Area:"]
[]
[null,"Authorized By:",null,null,"Authorized Date:"]

{"sheet":"Analyst","index":1,"n_rows":0,"n_cols":0,"rows_kept":0,"cut":false,"hidden":false,"merged":[]}

{"sheet":"Report","index":2,"n_rows":43,"n_cols":12,"rows_kept":43,"cut":false,"hidden":false,"merged":[]}
[null,null,null,"HYDROMETER  ANALYSIS OF SOIL BINDER                "]
[]
[null,"Sample No.",{"$f":"'Tex-110-E Part II'!D8","v":0}]
[null,"Hydrometer No.",{"$f":"'Tex-110-E Part II'!H23","v":0},"Date",{"$f":"'Tex-110-E Part II'!H8","v":"00:00:00"},null,"Starting Time",{"$f":"'Tex-110-E Part II'!H22","v":"00:00:00"}]
[null,"% Soil Binder",{"$f":"1-C6","v":{"$error":"#DIV/0!"}},"% Hgy Mc",{"$f":"('Tex-110-E Part II'!D31-'Tex-110-E Part II'!D32)/('Tex-110-E Part II'!D32-'Tex-110-E Part II'!D33)","v":{"$error":"#DIV/0!"}},null,"Weight of Air Dry Sample (g)",{"$f":"'Tex-110-E Part II'!H24","v":0},null,null,null," "]
[null,"Ret. on No.40",{"$f":"SUM('Tex-110-E Part II'!D23:D28)/'Tex-110-E Part II'!D22","v":{"$error":"#DIV/0!"}},"Sp. Gr.",{"$f":"(K7/('Tex-110-E Part II'!D37+K7-'Tex-110-E Part II'!D38))","v":{"$error":"#DIV/0!"}},null,"Corr. Weight of Sample (g)",{"$f":"(H5)/(1+E5)","v":{"$error":"#DIV/0!"}},null,null,null," "]
[null,"Composite Corr.",{"$f":"'Tex-110-E Part II'!H32","v":0},"Temp. Co",{"$f":"'Tex-110-E Part II'!H33","v":0},null,"Correction Factor, a",{"$f":"1.5555-0.2091*E6","v":{"$error":"#DIV/0!"}},null,null,{"$f":"'Tex-110-E Part II'!D36*(1-E5)","v":{"$error":"#DIV/0!"}}," "]
[]
[null,"Hydrometer","Corr. Hyd","% Soil in","Time","Eff. Depth","Constant","Grain Dia"]
[null,"Reading","Reading","Suspen.","Min."," L,cm ","K","mm",null,null,"log(dia)","% Suspen"]
[null,{"$f":"'Tex-110-E Part II'!H25","v":0},{"$f":"B11-C$7","v":0},{"$f":"C$5*C11*H$7/H$6","v":{"$error":"#DIV/0!"}},2,{"$f":"16.298-0.1639*B11","v":16.297999999999998},{"$f":"27.40753-0.15522*E7-4.00267*E6","v":{"$error":"#DIV/0!"}},{"$f":"(G11/1000)*(SQRT(F11/E11))","v":{"$error":"#DIV/0!"}},null,null,{"$f":"LOG10(H11)","v":{"$error":"#DIV/0!"}},{"$f":"D11","v":{"$error":"#DIV/0!"}}]
[null,{"$f":"'Tex-110-E Part II'!H26","v":0},{"$f":"B12-C$7","v":0},{"$f":"C$5*C12*H$7/H$6","v":{"$error":"#DIV/0!"}},5,{"$f":"16.298-0.1639*B12","v":16.297999999999998},{"$f":"G11","v":{"$error":"#DIV/0!"}},{"$f":"(G12/1000)*(SQRT(F12/E12))","v":{"$error":"#DIV/0!"}},null,null,{"$f":"LOG10(H12)","v":{"$error":"#DIV/0!"}},{"$f":"D12","v":{"$error":"#DIV/0!"}}]
[null,{"$f":"'Tex-110-E Part II'!H27","v":0},0,{"$error":"#DIV/0!"},15,16.297999999999998,{"$error":"#DIV/0!"},{"$error":"#DIV/0!"},null,null,{"$error":"#DIV/0!"},{"$error":"#DIV/0!"}]
[null,{"$f":"'Tex-110-E Part II'!H28","v":0},0,{"$error":"#DIV/0!"},30,16.297999999999998,{"$error":"#DIV/0!"},{"$error":"#DIV/0!"},null,null,{"$error":"#DIV/0!"},{"$error":"#DIV/0!"}]
[null,{"$f":"'Tex-110-E Part II'!H29","v":0},0,{"$error":"#DIV/0!"},60,16.297999999999998,{"$error":"#DIV/0!"},{"$error":"#DIV/0!"},null,null,{"$error":"#DIV/0!"},{"$error":"#DIV/0!"}]
[null,{"$f":"'Tex-110-E Part II'!H30","v":0},0,{"$f":"C$5*C16*H$7/H$6","v":{"$error":"#DIV/0!"}},250,16.297999999999998,{"$error":"#DIV/0!"},{"$error":"#DIV/0!"},null,null,{"$error":"#DIV/0!"},{"$error":"#DIV/0!"}]
[null,{"$f":"'Tex-110-E Part II'!H31","v":0},0,{"$error":"#DIV/0!"},1440,16.297999999999998,{"$error":"#DIV/0!"},{"$error":"#DIV/0!"},null,null,{"$error":"#DIV/0!"},{"$error":"#DIV/0!"}]
[null,null,null,null,null,null,null,null,null,null,-1.6989700043360187,{"$f":"TREND(L$11:L$17,K$11:K$17,K18)","v":{"$error":"#VALUE!"}}]
[null,null,null,"SIEVE  ANALYSIS OF SOIL & AGGREGATE",null,null,null,null,null,null,-2.6989700043360187,{"$f":"TREND(L$11:L$17,K$11:K$17,K19)","v":{"$error":"#VALUE!"}}]
[null,null,null,null,null,null,null,null,null,null,-3,{"$f":"TREND(L$11:L$17,K$11:K$17,K20)","v":{"$error":"#VALUE!"}}]
[null,"Sample No.",{"$f":"SampleId","v":0},null,null,"Total Sample Weight (g) =",{"$f":"'Tex-110-E Part II'!D22","v":0}]
[]
[null," "," ","Sieve No. or","Wt of Mtl","% of Material","% of Material"]
[null," "," ","Grain Dia.","Grams","Retained","Passing",null,null,null,"Dia 'Size","% passing"]
[null,"By Sieve Analysis",null,"Ret.75mm",{"$f":"'Tex-110-E Part II'!D23","v":0},{"$f":"E25/G$21","v":{"$error":"#DIV/0!"}},{"$f":"1-F25","v":{"$error":"#DIV/0!"}},null,null,null,75,{"$f":"G25","v":{"$error":"#DIV/0!"}}]
[null,null,null,"Ret.50mm",{"$f":"'Tex-110-E Part II'!D24","v":0},{"$f":"F25+E26/G$21","v":{"$error":"#DIV/0!"}},{"$error":"#DIV/0!"},null,null,null,50,{"$error":"#DIV/0!"}]
[null,null," ","Ret.25mm",{"$f":"'Tex-110-E Part II'!D25","v":0},{"$f":"F26+E27/G$21","v":{"$error":"#DIV/0!"}},{"$error":"#DIV/0!"},null,null,null,25,{"$error":"#DIV/0!"}]
[null,null," ","Ret.No.4",{"$f":"'Tex-110-E Part II'!D26","v":0},{"$f":"F27+E28/G$21","v":{"$error":"#DIV/0!"}},{"$error":"#DIV/0!"},null,null,null,4.75,{"$error":"#DIV/0!"}]
[null,null," ","Ret.No.10",{"$f":"'Tex-110-E Part II'!D27","v":0},{"$f":"F28+E29/G$21","v":{"$error":"#DIV/0!"}},{"$error":"#DIV/0!"},null,null,null,2,{"$error":"#DIV/0!"}]
[null,null," ","Ret.No.40",{"$f":"'Tex-110-E Part II'!D28","v":0},{"$f":"F29+E30/G$21","v":{"$error":"#DIV/0!"}},{"$error":"#DIV/0!"},null,null,null,0.42499999999999999,{"$error":"#DIV/0!"}]
[null,"By Slaking & Washing",null,"Ret.No.200",{"$f":"'Tex-110-E Part II'!H35","v":0},{"$f":"C5*E31/H6+F30","v":{"$error":"#DIV/0!"}},{"$error":"#DIV/0!"},null,null,null,7.4999999999999997E-2,{"$error":"#DIV/0!"}]
[null,"By Hydrometer Analysis",null,"0.02 mm",null,{"$f":"1-G32","v":{"$error":"#VALUE!"}},{"$f":"L18","v":{"$error":"#VALUE!"}},null,null,null,0.02,{"$error":"#VALUE!"}]
[null,null,null,"0.002 mm",null,{"$f":"1-G33","v":{"$error":"#VALUE!"}},{"$f":"L19","v":{"$error":"#VALUE!"}},null,null,null,2E-3,{"$error":"#VALUE!"}]
[null,null,null,"0.001 mm",null,{"$f":"1-G34","v":{"$error":"#VALUE!"}},{"$f":"L20","v":{"$error":"#VALUE!"}},null,null,null,1E-3,{"$error":"#VALUE!"}]
[]
[null,"Summary"]
[null,"a) Particles larger than 2 mm =",null,null,{"$f":"F29","v":{"$error":"#DIV/0!"}}]
[null,"b) Coarse sand, 2.0 to 0.42 mm=",null,null,{"$f":"G29-G30","v":{"$error":"#DIV/0!"}}]
[null,"c) Fine sand, 0.42 to 0.074 mm =",null,null,{"$f":"G30-G31","v":{"$error":"#DIV/0!"}}]
[null,"d) Silt, 0.074 to 0.002 mm =",null,null,{"$f":"G31-G33","v":{"$error":"#DIV/0!"}}]
[null,"e) Clay, smaller than 0.002 mm =",null,null,{"$f":"G33-G34","v":{"$error":"#VALUE!"}}]
[null,"f) Colloids, smaller than 0.001 mm =",null,null,{"$f":"G34","v":{"$error":"#VALUE!"}}]
[null,null,null," "]

{"sheet":"RX","index":3,"n_rows":40,"n_cols":9,"rows_kept":40,"cut":false,"hidden":true,"merged":[]}
[{"$f":"+COUNTA(A3:A1048576)","v":38}]
["Fld_nbr","Value","Desc_1","Desc_2","Desc_3","Desc_4","Desc_5","Desc_6","Desc_7"]
[1,{"$f":"IF('Tex-110-E Part II'!$B$42=\"\",\"\",'Tex-110-E Part II'!$B$42)","v":""},{"$f":"'Tex-110-E Part II'!$B$41","v":"Remarks:"}]
[2,{"$f":"IF('Tex-110-E Part II'!$D$19=\"\",\"\",'Tex-110-E Part II'!$D$19)","v":""},{"$f":"IF('Tex-110-E Part II'!$C$19=\"\",\"\",'Tex-110-E Part II'!$C$19)","v":"COURSE\\LIFT:"}]
[3,{"$f":"IF('Tex-110-E Part II'!$C$52=\"\",\"\",'Tex-110-E Part II'!$C$52)","v":""},"Tested By ",{"$f":"IF('Tex-110-E Part II'!$B$52=\"\",\"\",'Tex-110-E Part II'!$B$52)","v":"TX110"}]
[4,{"$f":"IF('Tex-110-E Part II'!$F$52=\"\",\"\",'Tex-110-E Part II'!$F$52)","v":""},"Tested Date ",{"$f":"IF('Tex-110-E Part II'!$B$52=\"\",\"\",'Tex-110-E Part II'!$B$52)","v":"TX110"}]
[5,{"$f":"IF('Tex-110-E Part II'!$D$22=\"\",\"\",'Tex-110-E Part II'!$D$22)","v":""},{"$f":"IF('Tex-110-E Part II'!$B$6=\"\",\"\",'Tex-110-E Part II'!$B$6)","v":"Tex-110-E, Part II"},{"$f":"IF('Tex-110-E Part II'!$B$21=\"\",\"\",'Tex-110-E Part II'!$B$21)","v":"Sieve Analysis"},{"$f":"IF('Tex-110-E Part II'!$B$22=\"\",\"\",'Tex-110-E Part II'!$B$22)","v":"Mass of Total Material (g)"}]
[6,{"$f":"IF('Tex-110-E Part II'!$D$23=\"\",\"\",'Tex-110-E Part II'!$D$23)","v":""},{"$f":"IF('Tex-110-E Part II'!$B$6=\"\",\"\",'Tex-110-E Part II'!$B$6)","v":"Tex-110-E, Part II"},{"$f":"IF('Tex-110-E Part II'!$B$21=\"\",\"\",'Tex-110-E Part II'!$B$21)","v":"Sieve Analysis"},{"$f":"IF('Tex-110-E Part II'!$B$23=\"\",\"\",'Tex-110-E Part II'!$B$23)","v":"Individual Ret.75mm (3in)"}]
[7,{"$f":"IF('Tex-110-E Part II'!$D$24=\"\",\"\",'Tex-110-E Part II'!$D$24)","v":""},{"$f":"IF('Tex-110-E Part II'!$B$6=\"\",\"\",'Tex-110-E Part II'!$B$6)","v":"Tex-110-E, Part II"},{"$f":"IF('Tex-110-E Part II'!$B$21=\"\",\"\",'Tex-110-E Part II'!$B$21)","v":"Sieve Analysis"},{"$f":"IF('Tex-110-E Part II'!$B$24=\"\",\"\",'Tex-110-E Part II'!$B$24)","v":"Individual Ret.50mm (2in)"}]
[8,{"$f":"IF('Tex-110-E Part II'!$D$25=\"\",\"\",'Tex-110-E Part II'!$D$25)","v":""},{"$f":"IF('Tex-110-E Part II'!$B$6=\"\",\"\",'Tex-110-E Part II'!$B$6)","v":"Tex-110-E, Part II"},{"$f":"IF('Tex-110-E Part II'!$B$21=\"\",\"\",'Tex-110-E Part II'!$B$21)","v":"Sieve Analysis"},{"$f":"IF('Tex-110-E Part II'!$B$25=\"\",\"\",'Tex-110-E Part II'!$B$25)","v":"Individual Ret.25mm (1in)"}]
[9,{"$f":"IF('Tex-110-E Part II'!$D$26=\"\",\"\",'Tex-110-E Part II'!$D$26)","v":""},{"$f":"IF('Tex-110-E Part II'!$B$6=\"\",\"\",'Tex-110-E Part II'!$B$6)","v":"Tex-110-E, Part II"},{"$f":"IF('Tex-110-E Part II'!$B$21=\"\",\"\",'Tex-110-E Part II'!$B$21)","v":"Sieve Analysis"},{"$f":"IF('Tex-110-E Part II'!$B$26=\"\",\"\",'Tex-110-E Part II'!$B$26)","v":"Individual Ret.No.4"}]
[10,{"$f":"IF('Tex-110-E Part II'!$D$27=\"\",\"\",'Tex-110-E Part II'!$D$27)","v":""},{"$f":"IF('Tex-110-E Part II'!$B$6=\"\",\"\",'Tex-110-E Part II'!$B$6)","v":"Tex-110-E, Part II"},{"$f":"IF('Tex-110-E Part II'!$B$21=\"\",\"\",'Tex-110-E Part II'!$B$21)","v":"Sieve Analysis"},{"$f":"IF('Tex-110-E Part II'!$B$27=\"\",\"\",'Tex-110-E Part II'!$B$27)","v":"Individual  Ret.No.10"}]
[11,{"$f":"IF('Tex-110-E Part II'!$D$28=\"\",\"\",'Tex-110-E Part II'!$D$28)","v":""},{"$f":"IF('Tex-110-E Part II'!$B$6=\"\",\"\",'Tex-110-E Part II'!$B$6)","v":"Tex-110-E, Part II"},{"$f":"IF('Tex-110-E Part II'!$B$21=\"\",\"\",'Tex-110-E Part II'!$B$21)","v":"Sieve Analysis"},{"$f":"IF('Tex-110-E Part II'!$B$28=\"\",\"\",'Tex-110-E Part II'!$B$28)","v":"Individual Ret.No.40"}]
[12,{"$f":"IF('Tex-110-E Part II'!$D$30=\"\",\"\",'Tex-110-E Part II'!$D$30)","v":""},{"$f":"IF('Tex-110-E Part II'!$B$6=\"\",\"\",'Tex-110-E Part II'!$B$6)","v":"Tex-110-E, Part II"},{"$f":"IF('Tex-110-E Part II'!$B$29=\"\",\"\",'Tex-110-E Part II'!$B$29)","v":"Hygroscopic Moisture PH"},{"$f":"IF('Tex-110-E Part II'!$B$30=\"\",\"\",'Tex-110-E Part II'!$B$30)","v":"Dish No"}]
[13,{"$f":"IF('Tex-110-E Part II'!$D$31=\"\",\"\",'Tex-110-E Part II'!$D$31)","v":""},{"$f":"IF('Tex-110-E Part II'!$B$6=\"\",\"\",'Tex-110-E Part II'!$B$6)","v":"Tex-110-E, Part II"},{"$f":"IF('Tex-110-E Part II'!$B$29=\"\",\"\",'Tex-110-E Part II'!$B$29)","v":"Hygroscopic Moisture PH"},{"$f":"IF('Tex-110-E Part II'!$B$31=\"\",\"\",'Tex-110-E Part II'!$B$31)","v":"Wet Weight (g)"}]
[14,{"$f":"IF('Tex-110-E Part II'!$D$32=\"\",\"\",'Tex-110-E Part II'!$D$32)","v":""},{"$f":"IF('Tex-110-E Part II'!$B$6=\"\",\"\",'Tex-110-E Part II'!$B$6)","v":"Tex-110-E, Part II"},{"$f":"IF('Tex-110-E Part II'!$B$29=\"\",\"\",'Tex-110-E Part II'!$B$29)","v":"Hygroscopic Moisture PH"},{"$f":"IF('Tex-110-E Part II'!$B$32=\"\",\"\",'Tex-110-E Part II'!$B$32)","v":"Dry Weight (g)"}]
[15,{"$f":"IF('Tex-110-E Part II'!$D$33=\"\",\"\",'Tex-110-E Part II'!$D$33)","v":""},{"$f":"IF('Tex-110-E Part II'!$B$6=\"\",\"\",'Tex-110-E Part II'!$B$6)","v":"Tex-110-E, Part II"},{"$f":"IF('Tex-110-E Part II'!$B$29=\"\",\"\",'Tex-110-E Part II'!$B$29)","v":"Hygroscopic Moisture PH"},{"$f":"IF('Tex-110-E Part II'!$B$33=\"\",\"\",'Tex-110-E Part II'!$B$33)","v":"Tare Weight (g)"}]
[16,{"$f":"IF('Tex-110-E Part II'!$D$35=\"\",\"\",'Tex-110-E Part II'!$D$35)","v":""},{"$f":"IF('Tex-110-E Part II'!$B$6=\"\",\"\",'Tex-110-E Part II'!$B$6)","v":"Tex-110-E, Part II"},{"$f":"IF('Tex-110-E Part II'!$B$34=\"\",\"\",'Tex-110-E Part II'!$B$34)","v":"Specific Gravity Gs"},{"$f":"IF('Tex-110-E Part II'!$B$35=\"\",\"\",'Tex-110-E Part II'!$B$35)","v":"Flask #"}]
[17,{"$f":"IF('Tex-110-E Part II'!$D$36=\"\",\"\",'Tex-110-E Part II'!$D$36)","v":""},{"$f":"IF('Tex-110-E Part II'!$B$6=\"\",\"\",'Tex-110-E Part II'!$B$6)","v":"Tex-110-E, Part II"},{"$f":"IF('Tex-110-E Part II'!$B$34=\"\",\"\",'Tex-110-E Part II'!$B$34)","v":"Specific Gravity Gs"},{"$f":"IF('Tex-110-E Part II'!$B$36=\"\",\"\",'Tex-110-E Part II'!$B$36)","v":"Wt. of  Soil (w/ hygro)  (g)"}]
[18,{"$f":"IF('Tex-110-E Part II'!$D$37=\"\",\"\",'Tex-110-E Part II'!$D$37)","v":""},{"$f":"IF('Tex-110-E Part II'!$B$6=\"\",\"\",'Tex-110-E Part II'!$B$6)","v":"Tex-110-E, Part II"},{"$f":"IF('Tex-110-E Part II'!$B$34=\"\",\"\",'Tex-110-E Part II'!$B$34)","v":"Specific Gravity Gs"},{"$f":"IF('Tex-110-E Part II'!$B$37=\"\",\"\",'Tex-110-E Part II'!$B$37)","v":"Wt. of Flask + Water (g)"}]
[19,{"$f":"IF('Tex-110-E Part II'!$D$38=\"\",\"\",'Tex-110-E Part II'!$D$38)","v":""},{"$f":"IF('Tex-110-E Part II'!$B$6=\"\",\"\",'Tex-110-E Part II'!$B$6)","v":"Tex-110-E, Part II"},{"$f":"IF('Tex-110-E Part II'!$B$34=\"\",\"\",'Tex-110-E Part II'!$B$34)","v":"Specific Gravity Gs"},{"$f":"IF('Tex-110-E Part II'!$B$38=\"\",\"\",'Tex-110-E Part II'!$B$38)","v":"Wt. of Flask + Water + Soil (g)"}]
[20,{"$f":"IF('Tex-110-E Part II'!$H$22=\"\",\"\",'Tex-110-E Part II'!$H$22)","v":""},{"$f":"IF('Tex-110-E Part II'!$B$6=\"\",\"\",'Tex-110-E Part II'!$B$6)","v":"Tex-110-E, Part II"},{"$f":"IF('Tex-110-E Part II'!$F$21=\"\",\"\",'Tex-110-E Part II'!$F$21)","v":"Hydrometer Analysis"},{"$f":"IF('Tex-110-E Part II'!$F$22=\"\",\"\",'Tex-110-E Part II'!$F$22)","v":"Starting Time"}]
[21,{"$f":"IF('Tex-110-E Part II'!$H$23=\"\",\"\",'Tex-110-E Part II'!$H$23)","v":""},{"$f":"IF('Tex-110-E Part II'!$B$6=\"\",\"\",'Tex-110-E Part II'!$B$6)","v":"Tex-110-E, Part II"},{"$f":"IF('Tex-110-E Part II'!$F$21=\"\",\"\",'Tex-110-E Part II'!$F$21)","v":"Hydrometer Analysis"},{"$f":"IF('Tex-110-E Part II'!$F$23=\"\",\"\",'Tex-110-E Part II'!$F$23)","v":"Hydrometer No"}]
[22,{"$f":"IF('Tex-110-E Part II'!$H$24=\"\",\"\",'Tex-110-E Part II'!$H$24)","v":""},{"$f":"IF('Tex-110-E Part II'!$B$6=\"\",\"\",'Tex-110-E Part II'!$B$6)","v":"Tex-110-E, Part II"},{"$f":"IF('Tex-110-E Part II'!$F$21=\"\",\"\",'Tex-110-E Part II'!$F$21)","v":"Hydrometer Analysis"},{"$f":"IF('Tex-110-E Part II'!$F$24=\"\",\"\",'Tex-110-E Part II'!$F$24)","v":"Weight Air Dry Sample(g)"}]
[23,{"$f":"IF('Tex-110-E Part II'!$H$25=\"\",\"\",'Tex-110-E Part II'!$H$25)","v":""},{"$f":"IF('Tex-110-E Part II'!$B$6=\"\",\"\",'Tex-110-E Part II'!$B$6)","v":"Tex-110-E, Part II"},{"$f":"IF('Tex-110-E Part II'!$F$21=\"\",\"\",'Tex-110-E Part II'!$F$21)","v":"Hydrometer Analysis"},{"$f":"IF('Tex-110-E Part II'!$F$25=\"\",\"\",'Tex-110-E Part II'!$F$25)","v":"Hyd. Reading at 2 Min"}]
[24,{"$f":"IF('Tex-110-E Part II'!$H$26=\"\",\"\",'Tex-110-E Part II'!$H$26)","v":""},{"$f":"IF('Tex-110-E Part II'!$B$6=\"\",\"\",'Tex-110-E Part II'!$B$6)","v":"Tex-110-E, Part II"},{"$f":"IF('Tex-110-E Part II'!$F$21=\"\",\"\",'Tex-110-E Part II'!$F$21)","v":"Hydrometer Analysis"},{"$f":"IF('Tex-110-E Part II'!$F$26=\"\",\"\",'Tex-110-E Part II'!$F$26)","v":"Hyd. Reading at 5 Min"}]
[25,{"$f":"IF('Tex-110-E Part II'!$H$27=\"\",\"\",'Tex-110-E Part II'!$H$27)","v":""},{"$f":"IF('Tex-110-E Part II'!$B$6=\"\",\"\",'Tex-110-E Part II'!$B$6)","v":"Tex-110-E, Part II"},{"$f":"IF('Tex-110-E Part II'!$F$21=\"\",\"\",'Tex-110-E Part II'!$F$21)","v":"Hydrometer Analysis"},{"$f":"IF('Tex-110-E Part II'!$F$27=\"\",\"\",'Tex-110-E Part II'!$F$27)","v":"Hyd. Reading at 15 Min"}]
[26,{"$f":"IF('Tex-110-E Part II'!$H$28=\"\",\"\",'Tex-110-E Part II'!$H$28)","v":""},{"$f":"IF('Tex-110-E Part II'!$B$6=\"\",\"\",'Tex-110-E Part II'!$B$6)","v":"Tex-110-E, Part II"},{"$f":"IF('Tex-110-E Part II'!$F$21=\"\",\"\",'Tex-110-E Part II'!$F$21)","v":"Hydrometer Analysis"},{"$f":"IF('Tex-110-E Part II'!$F$28=\"\",\"\",'Tex-110-E Part II'!$F$28)","v":"Hyd. Reading at 30 Min"}]
[27,{"$f":"IF('Tex-110-E Part II'!$H$29=\"\",\"\",'Tex-110-E Part II'!$H$29)","v":""},{"$f":"IF('Tex-110-E Part II'!$B$6=\"\",\"\",'Tex-110-E Part II'!$B$6)","v":"Tex-110-E, Part II"},{"$f":"IF('Tex-110-E Part II'!$F$21=\"\",\"\",'Tex-110-E Part II'!$F$21)","v":"Hydrometer Analysis"},{"$f":"IF('Tex-110-E Part II'!$F$29=\"\",\"\",'Tex-110-E Part II'!$F$29)","v":"Hyd. Reading at 60 Min"}]
[28,{"$f":"IF('Tex-110-E Part II'!$H$30=\"\",\"\",'Tex-110-E Part II'!$H$30)","v":""},{"$f":"IF('Tex-110-E Part II'!$B$6=\"\",\"\",'Tex-110-E Part II'!$B$6)","v":"Tex-110-E, Part II"},{"$f":"IF('Tex-110-E Part II'!$F$21=\"\",\"\",'Tex-110-E Part II'!$F$21)","v":"Hydrometer Analysis"},{"$f":"IF('Tex-110-E Part II'!$F$30=\"\",\"\",'Tex-110-E Part II'!$F$30)","v":"Hyd. Reading at 250 Min"}]
[29,{"$f":"IF('Tex-110-E Part II'!$H$31=\"\",\"\",'Tex-110-E Part II'!$H$31)","v":""},{"$f":"IF('Tex-110-E Part II'!$B$6=\"\",\"\",'Tex-110-E Part II'!$B$6)","v":"Tex-110-E, Part II"},{"$f":"IF('Tex-110-E Part II'!$F$21=\"\",\"\",'Tex-110-E Part II'!$F$21)","v":"Hydrometer Analysis"},{"$f":"IF('Tex-110-E Part II'!$F$31=\"\",\"\",'Tex-110-E Part II'!$F$31)","v":"Hyd.Reading at 1440 Min"}]
[30,{"$f":"IF('Tex-110-E Part II'!$H$32=\"\",\"\",'Tex-110-E Part II'!$H$32)","v":""},{"$f":"IF('Tex-110-E Part II'!$B$6=\"\",\"\",'Tex-110-E Part II'!$B$6)","v":"Tex-110-E, Part II"},{"$f":"IF('Tex-110-E Part II'!$F$21=\"\",\"\",'Tex-110-E Part II'!$F$21)","v":"Hydrometer Analysis"},{"$f":"IF('Tex-110-E Part II'!$F$32=\"\",\"\",'Tex-110-E Part II'!$F$32)","v":"Composite Correction"}]
[31,{"$f":"IF('Tex-110-E Part II'!$H$33=\"\",\"\",'Tex-110-E Part II'!$H$33)","v":""},{"$f":"IF('Tex-110-E Part II'!$B$6=\"\",\"\",'Tex-110-E Part II'!$B$6)","v":"Tex-110-E, Part II"},{"$f":"IF('Tex-110-E Part II'!$F$21=\"\",\"\",'Tex-110-E Part II'!$F$21)","v":"Hydrometer Analysis"},{"$f":"IF('Tex-110-E Part II'!$F$33=\"\",\"\",'Tex-110-E Part II'!$F$33)","v":"Temp.Co"}]
[32,{"$f":"IF('Tex-110-E Part II'!$H$35=\"\",\"\",'Tex-110-E Part II'!$H$35)","v":""},{"$f":"IF('Tex-110-E Part II'!$B$6=\"\",\"\",'Tex-110-E Part II'!$B$6)","v":"Tex-110-E, Part II"},{"$f":"IF('Tex-110-E Part II'!$F$34=\"\",\"\",'Tex-110-E Part II'!$F$34)","v":"By Slaking and Washing (g)"},{"$f":"IF('Tex-110-E Part II'!$F$35=\"\",\"\",'Tex-110-E Part II'!$F$35)","v":"Ret.No.200"}]
[33,{"$f":"IF('Tex-110-E Part II'!$C$54=\"\",\"\",'Tex-110-E Part II'!$C$54)","v":""},"Tested By ",{"$f":"IF('Tex-110-E Part II'!$B$54=\"\",\"\",'Tex-110-E Part II'!$B$54)","v":"TX110PII"}]
[34,{"$f":"IF('Tex-110-E Part II'!$F$54=\"\",\"\",'Tex-110-E Part II'!$F$54)","v":""},"Tested Date ",{"$f":"IF('Tex-110-E Part II'!$B$54=\"\",\"\",'Tex-110-E Part II'!$B$54)","v":"TX110PII"}]
[35,{"$f":"IF('Tex-110-E Part II'!$C$47=\"\",\"\",'Tex-110-E Part II'!$C$47)","v":""},"Sampled By ",{"$f":"IF('Tex-110-E Part II'!$B$47=\"\",\"\",'Tex-110-E Part II'!$B$47)","v":"TX100"}]
[36,{"$f":"IF('Tex-110-E Part II'!$F$47=\"\",\"\",'Tex-110-E Part II'!$F$47)","v":""},"Sampled Date ",{"$f":"IF('Tex-110-E Part II'!$B$47=\"\",\"\",'Tex-110-E Part II'!$B$47)","v":"TX100"}]
[37,{"$f":"IF('Tex-110-E Part II'!$C$49=\"\",\"\",'Tex-110-E Part II'!$C$49)","v":""},"Sampled By ",{"$f":"IF('Tex-110-E Part II'!$B$49=\"\",\"\",'Tex-110-E Part II'!$B$49)","v":"TX400"}]
[38,{"$f":"IF('Tex-110-E Part II'!$F$49=\"\",\"\",'Tex-110-E Part II'!$F$49)","v":""},"Sampled Date ",{"$f":"IF('Tex-110-E Part II'!$B$49=\"\",\"\",'Tex-110-E Part II'!$B$49)","v":"TX400"}]

{"sheet":"spcyr","index":4,"n_rows":7,"n_cols":3,"rows_kept":7,"cut":false,"hidden":true,"merged":[]}
["spec1993","spec1995","spec2004"]
["1","1","1"]
["2","2","2"]
[3,3,3]
[4,4,"Shown_On_Plans"]
[5,5]
["Shown_On_Plans","Shown_On_Plans"]