{"text_format":"1","workbook":"xlsx","n_sheets":6,"sheets":["Tex-113,4-E","Reference","UCS","SCA-Data","SCA","RX"],"not_rendered":{"charts":9,"images":1,"macros":1,"external_links":1,"defined_names":427,"comments":1,"pivot_tables":0},"unopened":[{"sheet":"UCS","index":2,"reason":"not_a_worksheet"},{"sheet":"SCA","index":4,"reason":"not_a_worksheet"}],"bounds":{"document_bytes":16777216,"sheet_cells":100000,"rows_first":2000,"rows_last":500,"rows_between":2000,"halvings":0,"cell_chars":16384,"cell_head_chars":4096},"cells_cut":0,"cells_raw":0,"read":"whole","date_system":"1900"}

{"sheet":"Tex-113,4-E","index":0,"n_rows":108,"n_cols":16,"rows_kept":108,"cut":false,"hidden":false,"merged":[[93,2,93,4],[94,2,94,4],[91,1,91,11],[92,1,92,11],[85,1,85,3],[79,1,79,3],[80,1,80,3],[16,9,16,11],[80,6,80,7],[79,6,79,7],[42,10,42,11],[42,8,42,9],[46,8,46,9],[45,8,45,9],[46,10,46,11],[38,8,38,9],[38,10,38,11],[40,8,40,9],[40,10,40,11],[39,10,39,11],[39,8,39,9],[44,8,44,9],[49,8,49,9],[37,8,37,9],[80,10,80,11],[79,10,79,11],[44,10,44,11],[47,10,47,11],[80,4,80,5],[79,4,79,5],[51,4,51,5],[50,4,50,5],[49,4,49,5],[47,4,47,5],[49,10,49,11],[47,8,47,9],[48,8,48,9],[48,4,48,5],[50,10,50,11],[51,10,51,11],[51,8,51,9],[51,6,51,7],[50,6,50,7],[49,6,49,7],[48,10,48,11],[65,10,66,11],[38,6,38,7],[43,4,43,5],[38,4,38,5],[40,4,40,5],[39,4,39,5],[46,4,46,5],[80,8,80,9],[79,8,79,9],[43,8,43,9],[44,6,44,7],[44,4,44,5],[40,6,40,7],[41,4,41,5],[41,6,41,7],[39,6,39,7],[48,6,48,7],[50,8,50,9],[47,6,47,7],[43,6,43,7],[42,6,42,7],[65,8,66,9],[36,6,36,7],[35,6,35,7],[36,4,36,5],[35,4,35,5],[36,10,36,11],[33,6,33,7],[33,8,33,9],[33,10,33,11],[35,10,35,11],[36,8,36,9],[35,8,35,9],[14,3,14,11],[13,3,13,5],[21,1,21,3],[22,1,22,3],[12,9,12,11],[23,1,23,3],[7,3,7,5],[8,3,8,5],[9,3,9,5],[10,3,10,5],[10,9,10,11],[9,9,9,11],[8,9,8,11],[7,9,7,11],[11,3,11,5],[18,3,18,4],[27,4,27,5],[65,6,66,7],[37,4,37,5],[45,1,45,3],[11,9,11,11],[21,4,21,5],[22,4,22,5],[15,3,15,11],[18,10,18,11],[18,6,18,7],[13,9,13,11],[16,3,16,5],[16,6,16,8],[30,4,30,5],[30,10,30,11],[30,8,30,9],[30,6,30,7],[24,4,24,5],[25,4,25,5],[37,6,37,7],[29,10,29,11],[29,8,29,9],[29,6,29,7],[37,10,37,11],[29,4,29,5],[23,4,23,5],[99,2,99,4],[103,6,103,9],[107,1,107,3],[101,2,101,4],[103,1,103,3],[32,10,32,11],[32,8,32,9],[32,6,32,7],[32,4,32,5],[33,4,33,5],[98,2,98,4],[63,1,63,3],[62,1,62,3],[61,1,61,3],[90,1,90,11],[70,1,70,3],[74,1,74,3],[82,1,82,3],[83,1,83,3],[65,1,66,3],[56,1,56,3],[84,1,84,3],[68,1,68,3],[45,10,45,11],[0,0,0,1],[48,1,48,3],[49,1,49,3],[50,1,50,3],[51,1,51,3],[30,1,30,3],[47,1,47,3],[35,1,35,3],[29,1,29,3],[44,1,44,3],[24,1,24,3],[27,1,27,3],[33,1,33,3],[38,1,38,3],[42,1,42,3],[43,1,43,3],[36,1,37,3],[25,1,25,3],[32,1,32,3],[39,1,39,3],[46,1,46,3],[12,3,12,5],[96,2,96,4],[67,1,67,3],[69,1,69,3],[71,1,71,3],[73,1,73,3],[88,1,89,11],[41,10,41,11],[65,4,66,5],[75,1,75,3],[76,1,76,3],[77,1,77,3],[40,1,41,3],[41,8,41,9],[54,1,54,3],[55,1,55,3],[42,4,42,5],[59,1,59,3],[60,1,60,3],[53,1,53,3],[57,1,57,3],[45,4,45,5],[46,6,46,7],[45,6,45,7],[43,10,43,11]]}
["TxDOT Manuals >",null,null,"Tex-113-E","Tex-114-E"]
[null,"TEXAS DEPARTMENT OF TRANSPORTATION",null,null,null,null,null,null,null,null,null,null,null,null,null,259]
[null,null,null,null,null,null,null,null,null,null,null,null,null,null,null,4]
[null,null,null,null,null,null,null,null,null,null,null,null,null,null,null,"tx113,4.xlsm::45448.658032"]
[null,"Moisture-Density Relations of Base Material & Sand or Subgrade & Embankment Soils",null,null,null,null,null,null,null,null,null,null,null,null,null,45]
[null,"Tex-113-E or Tex-114-E"]
[null,null,null,null,null,null,null,null,null,null,null,{"$f":"\"File Version: \" & TEXT(MID(P4,SEARCH(\"::\",P4,1)+2,20),\"mm/dd/yy hh:mm:ss\")","v":"File Version: 06/05/24 15:47:34"}]
[null,null,"SAMPLE ID:",null,null,null,null,null,"SAMPLED DATE:"]
[null,null,"TEST NUMBER:",null,null,null,null,null,"LETTING DATE:"]
[null,null,"SAMPLE STATUS:",null,null,null,null,null,"CONTROLLING CSJ:"]
[null,null,"COUNTY:",null,null,null,null,null,"SPEC YEAR:"]
[null,null,"SAMPLED BY:",null,null,null,null,null,"SPEC ITEM:"]
[null,null,"SAMPLE LOCATION:",null,null,null,null,null,"SPECIAL PROVISION:"]
[null,null,"MATERIAL CODE:",null,null,null,null,null,"GRADE:"]
[null,null,"MATERIAL NAME:"]
[null,null,"PRODUCER:",""]
[null,null,"AREA ENGINEER:",null,null,null,"PROJECT MANAGER:"]
[]
[null,null,"COURSE\\LIFT:",null,null,"STATION:",null,null,null,"DIST. FROM CL:"]
[null,"Moisture-Density Work Sheet"]
[]
[null,"Oven Dry Weight, (g):"]
[null,"Weight of Pycnometer & Water, (g):"]
[null,"Weight of Aggr., Pycn.& Water, (g):"]
[null,"Specific Gravity (Apparent)(Override):"]
[null,"Specific Gravity (Apparent)(Calc):",null,null,{"$f":"IF(Field126=\"\",IF(ISERROR(E22/(E22+E23-E24)),2.65,E22/(E22+E23-E24)),Field126)","v":2.65}]
[]
[null,"Hygroscopic Moisture, (%):"]
[]
[null,"Sample Number :",null,null,1,null,2,null,3,null,4]
{"$rows_left_out":79}
{"sheet":"Reference","index":1,"n_rows":196,"n_cols":28,"rows_kept":196,"cut":false,"hidden":true,"merged":[[24,1,24,2],[8,1,8,2],[1,16,1,24],[4,16,4,24],[11,16,11,24],[1,1,1,13],[18,10,18,13],[3,23,3,24],[3,10,3,13],[3,1,3,2],[14,1,14,2],[12,1,12,2],[3,17,3,18],[14,4,14,5],[20,16,21,16],[12,10,12,13],[24,4,24,5],[3,7,3,8],[3,4,3,5],[24,7,24,8],[27,16,27,20],[3,19,3,20],[18,16,18,21],[3,21,3,22],[22,16,23,16],[24,16,25,16],[28,16,28,17],[33,16,33,17],[32,16,32,17],[31,16,31,17],[37,23,37,24],[29,16,30,16],[57,16,57,17],[38,26,38,27],[35,16,35,27],[48,23,48,24],[52,16,52,17],[55,16,55,17],[45,16,45,17],[42,16,43,16],[37,20,37,21]]}
[]
[null,"M-D Graph Reference Data and Calculations",null,null,null,null,null,null,null,null,null,null,null,null,null,null,"SCA Reference Data"]
[]
[null,"Test Results",null,null,"M-D Curve Graph Limits",null,null,"M-D Graph Limit boundaries",null,null,"Best-Fit Line Coefficient Reference Data",null,null,null,null,null,null,"Specimen 1",null,"Specimen 2",null,"Specimen 3",null,"Specimen 4"]
[null,"Max Dry Density",{"$f":"C12*C6^2+C11*C6+C10","v":{"$error":"#DIV/0!"}},null,"Min Moisture",{"$f":"MIN('Tex-113,4-E'!$E$50:$L$50)","v":0},null,"X","Y",null,"N","Y","X","X^2",null,null,"SCA Energy Data"]
[null,"Opt Moist Content",{"$f":"-C11/(2*C12)","v":{"$error":"#DIV/0!"}},null,"Max Moisture",{"$f":"MAX('Tex-113,4-E'!$E$50:$L$50)","v":0},null,{"$f":"F10","v":0},{"$f":"F13","v":0},null,1,{"$f":"N('Tex-113,4-E'!E51)","v":0},{"$f":"N('Tex-113,4-E'!E50)","v":0},{"$f":"M6^2","v":0},null,null,"Lift","Total Energy ","Avg Energy/Blow","Total Energy ","Avg Energy/Blow","Total Energy ","Avg Energy/Blow","Total Energy ","Avg Energy/Blow"]
[null,"R^2",{"$f":"ROUND(RSQ(B17:B20,C17:C20),4)","v":{"$error":"#DIV/0!"}},null,"Min Density",{"$f":"MIN('Tex-113,4-E'!E51:L51)","v":0},null,{"$f":"F10","v":0},{"$f":"F12","v":2},null,2,{"$f":"N('Tex-113,4-E'!G51)","v":0},{"$f":"N('Tex-113,4-E'!G50)","v":0},{"$f":"M7^2","v":0},null,null,1,{"$f":"TRANSPOSE('SCA-Data'!D18:G18)","v":0},{"$f":"TRANSPOSE('SCA-Data'!D19:G19)","v":0},{"$f":"TRANSPOSE('SCA-Data'!K18:N18)","v":0},{"$f":"TRANSPOSE('SCA-Data'!K19:N19)","v":0},{"$f":"TRANSPOSE('SCA-Data'!R18:U18)","v":0},{"$f":"TRANSPOSE('SCA-Data'!R19:U19)","v":0},{"$f":"TRANSPOSE('SCA-Data'!Y18:AB18)","v":0},{"$f":"TRANSPOSE('SCA-Data'!Y19:AB19)","v":0}]
[null,null,null,null,"Max Density",{"$f":"MAX('Tex-113,4-E'!E51:L51)","v":0},null,{"$f":"F10","v":0},{"$f":"I7","v":2},null,3,{"$f":"N('Tex-113,4-E'!I51)","v":0},{"$f":"N('Tex-113,4-E'!I50)","v":0},{"$f":"M8^2","v":0},null,null,2,0,0,0,0,0,0,0,0]
[null,"Best Fit Line Coefficients",null,null,"Maximum Value, x-axis",{"$f":"MROUND(F6+1,1)","v":1},null,{"$f":"F9","v":1},{"$f":"I8","v":2},null,4,{"$f":"IF(AND(L8>0,N('Tex-113,4-E'!K49)=0),N22,N('Tex-113,4-E'!K51))","v":0},{"$f":"IF(AND(M8>0,N('Tex-113,4-E'!K49)=0),N15+2,N('Tex-113,4-E'!K50))","v":0},{"$f":"M9^2","v":0},null,null,3,0,0,0,0,0,0,0,0]
[null,"A0",{"$f":"INDEX(LINEST($L$6:$L$9,$M$6:$N$9),3)","v":0},null,"Minimum Value, x-axis",{"$f":"IF(ISERROR(MROUND(F5-1,1)),0,MROUND(F5-1,1))","v":0},null,{"$f":"H9","v":1},{"$f":"I9","v":2},null,5,{"$f":"N16","v":{"$error":"#DIV/0!"}},{"$f":"$N$15","v":{"$error":"#DIV/0!"}},{"$f":"M10^2","v":{"$error":"#DIV/0!"}},null,null,4,0,0,0,0,0,0,0,0]
[null,"A1",{"$f":"INDEX(LINEST($L$6:$L$9,$M$6:$N$9),2)","v":0},null,"Scale",{"$f":"(F9-F10)/150","v":6.6666666666670002E-3},null,{"$f":"H10","v":1},{"$f":"I6","v":0},null,"SUM",{"$f":"SUM(L8:L10)","v":{"$error":"#DIV/0!"}},{"$f":"SUM(M8:M10)","v":{"$error":"#DIV/0!"}},{"$f":"SUM(N6:N10)","v":{"$error":"#DIV/0!"}}]
[null,"A2",{"$f":"INDEX(LINEST($L$6:$L$9,$M$6:$N$9),1)","v":0},null,"Maximum Value, y-axis",{"$f":"ROUND(F8,0)+2","v":2},null,{"$f":"H6","v":0},{"$f":"I11","v":0},null,null,null,null,null,null,null,"SCA Drop Data"]
[null,{"$f":"\"y = \"&ROUND(C12,3)&\"x^2 + \"&ROUND(C11,3)&\"x + \" &ROUND(C10,3)","v":"y = 0x^2 + 0x + 0"},null,null,"Minimum Value, y-axis",{"$f":"IF(ROUND(F7,0)-2<0,0,ROUND(F7,0)-2)","v":0},null,{"$f":"H11","v":1},{"$f":"I12","v":0},null,"??? Fifth Point & MDD/OMC Calculation ???",null,null,null,null,null,"Lift","Avg. Drop Ht.","Blows","Avg. Drop Ht.","Blows","Avg. Drop Ht.","Blows","Avg. Drop Ht.","Blows"]
[null,null,null,null,null,null,null,null,null,null,"m1",{"$f":"(L7-L6)/(M7-M6)","v":{"$error":"#DIV/0!"}},null,null,null,null,1,{"$f":"TRANSPOSE('SCA-Data'!D21:G21)","v":0},{"$f":"TRANSPOSE('SCA-Data'!D17:G17)","v":0},{"$f":"TRANSPOSE('SCA-Data'!K21:N21)","v":0},{"$f":"TRANSPOSE('SCA-Data'!K17:N17)","v":0},{"$f":"TRANSPOSE('SCA-Data'!R21:U21)","v":0},{"$f":"TRANSPOSE('SCA-Data'!R17:U17)","v":0},{"$f":"TRANSPOSE('SCA-Data'!Y21:AB21)","v":0},{"$f":"TRANSPOSE('SCA-Data'!Y17:AB17)","v":0}]
[null,"R^2 Calculations",null,null,"M-D Curve Begin & End Points",null,null,null,null,null,"b1",{"$f":"L6-L14*M6","v":{"$error":"#DIV/0!"}},"X-Peak",{"$f":"(L17-L15)/(L14-L16)","v":{"$error":"#DIV/0!"}},null,null,2,0,0,0,0,0,0,0,0]
[null,"Y-Known","Y-Calculated",null,"Dry End Moisture",{"$f":"IF(ISERROR(((-C11)+(SQRT((C11^2)-(4*C12*(C10-F13)))))/(2*C12)),0,((-C11)+(SQRT((C11^2)-(4*C12*(C10-F13)))))/(2*C12))","v":0},null,null,null,null,"m2",{"$f":"IF(AND(L8>0,N('Tex-113,4-E'!K49)=0),L14*-1,(L9-L8)/(M9-M8))","v":{"$error":"#DIV/0!"}},"Y-Peak",{"$f":"L14*N15+L15","v":{"$error":"#DIV/0!"}},null,null,3,0,0,0,0,0,0,0,0]
[null,{"$f":"L6","v":0},{"$f":"($C$12*(VLOOKUP(B17,$L$5:$M$10,2,FALSE))^2)+($C$11*(VLOOKUP(B17,$L$5:$M$10,2,FALSE)))+$C$10","v":0},null,"Wet End Moisture",{"$f":"IF(ISERROR(((-C11)-(SQRT((C11^2)-(4*C12*(C10-F13)))))/(2*C12)),0,((-C11)-(SQRT((C11^2)-(4*C12*(C10-F13)))))/(2*C12))","v":0},null,null,null,null,"b2",{"$f":"L8-M8*L16","v":{"$error":"#DIV/0!"}},null,null,null,null,4,0,0,0,0,0,0,0,0]
[null,{"$f":"L7","v":0},{"$f":"($C$12*(VLOOKUP(B18,$L$5:$M$10,2,FALSE))^2)+($C$11*(VLOOKUP(B18,$L$5:$M$10,2,FALSE)))+$C$10","v":0}]
[null,{"$f":"L8","v":0},{"$f":"($C$12*(VLOOKUP(B19,$L$5:$M$10,2,FALSE))^2)+($C$11*(VLOOKUP(B19,$L$5:$M$10,2,FALSE)))+$C$10","v":0},null,null,null,null,null,null,null,"??? 3-Point Curve Reference Data ???",null,null,null,null,null,"SCA Data Limit"]
[null,{"$f":"L9","v":0},{"$f":"($C$12*(VLOOKUP(B20,$L$5:$M$10,2,FALSE))^2)+($C$11*(VLOOKUP(B20,$L$5:$M$10,2,FALSE)))+$C$10","v":0},null,null,null,null,null,null,null,null,"3pt Curve (1-Yes, 0-No) =  ",{"$f":"IF(N('Tex-113,4-E'!K36)=0,1,0)","v":1},null,null,null,"Limit","X","Y, Total Energy","Y, Drop Height","Y, Blows","Y, Energy/ Blow"]
[null,null,null,null,null,null,null,null,null,null,"mZAV=",{"$f":"(M25-M52)/(K25-K52)","v":-2.1094543851851899},"b4th=",{"$f":"L8-L21*M8","v":0},null,null,"Upper",1,{"$f":"S22","v":765},{"$f":"T22","v":18.5},{"$f":"U22","v":60},{"$f":"V22","v":15.3}]
[null,null,null,null,null,null,null,null,null,null,"bZAV=",{"$f":"M25-L21*K25","v":164.46226874148201},"Y4th=",{"$f":"L21*M9+N21","v":0},null,null,null,4,{"$f":"S23+15","v":765},{"$f":"T23+0.5","v":18.5},{"$f":"U23+10","v":60},{"$f":"MAX(U32:U34)","v":15.3}]
[null,null,null,null,"Gs=",{"$f":"IF(OR('Tex-113,4-E'!E24=\"\",'Tex-113,4-E'!E23=\"\",'Tex-113,4-E'!E22=\"\"),IF('Tex-113,4-E'!E26=\"\",2.65,N('Tex-113,4-E'!E26)),N('Tex-113,4-E'!E26))","v":2.65},null,null,null,null,null,null,null,null,null,null,"Ideal",1,750,18,50,{"$f":"T32","v":15}]
[null,null,null,null,"γw=",62.5,null,"Closest point to Max y-Scale",{"$f":"INDEX(H26:H176,MATCH(MIN(ABS(H26:H176-F12)),ABS(H26:H176-F12),0))","v":161.349245007306},null,"W","Dry Density","ZAV",null,null,null,null,4,750,18,50,{"$f":"T32","v":15}]
[null,"M_D Best-fit Plot within scale",null,null,"ZAV Plot within scale",null,null,"ZAV - Reference Data",null,null,{"$f":"IF(M20=1,N('Tex-113,4-E'!I50)+8,N('Tex-113,4-E'!K50)+8)","v":8},{"$f":"$C$10+$C$11*K25+$C$12*K25^2","v":0},{"$f":"IF(version<\"3\",($F$23*$F$24*(1+(K25/100)))/(1+$F$23*(K25/100)),($F$23*$F$24)/(1+$F$23*(K25/100)))","v":147.58663365999999},null,null,null,"Lower",1,{"$f":"S24-15","v":735},{"$f":"T24-0.5","v":17.5},{"$f":"U24","v":50},{"$f":"MIN(S32:S34)","v":12.25}]
[null,{"$f":"IF(F16<F10,F10,F16)","v":0},{"$f":"$C$10+$C$11*B26+$C$12*B26^2","v":0},null,{"$f":"VLOOKUP(I24,H26:I176,2)","v":1},{"$f":"IF(version<3,($F$23*$F$24*(1+(E26/100)))/(1+$F$23*(E26/100)),($F$23*$F$24)/(1+$F$23*(E26/100)))","v":161.349245007306},null,{"$f":"IF(version<3,($F$23*$F$24*(1+(I26/100)))/(1+$F$23*(I26/100)),($F$23*$F$24)/(1+$F$23*(I26/100)))","v":161.349245007306},{"$f":"F9","v":1},null,{"$f":"K25-0.2","v":7.8},0,147.96034639999999,null,null,null,null,4,{"$f":"S25","v":735},{"$f":"T25","v":17.5},{"$f":"U25","v":50},{"$f":"V25","v":12.25}]
[null,{"$f":"IF(B26+$F$11<=MIN($F$9,$F$17),B26+$F$11,B26)","v":0},0,null,{"$f":"IF(E26+$F$11<=$F$9,E26+$F$11,E26)","v":1},161.349245007306,null,161.377018938151,{"$f":"I26-$F$11","v":0.99333333333333296},null,{"$f":"K26-0.2","v":7.6},0,148.33735641999999]
[null,{"$f":"IF(B27+$F$11<=$F$9,B27+$F$11,B27)","v":6.6666666666670002E-3},0,null,{"$f":"IF(E27+$F$11<=$F$9,E27+$F$11,E27)","v":1},161.349245007306,null,161.404802432401,0.98666666666666603,null,{"$f":"K27-0.2","v":7.4},0,148.71770755,null,null,null,"Energy Levels to Achieve Total Energy with Defined Blow Limits"]
[null,1.3333333333334E-2,0,null,1,161.349245007306,null,161.43259549499501,0.97999999999999898,null,{"$f":"K28-0.2","v":7.2},0,149.10144441,null,null,null,"Limit Boundary",null,"Low","Ideal","High"]
[null,2.0000000000001E-2,0,null,1,161.349245007306,null,161.46039813087799,0.97333333333333205,null,{"$f":"K29-0.2","v":7},0,149.48861239999999,null,null,null,"Defined\nLimits","Total Energy",{"$f":"T30-15","v":735},750,{"$f":"T30+15","v":765}]
{"$rows_left_out":167}
{"sheet":"SCA-Data","index":3,"n_rows":290,"n_cols":29,"rows_kept":290,"cut":false,"hidden":true,"merged":[[1,23,1,27],[2,23,2,27],[1,2,1,6],[2,2,2,6],[1,9,1,13],[2,9,2,13],[1,16,1,20],[2,16,2,20]]}
[]
[null,"Specimen",1,null,null,null,null,null,null,2,null,null,null,null,null,null,3,null,null,null,null,null,null,4]
[null,"Moisture Content",{"$f":"Field11","v":0},null,null,null,null,null,null,{"$f":"Field12","v":0},null,null,null,null,null,null,{"$f":"Field13","v":0},null,null,null,null,null,null,{"$f":"Field14","v":0}]
[null,"Header"]
[]
[]
["`"]
[]
[]
[]
[]
[]
[null,null,"Drop #","Time (sec)","Velocity (ft/sec)","Impact Energy (ft-lb)","Lift Ht (in)","Drop Ht (in)",null,"Drop #","Time (sec)","Velocity (ft/sec)","Impact Energy (ft-lb)","Lift Ht (in)","Drop Ht (in)",null,"Drop #","Time (sec)","Velocity (ft/sec)","Impact Energy (ft-lb)","Lift Ht (in)","Drop Ht (in)",null,"Drop #","Time (sec)","Velocity (ft/sec)","Impact Energy (ft-lb)","Lift Ht (in)","Drop Ht (in)"]
[]
[null,"Lift Summary"]
[null,null,"Lift #",null,null,null,null,null,null,"Lift #",null,null,null,null,null,null,"Lift #",null,null,null,null,null,null,"Lift #"]
[null,null,"Drops",null,null,null,null,null,null,"Drops",null,null,null,null,null,null,"Drops",null,null,null,null,null,null,"Drops"]
[null,null,"Total Energy (ft-lb)",null,null,null,null,null,null,"Total Energy (ft-lb)",null,null,null,null,null,null,"Total Energy (ft-lb)",null,null,null,null,null,null,"Total Energy (ft-lb)"]
[null,null,"Ave Energy / Drop (ft-lb)",null,null,null,null,null,null,"Ave Energy / Drop (ft-lb)",null,null,null,null,null,null,"Ave Energy / Drop (ft-lb)",null,null,null,null,null,null,"Ave Energy / Drop (ft-lb)"]
[null,null,"Ave Lift Ht (in)",null,null,null,null,null,null,"Ave Lift Ht (in)",null,null,null,null,null,null,"Ave Lift Ht (in)",null,null,null,null,null,null,"Ave Lift Ht (in)"]
[null,null,"Ave Drop Ht (in)",null,null,null,null,null,null,"Ave Drop Ht (in)",null,null,null,null,null,null,"Ave Drop Ht (in)",null,null,null,null,null,null,"Ave Drop Ht (in)"]
[]
[null,null,null,null,null,null,null,null,null,null,null,null,null,null,null,null,null,null,null,null,null,null,null,null,null,null,null,null,18.477]
[null,null,null,null,null,null,null,null,null,null,null,null,null,null,null,null,null,null,null,null,null,null,null,null,null,null,null,null,18.378]
[null,null,null,null,null,null,null,null,null,null,null,null,null,null,null,null,null,null,null,null,null,null,null,null,null,null,null,null,18.443999999999999]
[null,null,null,null,null,null,null,null,null,null,null,null,null,null,null,null,null,null,null,null,null,null,null,null,null,null,null,null,18.468]
[null,null,null,null,null,null,null,null,null,null,null,null,null,null,null,null,null,null,null,null,null,null,null,null,null,null,null,null,18.466999999999999]
[null,null,null,null,null,null,null,null,null,null,null,null,null,null,null,null,null,null,null,null,null,null,null,null,null,null,null,null,18.472999999999999]
[null,null,null,null,null,null,null,null,null,null,null,null,null,null,null,null,null,null,null,null,null,null,null,null,null,null,null,null,18.439]
[null,null,null,null,null,null,null,null,null,null,null,null,null,null,null,null,null,null,null,null,null,null,null,null,null,null,null,null,18.498999999999999]
{"$rows_left_out":261}
{"sheet":"RX","index":5,"n_rows":231,"n_cols":9,"rows_kept":231,"cut":false,"hidden":true,"merged":[]}
[{"$f":"COUNTA(A3:A300)","v":229},{"$f":"sampleid & \" - \" & testnumber","v":" - "},{"$f":"testnumber","v":0},{"$f":"+testnumber","v":0}]
["Fld_nbr","Value","Desc_1","Desc_2","Desc_3","Desc_4","Desc_5","Desc_6","Desc_7"]
[1,{"$f":"IF('Tex-113,4-E'!$B$89=\"\",\"\",'Tex-113,4-E'!$B$89)","v":""},{"$f":"'Tex-113,4-E'!$B$88","v":"Remarks:"}]
[2,{"$f":"IF('Tex-113,4-E'!$D$19=\"\",\"\",'Tex-113,4-E'!$D$19)","v":""},{"$f":"IF('Tex-113,4-E'!$C$19=\"\",\"\",'Tex-113,4-E'!$C$19)","v":"COURSE\\LIFT:"}]
[3,{"$f":"IF('Tex-113,4-E'!$C$100=\"\",\"\",'Tex-113,4-E'!$C$100)","v":""},"Tested By ",{"$f":"IF('Tex-113,4-E'!$B$100=\"\",\"\",'Tex-113,4-E'!$B$100)","v":"TX113"}]
[4,{"$f":"IF('Tex-113,4-E'!$G$100=\"\",\"\",'Tex-113,4-E'!$G$100)","v":""},"Tested Date ",{"$f":"IF('Tex-113,4-E'!$B$100=\"\",\"\",'Tex-113,4-E'!$B$100)","v":"TX113"}]
[5,{"$f":"IF('Tex-113,4-E'!$C$102=\"\",\"\",'Tex-113,4-E'!$C$102)","v":""},"Tested By ",{"$f":"IF('Tex-113,4-E'!$B$102=\"\",\"\",'Tex-113,4-E'!$B$102)","v":"TX114"}]
[6,{"$f":"IF('Tex-113,4-E'!$G$102=\"\",\"\",'Tex-113,4-E'!$G$102)","v":""},"Tested Date ",{"$f":"IF('Tex-113,4-E'!$B$102=\"\",\"\",'Tex-113,4-E'!$B$102)","v":"TX114"}]
[7,{"$f":"IF('Tex-113,4-E'!$E$22=\"\",\"\",'Tex-113,4-E'!$E$22)","v":""},{"$f":"IF('Tex-113,4-E'!$B$6=\"\",\"\",'Tex-113,4-E'!$B$6)","v":"Tex-113-E or Tex-114-E"},{"$f":"IF('Tex-113,4-E'!$B$22=\"\",\"\",'Tex-113,4-E'!$B$22)","v":"Oven Dry Weight, (g):"}]
[8,{"$f":"IF('Tex-113,4-E'!$E$23=\"\",\"\",'Tex-113,4-E'!$E$23)","v":""},{"$f":"IF('Tex-113,4-E'!$B$6=\"\",\"\",'Tex-113,4-E'!$B$6)","v":"Tex-113-E or Tex-114-E"},{"$f":"IF('Tex-113,4-E'!$B$23=\"\",\"\",'Tex-113,4-E'!$B$23)","v":"Weight of Pycnometer & Water, (g):"}]
[9,{"$f":"IF('Tex-113,4-E'!$E$24=\"\",\"\",'Tex-113,4-E'!$E$24)","v":""},{"$f":"IF('Tex-113,4-E'!$B$6=\"\",\"\",'Tex-113,4-E'!$B$6)","v":"Tex-113-E or Tex-114-E"},{"$f":"IF('Tex-113,4-E'!$B$24=\"\",\"\",'Tex-113,4-E'!$B$24)","v":"Weight of Aggr., Pycn.& Water, (g):"}]
[10,{"$f":"IF('Tex-113,4-E'!$E$26=\"\",\"\",'Tex-113,4-E'!$E$26)","v":2.65},{"$f":"IF('Tex-113,4-E'!$B$6=\"\",\"\",'Tex-113,4-E'!$B$6)","v":"Tex-113-E or Tex-114-E"},{"$f":"IF('Tex-113,4-E'!$B$25=\"\",\"\",'Tex-113,4-E'!$B$25)","v":"Specific Gravity (Apparent)(Override):"}]
[11,{"$f":"IF('Tex-113,4-E'!$E$28=\"\",\"\",'Tex-113,4-E'!$E$28)","v":""},{"$f":"IF('Tex-113,4-E'!$B$6=\"\",\"\",'Tex-113,4-E'!$B$6)","v":"Tex-113-E or Tex-114-E"},{"$f":"IF('Tex-113,4-E'!$B$28=\"\",\"\",'Tex-113,4-E'!$B$28)","v":"Hygroscopic Moisture, (%):"}]
[12,{"$f":"IF('Tex-113,4-E'!$E$31=\"\",\"\",'Tex-113,4-E'!$E$31)","v":""},{"$f":"IF('Tex-113,4-E'!$B$31=\"\",\"\",'Tex-113,4-E'!$B$31)","v":"Percent Water Content, (%):"},{"$f":"IF('Tex-113,4-E'!$E$30=\"\",\"\",'Tex-113,4-E'!$E$30)","v":1}]
[13,{"$f":"IF('Tex-113,4-E'!$G$31=\"\",\"\",'Tex-113,4-E'!$G$31)","v":""},{"$f":"IF('Tex-113,4-E'!$B$31=\"\",\"\",'Tex-113,4-E'!$B$31)","v":"Percent Water Content, (%):"},{"$f":"IF('Tex-113,4-E'!$G$30=\"\",\"\",'Tex-113,4-E'!$G$30)","v":2}]
[14,{"$f":"IF('Tex-113,4-E'!$I$31=\"\",\"\",'Tex-113,4-E'!$I$31)","v":""},{"$f":"IF('Tex-113,4-E'!$B$31=\"\",\"\",'Tex-113,4-E'!$B$31)","v":"Percent Water Content, (%):"},{"$f":"IF('Tex-113,4-E'!$I$30=\"\",\"\",'Tex-113,4-E'!$I$30)","v":3}]
[15,{"$f":"IF('Tex-113,4-E'!$K$31=\"\",\"\",'Tex-113,4-E'!$K$31)","v":""},{"$f":"IF('Tex-113,4-E'!$B$31=\"\",\"\",'Tex-113,4-E'!$B$31)","v":"Percent Water Content, (%):"},{"$f":"IF('Tex-113,4-E'!$K$30=\"\",\"\",'Tex-113,4-E'!$K$30)","v":4}]
[16,{"$f":"IF('Tex-113,4-E'!$E$33=\"\",\"\",'Tex-113,4-E'!$E$33)","v":""},{"$f":"IF('Tex-113,4-E'!$B$6=\"\",\"\",'Tex-113,4-E'!$B$6)","v":"Tex-113-E or Tex-114-E"},{"$f":"IF('Tex-113,4-E'!$B$33=\"\",\"\",'Tex-113,4-E'!$B$33)","v":"Mass Material, (lb):"},{"$f":"IF('Tex-113,4-E'!$E$30=\"\",\"\",'Tex-113,4-E'!$E$30)","v":1}]
[17,{"$f":"IF('Tex-113,4-E'!$G$33=\"\",\"\",'Tex-113,4-E'!$G$33)","v":""},{"$f":"IF('Tex-113,4-E'!$B$6=\"\",\"\",'Tex-113,4-E'!$B$6)","v":"Tex-113-E or Tex-114-E"},{"$f":"IF('Tex-113,4-E'!$B$33=\"\",\"\",'Tex-113,4-E'!$B$33)","v":"Mass Material, (lb):"},{"$f":"IF('Tex-113,4-E'!$G$30=\"\",\"\",'Tex-113,4-E'!$G$30)","v":2}]
[18,{"$f":"IF('Tex-113,4-E'!$I$33=\"\",\"\",'Tex-113,4-E'!$I$33)","v":""},{"$f":"IF('Tex-113,4-E'!$B$6=\"\",\"\",'Tex-113,4-E'!$B$6)","v":"Tex-113-E or Tex-114-E"},{"$f":"IF('Tex-113,4-E'!$B$33=\"\",\"\",'Tex-113,4-E'!$B$33)","v":"Mass Material, (lb):"},{"$f":"IF('Tex-113,4-E'!$I$30=\"\",\"\",'Tex-113,4-E'!$I$30)","v":3}]
[19,{"$f":"IF('Tex-113,4-E'!$K$33=\"\",\"\",'Tex-113,4-E'!$K$33)","v":""},{"$f":"IF('Tex-113,4-E'!$B$6=\"\",\"\",'Tex-113,4-E'!$B$6)","v":"Tex-113-E or Tex-114-E"},{"$f":"IF('Tex-113,4-E'!$B$33=\"\",\"\",'Tex-113,4-E'!$B$33)","v":"Mass Material, (lb):"},{"$f":"IF('Tex-113,4-E'!$K$30=\"\",\"\",'Tex-113,4-E'!$K$30)","v":4}]
[20,{"$f":"IF('Tex-113,4-E'!$E$34=\"\",\"\",'Tex-113,4-E'!$E$34)","v":""},{"$f":"IF('Tex-113,4-E'!$B$6=\"\",\"\",'Tex-113,4-E'!$B$6)","v":"Tex-113-E or Tex-114-E"},{"$f":"IF('Tex-113,4-E'!$B$34=\"\",\"\",'Tex-113,4-E'!$B$34)","v":"Mass Water Added, (lb):"},{"$f":"IF('Tex-113,4-E'!$E$30=\"\",\"\",'Tex-113,4-E'!$E$30)","v":1}]
[21,{"$f":"IF('Tex-113,4-E'!$G$34=\"\",\"\",'Tex-113,4-E'!$G$34)","v":""},{"$f":"IF('Tex-113,4-E'!$B$6=\"\",\"\",'Tex-113,4-E'!$B$6)","v":"Tex-113-E or Tex-114-E"},{"$f":"IF('Tex-113,4-E'!$B$34=\"\",\"\",'Tex-113,4-E'!$B$34)","v":"Mass Water Added, (lb):"},{"$f":"IF('Tex-113,4-E'!$G$30=\"\",\"\",'Tex-113,4-E'!$G$30)","v":2}]
[22,{"$f":"IF('Tex-113,4-E'!$I$34=\"\",\"\",'Tex-113,4-E'!$I$34)","v":""},{"$f":"IF('Tex-113,4-E'!$B$6=\"\",\"\",'Tex-113,4-E'!$B$6)","v":"Tex-113-E or Tex-114-E"},{"$f":"IF('Tex-113,4-E'!$B$34=\"\",\"\",'Tex-113,4-E'!$B$34)","v":"Mass Water Added, (lb):"},{"$f":"IF('Tex-113,4-E'!$I$30=\"\",\"\",'Tex-113,4-E'!$I$30)","v":3}]
[23,{"$f":"IF('Tex-113,4-E'!$K$34=\"\",\"\",'Tex-113,4-E'!$K$34)","v":""},{"$f":"IF('Tex-113,4-E'!$B$6=\"\",\"\",'Tex-113,4-E'!$B$6)","v":"Tex-113-E or Tex-114-E"},{"$f":"IF('Tex-113,4-E'!$B$34=\"\",\"\",'Tex-113,4-E'!$B$34)","v":"Mass Water Added, (lb):"},{"$f":"IF('Tex-113,4-E'!$K$30=\"\",\"\",'Tex-113,4-E'!$K$30)","v":4}]
[24,{"$f":"IF('Tex-113,4-E'!$E$36=\"\",\"\",'Tex-113,4-E'!$E$36)","v":""},{"$f":"IF('Tex-113,4-E'!$B$6=\"\",\"\",'Tex-113,4-E'!$B$6)","v":"Tex-113-E or Tex-114-E"},{"$f":"IF('Tex-113,4-E'!$B$36=\"\",\"\",'Tex-113,4-E'!$B$36)","v":"Wet Mass Specimen & Mold, (lb):"},{"$f":"IF('Tex-113,4-E'!$E$30=\"\",\"\",'Tex-113,4-E'!$E$30)","v":1}]
[25,{"$f":"IF('Tex-113,4-E'!$G$36=\"\",\"\",'Tex-113,4-E'!$G$36)","v":""},{"$f":"IF('Tex-113,4-E'!$B$6=\"\",\"\",'Tex-113,4-E'!$B$6)","v":"Tex-113-E or Tex-114-E"},{"$f":"IF('Tex-113,4-E'!$B$36=\"\",\"\",'Tex-113,4-E'!$B$36)","v":"Wet Mass Specimen & Mold, (lb):"},{"$f":"IF('Tex-113,4-E'!$G$30=\"\",\"\",'Tex-113,4-E'!$G$30)","v":2}]
[26,{"$f":"IF('Tex-113,4-E'!$I$36=\"\",\"\",'Tex-113,4-E'!$I$36)","v":""},{"$f":"IF('Tex-113,4-E'!$B$6=\"\",\"\",'Tex-113,4-E'!$B$6)","v":"Tex-113-E or Tex-114-E"},{"$f":"IF('Tex-113,4-E'!$B$36=\"\",\"\",'Tex-113,4-E'!$B$36)","v":"Wet Mass Specimen & Mold, (lb):"},{"$f":"IF('Tex-113,4-E'!$I$30=\"\",\"\",'Tex-113,4-E'!$I$30)","v":3}]
[27,{"$f":"IF('Tex-113,4-E'!$K$36=\"\",\"\",'Tex-113,4-E'!$K$36)","v":""},{"$f":"IF('Tex-113,4-E'!$B$6=\"\",\"\",'Tex-113,4-E'!$B$6)","v":"Tex-113-E or Tex-114-E"},{"$f":"IF('Tex-113,4-E'!$B$36=\"\",\"\",'Tex-113,4-E'!$B$36)","v":"Wet Mass Specimen & Mold, (lb):"},{"$f":"IF('Tex-113,4-E'!$K$30=\"\",\"\",'Tex-113,4-E'!$K$30)","v":4}]
[28,{"$f":"IF('Tex-113,4-E'!$E$37=\"\",\"\",'Tex-113,4-E'!$E$37)","v":""},{"$f":"IF('Tex-113,4-E'!$B$6=\"\",\"\",'Tex-113,4-E'!$B$6)","v":"Tex-113-E or Tex-114-E"},{"$f":"IF('Tex-113,4-E'!$B$37=\"\",\"\",'Tex-113,4-E'!$B$37)","v":"Mass of Mold, (lb):"},{"$f":"IF('Tex-113,4-E'!$E$30=\"\",\"\",'Tex-113,4-E'!$E$30)","v":1}]
{"$rows_left_out":201}