{"text_format":"1","workbook":"xlsx","n_sheets":6,"sheets":["Tex-113,4-E","Reference","UCS","SCA-Data","SCA","RX"],"not_rendered":{"charts":9,"images":1,"macros":1,"external_links":1,"defined_names":427,"comments":1,"pivot_tables":0},"unopened":[{"sheet":"UCS","index":2,"reason":"not_a_worksheet"},{"sheet":"SCA","index":4,"reason":"not_a_worksheet"}],"bounds":{"document_bytes":16777216,"sheet_cells":100000,"rows_first":2000,"rows_last":500,"rows_between":2000,"halvings":0,"cell_chars":16384,"cell_head_chars":4096},"cells_cut":0,"cells_raw":0,"read":"whole","date_system":"1900"}

{"sheet":"Tex-113,4-E","index":0,"n_rows":108,"n_cols":16,"rows_kept":108,"cut":false,"hidden":false,"merged":[[93,2,93,4],[94,2,94,4],[91,1,91,11],[92,1,92,11],[85,1,85,3],[79,1,79,3],[80,1,80,3],[16,9,16,11],[80,6,80,7],[79,6,79,7],[42,10,42,11],[42,8,42,9],[46,8,46,9],[45,8,45,9],[46,10,46,11],[38,8,38,9],[38,10,38,11],[40,8,40,9],[40,10,40,11],[39,10,39,11],[39,8,39,9],[44,8,44,9],[49,8,49,9],[37,8,37,9],[80,10,80,11],[79,10,79,11],[44,10,44,11],[47,10,47,11],[80,4,80,5],[79,4,79,5],[51,4,51,5],[50,4,50,5],[49,4,49,5],[47,4,47,5],[49,10,49,11],[47,8,47,9],[48,8,48,9],[48,4,48,5],[50,10,50,11],[51,10,51,11],[51,8,51,9],[51,6,51,7],[50,6,50,7],[49,6,49,7],[48,10,48,11],[65,10,66,11],[38,6,38,7],[43,4,43,5],[38,4,38,5],[40,4,40,5],[39,4,39,5],[46,4,46,5],[80,8,80,9],[79,8,79,9],[43,8,43,9],[44,6,44,7],[44,4,44,5],[40,6,40,7],[41,4,41,5],[41,6,41,7],[39,6,39,7],[48,6,48,7],[50,8,50,9],[47,6,47,7],[43,6,43,7],[42,6,42,7],[65,8,66,9],[36,6,36,7],[35,6,35,7],[36,4,36,5],[35,4,35,5],[36,10,36,11],[33,6,33,7],[33,8,33,9],[33,10,33,11],[35,10,35,11],[36,8,36,9],[35,8,35,9],[14,3,14,11],[13,3,13,5],[21,1,21,3],[22,1,22,3],[12,9,12,11],[23,1,23,3],[7,3,7,5],[8,3,8,5],[9,3,9,5],[10,3,10,5],[10,9,10,11],[9,9,9,11],[8,9,8,11],[7,9,7,11],[11,3,11,5],[18,3,18,4],[27,4,27,5],[65,6,66,7],[37,4,37,5],[45,1,45,3],[11,9,11,11],[21,4,21,5],[22,4,22,5],[15,3,15,11],[18,10,18,11],[18,6,18,7],[13,9,13,11],[16,3,16,5],[16,6,16,8],[30,4,30,5],[30,10,30,11],[30,8,30,9],[30,6,30,7],[24,4,24,5],[25,4,25,5],[37,6,37,7],[29,10,29,11],[29,8,29,9],[29,6,29,7],[37,10,37,11],[29,4,29,5],[23,4,23,5],[99,2,99,4],[103,6,103,9],[107,1,107,3],[101,2,101,4],[103,1,103,3],[32,10,32,11],[32,8,32,9],[32,6,32,7],[32,4,32,5],[33,4,33,5],[98,2,98,4],[63,1,63,3],[62,1,62,3],[61,1,61,3],[90,1,90,11],[70,1,70,3],[74,1,74,3],[82,1,82,3],[83,1,83,3],[65,1,66,3],[56,1,56,3],[84,1,84,3],[68,1,68,3],[45,10,45,11],[0,0,0,1],[48,1,48,3],[49,1,49,3],[50,1,50,3],[51,1,51,3],[30,1,30,3],[47,1,47,3],[35,1,35,3],[29,1,29,3],[44,1,44,3],[24,1,24,3],[27,1,27,3],[33,1,33,3],[38,1,38,3],[42,1,42,3],[43,1,43,3],[36,1,37,3],[25,1,25,3],[32,1,32,3],[39,1,39,3],[46,1,46,3],[12,3,12,5],[96,2,96,4],[67,1,67,3],[69,1,69,3],[71,1,71,3],[73,1,73,3],[88,1,89,11],[41,10,41,11],[65,4,66,5],[75,1,75,3],[76,1,76,3],[77,1,77,3],[40,1,41,3],[41,8,41,9],[54,1,54,3],[55,1,55,3],[42,4,42,5],[59,1,59,3],[60,1,60,3],[53,1,53,3],[57,1,57,3],[45,4,45,5],[46,6,46,7],[45,6,45,7],[43,10,43,11]]}
["TxDOT Manuals >",null,null,"Tex-113-E","Tex-114-E"]
[null,"TEXAS DEPARTMENT OF TRANSPORTATION",null,null,null,null,null,null,null,null,null,null,null,null,null,259]
[null,null,null,null,null,null,null,null,null,null,null,null,null,null,null,4]
[null,null,null,null,null,null,null,null,null,null,null,null,null,null,null,"tx113,4.xlsm::45448.658032"]
[null,"Moisture-Density Relations of Base Material & Sand or Subgrade & Embankment Soils",null,null,null,null,null,null,null,null,null,null,null,null,null,45]
[null,"Tex-113-E or Tex-114-E"]
[null,null,null,null,null,null,null,null,null,null,null,{"$f":"\"File Version: \" & TEXT(MID(P4,SEARCH(\"::\",P4,1)+2,20),\"mm/dd/yy hh:mm:ss\")","v":"File Version: 06/05/24 15:47:34"}]
[null,null,"SAMPLE ID:",null,null,null,null,null,"SAMPLED DATE:"]
[null,null,"TEST NUMBER:",null,null,null,null,null,"LETTING DATE:"]
[null,null,"SAMPLE STATUS:",null,null,null,null,null,"CONTROLLING CSJ:"]
[null,null,"COUNTY:",null,null,null,null,null,"SPEC YEAR:"]
[null,null,"SAMPLED BY:",null,null,null,null,null,"SPEC ITEM:"]
[null,null,"SAMPLE LOCATION:",null,null,null,null,null,"SPECIAL PROVISION:"]
[null,null,"MATERIAL CODE:",null,null,null,null,null,"GRADE:"]
[null,null,"MATERIAL NAME:"]
[null,null,"PRODUCER:",""]
[null,null,"AREA ENGINEER:",null,null,null,"PROJECT MANAGER:"]
[]
[null,null,"COURSE\\LIFT:",null,null,"STATION:",null,null,null,"DIST. FROM CL:"]
[null,"Moisture-Density Work Sheet"]
[]
[null,"Oven Dry Weight, (g):"]
[null,"Weight of Pycnometer & Water, (g):"]
[null,"Weight of Aggr., Pycn.& Water, (g):"]
[null,"Specific Gravity (Apparent)(Override):"]
[null,"Specific Gravity (Apparent)(Calc):",null,null,{"$f":"IF(Field126=\"\",IF(ISERROR(E22/(E22+E23-E24)),2.65,E22/(E22+E23-E24)),Field126)","v":2.65}]
[]
[null,"Hygroscopic Moisture, (%):"]
[]
[null,"Sample Number :",null,null,1,null,2,null,3,null,4]
[null,"Percent Water Content, (%):"]
[]
[null,"Mass Material, (lb):"]
[null,"Mass Water Added, (lb):",null,null,{"$f":"IF(OR(ISERROR((E31/100)*E33),COUNTBLANK(E31:E33)=3,Field15=\"\"),\"\",(E31/100)*E33)","v":""},null,{"$f":"IF(OR(ISERROR((G31/100)*G33),COUNTBLANK(G31:G33)=3,Field16=\"\"),\"\",(G31/100)*G33)","v":""},null,{"$f":"IF(OR(ISERROR((I31/100)*I33),COUNTBLANK(I31:I33)=3,Field17=\"\"),\"\",(I31/100)*I33)","v":""},null,{"$f":"IF(OR(ISERROR((K31/100)*K33),COUNTBLANK(K31:K33)=3,Field18=\"\"),\"\",(K31/100)*K33)","v":""}]
[]
[null,"Wet Mass Specimen & Mold, (lb):"]
[null,"Mass of Mold, (lb):"]
[null,null,null,null,{"$f":"IF(OR(ISERROR(Field23),Field23=\"\",Field19=\"\"),\"\",Field23)","v":""},null,{"$f":"IF(OR(ISERROR(Field24),Field24=\"\"),IF(OR(ISERROR(Field23),Field23=\"\",Field20=\"\"),\"\",Field23),Field24)","v":""},null,{"$f":"IF(OR(ISERROR(Field25),Field25=\"\"),IF(OR(ISERROR(Field23),Field23=\"\",Field21=\"\"),\"\",Field23),Field25)","v":""},null,{"$f":"IF(OR(ISERROR(Field26),Field26=\"\"),IF(OR(ISERROR(Field23),Field23=\"\",Field22=\"\"),\"\",Field23),Field26)","v":""}]
[null,"Wet Mass Specimen, (lb):",null,null,{"$f":"IF(N(E36)+N(E38)=0,\"\",N(E36)-N(E38))","v":""},null,{"$f":"IF(N(G36)+N(G38)=0,\"\",N(G36)-N(G38))","v":""},null,{"$f":"IF(N(I36)+N(I38)=0,\"\",N(I36)-N(I38))","v":""},null,{"$f":"IF(N(K36)+N(K38)=0,\"\",N(K36)-N(K38))","v":""}]
[null,"Height of Specimen, (in.):"]
[null,"Volume per Linear mm., (in.):"]
[null,null,null,null,{"$f":"IF(OR(ISERROR(Field31),Field31=\"\",Field27=\"\"),\"\",Field31)","v":""},null,{"$f":"IF(OR(ISERROR(Field32),Field32=\"\"),IF(OR(ISERROR(Field31),Field31=\"\",Field28=\"\"),\"\",Field31),Field32)","v":""},null,{"$f":"IF(OR(ISERROR(Field33),Field33=\"\"),IF(OR(ISERROR(Field31),Field31=\"\",Field29=\"\"),\"\",Field31),Field33)","v":""},null,{"$f":"IF(OR(ISERROR(Field34),Field34=\"\"),IF(OR(ISERROR(Field31),Field31=\"\",Field30=\"\"),\"\",Field31),Field34)","v":""}]
[null,"Volume of Specimen, (ft^3):",null,null,{"$f":"IF(ISERROR(IF(AND(E40=\"\",E42=\"\"),\"\",E42*E40)),\"\",IF(AND(E40=\"\",E42=\"\"),\"\",E42*E40))","v":""},null,{"$f":"IF(ISERROR(IF(AND(G40=\"\",G42=\"\"),\"\",G42*G40)),\"\",IF(AND(G40=\"\",G42=\"\"),\"\",G42*G40))","v":""},null,{"$f":"IF(ISERROR(IF(AND(I40=\"\",I42=\"\"),\"\",I42*I40)),\"\",IF(AND(I40=\"\",I42=\"\"),\"\",I42*I40))","v":""},null,{"$f":"IF(ISERROR(IF(AND(K40=\"\",K42=\"\"),\"\",K42*K40)),\"\",IF(AND(K40=\"\",K42=\"\"),\"\",K42*K40))","v":""}]
[null,"Wet Density of Specimen, (lb):",null,null,{"$f":"IF(ISERROR(E39/E43),\"\",E39/E43)","v":""},null,{"$f":"IF(ISERROR(G39/G43),\"\",G39/G43)","v":""},null,{"$f":"IF(ISERROR(I39/I43),\"\",I39/I43)","v":""},null,{"$f":"IF(ISERROR(K39/K43),\"\",K39/K43)","v":""}]
[null,"Wet Mass of Pan & Specimen, (lb):"]
[null,"Dry Mass Pan & Specimen, (lb):"]
[null,"Tare Mass Pan, (lb):"]
[null,"Dry Mass Material , (lb):",null,null,{"$f":"IF(COUNTBLANK(E46:E47)=2,\"\",E46-E47)","v":""},null,{"$f":"IF(COUNTBLANK(G46:G47)=2,\"\",G46-G47)","v":""},null,{"$f":"IF(COUNTBLANK(I46:I47)=2,\"\",I46-I47)","v":""},null,{"$f":"IF(COUNTBLANK(K46:K47)=2,\"\",K46-K47)","v":""}]
[null,"Mass Water, (lb):",null,null,{"$f":"IF(COUNTBLANK(E45:E46)=2,\"\",E45-E46)","v":""},null,{"$f":"IF(COUNTBLANK(G45:G46)=2,\"\",G45-G46)","v":""},null,{"$f":"IF(COUNTBLANK(I45:I46)=2,\"\",I45-I46)","v":""},null,{"$f":"IF(COUNTBLANK(K45:K46)=2,\"\",K45-K46)","v":""}]
[null,"Percent Water on Total , (%):",null,null,{"$f":"IF(ISERROR((E49/E48)*100),\"\",(E49/E48)*100)","v":""},null,{"$f":"IF(ISERROR((G49/G48)*100),\"\",(G49/G48)*100)","v":""},null,{"$f":"IF(ISERROR((I49/I48)*100),\"\",(I49/I48)*100)","v":""},null,{"$f":"IF(ISERROR((K49/K48)*100),\"\",(K49/K48)*100)","v":""}]
[null,"Dry Density, (pcf):",null,null,{"$f":"IF(ISERROR(E44/(1+(E50/100))),\"\",E44/(1+(E50/100)))","v":""},null,{"$f":"IF(ISERROR(G44/(1+(G50/100))),\"\",G44/(1+(G50/100)))","v":""},null,{"$f":"IF(ISERROR(I44/(1+(I50/100))),\"\",I44/(1+(I50/100)))","v":""},null,{"$f":"IF(ISERROR(K44/(1+(K50/100))),\"\",K44/(1+(K50/100)))","v":""}]
[null,"Estimated Dry Density, (pcf):",null,null,{"$f":"IF(ISERROR(E44/(1+(E31/100))),\"\",E44/(1+(E31/100)))","v":""},null,{"$f":"IF(ISERROR(G44/(1+(G31/100))),\"\",G44/(1+(G31/100)))","v":""},null,{"$f":"IF(ISERROR(I44/(1+(I31/100))),\"\",I44/(1+(I31/100)))","v":""},null,{"$f":"IF(ISERROR(K44/(1+(K31/100))),\"\",K44/(1+(K31/100)))","v":""}]
[]
[null,"SCA Energy Data",null,null,"Total Energy \n(lb-ft)","Avg Energy/\nBlow (lb-ft)","Total Energy \n(lb-ft)","Avg Energy/\nBlow (lb-ft)","Total Energy \n(lb-ft)","Avg Energy/\nBlow (lb-ft)","Total Energy \n(lb-ft)","Avg Energy/\nBlow (lb-ft)"]
[null,"Lift 1:"]
[null,"Lift 2:"]
[null,"Lift 3:"]
[null,"Lift 4:"]
[]
[null,"SCA Drop Data",null,null,"Avg. Drop Ht. (in)","Blows","Avg. Drop Ht.(in)","Blows","Avg. Drop Ht.(in)","Blows","Avg. Drop Ht.(in)","Blows"]
[null,"Lift 1:"]
[null,"Lift 2:"]
[null,"Lift 3:"]
[null,"Lift 4:"]
[]
[null,"Import Data"]
[]
[null,"SCA Energy Data",null,null,"Total Energy \n(lb-ft)","Avg Energy/\nBlow (lb-ft)","Total Energy \n(lb-ft)","Avg Energy/\nBlow (lb-ft)","Total Energy \n(lb-ft)","Avg Energy/\nBlow (lb-ft)","Total Energy \n(lb-ft)","Avg Energy/\nBlow (lb-ft)"]
[null,"Lift 1:",null,null,{"$f":"IF(OR(ISERROR(ROUND(Reference!R7,1)),Reference!R7=\"\",Reference!R7=0),\"\",ROUND(Reference!R7,1))","v":""},{"$f":"IF(OR(ISERROR(ROUND(Reference!S7,1)),Reference!S7=\"\",Reference!S7=0),\"\",ROUND(Reference!S7,1))","v":""},{"$f":"IF(OR(ISERROR(ROUND(Reference!T7,1)),Reference!T7=\"\",Reference!T7=0),\"\",ROUND(Reference!T7,1))","v":""},{"$f":"IF(OR(ISERROR(ROUND(Reference!U7,1)),Reference!U7=\"\",Reference!U7=0),\"\",ROUND(Reference!U7,1))","v":""},{"$f":"IF(OR(ISERROR(ROUND(Reference!V7,1)),Reference!V7=\"\",Reference!V7=0),\"\",ROUND(Reference!V7,1))","v":""},{"$f":"IF(OR(ISERROR(ROUND(Reference!W7,1)),Reference!W7=\"\",Reference!W7=0),\"\",ROUND(Reference!W7,1))","v":""},{"$f":"IF(OR(ISERROR(ROUND(Reference!X7,1)),Reference!X7=\"\",Reference!X7=0),\"\",ROUND(Reference!X7,1))","v":""},{"$f":"IF(OR(ISERROR(ROUND(Reference!Y7,1)),Reference!Y7=\"\",Reference!Y7=0),\"\",ROUND(Reference!Y7,1))","v":""}]
[null,"Lift 2:",null,null,{"$f":"IF(OR(ISERROR(ROUND(Reference!R8,1)),Reference!R8=\"\",Reference!R8=0),\"\",ROUND(Reference!R8,1))","v":""},{"$f":"IF(OR(ISERROR(ROUND(Reference!S8,1)),Reference!S8=\"\",Reference!S8=0),\"\",ROUND(Reference!S8,1))","v":""},{"$f":"IF(OR(ISERROR(ROUND(Reference!T8,1)),Reference!T8=\"\",Reference!T8=0),\"\",ROUND(Reference!T8,1))","v":""},{"$f":"IF(OR(ISERROR(ROUND(Reference!U8,1)),Reference!U8=\"\",Reference!U8=0),\"\",ROUND(Reference!U8,1))","v":""},{"$f":"IF(OR(ISERROR(ROUND(Reference!V8,1)),Reference!V8=\"\",Reference!V8=0),\"\",ROUND(Reference!V8,1))","v":""},{"$f":"IF(OR(ISERROR(ROUND(Reference!W8,1)),Reference!W8=\"\",Reference!W8=0),\"\",ROUND(Reference!W8,1))","v":""},{"$f":"IF(OR(ISERROR(ROUND(Reference!X8,1)),Reference!X8=\"\",Reference!X8=0),\"\",ROUND(Reference!X8,1))","v":""},{"$f":"IF(OR(ISERROR(ROUND(Reference!Y8,1)),Reference!Y8=\"\",Reference!Y8=0),\"\",ROUND(Reference!Y8,1))","v":""}]
[null,"Lift 3:",null,null,{"$f":"IF(OR(ISERROR(ROUND(Reference!R9,1)),Reference!R9=\"\",Reference!R9=0),\"\",ROUND(Reference!R9,1))","v":""},{"$f":"IF(OR(ISERROR(ROUND(Reference!S9,1)),Reference!S9=\"\",Reference!S9=0),\"\",ROUND(Reference!S9,1))","v":""},{"$f":"IF(OR(ISERROR(ROUND(Reference!T9,1)),Reference!T9=\"\",Reference!T9=0),\"\",ROUND(Reference!T9,1))","v":""},{"$f":"IF(OR(ISERROR(ROUND(Reference!U9,1)),Reference!U9=\"\",Reference!U9=0),\"\",ROUND(Reference!U9,1))","v":""},{"$f":"IF(OR(ISERROR(ROUND(Reference!V9,1)),Reference!V9=\"\",Reference!V9=0),\"\",ROUND(Reference!V9,1))","v":""},{"$f":"IF(OR(ISERROR(ROUND(Reference!W9,1)),Reference!W9=\"\",Reference!W9=0),\"\",ROUND(Reference!W9,1))","v":""},{"$f":"IF(OR(ISERROR(ROUND(Reference!X9,1)),Reference!X9=\"\",Reference!X9=0),\"\",ROUND(Reference!X9,1))","v":""},{"$f":"IF(OR(ISERROR(ROUND(Reference!Y9,1)),Reference!Y9=\"\",Reference!Y9=0),\"\",ROUND(Reference!Y9,1))","v":""}]
[null,"Lift 4:",null,null,{"$f":"IF(OR(ISERROR(ROUND(Reference!R10,1)),Reference!R10=\"\",Reference!R10=0),\"\",ROUND(Reference!R10,1))","v":""},{"$f":"IF(OR(ISERROR(ROUND(Reference!S10,1)),Reference!S10=\"\",Reference!S10=0),\"\",ROUND(Reference!S10,1))","v":""},{"$f":"IF(OR(ISERROR(ROUND(Reference!T10,1)),Reference!T10=\"\",Reference!T10=0),\"\",ROUND(Reference!T10,1))","v":""},{"$f":"IF(OR(ISERROR(ROUND(Reference!U10,1)),Reference!U10=\"\",Reference!U10=0),\"\",ROUND(Reference!U10,1))","v":""},{"$f":"IF(OR(ISERROR(ROUND(Reference!V10,1)),Reference!V10=\"\",Reference!V10=0),\"\",ROUND(Reference!V10,1))","v":""},{"$f":"IF(OR(ISERROR(ROUND(Reference!W10,1)),Reference!W10=\"\",Reference!W10=0),\"\",ROUND(Reference!W10,1))","v":""},{"$f":"IF(OR(ISERROR(ROUND(Reference!X10,1)),Reference!X10=\"\",Reference!X10=0),\"\",ROUND(Reference!X10,1))","v":""},{"$f":"IF(OR(ISERROR(ROUND(Reference!Y10,1)),Reference!Y10=\"\",Reference!Y10=0),\"\",ROUND(Reference!Y10,1))","v":""}]
[]
[null,"SCA Drop Data",null,null,"Avg. Drop Ht. (in)","Blows","Avg. Drop Ht.(in)","Blows","Avg. Drop Ht.(in)","Blows","Avg. Drop Ht.(in)","Blows"]
[null,"Lift 1:",null,null,{"$f":"IF(OR(ISERROR(ROUND(Reference!R14,2)),Reference!R14=\"\",Reference!R14=0),\"\",ROUND(Reference!R14,2))","v":""},{"$f":"IF(OR(ISERROR(ROUND(Reference!S14,2)),Reference!S14=\"\",Reference!S14=0),\"\",ROUND(Reference!S14,2))","v":""},{"$f":"IF(OR(ISERROR(ROUND(Reference!T14,2)),Reference!T14=\"\",Reference!T14=0),\"\",ROUND(Reference!T14,2))","v":""},{"$f":"IF(OR(ISERROR(ROUND(Reference!U14,2)),Reference!U14=\"\",Reference!U14=0),\"\",ROUND(Reference!U14,2))","v":""},{"$f":"IF(OR(ISERROR(ROUND(Reference!V14,2)),Reference!V14=\"\",Reference!V14=0),\"\",ROUND(Reference!V14,2))","v":""},{"$f":"IF(OR(ISERROR(ROUND(Reference!W14,2)),Reference!W14=\"\",Reference!W14=0),\"\",ROUND(Reference!W14,2))","v":""},{"$f":"IF(OR(ISERROR(ROUND(Reference!X14,2)),Reference!X14=\"\",Reference!X14=0),\"\",ROUND(Reference!X14,2))","v":""},{"$f":"IF(OR(ISERROR(ROUND(Reference!Y14,2)),Reference!Y14=\"\",Reference!Y14=0),\"\",ROUND(Reference!Y14,2))","v":""}]
[null,"Lift 2:",null,null,{"$f":"IF(OR(ISERROR(ROUND(Reference!R15,2)),Reference!R15=\"\",Reference!R15=0),\"\",ROUND(Reference!R15,2))","v":""},{"$f":"IF(OR(ISERROR(ROUND(Reference!S15,2)),Reference!S15=\"\",Reference!S15=0),\"\",ROUND(Reference!S15,2))","v":""},{"$f":"IF(OR(ISERROR(ROUND(Reference!T15,2)),Reference!T15=\"\",Reference!T15=0),\"\",ROUND(Reference!T15,2))","v":""},{"$f":"IF(OR(ISERROR(ROUND(Reference!U15,2)),Reference!U15=\"\",Reference!U15=0),\"\",ROUND(Reference!U15,2))","v":""},{"$f":"IF(OR(ISERROR(ROUND(Reference!V15,2)),Reference!V15=\"\",Reference!V15=0),\"\",ROUND(Reference!V15,2))","v":""},{"$f":"IF(OR(ISERROR(ROUND(Reference!W15,2)),Reference!W15=\"\",Reference!W15=0),\"\",ROUND(Reference!W15,2))","v":""},{"$f":"IF(OR(ISERROR(ROUND(Reference!X15,2)),Reference!X15=\"\",Reference!X15=0),\"\",ROUND(Reference!X15,2))","v":""},{"$f":"IF(OR(ISERROR(ROUND(Reference!Y15,2)),Reference!Y15=\"\",Reference!Y15=0),\"\",ROUND(Reference!Y15,2))","v":""}]
[null,"Lift 3:",null,null,{"$f":"IF(OR(ISERROR(ROUND(Reference!R16,2)),Reference!R16=\"\",Reference!R16=0),\"\",ROUND(Reference!R16,2))","v":""},{"$f":"IF(OR(ISERROR(ROUND(Reference!S16,2)),Reference!S16=\"\",Reference!S16=0),\"\",ROUND(Reference!S16,2))","v":""},{"$f":"IF(OR(ISERROR(ROUND(Reference!T16,2)),Reference!T16=\"\",Reference!T16=0),\"\",ROUND(Reference!T16,2))","v":""},{"$f":"IF(OR(ISERROR(ROUND(Reference!U16,2)),Reference!U16=\"\",Reference!U16=0),\"\",ROUND(Reference!U16,2))","v":""},{"$f":"IF(OR(ISERROR(ROUND(Reference!V16,2)),Reference!V16=\"\",Reference!V16=0),\"\",ROUND(Reference!V16,2))","v":""},{"$f":"IF(OR(ISERROR(ROUND(Reference!W16,2)),Reference!W16=\"\",Reference!W16=0),\"\",ROUND(Reference!W16,2))","v":""},{"$f":"IF(OR(ISERROR(ROUND(Reference!X16,2)),Reference!X16=\"\",Reference!X16=0),\"\",ROUND(Reference!X16,2))","v":""},{"$f":"IF(OR(ISERROR(ROUND(Reference!Y16,2)),Reference!Y16=\"\",Reference!Y16=0),\"\",ROUND(Reference!Y16,2))","v":""}]
[null,"Lift 4:",null,null,{"$f":"IF(OR(ISERROR(ROUND(Reference!R17,2)),Reference!R17=\"\",Reference!R17=0),\"\",ROUND(Reference!R17,2))","v":""},{"$f":"IF(OR(ISERROR(ROUND(Reference!S17,2)),Reference!S17=\"\",Reference!S17=0),\"\",ROUND(Reference!S17,2))","v":""},{"$f":"IF(OR(ISERROR(ROUND(Reference!T17,2)),Reference!T17=\"\",Reference!T17=0),\"\",ROUND(Reference!T17,2))","v":""},{"$f":"IF(OR(ISERROR(ROUND(Reference!U17,2)),Reference!U17=\"\",Reference!U17=0),\"\",ROUND(Reference!U17,2))","v":""},{"$f":"IF(OR(ISERROR(ROUND(Reference!V17,2)),Reference!V17=\"\",Reference!V17=0),\"\",ROUND(Reference!V17,2))","v":""},{"$f":"IF(OR(ISERROR(ROUND(Reference!W17,2)),Reference!W17=\"\",Reference!W17=0),\"\",ROUND(Reference!W17,2))","v":""},{"$f":"IF(OR(ISERROR(ROUND(Reference!X17,2)),Reference!X17=\"\",Reference!X17=0),\"\",ROUND(Reference!X17,2))","v":""},{"$f":"IF(OR(ISERROR(ROUND(Reference!Y17,2)),Reference!Y17=\"\",Reference!Y17=0),\"\",ROUND(Reference!Y17,2))","v":""}]
[]
[null,"Unconfined Strength Data (psi):"]
[null,"Percent Strain (%):"]
[]
[null,"Max Dry Density, (pcf):",null,null,{"$f":"IF(ISERROR(IF(AND(E23>0,E24>0),Reference!C5,IF(K49>0,Reference!C5,\"Need SG\"))),\"\",IF(AND(E23>0,E24>0),Reference!C5,IF(K49>0,Reference!C5,\"Need SG\")))","v":""}]
[null,"Max Density, (kg/m3):",null,null,{"$f":"IF(ISERROR(E83*(0.4536/0.02832)),\"\",E83*(0.4536/0.02832))","v":""}]
[null,"Optimum Moisture Content, (%):",null,null,{"$f":"IF(ISERROR(Reference!C6),\"\",Reference!C6)","v":""}]
[null,"M-D Graph R2 Value:",null,null,{"$f":"IF(ISERROR(Reference!C7),\"\",Reference!C7)","v":""}]
[]
[null,"Remarks:",{"$f":"NOW()","v":"2024-06-05T15:47:34.760"}]
[]
[]
[]
[]
[]
[null,"Sample Method:","Sampled By:",null,null,"Sampled Date:"]
[null,"TX100"]
[]
[null,"TX400"]
[]
[null,"Test Method:","Tested By:",null,null,"Tech Cert No:","Tested Date:"]
[null,"TX113"]
[]
[null,"TX114"]
[null,"Test Stamp Code:",null,null,"Omit Test:","Completed Date:",null,null,"Reviewed By:"]
[]
[null,"Locked By:","TxDOT:","District:","Area:"]
[null,"","","",""]
[null,"Authorized By:",null,null,"Authorized Date:"]
[null,null,null,null,null,{"$f":"IF(OR(authorizeddate>41091,authorizeddate=\"\"),IF(COUNTBLANK(E55:L58)+COUNTBLANK(E61:L64)=64,4,3),IF(authorizeddate>40225,\"3\",IF(authorizeddate>38257,\"2\",\"1\")))","v":4}]

{"sheet":"Reference","index":1,"n_rows":196,"n_cols":28,"rows_kept":196,"cut":false,"hidden":true,"merged":[[24,1,24,2],[8,1,8,2],[1,16,1,24],[4,16,4,24],[11,16,11,24],[1,1,1,13],[18,10,18,13],[3,23,3,24],[3,10,3,13],[3,1,3,2],[14,1,14,2],[12,1,12,2],[3,17,3,18],[14,4,14,5],[20,16,21,16],[12,10,12,13],[24,4,24,5],[3,7,3,8],[3,4,3,5],[24,7,24,8],[27,16,27,20],[3,19,3,20],[18,16,18,21],[3,21,3,22],[22,16,23,16],[24,16,25,16],[28,16,28,17],[33,16,33,17],[32,16,32,17],[31,16,31,17],[37,23,37,24],[29,16,30,16],[57,16,57,17],[38,26,38,27],[35,16,35,27],[48,23,48,24],[52,16,52,17],[55,16,55,17],[45,16,45,17],[42,16,43,16],[37,20,37,21]]}
[]
[null,"M-D Graph Reference Data and Calculations",null,null,null,null,null,null,null,null,null,null,null,null,null,null,"SCA Reference Data"]
[]
[null,"Test Results",null,null,"M-D Curve Graph Limits",null,null,"M-D Graph Limit boundaries",null,null,"Best-Fit Line Coefficient Reference Data",null,null,null,null,null,null,"Specimen 1",null,"Specimen 2",null,"Specimen 3",null,"Specimen 4"]
[null,"Max Dry Density",{"$f":"C12*C6^2+C11*C6+C10","v":{"$error":"#DIV/0!"}},null,"Min Moisture",{"$f":"MIN('Tex-113,4-E'!$E$50:$L$50)","v":0},null,"X","Y",null,"N","Y","X","X^2",null,null,"SCA Energy Data"]
[null,"Opt Moist Content",{"$f":"-C11/(2*C12)","v":{"$error":"#DIV/0!"}},null,"Max Moisture",{"$f":"MAX('Tex-113,4-E'!$E$50:$L$50)","v":0},null,{"$f":"F10","v":0},{"$f":"F13","v":0},null,1,{"$f":"N('Tex-113,4-E'!E51)","v":0},{"$f":"N('Tex-113,4-E'!E50)","v":0},{"$f":"M6^2","v":0},null,null,"Lift","Total Energy ","Avg Energy/Blow","Total Energy ","Avg Energy/Blow","Total Energy ","Avg Energy/Blow","Total Energy ","Avg Energy/Blow"]
[null,"R^2",{"$f":"ROUND(RSQ(B17:B20,C17:C20),4)","v":{"$error":"#DIV/0!"}},null,"Min Density",{"$f":"MIN('Tex-113,4-E'!E51:L51)","v":0},null,{"$f":"F10","v":0},{"$f":"F12","v":2},null,2,{"$f":"N('Tex-113,4-E'!G51)","v":0},{"$f":"N('Tex-113,4-E'!G50)","v":0},{"$f":"M7^2","v":0},null,null,1,{"$f":"TRANSPOSE('SCA-Data'!D18:G18)","v":0},{"$f":"TRANSPOSE('SCA-Data'!D19:G19)","v":0},{"$f":"TRANSPOSE('SCA-Data'!K18:N18)","v":0},{"$f":"TRANSPOSE('SCA-Data'!K19:N19)","v":0},{"$f":"TRANSPOSE('SCA-Data'!R18:U18)","v":0},{"$f":"TRANSPOSE('SCA-Data'!R19:U19)","v":0},{"$f":"TRANSPOSE('SCA-Data'!Y18:AB18)","v":0},{"$f":"TRANSPOSE('SCA-Data'!Y19:AB19)","v":0}]
[null,null,null,null,"Max Density",{"$f":"MAX('Tex-113,4-E'!E51:L51)","v":0},null,{"$f":"F10","v":0},{"$f":"I7","v":2},null,3,{"$f":"N('Tex-113,4-E'!I51)","v":0},{"$f":"N('Tex-113,4-E'!I50)","v":0},{"$f":"M8^2","v":0},null,null,2,0,0,0,0,0,0,0,0]
[null,"Best Fit Line Coefficients",null,null,"Maximum Value, x-axis",{"$f":"MROUND(F6+1,1)","v":1},null,{"$f":"F9","v":1},{"$f":"I8","v":2},null,4,{"$f":"IF(AND(L8>0,N('Tex-113,4-E'!K49)=0),N22,N('Tex-113,4-E'!K51))","v":0},{"$f":"IF(AND(M8>0,N('Tex-113,4-E'!K49)=0),N15+2,N('Tex-113,4-E'!K50))","v":0},{"$f":"M9^2","v":0},null,null,3,0,0,0,0,0,0,0,0]
[null,"A0",{"$f":"INDEX(LINEST($L$6:$L$9,$M$6:$N$9),3)","v":0},null,"Minimum Value, x-axis",{"$f":"IF(ISERROR(MROUND(F5-1,1)),0,MROUND(F5-1,1))","v":0},null,{"$f":"H9","v":1},{"$f":"I9","v":2},null,5,{"$f":"N16","v":{"$error":"#DIV/0!"}},{"$f":"$N$15","v":{"$error":"#DIV/0!"}},{"$f":"M10^2","v":{"$error":"#DIV/0!"}},null,null,4,0,0,0,0,0,0,0,0]
[null,"A1",{"$f":"INDEX(LINEST($L$6:$L$9,$M$6:$N$9),2)","v":0},null,"Scale",{"$f":"(F9-F10)/150","v":6.6666666666670002E-3},null,{"$f":"H10","v":1},{"$f":"I6","v":0},null,"SUM",{"$f":"SUM(L8:L10)","v":{"$error":"#DIV/0!"}},{"$f":"SUM(M8:M10)","v":{"$error":"#DIV/0!"}},{"$f":"SUM(N6:N10)","v":{"$error":"#DIV/0!"}}]
[null,"A2",{"$f":"INDEX(LINEST($L$6:$L$9,$M$6:$N$9),1)","v":0},null,"Maximum Value, y-axis",{"$f":"ROUND(F8,0)+2","v":2},null,{"$f":"H6","v":0},{"$f":"I11","v":0},null,null,null,null,null,null,null,"SCA Drop Data"]
[null,{"$f":"\"y = \"&ROUND(C12,3)&\"x^2 + \"&ROUND(C11,3)&\"x + \" &ROUND(C10,3)","v":"y = 0x^2 + 0x + 0"},null,null,"Minimum Value, y-axis",{"$f":"IF(ROUND(F7,0)-2<0,0,ROUND(F7,0)-2)","v":0},null,{"$f":"H11","v":1},{"$f":"I12","v":0},null,"??? Fifth Point & MDD/OMC Calculation ???",null,null,null,null,null,"Lift","Avg. Drop Ht.","Blows","Avg. Drop Ht.","Blows","Avg. Drop Ht.","Blows","Avg. Drop Ht.","Blows"]
[null,null,null,null,null,null,null,null,null,null,"m1",{"$f":"(L7-L6)/(M7-M6)","v":{"$error":"#DIV/0!"}},null,null,null,null,1,{"$f":"TRANSPOSE('SCA-Data'!D21:G21)","v":0},{"$f":"TRANSPOSE('SCA-Data'!D17:G17)","v":0},{"$f":"TRANSPOSE('SCA-Data'!K21:N21)","v":0},{"$f":"TRANSPOSE('SCA-Data'!K17:N17)","v":0},{"$f":"TRANSPOSE('SCA-Data'!R21:U21)","v":0},{"$f":"TRANSPOSE('SCA-Data'!R17:U17)","v":0},{"$f":"TRANSPOSE('SCA-Data'!Y21:AB21)","v":0},{"$f":"TRANSPOSE('SCA-Data'!Y17:AB17)","v":0}]
[null,"R^2 Calculations",null,null,"M-D Curve Begin & End Points",null,null,null,null,null,"b1",{"$f":"L6-L14*M6","v":{"$error":"#DIV/0!"}},"X-Peak",{"$f":"(L17-L15)/(L14-L16)","v":{"$error":"#DIV/0!"}},null,null,2,0,0,0,0,0,0,0,0]
[null,"Y-Known","Y-Calculated",null,"Dry End Moisture",{"$f":"IF(ISERROR(((-C11)+(SQRT((C11^2)-(4*C12*(C10-F13)))))/(2*C12)),0,((-C11)+(SQRT((C11^2)-(4*C12*(C10-F13)))))/(2*C12))","v":0},null,null,null,null,"m2",{"$f":"IF(AND(L8>0,N('Tex-113,4-E'!K49)=0),L14*-1,(L9-L8)/(M9-M8))","v":{"$error":"#DIV/0!"}},"Y-Peak",{"$f":"L14*N15+L15","v":{"$error":"#DIV/0!"}},null,null,3,0,0,0,0,0,0,0,0]
[null,{"$f":"L6","v":0},{"$f":"($C$12*(VLOOKUP(B17,$L$5:$M$10,2,FALSE))^2)+($C$11*(VLOOKUP(B17,$L$5:$M$10,2,FALSE)))+$C$10","v":0},null,"Wet End Moisture",{"$f":"IF(ISERROR(((-C11)-(SQRT((C11^2)-(4*C12*(C10-F13)))))/(2*C12)),0,((-C11)-(SQRT((C11^2)-(4*C12*(C10-F13)))))/(2*C12))","v":0},null,null,null,null,"b2",{"$f":"L8-M8*L16","v":{"$error":"#DIV/0!"}},null,null,null,null,4,0,0,0,0,0,0,0,0]
[null,{"$f":"L7","v":0},{"$f":"($C$12*(VLOOKUP(B18,$L$5:$M$10,2,FALSE))^2)+($C$11*(VLOOKUP(B18,$L$5:$M$10,2,FALSE)))+$C$10","v":0}]
[null,{"$f":"L8","v":0},{"$f":"($C$12*(VLOOKUP(B19,$L$5:$M$10,2,FALSE))^2)+($C$11*(VLOOKUP(B19,$L$5:$M$10,2,FALSE)))+$C$10","v":0},null,null,null,null,null,null,null,"??? 3-Point Curve Reference Data ???",null,null,null,null,null,"SCA Data Limit"]
[null,{"$f":"L9","v":0},{"$f":"($C$12*(VLOOKUP(B20,$L$5:$M$10,2,FALSE))^2)+($C$11*(VLOOKUP(B20,$L$5:$M$10,2,FALSE)))+$C$10","v":0},null,null,null,null,null,null,null,null,"3pt Curve (1-Yes, 0-No) =  ",{"$f":"IF(N('Tex-113,4-E'!K36)=0,1,0)","v":1},null,null,null,"Limit","X","Y, Total Energy","Y, Drop Height","Y, Blows","Y, Energy/ Blow"]
[null,null,null,null,null,null,null,null,null,null,"mZAV=",{"$f":"(M25-M52)/(K25-K52)","v":-2.1094543851851899},"b4th=",{"$f":"L8-L21*M8","v":0},null,null,"Upper",1,{"$f":"S22","v":765},{"$f":"T22","v":18.5},{"$f":"U22","v":60},{"$f":"V22","v":15.3}]
[null,null,null,null,null,null,null,null,null,null,"bZAV=",{"$f":"M25-L21*K25","v":164.46226874148201},"Y4th=",{"$f":"L21*M9+N21","v":0},null,null,null,4,{"$f":"S23+15","v":765},{"$f":"T23+0.5","v":18.5},{"$f":"U23+10","v":60},{"$f":"MAX(U32:U34)","v":15.3}]
[null,null,null,null,"Gs=",{"$f":"IF(OR('Tex-113,4-E'!E24=\"\",'Tex-113,4-E'!E23=\"\",'Tex-113,4-E'!E22=\"\"),IF('Tex-113,4-E'!E26=\"\",2.65,N('Tex-113,4-E'!E26)),N('Tex-113,4-E'!E26))","v":2.65},null,null,null,null,null,null,null,null,null,null,"Ideal",1,750,18,50,{"$f":"T32","v":15}]
[null,null,null,null,"γw=",62.5,null,"Closest point to Max y-Scale",{"$f":"INDEX(H26:H176,MATCH(MIN(ABS(H26:H176-F12)),ABS(H26:H176-F12),0))","v":161.349245007306},null,"W","Dry Density","ZAV",null,null,null,null,4,750,18,50,{"$f":"T32","v":15}]
[null,"M_D Best-fit Plot within scale",null,null,"ZAV Plot within scale",null,null,"ZAV - Reference Data",null,null,{"$f":"IF(M20=1,N('Tex-113,4-E'!I50)+8,N('Tex-113,4-E'!K50)+8)","v":8},{"$f":"$C$10+$C$11*K25+$C$12*K25^2","v":0},{"$f":"IF(version<\"3\",($F$23*$F$24*(1+(K25/100)))/(1+$F$23*(K25/100)),($F$23*$F$24)/(1+$F$23*(K25/100)))","v":147.58663365999999},null,null,null,"Lower",1,{"$f":"S24-15","v":735},{"$f":"T24-0.5","v":17.5},{"$f":"U24","v":50},{"$f":"MIN(S32:S34)","v":12.25}]
[null,{"$f":"IF(F16<F10,F10,F16)","v":0},{"$f":"$C$10+$C$11*B26+$C$12*B26^2","v":0},null,{"$f":"VLOOKUP(I24,H26:I176,2)","v":1},{"$f":"IF(version<3,($F$23*$F$24*(1+(E26/100)))/(1+$F$23*(E26/100)),($F$23*$F$24)/(1+$F$23*(E26/100)))","v":161.349245007306},null,{"$f":"IF(version<3,($F$23*$F$24*(1+(I26/100)))/(1+$F$23*(I26/100)),($F$23*$F$24)/(1+$F$23*(I26/100)))","v":161.349245007306},{"$f":"F9","v":1},null,{"$f":"K25-0.2","v":7.8},0,147.96034639999999,null,null,null,null,4,{"$f":"S25","v":735},{"$f":"T25","v":17.5},{"$f":"U25","v":50},{"$f":"V25","v":12.25}]
[null,{"$f":"IF(B26+$F$11<=MIN($F$9,$F$17),B26+$F$11,B26)","v":0},0,null,{"$f":"IF(E26+$F$11<=$F$9,E26+$F$11,E26)","v":1},161.349245007306,null,161.377018938151,{"$f":"I26-$F$11","v":0.99333333333333296},null,{"$f":"K26-0.2","v":7.6},0,148.33735641999999]
[null,{"$f":"IF(B27+$F$11<=$F$9,B27+$F$11,B27)","v":6.6666666666670002E-3},0,null,{"$f":"IF(E27+$F$11<=$F$9,E27+$F$11,E27)","v":1},161.349245007306,null,161.404802432401,0.98666666666666603,null,{"$f":"K27-0.2","v":7.4},0,148.71770755,null,null,null,"Energy Levels to Achieve Total Energy with Defined Blow Limits"]
[null,1.3333333333334E-2,0,null,1,161.349245007306,null,161.43259549499501,0.97999999999999898,null,{"$f":"K28-0.2","v":7.2},0,149.10144441,null,null,null,"Limit Boundary",null,"Low","Ideal","High"]
[null,2.0000000000001E-2,0,null,1,161.349245007306,null,161.46039813087799,0.97333333333333205,null,{"$f":"K29-0.2","v":7},0,149.48861239999999,null,null,null,"Defined\nLimits","Total Energy",{"$f":"T30-15","v":735},750,{"$f":"T30+15","v":765}]
[null,2.6666666666668001E-2,0,null,1,161.349245007306,null,161.48821034499599,0.96666666666666501,null,{"$f":"K30-0.2","v":6.8},0,149.87925774999999,null,null,null,null,"Blow",50,50,60]
[null,3.3333333333334998E-2,0,null,1,161.349245007306,null,161.51603214229999,0.95999999999999797,null,6.6,0,150.27342752999999,null,null,null,"Energy/Blow, with ideal number of blows",null,{"$f":"S30/T31","v":14.7},{"$f":"T30/T31","v":15},{"$f":"U30/T31","v":15.3}]
[null,4.0000000000001999E-2,0,null,1,161.349245007306,null,161.54386352774401,0.95333333333333103,null,6.4,0,150.67116963000001,null,null,null,"Energy/Blow, with lowest number of blows",null,{"$f":"S30/S31","v":14.7},{"$f":"T30/S31","v":15},{"$f":"U30/S31","v":15.3}]
[null,4.6666666666669E-2,0,null,1,161.349245007306,null,161.57170450628601,0.94666666666666399,null,6.2,0,151.07253284999999,null,null,null,"Energy/Blow, with highest number of blows",null,{"$f":"S30/U31","v":12.25},{"$f":"T30/U31","v":12.5},{"$f":"U30/U31","v":12.75}]
[null,5.3333333333336001E-2,0,null,1,161.349245007306,null,161.59955508288499,0.93999999999999695,null,6,0,151.47756687]
[null,6.0000000000003002E-2,0,null,1,161.349245007306,null,161.62741526250699,0.93333333333333002,null,5.8,0,151.88632226999999,null,null,null,"UCS Reference Data"]
[null,6.6666666666669996E-2,0,null,1,161.349245007306,null,161.65528505011901,0.92666666666666297,null,5.6,0,152.29885057000001]
[null,7.3333333333336997E-2,0,null,1,161.349245007306,null,161.683164450692,0.91999999999999604,null,5.4,0,152.71520426999999,null,null,null,"Specimen","Moisture Content","UCS",null,"M_D Best-fit Plot within scale",null,null,"UCS Graph Limits",null,null,"Closest point to Max y-Scale",{"$f":"INDEX(AA40:AA190,MATCH(MIN(ABS(AA40:AA190-Y46)),ABS(AA40:AA190-Y46),0))","v":0}]
[null,8.0000000000003998E-2,0,null,1,161.349245007306,null,161.71105346920001,0.913333333333329,null,5.2,0,153.13543680999999,null,null,null,1,{"$f":"M6","v":0},{"$f":"_UCS1","v":0},null,{"$f":"(AB38-R54)/R55","v":{"$error":"#DIV/0!"}},{"$f":"($R$55*U39)+$R$54","v":{"$error":"#DIV/0!"}},null,"Min Moisture",{"$f":"MIN(R39:R42)","v":0},null,"ZAV - Reference Data"]
[null,8.6666666666670999E-2,0,null,1,161.349245007306,null,161.73895211062199,0.90666666666666196,null,5,0,153.55960264999999,null,null,null,2,{"$f":"M7","v":0},{"$f":"_UCS2","v":0},null,{"$f":"U39+$U$60","v":{"$error":"#DIV/0!"}},{"$f":"($R$55*U40)+$R$54","v":{"$error":"#DIV/0!"}},null,"Max Moisture",{"$f":"MAX(R39:R42)","v":0},null,{"$f":"($R$55*AB40)+$R$54","v":0},{"$f":"Y44","v":0}]
[null,9.3333333333338001E-2,0,null,1,161.349245007306,null,161.76686037993801,0.89999999999999503,null,4.8,0,153.98775727,null,null,null,3,{"$f":"M8","v":0},{"$f":"_UCS3","v":0},null,{"$f":"U40+$U$60","v":{"$error":"#DIV/0!"}},{"$error":"#DIV/0!"},null,"Min UCS",{"$f":"MIN(S39:S42)","v":0},null,{"$f":"($R$55*AB41)+$R$54","v":0},{"$f":"AB40+$Y$45","v":6.6666666666670002E-3}]
[null,0.100000000000005,0,null,1,161.349245007306,null,161.79477828213399,0.89333333333332798,null,4.5999999999999996,0,154.41995721999999,null,null,null,4,{"$f":"M9","v":0},{"$f":"_UCS4","v":0},null,{"$error":"#DIV/0!"},{"$error":"#DIV/0!"},null,"Max UCS",{"$f":"MAX(S39:S42)","v":0},null,0,{"$f":"AB41+$Y$45","v":1.3333333333334E-2}]
[null,0.106666666666672,0,null,1,161.349245007306,null,161.822705822198,0.88666666666666105,null,4.4000000000000004,0,154.85626008,null,null,null,"OMC",{"$f":"C6","v":{"$error":"#DIV/0!"}},{"$f":"MIN(Y51:Y58)","v":0},null,{"$error":"#DIV/0!"},{"$error":"#DIV/0!"},null,"Maximum Value, x-axis",{"$f":"MROUND(Y40+1,1)","v":1},null,0,2.0000000000001E-2]
[null,0.113333333333339,0,null,1,161.349245007306,null,161.85064300512099,0.87999999999999401,null,4.2,0,155.29672456,null,null,null,null,{"$f":"R43","v":{"$error":"#DIV/0!"}},{"$f":"MAX(Y51:Y58)","v":2},null,{"$error":"#DIV/0!"},{"$error":"#DIV/0!"},null,"Minimum Value, x-axis",{"$f":"IF(ISERROR(MROUND(Y39-1,1)),0,MROUND(Y39-1,1))","v":0},null,0,2.6666666666668001E-2]
[null,0.120000000000006,0,null,1,161.349245007306,null,161.878589835898,0.87333333333332697,null,4,0,155.74141048999999,null,null,null,null,null,null,null,{"$error":"#DIV/0!"},{"$error":"#DIV/0!"},null,"Scale",{"$f":"(Y43-Y44)/150","v":6.6666666666670002E-3},null,0,3.3333333333334998E-2]
[null,{"$f":"IF(B45+$F$11<=$F$9,B45+$F$11,B45)","v":0.12666666666667301},0,null,1,161.349245007306,null,161.90654631952799,0.86666666666666003,null,3.8,0,156.19037885,null,null,null,"UCS Data",null,null,null,{"$error":"#DIV/0!"},{"$error":"#DIV/0!"},null,"Maximum Value, y-axis",{"$f":"ROUND(Y42,0)+2","v":2},null,0,4.0000000000001999E-2]
[null,0.13333333333333999,0,null,1,161.349245007306,null,161.93451246101401,0.85999999999999299,null,3.6,0,156.6436918,null,null,null,"Y","X",null,null,{"$error":"#DIV/0!"},{"$error":"#DIV/0!"},null,"Minimum Value, y-axis",{"$f":"IF(ROUND(Y41,0)-2<0,0,ROUND(Y41,0)-2)","v":0},null,0,4.6666666666669E-2]
[null,0.14000000000000701,0,null,1,161.349245007306,null,161.96248826535901,0.85333333333332595,null,3.4,0,157.10141271000001,null,null,null,{"$f":"_UCS1","v":0},{"$f":"N('Tex-113,4-E'!E50)","v":0},null,null,{"$error":"#DIV/0!"},{"$error":"#DIV/0!"},null,null,null,null,0,5.3333333333336001E-2]
[null,0.14666666666667399,0,null,1,161.349245007306,null,161.990473737575,0.84666666666665902,null,3.2,0,157.56360619,null,null,null,{"$f":"_UCS2","v":0},{"$f":"N('Tex-113,4-E'!G50)","v":0},null,null,{"$error":"#DIV/0!"},{"$error":"#DIV/0!"},null,"UCS Graph Limit Boundaries",null,null,0,6.0000000000003002E-2]
[null,0.15333333333334101,0,null,1,161.349245007306,null,162.01846888267201,0.83999999999999198,null,3,0,158.03033812000001,null,null,null,{"$f":"_UCS3","v":0},{"$f":"N('Tex-113,4-E'!I50)","v":0},null,null,{"$error":"#DIV/0!"},{"$error":"#DIV/0!"},null,"X","Y",null,0,6.6666666666669996E-2]
[null,0.160000000000008,0,null,1,161.349245007306,null,162.04647370566701,0.83333333333332504,null,2.8,0,158.50167567,null,null,null,{"$f":"_UCS4","v":0},{"$f":"N('Tex-113,4-E'!K50)","v":0},null,null,{"$error":"#DIV/0!"},{"$error":"#DIV/0!"},null,{"$f":"Y44","v":0},{"$f":"Y47","v":0},null,0,7.3333333333336997E-2]
[null,0.16666666666667501,0,null,1,161.349245007306,null,162.074488211578,0.826666666666658,null,2.6,0,158.97768733999999,null,null,null,null,null,null,null,{"$error":"#DIV/0!"},{"$error":"#DIV/0!"},null,{"$f":"Y44","v":0},{"$f":"Y46","v":2},null,0,8.0000000000003998E-2]
[null,0.173333333333342,0,null,1,161.349245007306,null,162.10251240542999,0.81999999999999096,null,2.4,0,159.45844302,null,null,null,"Best Fit Line Coefficients",null,null,null,{"$error":"#DIV/0!"},{"$error":"#DIV/0!"},null,{"$f":"Y44","v":0},{"$f":"Y52","v":2},null,0,8.6666666666670999E-2]
[null,0.18000000000000899,0,null,1,161.349245007306,null,162.130546292248,0.81333333333332403,null,2.2000000000000002,0,159.94401397999999,null,null,null,"A1",{"$f":"INDEX(LINEST($Q$48:$Q$51,$R$48:$R$51),2)","v":0},null,null,{"$f":"U53+$U$60","v":{"$error":"#DIV/0!"}},{"$error":"#DIV/0!"},null,{"$f":"Y43","v":1},{"$f":"Y53","v":2},null,0,9.3333333333338001E-2]
[null,0.186666666666676,0,null,1,161.349245007306,null,162.15858987706099,0.80666666666665698,null,2,0,160.43447293,null,null,null,"A2",{"$f":"INDEX(LINEST($Q$48:$Q$51,$R$48:$R$51),1)","v":0},null,null,{"$f":"IF(U54+$U$60>$R$60,U54,U54+$U$60)","v":{"$error":"#DIV/0!"}},{"$error":"#DIV/0!"},null,{"$f":"X54","v":1},{"$f":"Y54","v":2},null,0,0.100000000000005]
[null,0.19333333333334299,0,null,1,161.349245007306,null,162.18664316490401,0.79999999999999005,null,1.8,0,160.92989405,null,null,null,{"$f":"\"y = \"&ROUND(R55,3)&\"x + \"&ROUND(R54,3)","v":"y = 0x + 0"},null,null,null,{"$f":"IF(U55+$U$60>$R$60,U55,U55+$U$60)","v":{"$error":"#DIV/0!"}},{"$error":"#DIV/0!"},null,{"$f":"X55","v":1},{"$f":"Y51","v":0},null,0,0.106666666666672]
[null,0.20000000000001,0,null,1,161.349245007306,null,162.21470616081299,0.79333333333332301,null,1.6,{"$f":"$C$10+$C$11*K57+$C$12*K57^2","v":0},{"$f":"IF(version<\"3\",($F$23*$F$24*(1+(K57/100)))/(1+$F$23*(K57/100)),($F$23*$F$24)/(1+$F$23*(K57/100)))","v":161.43035302999999},null,null,null,null,null,null,null,{"$f":"IF(U56+$U$60>$R$60,U56,U56+$U$60)","v":{"$error":"#DIV/0!"}},{"$error":"#DIV/0!"},null,{"$f":"X51","v":0},{"$f":"Y56","v":0},null,0,0.113333333333339]
[null,0.20666666666667699,{"$f":"$C$10+$C$11*B58+$C$12*B58^2","v":0},null,1,{"$f":"IF(version<3,($F$23*$F$24*(1+(E58/100)))/(1+$F$23*(E58/100)),($F$23*$F$24)/(1+$F$23*(E58/100)))","v":161.349245007306},null,{"$f":"IF(version<3,($F$23*$F$24*(1+(I58/100)))/(1+$F$23*(I58/100)),($F$23*$F$24)/(1+$F$23*(I58/100)))","v":162.24277886982699},0.78666666666665597,null,{"$f":"K57-0.2","v":1.4},0,161.93592709999999,null,null,null,"UCS Best-Fit  Line Begin & End Points",null,null,null,{"$f":"IF(U57+$U$60>$R$60,U57,U57+$U$60)","v":{"$error":"#DIV/0!"}},{"$error":"#DIV/0!"},null,{"$f":"X56","v":1},{"$f":"Y57","v":0},null,0,0.120000000000006]
[null,0.21333333333334401,0,null,{"$f":"IF(E58+$F$11<=$F$9,E58+$F$11,E58)","v":1},161.349245007306,null,162.270861296991,{"$f":"I58-$F$11","v":0.77999999999998904},null,1.2,0,162.4466951,null,null,null,"Dry End Moisture",{"$f":"(MAX(Y51:Y58)-R54)/R55","v":{"$error":"#DIV/0!"}},null,null,{"$f":"IF(U58+$U$60>$R$60,U58,U58+$U$60)","v":{"$error":"#DIV/0!"}},{"$error":"#DIV/0!"},null,null,null,null,0,0.12666666666667301]
[null,0.22000000000001099,0,null,1,161.349245007306,null,162.29895344735201,0.77333333333332199,null,1,0,162.96273746,null,null,null,"Wet End Moisture",{"$f":"(MIN(Y51:Y58)-R54)/R55","v":{"$error":"#DIV/0!"}},null,null,{"$f":"(R60-MAX(U39,Y44))/20","v":{"$error":"#DIV/0!"}},null,null,null,null,null,0,0.13333333333333999]
[null,0.22666666666667801,0,null,1,161.349245007306,null,162.327055325961,0.76666666666665495,null,0.8,0,163.48413631,null,null,null,null,null,null,null,null,null,null,null,null,null,0,0.14000000000000701]
[null,0.23333333333334499,0,null,1,161.349245007306,null,162.35516693787099,0.75999999999998802,null,0.6,0,164.01097548999999,null,null,null,null,null,null,null,null,null,null,null,null,null,0,0.14666666666667399]
[null,0.24000000000001201,0,null,1,161.349245007306,null,162.38328828814099,0.75333333333332098,null,0.4,0,164.54334059000001,null,null,null,null,null,null,null,null,null,null,null,null,null,0,0.15333333333334101]
[null,0.246666666666679,0,null,1,161.349245007306,null,162.41141938183199,0.74666666666665404,null,0.2,0,165.08131900999999,null,null,null,null,null,null,null,null,null,null,null,null,null,0,0.160000000000008]
[null,0.25333333333334601,0,null,1,161.349245007306,null,162.43956022400701,0.739999999999987,null,0,0,165.625,null,null,null,null,null,null,null,null,null,null,null,null,null,0,0.16666666666667501]
[null,0.260000000000013,0,null,1,161.349245007306,null,162.46771081973699,0.73333333333331996,null,-0.2,0,166.17447472000001,null,null,null,null,null,null,null,null,null,null,null,null,null,0,0.173333333333342]
[null,0.26666666666667999,0,null,1,161.349245007306,null,162.49587117409101,0.72666666666665303,null,-0.4,0,166.72983626000001,null,null,null,null,null,null,null,null,null,null,null,null,null,0,0.18000000000000899]
[null,0.27333333333334697,0,null,1,161.349245007306,null,162.52404129214599,0.71999999999998598,null,-0.6,0,167.29117976000001,null,null,null,null,null,null,null,null,null,null,null,null,null,0,0.186666666666676]
[null,0.28000000000001402,0,null,1,161.349245007306,null,162.55222117898001,0.71333333333331905,null,-0.8,0,167.85860237,null,null,null,null,null,null,null,null,null,null,null,null,null,0,0.19333333333334299]
[null,0.286666666666681,0,null,1,161.349245007306,null,162.58041083967601,0.70666666666665201,null,-1,0,168.43220339000001,null,null,null,null,null,null,null,null,null,null,null,null,null,0,0.20000000000001]
[null,0.29333333333334799,0,null,1,161.349245007306,null,162.60861027931901,0.69999999999998497,null,-1.2,0,169.01208428000001,null,null,null,null,null,null,null,null,null,null,null,null,null,0,0.20666666666667699]
[null,0.30000000000001498,0,null,1,161.349245007306,null,162.63681950299801,0.69333333333331804,null,-1.4,0,169.59834874000001,null,null,null,null,null,null,null,null,null,null,null,null,null,0,0.21333333333334401]
[null,0.30666666666668202,0,null,1,161.349245007306,null,162.665038515807,0.68666666666665099,null,-1.6,0,170.19110276000001,null,null,null,null,null,null,null,null,null,null,null,null,null,0,0.22000000000001099]
[null,0.31333333333334901,0,null,1,161.349245007306,null,162.69326732284199,0.67999999999998395,null,-1.8,0,170.79045468999999,null,null,null,null,null,null,null,null,null,null,null,null,null,0,0.22666666666667801]
[null,0.32000000000001599,0,null,1,161.349245007306,null,162.721505929203,0.67333333333331702,null,-2,0,171.39651531000001,null,null,null,null,null,null,null,null,null,null,null,null,null,0,0.23333333333334499]
[null,0.32666666666668298,0,null,1,161.349245007306,null,162.74975433999401,0.66666666666664998,null,-2.2000000000000002,0,172.00939790000001,null,null,null,null,null,null,null,null,null,null,null,null,null,0,0.24000000000001201]
[null,0.33333333333335002,0,null,1,161.349245007306,null,162.77801256032001,0.65999999999998304,null,-2.4,0,172.62921828,null,null,null,null,null,null,null,null,null,null,null,null,null,0,0.246666666666679]
[null,0.34000000000001701,0,null,1,161.349245007306,null,162.806280595294,0.653333333333316,null,-2.6,0,173.25609494,null,null,null,null,null,null,null,null,null,null,null,null,null,0,0.25333333333334601]
[null,0.346666666666684,0,null,1,161.349245007306,null,162.834558450028,0.64666666666664896,null,-2.8,0,173.89014906,null,null,null,null,null,null,null,null,null,null,null,null,null,0,0.260000000000013]
[null,0.35333333333335099,0,null,1,161.349245007306,null,162.86284612964101,0.63999999999998203,null,-3,0,174.53150461999999,null,null,null,null,null,null,null,null,null,null,null,null,null,0,0.26666666666667999]
[null,0.36000000000001797,0,null,1,161.349245007306,null,162.89114363925501,0.63333333333331499,null,-3.2,0,175.18028846000001,null,null,null,null,null,null,null,null,null,null,null,null,null,0,0.27333333333334697]
[null,0.36666666666668501,0,null,1,161.349245007306,null,162.91945098399299,0.62666666666664805,null,-3.4,0,175.83663039999999,null,null,null,null,null,null,null,null,null,null,null,null,null,0,0.28000000000001402]
[null,0.373333333333352,0,null,1,161.349245007306,null,162.947768168984,0.61999999999998101,null,-3.6,0,176.50066328,null,null,null,null,null,null,null,null,null,null,null,null,null,0,0.286666666666681]
[null,0.38000000000001899,0,null,1,161.349245007306,null,162.97609519936,0.61333333333331397,null,-3.8,0,177.17252307000001,null,null,null,null,null,null,null,null,null,null,null,null,null,0,0.29333333333334799]
[null,0.38666666666668598,0,null,1,161.349245007306,null,163.00443208025601,0.60666666666664704,null,-4,0,177.85234899,null,null,null,null,null,null,null,null,null,null,null,null,null,0,0.30000000000001498]
[null,0.39333333333335302,0,null,1,161.349245007306,null,163.03277881681299,0.59999999999997999,null,-4.2,0,178.54028356000001,null,null,null,null,null,null,null,null,null,null,null,null,null,0,0.30666666666668202]
[null,0.40000000000002001,0,null,1,161.349245007306,null,163.06113541417099,0.59333333333331295,null,-4.4000000000000004,0,179.23647271999999,null,null,null,null,null,null,null,null,null,null,null,null,null,0,0.31333333333334901]
[null,0.40666666666668699,0,null,1,161.349245007306,null,163.089501877478,0.58666666666664602,null,-4.5999999999999996,0,179.94106593999999,null,null,null,null,null,null,null,null,null,null,null,null,null,0,0.32000000000001599]
[null,0.41333333333335398,0,null,1,161.349245007306,null,163.11787821188301,0.57999999999997898,null,-4.8,{"$f":"$C$10+$C$11*K89+$C$12*K89^2","v":0},{"$f":"IF(version<\"3\",($F$23*$F$24*(1+(K89/100)))/(1+$F$23*(K89/100)),($F$23*$F$24)/(1+$F$23*(K89/100)))","v":180.65421631999999},null,null,null,null,null,null,null,null,null,null,null,null,null,0,0.32666666666668298]
[null,0.42000000000002102,{"$f":"$C$10+$C$11*B90+$C$12*B90^2","v":0},null,1,{"$f":"IF(version<3,($F$23*$F$24*(1+(E90/100)))/(1+$F$23*(E90/100)),($F$23*$F$24)/(1+$F$23*(E90/100)))","v":161.349245007306},null,{"$f":"IF(version<3,($F$23*$F$24*(1+(I90/100)))/(1+$F$23*(I90/100)),($F$23*$F$24)/(1+$F$23*(I90/100)))","v":163.14626442254001},0.57333333333331205,null,{"$f":"K89-0.2","v":-5},0,181.37608069000001,null,null,null,null,null,null,null,null,null,null,null,null,null,0,0.33333333333335002]
[null,0.42666666666668801,0,null,{"$f":"IF(E90+$F$11<=$F$9,E90+$F$11,E90)","v":1},161.349245007306,null,163.17466051460599,{"$f":"I90-$F$11","v":0.566666666666645},null,-5.2,0,182.10681976000001,null,null,null,null,null,null,null,null,null,null,null,null,null,0,0.34000000000001701]
[null,{"$f":"IF(B91+$F$11<=$F$9,B91+$F$11,B91)","v":0.433333333333355},0,null,1,161.349245007306,null,163.20306649323999,0.55999999999997796,null,-5.4,0,182.84659819999999,null,null,null,null,null,null,null,null,null,null,null,null,null,0,0.346666666666684]
[null,0.44000000000002198,0,null,1,161.349245007306,null,163.231482363608,0.55333333333331103,null,-5.6,0,183.59558478,null,null,null,null,null,null,null,null,null,null,null,null,null,0,0.35333333333335099]
[null,0.44666666666668903,0,null,1,161.349245007306,null,163.25990813087699,0.54666666666664399,null,-5.8,0,184.35395249999999,null,null,null,null,null,null,null,null,null,null,null,null,null,0,0.36000000000001797]
[null,0.45333333333335601,0,null,1,161.349245007306,null,163.288343800219,0.53999999999997705,null,-6,0,185.12187872000001,null,null,null,null,null,null,null,null,null,null,null,null,null,0,0.36666666666668501]
[null,0.460000000000023,0,null,1,161.349245007306,null,163.316789376808,0.53333333333331001,null,-6.2,0,185.89954528999999,null,null,null,null,null,null,null,null,null,null,null,null,null,0,0.373333333333352]
[null,0.46666666666668999,0,null,1,161.349245007306,null,163.34524486582299,0.52666666666664297,null,-6.4,0,186.68713872999999,null,null,null,null,null,null,null,null,null,null,null,null,null,0,0.38000000000001899]
[null,0.47333333333335698,0,null,1,161.349245007306,null,163.373710272446,0.51999999999997604,null,-6.6,0,187.48485031999999,null,null,null,null,null,null,null,null,null,null,null,null,null,0,0.38666666666668598]
[null,0.48000000000002402,{"$f":"$C$10+$C$11*B99+$C$12*B99^2","v":0},null,1,161.349245007306,null,163.40218560186301,0.51333333333330899,null,-6.8,0,188.29287631,null,null,null,null,null,null,null,null,null,null,null,null,null,0,0.39333333333335302]
[null,{"$f":"IF(AND($C$10+$C$11*B99+$C$12*B99^2>$F$13,$C$10+$C$11*(B99+$F$11)+$C$12*(B99+$F$11)^2>$F$13),B99+$F$11,B99)","v":0.48000000000002402},0,null,1,161.349245007306,null,163.43067085926299,0.50666666666664195,null,-7,0,189.11141805,null,null,null,null,null,null,null,null,null,null,null,null,null,0,0.40000000000002001]
[null,{"$f":"IF(AND($C$10+$C$11*B100+$C$12*B100^2>$F$13,$C$10+$C$11*(B100+$F$11)+$C$12*(B100+$F$11)^2>$F$13),B100+$F$11,B100)","v":0.48000000000002402},0,null,1,161.349245007306,null,163.45916604984001,0.49999999999997502,null,-7.2,0,189.94068215999999,null,null,null,null,null,null,null,null,null,null,null,null,null,0,0.40666666666668699]
[null,0.48000000000002402,0,null,1,161.349245007306,null,163.48767117878899,0.49333333333330798,null,-7.4,0,190.78088070999999,null,null,null,null,null,null,null,null,null,null,null,null,null,0,0.41333333333335398]
[null,0.48000000000002402,0,null,1,161.349245007306,null,163.51618625131201,0.48666666666664099,null,-7.6,0,191.63223139999999,null,null,null,null,null,null,null,null,null,null,null,null,null,0,0.42000000000002102]
[null,0.48000000000002402,0,null,1,161.349245007306,null,163.54471127261201,0.479999999999974,null,-7.8,0,192.49495777000001,null,null,null,null,null,null,null,null,null,null,null,null,null,0,0.42666666666668801]
[null,0.48000000000002402,0,null,1,161.349245007306,null,163.573246247897,0.47333333333330702,null,-8,0,193.36928933999999,null,null,null,null,null,null,null,null,null,null,null,null,null,{"$f":"($R$55*AB105)+$R$54","v":0},0.433333333333355]
[null,0.48000000000002402,0,null,1,161.349245007306,null,163.60179118237801,0.46666666666663997,null,-8.1999999999999993,0,194.25546186,null,null,null,null,null,null,null,null,null,null,null,null,null,0,{"$f":"AB105+$Y$45","v":0.44000000000002198}]
[null,0.48000000000002402,0,null,1,161.349245007306,null,163.63034608126901,0.45999999999997299,null,-8.4,0,195.15371751999999,null,null,null,null,null,null,null,null,null,null,null,null,null,0,0.44666666666668903]
[null,0.48000000000002402,0,null,1,161.349245007306,null,163.65891094979,0.453333333333306,null,-8.6,0,196.06430513999999,null,null,null,null,null,null,null,null,null,null,null,null,null,0,0.45333333333335601]
[null,0.48000000000002402,0,null,1,161.349245007306,null,163.68748579316201,0.44666666666663901,null,-8.8000000000000007,0,196.98748044000001,null,null,null,null,null,null,null,null,null,null,null,null,null,0,0.460000000000023]
[null,0.48000000000002402,0,null,1,161.349245007306,null,163.71607061661001,0.43999999999997202,null,-9,0,197.92350623999999,null,null,null,null,null,null,null,null,null,null,null,null,null,0,0.46666666666668999]
[null,0.48000000000002402,0,null,1,161.349245007306,null,163.74466542536501,0.43333333333330498,null,-9.1999999999999993,0,198.87265274000001,null,null,null,null,null,null,null,null,null,null,null,null,null,0,0.47333333333335698]
[null,0.48000000000002402,0,null,1,161.349245007306,null,163.77327022466,0.42666666666663799,null,-9.4,0,199.83519776,null,null,null,null,null,null,null,null,null,null,null,null,null,0,0.48000000000002402]
[null,0.48000000000002402,0,null,1,161.349245007306,null,163.801885019731,0.41999999999997101,null,-9.6,0,200.81142704000001,null,null,null,null,null,null,null,null,null,null,null,null,null,0,0.48666666666669101]
[null,0.48000000000002402,0,null,1,161.349245007306,null,163.830509815818,0.41333333333330402,null,-9.8000000000000007,0,201.80163447000001,null,null,null,null,null,null,null,null,null,null,null,null,null,0,0.49333333333335799]
[null,0.48000000000002402,0,null,1,161.349245007306,null,163.859144618165,0.40666666666663698,null,-10,0,202.80612245,null,null,null,null,null,null,null,null,null,null,null,null,null,0,0.50000000000002498]
[null,0.48000000000002402,0,null,1,161.349245007306,null,163.88778943202101,0.39999999999996999,null,-10.199999999999999,0,203.82520213999999,null,null,null,null,null,null,null,null,null,null,null,null,null,0,0.50666666666669202]
[null,0.48000000000002402,0,null,1,161.349245007306,null,163.91644426263599,0.393333333333303,null,-10.4,0,204.85919382,null,null,null,null,null,null,null,null,null,null,null,null,null,0,0.51333333333335895]
[null,0.48000000000002402,0,null,1,161.349245007306,null,163.94510911526601,0.38666666666663602,null,-10.6,0,205.90842720000001,null,null,null,null,null,null,null,null,null,null,null,null,null,0,0.520000000000026]
[null,0.48000000000002402,0,null,1,161.349245007306,null,163.97378399516899,0.37999999999996897,null,-10.8,0,206.97324180000001,null,null,null,null,null,null,null,null,null,null,null,null,null,0,0.52666666666669304]
[null,0.48000000000002402,0,null,1,161.349245007306,null,164.00246890760801,0.37333333333330199,null,-11,0,208.05398729999999,null,null,null,null,null,null,null,null,null,null,null,null,null,0,0.53333333333335997]
[null,0.48000000000002402,0,null,1,161.349245007306,null,164.03116385784799,0.366666666666635,null,-11.2,{"$f":"$C$10+$C$11*K121+$C$12*K121^2","v":0},{"$f":"IF(version<\"3\",($F$23*$F$24*(1+(K121/100)))/(1+$F$23*(K121/100)),($F$23*$F$24)/(1+$F$23*(K121/100)))","v":209.15102389},null,null,null,null,null,null,null,null,null,null,null,null,null,0,0.54000000000002701]
[null,0.48000000000002402,0,null,1,{"$f":"IF(version<3,($F$23*$F$24*(1+(E122/100)))/(1+$F$23*(E122/100)),($F$23*$F$24)/(1+$F$23*(E122/100)))","v":161.349245007306},null,{"$f":"IF(version<3,($F$23*$F$24*(1+(I122/100)))/(1+$F$23*(I122/100)),($F$23*$F$24)/(1+$F$23*(I122/100)))","v":164.05986885115999},0.35999999999996801,null,{"$f":"K121-0.2","v":-11.4},0,210.26472274,null,null,null,null,null,null,null,null,null,null,null,null,null,0,0.54666666666669395]
[null,0.48000000000002402,0,null,{"$f":"IF(E122+$F$11<=$F$9,E122+$F$11,E122)","v":1},161.349245007306,null,164.08858389281701,{"$f":"I122-$F$11","v":0.35333333333330103},null,-11.6,0,211.39546636,null,null,null,null,null,null,null,null,null,null,null,null,null,0,0.55333333333336099]
[null,0.48000000000002402,0,null,1,161.349245007306,null,164.117308988096,0.34666666666663398,null,-11.8,0,212.54364906000001,null,null,null,null,null,null,null,null,null,null,null,null,null,0,0.56000000000002803]
[null,0.48000000000002402,0,null,1,161.349245007306,null,164.14604414227799,0.339999999999967,null,-12,0,213.70967741999999,null,null,null,null,null,null,null,null,null,null,null,null,null,0,0.56666666666669496]
[null,0.48000000000002402,0,null,1,161.349245007306,null,164.17478936064799,0.33333333333330001,null,-12.2,0,214.89397073999999,null,null,null,null,null,null,null,null,null,null,null,null,null,0,0.57333333333336201]
[null,0.48000000000002402,0,null,1,161.349245007306,null,164.20354464849299,0.32666666666663302,null,-12.4,0,216.09696156999999,null,null,null,null,null,null,null,null,null,null,null,null,null,0,0.58000000000002905]
[null,0.48000000000002402,0,null,1,161.349245007306,null,164.23231001110599,0.31999999999996598,null,-12.6,0,217.31909623000001,null,null,null,null,null,null,null,null,null,null,null,null,null,0,0.58666666666669598]
[null,0.48000000000002402,0,null,1,161.349245007306,null,164.26108545378199,0.31333333333329899,null,-12.8,0,218.56083534999999,null,null,null,null,null,null,null,null,null,null,null,null,null,0,0.59333333333336302]
[null,0.48000000000002402,0,null,1,161.349245007306,null,164.289870981821,0.306666666666632,null,-13,0,219.82265446,null,null,null,null,null,null,null,null,null,null,null,null,null,0,0.60000000000002995]
[null,0.48000000000002402,0,null,1,161.349245007306,null,164.318666600526,0.29999999999996502,null,-13.2,0,221.10504460000001,null,null,null,null,null,null,null,null,null,null,null,null,null,0,0.606666666666697]
[null,0.48000000000002402,0,null,1,161.349245007306,null,164.34747231520299,0.29333333333329797,null,-13.4,0,222.40851294999999,null,null,null,null,null,null,null,null,null,null,null,null,null,0,0.61333333333336404]
[null,0.48000000000002402,0,null,1,161.349245007306,null,164.37628813116399,0.28666666666663099,null,-13.6,0,223.73358349,null,null,null,null,null,null,null,null,null,null,null,null,null,0,0.62000000000003097]
[null,0.48000000000002402,0,null,1,161.349245007306,null,164.405114053722,0.279999999999964,null,-13.8,0,225.08079773,null,null,null,null,null,null,null,null,null,null,null,null,null,0,0.62666666666669801]
[null,0.48000000000002402,0,null,1,161.349245007306,null,164.43395008819499,0.27333333333329701,null,-14,0,226.45071541999999,null,null,null,null,null,null,null,null,null,null,null,null,null,0,0.63333333333336495]
[null,0.48000000000002402,0,null,1,161.349245007306,null,164.462796239905,0.26666666666663003,null,-14.2,0,227.84391534,null,null,null,null,null,null,null,null,null,null,null,null,null,0,0.64000000000003199]
[null,0.48000000000002402,0,null,1,161.349245007306,null,164.49165251417801,0.25999999999996298,null,-14.4,0,229.26099611999999,null,null,null,null,null,null,null,null,null,null,null,null,null,0,0.64666666666669903]
[null,0.48000000000002402,0,null,1,161.349245007306,null,164.52051891634201,0.253333333333296,null,-14.6,0,230.70257706999999,null,null,null,null,null,null,null,null,null,null,null,null,null,0,0.65333333333336596]
[null,0.48000000000002402,0,null,1,161.349245007306,null,164.54939545173099,0.24666666666662901,null,-14.8,0,232.16929911,null,null,null,null,null,null,null,null,null,null,null,null,null,0,0.660000000000033]
[null,0.48000000000002402,0,null,1,161.349245007306,null,164.578282125681,0.23999999999996199,null,-15,0,233.66182573,null,null,null,null,null,null,null,null,null,null,null,null,null,0,0.66666666666670005]
[null,0.48000000000002402,0,null,1,161.349245007306,null,164.607178943533,0.23333333333329501,null,-15.2,0,235.18084393999999,null,null,null,null,null,null,null,null,null,null,null,null,null,0,0.67333333333336698]
[null,0.48000000000002402,0,null,1,161.349245007306,null,164.63608591062999,0.22666666666662799,null,-15.4,0,236.72706538,null,null,null,null,null,null,null,null,null,null,null,null,null,0,0.68000000000003402]
[null,0.48000000000002402,0,null,1,161.349245007306,null,164.66500303232201,0.219999999999961,null,-15.6,0,238.30122741,null,null,null,null,null,null,null,null,null,null,null,null,null,0,0.68666666666670095]
[null,0.48000000000002402,0,null,1,161.349245007306,null,164.69393031395899,0.21333333333329399,null,-15.8,0,239.90409427,null,null,null,null,null,null,null,null,null,null,null,null,null,0,0.693333333333368]
[null,0.48000000000002402,0,null,1,161.349245007306,null,164.72286776089601,0.206666666666627,null,-16,0,241.53645832999999,null,null,null,null,null,null,null,null,null,null,null,null,null,0,0.70000000000003504]
[null,0.48000000000002402,0,null,1,161.349245007306,null,164.751815378494,0.19999999999995999,null,-16.2,0,243.19914141000001,null,null,null,null,null,null,null,null,null,null,null,null,null,0,0.70666666666670197]
[null,0.48000000000002402,0,null,1,161.349245007306,null,164.780773172115,0.193333333333293,null,-16.399999999999999,0,244.89299611000001,null,null,null,null,null,null,null,null,null,null,null,null,null,0,0.71333333333336901]
[null,0.48000000000002402,0,null,1,161.349245007306,null,164.809741147126,0.18666666666662601,null,-16.600000000000001,0,246.61890733999999,null,null,null,null,null,null,null,null,null,null,null,null,null,0,0.72000000000003594]
[null,0.48000000000002402,0,null,1,161.349245007306,null,164.838719308897,0.179999999999959,null,-16.8,0,248.37779380000001,null,null,null,null,null,null,null,null,null,null,null,null,null,0,0.72666666666670299]
[null,0.48000000000002402,0,null,1,161.349245007306,null,164.86770766280199,0.17333333333329201,null,-17,0,250.17060964999999,null,null,null,null,null,null,null,null,null,null,null,null,null,0,0.73333333333337003]
[null,0.48000000000002402,0,null,1,161.349245007306,null,164.89670621422101,0.166666666666625,null,-17.2,0,251.99834619999999,null,null,null,null,null,null,null,null,null,null,null,null,null,0,0.74000000000003696]
[null,0.48000000000002402,0,null,1,161.349245007306,null,164.92571496853401,0.15999999999995801,null,-17.399999999999999,0,253.86203377000001,null,null,null,null,null,null,null,null,null,null,null,null,null,0,0.746666666666704]
[null,0.48000000000002402,0,null,1,161.349245007306,null,164.95473393112701,0.15333333333329099,null,-17.600000000000001,{"$f":"$C$10+$C$11*K153+$C$12*K153^2","v":0},{"$f":"IF(version<\"3\",($F$23*$F$24*(1+(K153/100)))/(1+$F$23*(K153/100)),($F$23*$F$24)/(1+$F$23*(K153/100)))","v":255.76274362999999},null,null,null,null,null,null,null,null,null,null,null,null,null,0,0.75333333333337105]
[null,0.48000000000002402,{"$f":"$C$10+$C$11*B154+$C$12*B154^2","v":0},null,1,{"$f":"IF(version<3,($F$23*$F$24*(1+(E154/100)))/(1+$F$23*(E154/100)),($F$23*$F$24)/(1+$F$23*(E154/100)))","v":161.349245007306},null,{"$f":"IF(version<3,($F$23*$F$24*(1+(I154/100)))/(1+$F$23*(I154/100)),($F$23*$F$24)/(1+$F$23*(I154/100)))","v":164.983763107389},0.14666666666662401,null,{"$f":"K153-0.2","v":-17.8},0,257.70159001000002,null,null,null,null,null,null,null,null,null,null,null,null,null,0,0.76000000000003798]
[null,0.48000000000002402,0,null,{"$f":"IF(E154+$F$11<=$F$9,E154+$F$11,E154)","v":1},161.349245007306,null,165.012802502715,{"$f":"I154-$F$11","v":0.13999999999995699},null,-18,0,259.67973231000002,null,null,null,null,null,null,null,null,null,null,null,null,null,0,0.76666666666670502]
[null,0.48000000000002402,0,null,1,161.349245007306,null,165.04185212250101,0.13333333333329001,null,-18.2,0,261.69837744,null,null,null,null,null,null,null,null,null,null,null,null,null,0,0.77333333333337195]
[null,0.48000000000002402,0,null,1,161.349245007306,null,165.070911972147,0.12666666666662299,null,-18.399999999999999,0,263.75878219999998,null,null,null,null,null,null,null,null,null,null,null,null,null,0,0.780000000000039]
[null,0.48000000000002402,0,null,1,161.349245007306,null,165.09998205705901,0.119999999999956,null,-18.600000000000001,0,265.86225596999998,null,null,null,null,null,null,null,null,null,null,null,null,null,0,0.78666666666670604]
[null,0.48000000000002402,0,null,1,161.349245007306,null,165.12906238264401,0.113333333333289,null,-18.8,0,268.01016341000002,null,null,null,null,null,null,null,null,null,null,null,null,null,0,0.79333333333337297]
[null,0.48000000000002402,0,null,1,161.349245007306,null,165.15815295431599,0.106666666666622,null,-19,0,270.20392749000001,null,null,null,null,null,null,null,null,null,null,null,null,null,0,0.80000000000004001]
[null,0.48000000000002402,0,null,1,161.349245007306,null,165.18725377749001,9.9999999999955E-2,null,-19.2,0,272.44503257000002,null,null,null,null,null,null,null,null,null,null,null,null,null,0,0.80666666666670706]
[null,0.48000000000002402,0,null,1,161.349245007306,null,165.216364857586,9.3333333333287999E-2,null,-19.399999999999999,0,274.73502778,null,null,null,null,null,null,null,null,null,null,null,null,null,0,0.81333333333337399]
[null,0.48000000000002402,0,null,1,161.349245007306,null,165.24548620002699,8.6666666666620998E-2,null,-19.600000000000001,0,277.07553059000003,null,null,null,null,null,null,null,null,null,null,null,null,null,0,0.82000000000004103]
[null,0.48000000000002402,0,null,1,161.349245007306,null,165.27461781024201,7.9999999999953997E-2,null,-19.8,0,279.46823059000002,null,null,null,null,null,null,null,null,null,null,null,null,null,0,0.82666666666670796]
[null,{"$f":"IF(AND($C$10+$C$11*B164+$C$12*B164^2>$F$13,$C$10+$C$11*(B164+$F$11)+$C$12*(B164+$F$11)^2>$F$13),B164+$F$11,B164)","v":0.48000000000002402},0,null,1,161.349245007306,null,165.30375969366199,7.3333333333286996E-2,null,-20,0,281.91489361999999,null,null,null,null,null,null,null,null,null,null,null,null,null,0,0.833333333333375]
[null,0.48000000000002402,0,null,1,161.349245007306,null,165.33291185572199,6.6666666666619995E-2,null,-20.2,0,284.41736603999999,null,null,null,null,null,null,null,null,null,null,null,null,null,0,0.84000000000004205]
[null,0.48000000000002402,0,null,1,161.349245007306,null,165.36207430185999,5.9999999999953001E-2,null,-20.399999999999999,0,286.97757945000001,null,null,null,null,null,null,null,null,null,null,null,null,null,0,0.84666666666670898]
[null,0.48000000000002402,0,null,1,161.349245007306,null,165.39124703752,5.3333333333286E-2,null,-20.6,0,289.59755560000002,null,null,null,null,null,null,null,null,null,null,null,null,null,0,0.85333333333337602]
[null,0.48000000000002402,0,null,1,161.349245007306,null,165.42043006814899,4.6666666666618999E-2,null,-20.8,0,292.27941176000002,null,null,null,null,null,null,null,null,null,null,null,null,null,{"$f":"($R$55*AB169)+$R$54","v":0},0.86000000000004295]
[null,0.48000000000002402,0,null,1,161.349245007306,null,165.44962339919701,3.9999999999951998E-2,null,-21,0,295.0253664,null,null,null,null,null,null,null,null,null,null,null,null,null,0,{"$f":"AB169+$Y$45","v":0.86666666666670999}]
[null,0.48000000000002402,0,null,1,161.349245007306,null,165.47882703611799,3.3333333333284997E-2,null,-21.2,0,297.83774532000001,null,null,null,null,null,null,null,null,null,null,null,null,null,0,0.87333333333337704]
[null,0.48000000000002402,0,null,1,161.349245007306,null,165.50804098437101,2.6666666666617999E-2,null,-21.4,0,300.71898822000003,null,null,null,null,null,null,null,null,null,null,null,null,null,0,0.88000000000004397]
[null,0.48000000000002402,0,null,1,161.349245007306,null,165.537265249418,1.9999999999951001E-2,null,-21.6,0,303.67165575000001,null,null,null,null,null,null,null,null,null,null,null,null,null,0,0.88666666666671101]
[null,0.48000000000002402,0,null,1,161.349245007306,null,165.566499836725,1.3333333333284E-2,null,-21.8,0,306.69843713,null,null,null,null,null,null,null,null,null,null,null,null,null,0,0.89333333333337805]
[null,0.48000000000002402,0,null,1,161.349245007306,null,165.595744751761,6.6666666666170002E-3,null,-22,0,309.80215827000001,null,null,null,null,null,null,null,null,null,null,null,null,null,0,0.90000000000004499]
[null,0.48000000000002402,0,null,1,161.349245007306,null,165.625,-5.0000000000000002E-14,null,-22.2,0,312.98579061999999,null,null,null,null,null,null,null,null,null,null,null,null,null,0,0.90666666666671203]
[null,null,null,null,null,null,null,null,null,null,-22.4,0,316.25246062999997,null,null,null,null,null,null,null,null,null,null,null,null,null,0,0.91333333333337896]
[null,null,null,null,null,null,null,null,null,null,-22.6,0,319.60545998999999,null,null,null,null,null,null,null,null,null,null,null,null,null,0,0.920000000000046]
[null,null,null,null,null,null,null,null,null,null,-22.8,0,323.04825670000002,null,null,null,null,null,null,null,null,null,null,null,null,null,0,0.92666666666671305]
[null,null,null,null,null,null,null,null,null,null,-23,0,326.58450704000001,null,null,null,null,null,null,null,null,null,null,null,null,null,0,0.93333333333337998]
[null,null,null,null,null,null,null,null,null,null,-23.2,0,330.21806853999999,null,null,null,null,null,null,null,null,null,null,null,null,null,0,0.94000000000004702]
[null,null,null,null,null,null,null,null,null,null,-23.4,0,333.95301395000001,null,null,null,null,null,null,null,null,null,null,null,null,null,0,0.94666666666671395]
[null,null,null,null,null,null,null,null,null,null,-23.6,0,337.79364656000001,null,null,null,null,null,null,null,null,null,null,null,null,null,0,0.95333333333338099]
[null,null,null,null,null,null,null,null,null,null,-23.8,0,341.74451664999998,null,null,null,null,null,null,null,null,null,null,null,null,null,0,0.96000000000004804]
[null,null,null,null,null,null,null,null,null,null,-24,{"$f":"$C$10+$C$11*K185+$C$12*K185^2","v":0},{"$f":"IF(version<\"3\",($F$23*$F$24*(1+(K185/100)))/(1+$F$23*(K185/100)),($F$23*$F$24)/(1+$F$23*(K185/100)))","v":345.81043956000002},null,null,null,null,null,null,null,null,null,null,null,null,null,0,0.96666666666671497]
[null,null,null,null,null,null,null,null,null,null,{"$f":"K185-0.2","v":-24.2},0,349.99651519000003,null,null,null,null,null,null,null,null,null,null,null,null,null,0,0.97333333333338201]
[null,null,null,null,null,null,null,null,null,null,-24.4,0,354.30814941,null,null,null,null,null,null,null,null,null,null,null,null,null,0,0.98000000000004905]
[null,null,null,null,null,null,null,null,null,null,-24.6,0,358.75107728,null,null,null,null,null,null,null,null,null,null,null,null,null,0,0.98666666666671599]
[null,null,null,null,null,null,null,null,null,null,-24.8,0,363.33138855999999,null,null,null,null,null,null,null,null,null,null,null,null,null,0,0.99333333333338303]
[null,null,null,null,null,null,null,null,null,null,-25,0,368.05555556000002,null,null,null,null,null,null,null,null,null,null,null,null,null,0,1.00000000000005]
[null,null,null,null,null,null,null,null,null,null,-25.2,0,372.93046357999998]
[null,null,null,null,null,null,null,null,null,null,-25.4,0,377.96344448000002]
[null,null,null,null,null,null,null,null,null,null,-25.6,0,383.16231342999998]
[null,null,null,null,null,null,null,null,null,null,-25.8,0,388.53540942000001]
[null,null,null,null,null,null,null,null,null,null,-26,0,394.09163986999999]
[null,null,null,null,null,null,null,null,null,null,-26.2,0,399.84052993]

{"sheet":"SCA-Data","index":3,"n_rows":290,"n_cols":29,"rows_kept":290,"cut":false,"hidden":true,"merged":[[1,23,1,27],[2,23,2,27],[1,2,1,6],[2,2,2,6],[1,9,1,13],[2,9,2,13],[1,16,1,20],[2,16,2,20]]}
[]
[null,"Specimen",1,null,null,null,null,null,null,2,null,null,null,null,null,null,3,null,null,null,null,null,null,4]
[null,"Moisture Content",{"$f":"Field11","v":0},null,null,null,null,null,null,{"$f":"Field12","v":0},null,null,null,null,null,null,{"$f":"Field13","v":0},null,null,null,null,null,null,{"$f":"Field14","v":0}]
[null,"Header"]
[]
[]
["`"]
[]
[]
[]
[]
[]
[null,null,"Drop #","Time (sec)","Velocity (ft/sec)","Impact Energy (ft-lb)","Lift Ht (in)","Drop Ht (in)",null,"Drop #","Time (sec)","Velocity (ft/sec)","Impact Energy (ft-lb)","Lift Ht (in)","Drop Ht (in)",null,"Drop #","Time (sec)","Velocity (ft/sec)","Impact Energy (ft-lb)","Lift Ht (in)","Drop Ht (in)",null,"Drop #","Time (sec)","Velocity (ft/sec)","Impact Energy (ft-lb)","Lift Ht (in)","Drop Ht (in)"]
[]
[null,"Lift Summary"]
[null,null,"Lift #",null,null,null,null,null,null,"Lift #",null,null,null,null,null,null,"Lift #",null,null,null,null,null,null,"Lift #"]
[null,null,"Drops",null,null,null,null,null,null,"Drops",null,null,null,null,null,null,"Drops",null,null,null,null,null,null,"Drops"]
[null,null,"Total Energy (ft-lb)",null,null,null,null,null,null,"Total Energy (ft-lb)",null,null,null,null,null,null,"Total Energy (ft-lb)",null,null,null,null,null,null,"Total Energy (ft-lb)"]
[null,null,"Ave Energy / Drop (ft-lb)",null,null,null,null,null,null,"Ave Energy / Drop (ft-lb)",null,null,null,null,null,null,"Ave Energy / Drop (ft-lb)",null,null,null,null,null,null,"Ave Energy / Drop (ft-lb)"]
[null,null,"Ave Lift Ht (in)",null,null,null,null,null,null,"Ave Lift Ht (in)",null,null,null,null,null,null,"Ave Lift Ht (in)",null,null,null,null,null,null,"Ave Lift Ht (in)"]
[null,null,"Ave Drop Ht (in)",null,null,null,null,null,null,"Ave Drop Ht (in)",null,null,null,null,null,null,"Ave Drop Ht (in)",null,null,null,null,null,null,"Ave Drop Ht (in)"]
[]
[null,null,null,null,null,null,null,null,null,null,null,null,null,null,null,null,null,null,null,null,null,null,null,null,null,null,null,null,18.477]
[null,null,null,null,null,null,null,null,null,null,null,null,null,null,null,null,null,null,null,null,null,null,null,null,null,null,null,null,18.378]
[null,null,null,null,null,null,null,null,null,null,null,null,null,null,null,null,null,null,null,null,null,null,null,null,null,null,null,null,18.443999999999999]
[null,null,null,null,null,null,null,null,null,null,null,null,null,null,null,null,null,null,null,null,null,null,null,null,null,null,null,null,18.468]
[null,null,null,null,null,null,null,null,null,null,null,null,null,null,null,null,null,null,null,null,null,null,null,null,null,null,null,null,18.466999999999999]
[null,null,null,null,null,null,null,null,null,null,null,null,null,null,null,null,null,null,null,null,null,null,null,null,null,null,null,null,18.472999999999999]
[null,null,null,null,null,null,null,null,null,null,null,null,null,null,null,null,null,null,null,null,null,null,null,null,null,null,null,null,18.439]
[null,null,null,null,null,null,null,null,null,null,null,null,null,null,null,null,null,null,null,null,null,null,null,null,null,null,null,null,18.498999999999999]
[null,null,null,null,null,null,null,null,null,null,null,null,null,null,null,null,null,null,null,null,null,null,null,null,null,null,null,null,18.492999999999999]
[null,null,null,null,null,null,null,null,null,null,null,null,null,null,null,null,null,null,null,null,null,null,null,null,null,null,null,null,18.454000000000001]
[null,null,null,null,null,null,null,null,null,null,null,null,null,null,null,null,null,null,null,null,null,null,null,null,null,null,null,null,18.495000000000001]
[null,null,null,null,null,null,null,null,null,null,null,null,null,null,null,null,null,null,null,null,null,null,null,null,null,null,null,null,18.532]
[null,null,null,null,null,null,null,null,null,null,null,null,null,null,null,null,null,null,null,null,null,null,null,null,null,null,null,null,18.405999999999999]
[null,null,null,null,null,null,null,null,null,null,null,null,null,null,null,null,null,null,null,null,null,null,null,null,null,null,null,null,18.422000000000001]
[null,null,null,null,null,null,null,null,null,null,null,null,null,null,null,null,null,null,null,null,null,null,null,null,null,null,null,null,18.419]
[null,null,null,null,null,null,null,null,null,null,null,null,null,null,null,null,null,null,null,null,null,null,null,null,null,null,null,null,18.518999999999998]
[null,null,null,null,null,null,null,null,null,null,null,null,null,null,null,null,null,null,null,null,null,null,null,null,null,null,null,null,18.533999999999999]
[null,null,null,null,null,null,null,null,null,null,null,null,null,null,null,null,null,null,null,null,null,null,null,null,null,null,null,null,18.382000000000001]
[null,null,null,null,null,null,null,null,null,null,null,null,null,null,null,null,null,null,null,null,null,null,null,null,null,null,null,null,18.46]
[null,null,null,null,null,null,null,null,null,null,null,null,null,null,null,null,null,null,null,null,null,null,null,null,null,null,null,null,18.433]
[null,null,null,null,null,null,null,null,null,null,null,null,null,null,null,null,null,null,null,null,null,null,null,null,null,null,null,null,18.477]
[null,null,null,null,null,null,null,null,null,null,null,null,null,null,null,null,null,null,null,null,null,null,null,null,null,null,null,null,18.459]
[null,null,null,null,null,null,null,null,null,null,null,null,null,null,null,null,null,null,null,null,null,null,null,null,null,null,null,null,18.463999999999999]
[null,null,null,null,null,null,null,null,null,null,null,null,null,null,null,null,null,null,null,null,null,null,null,null,null,null,null,null,0.16700000000000001]
[null,null,null,null,null,null,null,null,null,null,null,null,null,null,null,null,null,null,null,null,null,null,null,null,null,null,null,null,18.54]
[null,null,null,null,null,null,null,null,null,null,null,null,null,null,null,null,null,null,null,null,null,null,null,null,null,null,null,null,5.5720000000000001]
[null,null,null,null,null,null,null,null,null,null,null,null,null,null,null,null,null,null,null,null,null,null,null,null,null,null,null,null,18.431999999999999]
[null,null,null,null,null,null,null,null,null,null,null,null,null,null,null,null,null,null,null,null,null,null,null,null,null,null,null,null,18.41]
[null,null,null,null,null,null,null,null,null,null,null,null,null,null,null,null,null,null,null,null,null,null,null,null,null,null,null,null,18.504999999999999]
[null,null,null,null,null,null,null,null,null,null,null,null,null,null,null,null,null,null,null,null,null,null,null,null,null,null,null,null,18.395]
[null,null,null,null,null,null,null,null,null,null,null,null,null,null,null,null,null,null,null,null,null,null,null,null,null,null,null,null,18.475000000000001]
[null,null,null,null,null,null,null,null,null,null,null,null,null,null,null,null,null,null,null,null,null,null,null,null,null,null,null,null,18.512]
[null,null,null,null,null,null,null,null,null,null,null,null,null,null,null,null,null,null,null,null,null,null,null,null,null,null,null,null,18.475999999999999]
[null,null,null,null,null,null,null,null,null,null,null,null,null,null,null,null,null,null,null,null,null,null,null,null,null,null,null,null,18.492000000000001]
[null,null,null,null,null,null,null,null,null,null,null,null,null,null,null,null,null,null,null,null,null,null,null,null,null,null,null,null,18.475999999999999]
[null,null,null,null,null,null,null,null,null,null,null,null,null,null,null,null,null,null,null,null,null,null,null,null,null,null,null,null,18.494]
[null,null,null,null,null,null,null,null,null,null,null,null,null,null,null,null,null,null,null,null,null,null,null,null,null,null,null,null,18.478000000000002]
[null,null,null,null,null,null,null,null,null,null,null,null,null,null,null,null,null,null,null,null,null,null,null,null,null,null,null,null,18.385999999999999]
[null,null,null,null,null,null,null,null,null,null,null,null,null,null,null,null,null,null,null,null,null,null,null,null,null,null,null,null,18.524000000000001]
[null,null,null,null,null,null,null,null,null,null,null,null,null,null,null,null,null,null,null,null,null,null,null,null,null,null,null,null,18.481999999999999]
[null,null,null,null,null,null,null,null,null,null,null,null,null,null,null,null,null,null,null,null,null,null,null,null,null,null,null,null,18.446999999999999]
[null,null,null,null,null,null,null,null,null,null,null,null,null,null,null,null,null,null,null,null,null,null,null,null,null,null,null,null,18.451000000000001]
[null,null,null,null,null,null,null,null,null,null,null,null,null,null,null,null,null,null,null,null,null,null,null,null,null,null,null,null,18.492000000000001]
[null,null,null,null,null,null,null,null,null,null,null,null,null,null,null,null,null,null,null,null,null,null,null,null,null,null,null,null,18.382000000000001]
[null,null,null,null,null,null,null,null,null,null,null,null,null,null,null,null,null,null,null,null,null,null,null,null,null,null,null,null,18.434999999999999]
[null,null,null,null,null,null,null,null,null,null,null,null,null,null,null,null,null,null,null,null,null,null,null,null,null,null,null,null,18.411000000000001]
[null,null,null,null,null,null,null,null,null,null,null,null,null,null,null,null,null,null,null,null,null,null,null,null,null,null,null,null,18.443999999999999]
[null,null,null,null,null,null,null,null,null,null,null,null,null,null,null,null,null,null,null,null,null,null,null,null,null,null,null,null,18.457999999999998]
[null,null,null,null,null,null,null,null,null,null,null,null,null,null,null,null,null,null,null,null,null,null,null,null,null,null,null,null,18.41]
[null,null,null,null,null,null,null,null,null,null,null,null,null,null,null,null,null,null,null,null,null,null,null,null,null,null,null,null,18.431000000000001]
[null,null,null,null,null,null,null,null,null,null,null,null,null,null,null,null,null,null,null,null,null,null,null,null,null,null,null,null,18.439]
[null,null,null,null,null,null,null,null,null,null,null,null,null,null,null,null,null,null,null,null,null,null,null,null,null,null,null,null,18.469000000000001]
[null,null,null,null,null,null,null,null,null,null,null,null,null,null,null,null,null,null,null,null,null,null,null,null,null,null,null,null,18.498999999999999]
[null,null,null,null,null,null,null,null,null,null,null,null,null,null,null,null,null,null,null,null,null,null,null,null,null,null,null,null,18.420000000000002]
[null,null,null,null,null,null,null,null,null,null,null,null,null,null,null,null,null,null,null,null,null,null,null,null,null,null,null,null,18.391999999999999]
[null,null,null,null,null,null,null,null,null,null,null,null,null,null,null,null,null,null,null,null,null,null,null,null,null,null,null,null,18.457000000000001]
[null,null,null,null,null,null,null,null,null,null,null,null,null,null,null,null,null,null,null,null,null,null,null,null,null,null,null,null,18.440999999999999]
[null,null,null,null,null,null,null,null,null,null,null,null,null,null,null,null,null,null,null,null,null,null,null,null,null,null,null,null,18.454000000000001]
[null,null,null,null,null,null,null,null,null,null,null,null,null,null,null,null,null,null,null,null,null,null,null,null,null,null,null,null,18.472000000000001]
[null,null,null,null,null,null,null,null,null,null,null,null,null,null,null,null,null,null,null,null,null,null,null,null,null,null,null,null,18.506]
[null,null,null,null,null,null,null,null,null,null,null,null,null,null,null,null,null,null,null,null,null,null,null,null,null,null,null,null,18.448]
[null,null,null,null,null,null,null,null,null,null,null,null,null,null,null,null,null,null,null,null,null,null,null,null,null,null,null,null,18.422999999999998]
[]
[]
[]
[]
[]
[]
[]
[]
[]
[]
[null,null,null,null,null,null,null,null,null,null,null,null,null,null,null,null,null,null,null,null,null,null,null,null,null,null,null,null,18.486000000000001]
[null,null,null,null,null,null,null,null,null,null,null,null,null,null,null,null,null,null,null,null,null,null,null,null,null,null,null,null,18.472000000000001]
[null,null,null,null,null,null,null,null,null,null,null,null,null,null,null,null,null,null,null,null,null,null,null,null,null,null,null,null,18.465]
[null,null,null,null,null,null,null,null,null,null,null,null,null,null,null,null,null,null,null,null,null,null,null,null,null,null,null,null,18.504999999999999]
[null,null,null,null,null,null,null,null,null,null,null,null,null,null,null,null,null,null,null,null,null,null,null,null,null,null,null,null,18.503]
[null,null,null,null,null,null,null,null,null,null,null,null,null,null,null,null,null,null,null,null,null,null,null,null,null,null,null,null,18.495999999999999]
[null,null,null,null,null,null,null,null,null,null,null,null,null,null,null,null,null,null,null,null,null,null,null,null,null,null,null,null,18.515000000000001]
[null,null,null,null,null,null,null,null,null,null,null,null,null,null,null,null,null,null,null,null,null,null,null,null,null,null,null,null,18.533999999999999]
[null,null,null,null,null,null,null,null,null,null,null,null,null,null,null,null,null,null,null,null,null,null,null,null,null,null,null,null,18.463999999999999]
[null,null,null,null,null,null,null,null,null,null,null,null,null,null,null,null,null,null,null,null,null,null,null,null,null,null,null,null,18.408000000000001]
[null,null,null,null,null,null,null,null,null,null,null,null,null,null,null,null,null,null,null,null,null,null,null,null,null,null,null,null,18.442]
[null,null,null,null,null,null,null,null,null,null,null,null,null,null,null,null,null,null,null,null,null,null,null,null,null,null,null,null,18.475999999999999]
[null,null,null,null,null,null,null,null,null,null,null,null,null,null,null,null,null,null,null,null,null,null,null,null,null,null,null,null,18.523]
[null,null,null,null,null,null,null,null,null,null,null,null,null,null,null,null,null,null,null,null,null,null,null,null,null,null,null,null,18.515000000000001]
[null,null,null,null,null,null,null,null,null,null,null,null,null,null,null,null,null,null,null,null,null,null,null,null,null,null,null,null,18.498000000000001]
[null,null,null,null,null,null,null,null,null,null,null,null,null,null,null,null,null,null,null,null,null,null,null,null,null,null,null,null,18.527000000000001]
[null,null,null,null,null,null,null,null,null,null,null,null,null,null,null,null,null,null,null,null,null,null,null,null,null,null,null,null,18.446999999999999]
[null,null,null,null,null,null,null,null,null,null,null,null,null,null,null,null,null,null,null,null,null,null,null,null,null,null,null,null,18.442]
[null,null,null,null,null,null,null,null,null,null,null,null,null,null,null,null,null,null,null,null,null,null,null,null,null,null,null,null,18.503]
[null,null,null,null,null,null,null,null,null,null,null,null,null,null,null,null,null,null,null,null,null,null,null,null,null,null,null,null,18.529]
[null,null,null,null,null,null,null,null,null,null,null,null,null,null,null,null,null,null,null,null,null,null,null,null,null,null,null,null,18.527000000000001]
[null,null,null,null,null,null,null,null,null,null,null,null,null,null,null,null,null,null,null,null,null,null,null,null,null,null,null,null,18.472000000000001]
[null,null,null,null,null,null,null,null,null,null,null,null,null,null,null,null,null,null,null,null,null,null,null,null,null,null,null,null,18.489999999999998]
[null,null,null,null,null,null,null,null,null,null,null,null,null,null,null,null,null,null,null,null,null,null,null,null,null,null,null,null,18.5]
[null,null,null,null,null,null,null,null,null,null,null,null,null,null,null,null,null,null,null,null,null,null,null,null,null,null,null,null,18.501000000000001]
[null,null,null,null,null,null,null,null,null,null,null,null,null,null,null,null,null,null,null,null,null,null,null,null,null,null,null,null,18.451000000000001]
[null,null,null,null,null,null,null,null,null,null,null,null,null,null,null,null,null,null,null,null,null,null,null,null,null,null,null,null,18.405000000000001]
[null,null,null,null,null,null,null,null,null,null,null,null,null,null,null,null,null,null,null,null,null,null,null,null,null,null,null,null,18.391999999999999]
[null,null,null,null,null,null,null,null,null,null,null,null,null,null,null,null,null,null,null,null,null,null,null,null,null,null,null,null,18.478000000000002]
[null,null,null,null,null,null,null,null,null,null,null,null,null,null,null,null,null,null,null,null,null,null,null,null,null,null,null,null,18.452000000000002]
[null,null,null,null,null,null,null,null,null,null,null,null,null,null,null,null,null,null,null,null,null,null,null,null,null,null,null,null,18.486000000000001]
[null,null,null,null,null,null,null,null,null,null,null,null,null,null,null,null,null,null,null,null,null,null,null,null,null,null,null,null,18.507999999999999]
[null,null,null,null,null,null,null,null,null,null,null,null,null,null,null,null,null,null,null,null,null,null,null,null,null,null,null,null,18.492999999999999]
[null,null,null,null,null,null,null,null,null,null,null,null,null,null,null,null,null,null,null,null,null,null,null,null,null,null,null,null,18.459]
[null,null,null,null,null,null,null,null,null,null,null,null,null,null,null,null,null,null,null,null,null,null,null,null,null,null,null,null,18.417999999999999]
[null,null,null,null,null,null,null,null,null,null,null,null,null,null,null,null,null,null,null,null,null,null,null,null,null,null,null,null,18.454999999999998]
[null,null,null,null,null,null,null,null,null,null,null,null,null,null,null,null,null,null,null,null,null,null,null,null,null,null,null,null,18.459]
[null,null,null,null,null,null,null,null,null,null,null,null,null,null,null,null,null,null,null,null,null,null,null,null,null,null,null,null,18.475000000000001]
[null,null,null,null,null,null,null,null,null,null,null,null,null,null,null,null,null,null,null,null,null,null,null,null,null,null,null,null,18.501000000000001]
[null,null,null,null,null,null,null,null,null,null,null,null,null,null,null,null,null,null,null,null,null,null,null,null,null,null,null,null,18.545000000000002]
[null,null,null,null,null,null,null,null,null,null,null,null,null,null,null,null,null,null,null,null,null,null,null,null,null,null,null,null,18.518000000000001]
[null,null,null,null,null,null,null,null,null,null,null,null,null,null,null,null,null,null,null,null,null,null,null,null,null,null,null,null,2.2970000000000002]
[null,null,null,null,null,null,null,null,null,null,null,null,null,null,null,null,null,null,null,null,null,null,null,null,null,null,null,null,18.422000000000001]
[null,null,null,null,null,null,null,null,null,null,null,null,null,null,null,null,null,null,null,null,null,null,null,null,null,null,null,null,1.821]
[null,null,null,null,null,null,null,null,null,null,null,null,null,null,null,null,null,null,null,null,null,null,null,null,null,null,null,null,18.533999999999999]
[null,null,null,null,null,null,null,null,null,null,null,null,null,null,null,null,null,null,null,null,null,null,null,null,null,null,null,null,7.9059999999999997]
[null,null,null,null,null,null,null,null,null,null,null,null,null,null,null,null,null,null,null,null,null,null,null,null,null,null,null,null,18.445]
[null,null,null,null,null,null,null,null,null,null,null,null,null,null,null,null,null,null,null,null,null,null,null,null,null,null,null,null,18.466000000000001]
[null,null,null,null,null,null,null,null,null,null,null,null,null,null,null,null,null,null,null,null,null,null,null,null,null,null,null,null,18.510999999999999]
[null,null,null,null,null,null,null,null,null,null,null,null,null,null,null,null,null,null,null,null,null,null,null,null,null,null,null,null,18.516999999999999]
[null,null,null,null,null,null,null,null,null,null,null,null,null,null,null,null,null,null,null,null,null,null,null,null,null,null,null,null,18.460999999999999]
[null,null,null,null,null,null,null,null,null,null,null,null,null,null,null,null,null,null,null,null,null,null,null,null,null,null,null,null,18.504999999999999]
[null,null,null,null,null,null,null,null,null,null,null,null,null,null,null,null,null,null,null,null,null,null,null,null,null,null,null,null,18.379000000000001]
[null,null,null,null,null,null,null,null,null,null,null,null,null,null,null,null,null,null,null,null,null,null,null,null,null,null,null,null,18.443000000000001]
[null,null,null,null,null,null,null,null,null,null,null,null,null,null,null,null,null,null,null,null,null,null,null,null,null,null,null,null,18.477]
[null,null,null,null,null,null,null,null,null,null,null,null,null,null,null,null,null,null,null,null,null,null,null,null,null,null,null,null,18.523]
[null,null,null,null,null,null,null,null,null,null,null,null,null,null,null,null,null,null,null,null,null,null,null,null,null,null,null,null,18.488]
[null,null,null,null,null,null,null,null,null,null,null,null,null,null,null,null,null,null,null,null,null,null,null,null,null,null,null,null,18.456]
[]
[]
[]
[]
[]
[]
[]
[]
[]
[]
[null,null,null,null,null,null,null,null,null,null,null,null,null,null,null,null,null,null,null,null,null,null,null,null,null,null,null,null,18.504000000000001]
[null,null,null,null,null,null,null,null,null,null,null,null,null,null,null,null,null,null,null,null,null,null,null,null,null,null,null,null,18.45]
[null,null,null,null,null,null,null,null,null,null,null,null,null,null,null,null,null,null,null,null,null,null,null,null,null,null,null,null,18.466999999999999]
[null,null,null,null,null,null,null,null,null,null,null,null,null,null,null,null,null,null,null,null,null,null,null,null,null,null,null,null,18.486999999999998]
[null,null,null,null,null,null,null,null,null,null,null,null,null,null,null,null,null,null,null,null,null,null,null,null,null,null,null,null,18.565000000000001]
[null,null,null,null,null,null,null,null,null,null,null,null,null,null,null,null,null,null,null,null,null,null,null,null,null,null,null,null,18.541]
[null,null,null,null,null,null,null,null,null,null,null,null,null,null,null,null,null,null,null,null,null,null,null,null,null,null,null,null,18.515000000000001]
[null,null,null,null,null,null,null,null,null,null,null,null,null,null,null,null,null,null,null,null,null,null,null,null,null,null,null,null,18.463000000000001]
[null,null,null,null,null,null,null,null,null,null,null,null,null,null,null,null,null,null,null,null,null,null,null,null,null,null,null,null,18.431999999999999]
[null,null,null,null,null,null,null,null,null,null,null,null,null,null,null,null,null,null,null,null,null,null,null,null,null,null,null,null,18.518000000000001]
[null,null,null,null,null,null,null,null,null,null,null,null,null,null,null,null,null,null,null,null,null,null,null,null,null,null,null,null,18.474]
[null,null,null,null,null,null,null,null,null,null,null,null,null,null,null,null,null,null,null,null,null,null,null,null,null,null,null,null,18.545000000000002]
[null,null,null,null,null,null,null,null,null,null,null,null,null,null,null,null,null,null,null,null,null,null,null,null,null,null,null,null,18.504999999999999]
[null,null,null,null,null,null,null,null,null,null,null,null,null,null,null,null,null,null,null,null,null,null,null,null,null,null,null,null,18.463999999999999]
[null,null,null,null,null,null,null,null,null,null,null,null,null,null,null,null,null,null,null,null,null,null,null,null,null,null,null,null,18.501000000000001]
[null,null,null,null,null,null,null,null,null,null,null,null,null,null,null,null,null,null,null,null,null,null,null,null,null,null,null,null,18.567]
[null,null,null,null,null,null,null,null,null,null,null,null,null,null,null,null,null,null,null,null,null,null,null,null,null,null,null,null,18.5]
[null,null,null,null,null,null,null,null,null,null,null,null,null,null,null,null,null,null,null,null,null,null,null,null,null,null,null,null,18.497]
[null,null,null,null,null,null,null,null,null,null,null,null,null,null,null,null,null,null,null,null,null,null,null,null,null,null,null,null,18.459]
[null,null,null,null,null,null,null,null,null,null,null,null,null,null,null,null,null,null,null,null,null,null,null,null,null,null,null,null,18.484999999999999]
[null,null,null,null,null,null,null,null,null,null,null,null,null,null,null,null,null,null,null,null,null,null,null,null,null,null,null,null,18.483000000000001]
[null,null,null,null,null,null,null,null,null,null,null,null,null,null,null,null,null,null,null,null,null,null,null,null,null,null,null,null,18.52]
[null,null,null,null,null,null,null,null,null,null,null,null,null,null,null,null,null,null,null,null,null,null,null,null,null,null,null,null,18.518000000000001]
[null,null,null,null,null,null,null,null,null,null,null,null,null,null,null,null,null,null,null,null,null,null,null,null,null,null,null,null,18.498000000000001]
[null,null,null,null,null,null,null,null,null,null,null,null,null,null,null,null,null,null,null,null,null,null,null,null,null,null,null,null,18.486000000000001]
[null,null,null,null,null,null,null,null,null,null,null,null,null,null,null,null,null,null,null,null,null,null,null,null,null,null,null,null,18.488]
[null,null,null,null,null,null,null,null,null,null,null,null,null,null,null,null,null,null,null,null,null,null,null,null,null,null,null,null,18.405000000000001]
[null,null,null,null,null,null,null,null,null,null,null,null,null,null,null,null,null,null,null,null,null,null,null,null,null,null,null,null,18.488]
[null,null,null,null,null,null,null,null,null,null,null,null,null,null,null,null,null,null,null,null,null,null,null,null,null,null,null,null,18.535]
[null,null,null,null,null,null,null,null,null,null,null,null,null,null,null,null,null,null,null,null,null,null,null,null,null,null,null,null,18.516999999999999]
[null,null,null,null,null,null,null,null,null,null,null,null,null,null,null,null,null,null,null,null,null,null,null,null,null,null,null,null,18.506]
[null,null,null,null,null,null,null,null,null,null,null,null,null,null,null,null,null,null,null,null,null,null,null,null,null,null,null,null,4.2039999999999997]
[null,null,null,null,null,null,null,null,null,null,null,null,null,null,null,null,null,null,null,null,null,null,null,null,null,null,null,null,1.538]
[null,null,null,null,null,null,null,null,null,null,null,null,null,null,null,null,null,null,null,null,null,null,null,null,null,null,null,null,8.1120000000000001]
[null,null,null,null,null,null,null,null,null,null,null,null,null,null,null,null,null,null,null,null,null,null,null,null,null,null,null,null,8.7070000000000007]
[null,null,null,null,null,null,null,null,null,null,null,null,null,null,null,null,null,null,null,null,null,null,null,null,null,null,null,null,18.488]
[null,null,null,null,null,null,null,null,null,null,null,null,null,null,null,null,null,null,null,null,null,null,null,null,null,null,null,null,18.513999999999999]
[null,null,null,null,null,null,null,null,null,null,null,null,null,null,null,null,null,null,null,null,null,null,null,null,null,null,null,null,18.402000000000001]
[null,null,null,null,null,null,null,null,null,null,null,null,null,null,null,null,null,null,null,null,null,null,null,null,null,null,null,null,18.501999999999999]
[null,null,null,null,null,null,null,null,null,null,null,null,null,null,null,null,null,null,null,null,null,null,null,null,null,null,null,null,18.507999999999999]
[null,null,null,null,null,null,null,null,null,null,null,null,null,null,null,null,null,null,null,null,null,null,null,null,null,null,null,null,18.536000000000001]
[null,null,null,null,null,null,null,null,null,null,null,null,null,null,null,null,null,null,null,null,null,null,null,null,null,null,null,null,18.523]
[null,null,null,null,null,null,null,null,null,null,null,null,null,null,null,null,null,null,null,null,null,null,null,null,null,null,null,null,18.527000000000001]
[null,null,null,null,null,null,null,null,null,null,null,null,null,null,null,null,null,null,null,null,null,null,null,null,null,null,null,null,18.477]
[null,null,null,null,null,null,null,null,null,null,null,null,null,null,null,null,null,null,null,null,null,null,null,null,null,null,null,null,18.463000000000001]
[null,null,null,null,null,null,null,null,null,null,null,null,null,null,null,null,null,null,null,null,null,null,null,null,null,null,null,null,18.466000000000001]
[null,null,null,null,null,null,null,null,null,null,null,null,null,null,null,null,null,null,null,null,null,null,null,null,null,null,null,null,18.510999999999999]
[null,null,null,null,null,null,null,null,null,null,null,null,null,null,null,null,null,null,null,null,null,null,null,null,null,null,null,null,18.529]
[null,null,null,null,null,null,null,null,null,null,null,null,null,null,null,null,null,null,null,null,null,null,null,null,null,null,null,null,18.507999999999999]
[null,null,null,null,null,null,null,null,null,null,null,null,null,null,null,null,null,null,null,null,null,null,null,null,null,null,null,null,18.545999999999999]
[null,null,null,null,null,null,null,null,null,null,null,null,null,null,null,null,null,null,null,null,null,null,null,null,null,null,null,null,18.507999999999999]
[null,null,null,null,null,null,null,null,null,null,null,null,null,null,null,null,null,null,null,null,null,null,null,null,null,null,null,null,18.468]
[null,null,null,null,null,null,null,null,null,null,null,null,null,null,null,null,null,null,null,null,null,null,null,null,null,null,null,null,0.52600000000000002]
[null,null,null,null,null,null,null,null,null,null,null,null,null,null,null,null,null,null,null,null,null,null,null,null,null,null,null,null,18.45]
[null,null,null,null,null,null,null,null,null,null,null,null,null,null,null,null,null,null,null,null,null,null,null,null,null,null,null,null,12.571999999999999]
[null,null,null,null,null,null,null,null,null,null,null,null,null,null,null,null,null,null,null,null,null,null,null,null,null,null,null,null,18.588999999999999]
[null,null,null,null,null,null,null,null,null,null,null,null,null,null,null,null,null,null,null,null,null,null,null,null,null,null,null,null,18.515000000000001]
[null,null,null,null,null,null,null,null,null,null,null,null,null,null,null,null,null,null,null,null,null,null,null,null,null,null,null,null,18.510000000000002]
[null,null,null,null,null,null,null,null,null,null,null,null,null,null,null,null,null,null,null,null,null,null,null,null,null,null,null,null,18.492999999999999]
[]
[]
[]
[]
[]
[]
[]
[]
[]
[]
[null,null,null,null,null,null,null,null,null,null,null,null,null,null,null,null,null,null,null,null,null,null,null,null,null,null,null,null,18.515999999999998]
[null,null,null,null,null,null,null,null,null,null,null,null,null,null,null,null,null,null,null,null,null,null,null,null,null,null,null,null,18.497]
[null,null,null,null,null,null,null,null,null,null,null,null,null,null,null,null,null,null,null,null,null,null,null,null,null,null,null,null,18.497]
[null,null,null,null,null,null,null,null,null,null,null,null,null,null,null,null,null,null,null,null,null,null,null,null,null,null,null,null,18.515000000000001]
[null,null,null,null,null,null,null,null,null,null,null,null,null,null,null,null,null,null,null,null,null,null,null,null,null,null,null,null,18.459]
[null,null,null,null,null,null,null,null,null,null,null,null,null,null,null,null,null,null,null,null,null,null,null,null,null,null,null,null,18.494]
[null,null,null,null,null,null,null,null,null,null,null,null,null,null,null,null,null,null,null,null,null,null,null,null,null,null,null,null,18.498999999999999]
[null,null,null,null,null,null,null,null,null,null,null,null,null,null,null,null,null,null,null,null,null,null,null,null,null,null,null,null,18.538]
[null,null,null,null,null,null,null,null,null,null,null,null,null,null,null,null,null,null,null,null,null,null,null,null,null,null,null,null,18.484000000000002]
[null,null,null,null,null,null,null,null,null,null,null,null,null,null,null,null,null,null,null,null,null,null,null,null,null,null,null,null,18.481000000000002]
[null,null,null,null,null,null,null,null,null,null,null,null,null,null,null,null,null,null,null,null,null,null,null,null,null,null,null,null,18.504999999999999]
[null,null,null,null,null,null,null,null,null,null,null,null,null,null,null,null,null,null,null,null,null,null,null,null,null,null,null,null,18.544]
[null,null,null,null,null,null,null,null,null,null,null,null,null,null,null,null,null,null,null,null,null,null,null,null,null,null,null,null,18.489000000000001]
[null,null,null,null,null,null,null,null,null,null,null,null,null,null,null,null,null,null,null,null,null,null,null,null,null,null,null,null,18.54]
[null,null,null,null,null,null,null,null,null,null,null,null,null,null,null,null,null,null,null,null,null,null,null,null,null,null,null,null,18.492999999999999]
[null,null,null,null,null,null,null,null,null,null,null,null,null,null,null,null,null,null,null,null,null,null,null,null,null,null,null,null,18.495000000000001]
[null,null,null,null,null,null,null,null,null,null,null,null,null,null,null,null,null,null,null,null,null,null,null,null,null,null,null,null,18.484999999999999]
[null,null,null,null,null,null,null,null,null,null,null,null,null,null,null,null,null,null,null,null,null,null,null,null,null,null,null,null,18.483000000000001]
[null,null,null,null,null,null,null,null,null,null,null,null,null,null,null,null,null,null,null,null,null,null,null,null,null,null,null,null,18.483000000000001]
[null,null,null,null,null,null,null,null,null,null,null,null,null,null,null,null,null,null,null,null,null,null,null,null,null,null,null,null,18.538]
[null,null,null,null,null,null,null,null,null,null,null,null,null,null,null,null,null,null,null,null,null,null,null,null,null,null,null,null,18.532]
[null,null,null,null,null,null,null,null,null,null,null,null,null,null,null,null,null,null,null,null,null,null,null,null,null,null,null,null,18.501000000000001]
[null,null,null,null,null,null,null,null,null,null,null,null,null,null,null,null,null,null,null,null,null,null,null,null,null,null,null,null,18.513999999999999]
[null,null,null,null,null,null,null,null,null,null,null,null,null,null,null,null,null,null,null,null,null,null,null,null,null,null,null,null,18.513000000000002]
[null,null,null,null,null,null,null,null,null,null,null,null,null,null,null,null,null,null,null,null,null,null,null,null,null,null,null,null,18.518999999999998]
[null,null,null,null,null,null,null,null,null,null,null,null,null,null,null,null,null,null,null,null,null,null,null,null,null,null,null,null,18.462]
[null,null,null,null,null,null,null,null,null,null,null,null,null,null,null,null,null,null,null,null,null,null,null,null,null,null,null,null,18.527000000000001]
[null,null,null,null,null,null,null,null,null,null,null,null,null,null,null,null,null,null,null,null,null,null,null,null,null,null,null,null,1.107]
[null,null,null,null,null,null,null,null,null,null,null,null,null,null,null,null,null,null,null,null,null,null,null,null,null,null,null,null,4.827]
[null,null,null,null,null,null,null,null,null,null,null,null,null,null,null,null,null,null,null,null,null,null,null,null,null,null,null,null,8.2850000000000001]
[null,null,null,null,null,null,null,null,null,null,null,null,null,null,null,null,null,null,null,null,null,null,null,null,null,null,null,null,8.08]
[null,null,null,null,null,null,null,null,null,null,null,null,null,null,null,null,null,null,null,null,null,null,null,null,null,null,null,null,18.510000000000002]
[null,null,null,null,null,null,null,null,null,null,null,null,null,null,null,null,null,null,null,null,null,null,null,null,null,null,null,null,18.541]
[null,null,null,null,null,null,null,null,null,null,null,null,null,null,null,null,null,null,null,null,null,null,null,null,null,null,null,null,18.588000000000001]
[null,null,null,null,null,null,null,null,null,null,null,null,null,null,null,null,null,null,null,null,null,null,null,null,null,null,null,null,18.527000000000001]
[null,null,null,null,null,null,null,null,null,null,null,null,null,null,null,null,null,null,null,null,null,null,null,null,null,null,null,null,18.484000000000002]
[null,null,null,null,null,null,null,null,null,null,null,null,null,null,null,null,null,null,null,null,null,null,null,null,null,null,null,null,18.460999999999999]
[null,null,null,null,null,null,null,null,null,null,null,null,null,null,null,null,null,null,null,null,null,null,null,null,null,null,null,null,8.0000000000000002E-3]
[null,null,null,null,null,null,null,null,null,null,null,null,null,null,null,null,null,null,null,null,null,null,null,null,null,null,null,null,18.177]
[null,null,null,null,null,null,null,null,null,null,null,null,null,null,null,null,null,null,null,null,null,null,null,null,null,null,null,null,4.8620000000000001]
[null,null,null,null,null,null,null,null,null,null,null,null,null,null,null,null,null,null,null,null,null,null,null,null,null,null,null,null,18.492000000000001]
[null,null,null,null,null,null,null,null,null,null,null,null,null,null,null,null,null,null,null,null,null,null,null,null,null,null,null,null,18.486999999999998]
[null,null,null,null,null,null,null,null,null,null,null,null,null,null,null,null,null,null,null,null,null,null,null,null,null,null,null,null,20.117000000000001]
[null,null,null,null,null,null,null,null,null,null,null,null,null,null,null,null,null,null,null,null,null,null,null,null,null,null,null,null,18.48]
[null,null,null,null,null,null,null,null,null,null,null,null,null,null,null,null,null,null,null,null,null,null,null,null,null,null,null,null,18.5]
[null,null,null,null,null,null,null,null,null,null,null,null,null,null,null,null,null,null,null,null,null,null,null,null,null,null,null,null,18.457000000000001]
[null,null,null,null,null,null,null,null,null,null,null,null,null,null,null,null,null,null,null,null,null,null,null,null,null,null,null,null,18.463000000000001]
[null,null,null,null,null,null,null,null,null,null,null,null,null,null,null,null,null,null,null,null,null,null,null,null,null,null,null,null,18.521000000000001]
[null,null,null,null,null,null,null,null,null,null,null,null,null,null,null,null,null,null,null,null,null,null,null,null,null,null,null,null,18.492000000000001]
[null,null,null,null,null,null,null,null,null,null,null,null,null,null,null,null,null,null,null,null,null,null,null,null,null,null,null,null,18.518999999999998]
[null,null,null,null,null,null,null,null,null,null,null,null,null,null,null,null,null,null,null,null,null,null,null,null,null,null,null,null,11.952]
[null,null,null,null,null,null,null,null,null,null,null,null,null,null,null,null,null,null,null,null,null,null,null,null,null,null,null,null,8.1969999999999992]
[null,null,null,null,null,null,null,null,null,null,null,null,null,null,null,null,null,null,null,null,null,null,null,null,null,null,null,null,13.403]
[null,null,null,null,null,null,null,null,null,null,null,null,null,null,null,null,null,null,null,null,null,null,null,null,null,null,null,null,18.491]
[null,null,null,null,null,null,null,null,null,null,null,null,null,null,null,null,null,null,null,null,null,null,null,null,null,null,null,null,18.457000000000001]
[null,null,null,null,null,null,null,null,null,null,null,null,null,null,null,null,null,null,null,null,null,null,null,null,null,null,null,null,18.459]
[null,null,null,null,null,null,null,null,null,null,null,null,null,null,null,null,null,null,null,null,null,null,null,null,null,null,null,null,18.481999999999999]
[null,null,null,null,null,null,null,null,null,null,null,null,null,null,null,null,null,null,null,null,null,null,null,null,null,null,null,null,18.488]
[null,null,null,null,null,null,null,null,null,null,null,null,null,null,null,null,null,null,null,null,null,null,null,null,null,null,null,null,18.550999999999998]

{"sheet":"RX","index":5,"n_rows":231,"n_cols":9,"rows_kept":231,"cut":false,"hidden":true,"merged":[]}
[{"$f":"COUNTA(A3:A300)","v":229},{"$f":"sampleid & \" - \" & testnumber","v":" - "},{"$f":"testnumber","v":0},{"$f":"+testnumber","v":0}]
["Fld_nbr","Value","Desc_1","Desc_2","Desc_3","Desc_4","Desc_5","Desc_6","Desc_7"]
[1,{"$f":"IF('Tex-113,4-E'!$B$89=\"\",\"\",'Tex-113,4-E'!$B$89)","v":""},{"$f":"'Tex-113,4-E'!$B$88","v":"Remarks:"}]
[2,{"$f":"IF('Tex-113,4-E'!$D$19=\"\",\"\",'Tex-113,4-E'!$D$19)","v":""},{"$f":"IF('Tex-113,4-E'!$C$19=\"\",\"\",'Tex-113,4-E'!$C$19)","v":"COURSE\\LIFT:"}]
[3,{"$f":"IF('Tex-113,4-E'!$C$100=\"\",\"\",'Tex-113,4-E'!$C$100)","v":""},"Tested By ",{"$f":"IF('Tex-113,4-E'!$B$100=\"\",\"\",'Tex-113,4-E'!$B$100)","v":"TX113"}]
[4,{"$f":"IF('Tex-113,4-E'!$G$100=\"\",\"\",'Tex-113,4-E'!$G$100)","v":""},"Tested Date ",{"$f":"IF('Tex-113,4-E'!$B$100=\"\",\"\",'Tex-113,4-E'!$B$100)","v":"TX113"}]
[5,{"$f":"IF('Tex-113,4-E'!$C$102=\"\",\"\",'Tex-113,4-E'!$C$102)","v":""},"Tested By ",{"$f":"IF('Tex-113,4-E'!$B$102=\"\",\"\",'Tex-113,4-E'!$B$102)","v":"TX114"}]
[6,{"$f":"IF('Tex-113,4-E'!$G$102=\"\",\"\",'Tex-113,4-E'!$G$102)","v":""},"Tested Date ",{"$f":"IF('Tex-113,4-E'!$B$102=\"\",\"\",'Tex-113,4-E'!$B$102)","v":"TX114"}]
[7,{"$f":"IF('Tex-113,4-E'!$E$22=\"\",\"\",'Tex-113,4-E'!$E$22)","v":""},{"$f":"IF('Tex-113,4-E'!$B$6=\"\",\"\",'Tex-113,4-E'!$B$6)","v":"Tex-113-E or Tex-114-E"},{"$f":"IF('Tex-113,4-E'!$B$22=\"\",\"\",'Tex-113,4-E'!$B$22)","v":"Oven Dry Weight, (g):"}]
[8,{"$f":"IF('Tex-113,4-E'!$E$23=\"\",\"\",'Tex-113,4-E'!$E$23)","v":""},{"$f":"IF('Tex-113,4-E'!$B$6=\"\",\"\",'Tex-113,4-E'!$B$6)","v":"Tex-113-E or Tex-114-E"},{"$f":"IF('Tex-113,4-E'!$B$23=\"\",\"\",'Tex-113,4-E'!$B$23)","v":"Weight of Pycnometer & Water, (g):"}]
[9,{"$f":"IF('Tex-113,4-E'!$E$24=\"\",\"\",'Tex-113,4-E'!$E$24)","v":""},{"$f":"IF('Tex-113,4-E'!$B$6=\"\",\"\",'Tex-113,4-E'!$B$6)","v":"Tex-113-E or Tex-114-E"},{"$f":"IF('Tex-113,4-E'!$B$24=\"\",\"\",'Tex-113,4-E'!$B$24)","v":"Weight of Aggr., Pycn.& Water, (g):"}]
[10,{"$f":"IF('Tex-113,4-E'!$E$26=\"\",\"\",'Tex-113,4-E'!$E$26)","v":2.65},{"$f":"IF('Tex-113,4-E'!$B$6=\"\",\"\",'Tex-113,4-E'!$B$6)","v":"Tex-113-E or Tex-114-E"},{"$f":"IF('Tex-113,4-E'!$B$25=\"\",\"\",'Tex-113,4-E'!$B$25)","v":"Specific Gravity (Apparent)(Override):"}]
[11,{"$f":"IF('Tex-113,4-E'!$E$28=\"\",\"\",'Tex-113,4-E'!$E$28)","v":""},{"$f":"IF('Tex-113,4-E'!$B$6=\"\",\"\",'Tex-113,4-E'!$B$6)","v":"Tex-113-E or Tex-114-E"},{"$f":"IF('Tex-113,4-E'!$B$28=\"\",\"\",'Tex-113,4-E'!$B$28)","v":"Hygroscopic Moisture, (%):"}]
[12,{"$f":"IF('Tex-113,4-E'!$E$31=\"\",\"\",'Tex-113,4-E'!$E$31)","v":""},{"$f":"IF('Tex-113,4-E'!$B$31=\"\",\"\",'Tex-113,4-E'!$B$31)","v":"Percent Water Content, (%):"},{"$f":"IF('Tex-113,4-E'!$E$30=\"\",\"\",'Tex-113,4-E'!$E$30)","v":1}]
[13,{"$f":"IF('Tex-113,4-E'!$G$31=\"\",\"\",'Tex-113,4-E'!$G$31)","v":""},{"$f":"IF('Tex-113,4-E'!$B$31=\"\",\"\",'Tex-113,4-E'!$B$31)","v":"Percent Water Content, (%):"},{"$f":"IF('Tex-113,4-E'!$G$30=\"\",\"\",'Tex-113,4-E'!$G$30)","v":2}]
[14,{"$f":"IF('Tex-113,4-E'!$I$31=\"\",\"\",'Tex-113,4-E'!$I$31)","v":""},{"$f":"IF('Tex-113,4-E'!$B$31=\"\",\"\",'Tex-113,4-E'!$B$31)","v":"Percent Water Content, (%):"},{"$f":"IF('Tex-113,4-E'!$I$30=\"\",\"\",'Tex-113,4-E'!$I$30)","v":3}]
[15,{"$f":"IF('Tex-113,4-E'!$K$31=\"\",\"\",'Tex-113,4-E'!$K$31)","v":""},{"$f":"IF('Tex-113,4-E'!$B$31=\"\",\"\",'Tex-113,4-E'!$B$31)","v":"Percent Water Content, (%):"},{"$f":"IF('Tex-113,4-E'!$K$30=\"\",\"\",'Tex-113,4-E'!$K$30)","v":4}]
[16,{"$f":"IF('Tex-113,4-E'!$E$33=\"\",\"\",'Tex-113,4-E'!$E$33)","v":""},{"$f":"IF('Tex-113,4-E'!$B$6=\"\",\"\",'Tex-113,4-E'!$B$6)","v":"Tex-113-E or Tex-114-E"},{"$f":"IF('Tex-113,4-E'!$B$33=\"\",\"\",'Tex-113,4-E'!$B$33)","v":"Mass Material, (lb):"},{"$f":"IF('Tex-113,4-E'!$E$30=\"\",\"\",'Tex-113,4-E'!$E$30)","v":1}]
[17,{"$f":"IF('Tex-113,4-E'!$G$33=\"\",\"\",'Tex-113,4-E'!$G$33)","v":""},{"$f":"IF('Tex-113,4-E'!$B$6=\"\",\"\",'Tex-113,4-E'!$B$6)","v":"Tex-113-E or Tex-114-E"},{"$f":"IF('Tex-113,4-E'!$B$33=\"\",\"\",'Tex-113,4-E'!$B$33)","v":"Mass Material, (lb):"},{"$f":"IF('Tex-113,4-E'!$G$30=\"\",\"\",'Tex-113,4-E'!$G$30)","v":2}]
[18,{"$f":"IF('Tex-113,4-E'!$I$33=\"\",\"\",'Tex-113,4-E'!$I$33)","v":""},{"$f":"IF('Tex-113,4-E'!$B$6=\"\",\"\",'Tex-113,4-E'!$B$6)","v":"Tex-113-E or Tex-114-E"},{"$f":"IF('Tex-113,4-E'!$B$33=\"\",\"\",'Tex-113,4-E'!$B$33)","v":"Mass Material, (lb):"},{"$f":"IF('Tex-113,4-E'!$I$30=\"\",\"\",'Tex-113,4-E'!$I$30)","v":3}]
[19,{"$f":"IF('Tex-113,4-E'!$K$33=\"\",\"\",'Tex-113,4-E'!$K$33)","v":""},{"$f":"IF('Tex-113,4-E'!$B$6=\"\",\"\",'Tex-113,4-E'!$B$6)","v":"Tex-113-E or Tex-114-E"},{"$f":"IF('Tex-113,4-E'!$B$33=\"\",\"\",'Tex-113,4-E'!$B$33)","v":"Mass Material, (lb):"},{"$f":"IF('Tex-113,4-E'!$K$30=\"\",\"\",'Tex-113,4-E'!$K$30)","v":4}]
[20,{"$f":"IF('Tex-113,4-E'!$E$34=\"\",\"\",'Tex-113,4-E'!$E$34)","v":""},{"$f":"IF('Tex-113,4-E'!$B$6=\"\",\"\",'Tex-113,4-E'!$B$6)","v":"Tex-113-E or Tex-114-E"},{"$f":"IF('Tex-113,4-E'!$B$34=\"\",\"\",'Tex-113,4-E'!$B$34)","v":"Mass Water Added, (lb):"},{"$f":"IF('Tex-113,4-E'!$E$30=\"\",\"\",'Tex-113,4-E'!$E$30)","v":1}]
[21,{"$f":"IF('Tex-113,4-E'!$G$34=\"\",\"\",'Tex-113,4-E'!$G$34)","v":""},{"$f":"IF('Tex-113,4-E'!$B$6=\"\",\"\",'Tex-113,4-E'!$B$6)","v":"Tex-113-E or Tex-114-E"},{"$f":"IF('Tex-113,4-E'!$B$34=\"\",\"\",'Tex-113,4-E'!$B$34)","v":"Mass Water Added, (lb):"},{"$f":"IF('Tex-113,4-E'!$G$30=\"\",\"\",'Tex-113,4-E'!$G$30)","v":2}]
[22,{"$f":"IF('Tex-113,4-E'!$I$34=\"\",\"\",'Tex-113,4-E'!$I$34)","v":""},{"$f":"IF('Tex-113,4-E'!$B$6=\"\",\"\",'Tex-113,4-E'!$B$6)","v":"Tex-113-E or Tex-114-E"},{"$f":"IF('Tex-113,4-E'!$B$34=\"\",\"\",'Tex-113,4-E'!$B$34)","v":"Mass Water Added, (lb):"},{"$f":"IF('Tex-113,4-E'!$I$30=\"\",\"\",'Tex-113,4-E'!$I$30)","v":3}]
[23,{"$f":"IF('Tex-113,4-E'!$K$34=\"\",\"\",'Tex-113,4-E'!$K$34)","v":""},{"$f":"IF('Tex-113,4-E'!$B$6=\"\",\"\",'Tex-113,4-E'!$B$6)","v":"Tex-113-E or Tex-114-E"},{"$f":"IF('Tex-113,4-E'!$B$34=\"\",\"\",'Tex-113,4-E'!$B$34)","v":"Mass Water Added, (lb):"},{"$f":"IF('Tex-113,4-E'!$K$30=\"\",\"\",'Tex-113,4-E'!$K$30)","v":4}]
[24,{"$f":"IF('Tex-113,4-E'!$E$36=\"\",\"\",'Tex-113,4-E'!$E$36)","v":""},{"$f":"IF('Tex-113,4-E'!$B$6=\"\",\"\",'Tex-113,4-E'!$B$6)","v":"Tex-113-E or Tex-114-E"},{"$f":"IF('Tex-113,4-E'!$B$36=\"\",\"\",'Tex-113,4-E'!$B$36)","v":"Wet Mass Specimen & Mold, (lb):"},{"$f":"IF('Tex-113,4-E'!$E$30=\"\",\"\",'Tex-113,4-E'!$E$30)","v":1}]
[25,{"$f":"IF('Tex-113,4-E'!$G$36=\"\",\"\",'Tex-113,4-E'!$G$36)","v":""},{"$f":"IF('Tex-113,4-E'!$B$6=\"\",\"\",'Tex-113,4-E'!$B$6)","v":"Tex-113-E or Tex-114-E"},{"$f":"IF('Tex-113,4-E'!$B$36=\"\",\"\",'Tex-113,4-E'!$B$36)","v":"Wet Mass Specimen & Mold, (lb):"},{"$f":"IF('Tex-113,4-E'!$G$30=\"\",\"\",'Tex-113,4-E'!$G$30)","v":2}]
[26,{"$f":"IF('Tex-113,4-E'!$I$36=\"\",\"\",'Tex-113,4-E'!$I$36)","v":""},{"$f":"IF('Tex-113,4-E'!$B$6=\"\",\"\",'Tex-113,4-E'!$B$6)","v":"Tex-113-E or Tex-114-E"},{"$f":"IF('Tex-113,4-E'!$B$36=\"\",\"\",'Tex-113,4-E'!$B$36)","v":"Wet Mass Specimen & Mold, (lb):"},{"$f":"IF('Tex-113,4-E'!$I$30=\"\",\"\",'Tex-113,4-E'!$I$30)","v":3}]
[27,{"$f":"IF('Tex-113,4-E'!$K$36=\"\",\"\",'Tex-113,4-E'!$K$36)","v":""},{"$f":"IF('Tex-113,4-E'!$B$6=\"\",\"\",'Tex-113,4-E'!$B$6)","v":"Tex-113-E or Tex-114-E"},{"$f":"IF('Tex-113,4-E'!$B$36=\"\",\"\",'Tex-113,4-E'!$B$36)","v":"Wet Mass Specimen & Mold, (lb):"},{"$f":"IF('Tex-113,4-E'!$K$30=\"\",\"\",'Tex-113,4-E'!$K$30)","v":4}]
[28,{"$f":"IF('Tex-113,4-E'!$E$37=\"\",\"\",'Tex-113,4-E'!$E$37)","v":""},{"$f":"IF('Tex-113,4-E'!$B$6=\"\",\"\",'Tex-113,4-E'!$B$6)","v":"Tex-113-E or Tex-114-E"},{"$f":"IF('Tex-113,4-E'!$B$37=\"\",\"\",'Tex-113,4-E'!$B$37)","v":"Mass of Mold, (lb):"},{"$f":"IF('Tex-113,4-E'!$E$30=\"\",\"\",'Tex-113,4-E'!$E$30)","v":1}]
[29,{"$f":"IF('Tex-113,4-E'!$G$37=\"\",\"\",'Tex-113,4-E'!$G$37)","v":""},{"$f":"IF('Tex-113,4-E'!$B$6=\"\",\"\",'Tex-113,4-E'!$B$6)","v":"Tex-113-E or Tex-114-E"},{"$f":"IF('Tex-113,4-E'!$B$37=\"\",\"\",'Tex-113,4-E'!$B$37)","v":"Mass of Mold, (lb):"},{"$f":"IF('Tex-113,4-E'!$G$30=\"\",\"\",'Tex-113,4-E'!$G$30)","v":2}]
[30,{"$f":"IF('Tex-113,4-E'!$I$37=\"\",\"\",'Tex-113,4-E'!$I$37)","v":""},{"$f":"IF('Tex-113,4-E'!$B$6=\"\",\"\",'Tex-113,4-E'!$B$6)","v":"Tex-113-E or Tex-114-E"},{"$f":"IF('Tex-113,4-E'!$B$37=\"\",\"\",'Tex-113,4-E'!$B$37)","v":"Mass of Mold, (lb):"},{"$f":"IF('Tex-113,4-E'!$I$30=\"\",\"\",'Tex-113,4-E'!$I$30)","v":3}]
[31,{"$f":"IF('Tex-113,4-E'!$K$37=\"\",\"\",'Tex-113,4-E'!$K$37)","v":""},{"$f":"IF('Tex-113,4-E'!$B$6=\"\",\"\",'Tex-113,4-E'!$B$6)","v":"Tex-113-E or Tex-114-E"},{"$f":"IF('Tex-113,4-E'!$B$37=\"\",\"\",'Tex-113,4-E'!$B$37)","v":"Mass of Mold, (lb):"},{"$f":"IF('Tex-113,4-E'!$K$30=\"\",\"\",'Tex-113,4-E'!$K$30)","v":4}]
[32,{"$f":"IF('Tex-113,4-E'!$E$39=\"\",\"\",'Tex-113,4-E'!$E$39)","v":""},{"$f":"IF('Tex-113,4-E'!$B$6=\"\",\"\",'Tex-113,4-E'!$B$6)","v":"Tex-113-E or Tex-114-E"},{"$f":"IF('Tex-113,4-E'!$B$39=\"\",\"\",'Tex-113,4-E'!$B$39)","v":"Wet Mass Specimen, (lb):"},{"$f":"IF('Tex-113,4-E'!$E$30=\"\",\"\",'Tex-113,4-E'!$E$30)","v":1}]
[33,{"$f":"IF('Tex-113,4-E'!$G$39=\"\",\"\",'Tex-113,4-E'!$G$39)","v":""},{"$f":"IF('Tex-113,4-E'!$B$6=\"\",\"\",'Tex-113,4-E'!$B$6)","v":"Tex-113-E or Tex-114-E"},{"$f":"IF('Tex-113,4-E'!$B$39=\"\",\"\",'Tex-113,4-E'!$B$39)","v":"Wet Mass Specimen, (lb):"},{"$f":"IF('Tex-113,4-E'!$G$30=\"\",\"\",'Tex-113,4-E'!$G$30)","v":2}]
[34,{"$f":"IF('Tex-113,4-E'!$I$39=\"\",\"\",'Tex-113,4-E'!$I$39)","v":""},{"$f":"IF('Tex-113,4-E'!$B$6=\"\",\"\",'Tex-113,4-E'!$B$6)","v":"Tex-113-E or Tex-114-E"},{"$f":"IF('Tex-113,4-E'!$B$39=\"\",\"\",'Tex-113,4-E'!$B$39)","v":"Wet Mass Specimen, (lb):"},{"$f":"IF('Tex-113,4-E'!$I$30=\"\",\"\",'Tex-113,4-E'!$I$30)","v":3}]
[35,{"$f":"IF('Tex-113,4-E'!$K$39=\"\",\"\",'Tex-113,4-E'!$K$39)","v":""},{"$f":"IF('Tex-113,4-E'!$B$6=\"\",\"\",'Tex-113,4-E'!$B$6)","v":"Tex-113-E or Tex-114-E"},{"$f":"IF('Tex-113,4-E'!$B$39=\"\",\"\",'Tex-113,4-E'!$B$39)","v":"Wet Mass Specimen, (lb):"},{"$f":"IF('Tex-113,4-E'!$K$30=\"\",\"\",'Tex-113,4-E'!$K$30)","v":4}]
[36,{"$f":"IF('Tex-113,4-E'!$E$40=\"\",\"\",'Tex-113,4-E'!$E$40)","v":""},{"$f":"IF('Tex-113,4-E'!$B$6=\"\",\"\",'Tex-113,4-E'!$B$6)","v":"Tex-113-E or Tex-114-E"},{"$f":"IF('Tex-113,4-E'!$B$40=\"\",\"\",'Tex-113,4-E'!$B$40)","v":"Height of Specimen, (in.):"},{"$f":"IF('Tex-113,4-E'!$E$30=\"\",\"\",'Tex-113,4-E'!$E$30)","v":1}]
[37,{"$f":"IF('Tex-113,4-E'!$G$40=\"\",\"\",'Tex-113,4-E'!$G$40)","v":""},{"$f":"IF('Tex-113,4-E'!$B$6=\"\",\"\",'Tex-113,4-E'!$B$6)","v":"Tex-113-E or Tex-114-E"},{"$f":"IF('Tex-113,4-E'!$B$40=\"\",\"\",'Tex-113,4-E'!$B$40)","v":"Height of Specimen, (in.):"},{"$f":"IF('Tex-113,4-E'!$G$30=\"\",\"\",'Tex-113,4-E'!$G$30)","v":2}]
[38,{"$f":"IF('Tex-113,4-E'!$I$40=\"\",\"\",'Tex-113,4-E'!$I$40)","v":""},{"$f":"IF('Tex-113,4-E'!$B$6=\"\",\"\",'Tex-113,4-E'!$B$6)","v":"Tex-113-E or Tex-114-E"},{"$f":"IF('Tex-113,4-E'!$B$40=\"\",\"\",'Tex-113,4-E'!$B$40)","v":"Height of Specimen, (in.):"},{"$f":"IF('Tex-113,4-E'!$I$30=\"\",\"\",'Tex-113,4-E'!$I$30)","v":3}]
[39,{"$f":"IF('Tex-113,4-E'!$K$40=\"\",\"\",'Tex-113,4-E'!$K$40)","v":""},{"$f":"IF('Tex-113,4-E'!$B$6=\"\",\"\",'Tex-113,4-E'!$B$6)","v":"Tex-113-E or Tex-114-E"},{"$f":"IF('Tex-113,4-E'!$B$40=\"\",\"\",'Tex-113,4-E'!$B$40)","v":"Height of Specimen, (in.):"},{"$f":"IF('Tex-113,4-E'!$K$30=\"\",\"\",'Tex-113,4-E'!$K$30)","v":4}]
[40,{"$f":"IF('Tex-113,4-E'!$E$41=\"\",\"\",'Tex-113,4-E'!$E$41)","v":""},{"$f":"IF('Tex-113,4-E'!$B$6=\"\",\"\",'Tex-113,4-E'!$B$6)","v":"Tex-113-E or Tex-114-E"},{"$f":"IF('Tex-113,4-E'!$B$41=\"\",\"\",'Tex-113,4-E'!$B$41)","v":"Volume per Linear mm., (in.):"},{"$f":"IF('Tex-113,4-E'!$E$30=\"\",\"\",'Tex-113,4-E'!$E$30)","v":1}]
[41,{"$f":"IF('Tex-113,4-E'!$G$41=\"\",\"\",'Tex-113,4-E'!$G$41)","v":""},{"$f":"IF('Tex-113,4-E'!$B$6=\"\",\"\",'Tex-113,4-E'!$B$6)","v":"Tex-113-E or Tex-114-E"},{"$f":"IF('Tex-113,4-E'!$B$41=\"\",\"\",'Tex-113,4-E'!$B$41)","v":"Volume per Linear mm., (in.):"},{"$f":"IF('Tex-113,4-E'!$G$30=\"\",\"\",'Tex-113,4-E'!$G$30)","v":2}]
[42,{"$f":"IF('Tex-113,4-E'!$I$41=\"\",\"\",'Tex-113,4-E'!$I$41)","v":""},{"$f":"IF('Tex-113,4-E'!$B$6=\"\",\"\",'Tex-113,4-E'!$B$6)","v":"Tex-113-E or Tex-114-E"},{"$f":"IF('Tex-113,4-E'!$B$41=\"\",\"\",'Tex-113,4-E'!$B$41)","v":"Volume per Linear mm., (in.):"},{"$f":"IF('Tex-113,4-E'!$I$30=\"\",\"\",'Tex-113,4-E'!$I$30)","v":3}]
[43,{"$f":"IF('Tex-113,4-E'!$K$41=\"\",\"\",'Tex-113,4-E'!$K$41)","v":""},{"$f":"IF('Tex-113,4-E'!$B$6=\"\",\"\",'Tex-113,4-E'!$B$6)","v":"Tex-113-E or Tex-114-E"},{"$f":"IF('Tex-113,4-E'!$B$41=\"\",\"\",'Tex-113,4-E'!$B$41)","v":"Volume per Linear mm., (in.):"},{"$f":"IF('Tex-113,4-E'!$K$30=\"\",\"\",'Tex-113,4-E'!$K$30)","v":4}]
[44,{"$f":"IF('Tex-113,4-E'!$E$43=\"\",\"\",'Tex-113,4-E'!$E$43)","v":""},{"$f":"IF('Tex-113,4-E'!$B$6=\"\",\"\",'Tex-113,4-E'!$B$6)","v":"Tex-113-E or Tex-114-E"},{"$f":"IF('Tex-113,4-E'!$B$43=\"\",\"\",'Tex-113,4-E'!$B$43)","v":"Volume of Specimen, (ft^3):"},{"$f":"IF('Tex-113,4-E'!$E$30=\"\",\"\",'Tex-113,4-E'!$E$30)","v":1}]
[45,{"$f":"IF('Tex-113,4-E'!$G$43=\"\",\"\",'Tex-113,4-E'!$G$43)","v":""},{"$f":"IF('Tex-113,4-E'!$B$6=\"\",\"\",'Tex-113,4-E'!$B$6)","v":"Tex-113-E or Tex-114-E"},{"$f":"IF('Tex-113,4-E'!$B$43=\"\",\"\",'Tex-113,4-E'!$B$43)","v":"Volume of Specimen, (ft^3):"},{"$f":"IF('Tex-113,4-E'!$G$30=\"\",\"\",'Tex-113,4-E'!$G$30)","v":2}]
[46,{"$f":"IF('Tex-113,4-E'!$I$43=\"\",\"\",'Tex-113,4-E'!$I$43)","v":""},{"$f":"IF('Tex-113,4-E'!$B$6=\"\",\"\",'Tex-113,4-E'!$B$6)","v":"Tex-113-E or Tex-114-E"},{"$f":"IF('Tex-113,4-E'!$B$43=\"\",\"\",'Tex-113,4-E'!$B$43)","v":"Volume of Specimen, (ft^3):"},{"$f":"IF('Tex-113,4-E'!$I$30=\"\",\"\",'Tex-113,4-E'!$I$30)","v":3}]
[47,{"$f":"IF('Tex-113,4-E'!$K$43=\"\",\"\",'Tex-113,4-E'!$K$43)","v":""},{"$f":"IF('Tex-113,4-E'!$B$6=\"\",\"\",'Tex-113,4-E'!$B$6)","v":"Tex-113-E or Tex-114-E"},{"$f":"IF('Tex-113,4-E'!$B$43=\"\",\"\",'Tex-113,4-E'!$B$43)","v":"Volume of Specimen, (ft^3):"},{"$f":"IF('Tex-113,4-E'!$K$30=\"\",\"\",'Tex-113,4-E'!$K$30)","v":4}]
[48,{"$f":"IF('Tex-113,4-E'!$E$44=\"\",\"\",'Tex-113,4-E'!$E$44)","v":""},{"$f":"IF('Tex-113,4-E'!$B$6=\"\",\"\",'Tex-113,4-E'!$B$6)","v":"Tex-113-E or Tex-114-E"},{"$f":"IF('Tex-113,4-E'!$B$44=\"\",\"\",'Tex-113,4-E'!$B$44)","v":"Wet Density of Specimen, (lb):"},{"$f":"IF('Tex-113,4-E'!$E$30=\"\",\"\",'Tex-113,4-E'!$E$30)","v":1}]
[49,{"$f":"IF('Tex-113,4-E'!$G$44=\"\",\"\",'Tex-113,4-E'!$G$44)","v":""},{"$f":"IF('Tex-113,4-E'!$B$6=\"\",\"\",'Tex-113,4-E'!$B$6)","v":"Tex-113-E or Tex-114-E"},{"$f":"IF('Tex-113,4-E'!$B$44=\"\",\"\",'Tex-113,4-E'!$B$44)","v":"Wet Density of Specimen, (lb):"},{"$f":"IF('Tex-113,4-E'!$G$30=\"\",\"\",'Tex-113,4-E'!$G$30)","v":2}]
[50,{"$f":"IF('Tex-113,4-E'!$I$44=\"\",\"\",'Tex-113,4-E'!$I$44)","v":""},{"$f":"IF('Tex-113,4-E'!$B$6=\"\",\"\",'Tex-113,4-E'!$B$6)","v":"Tex-113-E or Tex-114-E"},{"$f":"IF('Tex-113,4-E'!$B$44=\"\",\"\",'Tex-113,4-E'!$B$44)","v":"Wet Density of Specimen, (lb):"},{"$f":"IF('Tex-113,4-E'!$I$30=\"\",\"\",'Tex-113,4-E'!$I$30)","v":3}]
[51,{"$f":"IF('Tex-113,4-E'!$K$44=\"\",\"\",'Tex-113,4-E'!$K$44)","v":""},{"$f":"IF('Tex-113,4-E'!$B$6=\"\",\"\",'Tex-113,4-E'!$B$6)","v":"Tex-113-E or Tex-114-E"},{"$f":"IF('Tex-113,4-E'!$B$44=\"\",\"\",'Tex-113,4-E'!$B$44)","v":"Wet Density of Specimen, (lb):"},{"$f":"IF('Tex-113,4-E'!$K$30=\"\",\"\",'Tex-113,4-E'!$K$30)","v":4}]
[52,{"$f":"IF('Tex-113,4-E'!$E$45=\"\",\"\",'Tex-113,4-E'!$E$45)","v":""},{"$f":"IF('Tex-113,4-E'!$B$6=\"\",\"\",'Tex-113,4-E'!$B$6)","v":"Tex-113-E or Tex-114-E"},{"$f":"IF('Tex-113,4-E'!$B$45=\"\",\"\",'Tex-113,4-E'!$B$45)","v":"Wet Mass of Pan & Specimen, (lb):"},{"$f":"IF('Tex-113,4-E'!$E$30=\"\",\"\",'Tex-113,4-E'!$E$30)","v":1}]
[53,{"$f":"IF('Tex-113,4-E'!$G$45=\"\",\"\",'Tex-113,4-E'!$G$45)","v":""},{"$f":"IF('Tex-113,4-E'!$B$6=\"\",\"\",'Tex-113,4-E'!$B$6)","v":"Tex-113-E or Tex-114-E"},{"$f":"IF('Tex-113,4-E'!$B$45=\"\",\"\",'Tex-113,4-E'!$B$45)","v":"Wet Mass of Pan & Specimen, (lb):"},{"$f":"IF('Tex-113,4-E'!$G$30=\"\",\"\",'Tex-113,4-E'!$G$30)","v":2}]
[54,{"$f":"IF('Tex-113,4-E'!$I$45=\"\",\"\",'Tex-113,4-E'!$I$45)","v":""},{"$f":"IF('Tex-113,4-E'!$B$6=\"\",\"\",'Tex-113,4-E'!$B$6)","v":"Tex-113-E or Tex-114-E"},{"$f":"IF('Tex-113,4-E'!$B$45=\"\",\"\",'Tex-113,4-E'!$B$45)","v":"Wet Mass of Pan & Specimen, (lb):"},{"$f":"IF('Tex-113,4-E'!$I$30=\"\",\"\",'Tex-113,4-E'!$I$30)","v":3}]
[55,{"$f":"IF('Tex-113,4-E'!$K$45=\"\",\"\",'Tex-113,4-E'!$K$45)","v":""},{"$f":"IF('Tex-113,4-E'!$B$6=\"\",\"\",'Tex-113,4-E'!$B$6)","v":"Tex-113-E or Tex-114-E"},{"$f":"IF('Tex-113,4-E'!$B$45=\"\",\"\",'Tex-113,4-E'!$B$45)","v":"Wet Mass of Pan & Specimen, (lb):"},{"$f":"IF('Tex-113,4-E'!$K$30=\"\",\"\",'Tex-113,4-E'!$K$30)","v":4}]
[56,{"$f":"IF('Tex-113,4-E'!$E$46=\"\",\"\",'Tex-113,4-E'!$E$46)","v":""},{"$f":"IF('Tex-113,4-E'!$B$6=\"\",\"\",'Tex-113,4-E'!$B$6)","v":"Tex-113-E or Tex-114-E"},{"$f":"IF('Tex-113,4-E'!$B$46=\"\",\"\",'Tex-113,4-E'!$B$46)","v":"Dry Mass Pan & Specimen, (lb):"},{"$f":"IF('Tex-113,4-E'!$E$30=\"\",\"\",'Tex-113,4-E'!$E$30)","v":1}]
[57,{"$f":"IF('Tex-113,4-E'!$G$46=\"\",\"\",'Tex-113,4-E'!$G$46)","v":""},{"$f":"IF('Tex-113,4-E'!$B$6=\"\",\"\",'Tex-113,4-E'!$B$6)","v":"Tex-113-E or Tex-114-E"},{"$f":"IF('Tex-113,4-E'!$B$46=\"\",\"\",'Tex-113,4-E'!$B$46)","v":"Dry Mass Pan & Specimen, (lb):"},{"$f":"IF('Tex-113,4-E'!$G$30=\"\",\"\",'Tex-113,4-E'!$G$30)","v":2}]
[58,{"$f":"IF('Tex-113,4-E'!$I$46=\"\",\"\",'Tex-113,4-E'!$I$46)","v":""},{"$f":"IF('Tex-113,4-E'!$B$6=\"\",\"\",'Tex-113,4-E'!$B$6)","v":"Tex-113-E or Tex-114-E"},{"$f":"IF('Tex-113,4-E'!$B$46=\"\",\"\",'Tex-113,4-E'!$B$46)","v":"Dry Mass Pan & Specimen, (lb):"},{"$f":"IF('Tex-113,4-E'!$I$30=\"\",\"\",'Tex-113,4-E'!$I$30)","v":3}]
[59,{"$f":"IF('Tex-113,4-E'!$K$46=\"\",\"\",'Tex-113,4-E'!$K$46)","v":""},{"$f":"IF('Tex-113,4-E'!$B$6=\"\",\"\",'Tex-113,4-E'!$B$6)","v":"Tex-113-E or Tex-114-E"},{"$f":"IF('Tex-113,4-E'!$B$46=\"\",\"\",'Tex-113,4-E'!$B$46)","v":"Dry Mass Pan & Specimen, (lb):"},{"$f":"IF('Tex-113,4-E'!$K$30=\"\",\"\",'Tex-113,4-E'!$K$30)","v":4}]
[60,{"$f":"IF('Tex-113,4-E'!$E$47=\"\",\"\",'Tex-113,4-E'!$E$47)","v":""},{"$f":"IF('Tex-113,4-E'!$B$6=\"\",\"\",'Tex-113,4-E'!$B$6)","v":"Tex-113-E or Tex-114-E"},{"$f":"IF('Tex-113,4-E'!$B$47=\"\",\"\",'Tex-113,4-E'!$B$47)","v":"Tare Mass Pan, (lb):"},{"$f":"IF('Tex-113,4-E'!$E$30=\"\",\"\",'Tex-113,4-E'!$E$30)","v":1}]
[61,{"$f":"IF('Tex-113,4-E'!$G$47=\"\",\"\",'Tex-113,4-E'!$G$47)","v":""},{"$f":"IF('Tex-113,4-E'!$B$6=\"\",\"\",'Tex-113,4-E'!$B$6)","v":"Tex-113-E or Tex-114-E"},{"$f":"IF('Tex-113,4-E'!$B$47=\"\",\"\",'Tex-113,4-E'!$B$47)","v":"Tare Mass Pan, (lb):"},{"$f":"IF('Tex-113,4-E'!$G$30=\"\",\"\",'Tex-113,4-E'!$G$30)","v":2}]
[62,{"$f":"IF('Tex-113,4-E'!$I$47=\"\",\"\",'Tex-113,4-E'!$I$47)","v":""},{"$f":"IF('Tex-113,4-E'!$B$6=\"\",\"\",'Tex-113,4-E'!$B$6)","v":"Tex-113-E or Tex-114-E"},{"$f":"IF('Tex-113,4-E'!$B$47=\"\",\"\",'Tex-113,4-E'!$B$47)","v":"Tare Mass Pan, (lb):"},{"$f":"IF('Tex-113,4-E'!$I$30=\"\",\"\",'Tex-113,4-E'!$I$30)","v":3}]
[63,{"$f":"IF('Tex-113,4-E'!$K$47=\"\",\"\",'Tex-113,4-E'!$K$47)","v":""},{"$f":"IF('Tex-113,4-E'!$B$6=\"\",\"\",'Tex-113,4-E'!$B$6)","v":"Tex-113-E or Tex-114-E"},{"$f":"IF('Tex-113,4-E'!$B$47=\"\",\"\",'Tex-113,4-E'!$B$47)","v":"Tare Mass Pan, (lb):"},{"$f":"IF('Tex-113,4-E'!$K$30=\"\",\"\",'Tex-113,4-E'!$K$30)","v":4}]
[64,{"$f":"IF('Tex-113,4-E'!$E$48=\"\",\"\",'Tex-113,4-E'!$E$48)","v":""},{"$f":"IF('Tex-113,4-E'!$B$6=\"\",\"\",'Tex-113,4-E'!$B$6)","v":"Tex-113-E or Tex-114-E"},{"$f":"IF('Tex-113,4-E'!$B$48=\"\",\"\",'Tex-113,4-E'!$B$48)","v":"Dry Mass Material , (lb):"},{"$f":"IF('Tex-113,4-E'!$E$30=\"\",\"\",'Tex-113,4-E'!$E$30)","v":1}]
[65,{"$f":"IF('Tex-113,4-E'!$G$48=\"\",\"\",'Tex-113,4-E'!$G$48)","v":""},{"$f":"IF('Tex-113,4-E'!$B$6=\"\",\"\",'Tex-113,4-E'!$B$6)","v":"Tex-113-E or Tex-114-E"},{"$f":"IF('Tex-113,4-E'!$B$48=\"\",\"\",'Tex-113,4-E'!$B$48)","v":"Dry Mass Material , (lb):"},{"$f":"IF('Tex-113,4-E'!$G$30=\"\",\"\",'Tex-113,4-E'!$G$30)","v":2}]
[66,{"$f":"IF('Tex-113,4-E'!$I$48=\"\",\"\",'Tex-113,4-E'!$I$48)","v":""},{"$f":"IF('Tex-113,4-E'!$B$6=\"\",\"\",'Tex-113,4-E'!$B$6)","v":"Tex-113-E or Tex-114-E"},{"$f":"IF('Tex-113,4-E'!$B$48=\"\",\"\",'Tex-113,4-E'!$B$48)","v":"Dry Mass Material , (lb):"},{"$f":"IF('Tex-113,4-E'!$I$30=\"\",\"\",'Tex-113,4-E'!$I$30)","v":3}]
[67,{"$f":"IF('Tex-113,4-E'!$K$48=\"\",\"\",'Tex-113,4-E'!$K$48)","v":""},{"$f":"IF('Tex-113,4-E'!$B$6=\"\",\"\",'Tex-113,4-E'!$B$6)","v":"Tex-113-E or Tex-114-E"},{"$f":"IF('Tex-113,4-E'!$B$48=\"\",\"\",'Tex-113,4-E'!$B$48)","v":"Dry Mass Material , (lb):"},{"$f":"IF('Tex-113,4-E'!$K$30=\"\",\"\",'Tex-113,4-E'!$K$30)","v":4}]
[68,{"$f":"IF('Tex-113,4-E'!$E$49=\"\",\"\",'Tex-113,4-E'!$E$49)","v":""},{"$f":"IF('Tex-113,4-E'!$B$6=\"\",\"\",'Tex-113,4-E'!$B$6)","v":"Tex-113-E or Tex-114-E"},{"$f":"IF('Tex-113,4-E'!$B$49=\"\",\"\",'Tex-113,4-E'!$B$49)","v":"Mass Water, (lb):"},{"$f":"IF('Tex-113,4-E'!$E$30=\"\",\"\",'Tex-113,4-E'!$E$30)","v":1}]
[69,{"$f":"IF('Tex-113,4-E'!$G$49=\"\",\"\",'Tex-113,4-E'!$G$49)","v":""},{"$f":"IF('Tex-113,4-E'!$B$6=\"\",\"\",'Tex-113,4-E'!$B$6)","v":"Tex-113-E or Tex-114-E"},{"$f":"IF('Tex-113,4-E'!$B$49=\"\",\"\",'Tex-113,4-E'!$B$49)","v":"Mass Water, (lb):"},{"$f":"IF('Tex-113,4-E'!$G$30=\"\",\"\",'Tex-113,4-E'!$G$30)","v":2}]
[70,{"$f":"IF('Tex-113,4-E'!$I$49=\"\",\"\",'Tex-113,4-E'!$I$49)","v":""},{"$f":"IF('Tex-113,4-E'!$B$6=\"\",\"\",'Tex-113,4-E'!$B$6)","v":"Tex-113-E or Tex-114-E"},{"$f":"IF('Tex-113,4-E'!$B$49=\"\",\"\",'Tex-113,4-E'!$B$49)","v":"Mass Water, (lb):"},{"$f":"IF('Tex-113,4-E'!$I$30=\"\",\"\",'Tex-113,4-E'!$I$30)","v":3}]
[71,{"$f":"IF('Tex-113,4-E'!$K$49=\"\",\"\",'Tex-113,4-E'!$K$49)","v":""},{"$f":"IF('Tex-113,4-E'!$B$6=\"\",\"\",'Tex-113,4-E'!$B$6)","v":"Tex-113-E or Tex-114-E"},{"$f":"IF('Tex-113,4-E'!$B$49=\"\",\"\",'Tex-113,4-E'!$B$49)","v":"Mass Water, (lb):"},{"$f":"IF('Tex-113,4-E'!$K$30=\"\",\"\",'Tex-113,4-E'!$K$30)","v":4}]
[72,{"$f":"IF('Tex-113,4-E'!$E$50=\"\",\"\",'Tex-113,4-E'!$E$50)","v":""},{"$f":"IF('Tex-113,4-E'!$B$6=\"\",\"\",'Tex-113,4-E'!$B$6)","v":"Tex-113-E or Tex-114-E"},{"$f":"IF('Tex-113,4-E'!$B$50=\"\",\"\",'Tex-113,4-E'!$B$50)","v":"Percent Water on Total , (%):"},{"$f":"IF('Tex-113,4-E'!$E$30=\"\",\"\",'Tex-113,4-E'!$E$30)","v":1}]
[73,{"$f":"IF('Tex-113,4-E'!$G$50=\"\",\"\",'Tex-113,4-E'!$G$50)","v":""},{"$f":"IF('Tex-113,4-E'!$B$6=\"\",\"\",'Tex-113,4-E'!$B$6)","v":"Tex-113-E or Tex-114-E"},{"$f":"IF('Tex-113,4-E'!$B$50=\"\",\"\",'Tex-113,4-E'!$B$50)","v":"Percent Water on Total , (%):"},{"$f":"IF('Tex-113,4-E'!$G$30=\"\",\"\",'Tex-113,4-E'!$G$30)","v":2}]
[74,{"$f":"IF('Tex-113,4-E'!$I$50=\"\",\"\",'Tex-113,4-E'!$I$50)","v":""},{"$f":"IF('Tex-113,4-E'!$B$6=\"\",\"\",'Tex-113,4-E'!$B$6)","v":"Tex-113-E or Tex-114-E"},{"$f":"IF('Tex-113,4-E'!$B$50=\"\",\"\",'Tex-113,4-E'!$B$50)","v":"Percent Water on Total , (%):"},{"$f":"IF('Tex-113,4-E'!$I$30=\"\",\"\",'Tex-113,4-E'!$I$30)","v":3}]
[75,{"$f":"IF('Tex-113,4-E'!$K$50=\"\",\"\",'Tex-113,4-E'!$K$50)","v":""},{"$f":"IF('Tex-113,4-E'!$B$6=\"\",\"\",'Tex-113,4-E'!$B$6)","v":"Tex-113-E or Tex-114-E"},{"$f":"IF('Tex-113,4-E'!$B$50=\"\",\"\",'Tex-113,4-E'!$B$50)","v":"Percent Water on Total , (%):"},{"$f":"IF('Tex-113,4-E'!$K$30=\"\",\"\",'Tex-113,4-E'!$K$30)","v":4}]
[76,{"$f":"IF('Tex-113,4-E'!$E$51=\"\",\"\",'Tex-113,4-E'!$E$51)","v":""},{"$f":"IF('Tex-113,4-E'!$B$6=\"\",\"\",'Tex-113,4-E'!$B$6)","v":"Tex-113-E or Tex-114-E"},{"$f":"IF('Tex-113,4-E'!$B$51=\"\",\"\",'Tex-113,4-E'!$B$51)","v":"Dry Density, (pcf):"},{"$f":"IF('Tex-113,4-E'!$E$30=\"\",\"\",'Tex-113,4-E'!$E$30)","v":1}]
[77,{"$f":"IF('Tex-113,4-E'!$G$51=\"\",\"\",'Tex-113,4-E'!$G$51)","v":""},{"$f":"IF('Tex-113,4-E'!$B$6=\"\",\"\",'Tex-113,4-E'!$B$6)","v":"Tex-113-E or Tex-114-E"},{"$f":"IF('Tex-113,4-E'!$B$51=\"\",\"\",'Tex-113,4-E'!$B$51)","v":"Dry Density, (pcf):"},{"$f":"IF('Tex-113,4-E'!$G$30=\"\",\"\",'Tex-113,4-E'!$G$30)","v":2}]
[78,{"$f":"IF('Tex-113,4-E'!$I$51=\"\",\"\",'Tex-113,4-E'!$I$51)","v":""},{"$f":"IF('Tex-113,4-E'!$B$6=\"\",\"\",'Tex-113,4-E'!$B$6)","v":"Tex-113-E or Tex-114-E"},{"$f":"IF('Tex-113,4-E'!$B$51=\"\",\"\",'Tex-113,4-E'!$B$51)","v":"Dry Density, (pcf):"},{"$f":"IF('Tex-113,4-E'!$I$30=\"\",\"\",'Tex-113,4-E'!$I$30)","v":3}]
[79,{"$f":"IF('Tex-113,4-E'!$K$51=\"\",\"\",'Tex-113,4-E'!$K$51)","v":""},{"$f":"IF('Tex-113,4-E'!$B$6=\"\",\"\",'Tex-113,4-E'!$B$6)","v":"Tex-113-E or Tex-114-E"},{"$f":"IF('Tex-113,4-E'!$B$51=\"\",\"\",'Tex-113,4-E'!$B$51)","v":"Dry Density, (pcf):"},{"$f":"IF('Tex-113,4-E'!$K$30=\"\",\"\",'Tex-113,4-E'!$K$30)","v":4}]
[80,{"$f":"IF('Tex-113,4-E'!$E$52=\"\",\"\",'Tex-113,4-E'!$E$52)","v":""},{"$f":"IF('Tex-113,4-E'!$B$6=\"\",\"\",'Tex-113,4-E'!$B$6)","v":"Tex-113-E or Tex-114-E"},{"$f":"IF('Tex-113,4-E'!$B$52=\"\",\"\",'Tex-113,4-E'!$B$52)","v":"Estimated Dry Density, (pcf):"},{"$f":"IF('Tex-113,4-E'!$E$30=\"\",\"\",'Tex-113,4-E'!$E$30)","v":1}]
[81,{"$f":"IF('Tex-113,4-E'!$G$52=\"\",\"\",'Tex-113,4-E'!$G$52)","v":""},{"$f":"IF('Tex-113,4-E'!$B$6=\"\",\"\",'Tex-113,4-E'!$B$6)","v":"Tex-113-E or Tex-114-E"},{"$f":"IF('Tex-113,4-E'!$B$52=\"\",\"\",'Tex-113,4-E'!$B$52)","v":"Estimated Dry Density, (pcf):"},{"$f":"IF('Tex-113,4-E'!$G$30=\"\",\"\",'Tex-113,4-E'!$G$30)","v":2}]
[82,{"$f":"IF('Tex-113,4-E'!$I$52=\"\",\"\",'Tex-113,4-E'!$I$52)","v":""},{"$f":"IF('Tex-113,4-E'!$B$6=\"\",\"\",'Tex-113,4-E'!$B$6)","v":"Tex-113-E or Tex-114-E"},{"$f":"IF('Tex-113,4-E'!$B$52=\"\",\"\",'Tex-113,4-E'!$B$52)","v":"Estimated Dry Density, (pcf):"},{"$f":"IF('Tex-113,4-E'!$I$30=\"\",\"\",'Tex-113,4-E'!$I$30)","v":3}]
[83,{"$f":"IF('Tex-113,4-E'!$K$52=\"\",\"\",'Tex-113,4-E'!$K$52)","v":""},{"$f":"IF('Tex-113,4-E'!$B$6=\"\",\"\",'Tex-113,4-E'!$B$6)","v":"Tex-113-E or Tex-114-E"},{"$f":"IF('Tex-113,4-E'!$B$52=\"\",\"\",'Tex-113,4-E'!$B$52)","v":"Estimated Dry Density, (pcf):"},{"$f":"IF('Tex-113,4-E'!$K$30=\"\",\"\",'Tex-113,4-E'!$K$30)","v":4}]
[84,{"$f":"IF('Tex-113,4-E'!$E$83=\"\",\"\",'Tex-113,4-E'!$E$83)","v":""},{"$f":"IF('Tex-113,4-E'!$B$6=\"\",\"\",'Tex-113,4-E'!$B$6)","v":"Tex-113-E or Tex-114-E"},{"$f":"IF('Tex-113,4-E'!$B$83=\"\",\"\",'Tex-113,4-E'!$B$83)","v":"Max Dry Density, (pcf):"}]
[85,{"$f":"IF('Tex-113,4-E'!$E$84=\"\",\"\",'Tex-113,4-E'!$E$84)","v":""},{"$f":"IF('Tex-113,4-E'!$B$6=\"\",\"\",'Tex-113,4-E'!$B$6)","v":"Tex-113-E or Tex-114-E"},{"$f":"IF('Tex-113,4-E'!$B$84=\"\",\"\",'Tex-113,4-E'!$B$84)","v":"Max Density, (kg/m3):"}]
[86,{"$f":"IF('Tex-113,4-E'!$E$85=\"\",\"\",'Tex-113,4-E'!$E$85)","v":""},{"$f":"IF('Tex-113,4-E'!$B$6=\"\",\"\",'Tex-113,4-E'!$B$6)","v":"Tex-113-E or Tex-114-E"},{"$f":"IF('Tex-113,4-E'!$B$85=\"\",\"\",'Tex-113,4-E'!$B$85)","v":"Optimum Moisture Content, (%):"}]
[87,{"$f":"IF('Tex-113,4-E'!$E$55=\"\",\"\",'Tex-113,4-E'!$E$55)","v":""},{"$f":"IF('Tex-113,4-E'!$B$6=\"\",\"\",'Tex-113,4-E'!$B$6)","v":"Tex-113-E or Tex-114-E"},{"$f":"IF(OR('Tex-113,4-E'!$E$54=\"\",'Tex-113,4-E'!$B$55=\"\"),\"\",'Tex-113,4-E'!$E$54&\", \"&'Tex-113,4-E'!$B$55)","v":"Total Energy \n(lb-ft), Lift 1:"},{"$f":"IF('Tex-113,4-E'!$E$30=\"\",\"\",'Tex-113,4-E'!$E$30)","v":1}]
[88,{"$f":"IF('Tex-113,4-E'!$E$56=\"\",\"\",'Tex-113,4-E'!$E$56)","v":""},{"$f":"IF('Tex-113,4-E'!$B$6=\"\",\"\",'Tex-113,4-E'!$B$6)","v":"Tex-113-E or Tex-114-E"},{"$f":"IF(OR('Tex-113,4-E'!$G$54=\"\",'Tex-113,4-E'!$B$56=\"\"),\"\",'Tex-113,4-E'!$G$54&\", \"&'Tex-113,4-E'!$B$56)","v":"Total Energy \n(lb-ft), Lift 2:"},{"$f":"IF('Tex-113,4-E'!$E$30=\"\",\"\",'Tex-113,4-E'!$E$30)","v":1}]
[89,{"$f":"IF('Tex-113,4-E'!$E$57=\"\",\"\",'Tex-113,4-E'!$E$57)","v":""},{"$f":"IF('Tex-113,4-E'!$B$6=\"\",\"\",'Tex-113,4-E'!$B$6)","v":"Tex-113-E or Tex-114-E"},{"$f":"IF(OR('Tex-113,4-E'!$I$54=\"\",'Tex-113,4-E'!$B$57=\"\"),\"\",'Tex-113,4-E'!$I$54&\", \"&'Tex-113,4-E'!$B$57)","v":"Total Energy \n(lb-ft), Lift 3:"},{"$f":"IF('Tex-113,4-E'!$E$30=\"\",\"\",'Tex-113,4-E'!$E$30)","v":1}]
[90,{"$f":"IF('Tex-113,4-E'!$E$58=\"\",\"\",'Tex-113,4-E'!$E$58)","v":""},{"$f":"IF('Tex-113,4-E'!$B$6=\"\",\"\",'Tex-113,4-E'!$B$6)","v":"Tex-113-E or Tex-114-E"},{"$f":"IF(OR('Tex-113,4-E'!$K$54=\"\",'Tex-113,4-E'!$B$58=\"\"),\"\",'Tex-113,4-E'!$K$54&\", \"&'Tex-113,4-E'!$B$58)","v":"Total Energy \n(lb-ft), Lift 4:"},{"$f":"IF('Tex-113,4-E'!$E$30=\"\",\"\",'Tex-113,4-E'!$E$30)","v":1}]
[91,{"$f":"IF('Tex-113,4-E'!$G$55=\"\",\"\",'Tex-113,4-E'!$G$55)","v":""},{"$f":"IF('Tex-113,4-E'!$B$6=\"\",\"\",'Tex-113,4-E'!$B$6)","v":"Tex-113-E or Tex-114-E"},{"$f":"IF(OR('Tex-113,4-E'!$E$54=\"\",'Tex-113,4-E'!$B$55=\"\"),\"\",'Tex-113,4-E'!$E$54&\", \"&'Tex-113,4-E'!$B$55)","v":"Total Energy \n(lb-ft), Lift 1:"},{"$f":"IF('Tex-113,4-E'!$G$30=\"\",\"\",'Tex-113,4-E'!$G$30)","v":2}]
[92,{"$f":"IF('Tex-113,4-E'!$G$56=\"\",\"\",'Tex-113,4-E'!$G$56)","v":""},{"$f":"IF('Tex-113,4-E'!$B$6=\"\",\"\",'Tex-113,4-E'!$B$6)","v":"Tex-113-E or Tex-114-E"},{"$f":"IF(OR('Tex-113,4-E'!$G$54=\"\",'Tex-113,4-E'!$B$56=\"\"),\"\",'Tex-113,4-E'!$G$54&\", \"&'Tex-113,4-E'!$B$56)","v":"Total Energy \n(lb-ft), Lift 2:"},{"$f":"IF('Tex-113,4-E'!$G$30=\"\",\"\",'Tex-113,4-E'!$G$30)","v":2}]
[93,{"$f":"IF('Tex-113,4-E'!$G$57=\"\",\"\",'Tex-113,4-E'!$G$57)","v":""},{"$f":"IF('Tex-113,4-E'!$B$6=\"\",\"\",'Tex-113,4-E'!$B$6)","v":"Tex-113-E or Tex-114-E"},{"$f":"IF(OR('Tex-113,4-E'!$I$54=\"\",'Tex-113,4-E'!$B$57=\"\"),\"\",'Tex-113,4-E'!$I$54&\", \"&'Tex-113,4-E'!$B$57)","v":"Total Energy \n(lb-ft), Lift 3:"},{"$f":"IF('Tex-113,4-E'!$G$30=\"\",\"\",'Tex-113,4-E'!$G$30)","v":2}]
[94,{"$f":"IF('Tex-113,4-E'!$G$58=\"\",\"\",'Tex-113,4-E'!$G$58)","v":""},{"$f":"IF('Tex-113,4-E'!$B$6=\"\",\"\",'Tex-113,4-E'!$B$6)","v":"Tex-113-E or Tex-114-E"},{"$f":"IF(OR('Tex-113,4-E'!$K$54=\"\",'Tex-113,4-E'!$B$58=\"\"),\"\",'Tex-113,4-E'!$K$54&\", \"&'Tex-113,4-E'!$B$58)","v":"Total Energy \n(lb-ft), Lift 4:"},{"$f":"IF('Tex-113,4-E'!$G$30=\"\",\"\",'Tex-113,4-E'!$G$30)","v":2}]
[95,{"$f":"IF('Tex-113,4-E'!$I$55=\"\",\"\",'Tex-113,4-E'!$I$55)","v":""},{"$f":"IF('Tex-113,4-E'!$B$6=\"\",\"\",'Tex-113,4-E'!$B$6)","v":"Tex-113-E or Tex-114-E"},{"$f":"IF(OR('Tex-113,4-E'!$E$54=\"\",'Tex-113,4-E'!$B$55=\"\"),\"\",'Tex-113,4-E'!$E$54&\", \"&'Tex-113,4-E'!$B$55)","v":"Total Energy \n(lb-ft), Lift 1:"},{"$f":"IF('Tex-113,4-E'!$I$30=\"\",\"\",'Tex-113,4-E'!$I$30)","v":3}]
[96,{"$f":"IF('Tex-113,4-E'!$I$56=\"\",\"\",'Tex-113,4-E'!$I$56)","v":""},{"$f":"IF('Tex-113,4-E'!$B$6=\"\",\"\",'Tex-113,4-E'!$B$6)","v":"Tex-113-E or Tex-114-E"},{"$f":"IF(OR('Tex-113,4-E'!$G$54=\"\",'Tex-113,4-E'!$B$56=\"\"),\"\",'Tex-113,4-E'!$G$54&\", \"&'Tex-113,4-E'!$B$56)","v":"Total Energy \n(lb-ft), Lift 2:"},{"$f":"IF('Tex-113,4-E'!$I$30=\"\",\"\",'Tex-113,4-E'!$I$30)","v":3}]
[97,{"$f":"IF('Tex-113,4-E'!$I$57=\"\",\"\",'Tex-113,4-E'!$I$57)","v":""},{"$f":"IF('Tex-113,4-E'!$B$6=\"\",\"\",'Tex-113,4-E'!$B$6)","v":"Tex-113-E or Tex-114-E"},{"$f":"IF(OR('Tex-113,4-E'!$I$54=\"\",'Tex-113,4-E'!$B$57=\"\"),\"\",'Tex-113,4-E'!$I$54&\", \"&'Tex-113,4-E'!$B$57)","v":"Total Energy \n(lb-ft), Lift 3:"},{"$f":"IF('Tex-113,4-E'!$I$30=\"\",\"\",'Tex-113,4-E'!$I$30)","v":3}]
[98,{"$f":"IF('Tex-113,4-E'!$I$58=\"\",\"\",'Tex-113,4-E'!$I$58)","v":""},{"$f":"IF('Tex-113,4-E'!$B$6=\"\",\"\",'Tex-113,4-E'!$B$6)","v":"Tex-113-E or Tex-114-E"},{"$f":"IF(OR('Tex-113,4-E'!$K$54=\"\",'Tex-113,4-E'!$B$58=\"\"),\"\",'Tex-113,4-E'!$K$54&\", \"&'Tex-113,4-E'!$B$58)","v":"Total Energy \n(lb-ft), Lift 4:"},{"$f":"IF('Tex-113,4-E'!$I$30=\"\",\"\",'Tex-113,4-E'!$I$30)","v":3}]
[99,{"$f":"IF('Tex-113,4-E'!$K$55=\"\",\"\",'Tex-113,4-E'!$K$55)","v":""},{"$f":"IF('Tex-113,4-E'!$B$6=\"\",\"\",'Tex-113,4-E'!$B$6)","v":"Tex-113-E or Tex-114-E"},{"$f":"IF(OR('Tex-113,4-E'!$E$54=\"\",'Tex-113,4-E'!$B$55=\"\"),\"\",'Tex-113,4-E'!$E$54&\", \"&'Tex-113,4-E'!$B$55)","v":"Total Energy \n(lb-ft), Lift 1:"},{"$f":"IF('Tex-113,4-E'!$K$30=\"\",\"\",'Tex-113,4-E'!$K$30)","v":4}]
[100,{"$f":"IF('Tex-113,4-E'!$K$56=\"\",\"\",'Tex-113,4-E'!$K$56)","v":""},{"$f":"IF('Tex-113,4-E'!$B$6=\"\",\"\",'Tex-113,4-E'!$B$6)","v":"Tex-113-E or Tex-114-E"},{"$f":"IF(OR('Tex-113,4-E'!$G$54=\"\",'Tex-113,4-E'!$B$56=\"\"),\"\",'Tex-113,4-E'!$G$54&\", \"&'Tex-113,4-E'!$B$56)","v":"Total Energy \n(lb-ft), Lift 2:"},{"$f":"IF('Tex-113,4-E'!$K$30=\"\",\"\",'Tex-113,4-E'!$K$30)","v":4}]
[101,{"$f":"IF('Tex-113,4-E'!$K$57=\"\",\"\",'Tex-113,4-E'!$K$57)","v":""},{"$f":"IF('Tex-113,4-E'!$B$6=\"\",\"\",'Tex-113,4-E'!$B$6)","v":"Tex-113-E or Tex-114-E"},{"$f":"IF(OR('Tex-113,4-E'!$I$54=\"\",'Tex-113,4-E'!$B$57=\"\"),\"\",'Tex-113,4-E'!$I$54&\", \"&'Tex-113,4-E'!$B$57)","v":"Total Energy \n(lb-ft), Lift 3:"},{"$f":"IF('Tex-113,4-E'!$K$30=\"\",\"\",'Tex-113,4-E'!$K$30)","v":4}]
[102,{"$f":"IF('Tex-113,4-E'!$K$58=\"\",\"\",'Tex-113,4-E'!$K$58)","v":""},{"$f":"IF('Tex-113,4-E'!$B$6=\"\",\"\",'Tex-113,4-E'!$B$6)","v":"Tex-113-E or Tex-114-E"},{"$f":"IF(OR('Tex-113,4-E'!$K$54=\"\",'Tex-113,4-E'!$B$58=\"\"),\"\",'Tex-113,4-E'!$K$54&\", \"&'Tex-113,4-E'!$B$58)","v":"Total Energy \n(lb-ft), Lift 4:"},{"$f":"IF('Tex-113,4-E'!$K$30=\"\",\"\",'Tex-113,4-E'!$K$30)","v":4}]
[103,{"$f":"IF('Tex-113,4-E'!$F$55=\"\",\"\",'Tex-113,4-E'!$F$55)","v":""},{"$f":"IF('Tex-113,4-E'!$B$6=\"\",\"\",'Tex-113,4-E'!$B$6)","v":"Tex-113-E or Tex-114-E"},{"$f":"IF(OR('Tex-113,4-E'!$F$54=\"\",'Tex-113,4-E'!$B$55=\"\"),\"\",'Tex-113,4-E'!$F$54&\", \"&'Tex-113,4-E'!$B$55)","v":"Avg Energy/\nBlow (lb-ft), Lift 1:"},{"$f":"IF('Tex-113,4-E'!$E$30=\"\",\"\",'Tex-113,4-E'!$E$30)","v":1}]
[104,{"$f":"IF('Tex-113,4-E'!$F$56=\"\",\"\",'Tex-113,4-E'!$F$56)","v":""},{"$f":"IF('Tex-113,4-E'!$B$6=\"\",\"\",'Tex-113,4-E'!$B$6)","v":"Tex-113-E or Tex-114-E"},{"$f":"IF(OR('Tex-113,4-E'!$H$54=\"\",'Tex-113,4-E'!$B$56=\"\"),\"\",'Tex-113,4-E'!$H$54&\", \"&'Tex-113,4-E'!$B$56)","v":"Avg Energy/\nBlow (lb-ft), Lift 2:"},{"$f":"IF('Tex-113,4-E'!$E$30=\"\",\"\",'Tex-113,4-E'!$E$30)","v":1}]
[105,{"$f":"IF('Tex-113,4-E'!$F$57=\"\",\"\",'Tex-113,4-E'!$F$57)","v":""},{"$f":"IF('Tex-113,4-E'!$B$6=\"\",\"\",'Tex-113,4-E'!$B$6)","v":"Tex-113-E or Tex-114-E"},{"$f":"IF(OR('Tex-113,4-E'!$J$54=\"\",'Tex-113,4-E'!$B$57=\"\"),\"\",'Tex-113,4-E'!$J$54&\", \"&'Tex-113,4-E'!$B$57)","v":"Avg Energy/\nBlow (lb-ft), Lift 3:"},{"$f":"IF('Tex-113,4-E'!$E$30=\"\",\"\",'Tex-113,4-E'!$E$30)","v":1}]
[106,{"$f":"IF('Tex-113,4-E'!$F$58=\"\",\"\",'Tex-113,4-E'!$F$58)","v":""},{"$f":"IF('Tex-113,4-E'!$B$6=\"\",\"\",'Tex-113,4-E'!$B$6)","v":"Tex-113-E or Tex-114-E"},{"$f":"IF(OR('Tex-113,4-E'!$L$54=\"\",'Tex-113,4-E'!$B$58=\"\"),\"\",'Tex-113,4-E'!$L$54&\", \"&'Tex-113,4-E'!$B$58)","v":"Avg Energy/\nBlow (lb-ft), Lift 4:"},{"$f":"IF('Tex-113,4-E'!$E$30=\"\",\"\",'Tex-113,4-E'!$E$30)","v":1}]
[107,{"$f":"IF('Tex-113,4-E'!$H$55=\"\",\"\",'Tex-113,4-E'!$H$55)","v":""},{"$f":"IF('Tex-113,4-E'!$B$6=\"\",\"\",'Tex-113,4-E'!$B$6)","v":"Tex-113-E or Tex-114-E"},{"$f":"IF(OR('Tex-113,4-E'!$F$54=\"\",'Tex-113,4-E'!$B$55=\"\"),\"\",'Tex-113,4-E'!$F$54&\", \"&'Tex-113,4-E'!$B$55)","v":"Avg Energy/\nBlow (lb-ft), Lift 1:"},{"$f":"IF('Tex-113,4-E'!$G$30=\"\",\"\",'Tex-113,4-E'!$G$30)","v":2}]
[108,{"$f":"IF('Tex-113,4-E'!$H$56=\"\",\"\",'Tex-113,4-E'!$H$56)","v":""},{"$f":"IF('Tex-113,4-E'!$B$6=\"\",\"\",'Tex-113,4-E'!$B$6)","v":"Tex-113-E or Tex-114-E"},{"$f":"IF(OR('Tex-113,4-E'!$H$54=\"\",'Tex-113,4-E'!$B$56=\"\"),\"\",'Tex-113,4-E'!$H$54&\", \"&'Tex-113,4-E'!$B$56)","v":"Avg Energy/\nBlow (lb-ft), Lift 2:"},{"$f":"IF('Tex-113,4-E'!$G$30=\"\",\"\",'Tex-113,4-E'!$G$30)","v":2}]
[109,{"$f":"IF('Tex-113,4-E'!$H$57=\"\",\"\",'Tex-113,4-E'!$H$57)","v":""},{"$f":"IF('Tex-113,4-E'!$B$6=\"\",\"\",'Tex-113,4-E'!$B$6)","v":"Tex-113-E or Tex-114-E"},{"$f":"IF(OR('Tex-113,4-E'!$J$54=\"\",'Tex-113,4-E'!$B$57=\"\"),\"\",'Tex-113,4-E'!$J$54&\", \"&'Tex-113,4-E'!$B$57)","v":"Avg Energy/\nBlow (lb-ft), Lift 3:"},{"$f":"IF('Tex-113,4-E'!$G$30=\"\",\"\",'Tex-113,4-E'!$G$30)","v":2}]
[110,{"$f":"IF('Tex-113,4-E'!$H$58=\"\",\"\",'Tex-113,4-E'!$H$58)","v":""},{"$f":"IF('Tex-113,4-E'!$B$6=\"\",\"\",'Tex-113,4-E'!$B$6)","v":"Tex-113-E or Tex-114-E"},{"$f":"IF(OR('Tex-113,4-E'!$L$54=\"\",'Tex-113,4-E'!$B$58=\"\"),\"\",'Tex-113,4-E'!$L$54&\", \"&'Tex-113,4-E'!$B$58)","v":"Avg Energy/\nBlow (lb-ft), Lift 4:"},{"$f":"IF('Tex-113,4-E'!$G$30=\"\",\"\",'Tex-113,4-E'!$G$30)","v":2}]
[111,{"$f":"IF('Tex-113,4-E'!$J$55=\"\",\"\",'Tex-113,4-E'!$J$55)","v":""},{"$f":"IF('Tex-113,4-E'!$B$6=\"\",\"\",'Tex-113,4-E'!$B$6)","v":"Tex-113-E or Tex-114-E"},{"$f":"IF(OR('Tex-113,4-E'!$F$54=\"\",'Tex-113,4-E'!$B$55=\"\"),\"\",'Tex-113,4-E'!$F$54&\", \"&'Tex-113,4-E'!$B$55)","v":"Avg Energy/\nBlow (lb-ft), Lift 1:"},{"$f":"IF('Tex-113,4-E'!$I$30=\"\",\"\",'Tex-113,4-E'!$I$30)","v":3}]
[112,{"$f":"IF('Tex-113,4-E'!$J$56=\"\",\"\",'Tex-113,4-E'!$J$56)","v":""},{"$f":"IF('Tex-113,4-E'!$B$6=\"\",\"\",'Tex-113,4-E'!$B$6)","v":"Tex-113-E or Tex-114-E"},{"$f":"IF(OR('Tex-113,4-E'!$H$54=\"\",'Tex-113,4-E'!$B$56=\"\"),\"\",'Tex-113,4-E'!$H$54&\", \"&'Tex-113,4-E'!$B$56)","v":"Avg Energy/\nBlow (lb-ft), Lift 2:"},{"$f":"IF('Tex-113,4-E'!$I$30=\"\",\"\",'Tex-113,4-E'!$I$30)","v":3}]
[113,{"$f":"IF('Tex-113,4-E'!$J$57=\"\",\"\",'Tex-113,4-E'!$J$57)","v":""},{"$f":"IF('Tex-113,4-E'!$B$6=\"\",\"\",'Tex-113,4-E'!$B$6)","v":"Tex-113-E or Tex-114-E"},{"$f":"IF(OR('Tex-113,4-E'!$J$54=\"\",'Tex-113,4-E'!$B$57=\"\"),\"\",'Tex-113,4-E'!$J$54&\", \"&'Tex-113,4-E'!$B$57)","v":"Avg Energy/\nBlow (lb-ft), Lift 3:"},{"$f":"IF('Tex-113,4-E'!$I$30=\"\",\"\",'Tex-113,4-E'!$I$30)","v":3}]
[114,{"$f":"IF('Tex-113,4-E'!$J$58=\"\",\"\",'Tex-113,4-E'!$J$58)","v":""},{"$f":"IF('Tex-113,4-E'!$B$6=\"\",\"\",'Tex-113,4-E'!$B$6)","v":"Tex-113-E or Tex-114-E"},{"$f":"IF(OR('Tex-113,4-E'!$L$54=\"\",'Tex-113,4-E'!$B$58=\"\"),\"\",'Tex-113,4-E'!$L$54&\", \"&'Tex-113,4-E'!$B$58)","v":"Avg Energy/\nBlow (lb-ft), Lift 4:"},{"$f":"IF('Tex-113,4-E'!$I$30=\"\",\"\",'Tex-113,4-E'!$I$30)","v":3}]
[115,{"$f":"IF('Tex-113,4-E'!$L$55=\"\",\"\",'Tex-113,4-E'!$L$55)","v":""},{"$f":"IF('Tex-113,4-E'!$B$6=\"\",\"\",'Tex-113,4-E'!$B$6)","v":"Tex-113-E or Tex-114-E"},{"$f":"IF(OR('Tex-113,4-E'!$F$54=\"\",'Tex-113,4-E'!$B$55=\"\"),\"\",'Tex-113,4-E'!$F$54&\", \"&'Tex-113,4-E'!$B$55)","v":"Avg Energy/\nBlow (lb-ft), Lift 1:"},{"$f":"IF('Tex-113,4-E'!$K$30=\"\",\"\",'Tex-113,4-E'!$K$30)","v":4}]
[116,{"$f":"IF('Tex-113,4-E'!$L$56=\"\",\"\",'Tex-113,4-E'!$L$56)","v":""},{"$f":"IF('Tex-113,4-E'!$B$6=\"\",\"\",'Tex-113,4-E'!$B$6)","v":"Tex-113-E or Tex-114-E"},{"$f":"IF(OR('Tex-113,4-E'!$H$54=\"\",'Tex-113,4-E'!$B$56=\"\"),\"\",'Tex-113,4-E'!$H$54&\", \"&'Tex-113,4-E'!$B$56)","v":"Avg Energy/\nBlow (lb-ft), Lift 2:"},{"$f":"IF('Tex-113,4-E'!$K$30=\"\",\"\",'Tex-113,4-E'!$K$30)","v":4}]
[117,{"$f":"IF('Tex-113,4-E'!$L$57=\"\",\"\",'Tex-113,4-E'!$L$57)","v":""},{"$f":"IF('Tex-113,4-E'!$B$6=\"\",\"\",'Tex-113,4-E'!$B$6)","v":"Tex-113-E or Tex-114-E"},{"$f":"IF(OR('Tex-113,4-E'!$J$54=\"\",'Tex-113,4-E'!$B$57=\"\"),\"\",'Tex-113,4-E'!$J$54&\", \"&'Tex-113,4-E'!$B$57)","v":"Avg Energy/\nBlow (lb-ft), Lift 3:"},{"$f":"IF('Tex-113,4-E'!$K$30=\"\",\"\",'Tex-113,4-E'!$K$30)","v":4}]
[118,{"$f":"IF('Tex-113,4-E'!$L$58=\"\",\"\",'Tex-113,4-E'!$L$58)","v":""},{"$f":"IF('Tex-113,4-E'!$B$6=\"\",\"\",'Tex-113,4-E'!$B$6)","v":"Tex-113-E or Tex-114-E"},{"$f":"IF(OR('Tex-113,4-E'!$L$54=\"\",'Tex-113,4-E'!$B$58=\"\"),\"\",'Tex-113,4-E'!$L$54&\", \"&'Tex-113,4-E'!$B$58)","v":"Avg Energy/\nBlow (lb-ft), Lift 4:"},{"$f":"IF('Tex-113,4-E'!$K$30=\"\",\"\",'Tex-113,4-E'!$K$30)","v":4}]
[119,{"$f":"IF('Tex-113,4-E'!$E$61=\"\",\"\",'Tex-113,4-E'!$E$61)","v":""},{"$f":"IF('Tex-113,4-E'!$B$6=\"\",\"\",'Tex-113,4-E'!$B$6)","v":"Tex-113-E or Tex-114-E"},{"$f":"IF(OR('Tex-113,4-E'!$E$60=\"\",'Tex-113,4-E'!$B$61=\"\"),\"\",'Tex-113,4-E'!$E$60&\", \"&'Tex-113,4-E'!$B$61)","v":"Avg. Drop Ht. (in), Lift 1:"},{"$f":"IF('Tex-113,4-E'!$E$30=\"\",\"\",'Tex-113,4-E'!$E$30)","v":1}]
[120,{"$f":"IF('Tex-113,4-E'!$E$62=\"\",\"\",'Tex-113,4-E'!$E$62)","v":""},{"$f":"IF('Tex-113,4-E'!$B$6=\"\",\"\",'Tex-113,4-E'!$B$6)","v":"Tex-113-E or Tex-114-E"},{"$f":"IF(OR('Tex-113,4-E'!$G$60=\"\",'Tex-113,4-E'!$B$62=\"\"),\"\",'Tex-113,4-E'!$G$60&\", \"&'Tex-113,4-E'!$B$62)","v":"Avg. Drop Ht.(in), Lift 2:"},{"$f":"IF('Tex-113,4-E'!$E$30=\"\",\"\",'Tex-113,4-E'!$E$30)","v":1}]
[121,{"$f":"IF('Tex-113,4-E'!$E$63=\"\",\"\",'Tex-113,4-E'!$E$63)","v":""},{"$f":"IF('Tex-113,4-E'!$B$6=\"\",\"\",'Tex-113,4-E'!$B$6)","v":"Tex-113-E or Tex-114-E"},{"$f":"IF(OR('Tex-113,4-E'!$I$60=\"\",'Tex-113,4-E'!$B$63=\"\"),\"\",'Tex-113,4-E'!$I$60&\", \"&'Tex-113,4-E'!$B$63)","v":"Avg. Drop Ht.(in), Lift 3:"},{"$f":"IF('Tex-113,4-E'!$E$30=\"\",\"\",'Tex-113,4-E'!$E$30)","v":1}]
[122,{"$f":"IF('Tex-113,4-E'!$E$64=\"\",\"\",'Tex-113,4-E'!$E$64)","v":""},{"$f":"IF('Tex-113,4-E'!$B$6=\"\",\"\",'Tex-113,4-E'!$B$6)","v":"Tex-113-E or Tex-114-E"},{"$f":"IF(OR('Tex-113,4-E'!$K$60=\"\",'Tex-113,4-E'!$B$64=\"\"),\"\",'Tex-113,4-E'!$K$60&\", \"&'Tex-113,4-E'!$B$64)","v":"Avg. Drop Ht.(in), Lift 4:"},{"$f":"IF('Tex-113,4-E'!$E$30=\"\",\"\",'Tex-113,4-E'!$E$30)","v":1}]
[123,{"$f":"IF('Tex-113,4-E'!$G$61=\"\",\"\",'Tex-113,4-E'!$G$61)","v":""},{"$f":"IF('Tex-113,4-E'!$B$6=\"\",\"\",'Tex-113,4-E'!$B$6)","v":"Tex-113-E or Tex-114-E"},{"$f":"IF(OR('Tex-113,4-E'!$E$60=\"\",'Tex-113,4-E'!$B$61=\"\"),\"\",'Tex-113,4-E'!$E$60&\", \"&'Tex-113,4-E'!$B$61)","v":"Avg. Drop Ht. (in), Lift 1:"},{"$f":"IF('Tex-113,4-E'!$G$30=\"\",\"\",'Tex-113,4-E'!$G$30)","v":2}]
[124,{"$f":"IF('Tex-113,4-E'!$G$62=\"\",\"\",'Tex-113,4-E'!$G$62)","v":""},{"$f":"IF('Tex-113,4-E'!$B$6=\"\",\"\",'Tex-113,4-E'!$B$6)","v":"Tex-113-E or Tex-114-E"},{"$f":"IF(OR('Tex-113,4-E'!$G$60=\"\",'Tex-113,4-E'!$B$62=\"\"),\"\",'Tex-113,4-E'!$G$60&\", \"&'Tex-113,4-E'!$B$62)","v":"Avg. Drop Ht.(in), Lift 2:"},{"$f":"IF('Tex-113,4-E'!$G$30=\"\",\"\",'Tex-113,4-E'!$G$30)","v":2}]
[125,{"$f":"IF('Tex-113,4-E'!$G$63=\"\",\"\",'Tex-113,4-E'!$G$63)","v":""},{"$f":"IF('Tex-113,4-E'!$B$6=\"\",\"\",'Tex-113,4-E'!$B$6)","v":"Tex-113-E or Tex-114-E"},{"$f":"IF(OR('Tex-113,4-E'!$I$60=\"\",'Tex-113,4-E'!$B$63=\"\"),\"\",'Tex-113,4-E'!$I$60&\", \"&'Tex-113,4-E'!$B$63)","v":"Avg. Drop Ht.(in), Lift 3:"},{"$f":"IF('Tex-113,4-E'!$G$30=\"\",\"\",'Tex-113,4-E'!$G$30)","v":2}]
[126,{"$f":"IF('Tex-113,4-E'!$G$64=\"\",\"\",'Tex-113,4-E'!$G$64)","v":""},{"$f":"IF('Tex-113,4-E'!$B$6=\"\",\"\",'Tex-113,4-E'!$B$6)","v":"Tex-113-E or Tex-114-E"},{"$f":"IF(OR('Tex-113,4-E'!$K$60=\"\",'Tex-113,4-E'!$B$64=\"\"),\"\",'Tex-113,4-E'!$K$60&\", \"&'Tex-113,4-E'!$B$64)","v":"Avg. Drop Ht.(in), Lift 4:"},{"$f":"IF('Tex-113,4-E'!$G$30=\"\",\"\",'Tex-113,4-E'!$G$30)","v":2}]
[127,{"$f":"IF('Tex-113,4-E'!$I$61=\"\",\"\",'Tex-113,4-E'!$I$61)","v":""},{"$f":"IF('Tex-113,4-E'!$B$6=\"\",\"\",'Tex-113,4-E'!$B$6)","v":"Tex-113-E or Tex-114-E"},{"$f":"IF(OR('Tex-113,4-E'!$E$60=\"\",'Tex-113,4-E'!$B$61=\"\"),\"\",'Tex-113,4-E'!$E$60&\", \"&'Tex-113,4-E'!$B$61)","v":"Avg. Drop Ht. (in), Lift 1:"},{"$f":"IF('Tex-113,4-E'!$I$30=\"\",\"\",'Tex-113,4-E'!$I$30)","v":3}]
[128,{"$f":"IF('Tex-113,4-E'!$I$62=\"\",\"\",'Tex-113,4-E'!$I$62)","v":""},{"$f":"IF('Tex-113,4-E'!$B$6=\"\",\"\",'Tex-113,4-E'!$B$6)","v":"Tex-113-E or Tex-114-E"},{"$f":"IF(OR('Tex-113,4-E'!$G$60=\"\",'Tex-113,4-E'!$B$62=\"\"),\"\",'Tex-113,4-E'!$G$60&\", \"&'Tex-113,4-E'!$B$62)","v":"Avg. Drop Ht.(in), Lift 2:"},{"$f":"IF('Tex-113,4-E'!$I$30=\"\",\"\",'Tex-113,4-E'!$I$30)","v":3}]
[129,{"$f":"IF('Tex-113,4-E'!$I$63=\"\",\"\",'Tex-113,4-E'!$I$63)","v":""},{"$f":"IF('Tex-113,4-E'!$B$6=\"\",\"\",'Tex-113,4-E'!$B$6)","v":"Tex-113-E or Tex-114-E"},{"$f":"IF(OR('Tex-113,4-E'!$I$60=\"\",'Tex-113,4-E'!$B$63=\"\"),\"\",'Tex-113,4-E'!$I$60&\", \"&'Tex-113,4-E'!$B$63)","v":"Avg. Drop Ht.(in), Lift 3:"},{"$f":"IF('Tex-113,4-E'!$I$30=\"\",\"\",'Tex-113,4-E'!$I$30)","v":3}]
[130,{"$f":"IF('Tex-113,4-E'!$I$64=\"\",\"\",'Tex-113,4-E'!$I$64)","v":""},{"$f":"IF('Tex-113,4-E'!$B$6=\"\",\"\",'Tex-113,4-E'!$B$6)","v":"Tex-113-E or Tex-114-E"},{"$f":"IF(OR('Tex-113,4-E'!$K$60=\"\",'Tex-113,4-E'!$B$64=\"\"),\"\",'Tex-113,4-E'!$K$60&\", \"&'Tex-113,4-E'!$B$64)","v":"Avg. Drop Ht.(in), Lift 4:"},{"$f":"IF('Tex-113,4-E'!$I$30=\"\",\"\",'Tex-113,4-E'!$I$30)","v":3}]
[131,{"$f":"IF('Tex-113,4-E'!$K$61=\"\",\"\",'Tex-113,4-E'!$K$61)","v":""},{"$f":"IF('Tex-113,4-E'!$B$6=\"\",\"\",'Tex-113,4-E'!$B$6)","v":"Tex-113-E or Tex-114-E"},{"$f":"IF(OR('Tex-113,4-E'!$E$60=\"\",'Tex-113,4-E'!$B$61=\"\"),\"\",'Tex-113,4-E'!$E$60&\", \"&'Tex-113,4-E'!$B$61)","v":"Avg. Drop Ht. (in), Lift 1:"},{"$f":"IF('Tex-113,4-E'!$K$30=\"\",\"\",'Tex-113,4-E'!$K$30)","v":4}]
[132,{"$f":"IF('Tex-113,4-E'!$K$62=\"\",\"\",'Tex-113,4-E'!$K$62)","v":""},{"$f":"IF('Tex-113,4-E'!$B$6=\"\",\"\",'Tex-113,4-E'!$B$6)","v":"Tex-113-E or Tex-114-E"},{"$f":"IF(OR('Tex-113,4-E'!$G$60=\"\",'Tex-113,4-E'!$B$62=\"\"),\"\",'Tex-113,4-E'!$G$60&\", \"&'Tex-113,4-E'!$B$62)","v":"Avg. Drop Ht.(in), Lift 2:"},{"$f":"IF('Tex-113,4-E'!$K$30=\"\",\"\",'Tex-113,4-E'!$K$30)","v":4}]
[133,{"$f":"IF('Tex-113,4-E'!$K$63=\"\",\"\",'Tex-113,4-E'!$K$63)","v":""},{"$f":"IF('Tex-113,4-E'!$B$6=\"\",\"\",'Tex-113,4-E'!$B$6)","v":"Tex-113-E or Tex-114-E"},{"$f":"IF(OR('Tex-113,4-E'!$I$60=\"\",'Tex-113,4-E'!$B$63=\"\"),\"\",'Tex-113,4-E'!$I$60&\", \"&'Tex-113,4-E'!$B$63)","v":"Avg. Drop Ht.(in), Lift 3:"},{"$f":"IF('Tex-113,4-E'!$K$30=\"\",\"\",'Tex-113,4-E'!$K$30)","v":4}]
[134,{"$f":"IF('Tex-113,4-E'!$K$64=\"\",\"\",'Tex-113,4-E'!$K$64)","v":""},{"$f":"IF('Tex-113,4-E'!$B$6=\"\",\"\",'Tex-113,4-E'!$B$6)","v":"Tex-113-E or Tex-114-E"},{"$f":"IF(OR('Tex-113,4-E'!$K$60=\"\",'Tex-113,4-E'!$B$64=\"\"),\"\",'Tex-113,4-E'!$K$60&\", \"&'Tex-113,4-E'!$B$64)","v":"Avg. Drop Ht.(in), Lift 4:"},{"$f":"IF('Tex-113,4-E'!$K$30=\"\",\"\",'Tex-113,4-E'!$K$30)","v":4}]
[135,{"$f":"IF('Tex-113,4-E'!$F$61=\"\",\"\",'Tex-113,4-E'!$F$61)","v":""},{"$f":"IF('Tex-113,4-E'!$B$6=\"\",\"\",'Tex-113,4-E'!$B$6)","v":"Tex-113-E or Tex-114-E"},{"$f":"IF(OR('Tex-113,4-E'!$F$60=\"\",'Tex-113,4-E'!$B$61=\"\"),\"\",'Tex-113,4-E'!$F$60&\", \"&'Tex-113,4-E'!$B$61)","v":"Blows, Lift 1:"},{"$f":"IF('Tex-113,4-E'!$E$30=\"\",\"\",'Tex-113,4-E'!$E$30)","v":1}]
[136,{"$f":"IF('Tex-113,4-E'!$F$62=\"\",\"\",'Tex-113,4-E'!$F$62)","v":""},{"$f":"IF('Tex-113,4-E'!$B$6=\"\",\"\",'Tex-113,4-E'!$B$6)","v":"Tex-113-E or Tex-114-E"},{"$f":"IF(OR('Tex-113,4-E'!$H$60=\"\",'Tex-113,4-E'!$B$62=\"\"),\"\",'Tex-113,4-E'!$H$60&\", \"&'Tex-113,4-E'!$B$62)","v":"Blows, Lift 2:"},{"$f":"IF('Tex-113,4-E'!$E$30=\"\",\"\",'Tex-113,4-E'!$E$30)","v":1}]
[137,{"$f":"IF('Tex-113,4-E'!$F$63=\"\",\"\",'Tex-113,4-E'!$F$63)","v":""},{"$f":"IF('Tex-113,4-E'!$B$6=\"\",\"\",'Tex-113,4-E'!$B$6)","v":"Tex-113-E or Tex-114-E"},{"$f":"IF(OR('Tex-113,4-E'!$J$60=\"\",'Tex-113,4-E'!$B$63=\"\"),\"\",'Tex-113,4-E'!$J$60&\", \"&'Tex-113,4-E'!$B$63)","v":"Blows, Lift 3:"},{"$f":"IF('Tex-113,4-E'!$E$30=\"\",\"\",'Tex-113,4-E'!$E$30)","v":1}]
[138,{"$f":"IF('Tex-113,4-E'!$F$64=\"\",\"\",'Tex-113,4-E'!$F$64)","v":""},{"$f":"IF('Tex-113,4-E'!$B$6=\"\",\"\",'Tex-113,4-E'!$B$6)","v":"Tex-113-E or Tex-114-E"},{"$f":"IF(OR('Tex-113,4-E'!$L$60=\"\",'Tex-113,4-E'!$B$64=\"\"),\"\",'Tex-113,4-E'!$L$60&\", \"&'Tex-113,4-E'!$B$64)","v":"Blows, Lift 4:"},{"$f":"IF('Tex-113,4-E'!$E$30=\"\",\"\",'Tex-113,4-E'!$E$30)","v":1}]
[139,{"$f":"IF('Tex-113,4-E'!$H$61=\"\",\"\",'Tex-113,4-E'!$H$61)","v":""},{"$f":"IF('Tex-113,4-E'!$B$6=\"\",\"\",'Tex-113,4-E'!$B$6)","v":"Tex-113-E or Tex-114-E"},{"$f":"IF(OR('Tex-113,4-E'!$F$60=\"\",'Tex-113,4-E'!$B$61=\"\"),\"\",'Tex-113,4-E'!$F$60&\", \"&'Tex-113,4-E'!$B$61)","v":"Blows, Lift 1:"},{"$f":"IF('Tex-113,4-E'!$G$30=\"\",\"\",'Tex-113,4-E'!$G$30)","v":2}]
[140,{"$f":"IF('Tex-113,4-E'!$H$62=\"\",\"\",'Tex-113,4-E'!$H$62)","v":""},{"$f":"IF('Tex-113,4-E'!$B$6=\"\",\"\",'Tex-113,4-E'!$B$6)","v":"Tex-113-E or Tex-114-E"},{"$f":"IF(OR('Tex-113,4-E'!$H$60=\"\",'Tex-113,4-E'!$B$62=\"\"),\"\",'Tex-113,4-E'!$H$60&\", \"&'Tex-113,4-E'!$B$62)","v":"Blows, Lift 2:"},{"$f":"IF('Tex-113,4-E'!$G$30=\"\",\"\",'Tex-113,4-E'!$G$30)","v":2}]
[141,{"$f":"IF('Tex-113,4-E'!$H$63=\"\",\"\",'Tex-113,4-E'!$H$63)","v":""},{"$f":"IF('Tex-113,4-E'!$B$6=\"\",\"\",'Tex-113,4-E'!$B$6)","v":"Tex-113-E or Tex-114-E"},{"$f":"IF(OR('Tex-113,4-E'!$J$60=\"\",'Tex-113,4-E'!$B$63=\"\"),\"\",'Tex-113,4-E'!$J$60&\", \"&'Tex-113,4-E'!$B$63)","v":"Blows, Lift 3:"},{"$f":"IF('Tex-113,4-E'!$G$30=\"\",\"\",'Tex-113,4-E'!$G$30)","v":2}]
[142,{"$f":"IF('Tex-113,4-E'!$H$64=\"\",\"\",'Tex-113,4-E'!$H$64)","v":""},{"$f":"IF('Tex-113,4-E'!$B$6=\"\",\"\",'Tex-113,4-E'!$B$6)","v":"Tex-113-E or Tex-114-E"},{"$f":"IF(OR('Tex-113,4-E'!$L$60=\"\",'Tex-113,4-E'!$B$64=\"\"),\"\",'Tex-113,4-E'!$L$60&\", \"&'Tex-113,4-E'!$B$64)","v":"Blows, Lift 4:"},{"$f":"IF('Tex-113,4-E'!$G$30=\"\",\"\",'Tex-113,4-E'!$G$30)","v":2}]
[143,{"$f":"IF('Tex-113,4-E'!$J$61=\"\",\"\",'Tex-113,4-E'!$J$61)","v":""},{"$f":"IF('Tex-113,4-E'!$B$6=\"\",\"\",'Tex-113,4-E'!$B$6)","v":"Tex-113-E or Tex-114-E"},{"$f":"IF(OR('Tex-113,4-E'!$F$60=\"\",'Tex-113,4-E'!$B$61=\"\"),\"\",'Tex-113,4-E'!$F$60&\", \"&'Tex-113,4-E'!$B$61)","v":"Blows, Lift 1:"},{"$f":"IF('Tex-113,4-E'!$I$30=\"\",\"\",'Tex-113,4-E'!$I$30)","v":3}]
[144,{"$f":"IF('Tex-113,4-E'!$J$62=\"\",\"\",'Tex-113,4-E'!$J$62)","v":""},{"$f":"IF('Tex-113,4-E'!$B$6=\"\",\"\",'Tex-113,4-E'!$B$6)","v":"Tex-113-E or Tex-114-E"},{"$f":"IF(OR('Tex-113,4-E'!$H$60=\"\",'Tex-113,4-E'!$B$62=\"\"),\"\",'Tex-113,4-E'!$H$60&\", \"&'Tex-113,4-E'!$B$62)","v":"Blows, Lift 2:"},{"$f":"IF('Tex-113,4-E'!$I$30=\"\",\"\",'Tex-113,4-E'!$I$30)","v":3}]
[145,{"$f":"IF('Tex-113,4-E'!$J$63=\"\",\"\",'Tex-113,4-E'!$J$63)","v":""},{"$f":"IF('Tex-113,4-E'!$B$6=\"\",\"\",'Tex-113,4-E'!$B$6)","v":"Tex-113-E or Tex-114-E"},{"$f":"IF(OR('Tex-113,4-E'!$J$60=\"\",'Tex-113,4-E'!$B$63=\"\"),\"\",'Tex-113,4-E'!$J$60&\", \"&'Tex-113,4-E'!$B$63)","v":"Blows, Lift 3:"},{"$f":"IF('Tex-113,4-E'!$I$30=\"\",\"\",'Tex-113,4-E'!$I$30)","v":3}]
[146,{"$f":"IF('Tex-113,4-E'!$J$64=\"\",\"\",'Tex-113,4-E'!$J$64)","v":""},{"$f":"IF('Tex-113,4-E'!$B$6=\"\",\"\",'Tex-113,4-E'!$B$6)","v":"Tex-113-E or Tex-114-E"},{"$f":"IF(OR('Tex-113,4-E'!$L$60=\"\",'Tex-113,4-E'!$B$64=\"\"),\"\",'Tex-113,4-E'!$L$60&\", \"&'Tex-113,4-E'!$B$64)","v":"Blows, Lift 4:"},{"$f":"IF('Tex-113,4-E'!$I$30=\"\",\"\",'Tex-113,4-E'!$I$30)","v":3}]
[147,{"$f":"IF('Tex-113,4-E'!$L$61=\"\",\"\",'Tex-113,4-E'!$L$61)","v":""},{"$f":"IF('Tex-113,4-E'!$B$6=\"\",\"\",'Tex-113,4-E'!$B$6)","v":"Tex-113-E or Tex-114-E"},{"$f":"IF(OR('Tex-113,4-E'!$F$60=\"\",'Tex-113,4-E'!$B$61=\"\"),\"\",'Tex-113,4-E'!$F$60&\", \"&'Tex-113,4-E'!$B$61)","v":"Blows, Lift 1:"},{"$f":"IF('Tex-113,4-E'!$K$30=\"\",\"\",'Tex-113,4-E'!$K$30)","v":4}]
[148,{"$f":"IF('Tex-113,4-E'!$L$62=\"\",\"\",'Tex-113,4-E'!$L$62)","v":""},{"$f":"IF('Tex-113,4-E'!$B$6=\"\",\"\",'Tex-113,4-E'!$B$6)","v":"Tex-113-E or Tex-114-E"},{"$f":"IF(OR('Tex-113,4-E'!$H$60=\"\",'Tex-113,4-E'!$B$62=\"\"),\"\",'Tex-113,4-E'!$H$60&\", \"&'Tex-113,4-E'!$B$62)","v":"Blows, Lift 2:"},{"$f":"IF('Tex-113,4-E'!$K$30=\"\",\"\",'Tex-113,4-E'!$K$30)","v":4}]
[149,{"$f":"IF('Tex-113,4-E'!$L$63=\"\",\"\",'Tex-113,4-E'!$L$63)","v":""},{"$f":"IF('Tex-113,4-E'!$B$6=\"\",\"\",'Tex-113,4-E'!$B$6)","v":"Tex-113-E or Tex-114-E"},{"$f":"IF(OR('Tex-113,4-E'!$J$60=\"\",'Tex-113,4-E'!$B$63=\"\"),\"\",'Tex-113,4-E'!$J$60&\", \"&'Tex-113,4-E'!$B$63)","v":"Blows, Lift 3:"},{"$f":"IF('Tex-113,4-E'!$K$30=\"\",\"\",'Tex-113,4-E'!$K$30)","v":4}]
[150,{"$f":"IF('Tex-113,4-E'!$L$64=\"\",\"\",'Tex-113,4-E'!$L$64)","v":""},{"$f":"IF('Tex-113,4-E'!$B$6=\"\",\"\",'Tex-113,4-E'!$B$6)","v":"Tex-113-E or Tex-114-E"},{"$f":"IF(OR('Tex-113,4-E'!$L$60=\"\",'Tex-113,4-E'!$B$64=\"\"),\"\",'Tex-113,4-E'!$L$60&\", \"&'Tex-113,4-E'!$B$64)","v":"Blows, Lift 4:"},{"$f":"IF('Tex-113,4-E'!$K$30=\"\",\"\",'Tex-113,4-E'!$K$30)","v":4}]
[151,{"$f":"IF('Tex-113,4-E'!$E$80=\"\",\"\",'Tex-113,4-E'!$E$80)","v":""},{"$f":"IF('Tex-113,4-E'!$B$6=\"\",\"\",'Tex-113,4-E'!$B$6)","v":"Tex-113-E or Tex-114-E"},{"$f":"IF('Tex-113,4-E'!$B$80=\"\",\"\",'Tex-113,4-E'!$B$80)","v":"Unconfined Strength Data (psi):"},{"$f":"IF('Tex-113,4-E'!$E$30=\"\",\"\",'Tex-113,4-E'!$E$30)","v":1}]
[152,{"$f":"IF('Tex-113,4-E'!$G$80=\"\",\"\",'Tex-113,4-E'!$G$80)","v":""},{"$f":"IF('Tex-113,4-E'!$B$6=\"\",\"\",'Tex-113,4-E'!$B$6)","v":"Tex-113-E or Tex-114-E"},{"$f":"IF('Tex-113,4-E'!$B$80=\"\",\"\",'Tex-113,4-E'!$B$80)","v":"Unconfined Strength Data (psi):"},{"$f":"IF('Tex-113,4-E'!$G$30=\"\",\"\",'Tex-113,4-E'!$G$30)","v":2}]
[153,{"$f":"IF('Tex-113,4-E'!$I$80=\"\",\"\",'Tex-113,4-E'!$I$80)","v":""},{"$f":"IF('Tex-113,4-E'!$B$6=\"\",\"\",'Tex-113,4-E'!$B$6)","v":"Tex-113-E or Tex-114-E"},{"$f":"IF('Tex-113,4-E'!$B$80=\"\",\"\",'Tex-113,4-E'!$B$80)","v":"Unconfined Strength Data (psi):"},{"$f":"IF('Tex-113,4-E'!$I$30=\"\",\"\",'Tex-113,4-E'!$I$30)","v":3}]
[154,{"$f":"IF('Tex-113,4-E'!$K$80=\"\",\"\",'Tex-113,4-E'!$K$80)","v":""},{"$f":"IF('Tex-113,4-E'!$B$6=\"\",\"\",'Tex-113,4-E'!$B$6)","v":"Tex-113-E or Tex-114-E"},{"$f":"IF('Tex-113,4-E'!$B$80=\"\",\"\",'Tex-113,4-E'!$B$80)","v":"Unconfined Strength Data (psi):"},{"$f":"IF('Tex-113,4-E'!$K$30=\"\",\"\",'Tex-113,4-E'!$K$30)","v":4}]
[155,{"$f":"IF('Tex-113,4-E'!$E$81=\"\",\"\",'Tex-113,4-E'!$E$81)","v":""},{"$f":"IF('Tex-113,4-E'!$B$6=\"\",\"\",'Tex-113,4-E'!$B$6)","v":"Tex-113-E or Tex-114-E"},{"$f":"IF('Tex-113,4-E'!$B$81=\"\",\"\",'Tex-113,4-E'!$B$81)","v":"Percent Strain (%):"},{"$f":"IF('Tex-113,4-E'!$E$30=\"\",\"\",'Tex-113,4-E'!$E$30)","v":1}]
[156,{"$f":"IF('Tex-113,4-E'!$G$81=\"\",\"\",'Tex-113,4-E'!$G$81)","v":""},{"$f":"IF('Tex-113,4-E'!$B$6=\"\",\"\",'Tex-113,4-E'!$B$6)","v":"Tex-113-E or Tex-114-E"},{"$f":"IF('Tex-113,4-E'!$B$81=\"\",\"\",'Tex-113,4-E'!$B$81)","v":"Percent Strain (%):"},{"$f":"IF('Tex-113,4-E'!$G$30=\"\",\"\",'Tex-113,4-E'!$G$30)","v":2}]
[157,{"$f":"IF('Tex-113,4-E'!$I$81=\"\",\"\",'Tex-113,4-E'!$I$81)","v":""},{"$f":"IF('Tex-113,4-E'!$B$6=\"\",\"\",'Tex-113,4-E'!$B$6)","v":"Tex-113-E or Tex-114-E"},{"$f":"IF('Tex-113,4-E'!$B$81=\"\",\"\",'Tex-113,4-E'!$B$81)","v":"Percent Strain (%):"},{"$f":"IF('Tex-113,4-E'!$I$30=\"\",\"\",'Tex-113,4-E'!$I$30)","v":3}]
[158,{"$f":"IF('Tex-113,4-E'!$K$81=\"\",\"\",'Tex-113,4-E'!$K$81)","v":""},{"$f":"IF('Tex-113,4-E'!$B$6=\"\",\"\",'Tex-113,4-E'!$B$6)","v":"Tex-113-E or Tex-114-E"},{"$f":"IF('Tex-113,4-E'!$B$81=\"\",\"\",'Tex-113,4-E'!$B$81)","v":"Percent Strain (%):"},{"$f":"IF('Tex-113,4-E'!$K$30=\"\",\"\",'Tex-113,4-E'!$K$30)","v":4}]
[159,{"$f":"IF('Tex-113,4-E'!$E$86=\"\",\"\",'Tex-113,4-E'!$E$86)","v":""},{"$f":"IF('Tex-113,4-E'!$B$6=\"\",\"\",'Tex-113,4-E'!$B$6)","v":"Tex-113-E or Tex-114-E"},{"$f":"IF('Tex-113,4-E'!$B$86=\"\",\"\",'Tex-113,4-E'!$B$86)","v":"M-D Graph R2 Value:"}]
[160,{"$f":"IF('Tex-113,4-E'!$F$100=\"\",\"\",'Tex-113,4-E'!$F$100)","v":""},{"$f":"IF('Tex-113,4-E'!$B$6=\"\",\"\",'Tex-113,4-E'!$B$6)","v":"Tex-113-E or Tex-114-E"},{"$f":"IF('Tex-113,4-E'!$B$100=\"\",\"\",'Tex-113,4-E'!$B$100)","v":"TX113"},{"$f":"IF('Tex-113,4-E'!$F$99=\"\",\"\",'Tex-113,4-E'!$F$99)","v":"Tech Cert No:"}]
[161,{"$f":"IF('Tex-113,4-E'!$F$102=\"\",\"\",'Tex-113,4-E'!$F$102)","v":""},{"$f":"IF('Tex-113,4-E'!$B$6=\"\",\"\",'Tex-113,4-E'!$B$6)","v":"Tex-113-E or Tex-114-E"},{"$f":"IF('Tex-113,4-E'!$B$102=\"\",\"\",'Tex-113,4-E'!$B$102)","v":"TX114"},{"$f":"IF('Tex-113,4-E'!$F$99=\"\",\"\",'Tex-113,4-E'!$F$99)","v":"Tech Cert No:"}]
[162,{"$f":"IF('Tex-113,4-E'!$E$69=\"\",\"\",'Tex-113,4-E'!$E$69)","v":""},{"$f":"IF('Tex-113,4-E'!$B$6=\"\",\"\",'Tex-113,4-E'!$B$6)","v":"Tex-113-E or Tex-114-E"},{"$f":"IF('Tex-113,4-E'!$B$68=\"\",\"\",'Tex-113,4-E'!$B$68)","v":"SCA Energy Data"},{"$f":"IF('Tex-113,4-E'!$B$66=\"\",\"\",'Tex-113,4-E'!$B$66)","v":"Import Data"},{"$f":"IF(OR('Tex-113,4-E'!E$68=\"\",'Tex-113,4-E'!$B69=\"\"),\"\",'Tex-113,4-E'!$E$68&\", \"&'Tex-113,4-E'!$B69)","v":"Total Energy \n(lb-ft), Lift 1:"},{"$f":"IF('Tex-113,4-E'!$E$30=\"\",\"\",'Tex-113,4-E'!$E$30)","v":1}]
[163,{"$f":"IF('Tex-113,4-E'!$E$70=\"\",\"\",'Tex-113,4-E'!$E$70)","v":""},{"$f":"IF('Tex-113,4-E'!$B$6=\"\",\"\",'Tex-113,4-E'!$B$6)","v":"Tex-113-E or Tex-114-E"},{"$f":"IF('Tex-113,4-E'!$B$68=\"\",\"\",'Tex-113,4-E'!$B$68)","v":"SCA Energy Data"},{"$f":"IF('Tex-113,4-E'!$B$66=\"\",\"\",'Tex-113,4-E'!$B$66)","v":"Import Data"},{"$f":"IF(OR('Tex-113,4-E'!E$68=\"\",'Tex-113,4-E'!$B70=\"\"),\"\",'Tex-113,4-E'!$E$68&\", \"&'Tex-113,4-E'!$B70)","v":"Total Energy \n(lb-ft), Lift 2:"},{"$f":"IF('Tex-113,4-E'!$E$30=\"\",\"\",'Tex-113,4-E'!$E$30)","v":1}]
[164,{"$f":"IF('Tex-113,4-E'!$E$71=\"\",\"\",'Tex-113,4-E'!$E$71)","v":""},{"$f":"IF('Tex-113,4-E'!$B$6=\"\",\"\",'Tex-113,4-E'!$B$6)","v":"Tex-113-E or Tex-114-E"},{"$f":"IF('Tex-113,4-E'!$B$68=\"\",\"\",'Tex-113,4-E'!$B$68)","v":"SCA Energy Data"},{"$f":"IF('Tex-113,4-E'!$B$66=\"\",\"\",'Tex-113,4-E'!$B$66)","v":"Import Data"},{"$f":"IF(OR('Tex-113,4-E'!E$68=\"\",'Tex-113,4-E'!$B71=\"\"),\"\",'Tex-113,4-E'!$E$68&\", \"&'Tex-113,4-E'!$B71)","v":"Total Energy \n(lb-ft), Lift 3:"},{"$f":"IF('Tex-113,4-E'!$E$30=\"\",\"\",'Tex-113,4-E'!$E$30)","v":1}]
[165,{"$f":"IF('Tex-113,4-E'!$E$72=\"\",\"\",'Tex-113,4-E'!$E$72)","v":""},{"$f":"IF('Tex-113,4-E'!$B$6=\"\",\"\",'Tex-113,4-E'!$B$6)","v":"Tex-113-E or Tex-114-E"},{"$f":"IF('Tex-113,4-E'!$B$68=\"\",\"\",'Tex-113,4-E'!$B$68)","v":"SCA Energy Data"},{"$f":"IF('Tex-113,4-E'!$B$66=\"\",\"\",'Tex-113,4-E'!$B$66)","v":"Import Data"},{"$f":"IF(OR('Tex-113,4-E'!E$68=\"\",'Tex-113,4-E'!$B72=\"\"),\"\",'Tex-113,4-E'!$E$68&\", \"&'Tex-113,4-E'!$B72)","v":"Total Energy \n(lb-ft), Lift 4:"},{"$f":"IF('Tex-113,4-E'!$E$30=\"\",\"\",'Tex-113,4-E'!$E$30)","v":1}]
[166,{"$f":"IF('Tex-113,4-E'!$F$69=\"\",\"\",'Tex-113,4-E'!$F$69)","v":""},{"$f":"IF('Tex-113,4-E'!$B$6=\"\",\"\",'Tex-113,4-E'!$B$6)","v":"Tex-113-E or Tex-114-E"},{"$f":"IF('Tex-113,4-E'!$B$68=\"\",\"\",'Tex-113,4-E'!$B$68)","v":"SCA Energy Data"},{"$f":"IF('Tex-113,4-E'!$B$66=\"\",\"\",'Tex-113,4-E'!$B$66)","v":"Import Data"},{"$f":"IF(OR('Tex-113,4-E'!$F$68=\"\",'Tex-113,4-E'!$B69=\"\"),\"\",'Tex-113,4-E'!$F$68&\", \"&'Tex-113,4-E'!$B69)","v":"Avg Energy/\nBlow (lb-ft), Lift 1:"},{"$f":"IF('Tex-113,4-E'!$E$30=\"\",\"\",'Tex-113,4-E'!$E$30)","v":1}]
[167,{"$f":"IF('Tex-113,4-E'!$F$70=\"\",\"\",'Tex-113,4-E'!$F$70)","v":""},{"$f":"IF('Tex-113,4-E'!$B$6=\"\",\"\",'Tex-113,4-E'!$B$6)","v":"Tex-113-E or Tex-114-E"},{"$f":"IF('Tex-113,4-E'!$B$68=\"\",\"\",'Tex-113,4-E'!$B$68)","v":"SCA Energy Data"},{"$f":"IF('Tex-113,4-E'!$B$66=\"\",\"\",'Tex-113,4-E'!$B$66)","v":"Import Data"},{"$f":"IF(OR('Tex-113,4-E'!$F$68=\"\",'Tex-113,4-E'!$B70=\"\"),\"\",'Tex-113,4-E'!$F$68&\", \"&'Tex-113,4-E'!$B70)","v":"Avg Energy/\nBlow (lb-ft), Lift 2:"},{"$f":"IF('Tex-113,4-E'!$E$30=\"\",\"\",'Tex-113,4-E'!$E$30)","v":1}]
[168,{"$f":"IF('Tex-113,4-E'!$F$71=\"\",\"\",'Tex-113,4-E'!$F$71)","v":""},{"$f":"IF('Tex-113,4-E'!$B$6=\"\",\"\",'Tex-113,4-E'!$B$6)","v":"Tex-113-E or Tex-114-E"},{"$f":"IF('Tex-113,4-E'!$B$68=\"\",\"\",'Tex-113,4-E'!$B$68)","v":"SCA Energy Data"},{"$f":"IF('Tex-113,4-E'!$B$66=\"\",\"\",'Tex-113,4-E'!$B$66)","v":"Import Data"},{"$f":"IF(OR('Tex-113,4-E'!$F$68=\"\",'Tex-113,4-E'!$B71=\"\"),\"\",'Tex-113,4-E'!$F$68&\", \"&'Tex-113,4-E'!$B71)","v":"Avg Energy/\nBlow (lb-ft), Lift 3:"},{"$f":"IF('Tex-113,4-E'!$E$30=\"\",\"\",'Tex-113,4-E'!$E$30)","v":1}]
[169,{"$f":"IF('Tex-113,4-E'!$F$72=\"\",\"\",'Tex-113,4-E'!$F$72)","v":""},{"$f":"IF('Tex-113,4-E'!$B$6=\"\",\"\",'Tex-113,4-E'!$B$6)","v":"Tex-113-E or Tex-114-E"},{"$f":"IF('Tex-113,4-E'!$B$68=\"\",\"\",'Tex-113,4-E'!$B$68)","v":"SCA Energy Data"},{"$f":"IF('Tex-113,4-E'!$B$66=\"\",\"\",'Tex-113,4-E'!$B$66)","v":"Import Data"},{"$f":"IF(OR('Tex-113,4-E'!$F$68=\"\",'Tex-113,4-E'!$B72=\"\"),\"\",'Tex-113,4-E'!$F$68&\", \"&'Tex-113,4-E'!$B72)","v":"Avg Energy/\nBlow (lb-ft), Lift 4:"},{"$f":"IF('Tex-113,4-E'!$E$30=\"\",\"\",'Tex-113,4-E'!$E$30)","v":1}]
[170,{"$f":"IF('Tex-113,4-E'!$G$69=\"\",\"\",'Tex-113,4-E'!$G$69)","v":""},{"$f":"IF('Tex-113,4-E'!$B$6=\"\",\"\",'Tex-113,4-E'!$B$6)","v":"Tex-113-E or Tex-114-E"},{"$f":"IF('Tex-113,4-E'!$B$68=\"\",\"\",'Tex-113,4-E'!$B$68)","v":"SCA Energy Data"},{"$f":"IF('Tex-113,4-E'!$B$66=\"\",\"\",'Tex-113,4-E'!$B$66)","v":"Import Data"},{"$f":"IF(OR('Tex-113,4-E'!$G$68=\"\",'Tex-113,4-E'!$B$69=\"\"),\"\",'Tex-113,4-E'!$G$68&\", \"&'Tex-113,4-E'!$B$69)","v":"Total Energy \n(lb-ft), Lift 1:"},{"$f":"IF('Tex-113,4-E'!$G$30=\"\",\"\",'Tex-113,4-E'!$G$30)","v":2}]
[171,{"$f":"IF('Tex-113,4-E'!$G$70=\"\",\"\",'Tex-113,4-E'!$G$70)","v":""},{"$f":"IF('Tex-113,4-E'!$B$6=\"\",\"\",'Tex-113,4-E'!$B$6)","v":"Tex-113-E or Tex-114-E"},{"$f":"IF('Tex-113,4-E'!$B$68=\"\",\"\",'Tex-113,4-E'!$B$68)","v":"SCA Energy Data"},{"$f":"IF('Tex-113,4-E'!$B$66=\"\",\"\",'Tex-113,4-E'!$B$66)","v":"Import Data"},{"$f":"IF(OR('Tex-113,4-E'!$G$68=\"\",'Tex-113,4-E'!$B$70=\"\"),\"\",'Tex-113,4-E'!$G$68&\", \"&'Tex-113,4-E'!$B$70)","v":"Total Energy \n(lb-ft), Lift 2:"},{"$f":"IF('Tex-113,4-E'!$G$30=\"\",\"\",'Tex-113,4-E'!$G$30)","v":2}]
[172,{"$f":"IF('Tex-113,4-E'!$G$71=\"\",\"\",'Tex-113,4-E'!$G$71)","v":""},{"$f":"IF('Tex-113,4-E'!$B$6=\"\",\"\",'Tex-113,4-E'!$B$6)","v":"Tex-113-E or Tex-114-E"},{"$f":"IF('Tex-113,4-E'!$B$68=\"\",\"\",'Tex-113,4-E'!$B$68)","v":"SCA Energy Data"},{"$f":"IF('Tex-113,4-E'!$B$66=\"\",\"\",'Tex-113,4-E'!$B$66)","v":"Import Data"},{"$f":"IF(OR('Tex-113,4-E'!$G$68=\"\",'Tex-113,4-E'!$B$71=\"\"),\"\",'Tex-113,4-E'!$G$68&\", \"&'Tex-113,4-E'!$B$71)","v":"Total Energy \n(lb-ft), Lift 3:"},{"$f":"IF('Tex-113,4-E'!$G$30=\"\",\"\",'Tex-113,4-E'!$G$30)","v":2}]
[173,{"$f":"IF('Tex-113,4-E'!$G$72=\"\",\"\",'Tex-113,4-E'!$G$72)","v":""},{"$f":"IF('Tex-113,4-E'!$B$6=\"\",\"\",'Tex-113,4-E'!$B$6)","v":"Tex-113-E or Tex-114-E"},{"$f":"IF('Tex-113,4-E'!$B$68=\"\",\"\",'Tex-113,4-E'!$B$68)","v":"SCA Energy Data"},{"$f":"IF('Tex-113,4-E'!$B$66=\"\",\"\",'Tex-113,4-E'!$B$66)","v":"Import Data"},{"$f":"IF(OR('Tex-113,4-E'!$G$68=\"\",'Tex-113,4-E'!$B$72=\"\"),\"\",'Tex-113,4-E'!$G$68&\", \"&'Tex-113,4-E'!$B$72)","v":"Total Energy \n(lb-ft), Lift 4:"},{"$f":"IF('Tex-113,4-E'!$G$30=\"\",\"\",'Tex-113,4-E'!$G$30)","v":2}]
[174,{"$f":"IF('Tex-113,4-E'!$H$69=\"\",\"\",'Tex-113,4-E'!$H$69)","v":""},{"$f":"IF('Tex-113,4-E'!$B$6=\"\",\"\",'Tex-113,4-E'!$B$6)","v":"Tex-113-E or Tex-114-E"},{"$f":"IF('Tex-113,4-E'!$B$68=\"\",\"\",'Tex-113,4-E'!$B$68)","v":"SCA Energy Data"},{"$f":"IF('Tex-113,4-E'!$B$66=\"\",\"\",'Tex-113,4-E'!$B$66)","v":"Import Data"},{"$f":"IF(OR('Tex-113,4-E'!$H$68=\"\",'Tex-113,4-E'!$B$69=\"\"),\"\",'Tex-113,4-E'!$H$68&\", \"&'Tex-113,4-E'!$B$69)","v":"Avg Energy/\nBlow (lb-ft), Lift 1:"},{"$f":"IF('Tex-113,4-E'!$G$30=\"\",\"\",'Tex-113,4-E'!$G$30)","v":2}]
[175,{"$f":"IF('Tex-113,4-E'!$H$70=\"\",\"\",'Tex-113,4-E'!$H$70)","v":""},{"$f":"IF('Tex-113,4-E'!$B$6=\"\",\"\",'Tex-113,4-E'!$B$6)","v":"Tex-113-E or Tex-114-E"},{"$f":"IF('Tex-113,4-E'!$B$68=\"\",\"\",'Tex-113,4-E'!$B$68)","v":"SCA Energy Data"},{"$f":"IF('Tex-113,4-E'!$B$66=\"\",\"\",'Tex-113,4-E'!$B$66)","v":"Import Data"},{"$f":"IF(OR('Tex-113,4-E'!$H$68=\"\",'Tex-113,4-E'!$B$70=\"\"),\"\",'Tex-113,4-E'!$H$68&\", \"&'Tex-113,4-E'!$B$70)","v":"Avg Energy/\nBlow (lb-ft), Lift 2:"},{"$f":"IF('Tex-113,4-E'!$G$30=\"\",\"\",'Tex-113,4-E'!$G$30)","v":2}]
[176,{"$f":"IF('Tex-113,4-E'!$H$71=\"\",\"\",'Tex-113,4-E'!$H$71)","v":""},{"$f":"IF('Tex-113,4-E'!$B$6=\"\",\"\",'Tex-113,4-E'!$B$6)","v":"Tex-113-E or Tex-114-E"},{"$f":"IF('Tex-113,4-E'!$B$68=\"\",\"\",'Tex-113,4-E'!$B$68)","v":"SCA Energy Data"},{"$f":"IF('Tex-113,4-E'!$B$66=\"\",\"\",'Tex-113,4-E'!$B$66)","v":"Import Data"},{"$f":"IF(OR('Tex-113,4-E'!$H$68=\"\",'Tex-113,4-E'!$B$71=\"\"),\"\",'Tex-113,4-E'!$H$68&\", \"&'Tex-113,4-E'!$B$71)","v":"Avg Energy/\nBlow (lb-ft), Lift 3:"},{"$f":"IF('Tex-113,4-E'!$G$30=\"\",\"\",'Tex-113,4-E'!$G$30)","v":2}]
[177,{"$f":"IF('Tex-113,4-E'!$H$72=\"\",\"\",'Tex-113,4-E'!$H$72)","v":""},{"$f":"IF('Tex-113,4-E'!$B$6=\"\",\"\",'Tex-113,4-E'!$B$6)","v":"Tex-113-E or Tex-114-E"},{"$f":"IF('Tex-113,4-E'!$B$68=\"\",\"\",'Tex-113,4-E'!$B$68)","v":"SCA Energy Data"},{"$f":"IF('Tex-113,4-E'!$B$66=\"\",\"\",'Tex-113,4-E'!$B$66)","v":"Import Data"},{"$f":"IF(OR('Tex-113,4-E'!$H$68=\"\",'Tex-113,4-E'!$B$72=\"\"),\"\",'Tex-113,4-E'!$H$68&\", \"&'Tex-113,4-E'!$B$72)","v":"Avg Energy/\nBlow (lb-ft), Lift 4:"},{"$f":"IF('Tex-113,4-E'!$G$30=\"\",\"\",'Tex-113,4-E'!$G$30)","v":2}]
[178,{"$f":"IF('Tex-113,4-E'!$I$69=\"\",\"\",'Tex-113,4-E'!$I$69)","v":""},{"$f":"IF('Tex-113,4-E'!$B$6=\"\",\"\",'Tex-113,4-E'!$B$6)","v":"Tex-113-E or Tex-114-E"},{"$f":"IF('Tex-113,4-E'!$B$68=\"\",\"\",'Tex-113,4-E'!$B$68)","v":"SCA Energy Data"},{"$f":"IF('Tex-113,4-E'!$B$66=\"\",\"\",'Tex-113,4-E'!$B$66)","v":"Import Data"},{"$f":"IF(OR('Tex-113,4-E'!$I$68=\"\",'Tex-113,4-E'!$B$69=\"\"),\"\",'Tex-113,4-E'!$I$68&\", \"&'Tex-113,4-E'!$B$69)","v":"Total Energy \n(lb-ft), Lift 1:"},{"$f":"IF('Tex-113,4-E'!$I$30=\"\",\"\",'Tex-113,4-E'!$I$30)","v":3}]
[179,{"$f":"IF('Tex-113,4-E'!$I$70=\"\",\"\",'Tex-113,4-E'!$I$70)","v":""},{"$f":"IF('Tex-113,4-E'!$B$6=\"\",\"\",'Tex-113,4-E'!$B$6)","v":"Tex-113-E or Tex-114-E"},{"$f":"IF('Tex-113,4-E'!$B$68=\"\",\"\",'Tex-113,4-E'!$B$68)","v":"SCA Energy Data"},{"$f":"IF('Tex-113,4-E'!$B$66=\"\",\"\",'Tex-113,4-E'!$B$66)","v":"Import Data"},{"$f":"IF(OR('Tex-113,4-E'!$I$68=\"\",'Tex-113,4-E'!$B$70=\"\"),\"\",'Tex-113,4-E'!$I$68&\", \"&'Tex-113,4-E'!$B$70)","v":"Total Energy \n(lb-ft), Lift 2:"},{"$f":"IF('Tex-113,4-E'!$I$30=\"\",\"\",'Tex-113,4-E'!$I$30)","v":3}]
[180,{"$f":"IF('Tex-113,4-E'!$I$71=\"\",\"\",'Tex-113,4-E'!$I$71)","v":""},{"$f":"IF('Tex-113,4-E'!$B$6=\"\",\"\",'Tex-113,4-E'!$B$6)","v":"Tex-113-E or Tex-114-E"},{"$f":"IF('Tex-113,4-E'!$B$68=\"\",\"\",'Tex-113,4-E'!$B$68)","v":"SCA Energy Data"},{"$f":"IF('Tex-113,4-E'!$B$66=\"\",\"\",'Tex-113,4-E'!$B$66)","v":"Import Data"},{"$f":"IF(OR('Tex-113,4-E'!$I$68=\"\",'Tex-113,4-E'!$B$71=\"\"),\"\",'Tex-113,4-E'!$I$68&\", \"&'Tex-113,4-E'!$B$71)","v":"Total Energy \n(lb-ft), Lift 3:"},{"$f":"IF('Tex-113,4-E'!$I$30=\"\",\"\",'Tex-113,4-E'!$I$30)","v":3}]
[181,{"$f":"IF('Tex-113,4-E'!$I$72=\"\",\"\",'Tex-113,4-E'!$I$72)","v":""},{"$f":"IF('Tex-113,4-E'!$B$6=\"\",\"\",'Tex-113,4-E'!$B$6)","v":"Tex-113-E or Tex-114-E"},{"$f":"IF('Tex-113,4-E'!$B$68=\"\",\"\",'Tex-113,4-E'!$B$68)","v":"SCA Energy Data"},{"$f":"IF('Tex-113,4-E'!$B$66=\"\",\"\",'Tex-113,4-E'!$B$66)","v":"Import Data"},{"$f":"IF(OR('Tex-113,4-E'!$I$68=\"\",'Tex-113,4-E'!$B$72=\"\"),\"\",'Tex-113,4-E'!$I$68&\", \"&'Tex-113,4-E'!$B$72)","v":"Total Energy \n(lb-ft), Lift 4:"},{"$f":"IF('Tex-113,4-E'!$I$30=\"\",\"\",'Tex-113,4-E'!$I$30)","v":3}]
[182,{"$f":"IF('Tex-113,4-E'!$J$69=\"\",\"\",'Tex-113,4-E'!$J$69)","v":""},{"$f":"IF('Tex-113,4-E'!$B$6=\"\",\"\",'Tex-113,4-E'!$B$6)","v":"Tex-113-E or Tex-114-E"},{"$f":"IF('Tex-113,4-E'!$B$68=\"\",\"\",'Tex-113,4-E'!$B$68)","v":"SCA Energy Data"},{"$f":"IF('Tex-113,4-E'!$B$66=\"\",\"\",'Tex-113,4-E'!$B$66)","v":"Import Data"},{"$f":"IF(OR('Tex-113,4-E'!$J$68=\"\",'Tex-113,4-E'!$B$69=\"\"),\"\",'Tex-113,4-E'!$J$68&\", \"&'Tex-113,4-E'!$B$69)","v":"Avg Energy/\nBlow (lb-ft), Lift 1:"},{"$f":"IF('Tex-113,4-E'!$I$30=\"\",\"\",'Tex-113,4-E'!$I$30)","v":3}]
[183,{"$f":"IF('Tex-113,4-E'!$J$70=\"\",\"\",'Tex-113,4-E'!$J$70)","v":""},{"$f":"IF('Tex-113,4-E'!$B$6=\"\",\"\",'Tex-113,4-E'!$B$6)","v":"Tex-113-E or Tex-114-E"},{"$f":"IF('Tex-113,4-E'!$B$68=\"\",\"\",'Tex-113,4-E'!$B$68)","v":"SCA Energy Data"},{"$f":"IF('Tex-113,4-E'!$B$66=\"\",\"\",'Tex-113,4-E'!$B$66)","v":"Import Data"},{"$f":"IF(OR('Tex-113,4-E'!$J$68=\"\",'Tex-113,4-E'!$B$70=\"\"),\"\",'Tex-113,4-E'!$J$68&\", \"&'Tex-113,4-E'!$B$70)","v":"Avg Energy/\nBlow (lb-ft), Lift 2:"},{"$f":"IF('Tex-113,4-E'!$I$30=\"\",\"\",'Tex-113,4-E'!$I$30)","v":3}]
[184,{"$f":"IF('Tex-113,4-E'!$J$71=\"\",\"\",'Tex-113,4-E'!$J$71)","v":""},{"$f":"IF('Tex-113,4-E'!$B$6=\"\",\"\",'Tex-113,4-E'!$B$6)","v":"Tex-113-E or Tex-114-E"},{"$f":"IF('Tex-113,4-E'!$B$68=\"\",\"\",'Tex-113,4-E'!$B$68)","v":"SCA Energy Data"},{"$f":"IF('Tex-113,4-E'!$B$66=\"\",\"\",'Tex-113,4-E'!$B$66)","v":"Import Data"},{"$f":"IF(OR('Tex-113,4-E'!$J$68=\"\",'Tex-113,4-E'!$B$71=\"\"),\"\",'Tex-113,4-E'!$J$68&\", \"&'Tex-113,4-E'!$B$71)","v":"Avg Energy/\nBlow (lb-ft), Lift 3:"},{"$f":"IF('Tex-113,4-E'!$I$30=\"\",\"\",'Tex-113,4-E'!$I$30)","v":3}]
[185,{"$f":"IF('Tex-113,4-E'!$J$72=\"\",\"\",'Tex-113,4-E'!$J$72)","v":""},{"$f":"IF('Tex-113,4-E'!$B$6=\"\",\"\",'Tex-113,4-E'!$B$6)","v":"Tex-113-E or Tex-114-E"},{"$f":"IF('Tex-113,4-E'!$B$68=\"\",\"\",'Tex-113,4-E'!$B$68)","v":"SCA Energy Data"},{"$f":"IF('Tex-113,4-E'!$B$66=\"\",\"\",'Tex-113,4-E'!$B$66)","v":"Import Data"},{"$f":"IF(OR('Tex-113,4-E'!$J$68=\"\",'Tex-113,4-E'!$B$72=\"\"),\"\",'Tex-113,4-E'!$J$68&\", \"&'Tex-113,4-E'!$B$72)","v":"Avg Energy/\nBlow (lb-ft), Lift 4:"},{"$f":"IF('Tex-113,4-E'!$I$30=\"\",\"\",'Tex-113,4-E'!$I$30)","v":3}]
[186,{"$f":"IF('Tex-113,4-E'!$K$69=\"\",\"\",'Tex-113,4-E'!$K$69)","v":""},{"$f":"IF('Tex-113,4-E'!$B$6=\"\",\"\",'Tex-113,4-E'!$B$6)","v":"Tex-113-E or Tex-114-E"},{"$f":"IF('Tex-113,4-E'!$B$68=\"\",\"\",'Tex-113,4-E'!$B$68)","v":"SCA Energy Data"},{"$f":"IF('Tex-113,4-E'!$B$66=\"\",\"\",'Tex-113,4-E'!$B$66)","v":"Import Data"},{"$f":"IF(OR('Tex-113,4-E'!$K$68=\"\",'Tex-113,4-E'!$B$69=\"\"),\"\",'Tex-113,4-E'!$K$68&\", \"&'Tex-113,4-E'!$B$69)","v":"Total Energy \n(lb-ft), Lift 1:"},{"$f":"IF('Tex-113,4-E'!$K$30=\"\",\"\",'Tex-113,4-E'!$K$30)","v":4}]
[187,{"$f":"IF('Tex-113,4-E'!$K$70=\"\",\"\",'Tex-113,4-E'!$K$70)","v":""},{"$f":"IF('Tex-113,4-E'!$B$6=\"\",\"\",'Tex-113,4-E'!$B$6)","v":"Tex-113-E or Tex-114-E"},{"$f":"IF('Tex-113,4-E'!$B$68=\"\",\"\",'Tex-113,4-E'!$B$68)","v":"SCA Energy Data"},{"$f":"IF('Tex-113,4-E'!$B$66=\"\",\"\",'Tex-113,4-E'!$B$66)","v":"Import Data"},{"$f":"IF(OR('Tex-113,4-E'!$K$68=\"\",'Tex-113,4-E'!$B$70=\"\"),\"\",'Tex-113,4-E'!$K$68&\", \"&'Tex-113,4-E'!$B$70)","v":"Total Energy \n(lb-ft), Lift 2:"},{"$f":"IF('Tex-113,4-E'!$K$30=\"\",\"\",'Tex-113,4-E'!$K$30)","v":4}]
[188,{"$f":"IF('Tex-113,4-E'!$K$71=\"\",\"\",'Tex-113,4-E'!$K$71)","v":""},{"$f":"IF('Tex-113,4-E'!$B$6=\"\",\"\",'Tex-113,4-E'!$B$6)","v":"Tex-113-E or Tex-114-E"},{"$f":"IF('Tex-113,4-E'!$B$68=\"\",\"\",'Tex-113,4-E'!$B$68)","v":"SCA Energy Data"},{"$f":"IF('Tex-113,4-E'!$B$66=\"\",\"\",'Tex-113,4-E'!$B$66)","v":"Import Data"},{"$f":"IF(OR('Tex-113,4-E'!$K$68=\"\",'Tex-113,4-E'!$B$71=\"\"),\"\",'Tex-113,4-E'!$K$68&\", \"&'Tex-113,4-E'!$B$71)","v":"Total Energy \n(lb-ft), Lift 3:"},{"$f":"IF('Tex-113,4-E'!$K$30=\"\",\"\",'Tex-113,4-E'!$K$30)","v":4}]
[189,{"$f":"IF('Tex-113,4-E'!$K$72=\"\",\"\",'Tex-113,4-E'!$K$72)","v":""},{"$f":"IF('Tex-113,4-E'!$B$6=\"\",\"\",'Tex-113,4-E'!$B$6)","v":"Tex-113-E or Tex-114-E"},{"$f":"IF('Tex-113,4-E'!$B$68=\"\",\"\",'Tex-113,4-E'!$B$68)","v":"SCA Energy Data"},{"$f":"IF('Tex-113,4-E'!$B$66=\"\",\"\",'Tex-113,4-E'!$B$66)","v":"Import Data"},{"$f":"IF(OR('Tex-113,4-E'!$K$68=\"\",'Tex-113,4-E'!$B$72=\"\"),\"\",'Tex-113,4-E'!$K$68&\", \"&'Tex-113,4-E'!$B$72)","v":"Total Energy \n(lb-ft), Lift 4:"},{"$f":"IF('Tex-113,4-E'!$K$30=\"\",\"\",'Tex-113,4-E'!$K$30)","v":4}]
[190,{"$f":"IF('Tex-113,4-E'!$L$69=\"\",\"\",'Tex-113,4-E'!$L$69)","v":""},{"$f":"IF('Tex-113,4-E'!$B$6=\"\",\"\",'Tex-113,4-E'!$B$6)","v":"Tex-113-E or Tex-114-E"},{"$f":"IF('Tex-113,4-E'!$B$68=\"\",\"\",'Tex-113,4-E'!$B$68)","v":"SCA Energy Data"},{"$f":"IF('Tex-113,4-E'!$B$66=\"\",\"\",'Tex-113,4-E'!$B$66)","v":"Import Data"},{"$f":"IF(OR('Tex-113,4-E'!$L$68=\"\",'Tex-113,4-E'!$B$69=\"\"),\"\",'Tex-113,4-E'!$L$68&\", \"&'Tex-113,4-E'!$B$69)","v":"Avg Energy/\nBlow (lb-ft), Lift 1:"},{"$f":"IF('Tex-113,4-E'!$K$30=\"\",\"\",'Tex-113,4-E'!$K$30)","v":4}]
[191,{"$f":"IF('Tex-113,4-E'!$L$70=\"\",\"\",'Tex-113,4-E'!$L$70)","v":""},{"$f":"IF('Tex-113,4-E'!$B$6=\"\",\"\",'Tex-113,4-E'!$B$6)","v":"Tex-113-E or Tex-114-E"},{"$f":"IF('Tex-113,4-E'!$B$68=\"\",\"\",'Tex-113,4-E'!$B$68)","v":"SCA Energy Data"},{"$f":"IF('Tex-113,4-E'!$B$66=\"\",\"\",'Tex-113,4-E'!$B$66)","v":"Import Data"},{"$f":"IF(OR('Tex-113,4-E'!$L$68=\"\",'Tex-113,4-E'!$B$70=\"\"),\"\",'Tex-113,4-E'!$L$68&\", \"&'Tex-113,4-E'!$B$70)","v":"Avg Energy/\nBlow (lb-ft), Lift 2:"},{"$f":"IF('Tex-113,4-E'!$K$30=\"\",\"\",'Tex-113,4-E'!$K$30)","v":4}]
[192,{"$f":"IF('Tex-113,4-E'!$L$71=\"\",\"\",'Tex-113,4-E'!$L$71)","v":""},{"$f":"IF('Tex-113,4-E'!$B$6=\"\",\"\",'Tex-113,4-E'!$B$6)","v":"Tex-113-E or Tex-114-E"},{"$f":"IF('Tex-113,4-E'!$B$68=\"\",\"\",'Tex-113,4-E'!$B$68)","v":"SCA Energy Data"},{"$f":"IF('Tex-113,4-E'!$B$66=\"\",\"\",'Tex-113,4-E'!$B$66)","v":"Import Data"},{"$f":"IF(OR('Tex-113,4-E'!$L$68=\"\",'Tex-113,4-E'!$B$71=\"\"),\"\",'Tex-113,4-E'!$L$68&\", \"&'Tex-113,4-E'!$B$71)","v":"Avg Energy/\nBlow (lb-ft), Lift 3:"},{"$f":"IF('Tex-113,4-E'!$K$30=\"\",\"\",'Tex-113,4-E'!$K$30)","v":4}]
[193,{"$f":"IF('Tex-113,4-E'!$L$72=\"\",\"\",'Tex-113,4-E'!$L$72)","v":""},{"$f":"IF('Tex-113,4-E'!$B$6=\"\",\"\",'Tex-113,4-E'!$B$6)","v":"Tex-113-E or Tex-114-E"},{"$f":"IF('Tex-113,4-E'!$B$68=\"\",\"\",'Tex-113,4-E'!$B$68)","v":"SCA Energy Data"},{"$f":"IF('Tex-113,4-E'!$B$66=\"\",\"\",'Tex-113,4-E'!$B$66)","v":"Import Data"},{"$f":"IF(OR('Tex-113,4-E'!$L$68=\"\",'Tex-113,4-E'!$B$72=\"\"),\"\",'Tex-113,4-E'!$L$68&\", \"&'Tex-113,4-E'!$B$72)","v":"Avg Energy/\nBlow (lb-ft), Lift 4:"},{"$f":"IF('Tex-113,4-E'!$K$30=\"\",\"\",'Tex-113,4-E'!$K$30)","v":4}]
[194,{"$f":"IF('Tex-113,4-E'!$E$75=\"\",\"\",'Tex-113,4-E'!$E$75)","v":""},{"$f":"IF('Tex-113,4-E'!$B$6=\"\",\"\",'Tex-113,4-E'!$B$6)","v":"Tex-113-E or Tex-114-E"},{"$f":"IF('Tex-113,4-E'!$B$80=\"\",\"\",'Tex-113,4-E'!$B$80)","v":"Unconfined Strength Data (psi):"},{"$f":"IF('Tex-113,4-E'!$B$66=\"\",\"\",'Tex-113,4-E'!$B$66)","v":"Import Data"},{"$f":"IF(OR('Tex-113,4-E'!E$74=\"\",'Tex-113,4-E'!$B75=\"\"),\"\",'Tex-113,4-E'!$E$74&\", \"&'Tex-113,4-E'!$B75)","v":"Avg. Drop Ht. (in), Lift 1:"},{"$f":"IF('Tex-113,4-E'!$E$30=\"\",\"\",'Tex-113,4-E'!$E$30)","v":1}]
[195,{"$f":"IF('Tex-113,4-E'!$E$76=\"\",\"\",'Tex-113,4-E'!$E$76)","v":""},{"$f":"IF('Tex-113,4-E'!$B$6=\"\",\"\",'Tex-113,4-E'!$B$6)","v":"Tex-113-E or Tex-114-E"},{"$f":"IF('Tex-113,4-E'!$B$80=\"\",\"\",'Tex-113,4-E'!$B$80)","v":"Unconfined Strength Data (psi):"},{"$f":"IF('Tex-113,4-E'!$B$66=\"\",\"\",'Tex-113,4-E'!$B$66)","v":"Import Data"},{"$f":"IF(OR('Tex-113,4-E'!E$74=\"\",'Tex-113,4-E'!$B76=\"\"),\"\",'Tex-113,4-E'!$E$74&\", \"&'Tex-113,4-E'!$B76)","v":"Avg. Drop Ht. (in), Lift 2:"},{"$f":"IF('Tex-113,4-E'!$E$30=\"\",\"\",'Tex-113,4-E'!$E$30)","v":1}]
[196,{"$f":"IF('Tex-113,4-E'!$E$77=\"\",\"\",'Tex-113,4-E'!$E$77)","v":""},{"$f":"IF('Tex-113,4-E'!$B$6=\"\",\"\",'Tex-113,4-E'!$B$6)","v":"Tex-113-E or Tex-114-E"},{"$f":"IF('Tex-113,4-E'!$B$80=\"\",\"\",'Tex-113,4-E'!$B$80)","v":"Unconfined Strength Data (psi):"},{"$f":"IF('Tex-113,4-E'!$B$66=\"\",\"\",'Tex-113,4-E'!$B$66)","v":"Import Data"},{"$f":"IF(OR('Tex-113,4-E'!E$74=\"\",'Tex-113,4-E'!$B77=\"\"),\"\",'Tex-113,4-E'!$E$74&\", \"&'Tex-113,4-E'!$B77)","v":"Avg. Drop Ht. (in), Lift 3:"},{"$f":"IF('Tex-113,4-E'!$E$30=\"\",\"\",'Tex-113,4-E'!$E$30)","v":1}]
[197,{"$f":"IF('Tex-113,4-E'!$E$78=\"\",\"\",'Tex-113,4-E'!$E$78)","v":""},{"$f":"IF('Tex-113,4-E'!$B$6=\"\",\"\",'Tex-113,4-E'!$B$6)","v":"Tex-113-E or Tex-114-E"},{"$f":"IF('Tex-113,4-E'!$B$80=\"\",\"\",'Tex-113,4-E'!$B$80)","v":"Unconfined Strength Data (psi):"},{"$f":"IF('Tex-113,4-E'!$B$66=\"\",\"\",'Tex-113,4-E'!$B$66)","v":"Import Data"},{"$f":"IF(OR('Tex-113,4-E'!E$74=\"\",'Tex-113,4-E'!$B78=\"\"),\"\",'Tex-113,4-E'!$E$74&\", \"&'Tex-113,4-E'!$B78)","v":"Avg. Drop Ht. (in), Lift 4:"},{"$f":"IF('Tex-113,4-E'!$E$30=\"\",\"\",'Tex-113,4-E'!$E$30)","v":1}]
[198,{"$f":"IF('Tex-113,4-E'!$F$75=\"\",\"\",'Tex-113,4-E'!$F$75)","v":""},{"$f":"IF('Tex-113,4-E'!$B$6=\"\",\"\",'Tex-113,4-E'!$B$6)","v":"Tex-113-E or Tex-114-E"},{"$f":"IF('Tex-113,4-E'!$B$80=\"\",\"\",'Tex-113,4-E'!$B$80)","v":"Unconfined Strength Data (psi):"},{"$f":"IF('Tex-113,4-E'!$B$66=\"\",\"\",'Tex-113,4-E'!$B$66)","v":"Import Data"},{"$f":"IF(OR('Tex-113,4-E'!E$74=\"\",'Tex-113,4-E'!$B75=\"\"),\"\",'Tex-113,4-E'!$E$74&\", \"&'Tex-113,4-E'!$B75)","v":"Avg. Drop Ht. (in), Lift 1:"},{"$f":"IF('Tex-113,4-E'!$E$30=\"\",\"\",'Tex-113,4-E'!$E$30)","v":1}]
[199,{"$f":"IF('Tex-113,4-E'!$F$76=\"\",\"\",'Tex-113,4-E'!$F$76)","v":""},{"$f":"IF('Tex-113,4-E'!$B$6=\"\",\"\",'Tex-113,4-E'!$B$6)","v":"Tex-113-E or Tex-114-E"},{"$f":"IF('Tex-113,4-E'!$B$80=\"\",\"\",'Tex-113,4-E'!$B$80)","v":"Unconfined Strength Data (psi):"},{"$f":"IF('Tex-113,4-E'!$B$66=\"\",\"\",'Tex-113,4-E'!$B$66)","v":"Import Data"},{"$f":"IF(OR('Tex-113,4-E'!E$74=\"\",'Tex-113,4-E'!$B76=\"\"),\"\",'Tex-113,4-E'!$E$74&\", \"&'Tex-113,4-E'!$B76)","v":"Avg. Drop Ht. (in), Lift 2:"},{"$f":"IF('Tex-113,4-E'!$E$30=\"\",\"\",'Tex-113,4-E'!$E$30)","v":1}]
[200,{"$f":"IF('Tex-113,4-E'!$F$77=\"\",\"\",'Tex-113,4-E'!$F$77)","v":""},{"$f":"IF('Tex-113,4-E'!$B$6=\"\",\"\",'Tex-113,4-E'!$B$6)","v":"Tex-113-E or Tex-114-E"},{"$f":"IF('Tex-113,4-E'!$B$80=\"\",\"\",'Tex-113,4-E'!$B$80)","v":"Unconfined Strength Data (psi):"},{"$f":"IF('Tex-113,4-E'!$B$66=\"\",\"\",'Tex-113,4-E'!$B$66)","v":"Import Data"},{"$f":"IF(OR('Tex-113,4-E'!E$74=\"\",'Tex-113,4-E'!$B77=\"\"),\"\",'Tex-113,4-E'!$E$74&\", \"&'Tex-113,4-E'!$B77)","v":"Avg. Drop Ht. (in), Lift 3:"},{"$f":"IF('Tex-113,4-E'!$E$30=\"\",\"\",'Tex-113,4-E'!$E$30)","v":1}]
[201,{"$f":"IF('Tex-113,4-E'!$F$78=\"\",\"\",'Tex-113,4-E'!$F$78)","v":""},{"$f":"IF('Tex-113,4-E'!$B$6=\"\",\"\",'Tex-113,4-E'!$B$6)","v":"Tex-113-E or Tex-114-E"},{"$f":"IF('Tex-113,4-E'!$B$80=\"\",\"\",'Tex-113,4-E'!$B$80)","v":"Unconfined Strength Data (psi):"},{"$f":"IF('Tex-113,4-E'!$B$66=\"\",\"\",'Tex-113,4-E'!$B$66)","v":"Import Data"},{"$f":"IF(OR('Tex-113,4-E'!E$74=\"\",'Tex-113,4-E'!$B78=\"\"),\"\",'Tex-113,4-E'!$E$74&\", \"&'Tex-113,4-E'!$B78)","v":"Avg. Drop Ht. (in), Lift 4:"},{"$f":"IF('Tex-113,4-E'!$E$30=\"\",\"\",'Tex-113,4-E'!$E$30)","v":1}]
[202,{"$f":"IF('Tex-113,4-E'!$G$75=\"\",\"\",'Tex-113,4-E'!$G$75)","v":""},{"$f":"IF('Tex-113,4-E'!$B$6=\"\",\"\",'Tex-113,4-E'!$B$6)","v":"Tex-113-E or Tex-114-E"},{"$f":"IF('Tex-113,4-E'!$B$80=\"\",\"\",'Tex-113,4-E'!$B$80)","v":"Unconfined Strength Data (psi):"},{"$f":"IF('Tex-113,4-E'!$B$66=\"\",\"\",'Tex-113,4-E'!$B$66)","v":"Import Data"},{"$f":"IF(OR('Tex-113,4-E'!$G$74=\"\",'Tex-113,4-E'!$B$75=\"\"),\"\",'Tex-113,4-E'!$G$74&\", \"&'Tex-113,4-E'!$B$75)","v":"Avg. Drop Ht.(in), Lift 1:"},{"$f":"IF('Tex-113,4-E'!$G$30=\"\",\"\",'Tex-113,4-E'!$G$30)","v":2}]
[203,{"$f":"IF('Tex-113,4-E'!$G$76=\"\",\"\",'Tex-113,4-E'!$G$76)","v":""},{"$f":"IF('Tex-113,4-E'!$B$6=\"\",\"\",'Tex-113,4-E'!$B$6)","v":"Tex-113-E or Tex-114-E"},{"$f":"IF('Tex-113,4-E'!$B$80=\"\",\"\",'Tex-113,4-E'!$B$80)","v":"Unconfined Strength Data (psi):"},{"$f":"IF('Tex-113,4-E'!$B$66=\"\",\"\",'Tex-113,4-E'!$B$66)","v":"Import Data"},{"$f":"IF(OR('Tex-113,4-E'!$G$74=\"\",'Tex-113,4-E'!$B$76=\"\"),\"\",'Tex-113,4-E'!$G$74&\", \"&'Tex-113,4-E'!$B$76)","v":"Avg. Drop Ht.(in), Lift 2:"},{"$f":"IF('Tex-113,4-E'!$G$30=\"\",\"\",'Tex-113,4-E'!$G$30)","v":2}]
[204,{"$f":"IF('Tex-113,4-E'!$G$77=\"\",\"\",'Tex-113,4-E'!$G$77)","v":""},{"$f":"IF('Tex-113,4-E'!$B$6=\"\",\"\",'Tex-113,4-E'!$B$6)","v":"Tex-113-E or Tex-114-E"},{"$f":"IF('Tex-113,4-E'!$B$80=\"\",\"\",'Tex-113,4-E'!$B$80)","v":"Unconfined Strength Data (psi):"},{"$f":"IF('Tex-113,4-E'!$B$66=\"\",\"\",'Tex-113,4-E'!$B$66)","v":"Import Data"},{"$f":"IF(OR('Tex-113,4-E'!$G$74=\"\",'Tex-113,4-E'!$B$77=\"\"),\"\",'Tex-113,4-E'!$G$74&\", \"&'Tex-113,4-E'!$B$77)","v":"Avg. Drop Ht.(in), Lift 3:"},{"$f":"IF('Tex-113,4-E'!$G$30=\"\",\"\",'Tex-113,4-E'!$G$30)","v":2}]
[205,{"$f":"IF('Tex-113,4-E'!$G$78=\"\",\"\",'Tex-113,4-E'!$G$78)","v":""},{"$f":"IF('Tex-113,4-E'!$B$6=\"\",\"\",'Tex-113,4-E'!$B$6)","v":"Tex-113-E or Tex-114-E"},{"$f":"IF('Tex-113,4-E'!$B$80=\"\",\"\",'Tex-113,4-E'!$B$80)","v":"Unconfined Strength Data (psi):"},{"$f":"IF('Tex-113,4-E'!$B$66=\"\",\"\",'Tex-113,4-E'!$B$66)","v":"Import Data"},{"$f":"IF(OR('Tex-113,4-E'!$G$74=\"\",'Tex-113,4-E'!$B$78=\"\"),\"\",'Tex-113,4-E'!$G$74&\", \"&'Tex-113,4-E'!$B$78)","v":"Avg. Drop Ht.(in), Lift 4:"},{"$f":"IF('Tex-113,4-E'!$G$30=\"\",\"\",'Tex-113,4-E'!$G$30)","v":2}]
[206,{"$f":"IF('Tex-113,4-E'!$H$75=\"\",\"\",'Tex-113,4-E'!$H$75)","v":""},{"$f":"IF('Tex-113,4-E'!$B$6=\"\",\"\",'Tex-113,4-E'!$B$6)","v":"Tex-113-E or Tex-114-E"},{"$f":"IF('Tex-113,4-E'!$B$80=\"\",\"\",'Tex-113,4-E'!$B$80)","v":"Unconfined Strength Data (psi):"},{"$f":"IF('Tex-113,4-E'!$B$66=\"\",\"\",'Tex-113,4-E'!$B$66)","v":"Import Data"},{"$f":"IF(OR('Tex-113,4-E'!$H$74=\"\",'Tex-113,4-E'!$B$75=\"\"),\"\",'Tex-113,4-E'!$H$74&\", \"&'Tex-113,4-E'!$B$75)","v":"Blows, Lift 1:"},{"$f":"IF('Tex-113,4-E'!$G$30=\"\",\"\",'Tex-113,4-E'!$G$30)","v":2}]
[207,{"$f":"IF('Tex-113,4-E'!$H$76=\"\",\"\",'Tex-113,4-E'!$H$76)","v":""},{"$f":"IF('Tex-113,4-E'!$B$6=\"\",\"\",'Tex-113,4-E'!$B$6)","v":"Tex-113-E or Tex-114-E"},{"$f":"IF('Tex-113,4-E'!$B$80=\"\",\"\",'Tex-113,4-E'!$B$80)","v":"Unconfined Strength Data (psi):"},{"$f":"IF('Tex-113,4-E'!$B$66=\"\",\"\",'Tex-113,4-E'!$B$66)","v":"Import Data"},{"$f":"IF(OR('Tex-113,4-E'!$H$74=\"\",'Tex-113,4-E'!$B$76=\"\"),\"\",'Tex-113,4-E'!$H$74&\", \"&'Tex-113,4-E'!$B$76)","v":"Blows, Lift 2:"},{"$f":"IF('Tex-113,4-E'!$G$30=\"\",\"\",'Tex-113,4-E'!$G$30)","v":2}]
[208,{"$f":"IF('Tex-113,4-E'!$H$77=\"\",\"\",'Tex-113,4-E'!$H$77)","v":""},{"$f":"IF('Tex-113,4-E'!$B$6=\"\",\"\",'Tex-113,4-E'!$B$6)","v":"Tex-113-E or Tex-114-E"},{"$f":"IF('Tex-113,4-E'!$B$80=\"\",\"\",'Tex-113,4-E'!$B$80)","v":"Unconfined Strength Data (psi):"},{"$f":"IF('Tex-113,4-E'!$B$66=\"\",\"\",'Tex-113,4-E'!$B$66)","v":"Import Data"},{"$f":"IF(OR('Tex-113,4-E'!$H$74=\"\",'Tex-113,4-E'!$B$77=\"\"),\"\",'Tex-113,4-E'!$H$74&\", \"&'Tex-113,4-E'!$B$77)","v":"Blows, Lift 3:"},{"$f":"IF('Tex-113,4-E'!$G$30=\"\",\"\",'Tex-113,4-E'!$G$30)","v":2}]
[209,{"$f":"IF('Tex-113,4-E'!$H$78=\"\",\"\",'Tex-113,4-E'!$H$78)","v":""},{"$f":"IF('Tex-113,4-E'!$B$6=\"\",\"\",'Tex-113,4-E'!$B$6)","v":"Tex-113-E or Tex-114-E"},{"$f":"IF('Tex-113,4-E'!$B$80=\"\",\"\",'Tex-113,4-E'!$B$80)","v":"Unconfined Strength Data (psi):"},{"$f":"IF('Tex-113,4-E'!$B$66=\"\",\"\",'Tex-113,4-E'!$B$66)","v":"Import Data"},{"$f":"IF(OR('Tex-113,4-E'!$H$74=\"\",'Tex-113,4-E'!$B$78=\"\"),\"\",'Tex-113,4-E'!$H$74&\", \"&'Tex-113,4-E'!$B$78)","v":"Blows, Lift 4:"},{"$f":"IF('Tex-113,4-E'!$G$30=\"\",\"\",'Tex-113,4-E'!$G$30)","v":2}]
[210,{"$f":"IF('Tex-113,4-E'!$I$75=\"\",\"\",'Tex-113,4-E'!$I$75)","v":""},{"$f":"IF('Tex-113,4-E'!$B$6=\"\",\"\",'Tex-113,4-E'!$B$6)","v":"Tex-113-E or Tex-114-E"},{"$f":"IF('Tex-113,4-E'!$B$80=\"\",\"\",'Tex-113,4-E'!$B$80)","v":"Unconfined Strength Data (psi):"},{"$f":"IF('Tex-113,4-E'!$B$66=\"\",\"\",'Tex-113,4-E'!$B$66)","v":"Import Data"},{"$f":"IF(OR('Tex-113,4-E'!$I$74=\"\",'Tex-113,4-E'!$B$75=\"\"),\"\",'Tex-113,4-E'!$I$74&\", \"&'Tex-113,4-E'!$B$75)","v":"Avg. Drop Ht.(in), Lift 1:"},{"$f":"IF('Tex-113,4-E'!$I$30=\"\",\"\",'Tex-113,4-E'!$I$30)","v":3}]
[211,{"$f":"IF('Tex-113,4-E'!$I$76=\"\",\"\",'Tex-113,4-E'!$I$76)","v":""},{"$f":"IF('Tex-113,4-E'!$B$6=\"\",\"\",'Tex-113,4-E'!$B$6)","v":"Tex-113-E or Tex-114-E"},{"$f":"IF('Tex-113,4-E'!$B$80=\"\",\"\",'Tex-113,4-E'!$B$80)","v":"Unconfined Strength Data (psi):"},{"$f":"IF('Tex-113,4-E'!$B$66=\"\",\"\",'Tex-113,4-E'!$B$66)","v":"Import Data"},{"$f":"IF(OR('Tex-113,4-E'!$I$74=\"\",'Tex-113,4-E'!$B$76=\"\"),\"\",'Tex-113,4-E'!$I$74&\", \"&'Tex-113,4-E'!$B$76)","v":"Avg. Drop Ht.(in), Lift 2:"},{"$f":"IF('Tex-113,4-E'!$I$30=\"\",\"\",'Tex-113,4-E'!$I$30)","v":3}]
[212,{"$f":"IF('Tex-113,4-E'!$I$77=\"\",\"\",'Tex-113,4-E'!$I$77)","v":""},{"$f":"IF('Tex-113,4-E'!$B$6=\"\",\"\",'Tex-113,4-E'!$B$6)","v":"Tex-113-E or Tex-114-E"},{"$f":"IF('Tex-113,4-E'!$B$80=\"\",\"\",'Tex-113,4-E'!$B$80)","v":"Unconfined Strength Data (psi):"},{"$f":"IF('Tex-113,4-E'!$B$66=\"\",\"\",'Tex-113,4-E'!$B$66)","v":"Import Data"},{"$f":"IF(OR('Tex-113,4-E'!$I$74=\"\",'Tex-113,4-E'!$B$77=\"\"),\"\",'Tex-113,4-E'!$I$74&\", \"&'Tex-113,4-E'!$B$77)","v":"Avg. Drop Ht.(in), Lift 3:"},{"$f":"IF('Tex-113,4-E'!$I$30=\"\",\"\",'Tex-113,4-E'!$I$30)","v":3}]
[213,{"$f":"IF('Tex-113,4-E'!$I$78=\"\",\"\",'Tex-113,4-E'!$I$78)","v":""},{"$f":"IF('Tex-113,4-E'!$B$6=\"\",\"\",'Tex-113,4-E'!$B$6)","v":"Tex-113-E or Tex-114-E"},{"$f":"IF('Tex-113,4-E'!$B$80=\"\",\"\",'Tex-113,4-E'!$B$80)","v":"Unconfined Strength Data (psi):"},{"$f":"IF('Tex-113,4-E'!$B$66=\"\",\"\",'Tex-113,4-E'!$B$66)","v":"Import Data"},{"$f":"IF(OR('Tex-113,4-E'!$I$74=\"\",'Tex-113,4-E'!$B$78=\"\"),\"\",'Tex-113,4-E'!$I$74&\", \"&'Tex-113,4-E'!$B$78)","v":"Avg. Drop Ht.(in), Lift 4:"},{"$f":"IF('Tex-113,4-E'!$I$30=\"\",\"\",'Tex-113,4-E'!$I$30)","v":3}]
[214,{"$f":"IF('Tex-113,4-E'!$J$75=\"\",\"\",'Tex-113,4-E'!$J$75)","v":""},{"$f":"IF('Tex-113,4-E'!$B$6=\"\",\"\",'Tex-113,4-E'!$B$6)","v":"Tex-113-E or Tex-114-E"},{"$f":"IF('Tex-113,4-E'!$B$80=\"\",\"\",'Tex-113,4-E'!$B$80)","v":"Unconfined Strength Data (psi):"},{"$f":"IF('Tex-113,4-E'!$B$66=\"\",\"\",'Tex-113,4-E'!$B$66)","v":"Import Data"},{"$f":"IF(OR('Tex-113,4-E'!$J$74=\"\",'Tex-113,4-E'!$B$75=\"\"),\"\",'Tex-113,4-E'!$J$74&\", \"&'Tex-113,4-E'!$B$75)","v":"Blows, Lift 1:"},{"$f":"IF('Tex-113,4-E'!$I$30=\"\",\"\",'Tex-113,4-E'!$I$30)","v":3}]
[215,{"$f":"IF('Tex-113,4-E'!$J$76=\"\",\"\",'Tex-113,4-E'!$J$76)","v":""},{"$f":"IF('Tex-113,4-E'!$B$6=\"\",\"\",'Tex-113,4-E'!$B$6)","v":"Tex-113-E or Tex-114-E"},{"$f":"IF('Tex-113,4-E'!$B$80=\"\",\"\",'Tex-113,4-E'!$B$80)","v":"Unconfined Strength Data (psi):"},{"$f":"IF('Tex-113,4-E'!$B$66=\"\",\"\",'Tex-113,4-E'!$B$66)","v":"Import Data"},{"$f":"IF(OR('Tex-113,4-E'!$J$74=\"\",'Tex-113,4-E'!$B$76=\"\"),\"\",'Tex-113,4-E'!$J$74&\", \"&'Tex-113,4-E'!$B$76)","v":"Blows, Lift 2:"},{"$f":"IF('Tex-113,4-E'!$I$30=\"\",\"\",'Tex-113,4-E'!$I$30)","v":3}]
[216,{"$f":"IF('Tex-113,4-E'!$J$77=\"\",\"\",'Tex-113,4-E'!$J$77)","v":""},{"$f":"IF('Tex-113,4-E'!$B$6=\"\",\"\",'Tex-113,4-E'!$B$6)","v":"Tex-113-E or Tex-114-E"},{"$f":"IF('Tex-113,4-E'!$B$80=\"\",\"\",'Tex-113,4-E'!$B$80)","v":"Unconfined Strength Data (psi):"},{"$f":"IF('Tex-113,4-E'!$B$66=\"\",\"\",'Tex-113,4-E'!$B$66)","v":"Import Data"},{"$f":"IF(OR('Tex-113,4-E'!$J$74=\"\",'Tex-113,4-E'!$B$77=\"\"),\"\",'Tex-113,4-E'!$J$74&\", \"&'Tex-113,4-E'!$B$77)","v":"Blows, Lift 3:"},{"$f":"IF('Tex-113,4-E'!$I$30=\"\",\"\",'Tex-113,4-E'!$I$30)","v":3}]
[217,{"$f":"IF('Tex-113,4-E'!$J$78=\"\",\"\",'Tex-113,4-E'!$J$78)","v":""},{"$f":"IF('Tex-113,4-E'!$B$6=\"\",\"\",'Tex-113,4-E'!$B$6)","v":"Tex-113-E or Tex-114-E"},{"$f":"IF('Tex-113,4-E'!$B$80=\"\",\"\",'Tex-113,4-E'!$B$80)","v":"Unconfined Strength Data (psi):"},{"$f":"IF('Tex-113,4-E'!$B$66=\"\",\"\",'Tex-113,4-E'!$B$66)","v":"Import Data"},{"$f":"IF(OR('Tex-113,4-E'!$J$74=\"\",'Tex-113,4-E'!$B$78=\"\"),\"\",'Tex-113,4-E'!$J$74&\", \"&'Tex-113,4-E'!$B$78)","v":"Blows, Lift 4:"},{"$f":"IF('Tex-113,4-E'!$I$30=\"\",\"\",'Tex-113,4-E'!$I$30)","v":3}]
[218,{"$f":"IF('Tex-113,4-E'!$K$75=\"\",\"\",'Tex-113,4-E'!$K$75)","v":""},{"$f":"IF('Tex-113,4-E'!$B$6=\"\",\"\",'Tex-113,4-E'!$B$6)","v":"Tex-113-E or Tex-114-E"},{"$f":"IF('Tex-113,4-E'!$B$80=\"\",\"\",'Tex-113,4-E'!$B$80)","v":"Unconfined Strength Data (psi):"},{"$f":"IF('Tex-113,4-E'!$B$66=\"\",\"\",'Tex-113,4-E'!$B$66)","v":"Import Data"},{"$f":"IF(OR('Tex-113,4-E'!$K$74=\"\",'Tex-113,4-E'!$B$75=\"\"),\"\",'Tex-113,4-E'!$K$74&\", \"&'Tex-113,4-E'!$B$75)","v":"Avg. Drop Ht.(in), Lift 1:"},{"$f":"IF('Tex-113,4-E'!$K$30=\"\",\"\",'Tex-113,4-E'!$K$30)","v":4}]
[219,{"$f":"IF('Tex-113,4-E'!$K$76=\"\",\"\",'Tex-113,4-E'!$K$76)","v":""},{"$f":"IF('Tex-113,4-E'!$B$6=\"\",\"\",'Tex-113,4-E'!$B$6)","v":"Tex-113-E or Tex-114-E"},{"$f":"IF('Tex-113,4-E'!$B$80=\"\",\"\",'Tex-113,4-E'!$B$80)","v":"Unconfined Strength Data (psi):"},{"$f":"IF('Tex-113,4-E'!$B$66=\"\",\"\",'Tex-113,4-E'!$B$66)","v":"Import Data"},{"$f":"IF(OR('Tex-113,4-E'!$K$74=\"\",'Tex-113,4-E'!$B$76=\"\"),\"\",'Tex-113,4-E'!$K$74&\", \"&'Tex-113,4-E'!$B$76)","v":"Avg. Drop Ht.(in), Lift 2:"},{"$f":"IF('Tex-113,4-E'!$K$30=\"\",\"\",'Tex-113,4-E'!$K$30)","v":4}]
[220,{"$f":"IF('Tex-113,4-E'!$K$77=\"\",\"\",'Tex-113,4-E'!$K$77)","v":""},{"$f":"IF('Tex-113,4-E'!$B$6=\"\",\"\",'Tex-113,4-E'!$B$6)","v":"Tex-113-E or Tex-114-E"},{"$f":"IF('Tex-113,4-E'!$B$80=\"\",\"\",'Tex-113,4-E'!$B$80)","v":"Unconfined Strength Data (psi):"},{"$f":"IF('Tex-113,4-E'!$B$66=\"\",\"\",'Tex-113,4-E'!$B$66)","v":"Import Data"},{"$f":"IF(OR('Tex-113,4-E'!$K$74=\"\",'Tex-113,4-E'!$B$77=\"\"),\"\",'Tex-113,4-E'!$K$74&\", \"&'Tex-113,4-E'!$B$77)","v":"Avg. Drop Ht.(in), Lift 3:"},{"$f":"IF('Tex-113,4-E'!$K$30=\"\",\"\",'Tex-113,4-E'!$K$30)","v":4}]
[221,{"$f":"IF('Tex-113,4-E'!$K$78=\"\",\"\",'Tex-113,4-E'!$K$78)","v":""},{"$f":"IF('Tex-113,4-E'!$B$6=\"\",\"\",'Tex-113,4-E'!$B$6)","v":"Tex-113-E or Tex-114-E"},{"$f":"IF('Tex-113,4-E'!$B$80=\"\",\"\",'Tex-113,4-E'!$B$80)","v":"Unconfined Strength Data (psi):"},{"$f":"IF('Tex-113,4-E'!$B$66=\"\",\"\",'Tex-113,4-E'!$B$66)","v":"Import Data"},{"$f":"IF(OR('Tex-113,4-E'!$K$74=\"\",'Tex-113,4-E'!$B$78=\"\"),\"\",'Tex-113,4-E'!$K$74&\", \"&'Tex-113,4-E'!$B$78)","v":"Avg. Drop Ht.(in), Lift 4:"},{"$f":"IF('Tex-113,4-E'!$K$30=\"\",\"\",'Tex-113,4-E'!$K$30)","v":4}]
[222,{"$f":"IF('Tex-113,4-E'!$L$75=\"\",\"\",'Tex-113,4-E'!$L$75)","v":""},{"$f":"IF('Tex-113,4-E'!$B$6=\"\",\"\",'Tex-113,4-E'!$B$6)","v":"Tex-113-E or Tex-114-E"},{"$f":"IF('Tex-113,4-E'!$B$80=\"\",\"\",'Tex-113,4-E'!$B$80)","v":"Unconfined Strength Data (psi):"},{"$f":"IF('Tex-113,4-E'!$B$66=\"\",\"\",'Tex-113,4-E'!$B$66)","v":"Import Data"},{"$f":"IF(OR('Tex-113,4-E'!$L$74=\"\",'Tex-113,4-E'!$B$75=\"\"),\"\",'Tex-113,4-E'!$L$74&\", \"&'Tex-113,4-E'!$B$75)","v":"Blows, Lift 1:"},{"$f":"IF('Tex-113,4-E'!$K$30=\"\",\"\",'Tex-113,4-E'!$K$30)","v":4}]
[223,{"$f":"IF('Tex-113,4-E'!$L$76=\"\",\"\",'Tex-113,4-E'!$L$76)","v":""},{"$f":"IF('Tex-113,4-E'!$B$6=\"\",\"\",'Tex-113,4-E'!$B$6)","v":"Tex-113-E or Tex-114-E"},{"$f":"IF('Tex-113,4-E'!$B$80=\"\",\"\",'Tex-113,4-E'!$B$80)","v":"Unconfined Strength Data (psi):"},{"$f":"IF('Tex-113,4-E'!$B$66=\"\",\"\",'Tex-113,4-E'!$B$66)","v":"Import Data"},{"$f":"IF(OR('Tex-113,4-E'!$L$74=\"\",'Tex-113,4-E'!$B$76=\"\"),\"\",'Tex-113,4-E'!$L$74&\", \"&'Tex-113,4-E'!$B$76)","v":"Blows, Lift 2:"},{"$f":"IF('Tex-113,4-E'!$K$30=\"\",\"\",'Tex-113,4-E'!$K$30)","v":4}]
[224,{"$f":"IF('Tex-113,4-E'!$L$77=\"\",\"\",'Tex-113,4-E'!$L$77)","v":""},{"$f":"IF('Tex-113,4-E'!$B$6=\"\",\"\",'Tex-113,4-E'!$B$6)","v":"Tex-113-E or Tex-114-E"},{"$f":"IF('Tex-113,4-E'!$B$80=\"\",\"\",'Tex-113,4-E'!$B$80)","v":"Unconfined Strength Data (psi):"},{"$f":"IF('Tex-113,4-E'!$B$66=\"\",\"\",'Tex-113,4-E'!$B$66)","v":"Import Data"},{"$f":"IF(OR('Tex-113,4-E'!$L$74=\"\",'Tex-113,4-E'!$B$77=\"\"),\"\",'Tex-113,4-E'!$L$74&\", \"&'Tex-113,4-E'!$B$77)","v":"Blows, Lift 3:"},{"$f":"IF('Tex-113,4-E'!$K$30=\"\",\"\",'Tex-113,4-E'!$K$30)","v":4}]
[225,{"$f":"IF('Tex-113,4-E'!$L$78=\"\",\"\",'Tex-113,4-E'!$L$78)","v":""},{"$f":"IF('Tex-113,4-E'!$B$6=\"\",\"\",'Tex-113,4-E'!$B$6)","v":"Tex-113-E or Tex-114-E"},{"$f":"IF('Tex-113,4-E'!$B$80=\"\",\"\",'Tex-113,4-E'!$B$80)","v":"Unconfined Strength Data (psi):"},{"$f":"IF('Tex-113,4-E'!$B$66=\"\",\"\",'Tex-113,4-E'!$B$66)","v":"Import Data"},{"$f":"IF(OR('Tex-113,4-E'!$L$74=\"\",'Tex-113,4-E'!$B$78=\"\"),\"\",'Tex-113,4-E'!$L$74&\", \"&'Tex-113,4-E'!$B$78)","v":"Blows, Lift 4:"},{"$f":"IF('Tex-113,4-E'!$K$30=\"\",\"\",'Tex-113,4-E'!$K$30)","v":4}]
[226,{"$f":"IF('Tex-113,4-E'!$C$95=\"\",\"\",'Tex-113,4-E'!$C$95)","v":""},"Sampled By ",{"$f":"IF('Tex-113,4-E'!$B$95=\"\",\"\",'Tex-113,4-E'!$B$95)","v":"TX100"}]
[227,{"$f":"IF('Tex-113,4-E'!$F$95=\"\",\"\",'Tex-113,4-E'!$F$95)","v":""},"Sampled Date ",{"$f":"IF('Tex-113,4-E'!$B$95=\"\",\"\",'Tex-113,4-E'!$B$95)","v":"TX100"}]
[228,{"$f":"IF('Tex-113,4-E'!$C$97=\"\",\"\",'Tex-113,4-E'!$C$97)","v":""},"Sampled By ",{"$f":"IF('Tex-113,4-E'!$B$97=\"\",\"\",'Tex-113,4-E'!$B$97)","v":"TX400"}]
[229,{"$f":"IF('Tex-113,4-E'!$F$97=\"\",\"\",'Tex-113,4-E'!$F$97)","v":""},"Sampled Date ",{"$f":"IF('Tex-113,4-E'!$B$97=\"\",\"\",'Tex-113,4-E'!$B$97)","v":"TX400"}]