{"text_format":"1","workbook":"xlsx","n_sheets":3,"sheets":["Tex-113-E","RX","Reference"],"not_rendered":{"charts":1,"images":1,"macros":1,"external_links":0,"defined_names":98,"comments":1,"pivot_tables":0},"unopened":[],"bounds":{"document_bytes":16777216,"sheet_cells":100000,"rows_first":2000,"rows_last":500,"rows_between":2000,"halvings":0,"cell_chars":16384,"cell_head_chars":4096},"cells_cut":0,"cells_raw":0,"read":"whole","date_system":"1900"}

{"sheet":"Tex-113-E","index":0,"n_rows":65,"n_cols":11,"rows_kept":65,"cut":false,"hidden":false,"merged":[[7,3,7,4],[7,7,7,8],[8,3,8,4],[8,7,8,8],[9,3,9,4],[9,7,9,8],[10,3,10,4],[10,7,10,8],[11,3,11,4],[11,7,11,8],[12,3,12,4],[12,7,12,8],[21,1,21,3],[29,1,29,3],[31,1,31,3],[23,1,23,3],[22,1,22,3],[13,7,13,8],[15,3,15,8],[16,3,16,4],[16,7,16,8],[13,3,13,4],[14,3,14,8],[46,1,46,3],[54,1,54,8],[61,6,61,8],[41,1,41,3],[42,1,42,3],[0,0,0,1],[43,1,43,3],[44,1,44,3],[45,1,45,3],[26,1,26,3],[30,1,30,3],[37,1,37,3],[38,1,38,3],[33,1,33,3],[34,1,34,3],[39,1,39,3],[40,1,40,3],[35,1,35,3],[36,1,36,3],[32,1,32,3],[24,1,24,3],[65,1,65,3],[47,1,47,3],[48,1,48,3],[49,1,49,3],[52,1,53,8],[55,1,55,8],[59,2,59,4],[61,1,61,3],[58,2,58,4],[56,2,56,4],[57,2,57,4]]}
["TxDOT Manuals >",null,null,"Tex-113-E"]
[null,"TEXAS DEPARTMENT OF TRANSPORTATION",null,null,null,null,null,null,null,null,51]
[null,null,null,null,null,null,null,null,null,null,2]
[null,null,null,null,null,null,null,null,null,null,"tx113.xlsm::44734.680347"]
[null,"Moisture-Density Relations of Base Material and Cohesionless Sand"]
[null,"TEX-113-E"]
[null,null,null,null,null,null,null,null,{"$f":"\"File Version: \" & TEXT(MID(K4,SEARCH(\"::\",K4,1)+2,20),\"mm/dd/yy hh:mm:ss\")","v":"File Version: 06/22/22 16:19:42"}]
[null,null,"SAMPLE ID:",null,null,null,"SAMPLED DATE:"]
[null,null,"TEST NUMBER:",null,null,null,"LETTING DATE:"]
[null,null,"SAMPLE STATUS:",null,null,null,"CONTROLLING CSJ:"]
[null,null,"COUNTY:",null,null,null,"SPEC YEAR:"]
[null,null,"SAMPLED BY:",null,null,null,"SPEC ITEM:"]
[null,null,"SAMPLE LOCATION:",null,null,null,"SPECIAL PROVISION:"]
[null,null,"MATERIAL CODE:",null,null,null,"GRADE:"]
[null,null,"MATERIAL NAME:"]
[null,null,"PRODUCER:",""]
[null,null,"AREA ENGINEER:",null,null,null,"PROJECT MANAGER:"]
[]
[null,null,"COURSE\\LIFT:",null,"STATION:",null,null,"DIST. FROM CL:"]
[null,"Moisture-Density Work Sheet"]
[]
[null,"Oven Dry Weight, (g):"]
[null,"Weight of Pycnometer & Water, (g):"]
[null,"Weight of Aggr., Pycn.& Water, (g):"]
[null,"Specific Gravity (Apparent):",null,null,{"$f":"IF(ISERROR(E22/(E22+E23-E24)),\"\",E22/(E22+E23-E24))","v":""}]
[]
[null,"Hygroscopic Moisture, (%):"]
[]
[null,null,null,null,1,2,3,4]
[null,"Percent Water Content, (%):"]
[null,"Mass Material, (lb):"]
[null,"Mass Water Added, (lb):",null,null,{"$f":"IF(COUNTBLANK(E30:E31)=2,\"\",(E30/100)*E31)","v":""},{"$f":"IF(COUNTBLANK(F30:F31)=2,\"\",(F30/100)*F31)","v":""},{"$f":"IF(COUNTBLANK(G30:G31)=2,\"\",(G30/100)*G31)","v":""},{"$f":"IF(COUNTBLANK(H30:H31)=2,\"\",(H30/100)*H31)","v":""}]
[null,"Wet Mass Specimen & Mold, (lb):"]
[null,"Tare Mass Mold, (lb):"]
[null,"Wet Mass Specimen, (lb):",null,null,{"$f":"IF(COUNTBLANK(E33:E34)=2,\"\",E33-E34)","v":""},{"$f":"IF(COUNTBLANK(F33:F34)=2,\"\",F33-F34)","v":""},{"$f":"IF(COUNTBLANK(G33:G34)=2,\"\",G33-G34)","v":""},{"$f":"IF(COUNTBLANK(H33:H34)=2,\"\",H33-H34)","v":""}]
[null,"Height of Specimen, (in.):"]
[null,"Volume per Linear mm., (in.):"]
[null,"Volume of Specimen, (ft^3):",null,null,{"$f":"IF(COUNTBLANK(E36:E37)=2,\"\",E37*E36)","v":""},{"$f":"IF(COUNTBLANK(F36:F37)=2,\"\",F37*F36)","v":""},{"$f":"IF(COUNTBLANK(G36:G37)=2,\"\",G37*G36)","v":""},{"$f":"IF(COUNTBLANK(H36:H37)=2,\"\",H37*H36)","v":""}]
[null,"Wet Density of Specimen, (g):",null,null,{"$f":"IF(ISERROR(E35/E38),\"\",E35/E38)","v":""},{"$f":"IF(ISERROR(F35/F38),\"\",F35/F38)","v":""},{"$f":"IF(ISERROR(G35/G38),\"\",G35/G38)","v":""},{"$f":"IF(ISERROR(H35/H38),\"\",H35/H38)","v":""}]
[null,"Wet Mass of Pan & Specimen, (g):"]
{"$rows_left_out":26}
{"sheet":"RX","index":1,"n_rows":88,"n_cols":9,"rows_kept":88,"cut":false,"hidden":true,"merged":[]}
[{"$f":"COUNTA(A3:A200)","v":86}]
["Fld_nbr","Value","Desc_1","Desc_2","Desc_3","Desc_4","Desc_5","Desc_6","Desc_7"]
[1,{"$f":"IF('Tex-113-E'!$B$53=\"\",\"\",'Tex-113-E'!$B$53)","v":""},{"$f":"'Tex-113-E'!$B$52","v":"Remarks:"}]
[2,{"$f":"IF('Tex-113-E'!$D$19=\"\",\"\",'Tex-113-E'!$D$19)","v":""},{"$f":"IF('Tex-113-E'!$C$19=\"\",\"\",'Tex-113-E'!$C$19)","v":"COURSE\\LIFT:"}]
[3,{"$f":"IF('Tex-113-E'!$C$60=\"\",\"\",'Tex-113-E'!$C$60)","v":""},"Tested By ",{"$f":"IF('Tex-113-E'!$B$60=\"\",\"\",'Tex-113-E'!$B$60)","v":"TX113"}]
[4,{"$f":"IF('Tex-113-E'!$F$60=\"\",\"\",'Tex-113-E'!$F$60)","v":""},"Tested Date ",{"$f":"IF('Tex-113-E'!$B$60=\"\",\"\",'Tex-113-E'!$B$60)","v":"TX113"}]
[5,{"$f":"IF('Tex-113-E'!$E$22=\"\",\"\",'Tex-113-E'!$E$22)","v":""},{"$f":"IF('Tex-113-E'!$B$6=\"\",\"\",'Tex-113-E'!$B$6)","v":"TEX-113-E"},{"$f":"IF('Tex-113-E'!$B$22=\"\",\"\",'Tex-113-E'!$B$22)","v":"Oven Dry Weight, (g):"}]
[6,{"$f":"IF('Tex-113-E'!$E$23=\"\",\"\",'Tex-113-E'!$E$23)","v":""},{"$f":"IF('Tex-113-E'!$B$6=\"\",\"\",'Tex-113-E'!$B$6)","v":"TEX-113-E"},{"$f":"IF('Tex-113-E'!$B$23=\"\",\"\",'Tex-113-E'!$B$23)","v":"Weight of Pycnometer & Water, (g):"}]
[7,{"$f":"IF('Tex-113-E'!$E$24=\"\",\"\",'Tex-113-E'!$E$24)","v":""},{"$f":"IF('Tex-113-E'!$B$6=\"\",\"\",'Tex-113-E'!$B$6)","v":"TEX-113-E"},{"$f":"IF('Tex-113-E'!$B$24=\"\",\"\",'Tex-113-E'!$B$24)","v":"Weight of Aggr., Pycn.& Water, (g):"}]
[8,{"$f":"IF('Tex-113-E'!$E$25=\"\",\"\",'Tex-113-E'!$E$25)","v":""},{"$f":"IF('Tex-113-E'!$B$6=\"\",\"\",'Tex-113-E'!$B$6)","v":"TEX-113-E"},{"$f":"IF('Tex-113-E'!$B$25=\"\",\"\",'Tex-113-E'!$B$25)","v":"Specific Gravity (Apparent):"}]
[9,{"$f":"IF('Tex-113-E'!$E$27=\"\",\"\",'Tex-113-E'!$E$27)","v":""},{"$f":"IF('Tex-113-E'!$B$6=\"\",\"\",'Tex-113-E'!$B$6)","v":"TEX-113-E"},{"$f":"IF('Tex-113-E'!$B$27=\"\",\"\",'Tex-113-E'!$B$27)","v":"Hygroscopic Moisture, (%):"}]
[10,{"$f":"IF('Tex-113-E'!$E$30=\"\",\"\",'Tex-113-E'!$E$30)","v":""},{"$f":"IF('Tex-113-E'!$B$6=\"\",\"\",'Tex-113-E'!$B$6)","v":"TEX-113-E"},{"$f":"IF('Tex-113-E'!$B$30=\"\",\"\",'Tex-113-E'!$B$30)","v":"Percent Water Content, (%):"},{"$f":"IF('Tex-113-E'!$E$29=\"\",\"\",'Tex-113-E'!$E$29)","v":1}]
[11,{"$f":"IF('Tex-113-E'!$F$30=\"\",\"\",'Tex-113-E'!$F$30)","v":""},{"$f":"IF('Tex-113-E'!$B$6=\"\",\"\",'Tex-113-E'!$B$6)","v":"TEX-113-E"},{"$f":"IF('Tex-113-E'!$B$30=\"\",\"\",'Tex-113-E'!$B$30)","v":"Percent Water Content, (%):"},{"$f":"IF('Tex-113-E'!$F$29=\"\",\"\",'Tex-113-E'!$F$29)","v":2}]
[12,{"$f":"IF('Tex-113-E'!$G$30=\"\",\"\",'Tex-113-E'!$G$30)","v":""},{"$f":"IF('Tex-113-E'!$B$6=\"\",\"\",'Tex-113-E'!$B$6)","v":"TEX-113-E"},{"$f":"IF('Tex-113-E'!$B$30=\"\",\"\",'Tex-113-E'!$B$30)","v":"Percent Water Content, (%):"},{"$f":"IF('Tex-113-E'!$G$29=\"\",\"\",'Tex-113-E'!$G$29)","v":3}]
[13,{"$f":"IF('Tex-113-E'!$H$30=\"\",\"\",'Tex-113-E'!$H$30)","v":""},{"$f":"IF('Tex-113-E'!$B$6=\"\",\"\",'Tex-113-E'!$B$6)","v":"TEX-113-E"},{"$f":"IF('Tex-113-E'!$B$30=\"\",\"\",'Tex-113-E'!$B$30)","v":"Percent Water Content, (%):"},{"$f":"IF('Tex-113-E'!$H$29=\"\",\"\",'Tex-113-E'!$H$29)","v":4}]
[14,{"$f":"IF('Tex-113-E'!$E$31=\"\",\"\",'Tex-113-E'!$E$31)","v":""},{"$f":"IF('Tex-113-E'!$B$6=\"\",\"\",'Tex-113-E'!$B$6)","v":"TEX-113-E"},{"$f":"IF('Tex-113-E'!$B$31=\"\",\"\",'Tex-113-E'!$B$31)","v":"Mass Material, (lb):"},{"$f":"IF('Tex-113-E'!$E$29=\"\",\"\",'Tex-113-E'!$E$29)","v":1}]
[15,{"$f":"IF('Tex-113-E'!$F$31=\"\",\"\",'Tex-113-E'!$F$31)","v":""},{"$f":"IF('Tex-113-E'!$B$6=\"\",\"\",'Tex-113-E'!$B$6)","v":"TEX-113-E"},{"$f":"IF('Tex-113-E'!$B$31=\"\",\"\",'Tex-113-E'!$B$31)","v":"Mass Material, (lb):"},{"$f":"IF('Tex-113-E'!$F$29=\"\",\"\",'Tex-113-E'!$F$29)","v":2}]
[16,{"$f":"IF('Tex-113-E'!$G$31=\"\",\"\",'Tex-113-E'!$G$31)","v":""},{"$f":"IF('Tex-113-E'!$B$6=\"\",\"\",'Tex-113-E'!$B$6)","v":"TEX-113-E"},{"$f":"IF('Tex-113-E'!$B$31=\"\",\"\",'Tex-113-E'!$B$31)","v":"Mass Material, (lb):"},{"$f":"IF('Tex-113-E'!$G$29=\"\",\"\",'Tex-113-E'!$G$29)","v":3}]
[17,{"$f":"IF('Tex-113-E'!$H$31=\"\",\"\",'Tex-113-E'!$H$31)","v":""},{"$f":"IF('Tex-113-E'!$B$6=\"\",\"\",'Tex-113-E'!$B$6)","v":"TEX-113-E"},{"$f":"IF('Tex-113-E'!$B$31=\"\",\"\",'Tex-113-E'!$B$31)","v":"Mass Material, (lb):"},{"$f":"IF('Tex-113-E'!$H$29=\"\",\"\",'Tex-113-E'!$H$29)","v":4}]
[18,{"$f":"IF('Tex-113-E'!$E$32=\"\",\"\",'Tex-113-E'!$E$32)","v":""},{"$f":"IF('Tex-113-E'!$B$6=\"\",\"\",'Tex-113-E'!$B$6)","v":"TEX-113-E"},{"$f":"IF('Tex-113-E'!$B$32=\"\",\"\",'Tex-113-E'!$B$32)","v":"Mass Water Added, (lb):"},{"$f":"IF('Tex-113-E'!$E$29=\"\",\"\",'Tex-113-E'!$E$29)","v":1}]
[19,{"$f":"IF('Tex-113-E'!$F$32=\"\",\"\",'Tex-113-E'!$F$32)","v":""},{"$f":"IF('Tex-113-E'!$B$6=\"\",\"\",'Tex-113-E'!$B$6)","v":"TEX-113-E"},{"$f":"IF('Tex-113-E'!$B$32=\"\",\"\",'Tex-113-E'!$B$32)","v":"Mass Water Added, (lb):"},{"$f":"IF('Tex-113-E'!$F$29=\"\",\"\",'Tex-113-E'!$F$29)","v":2}]
[20,{"$f":"IF('Tex-113-E'!$G$32=\"\",\"\",'Tex-113-E'!$G$32)","v":""},{"$f":"IF('Tex-113-E'!$B$6=\"\",\"\",'Tex-113-E'!$B$6)","v":"TEX-113-E"},{"$f":"IF('Tex-113-E'!$B$32=\"\",\"\",'Tex-113-E'!$B$32)","v":"Mass Water Added, (lb):"},{"$f":"IF('Tex-113-E'!$G$29=\"\",\"\",'Tex-113-E'!$G$29)","v":3}]
[21,{"$f":"IF('Tex-113-E'!$H$32=\"\",\"\",'Tex-113-E'!$H$32)","v":""},{"$f":"IF('Tex-113-E'!$B$6=\"\",\"\",'Tex-113-E'!$B$6)","v":"TEX-113-E"},{"$f":"IF('Tex-113-E'!$B$32=\"\",\"\",'Tex-113-E'!$B$32)","v":"Mass Water Added, (lb):"},{"$f":"IF('Tex-113-E'!$H$29=\"\",\"\",'Tex-113-E'!$H$29)","v":4}]
[22,{"$f":"IF('Tex-113-E'!$E$33=\"\",\"\",'Tex-113-E'!$E$33)","v":""},{"$f":"IF('Tex-113-E'!$B$6=\"\",\"\",'Tex-113-E'!$B$6)","v":"TEX-113-E"},{"$f":"IF('Tex-113-E'!$B$33=\"\",\"\",'Tex-113-E'!$B$33)","v":"Wet Mass Specimen & Mold, (lb):"},{"$f":"IF('Tex-113-E'!$E$29=\"\",\"\",'Tex-113-E'!$E$29)","v":1}]
[23,{"$f":"IF('Tex-113-E'!$F$33=\"\",\"\",'Tex-113-E'!$F$33)","v":""},{"$f":"IF('Tex-113-E'!$B$6=\"\",\"\",'Tex-113-E'!$B$6)","v":"TEX-113-E"},{"$f":"IF('Tex-113-E'!$B$33=\"\",\"\",'Tex-113-E'!$B$33)","v":"Wet Mass Specimen & Mold, (lb):"},{"$f":"IF('Tex-113-E'!$F$29=\"\",\"\",'Tex-113-E'!$F$29)","v":2}]
[24,{"$f":"IF('Tex-113-E'!$G$33=\"\",\"\",'Tex-113-E'!$G$33)","v":""},{"$f":"IF('Tex-113-E'!$B$6=\"\",\"\",'Tex-113-E'!$B$6)","v":"TEX-113-E"},{"$f":"IF('Tex-113-E'!$B$33=\"\",\"\",'Tex-113-E'!$B$33)","v":"Wet Mass Specimen & Mold, (lb):"},{"$f":"IF('Tex-113-E'!$G$29=\"\",\"\",'Tex-113-E'!$G$29)","v":3}]
[25,{"$f":"IF('Tex-113-E'!$H$33=\"\",\"\",'Tex-113-E'!$H$33)","v":""},{"$f":"IF('Tex-113-E'!$B$6=\"\",\"\",'Tex-113-E'!$B$6)","v":"TEX-113-E"},{"$f":"IF('Tex-113-E'!$B$33=\"\",\"\",'Tex-113-E'!$B$33)","v":"Wet Mass Specimen & Mold, (lb):"},{"$f":"IF('Tex-113-E'!$H$29=\"\",\"\",'Tex-113-E'!$H$29)","v":4}]
[26,{"$f":"IF('Tex-113-E'!$E$34=\"\",\"\",'Tex-113-E'!$E$34)","v":""},{"$f":"IF('Tex-113-E'!$B$6=\"\",\"\",'Tex-113-E'!$B$6)","v":"TEX-113-E"},{"$f":"IF('Tex-113-E'!$B$34=\"\",\"\",'Tex-113-E'!$B$34)","v":"Tare Mass Mold, (lb):"},{"$f":"IF('Tex-113-E'!$E$29=\"\",\"\",'Tex-113-E'!$E$29)","v":1}]
[27,{"$f":"IF('Tex-113-E'!$F$34=\"\",\"\",'Tex-113-E'!$F$34)","v":""},{"$f":"IF('Tex-113-E'!$B$6=\"\",\"\",'Tex-113-E'!$B$6)","v":"TEX-113-E"},{"$f":"IF('Tex-113-E'!$B$34=\"\",\"\",'Tex-113-E'!$B$34)","v":"Tare Mass Mold, (lb):"},{"$f":"IF('Tex-113-E'!$F$29=\"\",\"\",'Tex-113-E'!$F$29)","v":2}]
[28,{"$f":"IF('Tex-113-E'!$G$34=\"\",\"\",'Tex-113-E'!$G$34)","v":""},{"$f":"IF('Tex-113-E'!$B$6=\"\",\"\",'Tex-113-E'!$B$6)","v":"TEX-113-E"},{"$f":"IF('Tex-113-E'!$B$34=\"\",\"\",'Tex-113-E'!$B$34)","v":"Tare Mass Mold, (lb):"},{"$f":"IF('Tex-113-E'!$G$29=\"\",\"\",'Tex-113-E'!$G$29)","v":3}]
[29,{"$f":"IF('Tex-113-E'!$H$34=\"\",\"\",'Tex-113-E'!$H$34)","v":""},{"$f":"IF('Tex-113-E'!$B$6=\"\",\"\",'Tex-113-E'!$B$6)","v":"TEX-113-E"},{"$f":"IF('Tex-113-E'!$B$34=\"\",\"\",'Tex-113-E'!$B$34)","v":"Tare Mass Mold, (lb):"},{"$f":"IF('Tex-113-E'!$H$29=\"\",\"\",'Tex-113-E'!$H$29)","v":4}]
[30,{"$f":"IF('Tex-113-E'!$E$35=\"\",\"\",'Tex-113-E'!$E$35)","v":""},{"$f":"IF('Tex-113-E'!$B$6=\"\",\"\",'Tex-113-E'!$B$6)","v":"TEX-113-E"},{"$f":"IF('Tex-113-E'!$B$35=\"\",\"\",'Tex-113-E'!$B$35)","v":"Wet Mass Specimen, (lb):"},{"$f":"IF('Tex-113-E'!$E$29=\"\",\"\",'Tex-113-E'!$E$29)","v":1}]
[31,{"$f":"IF('Tex-113-E'!$F$35=\"\",\"\",'Tex-113-E'!$F$35)","v":""},{"$f":"IF('Tex-113-E'!$B$6=\"\",\"\",'Tex-113-E'!$B$6)","v":"TEX-113-E"},{"$f":"IF('Tex-113-E'!$B$35=\"\",\"\",'Tex-113-E'!$B$35)","v":"Wet Mass Specimen, (lb):"},{"$f":"IF('Tex-113-E'!$F$29=\"\",\"\",'Tex-113-E'!$F$29)","v":2}]
[32,{"$f":"IF('Tex-113-E'!$G$35=\"\",\"\",'Tex-113-E'!$G$35)","v":""},{"$f":"IF('Tex-113-E'!$B$6=\"\",\"\",'Tex-113-E'!$B$6)","v":"TEX-113-E"},{"$f":"IF('Tex-113-E'!$B$35=\"\",\"\",'Tex-113-E'!$B$35)","v":"Wet Mass Specimen, (lb):"},{"$f":"IF('Tex-113-E'!$G$29=\"\",\"\",'Tex-113-E'!$G$29)","v":3}]
[33,{"$f":"IF('Tex-113-E'!$H$35=\"\",\"\",'Tex-113-E'!$H$35)","v":""},{"$f":"IF('Tex-113-E'!$B$6=\"\",\"\",'Tex-113-E'!$B$6)","v":"TEX-113-E"},{"$f":"IF('Tex-113-E'!$B$35=\"\",\"\",'Tex-113-E'!$B$35)","v":"Wet Mass Specimen, (lb):"},{"$f":"IF('Tex-113-E'!$H$29=\"\",\"\",'Tex-113-E'!$H$29)","v":4}]
[34,{"$f":"IF('Tex-113-E'!$E$36=\"\",\"\",'Tex-113-E'!$E$36)","v":""},{"$f":"IF('Tex-113-E'!$B$6=\"\",\"\",'Tex-113-E'!$B$6)","v":"TEX-113-E"},{"$f":"IF('Tex-113-E'!$B$36=\"\",\"\",'Tex-113-E'!$B$36)","v":"Height of Specimen, (in.):"},{"$f":"IF('Tex-113-E'!$E$29=\"\",\"\",'Tex-113-E'!$E$29)","v":1}]
[35,{"$f":"IF('Tex-113-E'!$F$36=\"\",\"\",'Tex-113-E'!$F$36)","v":""},{"$f":"IF('Tex-113-E'!$B$6=\"\",\"\",'Tex-113-E'!$B$6)","v":"TEX-113-E"},{"$f":"IF('Tex-113-E'!$B$36=\"\",\"\",'Tex-113-E'!$B$36)","v":"Height of Specimen, (in.):"},{"$f":"IF('Tex-113-E'!$F$29=\"\",\"\",'Tex-113-E'!$F$29)","v":2}]
[36,{"$f":"IF('Tex-113-E'!$G$36=\"\",\"\",'Tex-113-E'!$G$36)","v":""},{"$f":"IF('Tex-113-E'!$B$6=\"\",\"\",'Tex-113-E'!$B$6)","v":"TEX-113-E"},{"$f":"IF('Tex-113-E'!$B$36=\"\",\"\",'Tex-113-E'!$B$36)","v":"Height of Specimen, (in.):"},{"$f":"IF('Tex-113-E'!$G$29=\"\",\"\",'Tex-113-E'!$G$29)","v":3}]
[37,{"$f":"IF('Tex-113-E'!$H$36=\"\",\"\",'Tex-113-E'!$H$36)","v":""},{"$f":"IF('Tex-113-E'!$B$6=\"\",\"\",'Tex-113-E'!$B$6)","v":"TEX-113-E"},{"$f":"IF('Tex-113-E'!$B$36=\"\",\"\",'Tex-113-E'!$B$36)","v":"Height of Specimen, (in.):"},{"$f":"IF('Tex-113-E'!$H$29=\"\",\"\",'Tex-113-E'!$H$29)","v":4}]
[38,{"$f":"IF('Tex-113-E'!$E$37=\"\",\"\",'Tex-113-E'!$E$37)","v":""},{"$f":"IF('Tex-113-E'!$B$6=\"\",\"\",'Tex-113-E'!$B$6)","v":"TEX-113-E"},{"$f":"IF('Tex-113-E'!$B$37=\"\",\"\",'Tex-113-E'!$B$37)","v":"Volume per Linear mm., (in.):"},{"$f":"IF('Tex-113-E'!$E$29=\"\",\"\",'Tex-113-E'!$E$29)","v":1}]
{"$rows_left_out":49}
{"sheet":"Reference","index":2,"n_rows":201,"n_cols":5,"rows_kept":201,"cut":false,"hidden":true,"merged":[]}
["m1",{"$f":"(B12-B11)/(C12-C11)","v":{"$error":"#VALUE!"}}]
["b1",{"$f":"B11-B1*C11","v":{"$error":"#VALUE!"}},"X-Peak",{"$f":"(B4-B2)/(B1-B3)","v":{"$error":"#VALUE!"}}]
["m2",{"$f":"IF(AND(B13>0,N('Tex-113-E'!H44)=0),B1*-1,(B14-B13)/(C14-C13))","v":{"$error":"#VALUE!"}},"Y-Peak",{"$f":"B1*D2+B2","v":{"$error":"#VALUE!"}}]
["b2",{"$f":"B13-C13*B3","v":{"$error":"#VALUE!"}}]
[]
[]
[]
[]
[]
["N","Y","X","X^2"]
[1,{"$f":"'Tex-113-E'!E46","v":""},{"$f":"'Tex-113-E'!E45","v":""},{"$f":"C11^2","v":{"$error":"#VALUE!"}}]
[2,{"$f":"'Tex-113-E'!F46","v":""},{"$f":"'Tex-113-E'!F45","v":""},{"$error":"#VALUE!"}]
[3,{"$f":"'Tex-113-E'!G46","v":""},{"$f":"'Tex-113-E'!G45","v":""},{"$error":"#VALUE!"}]
[4,{"$f":"IF(AND(B13>0,N('Tex-113-E'!H44)=0),D3,'Tex-113-E'!H46)","v":{"$error":"#VALUE!"}},{"$f":"IF(AND(C13>0,N('Tex-113-E'!H44)=0),D2,'Tex-113-E'!H45)","v":{"$error":"#VALUE!"}},{"$error":"#VALUE!"}]
[5,{"$f":"D3","v":{"$error":"#VALUE!"}},{"$f":"$D$2","v":{"$error":"#VALUE!"}},{"$error":"#VALUE!"}]
[6,{"$f":"D3","v":{"$error":"#VALUE!"}},{"$f":"$D$2","v":{"$error":"#VALUE!"}},{"$error":"#VALUE!"}]
[7,{"$f":"D3","v":{"$error":"#VALUE!"}},{"$f":"$D$2","v":{"$error":"#VALUE!"}},{"$error":"#VALUE!"}]
[8,{"$f":"D3","v":{"$error":"#VALUE!"}},{"$f":"D2","v":{"$error":"#VALUE!"}},{"$error":"#VALUE!"}]
["SUM",{"$f":"SUM(B13:B17)","v":{"$error":"#VALUE!"}},{"$f":"SUM(C13:C17)","v":{"$error":"#VALUE!"}},{"$f":"SUM(D11:D17)","v":{"$error":"#VALUE!"}}]
[]
[]
["MAX DEN",{"$f":"B27*B23^2+B26*B23+B25","v":{"$error":"#VALUE!"}}]
["MAX  W",{"$f":"-B26/(2*B27)","v":{"$error":"#VALUE!"}}]
[]
["Ao",{"$f":"INDEX(LINEST($B$11:$B$14,$C$11:$D$14),3)","v":{"$error":"#VALUE!"}}]
["A1",{"$f":"INDEX(LINEST($B$11:$B$14,$C$11:$D$14),2)","v":{"$error":"#VALUE!"}},null,"SG",{"$f":"IF(AND('Tex-113-E'!E24>0,'Tex-113-E'!E23>0),'Tex-113-E'!E25,\"\")","v":""}]
["A2",{"$f":"INDEX(LINEST($B$11:$B$14,$C$11:$D$14),1)","v":{"$error":"#VALUE!"}}]
[]
["W","Dry Density","ZAV"]
[{"$f":"IF('Tex-113-E'!H30>0,'Tex-113-E'!H30+8,'Tex-113-E'!G30+8)","v":8},{"$f":"$B$25+$B$26*A30+$B$27*A30^2","v":{"$error":"#VALUE!"}},{"$f":"($E$26*62.4)/(1+(A30/100)*$E$26)","v":{"$error":"#VALUE!"}}]
[{"$f":"A30-0.1","v":7.9},{"$error":"#VALUE!"},{"$error":"#VALUE!"}]
[7.8,{"$error":"#VALUE!"},{"$error":"#VALUE!"}]
[7.7,{"$error":"#VALUE!"},{"$error":"#VALUE!"}]
[7.6,{"$error":"#VALUE!"},{"$error":"#VALUE!"}]
[7.5,{"$error":"#VALUE!"},{"$error":"#VALUE!"}]
[7.4,{"$error":"#VALUE!"},{"$error":"#VALUE!"}]
[7.3,{"$error":"#VALUE!"},{"$error":"#VALUE!"}]
[7.2,{"$error":"#VALUE!"},{"$error":"#VALUE!"}]
[7.1,{"$error":"#VALUE!"},{"$error":"#VALUE!"}]
[7,{"$error":"#VALUE!"},{"$error":"#VALUE!"}]
{"$rows_left_out":161}