{"text_format":"1","workbook":"xlsx","n_sheets":22,"sheets":["Compressive Strength","Tex-113,4-E","Optimum Moisture","RX","Log","Reference","Reference (2)","Reference (3)","Reference (4)","Reference (5)","Set 1(a)","Set 1(b)","Set 1(c)","Set 2(a)","Set 2(b)","Set 2(c)","Set 3(a)","Set 3(b)","Set 3(c)","Set 4(a)","Set 4(b)","Set 4(c)"],"not_rendered":{"charts":2,"images":1,"macros":1,"external_links":0,"defined_names":764,"comments":3,"pivot_tables":0},"unopened":[],"bounds":{"document_bytes":16777216,"sheet_cells":100000,"rows_first":2000,"rows_last":500,"rows_between":2000,"halvings":0,"cell_chars":16384,"cell_head_chars":4096},"cells_cut":0,"cells_raw":0,"read":"whole","date_system":"1900"}

{"sheet":"Compressive Strength","index":0,"n_rows":79,"n_cols":19,"rows_kept":79,"cut":false,"hidden":false,"merged":[[78,1,78,6],[78,7,78,8],[32,1,32,5],[26,1,26,5],[74,1,74,6],[74,7,74,8],[74,9,74,10],[74,11,74,16],[76,1,76,2],[76,3,76,4],[76,5,76,6],[76,7,76,8],[28,1,28,5],[47,1,47,5],[51,1,51,5],[49,1,49,5],[50,1,50,5],[38,1,38,5],[39,1,39,5],[40,1,40,5],[42,1,42,5],[44,1,44,5],[48,1,48,5],[41,1,41,5],[7,1,7,4],[7,13,7,16],[8,13,8,16],[9,13,9,16],[7,9,7,12],[11,13,11,16],[12,13,12,16],[10,13,10,16],[18,11,18,14],[8,1,8,4],[9,1,9,4],[10,1,10,4],[9,5,9,8],[10,5,10,8],[11,1,11,4],[11,5,11,8],[8,5,8,8],[16,9,16,12],[11,9,11,12],[13,5,13,8],[43,1,43,5],[45,1,45,5],[46,1,46,5],[27,1,27,5],[30,1,30,5],[31,1,31,5],[24,1,24,5],[13,9,13,12],[12,9,12,12],[37,1,37,5],[12,1,12,4],[13,1,13,4],[12,5,12,8],[22,1,22,17],[24,12,24,14],[18,15,18,16],[18,7,18,8],[20,5,20,6],[23,12,23,14],[23,15,23,17],[13,13,13,16],[23,9,23,11],[23,6,23,8],[24,15,24,17],[29,1,29,5],[35,1,35,5],[36,1,36,5],[0,0,0,2],[33,1,33,5],[34,1,34,5],[14,1,14,4],[14,5,14,16],[18,9,18,10],[20,1,20,4],[25,1,25,5],[18,1,18,4],[18,5,18,6],[24,6,24,8],[24,9,24,11],[7,5,7,8],[15,5,15,16],[16,13,16,16],[8,9,8,12],[9,9,9,12],[10,9,10,12],[15,1,15,4],[16,1,16,4],[16,5,16,8],[66,1,66,16],[54,1,54,5],[55,1,55,5],[57,6,57,7],[59,6,59,7],[59,1,59,5],[57,1,57,5],[65,1,65,16],[72,3,72,8],[72,1,72,2],[70,1,70,2],[70,3,70,8],[70,9,70,10],[67,3,67,5],[72,9,72,10],[63,1,64,16],[68,1,68,2],[68,3,68,8],[68,9,68,10]]}
["TxDOT Manuals >",null,null,null,"Tex-120-E"]
[null,"TEXAS DEPARTMENT OF TRANSPORTATION",null,null,null,null,null,null,null,null,null,null,null,null,null,null,null,null,524]
[null,null,null,null,null,null,null,null,null,null,null,null,null,null,null,null,null,null,3]
[null,null,null,null,null,null,null,null,null,null,null,null,null,null,null,null,null,null,"tx120.xlsm::45505.66456"]
[null,"SOIL-CEMENT TESTING"]
[null,"Tex-120-E : PART I"]
[null,null,null,null,null,null,null,null,null,null,null,null,null,null,null,null,{"$f":"\"File Version: \" & TEXT(MID(sn,SEARCH(\"::\",sn,1)+2,20),\"mm/dd/yy hh:mm:ss\")","v":"File Version: 08/01/24 15:56:58"}]
[null,"SAMPLE ID:",null,null,null,null,null,null,null,"SAMPLED DATE:"]
[null,"TEST NUMBER:",null,null,null,null,null,null,null,"LETTING DATE:"]
[null,"SAMPLE STATUS:",null,null,null,null,null,null,null,"CONTROLLING CSJ:"]
[null,"COUNTY:",null,null,null,null,null,null,null,"SPEC YEAR:"]
[null,"SAMPLED BY:",null,null,null,null,null,null,null,"SPEC ITEM:"]
[null,"SAMPLE LOCATION:",null,null,null,null,null,null,null,"SPECIAL PROVISION:"]
[null,"MATERIAL CODE:",null,null,null,null,null,null,null,"GRADE:"]
[null,"MATERIAL NAME:"]
{"$rows_left_out":65}
{"sheet":"Tex-113,4-E","index":1,"n_rows":60,"n_cols":11,"rows_kept":60,"cut":false,"hidden":false,"merged":[[38,1,38,3],[29,1,29,3],[21,1,21,3],[22,1,22,3],[23,1,23,3],[24,1,24,3],[26,1,26,3],[20,1,20,3],[31,1,31,3],[0,0,0,1],[13,3,13,4],[30,1,30,3],[14,3,14,8],[7,7,7,8],[7,3,7,4],[10,3,10,4],[9,7,9,8],[15,3,15,8],[13,7,13,8],[9,3,9,4],[8,7,8,8],[8,3,8,4],[10,7,10,8],[39,1,39,3],[41,1,41,3],[32,1,32,3],[34,1,34,3],[56,2,56,4],[42,1,42,3],[51,1,51,3],[48,1,48,3],[54,1,55,8],[43,1,43,3],[49,1,49,3],[40,1,40,3],[35,1,35,3],[36,1,36,3],[33,1,33,3],[37,1,37,3],[12,3,12,4],[11,7,11,8],[11,3,11,4],[16,7,16,8],[16,3,16,4],[12,7,12,8],[47,1,47,3],[44,1,44,3],[45,1,45,3],[46,1,46,3],[59,2,59,4],[50,1,50,3],[57,2,57,4]]}
["TxDOT Manuals >",null,null,"Tex-113-E"]
[null,"TEXAS DEPARTMENT OF TRANSPORTATION",null,null,null,null,null,null,null,null,49]
[null,{"$f":"IF(Location=\"\",\"\",Location)","v":""},null,null,null,null,null,null,null,null,1]
[null,"Soil-Cement Testing: Tex-120-E, Part II",null,null,null,null,null,null,null,"Tx113,4.xls::37445.433542","Tx113.xls::37092.636285"]
[null,"Moisture-Density Relations of Base Material & Sand or Subgrade & Embankment Soils",null,null,null,null,null,null,null,44]
[null,"TEX-113-E or Tex-114-E"]
[null,null,null,null,null,null,null,null,{"$f":"\"Tx113,4 File Version: \" & TEXT(MID(_sn113,SEARCH(\"::\",_sn113,1)+2,20),\"mm/dd/yy hh:mm:ss\")","v":"Tx113,4 File Version: 07/08/02 10:24:18"}]
[null,null,"SAMPLE ID:",{"$f":"IF(SampleId=\"\",\"\",SampleId)","v":""},null,null,"SAMPLED DATE:",{"$f":"IF(SampledDate=\"\",\"\",SampledDate)","v":""}]
[null,null,"TEST NUMBER:",{"$f":"IF(TestNumber=\"\",\"\",TestNumber)","v":""},null,null,"LETTING DATE:",{"$f":"IF(LettingDate=\"\",\"\",LettingDate)","v":""}]
[null,null,"SAMPLE STATUS:",{"$f":"IF(Status=\"\",\"\",Status)","v":""},null,null,"CONTROLLING CSJ:",{"$f":"IF(CCSJ=\"\",\"\",CCSJ)","v":""}]
[null,null,"COUNTY:",{"$f":"IF(County=\"\",\"\",County)","v":""},null,null,"SPEC YEAR:",{"$f":"IF(SpecYear=\"\",\"\",SpecYear)","v":""}]
[null,null,"SAMPLED BY:",{"$f":"IF(SampledBy=\"\",\"\",SampledBy)","v":""},null,null,"SPEC ITEM:",{"$f":"IF(SpecItem=\"\",\"\",SpecItem)","v":""}]
[null,null,"SAMPLE LOCATION:",{"$f":"IF(SampleLocation=\"\",\"\",SampleLocation)","v":""},null,null,"SPECIAL PROVISION:",{"$f":"IF(SpecialProvision=\"\",\"\",SpecialProvision)","v":""}]
[null,null,"MATERIAL CODE:",{"$f":"IF(Material=\"\",\"\",Material)","v":""},null,null,"GRADE:",{"$f":"IF(Grade=\"\",\"\",Grade)","v":""}]
[null,null,"MATERIAL NAME:",{"$f":"IF(matl_nm=\"\",\"\",matl_nm)","v":""}]
{"$rows_left_out":46}
{"sheet":"Optimum Moisture","index":2,"n_rows":57,"n_cols":19,"rows_kept":57,"cut":false,"hidden":false,"merged":[[25,15,25,17],[41,1,41,5],[42,1,42,5],[43,1,43,5],[25,6,25,8],[25,9,25,11],[40,1,40,5],[26,9,26,11],[35,1,35,5],[36,1,36,5],[37,1,37,5],[38,1,38,5],[39,1,39,5],[26,15,26,17],[32,1,32,5],[33,1,33,5],[50,1,50,5],[44,1,44,5],[45,1,45,5],[46,1,46,5],[48,1,48,5],[49,1,49,5],[34,1,34,5],[26,6,26,8],[30,1,30,5],[31,1,31,5],[28,1,28,5],[26,1,26,5],[27,1,27,5],[11,13,11,16],[11,5,11,8],[26,12,26,14],[29,1,29,5],[16,9,16,12],[18,11,18,14],[18,15,18,16],[18,1,18,4],[18,5,18,6],[18,7,18,8],[18,9,18,10],[16,1,16,4],[16,5,16,8],[22,1,22,5],[23,1,23,5],[25,12,25,14],[13,1,13,4],[15,5,15,16],[15,1,15,4],[12,5,12,8],[13,5,13,8],[14,1,14,4],[14,5,14,16],[13,9,13,12],[13,13,13,16],[12,13,12,16],[9,1,9,4],[10,1,10,4],[10,5,10,8],[11,1,11,4],[12,1,12,4],[8,13,8,16],[7,13,7,16],[7,9,7,12],[7,1,7,4],[8,1,8,4],[10,13,10,16],[11,9,11,12],[0,0,0,2],[56,1,56,2],[56,3,56,8],[56,9,56,10],[12,9,12,12],[8,9,8,12],[9,9,9,12],[10,9,10,12],[53,1,54,16],[16,13,16,16],[9,13,9,16],[7,5,7,8],[8,5,8,8],[9,5,9,8]]}
["TxDOT Manuals >",null,null,null,"Tex-120-E"]
[null,"TEXAS DEPARTMENT OF TRANSPORTATION",null,null,null,null,null,null,null,null,null,null,null,null,null,null,null,null,242]
[null,null,null,null,null,null,null,null,null,null,null,null,null,null,null,null,null,null,1]
[null,null,null,null,null,null,null,null,null,null,null,null,null,null,null,null,null,null,"Tx120.xls::37103.638102"]
[null,"OPTIMUM MOISTURE TESTS"]
[null,"Tex-120-E : PART II"]
[]
[null,"SAMPLE ID:",null,null,null,{"$f":"IF(SampleId=\"\",\"\",SampleId)","v":""},null,null,null,"SAMPLED DATE:",null,null,null,{"$f":"IF(SampledDate=\"\",\"\",SampledDate)","v":""}]
[null,"TEST NUMBER:",null,null,null,{"$f":"IF(TestNumber=\"\",\"\",TestNumber)","v":""},null,null,null,"LETTING DATE:",null,null,null,{"$f":"IF(LettingDate=\"\",\"\",LettingDate)","v":""}]
[null,"SAMPLE STATUS:",null,null,null,{"$f":"IF(Status=\"\",\"\",Status)","v":""},null,null,null,"CONTROLLING CSJ:",null,null,null,{"$f":"IF(CCSJ=\"\",\"\",CCSJ )","v":""}]
[null,"COUNTY:",null,null,null,{"$f":"IF(County=\"\",\"\",County)","v":""},null,null,null,"SPEC YEAR:",null,null,null,{"$f":"IF(SpecYear=\"\",\"\",SpecYear)","v":""}]
[null,"SAMPLED BY:",null,null,null,{"$f":"IF(SampledBy=\"\",\"\",SampledBy)","v":""},null,null,null,"SPEC ITEM:",null,null,null,{"$f":"IF(SpecItem=\"\",\"\",SpecItem)","v":""}]
[null,"SAMPLE LOCATION:",null,null,null,{"$f":"IF(SampleLocation=\"\",\"\",SampleLocation)","v":""},null,null,null,"SPECIAL PROVISION:",null,null,null,{"$f":"IF(SpecialProvision=\"\",\"\",SpecialProvision)","v":""}]
[null,"MATERIAL CODE:",null,null,null,{"$f":"IF(Material=\"\",\"\",Material)","v":""},null,null,null,"GRADE:",null,null,null,{"$f":"IF(Grade=\"\",\"\",Grade)","v":""}]
[null,"MATERIAL NAME:",null,null,null,{"$f":"IF(matl_nm=\"\",\"\",matl_nm)","v":""}]
{"$rows_left_out":43}
{"sheet":"RX","index":3,"n_rows":658,"n_cols":9,"rows_kept":658,"cut":false,"hidden":true,"merged":[]}
[656]
["Fld_nbr","Value","Desc_1","Desc_2","Desc_3","Desc_4","Desc_5","Desc_6","Desc_7"]
[1,{"$f":"IF('Compressive Strength'!$B$64=\"\",\"\",'Compressive Strength'!$B$64)","v":""},{"$f":"'Compressive Strength'!$B$63","v":"Remarks:"}]
[2,{"$f":"IF('Compressive Strength'!$F$19=\"\",\"\",'Compressive Strength'!$F$19)","v":""},{"$f":"IF('Compressive Strength'!$B$19=\"\",\"\",'Compressive Strength'!$B$19)","v":"COURSE\\LIFT:"}]
[3,{"$f":"IF('Compressive Strength'!$D$73=\"\",\"\",'Compressive Strength'!$D$73)","v":""},"Tested By ",{"$f":"IF('Compressive Strength'!$B$73=\"\",\"\",'Compressive Strength'!$B$73)","v":"TX120"}]
[4,{"$f":"IF('Compressive Strength'!$J$73=\"\",\"\",'Compressive Strength'!$J$73)","v":""},"Tested Date ",{"$f":"IF('Compressive Strength'!$B$73=\"\",\"\",'Compressive Strength'!$B$73)","v":"TX120"}]
[5,{"$f":"IF('Optimum Moisture'!$D$57=\"\",\"\",'Optimum Moisture'!$D$57)","v":""},"Tested By ",{"$f":"IF('Optimum Moisture'!$B$57=\"\",\"\",'Optimum Moisture'!$B$57)","v":"TX120"}]
[6,{"$f":"IF('Optimum Moisture'!$J$57=\"\",\"\",'Optimum Moisture'!$J$57)","v":""},"Tested Date ",{"$f":"IF('Optimum Moisture'!$B$57=\"\",\"\",'Optimum Moisture'!$B$57)","v":"TX120"}]
[7,{"$f":"IF('Tex-113,4-E'!$C$58=\"\",\"\",'Tex-113,4-E'!$C$58)","v":""},"Tested By ",{"$f":"IF('Tex-113,4-E'!$B$58=\"\",\"\",'Tex-113,4-E'!$B$58)","v":"TX113"}]
[8,{"$f":"IF('Tex-113,4-E'!$F$58=\"\",\"\",'Tex-113,4-E'!$F$58)","v":""},"Tested Date ",{"$f":"IF('Tex-113,4-E'!$B$58=\"\",\"\",'Tex-113,4-E'!$B$58)","v":"TX113"}]
[9,{"$f":"IF('Tex-113,4-E'!$C$60=\"\",\"\",'Tex-113,4-E'!$C$60)","v":""},"Tested By ",{"$f":"IF('Tex-113,4-E'!$B$60=\"\",\"\",'Tex-113,4-E'!$B$60)","v":"Tx114"}]
[10,{"$f":"IF('Tex-113,4-E'!$F$60=\"\",\"\",'Tex-113,4-E'!$F$60)","v":""},"Tested Date ",{"$f":"IF('Tex-113,4-E'!$B$60=\"\",\"\",'Tex-113,4-E'!$B$60)","v":"Tx114"}]
[11,{"$f":"IF('Compressive Strength'!$F$21=\"\",\"\",'Compressive Strength'!$F$21)","v":""},{"$f":"IF('Compressive Strength'!$B$6=\"\",\"\",'Compressive Strength'!$B$6)","v":"Tex-120-E : PART I"},{"$f":"IF('Compressive Strength'!$B$21=\"\",\"\",'Compressive Strength'!$B$21)","v":"Performed By Tex-120-E:"}]
[12,{"$f":"IF('Compressive Strength'!$G$25=\"\",\"\",'Compressive Strength'!$G$25)","v":""},{"$f":"IF('Compressive Strength'!$B$6=\"\",\"\",'Compressive Strength'!$B$6)","v":"Tex-120-E : PART I"},{"$f":"IF('Compressive Strength'!$B$25=\"\",\"\",'Compressive Strength'!$B$25)","v":"Percent Cement, (%)"},{"$f":"IF('Compressive Strength'!$G$24=\"\",\"\",'Compressive Strength'!$G$24)","v":1}]
[13,{"$f":"IF('Compressive Strength'!$J$25=\"\",\"\",'Compressive Strength'!$J$25)","v":""},{"$f":"IF('Compressive Strength'!$B$6=\"\",\"\",'Compressive Strength'!$B$6)","v":"Tex-120-E : PART I"},{"$f":"IF('Compressive Strength'!$B$25=\"\",\"\",'Compressive Strength'!$B$25)","v":"Percent Cement, (%)"},{"$f":"IF('Compressive Strength'!$J$24=\"\",\"\",'Compressive Strength'!$J$24)","v":2}]
{"$rows_left_out":644}
{"sheet":"Log","index":4,"n_rows":7,"n_cols":1,"rows_kept":7,"cut":false,"hidden":true,"merged":[]}
["*** Add Range Name \"Version\" Cell K68 =IF(AuthorizedDate<38257,\"1\",\"2\")"]
[]
[]
["*** New  =IF(G25=0,0,IF(AutoMan=\"automated\",(G41+G38)/IF(Version=\"1\",G32,G31),(((G43*G37)+G38)/G31)))"]
["*** Old   =IF(G25=0,0,IF(AutoMan=\"automated\",(G41+G38)/G31,(((G43*G37)+G38)/G31))"]
[]
["11/1/2010 changed the % cement to a tenth of a decimal on compressive strength sheet Row 25."]

{"sheet":"Reference","index":5,"n_rows":201,"n_cols":5,"rows_kept":201,"cut":false,"hidden":true,"merged":[]}
["m1",{"$f":"(B12-B11)/(C12-C11)","v":{"$error":"#VALUE!"}}]
["b1",{"$f":"B11-B1*C11","v":{"$error":"#VALUE!"}},"X-Peak",{"$f":"(B4-B2)/(B1-B3)","v":{"$error":"#VALUE!"}}]
["m2",{"$f":"IF(AND(B13>0,'Tex-113,4-E'!H46=0),B1*-1,(B14-B13)/(C14-C13))","v":{"$error":"#VALUE!"}},"Y-Peak",{"$f":"B1*D2+B2","v":{"$error":"#VALUE!"}}]
["b2",{"$f":"B13-C13*B3","v":{"$error":"#VALUE!"}}]
[]
[]
[]
[]
[]
["N","Y","X","X^2"]
[1,{"$f":"'Tex-113,4-E'!E48","v":""},{"$f":"'Tex-113,4-E'!E47","v":""},{"$f":"C11^2","v":{"$error":"#VALUE!"}}]
[2,{"$f":"'Tex-113,4-E'!F48","v":""},{"$f":"'Tex-113,4-E'!F47","v":""},{"$error":"#VALUE!"}]
[3,{"$f":"'Tex-113,4-E'!G48","v":""},{"$f":"'Tex-113,4-E'!G47","v":""},{"$error":"#VALUE!"}]
[4,{"$f":"IF(AND(B13>0,'Tex-113,4-E'!H46=0),D3,'Tex-113,4-E'!H48)","v":""},{"$f":"IF(AND(C13>0,'Tex-113,4-E'!H46=0),D2,'Tex-113,4-E'!H47)","v":""},{"$error":"#VALUE!"}]
[5,{"$f":"D3","v":{"$error":"#VALUE!"}},{"$f":"$D$2","v":{"$error":"#VALUE!"}},{"$error":"#VALUE!"}]
{"$rows_left_out":187}
{"sheet":"Reference (2)","index":6,"n_rows":201,"n_cols":5,"rows_kept":201,"cut":false,"hidden":true,"merged":[]}
["m1",{"$f":"(B12-B11)/(C12-C11)","v":{"$error":"#VALUE!"}}]
["b1",{"$f":"B11-B1*C11","v":{"$error":"#VALUE!"}},"X-Peak",{"$f":"(B4-B2)/(B1-B3)","v":{"$error":"#VALUE!"}}]
["m2",{"$f":"IF(B13>0,B1*-1,(B14-B13)/(C14-C13))","v":{"$error":"#VALUE!"}},"Y-Peak",{"$f":"B1*D2+B2","v":{"$error":"#VALUE!"}}]
["b2",{"$f":"B13-C13*B3","v":{"$error":"#VALUE!"}}]
[]
[]
[]
[]
[]
["N","Y","X","X^2"]
[1,{"$f":"'Optimum Moisture'!G46","v":""},{"$f":"'Optimum Moisture'!G45","v":""},{"$f":"C11^2","v":{"$error":"#VALUE!"}}]
[2,{"$f":"'Optimum Moisture'!H46","v":""},{"$f":"'Optimum Moisture'!H45","v":""},{"$error":"#VALUE!"}]
[3,{"$f":"'Optimum Moisture'!I46","v":""},{"$f":"'Optimum Moisture'!I45","v":""},{"$error":"#VALUE!"}]
[4,{"$f":"D3","v":{"$error":"#VALUE!"}},{"$f":"D2","v":{"$error":"#VALUE!"}},{"$error":"#VALUE!"}]
[5,{"$f":"D3","v":{"$error":"#VALUE!"}},{"$f":"$D$2","v":{"$error":"#VALUE!"}},{"$error":"#VALUE!"}]
{"$rows_left_out":187}
{"sheet":"Reference (3)","index":7,"n_rows":201,"n_cols":5,"rows_kept":201,"cut":false,"hidden":true,"merged":[]}
["m1",{"$f":"(B12-B11)/(C12-C11)","v":{"$error":"#VALUE!"}}]
["b1",{"$f":"B11-B1*C11","v":{"$error":"#VALUE!"}},"X-Peak",{"$f":"(B4-B2)/(B1-B3)","v":{"$error":"#VALUE!"}}]
["m2",{"$f":"IF(B13>0,B1*-1,(B14-B13)/(C14-C13))","v":{"$error":"#VALUE!"}},"Y-Peak",{"$f":"B1*D2+B2","v":{"$error":"#VALUE!"}}]
["b2",{"$f":"B13-C13*B3","v":{"$error":"#VALUE!"}}]
[]
[]
[]
[]
[]
["N","Y","X","X^2"]
[1,{"$f":"'Optimum Moisture'!J46","v":""},{"$f":"'Optimum Moisture'!J45","v":""},{"$f":"C11^2","v":{"$error":"#VALUE!"}}]
[2,{"$f":"'Optimum Moisture'!K46","v":""},{"$f":"'Optimum Moisture'!K45","v":""},{"$error":"#VALUE!"}]
[3,{"$f":"'Optimum Moisture'!L46","v":""},{"$f":"'Optimum Moisture'!L45","v":""},{"$error":"#VALUE!"}]
[4,{"$f":"D3","v":{"$error":"#VALUE!"}},{"$f":"D2","v":{"$error":"#VALUE!"}},{"$error":"#VALUE!"}]
[5,{"$f":"D3","v":{"$error":"#VALUE!"}},{"$f":"$D$2","v":{"$error":"#VALUE!"}},{"$error":"#VALUE!"}]
{"$rows_left_out":187}
{"sheet":"Reference (4)","index":8,"n_rows":201,"n_cols":5,"rows_kept":201,"cut":false,"hidden":true,"merged":[]}
["m1",{"$f":"(B12-B11)/(C12-C11)","v":{"$error":"#VALUE!"}}]
["b1",{"$f":"B11-B1*C11","v":{"$error":"#VALUE!"}},"X-Peak",{"$f":"(B4-B2)/(B1-B3)","v":{"$error":"#VALUE!"}}]
["m2",{"$f":"IF(B13>0,B1*-1,(B14-B13)/(C14-C13))","v":{"$error":"#VALUE!"}},"Y-Peak",{"$f":"B1*D2+B2","v":{"$error":"#VALUE!"}}]
["b2",{"$f":"B13-C13*B3","v":{"$error":"#VALUE!"}}]
[]
[]
[]
[]
[]
["N","Y","X","X^2"]
[1,{"$f":"'Optimum Moisture'!M46","v":""},{"$f":"'Optimum Moisture'!M45","v":""},{"$f":"C11^2","v":{"$error":"#VALUE!"}}]
[2,{"$f":"'Optimum Moisture'!N46","v":""},{"$f":"'Optimum Moisture'!N45","v":""},{"$error":"#VALUE!"}]
[3,{"$f":"'Optimum Moisture'!O46","v":""},{"$f":"'Optimum Moisture'!O45","v":""},{"$error":"#VALUE!"}]
[4,{"$f":"D3","v":{"$error":"#VALUE!"}},{"$f":"D2","v":{"$error":"#VALUE!"}},{"$error":"#VALUE!"}]
[5,{"$f":"D3","v":{"$error":"#VALUE!"}},{"$f":"$D$2","v":{"$error":"#VALUE!"}},{"$error":"#VALUE!"}]
{"$rows_left_out":187}
{"sheet":"Reference (5)","index":9,"n_rows":201,"n_cols":5,"rows_kept":201,"cut":false,"hidden":true,"merged":[]}
["m1",{"$f":"(B12-B11)/(C12-C11)","v":{"$error":"#VALUE!"}}]
["b1",{"$f":"B11-B1*C11","v":{"$error":"#VALUE!"}},"X-Peak",{"$f":"(B4-B2)/(B1-B3)","v":{"$error":"#VALUE!"}}]
["m2",{"$f":"IF(B13>0,B1*-1,(B14-B13)/(C14-C13))","v":{"$error":"#VALUE!"}},"Y-Peak",{"$f":"B1*D2+B2","v":{"$error":"#VALUE!"}}]
["b2",{"$f":"B13-C13*B3","v":{"$error":"#VALUE!"}}]
[]
[]
[]
[]
[]
["N","Y","X","X^2"]
[1,{"$f":"'Optimum Moisture'!P46","v":""},{"$f":"'Optimum Moisture'!P45","v":""},{"$f":"C11^2","v":{"$error":"#VALUE!"}}]
[2,{"$f":"'Optimum Moisture'!Q46","v":""},{"$f":"'Optimum Moisture'!Q45","v":""},{"$error":"#VALUE!"}]
[3,{"$f":"'Optimum Moisture'!R46","v":""},{"$f":"'Optimum Moisture'!R45","v":""},{"$error":"#VALUE!"}]
[4,{"$f":"D3","v":{"$error":"#VALUE!"}},{"$f":"D2","v":{"$error":"#VALUE!"}},{"$error":"#VALUE!"}]
[5,{"$f":"D3","v":{"$error":"#VALUE!"}},{"$f":"$D$2","v":{"$error":"#VALUE!"}},{"$error":"#VALUE!"}]
{"$rows_left_out":187}
{"sheet":"Set 1(a)","index":10,"n_rows":23,"n_cols":4,"rows_kept":23,"cut":false,"hidden":true,"merged":[[0,4,0,9]]}
["[HEADER]"]
["Project:","Project1"]
["Date:",37036,"Time:",0.41158564814814802]
["Boring:","Boring1","Sample:",2]
["Specimen:",2,"Depth (ft):",10]
["Diameter (inch):",null,"Height (inch):"]
["Piston Correction (lbs):"]
["Comments:"]
[]
["[SENSORS]"]
["Name","External Load Cell","Cell Pressure","Load Frame Encoder"]
["ID","LC54032","PS9170013","N/A"]
["Module","Load Frame Adc","Load Frame Adc","N/A"]
["Channel",1,3,"N/A"]
["Unit","lbs","psi","inch"]
{"$rows_left_out":9}
{"sheet":"Set 1(b)","index":11,"n_rows":23,"n_cols":4,"rows_kept":23,"cut":false,"hidden":true,"merged":[[0,4,0,9]]}
["[HEADER]"]
["Project:","Project1"]
["Date:",37036,"Time:",0.41158564814814802]
["Boring:","Boring1","Sample:",2]
["Specimen:",2,"Depth (ft):",10]
["Diameter (inch):",null,"Height (inch):"]
["Piston Correction (lbs):"]
["Comments:"]
[]
["[SENSORS]"]
["Name","External Load Cell","Cell Pressure","Load Frame Encoder"]
["ID","LC54032","PS9170013","N/A"]
["Module","Load Frame Adc","Load Frame Adc","N/A"]
["Channel",1,3,"N/A"]
["Unit","lbs","psi","inch"]
{"$rows_left_out":9}
{"sheet":"Set 1(c)","index":12,"n_rows":23,"n_cols":4,"rows_kept":23,"cut":false,"hidden":true,"merged":[[0,4,0,9]]}
["[HEADER]"]
["Project:","Project1"]
["Date:",37036,"Time:",0.44061342592592601]
["Boring:","Boring1","Sample:",5]
["Specimen:",5,"Depth (ft):",10]
["Diameter (inch):",null,"Height (inch):"]
["Piston Correction (lbs):"]
["Comments:"]
[]
["[SENSORS]"]
["Name","External Load Cell","Cell Pressure","Load Frame Encoder"]
["ID","LC54032","PS9170013","N/A"]
["Module","Load Frame Adc","Load Frame Adc","N/A"]
["Channel",1,3,"N/A"]
["Unit","lbs","psi","inch"]
{"$rows_left_out":9}
{"sheet":"Set 2(a)","index":13,"n_rows":23,"n_cols":4,"rows_kept":23,"cut":false,"hidden":true,"merged":[[0,4,0,9]]}
["[HEADER]"]
["Project:","Project1"]
["Date:",37036,"Time:",0.42736111111111103]
["Boring:","Boring1","Sample:",1]
["Specimen:",1,"Depth (ft):",10]
["Diameter (inch):",null,"Height (inch):"]
["Piston Correction (lbs):"]
["Comments:"]
[]
["[SENSORS]"]
["Name","External Load Cell","Cell Pressure","Load Frame Encoder"]
["ID","LC54032","PS9170013","N/A"]
["Module","Load Frame Adc","Load Frame Adc","N/A"]
["Channel",1,3,"N/A"]
["Unit","lbs","psi","inch"]
{"$rows_left_out":9}
{"sheet":"Set 2(b)","index":14,"n_rows":23,"n_cols":4,"rows_kept":23,"cut":false,"hidden":true,"merged":[[0,4,0,9]]}
["Created by Sigma-1 UU Version 3.7.5; Copyright 2003, GEOTAC"]
["Project:","Amarillo "]
["Date:",38279,"Time:",0.422337962962963]
["Boring:","3% Cement Base","Sample:","04-E-131"]
["Specimen:","Specimen 2","Depth (ft):",0]
["Diameter (inch):",null,"Height (inch):"]
["Piston Correction (lbs):"]
["Comments:"]
[]
["[SENSORS]"]
["Name","External Load Cell","Cell Pressure","Load Frame Encoder"]
["ID",118521,"ID2","N/A"]
["Module","Load Frame ADIO","Load Frame ADIO","N/A"]
["Channel",1,4,"N/A"]
["Unit","lbs","psi","inch"]
{"$rows_left_out":9}
{"sheet":"Set 2(c)","index":15,"n_rows":23,"n_cols":4,"rows_kept":23,"cut":false,"hidden":true,"merged":[[0,4,0,9]]}
["Created by Sigma-1 UU Version 3.7.5; Copyright 2003, GEOTAC"]
["Project:","Amarillo "]
["Date:",38279,"Time:",0.43348379629629602]
["Boring:","3% Cement Base","Sample:","04-E-131"]
["Specimen:","Specimen 4","Depth (ft):",0]
["Diameter (inch):",null,"Height (inch):"]
["Piston Correction (lbs):"]
["Comments:"]
[]
["[SENSORS]"]
["Name","External Load Cell","Cell Pressure","Load Frame Encoder"]
["ID",118521,"ID2","N/A"]
["Module","Load Frame ADIO","Load Frame ADIO","N/A"]
["Channel",1,4,"N/A"]
["Unit","lbs","psi","inch"]
{"$rows_left_out":9}
{"sheet":"Set 3(a)","index":16,"n_rows":23,"n_cols":4,"rows_kept":23,"cut":false,"hidden":true,"merged":[[0,4,0,9]]}
["[HEADER]"]
["Project:","Project1"]
["Date:",37036,"Time:",0.42031249999999998]
["Boring:","Boring1","Sample:",3]
["Specimen:",3,"Depth (ft):",10]
["Diameter (inch):",null,"Height (inch):"]
["Piston Correction (lbs):"]
["Comments:"]
[]
["[SENSORS]"]
["Name","External Load Cell","Cell Pressure","Load Frame Encoder"]
["ID","LC54032","PS9170013","N/A"]
["Module","Load Frame Adc","Load Frame Adc","N/A"]
["Channel",1,3,"N/A"]
["Unit","lbs","psi","inch"]
{"$rows_left_out":9}
{"sheet":"Set 3(b)","index":17,"n_rows":23,"n_cols":4,"rows_kept":23,"cut":false,"hidden":true,"merged":[[0,4,0,9]]}
["Created by Sigma-1 UU Version 3.7.5; Copyright 2003, GEOTAC"]
["Project:","Amarillo "]
["Date:",38279,"Time:",0.404212962962963]
["Boring:","4% Cement Base","Sample:","04-E-131"]
["Specimen:","Specimen 3","Depth (ft):",0]
["Diameter (inch):",null,"Height (inch):"]
["Piston Correction (lbs):"]
["Comments:"]
[]
["[SENSORS]"]
["Name","External Load Cell","Cell Pressure","Load Frame Encoder"]
["ID",118521,"ID2","N/A"]
["Module","Load Frame ADIO","Load Frame ADIO","N/A"]
["Channel",1,4,"N/A"]
["Unit","lbs","psi","inch"]
{"$rows_left_out":9}
{"sheet":"Set 3(c)","index":18,"n_rows":23,"n_cols":4,"rows_kept":23,"cut":false,"hidden":true,"merged":[[0,4,0,9]]}
["Created by Sigma-1 UU Version 3.7.5; Copyright 2003, GEOTAC"]
["Project:"]
["Date:",null,"Time:"]
["Boring:",null,"Sample:"]
["Specimen:",null,"Depth (ft):"]
["Diameter (inch):",null,"Height (inch):"]
["Piston Correction (lbs):"]
["Comments:"]
[]
["[SENSORS]"]
["Name","External Load Cell","Cell Pressure","Load Frame Encoder"]
["ID"]
["Module"]
["Channel"]
["Unit"]
{"$rows_left_out":9}
{"sheet":"Set 4(a)","index":19,"n_rows":23,"n_cols":4,"rows_kept":23,"cut":false,"hidden":true,"merged":[[0,4,0,9]]}
["Created by Sigma-1 UU Version 3.7.5; Copyright 2003, GEOTAC"]
["Project:","Amarillo "]
["Date:",38279,"Time:",0.351793981481481]
["Boring:","5 % Cement Base","Sample:","04-E-131"]
["Specimen:","Specimen 2","Depth (ft):",0]
["Diameter (inch):",null,"Height (inch):"]
["Piston Correction (lbs):"]
["Comments:"]
[]
["[SENSORS]"]
["Name","External Load Cell","Cell Pressure","Load Frame Encoder"]
["ID",118521,"ID2","N/A"]
["Module","Load Frame ADIO","Load Frame ADIO","N/A"]
["Channel",1,4,"N/A"]
["Unit","lbs","psi","inch"]
{"$rows_left_out":9}
{"sheet":"Set 4(b)","index":20,"n_rows":23,"n_cols":4,"rows_kept":23,"cut":false,"hidden":true,"merged":[[0,4,0,9]]}
["[HEADER]"]
["Project:","Project1"]
["Date:",37036,"Time:",0.40013888888888899]
["Boring:","Boring1","Sample:",6]
["Specimen:",6,"Depth (ft):",10]
["Diameter (inch):",null,"Height (inch):"]
["Piston Correction (lbs):"]
["Comments:"]
[]
["[SENSORS]"]
["Name","External Load Cell","Cell Pressure","Load Frame Encoder"]
["ID","LC54032","PS9170013","N/A"]
["Module","Load Frame Adc","Load Frame Adc","N/A"]
["Channel",1,3,"N/A"]
["Unit","lbs","psi","inch"]
{"$rows_left_out":9}
{"sheet":"Set 4(c)","index":21,"n_rows":23,"n_cols":4,"rows_kept":23,"cut":false,"hidden":true,"merged":[[0,4,0,9]]}
["[HEADER]"]
["Project:","Project1"]
["Date:",37036,"Time:",0.40276620370370397]
["Boring:","Boring1","Sample:",6]
["Specimen:",6,"Depth (ft):",10]
["Diameter (inch):",null,"Height (inch):"]
["Piston Correction (lbs):"]
["Comments:"]
[]
["[SENSORS]"]
["Name","External Load Cell","Cell Pressure","Load Frame Encoder"]
["ID","LC54032","PS9170013","N/A"]
["Module","Load Frame Adc","Load Frame Adc","N/A"]
["Channel",1,3,"N/A"]
["Unit","lbs","psi","inch"]
{"$rows_left_out":8}