{"text_format":"1","workbook":"xlsx","n_sheets":22,"sheets":["Compressive Strength","Tex-113,4-E","Optimum Moisture","RX","Log","Reference","Reference (2)","Reference (3)","Reference (4)","Reference (5)","Set 1(a)","Set 1(b)","Set 1(c)","Set 2(a)","Set 2(b)","Set 2(c)","Set 3(a)","Set 3(b)","Set 3(c)","Set 4(a)","Set 4(b)","Set 4(c)"],"not_rendered":{"charts":2,"images":1,"macros":1,"external_links":0,"defined_names":764,"comments":3,"pivot_tables":0},"unopened":[],"bounds":{"document_bytes":16777216,"sheet_cells":100000,"rows_first":2000,"rows_last":500,"rows_between":2000,"halvings":0,"cell_chars":16384,"cell_head_chars":4096},"cells_cut":0,"cells_raw":0,"read":"whole","date_system":"1900"}

{"sheet":"Compressive Strength","index":0,"n_rows":79,"n_cols":19,"rows_kept":79,"cut":false,"hidden":false,"merged":[[78,1,78,6],[78,7,78,8],[32,1,32,5],[26,1,26,5],[74,1,74,6],[74,7,74,8],[74,9,74,10],[74,11,74,16],[76,1,76,2],[76,3,76,4],[76,5,76,6],[76,7,76,8],[28,1,28,5],[47,1,47,5],[51,1,51,5],[49,1,49,5],[50,1,50,5],[38,1,38,5],[39,1,39,5],[40,1,40,5],[42,1,42,5],[44,1,44,5],[48,1,48,5],[41,1,41,5],[7,1,7,4],[7,13,7,16],[8,13,8,16],[9,13,9,16],[7,9,7,12],[11,13,11,16],[12,13,12,16],[10,13,10,16],[18,11,18,14],[8,1,8,4],[9,1,9,4],[10,1,10,4],[9,5,9,8],[10,5,10,8],[11,1,11,4],[11,5,11,8],[8,5,8,8],[16,9,16,12],[11,9,11,12],[13,5,13,8],[43,1,43,5],[45,1,45,5],[46,1,46,5],[27,1,27,5],[30,1,30,5],[31,1,31,5],[24,1,24,5],[13,9,13,12],[12,9,12,12],[37,1,37,5],[12,1,12,4],[13,1,13,4],[12,5,12,8],[22,1,22,17],[24,12,24,14],[18,15,18,16],[18,7,18,8],[20,5,20,6],[23,12,23,14],[23,15,23,17],[13,13,13,16],[23,9,23,11],[23,6,23,8],[24,15,24,17],[29,1,29,5],[35,1,35,5],[36,1,36,5],[0,0,0,2],[33,1,33,5],[34,1,34,5],[14,1,14,4],[14,5,14,16],[18,9,18,10],[20,1,20,4],[25,1,25,5],[18,1,18,4],[18,5,18,6],[24,6,24,8],[24,9,24,11],[7,5,7,8],[15,5,15,16],[16,13,16,16],[8,9,8,12],[9,9,9,12],[10,9,10,12],[15,1,15,4],[16,1,16,4],[16,5,16,8],[66,1,66,16],[54,1,54,5],[55,1,55,5],[57,6,57,7],[59,6,59,7],[59,1,59,5],[57,1,57,5],[65,1,65,16],[72,3,72,8],[72,1,72,2],[70,1,70,2],[70,3,70,8],[70,9,70,10],[67,3,67,5],[72,9,72,10],[63,1,64,16],[68,1,68,2],[68,3,68,8],[68,9,68,10]]}
["TxDOT Manuals >",null,null,null,"Tex-120-E"]
[null,"TEXAS DEPARTMENT OF TRANSPORTATION",null,null,null,null,null,null,null,null,null,null,null,null,null,null,null,null,524]
[null,null,null,null,null,null,null,null,null,null,null,null,null,null,null,null,null,null,3]
[null,null,null,null,null,null,null,null,null,null,null,null,null,null,null,null,null,null,"tx120.xlsm::45505.66456"]
[null,"SOIL-CEMENT TESTING"]
[null,"Tex-120-E : PART I"]
[null,null,null,null,null,null,null,null,null,null,null,null,null,null,null,null,{"$f":"\"File Version: \" & TEXT(MID(sn,SEARCH(\"::\",sn,1)+2,20),\"mm/dd/yy hh:mm:ss\")","v":"File Version: 08/01/24 15:56:58"}]
[null,"SAMPLE ID:",null,null,null,null,null,null,null,"SAMPLED DATE:"]
[null,"TEST NUMBER:",null,null,null,null,null,null,null,"LETTING DATE:"]
[null,"SAMPLE STATUS:",null,null,null,null,null,null,null,"CONTROLLING CSJ:"]
[null,"COUNTY:",null,null,null,null,null,null,null,"SPEC YEAR:"]
[null,"SAMPLED BY:",null,null,null,null,null,null,null,"SPEC ITEM:"]
[null,"SAMPLE LOCATION:",null,null,null,null,null,null,null,"SPECIAL PROVISION:"]
[null,"MATERIAL CODE:",null,null,null,null,null,null,null,"GRADE:"]
[null,"MATERIAL NAME:"]
[null,"PRODUCER:",null,null,null,""]
[null,"AREA ENGINEER:",null,null,null,null,null,null,null,"PROJECT MANAGER:"]
[]
[null,"COURSE\\LIFT:",null,null,null,null,null,"STATION:",null,null,null,"DIST. FROM CL:"]
[]
[null,"Performed By Tex-120-E:",null,null,null,null,null," <-- Select method of data collection."]
[]
[null,"Soil-Cement Test Data Sheet"]
[null,null,null,null,null,null,1,null,null,2,null,null,3,null,null,4]
[null,"Percent Cement, (%)"]
[null,"Specimen Number:",null,null,null,null,"1-1","1-2","1-3","2-1","2-2","2-3","3-1","3-2","3-3","4-1","4-2","4-3"]
[null,"Initial Height of Specimen, in.:"]
[null,"Height of Stone 1, in."]
[null,"Height of Stone 2, in."]
[null,"New Height of Specimen, in.:",null,null,null,null,{"$f":"IF(AutoMan=\"automated\",IF('Set 1(a)'!$D$6=\"\",\"\",'Set 1(a)'!$D$6),IF(COUNTBLANK(G27:G29)=3,\"\",G27-G28-G29))","v":""},{"$f":"IF(AutoMan=\"automated\",IF('Set 1(b)'!$D$6=\"\",\"\",'Set 1(b)'!$D$6),IF(COUNTBLANK(H27:H29)=3,\"\",H27-H28-H29))","v":""},{"$f":"IF(AutoMan=\"automated\",IF('Set 1(c)'!$D$6=\"\",\"\",'Set 1(c)'!$D$6),IF(COUNTBLANK(I27:I29)=3,\"\",I27-I28-I29))","v":""},{"$f":"IF(AutoMan=\"automated\",IF('Set 2(a)'!$D$6=\"\",\"\",'Set 2(a)'!$D$6),IF(COUNTBLANK(J27:J29)=3,\"\",J27-J28-J29))","v":""},{"$f":"IF(AutoMan=\"automated\",IF('Set 2(b)'!$D$6=\"\",\"\",'Set 2(b)'!$D$6),IF(COUNTBLANK(K27:K29)=3,\"\",K27-K28-K29))","v":""},{"$f":"IF(AutoMan=\"automated\",IF('Set 2(c)'!$D$6=\"\",\"\",'Set 2(c)'!$D$6),IF(COUNTBLANK(L27:L29)=3,\"\",L27-L28-L29))","v":""},{"$f":"IF(AutoMan=\"automated\",IF('Set 3(a)'!$D$6=\"\",\"\",'Set 3(a)'!$D$6),IF(COUNTBLANK(M27:M29)=3,\"\",M27-M28-M29))","v":""},{"$f":"IF(AutoMan=\"automated\",IF('Set 3(b)'!$D$6=\"\",\"\",'Set 3(b)'!$D$6),IF(COUNTBLANK(N27:N29)=3,\"\",N27-N28-N29))","v":""},{"$f":"IF(AutoMan=\"automated\",IF('Set 3(c)'!$D$6=\"\",\"\",'Set 3(c)'!$D$6),IF(COUNTBLANK(O27:O29)=3,\"\",O27-O28-O29))","v":""},{"$f":"IF(AutoMan=\"automated\",IF('Set 4(a)'!$D$6=\"\",\"\",'Set 4(a)'!$D$6),IF(COUNTBLANK(P27:P29)=3,\"\",P27-P28-P29))","v":""},{"$f":"IF(AutoMan=\"automated\",IF('Set 4(b)'!$D$6=\"\",\"\",'Set 4(b)'!$D$6),IF(COUNTBLANK(Q27:Q29)=3,\"\",Q27-Q28-Q29))","v":""},{"$f":"IF(AutoMan=\"automated\",IF('Set 4(c)'!$D$6=\"\",\"\",'Set 4(c)'!$D$6),IF(COUNTBLANK(R27:R29)=3,\"\",R27-R28-R29))","v":""}]
[null,"Average Diameter, in.:",null,null,null,null,{"$f":"IF(G27=\"\",\"\",IF(AutoMan=\"automated\",'Set 1(a)'!$B$6,+G32/PI()))","v":""},{"$f":"IF(H27=\"\",\"\",IF(AutoMan=\"automated\",'Set 1(b)'!$B$6,+H32/PI()))","v":""},{"$f":"IF(I27=\"\",\"\",IF(AutoMan=\"automated\",'Set 1(c)'!$B$6,+I32/PI()))","v":""},{"$f":"IF(J27=\"\",\"\",IF(AutoMan=\"automated\",'Set 2(a)'!$B$6,+J32/PI()))","v":""},{"$f":"IF(K27=\"\",\"\",IF(AutoMan=\"automated\",'Set 2(b)'!$B$6,+K32/PI()))","v":""},{"$f":"IF(L27=\"\",\"\",IF(AutoMan=\"automated\",'Set 2(c)'!$B$6,+L32/PI()))","v":""},{"$f":"IF(M27=\"\",\"\",IF(AutoMan=\"automated\",'Set 3(a)'!$B$6,+M32/PI()))","v":""},{"$f":"IF(N27=\"\",\"\",IF(AutoMan=\"automated\",'Set 3(b)'!$B$6,+N32/PI()))","v":""},{"$f":"IF(O27=\"\",\"\",IF(AutoMan=\"automated\",'Set 3(c)'!$B$6,+O32/PI()))","v":""},{"$f":"IF(P27=\"\",\"\",IF(AutoMan=\"automated\",'Set 4(a)'!$B$6,+P32/PI()))","v":""},{"$f":"IF(Q27=\"\",\"\",IF(AutoMan=\"automated\",'Set 4(b)'!$B$6,+Q32/PI()))","v":""},{"$f":"IF(R27=\"\",\"\",IF(AutoMan=\"automated\",'Set 4(c)'!$B$6,+R32/PI()))","v":""}]
[null,"Circumference, in.:"]
[null,"Area, in.^2:",null,null,null,null,{"$f":"IF(G27=\"\",\"\",+G32*(G31/4))","v":""},"","","","","","","","","","",""]
[null,"Avg. Cross Sectional Area, in^2:",null,null,null,null,{"$f":"IF(G27=\"\",\"\",+G33/G49)","v":""},"","","","","","","","","","",""]
[null,"Lateral Pressure, psi.:"]
[null,"Calibration Factor:",null,null,null,null,{"$f":"IF('Set 1(a)'!$B$16=\"\",\"\",'Set 1(a)'!$B$16)","v":""},{"$f":"IF('Set 1(b)'!$B$16=\"\",\"\",'Set 1(b)'!$B$16)","v":""},{"$f":"IF('Set 1(c)'!$B$16=\"\",\"\",'Set 1(c)'!$B$16)","v":""},{"$f":"IF('Set 2(a)'!$B$16=\"\",\"\",'Set 2(a)'!$B$16)","v":""},{"$f":"IF('Set 2(b)'!$B$16=\"\",\"\",'Set 2(b)'!$B$16)","v":""},{"$f":"IF('Set 2(c)'!$B$16=\"\",\"\",'Set 2(c)'!$B$16)","v":""},{"$f":"IF('Set 3(a)'!$B$16=\"\",\"\",'Set 3(a)'!$B$16)","v":""},{"$f":"IF('Set 3(b)'!$B$16=\"\",\"\",'Set 3(b)'!$B$16)","v":""},{"$f":"IF('Set 3(c)'!$B$16=\"\",\"\",'Set 3(c)'!$B$16)","v":""},{"$f":"IF('Set 4(a)'!$B$16=\"\",\"\",'Set 4(a)'!$B$16)","v":""},{"$f":"IF('Set 4(b)'!$B$16=\"\",\"\",'Set 4(b)'!$B$16)","v":""},{"$f":"IF('Set 4(c)'!$B$16=\"\",\"\",'Set 4(c)'!$B$16)","v":""}]
[null,"Excitation:",null,null,null,null,{"$f":"IF('Set 1(a)'!$B$17=\"\",\"\",'Set 1(a)'!$B$17)","v":""},{"$f":"IF('Set 1(b)'!$B$17=\"\",\"\",'Set 1(b)'!$B$17)","v":""},{"$f":"IF('Set 1(c)'!$B$17=\"\",\"\",'Set 1(c)'!$B$17)","v":""},{"$f":"IF('Set 2(a)'!$B$17=\"\",\"\",'Set 2(a)'!$B$17)","v":""},{"$f":"IF('Set 2(b)'!$B$17=\"\",\"\",'Set 2(b)'!$B$17)","v":""},{"$f":"IF('Set 2(c)'!$B$17=\"\",\"\",'Set 2(c)'!$B$17)","v":""},{"$f":"IF('Set 3(a)'!$B$17=\"\",\"\",'Set 3(a)'!$B$17)","v":""},{"$f":"IF('Set 3(b)'!$B$17=\"\",\"\",'Set 3(b)'!$B$17)","v":""},{"$f":"IF('Set 3(c)'!$B$17=\"\",\"\",'Set 3(c)'!$B$17)","v":""},{"$f":"IF('Set 4(a)'!$B$17=\"\",\"\",'Set 4(a)'!$B$17)","v":""},{"$f":"IF('Set 4(b)'!$B$17=\"\",\"\",'Set 4(b)'!$B$17)","v":""},{"$f":"IF('Set 4(c)'!$B$17=\"\",\"\",'Set 4(c)'!$B$17)","v":""}]
[null,"Zero:",null,null,null,null,{"$f":"IF('Set 1(a)'!$B$18=\"\",\"\",'Set 1(a)'!$B$18)","v":""},{"$f":"IF('Set 1(b)'!$B$18=\"\",\"\",'Set 1(b)'!$B$18)","v":""},{"$f":"IF('Set 1(c)'!$B$18=\"\",\"\",'Set 1(c)'!$B$18)","v":""},{"$f":"IF('Set 2(a)'!$B$18=\"\",\"\",'Set 2(a)'!$B$18)","v":""},{"$f":"IF('Set 2(b)'!$B$18=\"\",\"\",'Set 2(b)'!$B$18)","v":""},{"$f":"IF('Set 2(c)'!$B$18=\"\",\"\",'Set 2(c)'!$B$18)","v":""},{"$f":"IF('Set 3(a)'!$B$18=\"\",\"\",'Set 3(a)'!$B$18)","v":""},{"$f":"IF('Set 3(b)'!$B$18=\"\",\"\",'Set 3(b)'!$B$18)","v":""},{"$f":"IF('Set 3(c)'!$B$18=\"\",\"\",'Set 3(c)'!$B$18)","v":""},{"$f":"IF('Set 4(a)'!$B$18=\"\",\"\",'Set 4(a)'!$B$18)","v":""},{"$f":"IF('Set 4(b)'!$B$18=\"\",\"\",'Set 4(b)'!$B$18)","v":""},{"$f":"IF('Set 4(c)'!$B$18=\"\",\"\",'Set 4(c)'!$B$18)","v":""}]
[null,"Ring Factor, lbs./div"]
[null,"Dead Load, lbs.:"]
[null,"Piston Correction, lbs.:",null,null,null,null,{"$f":"IF('Set 1(a)'!$B$7=\"\",\"\",'Set 1(a)'!$B$7)","v":""},{"$f":"IF('Set 1(b)'!$B$7=\"\",\"\",'Set 1(b)'!$B$7)","v":""},{"$f":"IF('Set 1(c)'!$B$7=\"\",\"\",'Set 1(c)'!$B$7)","v":""},{"$f":"IF('Set 2(a)'!$B$7=\"\",\"\",'Set 2(a)'!$B$7)","v":""},{"$f":"IF('Set 2(b)'!$B$7=\"\",\"\",'Set 2(b)'!$B$7)","v":""},{"$f":"IF('Set 2(c)'!$B$7=\"\",\"\",'Set 2(c)'!$B$7)","v":""},{"$f":"IF('Set 3(a)'!$B$7=\"\",\"\",'Set 3(a)'!$B$7)","v":""},{"$f":"IF('Set 3(b)'!$B$7=\"\",\"\",'Set 3(b)'!$B$7)","v":""},{"$f":"IF('Set 3(c)'!$B$7=\"\",\"\",'Set 3(c)'!$B$7)","v":""},{"$f":"IF('Set 4(a)'!$B$7=\"\",\"\",'Set 4(a)'!$B$7)","v":""},{"$f":"IF('Set 4(b)'!$B$7=\"\",\"\",'Set 4(b)'!$B$7)","v":""},{"$f":"IF('Set 4(c)'!$B$7=\"\",\"\",'Set 4(c)'!$B$7)","v":""}]
[null,"Max. Load Reading, div.:",null,null,null,null,{"$f":"IF('Set 1(a)'!$B$25=\"\",\"\",'Set 1(a)'!$B$25)","v":""},{"$f":"IF('Set 1(b)'!$B$25=\"\",\"\",'Set 1(b)'!$B$25)","v":""},{"$f":"IF('Set 1(c)'!$B$25=\"\",\"\",'Set 1(c)'!$B$25)","v":""},{"$f":"IF('Set 2(a)'!$B$25=\"\",\"\",'Set 2(a)'!$B$25)","v":""},{"$f":"IF('Set 2(b)'!$B$25=\"\",\"\",'Set 2(b)'!$B$25)","v":""},{"$f":"IF('Set 2(c)'!$B$25=\"\",\"\",'Set 2(c)'!$B$25)","v":""},{"$f":"IF('Set 3(a)'!$B$25=\"\",\"\",'Set 3(a)'!$B$25)","v":""},{"$f":"IF('Set 3(b)'!$B$25=\"\",\"\",'Set 3(b)'!$B$25)","v":""},{"$f":"IF('Set 3(c)'!$B$25=\"\",\"\",'Set 3(c)'!$B$25)","v":""},{"$f":"IF('Set 4(a)'!$B$25=\"\",\"\",'Set 4(a)'!$B$25)","v":""},{"$f":"IF('Set 4(b)'!$B$25=\"\",\"\",'Set 4(b)'!$B$25)","v":""},{"$f":"IF('Set 4(c)'!$B$25=\"\",\"\",'Set 4(c)'!$B$25)","v":""}]
[null,"Max Load, lbs.:",null,null,null,null,{"$f":"IF(G42=\"\",\"\",((G$42-G$38)*G$36)/G$37)","v":""},"","","","","","","","","","",""]
[null,"Deformation at Max Load, in.:",null,null,null,null,{"$f":"IF(G42=\"\",\"\",('Set 1(a)'!$D$26-'Set 1(a)'!$D$24)/'Set 1(a)'!$D$16)","v":""},{"$f":"IF(H42=\"\",\"\",('Set 1(b)'!$D$26-'Set 1(b)'!$D$24)/'Set 1(b)'!$D$16)","v":""},{"$f":"IF(I42=\"\",\"\",('Set 1(c)'!$D$26-'Set 1(c)'!$D$24)/'Set 1(c)'!$D$16)","v":""},{"$f":"IF(J42=\"\",\"\",('Set 2(a)'!$D$26-'Set 2(a)'!$D$24)/'Set 2(a)'!$D$16)","v":""},{"$f":"IF(K42=\"\",\"\",('Set 2(b)'!$D$26-'Set 2(b)'!$D$24)/'Set 2(b)'!$D$16)","v":""},{"$f":"IF(L42=\"\",\"\",('Set 2(c)'!$D$26-'Set 2(c)'!$D$24)/'Set 2(c)'!$D$16)","v":""},{"$f":"IF(M42=\"\",\"\",('Set 3(a)'!$D$26-'Set 3(a)'!$D$24)/'Set 3(a)'!$D$16)","v":""},{"$f":"IF(N42=\"\",\"\",('Set 3(b)'!$D$26-'Set 3(b)'!$D$24)/'Set 3(b)'!$D$16)","v":""},{"$f":"IF(O42=\"\",\"\",('Set 3(c)'!$D$26-'Set 3(c)'!$D$24)/'Set 3(c)'!$D$16)","v":""},{"$f":"IF(P42=\"\",\"\",('Set 4(a)'!$D$26-'Set 4(a)'!$D$24)/'Set 4(a)'!$D$16)","v":""},{"$f":"IF(Q42=\"\",\"\",('Set 4(b)'!$D$26-'Set 4(b)'!$D$24)/'Set 4(b)'!$D$16)","v":""},{"$f":"IF(R42=\"\",\"\",('Set 4(c)'!$D$26-'Set 4(c)'!$D$24)/'Set 4(c)'!$D$16)","v":""}]
[null,"Max. Load Reading, div."]
[null,"Deformation at Max Load, in."]
[null,"Uncorr'd Stress, psi.:",null,null,null,null,{"$f":"IF(G27=\"\",\"\",IF(AutoMan=\"automated\",(G43+G40)/IF(Version=\"1\",G34,G33),(((G45*G39)+G40)/G33)))","v":""},"","","","","","","","","","",""]
[null,"% Strain , in./in.:",null,null,null,null,{"$f":"IF(G27=\"\",\"\",IF(AutoMan=\"automated\",(G44/G30)*100,(G46/G30)*100))","v":""},"","","","","","","","","","",""]
[null,"I-Strain, in./in.:",null,null,null,null,{"$f":"IF(G27=\"\",\"\",IF(AutoMan=\"automated\",1-(G44/G30),1-(G46/G30)))","v":""},"","","","","","","","","","",""]
[null,"Corrected Stress, psi.:",null,null,null,null,{"$f":"IF(G27=0,\"\",IF(AutoMan=\"automated\",(G49*G47),((G39*G45)+G40)/G34))","v":""},{"$f":"IF(H27=0,\"\",IF(AutoMan=\"automated\",(H49*H47),((H39*H45)+H40)/H34))","v":""},{"$f":"IF(I27=0,\"\",IF(AutoMan=\"automated\",(I49*I47),((I39*I45)+I40)/I34))","v":""},{"$f":"IF(J27=\"\",\"\",IF(AutoMan=\"automated\",(J49*J47),((J39*J45)+J40)/J34))","v":""},"","","","","","","",""]
[]
[null,"Avg. Corrected Stress, psi:",null,null,null,null,null,null,{"$f":"IF(ISERROR(AVERAGE(G50:I50)),\"\",AVERAGE(G50:I50))","v":""},null,null,{"$f":"IF(ISERROR(AVERAGE(J50:L50)),\"\",AVERAGE(J50:L50))","v":""},null,null,{"$f":"IF(ISERROR(AVERAGE(M50:O50)),\"\",AVERAGE(M50:O50))","v":""},null,null,{"$f":"IF(ISERROR(AVERAGE(P50:R50)),\"\",AVERAGE(P50:R50))","v":""}]
[]
[null,null,null,null,null,null,1,2,3,4]
[null,"Percent Cement, (%)",null,null,null,null,{"$f":"IF(CSPercentCement1=\"\",\"\",ROUND(CSPercentCement1*2,0)/2)","v":""},{"$f":"IF(CSPercentCement2=\"\",\"\",ROUND(CSPercentCement2*2,0)/2)","v":""},{"$f":"IF(CSPercentCement3=\"\",\"\",ROUND(CSPercentCement3*2,0)/2)","v":""},{"$f":"IF(CSPercentCement4=\"\",\"\",ROUND(CSPercentCement4*2,0)/2)","v":""}]
[null,"Avg. Corrected Stress, psi:",null,null,null,null,{"$f":"IF(AVGCS1=0,0,AVGCS1)","v":""},{"$f":"IF(AVGCS2=0,0,AVGCS2)","v":""},{"$f":"IF(AVGCS3=0,0,AVGCS3)","v":""},{"$f":"IF(AVGCS4=0,0,AVGCS4)","v":""}]
[]
[null,"Target Stress, psi:"]
[]
[null,"Target Percent Cement, %:",null,null,null,null,{"$f":"IF(TargetStress=\"\",\"\",(G58-INTERCEPT(G56:J56,G55:J55))/LINEST(G56:J56,G55:J55))","v":""}]
[]
[]
[null,"Remarks:",null,{"$f":"NOW()","v":"2024-08-01T15:56:58.440"}]
[]
[]
[]
[]
[null,"Sample Method:",null,"Sampled By:",null,null,null,null,null,"Sampled Date:"]
[null,"TX100"]
[]
[null,"TX400"]
[null,"Test Method:",null,"Tested By:",null,null,null,null,null,"Tested Date:"]
[null,"TX120"]
[null,"Test Stamp Code:",null,null,null,null,null,"Omit Test:",null,"Completed Date:",null,"Reviewed By:"]
[]
[null,"Locked By:",null,"TxDOT:",null,"District:",null,"Area:"]
[null,"",null,"",null,"",null,""]
[null,"Authorized By:",null,null,null,null,null,"Authorized Date:"]
[null,null,null,null,null,null,null,null,null,null,{"$f":"IF(AuthorizedDate<38257,\"1\",\"2\")","v":"1"}]

{"sheet":"Tex-113,4-E","index":1,"n_rows":60,"n_cols":11,"rows_kept":60,"cut":false,"hidden":false,"merged":[[38,1,38,3],[29,1,29,3],[21,1,21,3],[22,1,22,3],[23,1,23,3],[24,1,24,3],[26,1,26,3],[20,1,20,3],[31,1,31,3],[0,0,0,1],[13,3,13,4],[30,1,30,3],[14,3,14,8],[7,7,7,8],[7,3,7,4],[10,3,10,4],[9,7,9,8],[15,3,15,8],[13,7,13,8],[9,3,9,4],[8,7,8,8],[8,3,8,4],[10,7,10,8],[39,1,39,3],[41,1,41,3],[32,1,32,3],[34,1,34,3],[56,2,56,4],[42,1,42,3],[51,1,51,3],[48,1,48,3],[54,1,55,8],[43,1,43,3],[49,1,49,3],[40,1,40,3],[35,1,35,3],[36,1,36,3],[33,1,33,3],[37,1,37,3],[12,3,12,4],[11,7,11,8],[11,3,11,4],[16,7,16,8],[16,3,16,4],[12,7,12,8],[47,1,47,3],[44,1,44,3],[45,1,45,3],[46,1,46,3],[59,2,59,4],[50,1,50,3],[57,2,57,4]]}
["TxDOT Manuals >",null,null,"Tex-113-E"]
[null,"TEXAS DEPARTMENT OF TRANSPORTATION",null,null,null,null,null,null,null,null,49]
[null,{"$f":"IF(Location=\"\",\"\",Location)","v":""},null,null,null,null,null,null,null,null,1]
[null,"Soil-Cement Testing: Tex-120-E, Part II",null,null,null,null,null,null,null,"Tx113,4.xls::37445.433542","Tx113.xls::37092.636285"]
[null,"Moisture-Density Relations of Base Material & Sand or Subgrade & Embankment Soils",null,null,null,null,null,null,null,44]
[null,"TEX-113-E or Tex-114-E"]
[null,null,null,null,null,null,null,null,{"$f":"\"Tx113,4 File Version: \" & TEXT(MID(_sn113,SEARCH(\"::\",_sn113,1)+2,20),\"mm/dd/yy hh:mm:ss\")","v":"Tx113,4 File Version: 07/08/02 10:24:18"}]
[null,null,"SAMPLE ID:",{"$f":"IF(SampleId=\"\",\"\",SampleId)","v":""},null,null,"SAMPLED DATE:",{"$f":"IF(SampledDate=\"\",\"\",SampledDate)","v":""}]
[null,null,"TEST NUMBER:",{"$f":"IF(TestNumber=\"\",\"\",TestNumber)","v":""},null,null,"LETTING DATE:",{"$f":"IF(LettingDate=\"\",\"\",LettingDate)","v":""}]
[null,null,"SAMPLE STATUS:",{"$f":"IF(Status=\"\",\"\",Status)","v":""},null,null,"CONTROLLING CSJ:",{"$f":"IF(CCSJ=\"\",\"\",CCSJ)","v":""}]
[null,null,"COUNTY:",{"$f":"IF(County=\"\",\"\",County)","v":""},null,null,"SPEC YEAR:",{"$f":"IF(SpecYear=\"\",\"\",SpecYear)","v":""}]
[null,null,"SAMPLED BY:",{"$f":"IF(SampledBy=\"\",\"\",SampledBy)","v":""},null,null,"SPEC ITEM:",{"$f":"IF(SpecItem=\"\",\"\",SpecItem)","v":""}]
[null,null,"SAMPLE LOCATION:",{"$f":"IF(SampleLocation=\"\",\"\",SampleLocation)","v":""},null,null,"SPECIAL PROVISION:",{"$f":"IF(SpecialProvision=\"\",\"\",SpecialProvision)","v":""}]
[null,null,"MATERIAL CODE:",{"$f":"IF(Material=\"\",\"\",Material)","v":""},null,null,"GRADE:",{"$f":"IF(Grade=\"\",\"\",Grade)","v":""}]
[null,null,"MATERIAL NAME:",{"$f":"IF(matl_nm=\"\",\"\",matl_nm)","v":""}]
[null,null,"PRODUCER:",{"$f":"IF(Producer=\"\",\"\",Producer)","v":""},null,{"$f":"IF(SampleId=\"\",\"\",SampleId)","v":""},null,{"$f":"IF(SampleId=\"\",\"\",SampleId)","v":""}]
[null,null,"AREA ENGINEER:",{"$f":"IF(AreaEngineer=\"\",\"\",AreaEngineer)","v":""},null,null,"PROJECT MANAGER:",{"$f":"IF(ProjectManager=\"\",\"\",ProjectManager)","v":""}]
[]
[null,null,"COURSE\\LIFT:",{"$f":"IF(CourseLift=\"\",\"\",CourseLift)","v":""},"STATION:",{"$f":"IF(Station=\"\",\"\",Station)","v":""},null,"DIST. FROM CL:",{"$f":"IF(DistFromCL=\"\",\"\",DistFromCL)","v":""}]
[null,"Moisture-Density Work Sheet"]
[null,"Percent Cement, (%):"]
[null,"Oven Dry Weight, (g):"]
[null,"Weight of Pycnometer & Water, (g):"]
[null,"Weight of Aggr., Pycn.& Water, (g):"]
[null,"Specific Gravity (Apparent):",null,null,{"$f":"IF(ISERROR(E22/(E22+E23-E24)),\"\",E22/(E22+E23-E24))","v":""}]
[]
[null,"Hygroscopic Moisture, (%):"]
[]
[null,null,null,null,1,2,3,4]
[null,"Percent Water Content, (%):"]
[null,"Percent Cement, (%):",null,null,{"$f":"IF(OR(E30=\"\",PerCem113=\"\"),\"\",ROUND(PerCem113*2,0)/2)","v":""},{"$f":"IF(OR(F30=\"\",PerCem113=\"\"),\"\",ROUND(PerCem113*2,0)/2)","v":""},{"$f":"IF(OR(G30=\"\",PerCem113=\"\"),\"\",ROUND(PerCem113*2,0)/2)","v":""},{"$f":"IF(OR(H30=\"\",PerCem113=\"\"),\"\",ROUND(PerCem113*2,0)/2)","v":""}]
[null,"Mass Material, (lb):"]
[null,"Mass Water Added, (lb):",null,null,{"$f":"IF(OR(E30=\"\",ISERROR((E30/100)*(E32+E34))),\"\",(E30/100)*(E32+E34))","v":""},{"$f":"IF(OR(F30=\"\",ISERROR((F30/100)*(F32+F34))),\"\",(F30/100)*(F32+F34))","v":""},{"$f":"IF(OR(G30=\"\",ISERROR((G30/100)*(G32+G34))),\"\",(G30/100)*(G32+G34))","v":""},{"$f":"IF(OR(H30=\"\",ISERROR((H30/100)*(H32+H34))),\"\",(H30/100)*(H32+H34))","v":""}]
[null,"Mass Cement Added, (lb):",null,null,{"$f":"IF(OR(E30=\"\",ISERROR((N(E31)/100)*(E32-(E32*$E$27)))),\"\",(N(E31)/100)*(E32-(E32*$E$27)))","v":""},{"$f":"IF(OR(F30=\"\",ISERROR((N(F31)/100)*(F32-(F32*$E$27)))),\"\",(N(F31)/100)*(F32-(F32*$E$27)))","v":""},{"$f":"IF(OR(G30=\"\",ISERROR((N(G31)/100)*(G32-(G32*$E$27)))),\"\",(N(G31)/100)*(G32-(G32*$E$27)))","v":""},{"$f":"IF(OR(H30=\"\",ISERROR((N(H31)/100)*(H32-(H32*$E$27)))),\"\",(N(H31)/100)*(H32-(H32*$E$27)))","v":""}]
[null,"Wet Mass Specimen & Mold, (lb):"]
[null,"Tare Mass Mold, (lb):"]
[null,"Wet Mass Specimen, (lb):",null,null,{"$f":"IF(COUNTBLANK(E35:E36)=2,\"\",E35-E36)","v":""},{"$f":"IF(COUNTBLANK(F35:F36)=2,\"\",F35-F36)","v":""},{"$f":"IF(COUNTBLANK(G35:G36)=2,\"\",G35-G36)","v":""},{"$f":"IF(COUNTBLANK(H35:H36)=2,\"\",H35-H36)","v":""}]
[null,"Height of Specimen, (in.):"]
[null,"Volume per Linear mm., (in.):"]
[null,"Volume of Specimen, (ft^3):",null,null,{"$f":"IF(COUNTBLANK(E38:E39)=2,\"\",E39*E38)","v":""},{"$f":"IF(COUNTBLANK(F38:F39)=2,\"\",F39*F38)","v":""},{"$f":"IF(COUNTBLANK(G38:G39)=2,\"\",G39*G38)","v":""},{"$f":"IF(COUNTBLANK(H38:H39)=2,\"\",H39*H38)","v":""}]
[null,"Wet Density of Specimen, (lb):",null,null,{"$f":"IF(ISERROR(E37/E40),\"\",E37/E40)","v":""},{"$f":"IF(ISERROR(F37/F40),\"\",F37/F40)","v":""},{"$f":"IF(ISERROR(G37/G40),\"\",G37/G40)","v":""},{"$f":"IF(ISERROR(H37/H40),\"\",H37/H40)","v":""}]
[null,"Wet Mass of Pan & Specimen, (lb):"]
[null,"Dry Mass Pan & Specimen, (lb):"]
[null,"Tare Mass Pan, (lb):"]
[null,"Dry Mass Material , (lb):",null,null,{"$f":"IF(COUNTBLANK(E43:E44)=2,\"\",E43-E44)","v":""},{"$f":"IF(COUNTBLANK(F43:F44)=2,\"\",F43-F44)","v":""},{"$f":"IF(COUNTBLANK(G43:G44)=2,\"\",G43-G44)","v":""},{"$f":"IF(COUNTBLANK(H43:H44)=2,\"\",H43-H44)","v":""}]
[null,"Mass Water, (lb):",null,null,{"$f":"IF(COUNTBLANK(E42:E43)=2,\"\",E42-E43)","v":""},{"$f":"IF(COUNTBLANK(F42:F43)=2,\"\",F42-F43)","v":""},{"$f":"IF(COUNTBLANK(G42:G43)=2,\"\",G42-G43)","v":""},{"$f":"IF(COUNTBLANK(H42:H43)=2,\"\",H42-H43)","v":""}]
[null,"Percent Water on Total , (%):",null,null,{"$f":"IF(ISERROR((E46/E45)*100),\"\",(E46/E45)*100)","v":""},{"$f":"IF(ISERROR((F46/F45)*100),\"\",(F46/F45)*100)","v":""},{"$f":"IF(ISERROR((G46/G45)*100),\"\",(G46/G45)*100)","v":""},{"$f":"IF(ISERROR((H46/H45)*100),\"\",(H46/H45)*100)","v":""}]
[null,"Dry Density, (pcf):",null,null,{"$f":"IF(ISERROR(E41/(1+(E47/100))),\"\",E41/(1+(E47/100)))","v":""},{"$f":"IF(ISERROR(F41/(1+(F47/100))),\"\",F41/(1+(F47/100)))","v":""},{"$f":"IF(ISERROR(G41/(1+(G47/100))),\"\",G41/(1+(G47/100)))","v":""},{"$f":"IF(ISERROR(H41/(1+(H47/100))),\"\",H41/(1+(H47/100)))","v":""}]
[null,"Estimated Dry Density, (pcf):",null,null,{"$f":"IF(ISERROR(E41/(1+(E30/100))),\"\",E41/(1+(E30/100)))","v":""},{"$f":"IF(ISERROR(F41/(1+(F30/100))),\"\",F41/(1+(F30/100)))","v":""},{"$f":"IF(ISERROR(G41/(1+(G30/100))),\"\",G41/(1+(G30/100)))","v":""},{"$f":"IF(ISERROR(H41/(1+(H30/100))),\"\",H41/(1+(H30/100)))","v":""}]
[null,"Max Density, (pcf):",null,null,{"$f":"IF(ISERROR(IF(AND(E23>0,E24>0),Reference!B22,IF(H46>0,Reference!B22,\"Need SG\"))),\"\",IF(AND(E23>0,E24>0),Reference!B22,IF(H46>0,Reference!B22,\"Need SG\")))","v":""}]
[null,"Max Density, (kg/m3):",null,null,{"$f":"IF(ISERROR(E50*(0.4536/0.02832)),\"\",E50*(0.4536/0.02832))","v":""}]
[null,"Optimum Moisture, (%):",null,null,{"$f":"IF(ISERROR(Reference!B23),\"\",Reference!B23)","v":""}]
[]
[null,"Remarks:",{"$f":"NOW()","v":"2024-08-01T15:56:58.450"}]
[]
[]
[null,"Test Method:","Tested By:",null,null,"Date:"]
[null,"TX113"]
[]
[null,"Tx114"]

{"sheet":"Optimum Moisture","index":2,"n_rows":57,"n_cols":19,"rows_kept":57,"cut":false,"hidden":false,"merged":[[25,15,25,17],[41,1,41,5],[42,1,42,5],[43,1,43,5],[25,6,25,8],[25,9,25,11],[40,1,40,5],[26,9,26,11],[35,1,35,5],[36,1,36,5],[37,1,37,5],[38,1,38,5],[39,1,39,5],[26,15,26,17],[32,1,32,5],[33,1,33,5],[50,1,50,5],[44,1,44,5],[45,1,45,5],[46,1,46,5],[48,1,48,5],[49,1,49,5],[34,1,34,5],[26,6,26,8],[30,1,30,5],[31,1,31,5],[28,1,28,5],[26,1,26,5],[27,1,27,5],[11,13,11,16],[11,5,11,8],[26,12,26,14],[29,1,29,5],[16,9,16,12],[18,11,18,14],[18,15,18,16],[18,1,18,4],[18,5,18,6],[18,7,18,8],[18,9,18,10],[16,1,16,4],[16,5,16,8],[22,1,22,5],[23,1,23,5],[25,12,25,14],[13,1,13,4],[15,5,15,16],[15,1,15,4],[12,5,12,8],[13,5,13,8],[14,1,14,4],[14,5,14,16],[13,9,13,12],[13,13,13,16],[12,13,12,16],[9,1,9,4],[10,1,10,4],[10,5,10,8],[11,1,11,4],[12,1,12,4],[8,13,8,16],[7,13,7,16],[7,9,7,12],[7,1,7,4],[8,1,8,4],[10,13,10,16],[11,9,11,12],[0,0,0,2],[56,1,56,2],[56,3,56,8],[56,9,56,10],[12,9,12,12],[8,9,8,12],[9,9,9,12],[10,9,10,12],[53,1,54,16],[16,13,16,16],[9,13,9,16],[7,5,7,8],[8,5,8,8],[9,5,9,8]]}
["TxDOT Manuals >",null,null,null,"Tex-120-E"]
[null,"TEXAS DEPARTMENT OF TRANSPORTATION",null,null,null,null,null,null,null,null,null,null,null,null,null,null,null,null,242]
[null,null,null,null,null,null,null,null,null,null,null,null,null,null,null,null,null,null,1]
[null,null,null,null,null,null,null,null,null,null,null,null,null,null,null,null,null,null,"Tx120.xls::37103.638102"]
[null,"OPTIMUM MOISTURE TESTS"]
[null,"Tex-120-E : PART II"]
[]
[null,"SAMPLE ID:",null,null,null,{"$f":"IF(SampleId=\"\",\"\",SampleId)","v":""},null,null,null,"SAMPLED DATE:",null,null,null,{"$f":"IF(SampledDate=\"\",\"\",SampledDate)","v":""}]
[null,"TEST NUMBER:",null,null,null,{"$f":"IF(TestNumber=\"\",\"\",TestNumber)","v":""},null,null,null,"LETTING DATE:",null,null,null,{"$f":"IF(LettingDate=\"\",\"\",LettingDate)","v":""}]
[null,"SAMPLE STATUS:",null,null,null,{"$f":"IF(Status=\"\",\"\",Status)","v":""},null,null,null,"CONTROLLING CSJ:",null,null,null,{"$f":"IF(CCSJ=\"\",\"\",CCSJ )","v":""}]
[null,"COUNTY:",null,null,null,{"$f":"IF(County=\"\",\"\",County)","v":""},null,null,null,"SPEC YEAR:",null,null,null,{"$f":"IF(SpecYear=\"\",\"\",SpecYear)","v":""}]
[null,"SAMPLED BY:",null,null,null,{"$f":"IF(SampledBy=\"\",\"\",SampledBy)","v":""},null,null,null,"SPEC ITEM:",null,null,null,{"$f":"IF(SpecItem=\"\",\"\",SpecItem)","v":""}]
[null,"SAMPLE LOCATION:",null,null,null,{"$f":"IF(SampleLocation=\"\",\"\",SampleLocation)","v":""},null,null,null,"SPECIAL PROVISION:",null,null,null,{"$f":"IF(SpecialProvision=\"\",\"\",SpecialProvision)","v":""}]
[null,"MATERIAL CODE:",null,null,null,{"$f":"IF(Material=\"\",\"\",Material)","v":""},null,null,null,"GRADE:",null,null,null,{"$f":"IF(Grade=\"\",\"\",Grade)","v":""}]
[null,"MATERIAL NAME:",null,null,null,{"$f":"IF(matl_nm=\"\",\"\",matl_nm)","v":""}]
[null,"PRODUCER:",null,null,null,{"$f":"IF(Producer=\"\",\"\",Producer)","v":""}]
[null,"AREA ENGINEER:",null,null,null,{"$f":"IF(AreaEngineer=\"\",\"\",AreaEngineer)","v":""},null,null,null,"PROJECT MANAGER:",null,null,null,{"$f":"IF(ProjectManager=\"\",\"\",ProjectManager)","v":""}]
[]
[null,"COURSE\\LIFT:",null,null,null,{"$f":"IF(CourseLift=\"\",\"\",CourseLift)","v":""},null,"STATION:",null,{"$f":"IF(Station=\"\",\"\",Station)","v":""},null,"DIST. FROM CL:",null,null,null,{"$f":"IF(DistFromCL=\"\",\"\",DistFromCL)","v":""}]
[]
[null,"Moisture-Density Work Sheet"]
[]
[null,"Specific Gravity="]
[null,"Hygroscopic Moisture, (%):",null,null,null,null,{"$f":"IF(HygroMo=\"\",\"\",HygroMo)","v":""}]
[]
[null,null,null,null,null,null,1,null,null,2,null,null,3,null,null,4]
[null,"Percent Cement, (%)"]
[null,"Specimen Number:",null,null,null,null,"1-1","1-2","1-3","2-1","2-2","2-3","3-1","3-2","3-3","4-1","4-2","4-3"]
[null,"Percent Water Content, (%):"]
[null,"Mass Material, lbs."]
[null,"Mass Water Added, lbs.",null,null,null,null,{"$f":"IF(G32=\"\",\"\",(G30+G32)*(G29/100))","v":""},{"$f":"IF(H32=\"\",\"\",(H30+H32)*(H29/100))","v":""},{"$f":"IF(I32=\"\",\"\",(I30+I32)*(I29/100))","v":""},{"$f":"IF(J32=\"\",\"\",(J30+J32)*(J29/100))","v":""},"","","","","","","",""]
[null,"Mass Cement Added, lbs.",null,null,null,null,{"$f":"IF(PercentCement1=\"\",\"\",(PercentCement1/100)*G30)","v":""},{"$f":"IF(PercentCement1=\"\",\"\",(PercentCement1/100)*H30)","v":""},{"$f":"IF(PercentCement1=\"\",\"\",(PercentCement1/100)*I30)","v":""},{"$f":"IF(PercentCement2=\"\",\"\",(PercentCement2/100)*J30)","v":""},{"$f":"IF(PercentCement2=\"\",\"\",(PercentCement2/100)*K30)","v":""},{"$f":"IF(PercentCement2=\"\",\"\",(PercentCement2/100)*L30)","v":""},{"$f":"IF(PercentCement3=\"\",\"\",(PercentCement3/100)*M30)","v":""},{"$f":"IF(PercentCement3=\"\",\"\",(PercentCement3/100)*N30)","v":""},{"$f":"IF(PercentCement3=\"\",\"\",(PercentCement3/100)*O30)","v":""},{"$f":"IF(PercentCement4=\"\",\"\",(PercentCement4/100)*P30)","v":""},{"$f":"IF(PercentCement4=\"\",\"\",(PercentCement4/100)*Q30)","v":""},{"$f":"IF(PercentCement4=\"\",\"\",(PercentCement4/100)*R30)","v":""}]
[null,"Wet Mass Specimen & Mold,lb"]
[null,"Tare Mass Mold, lb"]
[null,"Wet Mass Specimen, lb",null,null,null,null,{"$f":"IF(COUNTBLANK(G33:G34)=2,\"\",G33-G34)","v":""},{"$f":"IF(COUNTBLANK(H33:H34)=2,\"\",H33-H34)","v":""},"","","","",{"$f":"IF(COUNTBLANK(M33:M34)=2,\"\",M33-M34)","v":""},"","","","",""]
[null,"Height of Specimen, in."]
[null,"Vol. per Linear mm.(in.)"]
[null,"Vol. of Specimen, ft^3",null,null,null,null,{"$f":"IF(COUNTBLANK(G36:G37)=2,\"\",G37*G36)","v":""},{"$f":"IF(COUNTBLANK(H36:H37)=2,\"\",H37*H36)","v":""},"","","","","","","","","",""]
[null,"Wet Density of Specimen",null,null,null,null,{"$f":"IF(ISERROR(G35/G38),\"\",G35/G38)","v":""},{"$f":"IF(ISERROR(H35/H38),\"\",H35/H38)","v":""},"","","","","","","","","",""]
[null,"Wet Mass of Pan & Specimen"]
[null,"Dry Mass Pan & Specimen,lb"]
[null,"Tare Mass Pan ,lb"]
[null,"Dry Mass Material , lb",null,null,null,null,{"$f":"IF(COUNTBLANK(G41:G42)=2,\"\",G41-G42)","v":""},{"$f":"IF(COUNTBLANK(H41:H42)=2,\"\",H41-H42)","v":""},"","","","","","","","","",""]
[null,"Mass Water,lb",null,null,null,null,{"$f":"IF(COUNTBLANK(G40:G41)=2,\"\",G40-G41)","v":""},{"$f":"IF(COUNTBLANK(H40:H41)=2,\"\",H40-H41)","v":""},"","","","","","","","","",""]
[null,"Percent Water on Total ,%",null,null,null,null,{"$f":"IF(ISERROR((G44/G43)*100),\"\",(G44/G43)*100)","v":""},{"$f":"IF(ISERROR((H44/H43)*100),\"\",(H44/H43)*100)","v":""},"","","","","","","","","",""]
[null,"Dry Density (pcf)",null,null,null,null,{"$f":"IF(ISERROR(G39/(1+(G45/100))),\"\",G39/(1+(G45/100)))","v":""},{"$f":"IF(ISERROR(H39/(1+(H45/100))),\"\",H39/(1+(H45/100)))","v":""},"","","","","","","","","",""]
[null,"Estimated Dry Density (pcf)",null,null,null,null,{"$f":"IF(ISERROR(G39/(1+(G29/100))),\"\",G39/(1+(G29/100)))","v":""},{"$f":"IF(ISERROR(H39/(1+(H29/100))),\"\",H39/(1+(H29/100)))","v":""},"","","","","","","","","",""]
[]
[null,"Max Density(pcf)",null,null,null,null,null,null,{"$f":"IF(SpecificGravity=\"\",IF(PercentCement1=\"\",\"\",\"No S.G.\"),'Reference (2)'!$B$22)","v":""},null,null,{"$f":"IF(SpecificGravity=\"\",IF(PercentCement2=\"\",\"\",\"No S.G.\"),'Reference (3)'!$B$22)","v":""},null,null,{"$f":"IF(SpecificGravity=\"\",IF(PercentCement3=\"\",\"\",\"No S.G.\"),'Reference (4)'!$B$22)","v":""},null,null,{"$f":"IF(SpecificGravity=\"\",IF(PercentCement4=\"\",\"\",\"No S.G.\"),'Reference (5)'!$B$22)","v":""}]
[null,"Max Density (kg/m3)",null,null,null,null,null,null,{"$f":"IF(ISERROR(I49*(0.4536/0.02832)),\"\",I49*(0.4536/0.02832))","v":""},null,null,{"$f":"IF(ISERROR(L49*(0.4536/0.02832)),\"\",L49*(0.4536/0.02832))","v":""},null,null,{"$f":"IF(ISERROR(O49*(0.4536/0.02832)),\"\",O49*(0.4536/0.02832))","v":""},null,null,{"$f":"IF(ISERROR(R49*(0.4536/0.02832)),\"\",R49*(0.4536/0.02832))","v":""}]
[null,"Optimum Moisture(%)",null,null,null,null,null,null,{"$f":"IF(ISERROR('Reference (2)'!$B$23),\"\",'Reference (2)'!$B$23)","v":""},null,null,{"$f":"IF(ISERROR('Reference (3)'!$B$23),\"\",'Reference (3)'!$B$23)","v":""},null,null,{"$f":"IF(ISERROR('Reference (4)'!$B$23),\"\",'Reference (4)'!$B$23)","v":""},null,null,{"$f":"IF(ISERROR('Reference (5)'!$B$23),\"\",'Reference (5)'!$B$23)","v":""}]
[]
[null,"Remarks:",null,{"$f":"NOW()","v":"2024-08-01T15:56:58.440"}]
[]
[]
[null,"Test Method:",null,"Tested By:",null,null,null,null,null,"Date:"]
[null,"TX120"]

{"sheet":"RX","index":3,"n_rows":658,"n_cols":9,"rows_kept":658,"cut":false,"hidden":true,"merged":[]}
[656]
["Fld_nbr","Value","Desc_1","Desc_2","Desc_3","Desc_4","Desc_5","Desc_6","Desc_7"]
[1,{"$f":"IF('Compressive Strength'!$B$64=\"\",\"\",'Compressive Strength'!$B$64)","v":""},{"$f":"'Compressive Strength'!$B$63","v":"Remarks:"}]
[2,{"$f":"IF('Compressive Strength'!$F$19=\"\",\"\",'Compressive Strength'!$F$19)","v":""},{"$f":"IF('Compressive Strength'!$B$19=\"\",\"\",'Compressive Strength'!$B$19)","v":"COURSE\\LIFT:"}]
[3,{"$f":"IF('Compressive Strength'!$D$73=\"\",\"\",'Compressive Strength'!$D$73)","v":""},"Tested By ",{"$f":"IF('Compressive Strength'!$B$73=\"\",\"\",'Compressive Strength'!$B$73)","v":"TX120"}]
[4,{"$f":"IF('Compressive Strength'!$J$73=\"\",\"\",'Compressive Strength'!$J$73)","v":""},"Tested Date ",{"$f":"IF('Compressive Strength'!$B$73=\"\",\"\",'Compressive Strength'!$B$73)","v":"TX120"}]
[5,{"$f":"IF('Optimum Moisture'!$D$57=\"\",\"\",'Optimum Moisture'!$D$57)","v":""},"Tested By ",{"$f":"IF('Optimum Moisture'!$B$57=\"\",\"\",'Optimum Moisture'!$B$57)","v":"TX120"}]
[6,{"$f":"IF('Optimum Moisture'!$J$57=\"\",\"\",'Optimum Moisture'!$J$57)","v":""},"Tested Date ",{"$f":"IF('Optimum Moisture'!$B$57=\"\",\"\",'Optimum Moisture'!$B$57)","v":"TX120"}]
[7,{"$f":"IF('Tex-113,4-E'!$C$58=\"\",\"\",'Tex-113,4-E'!$C$58)","v":""},"Tested By ",{"$f":"IF('Tex-113,4-E'!$B$58=\"\",\"\",'Tex-113,4-E'!$B$58)","v":"TX113"}]
[8,{"$f":"IF('Tex-113,4-E'!$F$58=\"\",\"\",'Tex-113,4-E'!$F$58)","v":""},"Tested Date ",{"$f":"IF('Tex-113,4-E'!$B$58=\"\",\"\",'Tex-113,4-E'!$B$58)","v":"TX113"}]
[9,{"$f":"IF('Tex-113,4-E'!$C$60=\"\",\"\",'Tex-113,4-E'!$C$60)","v":""},"Tested By ",{"$f":"IF('Tex-113,4-E'!$B$60=\"\",\"\",'Tex-113,4-E'!$B$60)","v":"Tx114"}]
[10,{"$f":"IF('Tex-113,4-E'!$F$60=\"\",\"\",'Tex-113,4-E'!$F$60)","v":""},"Tested Date ",{"$f":"IF('Tex-113,4-E'!$B$60=\"\",\"\",'Tex-113,4-E'!$B$60)","v":"Tx114"}]
[11,{"$f":"IF('Compressive Strength'!$F$21=\"\",\"\",'Compressive Strength'!$F$21)","v":""},{"$f":"IF('Compressive Strength'!$B$6=\"\",\"\",'Compressive Strength'!$B$6)","v":"Tex-120-E : PART I"},{"$f":"IF('Compressive Strength'!$B$21=\"\",\"\",'Compressive Strength'!$B$21)","v":"Performed By Tex-120-E:"}]
[12,{"$f":"IF('Compressive Strength'!$G$25=\"\",\"\",'Compressive Strength'!$G$25)","v":""},{"$f":"IF('Compressive Strength'!$B$6=\"\",\"\",'Compressive Strength'!$B$6)","v":"Tex-120-E : PART I"},{"$f":"IF('Compressive Strength'!$B$25=\"\",\"\",'Compressive Strength'!$B$25)","v":"Percent Cement, (%)"},{"$f":"IF('Compressive Strength'!$G$24=\"\",\"\",'Compressive Strength'!$G$24)","v":1}]
[13,{"$f":"IF('Compressive Strength'!$J$25=\"\",\"\",'Compressive Strength'!$J$25)","v":""},{"$f":"IF('Compressive Strength'!$B$6=\"\",\"\",'Compressive Strength'!$B$6)","v":"Tex-120-E : PART I"},{"$f":"IF('Compressive Strength'!$B$25=\"\",\"\",'Compressive Strength'!$B$25)","v":"Percent Cement, (%)"},{"$f":"IF('Compressive Strength'!$J$24=\"\",\"\",'Compressive Strength'!$J$24)","v":2}]
[14,{"$f":"IF('Compressive Strength'!$M$25=\"\",\"\",'Compressive Strength'!$M$25)","v":""},{"$f":"IF('Compressive Strength'!$B$6=\"\",\"\",'Compressive Strength'!$B$6)","v":"Tex-120-E : PART I"},{"$f":"IF('Compressive Strength'!$B$25=\"\",\"\",'Compressive Strength'!$B$25)","v":"Percent Cement, (%)"},{"$f":"IF('Compressive Strength'!$M$24=\"\",\"\",'Compressive Strength'!$M$24)","v":3}]
[15,{"$f":"IF('Compressive Strength'!$P$25=\"\",\"\",'Compressive Strength'!$P$25)","v":""},{"$f":"IF('Compressive Strength'!$B$6=\"\",\"\",'Compressive Strength'!$B$6)","v":"Tex-120-E : PART I"},{"$f":"IF('Compressive Strength'!$B$25=\"\",\"\",'Compressive Strength'!$B$25)","v":"Percent Cement, (%)"},{"$f":"IF('Compressive Strength'!$P$24=\"\",\"\",'Compressive Strength'!$P$24)","v":4}]
[16,{"$f":"IF('Compressive Strength'!$G$27=\"\",\"\",'Compressive Strength'!$G$27)","v":""},{"$f":"IF('Compressive Strength'!$B$6=\"\",\"\",'Compressive Strength'!$B$6)","v":"Tex-120-E : PART I"},{"$f":"IF('Compressive Strength'!$B$27=\"\",\"\",'Compressive Strength'!$B$27)","v":"Initial Height of Specimen, in.:"},{"$f":"IF('Compressive Strength'!$G$24=\"\",\"\",'Compressive Strength'!$G$24)","v":1},{"$f":"IF('Compressive Strength'!$G$26=\"\",\"\",'Compressive Strength'!$G$26)","v":"1-1"}]
[17,{"$f":"IF('Compressive Strength'!$H$27=\"\",\"\",'Compressive Strength'!$H$27)","v":""},{"$f":"IF('Compressive Strength'!$B$6=\"\",\"\",'Compressive Strength'!$B$6)","v":"Tex-120-E : PART I"},{"$f":"IF('Compressive Strength'!$B$27=\"\",\"\",'Compressive Strength'!$B$27)","v":"Initial Height of Specimen, in.:"},{"$f":"IF('Compressive Strength'!$G$24=\"\",\"\",'Compressive Strength'!$G$24)","v":1},{"$f":"IF('Compressive Strength'!$H$26=\"\",\"\",'Compressive Strength'!$H$26)","v":"1-2"}]
[18,{"$f":"IF('Compressive Strength'!$I$27=\"\",\"\",'Compressive Strength'!$I$27)","v":""},{"$f":"IF('Compressive Strength'!$B$6=\"\",\"\",'Compressive Strength'!$B$6)","v":"Tex-120-E : PART I"},{"$f":"IF('Compressive Strength'!$B$27=\"\",\"\",'Compressive Strength'!$B$27)","v":"Initial Height of Specimen, in.:"},{"$f":"IF('Compressive Strength'!$G$24=\"\",\"\",'Compressive Strength'!$G$24)","v":1},{"$f":"IF('Compressive Strength'!$I$26=\"\",\"\",'Compressive Strength'!$I$26)","v":"1-3"}]
[19,{"$f":"IF('Compressive Strength'!$J$27=\"\",\"\",'Compressive Strength'!$J$27)","v":""},{"$f":"IF('Compressive Strength'!$B$6=\"\",\"\",'Compressive Strength'!$B$6)","v":"Tex-120-E : PART I"},{"$f":"IF('Compressive Strength'!$B$27=\"\",\"\",'Compressive Strength'!$B$27)","v":"Initial Height of Specimen, in.:"},{"$f":"IF('Compressive Strength'!$J$24=\"\",\"\",'Compressive Strength'!$J$24)","v":2},{"$f":"IF('Compressive Strength'!$J$26=\"\",\"\",'Compressive Strength'!$J$26)","v":"2-1"}]
[20,{"$f":"IF('Compressive Strength'!$K$27=\"\",\"\",'Compressive Strength'!$K$27)","v":""},{"$f":"IF('Compressive Strength'!$B$6=\"\",\"\",'Compressive Strength'!$B$6)","v":"Tex-120-E : PART I"},{"$f":"IF('Compressive Strength'!$B$27=\"\",\"\",'Compressive Strength'!$B$27)","v":"Initial Height of Specimen, in.:"},{"$f":"IF('Compressive Strength'!$J$24=\"\",\"\",'Compressive Strength'!$J$24)","v":2},{"$f":"IF('Compressive Strength'!$K$26=\"\",\"\",'Compressive Strength'!$K$26)","v":"2-2"}]
[21,{"$f":"IF('Compressive Strength'!$L$27=\"\",\"\",'Compressive Strength'!$L$27)","v":""},{"$f":"IF('Compressive Strength'!$B$6=\"\",\"\",'Compressive Strength'!$B$6)","v":"Tex-120-E : PART I"},{"$f":"IF('Compressive Strength'!$B$27=\"\",\"\",'Compressive Strength'!$B$27)","v":"Initial Height of Specimen, in.:"},{"$f":"IF('Compressive Strength'!$J$24=\"\",\"\",'Compressive Strength'!$J$24)","v":2},{"$f":"IF('Compressive Strength'!$L$26=\"\",\"\",'Compressive Strength'!$L$26)","v":"2-3"}]
[22,{"$f":"IF('Compressive Strength'!$M$27=\"\",\"\",'Compressive Strength'!$M$27)","v":""},{"$f":"IF('Compressive Strength'!$B$6=\"\",\"\",'Compressive Strength'!$B$6)","v":"Tex-120-E : PART I"},{"$f":"IF('Compressive Strength'!$B$27=\"\",\"\",'Compressive Strength'!$B$27)","v":"Initial Height of Specimen, in.:"},{"$f":"IF('Compressive Strength'!$M$24=\"\",\"\",'Compressive Strength'!$M$24)","v":3},{"$f":"IF('Compressive Strength'!$M$26=\"\",\"\",'Compressive Strength'!$M$26)","v":"3-1"}]
[23,{"$f":"IF('Compressive Strength'!$N$27=\"\",\"\",'Compressive Strength'!$N$27)","v":""},{"$f":"IF('Compressive Strength'!$B$6=\"\",\"\",'Compressive Strength'!$B$6)","v":"Tex-120-E : PART I"},{"$f":"IF('Compressive Strength'!$B$27=\"\",\"\",'Compressive Strength'!$B$27)","v":"Initial Height of Specimen, in.:"},{"$f":"IF('Compressive Strength'!$M$24=\"\",\"\",'Compressive Strength'!$M$24)","v":3},{"$f":"IF('Compressive Strength'!$N$26=\"\",\"\",'Compressive Strength'!$N$26)","v":"3-2"}]
[24,{"$f":"IF('Compressive Strength'!$O$27=\"\",\"\",'Compressive Strength'!$O$27)","v":""},{"$f":"IF('Compressive Strength'!$B$6=\"\",\"\",'Compressive Strength'!$B$6)","v":"Tex-120-E : PART I"},{"$f":"IF('Compressive Strength'!$B$27=\"\",\"\",'Compressive Strength'!$B$27)","v":"Initial Height of Specimen, in.:"},{"$f":"IF('Compressive Strength'!$M$24=\"\",\"\",'Compressive Strength'!$M$24)","v":3},{"$f":"IF('Compressive Strength'!$O$26=\"\",\"\",'Compressive Strength'!$O$26)","v":"3-3"}]
[25,{"$f":"IF('Compressive Strength'!$P$27=\"\",\"\",'Compressive Strength'!$P$27)","v":""},{"$f":"IF('Compressive Strength'!$B$6=\"\",\"\",'Compressive Strength'!$B$6)","v":"Tex-120-E : PART I"},{"$f":"IF('Compressive Strength'!$B$27=\"\",\"\",'Compressive Strength'!$B$27)","v":"Initial Height of Specimen, in.:"},{"$f":"IF('Compressive Strength'!$P$24=\"\",\"\",'Compressive Strength'!$P$24)","v":4},{"$f":"IF('Compressive Strength'!$P$26=\"\",\"\",'Compressive Strength'!$P$26)","v":"4-1"}]
[26,{"$f":"IF('Compressive Strength'!$Q$27=\"\",\"\",'Compressive Strength'!$Q$27)","v":""},{"$f":"IF('Compressive Strength'!$B$6=\"\",\"\",'Compressive Strength'!$B$6)","v":"Tex-120-E : PART I"},{"$f":"IF('Compressive Strength'!$B$27=\"\",\"\",'Compressive Strength'!$B$27)","v":"Initial Height of Specimen, in.:"},{"$f":"IF('Compressive Strength'!$P$24=\"\",\"\",'Compressive Strength'!$P$24)","v":4},{"$f":"IF('Compressive Strength'!$Q$26=\"\",\"\",'Compressive Strength'!$Q$26)","v":"4-2"}]
[27,{"$f":"IF('Compressive Strength'!$R$27=\"\",\"\",'Compressive Strength'!$R$27)","v":""},{"$f":"IF('Compressive Strength'!$B$6=\"\",\"\",'Compressive Strength'!$B$6)","v":"Tex-120-E : PART I"},{"$f":"IF('Compressive Strength'!$B$27=\"\",\"\",'Compressive Strength'!$B$27)","v":"Initial Height of Specimen, in.:"},{"$f":"IF('Compressive Strength'!$P$24=\"\",\"\",'Compressive Strength'!$P$24)","v":4},{"$f":"IF('Compressive Strength'!$R$26=\"\",\"\",'Compressive Strength'!$R$26)","v":"4-3"}]
[28,{"$f":"IF('Compressive Strength'!$G$28=\"\",\"\",'Compressive Strength'!$G$28)","v":""},{"$f":"IF('Compressive Strength'!$B$6=\"\",\"\",'Compressive Strength'!$B$6)","v":"Tex-120-E : PART I"},{"$f":"IF('Compressive Strength'!$B$28=\"\",\"\",'Compressive Strength'!$B$28)","v":"Height of Stone 1, in."},{"$f":"IF('Compressive Strength'!$G$24=\"\",\"\",'Compressive Strength'!$G$24)","v":1},{"$f":"IF('Compressive Strength'!$G$26=\"\",\"\",'Compressive Strength'!$G$26)","v":"1-1"}]
[29,{"$f":"IF('Compressive Strength'!$H$28=\"\",\"\",'Compressive Strength'!$H$28)","v":""},{"$f":"IF('Compressive Strength'!$B$6=\"\",\"\",'Compressive Strength'!$B$6)","v":"Tex-120-E : PART I"},{"$f":"IF('Compressive Strength'!$B$28=\"\",\"\",'Compressive Strength'!$B$28)","v":"Height of Stone 1, in."},{"$f":"IF('Compressive Strength'!$G$24=\"\",\"\",'Compressive Strength'!$G$24)","v":1},{"$f":"IF('Compressive Strength'!$H$26=\"\",\"\",'Compressive Strength'!$H$26)","v":"1-2"}]
[30,{"$f":"IF('Compressive Strength'!$I$28=\"\",\"\",'Compressive Strength'!$I$28)","v":""},{"$f":"IF('Compressive Strength'!$B$6=\"\",\"\",'Compressive Strength'!$B$6)","v":"Tex-120-E : PART I"},{"$f":"IF('Compressive Strength'!$B$28=\"\",\"\",'Compressive Strength'!$B$28)","v":"Height of Stone 1, in."},{"$f":"IF('Compressive Strength'!$G$24=\"\",\"\",'Compressive Strength'!$G$24)","v":1},{"$f":"IF('Compressive Strength'!$I$26=\"\",\"\",'Compressive Strength'!$I$26)","v":"1-3"}]
[31,{"$f":"IF('Compressive Strength'!$J$28=\"\",\"\",'Compressive Strength'!$J$28)","v":""},{"$f":"IF('Compressive Strength'!$B$6=\"\",\"\",'Compressive Strength'!$B$6)","v":"Tex-120-E : PART I"},{"$f":"IF('Compressive Strength'!$B$28=\"\",\"\",'Compressive Strength'!$B$28)","v":"Height of Stone 1, in."},{"$f":"IF('Compressive Strength'!$J$24=\"\",\"\",'Compressive Strength'!$J$24)","v":2},{"$f":"IF('Compressive Strength'!$J$26=\"\",\"\",'Compressive Strength'!$J$26)","v":"2-1"}]
[32,{"$f":"IF('Compressive Strength'!$K$28=\"\",\"\",'Compressive Strength'!$K$28)","v":""},{"$f":"IF('Compressive Strength'!$B$6=\"\",\"\",'Compressive Strength'!$B$6)","v":"Tex-120-E : PART I"},{"$f":"IF('Compressive Strength'!$B$28=\"\",\"\",'Compressive Strength'!$B$28)","v":"Height of Stone 1, in."},{"$f":"IF('Compressive Strength'!$J$24=\"\",\"\",'Compressive Strength'!$J$24)","v":2},{"$f":"IF('Compressive Strength'!$K$26=\"\",\"\",'Compressive Strength'!$K$26)","v":"2-2"}]
[33,{"$f":"IF('Compressive Strength'!$L$28=\"\",\"\",'Compressive Strength'!$L$28)","v":""},{"$f":"IF('Compressive Strength'!$B$6=\"\",\"\",'Compressive Strength'!$B$6)","v":"Tex-120-E : PART I"},{"$f":"IF('Compressive Strength'!$B$28=\"\",\"\",'Compressive Strength'!$B$28)","v":"Height of Stone 1, in."},{"$f":"IF('Compressive Strength'!$J$24=\"\",\"\",'Compressive Strength'!$J$24)","v":2},{"$f":"IF('Compressive Strength'!$L$26=\"\",\"\",'Compressive Strength'!$L$26)","v":"2-3"}]
[34,{"$f":"IF('Compressive Strength'!$M$28=\"\",\"\",'Compressive Strength'!$M$28)","v":""},{"$f":"IF('Compressive Strength'!$B$6=\"\",\"\",'Compressive Strength'!$B$6)","v":"Tex-120-E : PART I"},{"$f":"IF('Compressive Strength'!$B$28=\"\",\"\",'Compressive Strength'!$B$28)","v":"Height of Stone 1, in."},{"$f":"IF('Compressive Strength'!$M$24=\"\",\"\",'Compressive Strength'!$M$24)","v":3},{"$f":"IF('Compressive Strength'!$M$26=\"\",\"\",'Compressive Strength'!$M$26)","v":"3-1"}]
[35,{"$f":"IF('Compressive Strength'!$N$28=\"\",\"\",'Compressive Strength'!$N$28)","v":""},{"$f":"IF('Compressive Strength'!$B$6=\"\",\"\",'Compressive Strength'!$B$6)","v":"Tex-120-E : PART I"},{"$f":"IF('Compressive Strength'!$B$28=\"\",\"\",'Compressive Strength'!$B$28)","v":"Height of Stone 1, in."},{"$f":"IF('Compressive Strength'!$M$24=\"\",\"\",'Compressive Strength'!$M$24)","v":3},{"$f":"IF('Compressive Strength'!$N$26=\"\",\"\",'Compressive Strength'!$N$26)","v":"3-2"}]
[36,{"$f":"IF('Compressive Strength'!$O$28=\"\",\"\",'Compressive Strength'!$O$28)","v":""},{"$f":"IF('Compressive Strength'!$B$6=\"\",\"\",'Compressive Strength'!$B$6)","v":"Tex-120-E : PART I"},{"$f":"IF('Compressive Strength'!$B$28=\"\",\"\",'Compressive Strength'!$B$28)","v":"Height of Stone 1, in."},{"$f":"IF('Compressive Strength'!$M$24=\"\",\"\",'Compressive Strength'!$M$24)","v":3},{"$f":"IF('Compressive Strength'!$O$26=\"\",\"\",'Compressive Strength'!$O$26)","v":"3-3"}]
[37,{"$f":"IF('Compressive Strength'!$P$28=\"\",\"\",'Compressive Strength'!$P$28)","v":""},{"$f":"IF('Compressive Strength'!$B$6=\"\",\"\",'Compressive Strength'!$B$6)","v":"Tex-120-E : PART I"},{"$f":"IF('Compressive Strength'!$B$28=\"\",\"\",'Compressive Strength'!$B$28)","v":"Height of Stone 1, in."},{"$f":"IF('Compressive Strength'!$P$24=\"\",\"\",'Compressive Strength'!$P$24)","v":4},{"$f":"IF('Compressive Strength'!$P$26=\"\",\"\",'Compressive Strength'!$P$26)","v":"4-1"}]
[38,{"$f":"IF('Compressive Strength'!$Q$28=\"\",\"\",'Compressive Strength'!$Q$28)","v":""},{"$f":"IF('Compressive Strength'!$B$6=\"\",\"\",'Compressive Strength'!$B$6)","v":"Tex-120-E : PART I"},{"$f":"IF('Compressive Strength'!$B$28=\"\",\"\",'Compressive Strength'!$B$28)","v":"Height of Stone 1, in."},{"$f":"IF('Compressive Strength'!$P$24=\"\",\"\",'Compressive Strength'!$P$24)","v":4},{"$f":"IF('Compressive Strength'!$Q$26=\"\",\"\",'Compressive Strength'!$Q$26)","v":"4-2"}]
[39,{"$f":"IF('Compressive Strength'!$R$28=\"\",\"\",'Compressive Strength'!$R$28)","v":""},{"$f":"IF('Compressive Strength'!$B$6=\"\",\"\",'Compressive Strength'!$B$6)","v":"Tex-120-E : PART I"},{"$f":"IF('Compressive Strength'!$B$28=\"\",\"\",'Compressive Strength'!$B$28)","v":"Height of Stone 1, in."},{"$f":"IF('Compressive Strength'!$P$24=\"\",\"\",'Compressive Strength'!$P$24)","v":4},{"$f":"IF('Compressive Strength'!$R$26=\"\",\"\",'Compressive Strength'!$R$26)","v":"4-3"}]
[40,{"$f":"IF('Compressive Strength'!$G$29=\"\",\"\",'Compressive Strength'!$G$29)","v":""},{"$f":"IF('Compressive Strength'!$B$6=\"\",\"\",'Compressive Strength'!$B$6)","v":"Tex-120-E : PART I"},{"$f":"IF('Compressive Strength'!$B$29=\"\",\"\",'Compressive Strength'!$B$29)","v":"Height of Stone 2, in."},{"$f":"IF('Compressive Strength'!$G$24=\"\",\"\",'Compressive Strength'!$G$24)","v":1},{"$f":"IF('Compressive Strength'!$G$26=\"\",\"\",'Compressive Strength'!$G$26)","v":"1-1"}]
[41,{"$f":"IF('Compressive Strength'!$H$29=\"\",\"\",'Compressive Strength'!$H$29)","v":""},{"$f":"IF('Compressive Strength'!$B$6=\"\",\"\",'Compressive Strength'!$B$6)","v":"Tex-120-E : PART I"},{"$f":"IF('Compressive Strength'!$B$29=\"\",\"\",'Compressive Strength'!$B$29)","v":"Height of Stone 2, in."},{"$f":"IF('Compressive Strength'!$G$24=\"\",\"\",'Compressive Strength'!$G$24)","v":1},{"$f":"IF('Compressive Strength'!$H$26=\"\",\"\",'Compressive Strength'!$H$26)","v":"1-2"}]
[42,{"$f":"IF('Compressive Strength'!$I$29=\"\",\"\",'Compressive Strength'!$I$29)","v":""},{"$f":"IF('Compressive Strength'!$B$6=\"\",\"\",'Compressive Strength'!$B$6)","v":"Tex-120-E : PART I"},{"$f":"IF('Compressive Strength'!$B$29=\"\",\"\",'Compressive Strength'!$B$29)","v":"Height of Stone 2, in."},{"$f":"IF('Compressive Strength'!$G$24=\"\",\"\",'Compressive Strength'!$G$24)","v":1},{"$f":"IF('Compressive Strength'!$I$26=\"\",\"\",'Compressive Strength'!$I$26)","v":"1-3"}]
[43,{"$f":"IF('Compressive Strength'!$J$29=\"\",\"\",'Compressive Strength'!$J$29)","v":""},{"$f":"IF('Compressive Strength'!$B$6=\"\",\"\",'Compressive Strength'!$B$6)","v":"Tex-120-E : PART I"},{"$f":"IF('Compressive Strength'!$B$29=\"\",\"\",'Compressive Strength'!$B$29)","v":"Height of Stone 2, in."},{"$f":"IF('Compressive Strength'!$J$24=\"\",\"\",'Compressive Strength'!$J$24)","v":2},{"$f":"IF('Compressive Strength'!$J$26=\"\",\"\",'Compressive Strength'!$J$26)","v":"2-1"}]
[44,{"$f":"IF('Compressive Strength'!$K$29=\"\",\"\",'Compressive Strength'!$K$29)","v":""},{"$f":"IF('Compressive Strength'!$B$6=\"\",\"\",'Compressive Strength'!$B$6)","v":"Tex-120-E : PART I"},{"$f":"IF('Compressive Strength'!$B$29=\"\",\"\",'Compressive Strength'!$B$29)","v":"Height of Stone 2, in."},{"$f":"IF('Compressive Strength'!$J$24=\"\",\"\",'Compressive Strength'!$J$24)","v":2},{"$f":"IF('Compressive Strength'!$K$26=\"\",\"\",'Compressive Strength'!$K$26)","v":"2-2"}]
[45,{"$f":"IF('Compressive Strength'!$L$29=\"\",\"\",'Compressive Strength'!$L$29)","v":""},{"$f":"IF('Compressive Strength'!$B$6=\"\",\"\",'Compressive Strength'!$B$6)","v":"Tex-120-E : PART I"},{"$f":"IF('Compressive Strength'!$B$29=\"\",\"\",'Compressive Strength'!$B$29)","v":"Height of Stone 2, in."},{"$f":"IF('Compressive Strength'!$J$24=\"\",\"\",'Compressive Strength'!$J$24)","v":2},{"$f":"IF('Compressive Strength'!$L$26=\"\",\"\",'Compressive Strength'!$L$26)","v":"2-3"}]
[46,{"$f":"IF('Compressive Strength'!$M$29=\"\",\"\",'Compressive Strength'!$M$29)","v":""},{"$f":"IF('Compressive Strength'!$B$6=\"\",\"\",'Compressive Strength'!$B$6)","v":"Tex-120-E : PART I"},{"$f":"IF('Compressive Strength'!$B$29=\"\",\"\",'Compressive Strength'!$B$29)","v":"Height of Stone 2, in."},{"$f":"IF('Compressive Strength'!$M$24=\"\",\"\",'Compressive Strength'!$M$24)","v":3},{"$f":"IF('Compressive Strength'!$M$26=\"\",\"\",'Compressive Strength'!$M$26)","v":"3-1"}]
[47,{"$f":"IF('Compressive Strength'!$N$29=\"\",\"\",'Compressive Strength'!$N$29)","v":""},{"$f":"IF('Compressive Strength'!$B$6=\"\",\"\",'Compressive Strength'!$B$6)","v":"Tex-120-E : PART I"},{"$f":"IF('Compressive Strength'!$B$29=\"\",\"\",'Compressive Strength'!$B$29)","v":"Height of Stone 2, in."},{"$f":"IF('Compressive Strength'!$M$24=\"\",\"\",'Compressive Strength'!$M$24)","v":3},{"$f":"IF('Compressive Strength'!$N$26=\"\",\"\",'Compressive Strength'!$N$26)","v":"3-2"}]
[48,{"$f":"IF('Compressive Strength'!$O$29=\"\",\"\",'Compressive Strength'!$O$29)","v":""},{"$f":"IF('Compressive Strength'!$B$6=\"\",\"\",'Compressive Strength'!$B$6)","v":"Tex-120-E : PART I"},{"$f":"IF('Compressive Strength'!$B$29=\"\",\"\",'Compressive Strength'!$B$29)","v":"Height of Stone 2, in."},{"$f":"IF('Compressive Strength'!$M$24=\"\",\"\",'Compressive Strength'!$M$24)","v":3},{"$f":"IF('Compressive Strength'!$O$26=\"\",\"\",'Compressive Strength'!$O$26)","v":"3-3"}]
[49,{"$f":"IF('Compressive Strength'!$P$29=\"\",\"\",'Compressive Strength'!$P$29)","v":""},{"$f":"IF('Compressive Strength'!$B$6=\"\",\"\",'Compressive Strength'!$B$6)","v":"Tex-120-E : PART I"},{"$f":"IF('Compressive Strength'!$B$29=\"\",\"\",'Compressive Strength'!$B$29)","v":"Height of Stone 2, in."},{"$f":"IF('Compressive Strength'!$P$24=\"\",\"\",'Compressive Strength'!$P$24)","v":4},{"$f":"IF('Compressive Strength'!$P$26=\"\",\"\",'Compressive Strength'!$P$26)","v":"4-1"}]
[50,{"$f":"IF('Compressive Strength'!$Q$29=\"\",\"\",'Compressive Strength'!$Q$29)","v":""},{"$f":"IF('Compressive Strength'!$B$6=\"\",\"\",'Compressive Strength'!$B$6)","v":"Tex-120-E : PART I"},{"$f":"IF('Compressive Strength'!$B$29=\"\",\"\",'Compressive Strength'!$B$29)","v":"Height of Stone 2, in."},{"$f":"IF('Compressive Strength'!$P$24=\"\",\"\",'Compressive Strength'!$P$24)","v":4},{"$f":"IF('Compressive Strength'!$Q$26=\"\",\"\",'Compressive Strength'!$Q$26)","v":"4-2"}]
[51,{"$f":"IF('Compressive Strength'!$R$29=\"\",\"\",'Compressive Strength'!$R$29)","v":""},{"$f":"IF('Compressive Strength'!$B$6=\"\",\"\",'Compressive Strength'!$B$6)","v":"Tex-120-E : PART I"},{"$f":"IF('Compressive Strength'!$B$29=\"\",\"\",'Compressive Strength'!$B$29)","v":"Height of Stone 2, in."},{"$f":"IF('Compressive Strength'!$P$24=\"\",\"\",'Compressive Strength'!$P$24)","v":4},{"$f":"IF('Compressive Strength'!$R$26=\"\",\"\",'Compressive Strength'!$R$26)","v":"4-3"}]
[52,{"$f":"IF('Compressive Strength'!$G$30=\"\",\"\",'Compressive Strength'!$G$30)","v":""},{"$f":"IF('Compressive Strength'!$B$6=\"\",\"\",'Compressive Strength'!$B$6)","v":"Tex-120-E : PART I"},{"$f":"IF('Compressive Strength'!$B$30=\"\",\"\",'Compressive Strength'!$B$30)","v":"New Height of Specimen, in.:"},{"$f":"IF('Compressive Strength'!$G$24=\"\",\"\",'Compressive Strength'!$G$24)","v":1},{"$f":"IF('Compressive Strength'!$G$26=\"\",\"\",'Compressive Strength'!$G$26)","v":"1-1"}]
[53,{"$f":"IF('Compressive Strength'!$H$30=\"\",\"\",'Compressive Strength'!$H$30)","v":""},{"$f":"IF('Compressive Strength'!$B$6=\"\",\"\",'Compressive Strength'!$B$6)","v":"Tex-120-E : PART I"},{"$f":"IF('Compressive Strength'!$B$30=\"\",\"\",'Compressive Strength'!$B$30)","v":"New Height of Specimen, in.:"},{"$f":"IF('Compressive Strength'!$G$24=\"\",\"\",'Compressive Strength'!$G$24)","v":1},{"$f":"IF('Compressive Strength'!$H$26=\"\",\"\",'Compressive Strength'!$H$26)","v":"1-2"}]
[54,{"$f":"IF('Compressive Strength'!$I$30=\"\",\"\",'Compressive Strength'!$I$30)","v":""},{"$f":"IF('Compressive Strength'!$B$6=\"\",\"\",'Compressive Strength'!$B$6)","v":"Tex-120-E : PART I"},{"$f":"IF('Compressive Strength'!$B$30=\"\",\"\",'Compressive Strength'!$B$30)","v":"New Height of Specimen, in.:"},{"$f":"IF('Compressive Strength'!$G$24=\"\",\"\",'Compressive Strength'!$G$24)","v":1},{"$f":"IF('Compressive Strength'!$I$26=\"\",\"\",'Compressive Strength'!$I$26)","v":"1-3"}]
[55,{"$f":"IF('Compressive Strength'!$J$30=\"\",\"\",'Compressive Strength'!$J$30)","v":""},{"$f":"IF('Compressive Strength'!$B$6=\"\",\"\",'Compressive Strength'!$B$6)","v":"Tex-120-E : PART I"},{"$f":"IF('Compressive Strength'!$B$30=\"\",\"\",'Compressive Strength'!$B$30)","v":"New Height of Specimen, in.:"},{"$f":"IF('Compressive Strength'!$J$24=\"\",\"\",'Compressive Strength'!$J$24)","v":2},{"$f":"IF('Compressive Strength'!$J$26=\"\",\"\",'Compressive Strength'!$J$26)","v":"2-1"}]
[56,{"$f":"IF('Compressive Strength'!$K$30=\"\",\"\",'Compressive Strength'!$K$30)","v":""},{"$f":"IF('Compressive Strength'!$B$6=\"\",\"\",'Compressive Strength'!$B$6)","v":"Tex-120-E : PART I"},{"$f":"IF('Compressive Strength'!$B$30=\"\",\"\",'Compressive Strength'!$B$30)","v":"New Height of Specimen, in.:"},{"$f":"IF('Compressive Strength'!$J$24=\"\",\"\",'Compressive Strength'!$J$24)","v":2},{"$f":"IF('Compressive Strength'!$K$26=\"\",\"\",'Compressive Strength'!$K$26)","v":"2-2"}]
[57,{"$f":"IF('Compressive Strength'!$L$30=\"\",\"\",'Compressive Strength'!$L$30)","v":""},{"$f":"IF('Compressive Strength'!$B$6=\"\",\"\",'Compressive Strength'!$B$6)","v":"Tex-120-E : PART I"},{"$f":"IF('Compressive Strength'!$B$30=\"\",\"\",'Compressive Strength'!$B$30)","v":"New Height of Specimen, in.:"},{"$f":"IF('Compressive Strength'!$J$24=\"\",\"\",'Compressive Strength'!$J$24)","v":2},{"$f":"IF('Compressive Strength'!$L$26=\"\",\"\",'Compressive Strength'!$L$26)","v":"2-3"}]
[58,{"$f":"IF('Compressive Strength'!$M$30=\"\",\"\",'Compressive Strength'!$M$30)","v":""},{"$f":"IF('Compressive Strength'!$B$6=\"\",\"\",'Compressive Strength'!$B$6)","v":"Tex-120-E : PART I"},{"$f":"IF('Compressive Strength'!$B$30=\"\",\"\",'Compressive Strength'!$B$30)","v":"New Height of Specimen, in.:"},{"$f":"IF('Compressive Strength'!$M$24=\"\",\"\",'Compressive Strength'!$M$24)","v":3},{"$f":"IF('Compressive Strength'!$M$26=\"\",\"\",'Compressive Strength'!$M$26)","v":"3-1"}]
[59,{"$f":"IF('Compressive Strength'!$N$30=\"\",\"\",'Compressive Strength'!$N$30)","v":""},{"$f":"IF('Compressive Strength'!$B$6=\"\",\"\",'Compressive Strength'!$B$6)","v":"Tex-120-E : PART I"},{"$f":"IF('Compressive Strength'!$B$30=\"\",\"\",'Compressive Strength'!$B$30)","v":"New Height of Specimen, in.:"},{"$f":"IF('Compressive Strength'!$M$24=\"\",\"\",'Compressive Strength'!$M$24)","v":3},{"$f":"IF('Compressive Strength'!$N$26=\"\",\"\",'Compressive Strength'!$N$26)","v":"3-2"}]
[60,{"$f":"IF('Compressive Strength'!$O$30=\"\",\"\",'Compressive Strength'!$O$30)","v":""},{"$f":"IF('Compressive Strength'!$B$6=\"\",\"\",'Compressive Strength'!$B$6)","v":"Tex-120-E : PART I"},{"$f":"IF('Compressive Strength'!$B$30=\"\",\"\",'Compressive Strength'!$B$30)","v":"New Height of Specimen, in.:"},{"$f":"IF('Compressive Strength'!$M$24=\"\",\"\",'Compressive Strength'!$M$24)","v":3},{"$f":"IF('Compressive Strength'!$O$26=\"\",\"\",'Compressive Strength'!$O$26)","v":"3-3"}]
[61,{"$f":"IF('Compressive Strength'!$P$30=\"\",\"\",'Compressive Strength'!$P$30)","v":""},{"$f":"IF('Compressive Strength'!$B$6=\"\",\"\",'Compressive Strength'!$B$6)","v":"Tex-120-E : PART I"},{"$f":"IF('Compressive Strength'!$B$30=\"\",\"\",'Compressive Strength'!$B$30)","v":"New Height of Specimen, in.:"},{"$f":"IF('Compressive Strength'!$P$24=\"\",\"\",'Compressive Strength'!$P$24)","v":4},{"$f":"IF('Compressive Strength'!$P$26=\"\",\"\",'Compressive Strength'!$P$26)","v":"4-1"}]
[62,{"$f":"IF('Compressive Strength'!$Q$30=\"\",\"\",'Compressive Strength'!$Q$30)","v":""},{"$f":"IF('Compressive Strength'!$B$6=\"\",\"\",'Compressive Strength'!$B$6)","v":"Tex-120-E : PART I"},{"$f":"IF('Compressive Strength'!$B$30=\"\",\"\",'Compressive Strength'!$B$30)","v":"New Height of Specimen, in.:"},{"$f":"IF('Compressive Strength'!$P$24=\"\",\"\",'Compressive Strength'!$P$24)","v":4},{"$f":"IF('Compressive Strength'!$Q$26=\"\",\"\",'Compressive Strength'!$Q$26)","v":"4-2"}]
[63,{"$f":"IF('Compressive Strength'!$R$30=\"\",\"\",'Compressive Strength'!$R$30)","v":""},{"$f":"IF('Compressive Strength'!$B$6=\"\",\"\",'Compressive Strength'!$B$6)","v":"Tex-120-E : PART I"},{"$f":"IF('Compressive Strength'!$B$30=\"\",\"\",'Compressive Strength'!$B$30)","v":"New Height of Specimen, in.:"},{"$f":"IF('Compressive Strength'!$P$24=\"\",\"\",'Compressive Strength'!$P$24)","v":4},{"$f":"IF('Compressive Strength'!$R$26=\"\",\"\",'Compressive Strength'!$R$26)","v":"4-3"}]
[64,{"$f":"IF('Compressive Strength'!$G$31=\"\",\"\",'Compressive Strength'!$G$31)","v":""},{"$f":"IF('Compressive Strength'!$B$6=\"\",\"\",'Compressive Strength'!$B$6)","v":"Tex-120-E : PART I"},{"$f":"IF('Compressive Strength'!$B$31=\"\",\"\",'Compressive Strength'!$B$31)","v":"Average Diameter, in.:"},{"$f":"IF('Compressive Strength'!$G$24=\"\",\"\",'Compressive Strength'!$G$24)","v":1},{"$f":"IF('Compressive Strength'!$G$26=\"\",\"\",'Compressive Strength'!$G$26)","v":"1-1"}]
[65,{"$f":"IF('Compressive Strength'!$H$31=\"\",\"\",'Compressive Strength'!$H$31)","v":""},{"$f":"IF('Compressive Strength'!$B$6=\"\",\"\",'Compressive Strength'!$B$6)","v":"Tex-120-E : PART I"},{"$f":"IF('Compressive Strength'!$B$31=\"\",\"\",'Compressive Strength'!$B$31)","v":"Average Diameter, in.:"},{"$f":"IF('Compressive Strength'!$G$24=\"\",\"\",'Compressive Strength'!$G$24)","v":1},{"$f":"IF('Compressive Strength'!$H$26=\"\",\"\",'Compressive Strength'!$H$26)","v":"1-2"}]
[66,{"$f":"IF('Compressive Strength'!$I$31=\"\",\"\",'Compressive Strength'!$I$31)","v":""},{"$f":"IF('Compressive Strength'!$B$6=\"\",\"\",'Compressive Strength'!$B$6)","v":"Tex-120-E : PART I"},{"$f":"IF('Compressive Strength'!$B$31=\"\",\"\",'Compressive Strength'!$B$31)","v":"Average Diameter, in.:"},{"$f":"IF('Compressive Strength'!$G$24=\"\",\"\",'Compressive Strength'!$G$24)","v":1},{"$f":"IF('Compressive Strength'!$I$26=\"\",\"\",'Compressive Strength'!$I$26)","v":"1-3"}]
[67,{"$f":"IF('Compressive Strength'!$J$31=\"\",\"\",'Compressive Strength'!$J$31)","v":""},{"$f":"IF('Compressive Strength'!$B$6=\"\",\"\",'Compressive Strength'!$B$6)","v":"Tex-120-E : PART I"},{"$f":"IF('Compressive Strength'!$B$31=\"\",\"\",'Compressive Strength'!$B$31)","v":"Average Diameter, in.:"},{"$f":"IF('Compressive Strength'!$J$24=\"\",\"\",'Compressive Strength'!$J$24)","v":2},{"$f":"IF('Compressive Strength'!$J$26=\"\",\"\",'Compressive Strength'!$J$26)","v":"2-1"}]
[68,{"$f":"IF('Compressive Strength'!$K$31=\"\",\"\",'Compressive Strength'!$K$31)","v":""},{"$f":"IF('Compressive Strength'!$B$6=\"\",\"\",'Compressive Strength'!$B$6)","v":"Tex-120-E : PART I"},{"$f":"IF('Compressive Strength'!$B$31=\"\",\"\",'Compressive Strength'!$B$31)","v":"Average Diameter, in.:"},{"$f":"IF('Compressive Strength'!$J$24=\"\",\"\",'Compressive Strength'!$J$24)","v":2},{"$f":"IF('Compressive Strength'!$K$26=\"\",\"\",'Compressive Strength'!$K$26)","v":"2-2"}]
[69,{"$f":"IF('Compressive Strength'!$L$31=\"\",\"\",'Compressive Strength'!$L$31)","v":""},{"$f":"IF('Compressive Strength'!$B$6=\"\",\"\",'Compressive Strength'!$B$6)","v":"Tex-120-E : PART I"},{"$f":"IF('Compressive Strength'!$B$31=\"\",\"\",'Compressive Strength'!$B$31)","v":"Average Diameter, in.:"},{"$f":"IF('Compressive Strength'!$J$24=\"\",\"\",'Compressive Strength'!$J$24)","v":2},{"$f":"IF('Compressive Strength'!$L$26=\"\",\"\",'Compressive Strength'!$L$26)","v":"2-3"}]
[70,{"$f":"IF('Compressive Strength'!$M$31=\"\",\"\",'Compressive Strength'!$M$31)","v":""},{"$f":"IF('Compressive Strength'!$B$6=\"\",\"\",'Compressive Strength'!$B$6)","v":"Tex-120-E : PART I"},{"$f":"IF('Compressive Strength'!$B$31=\"\",\"\",'Compressive Strength'!$B$31)","v":"Average Diameter, in.:"},{"$f":"IF('Compressive Strength'!$M$24=\"\",\"\",'Compressive Strength'!$M$24)","v":3},{"$f":"IF('Compressive Strength'!$M$26=\"\",\"\",'Compressive Strength'!$M$26)","v":"3-1"}]
[71,{"$f":"IF('Compressive Strength'!$N$31=\"\",\"\",'Compressive Strength'!$N$31)","v":""},{"$f":"IF('Compressive Strength'!$B$6=\"\",\"\",'Compressive Strength'!$B$6)","v":"Tex-120-E : PART I"},{"$f":"IF('Compressive Strength'!$B$31=\"\",\"\",'Compressive Strength'!$B$31)","v":"Average Diameter, in.:"},{"$f":"IF('Compressive Strength'!$M$24=\"\",\"\",'Compressive Strength'!$M$24)","v":3},{"$f":"IF('Compressive Strength'!$N$26=\"\",\"\",'Compressive Strength'!$N$26)","v":"3-2"}]
[72,{"$f":"IF('Compressive Strength'!$O$31=\"\",\"\",'Compressive Strength'!$O$31)","v":""},{"$f":"IF('Compressive Strength'!$B$6=\"\",\"\",'Compressive Strength'!$B$6)","v":"Tex-120-E : PART I"},{"$f":"IF('Compressive Strength'!$B$31=\"\",\"\",'Compressive Strength'!$B$31)","v":"Average Diameter, in.:"},{"$f":"IF('Compressive Strength'!$M$24=\"\",\"\",'Compressive Strength'!$M$24)","v":3},{"$f":"IF('Compressive Strength'!$O$26=\"\",\"\",'Compressive Strength'!$O$26)","v":"3-3"}]
[73,{"$f":"IF('Compressive Strength'!$P$31=\"\",\"\",'Compressive Strength'!$P$31)","v":""},{"$f":"IF('Compressive Strength'!$B$6=\"\",\"\",'Compressive Strength'!$B$6)","v":"Tex-120-E : PART I"},{"$f":"IF('Compressive Strength'!$B$31=\"\",\"\",'Compressive Strength'!$B$31)","v":"Average Diameter, in.:"},{"$f":"IF('Compressive Strength'!$P$24=\"\",\"\",'Compressive Strength'!$P$24)","v":4},{"$f":"IF('Compressive Strength'!$P$26=\"\",\"\",'Compressive Strength'!$P$26)","v":"4-1"}]
[74,{"$f":"IF('Compressive Strength'!$Q$31=\"\",\"\",'Compressive Strength'!$Q$31)","v":""},{"$f":"IF('Compressive Strength'!$B$6=\"\",\"\",'Compressive Strength'!$B$6)","v":"Tex-120-E : PART I"},{"$f":"IF('Compressive Strength'!$B$31=\"\",\"\",'Compressive Strength'!$B$31)","v":"Average Diameter, in.:"},{"$f":"IF('Compressive Strength'!$P$24=\"\",\"\",'Compressive Strength'!$P$24)","v":4},{"$f":"IF('Compressive Strength'!$Q$26=\"\",\"\",'Compressive Strength'!$Q$26)","v":"4-2"}]
[75,{"$f":"IF('Compressive Strength'!$R$31=\"\",\"\",'Compressive Strength'!$R$31)","v":""},{"$f":"IF('Compressive Strength'!$B$6=\"\",\"\",'Compressive Strength'!$B$6)","v":"Tex-120-E : PART I"},{"$f":"IF('Compressive Strength'!$B$31=\"\",\"\",'Compressive Strength'!$B$31)","v":"Average Diameter, in.:"},{"$f":"IF('Compressive Strength'!$P$24=\"\",\"\",'Compressive Strength'!$P$24)","v":4},{"$f":"IF('Compressive Strength'!$R$26=\"\",\"\",'Compressive Strength'!$R$26)","v":"4-3"}]
[76,{"$f":"IF('Compressive Strength'!$G$32=\"\",\"\",'Compressive Strength'!$G$32)","v":""},{"$f":"IF('Compressive Strength'!$B$6=\"\",\"\",'Compressive Strength'!$B$6)","v":"Tex-120-E : PART I"},{"$f":"IF('Compressive Strength'!$B$32=\"\",\"\",'Compressive Strength'!$B$32)","v":"Circumference, in.:"},{"$f":"IF('Compressive Strength'!$G$24=\"\",\"\",'Compressive Strength'!$G$24)","v":1},{"$f":"IF('Compressive Strength'!$G$26=\"\",\"\",'Compressive Strength'!$G$26)","v":"1-1"}]
[77,{"$f":"IF('Compressive Strength'!$H$32=\"\",\"\",'Compressive Strength'!$H$32)","v":""},{"$f":"IF('Compressive Strength'!$B$6=\"\",\"\",'Compressive Strength'!$B$6)","v":"Tex-120-E : PART I"},{"$f":"IF('Compressive Strength'!$B$32=\"\",\"\",'Compressive Strength'!$B$32)","v":"Circumference, in.:"},{"$f":"IF('Compressive Strength'!$G$24=\"\",\"\",'Compressive Strength'!$G$24)","v":1},{"$f":"IF('Compressive Strength'!$H$26=\"\",\"\",'Compressive Strength'!$H$26)","v":"1-2"}]
[78,{"$f":"IF('Compressive Strength'!$I$32=\"\",\"\",'Compressive Strength'!$I$32)","v":""},{"$f":"IF('Compressive Strength'!$B$6=\"\",\"\",'Compressive Strength'!$B$6)","v":"Tex-120-E : PART I"},{"$f":"IF('Compressive Strength'!$B$32=\"\",\"\",'Compressive Strength'!$B$32)","v":"Circumference, in.:"},{"$f":"IF('Compressive Strength'!$G$24=\"\",\"\",'Compressive Strength'!$G$24)","v":1},{"$f":"IF('Compressive Strength'!$I$26=\"\",\"\",'Compressive Strength'!$I$26)","v":"1-3"}]
[79,{"$f":"IF('Compressive Strength'!$J$32=\"\",\"\",'Compressive Strength'!$J$32)","v":""},{"$f":"IF('Compressive Strength'!$B$6=\"\",\"\",'Compressive Strength'!$B$6)","v":"Tex-120-E : PART I"},{"$f":"IF('Compressive Strength'!$B$32=\"\",\"\",'Compressive Strength'!$B$32)","v":"Circumference, in.:"},{"$f":"IF('Compressive Strength'!$J$24=\"\",\"\",'Compressive Strength'!$J$24)","v":2},{"$f":"IF('Compressive Strength'!$J$26=\"\",\"\",'Compressive Strength'!$J$26)","v":"2-1"}]
[80,{"$f":"IF('Compressive Strength'!$K$32=\"\",\"\",'Compressive Strength'!$K$32)","v":""},{"$f":"IF('Compressive Strength'!$B$6=\"\",\"\",'Compressive Strength'!$B$6)","v":"Tex-120-E : PART I"},{"$f":"IF('Compressive Strength'!$B$32=\"\",\"\",'Compressive Strength'!$B$32)","v":"Circumference, in.:"},{"$f":"IF('Compressive Strength'!$J$24=\"\",\"\",'Compressive Strength'!$J$24)","v":2},{"$f":"IF('Compressive Strength'!$K$26=\"\",\"\",'Compressive Strength'!$K$26)","v":"2-2"}]
[81,{"$f":"IF('Compressive Strength'!$L$32=\"\",\"\",'Compressive Strength'!$L$32)","v":""},{"$f":"IF('Compressive Strength'!$B$6=\"\",\"\",'Compressive Strength'!$B$6)","v":"Tex-120-E : PART I"},{"$f":"IF('Compressive Strength'!$B$32=\"\",\"\",'Compressive Strength'!$B$32)","v":"Circumference, in.:"},{"$f":"IF('Compressive Strength'!$J$24=\"\",\"\",'Compressive Strength'!$J$24)","v":2},{"$f":"IF('Compressive Strength'!$L$26=\"\",\"\",'Compressive Strength'!$L$26)","v":"2-3"}]
[82,{"$f":"IF('Compressive Strength'!$M$32=\"\",\"\",'Compressive Strength'!$M$32)","v":""},{"$f":"IF('Compressive Strength'!$B$6=\"\",\"\",'Compressive Strength'!$B$6)","v":"Tex-120-E : PART I"},{"$f":"IF('Compressive Strength'!$B$32=\"\",\"\",'Compressive Strength'!$B$32)","v":"Circumference, in.:"},{"$f":"IF('Compressive Strength'!$M$24=\"\",\"\",'Compressive Strength'!$M$24)","v":3},{"$f":"IF('Compressive Strength'!$M$26=\"\",\"\",'Compressive Strength'!$M$26)","v":"3-1"}]
[83,{"$f":"IF('Compressive Strength'!$N$32=\"\",\"\",'Compressive Strength'!$N$32)","v":""},{"$f":"IF('Compressive Strength'!$B$6=\"\",\"\",'Compressive Strength'!$B$6)","v":"Tex-120-E : PART I"},{"$f":"IF('Compressive Strength'!$B$32=\"\",\"\",'Compressive Strength'!$B$32)","v":"Circumference, in.:"},{"$f":"IF('Compressive Strength'!$M$24=\"\",\"\",'Compressive Strength'!$M$24)","v":3},{"$f":"IF('Compressive Strength'!$N$26=\"\",\"\",'Compressive Strength'!$N$26)","v":"3-2"}]
[84,{"$f":"IF('Compressive Strength'!$O$32=\"\",\"\",'Compressive Strength'!$O$32)","v":""},{"$f":"IF('Compressive Strength'!$B$6=\"\",\"\",'Compressive Strength'!$B$6)","v":"Tex-120-E : PART I"},{"$f":"IF('Compressive Strength'!$B$32=\"\",\"\",'Compressive Strength'!$B$32)","v":"Circumference, in.:"},{"$f":"IF('Compressive Strength'!$M$24=\"\",\"\",'Compressive Strength'!$M$24)","v":3},{"$f":"IF('Compressive Strength'!$O$26=\"\",\"\",'Compressive Strength'!$O$26)","v":"3-3"}]
[85,{"$f":"IF('Compressive Strength'!$P$32=\"\",\"\",'Compressive Strength'!$P$32)","v":""},{"$f":"IF('Compressive Strength'!$B$6=\"\",\"\",'Compressive Strength'!$B$6)","v":"Tex-120-E : PART I"},{"$f":"IF('Compressive Strength'!$B$32=\"\",\"\",'Compressive Strength'!$B$32)","v":"Circumference, in.:"},{"$f":"IF('Compressive Strength'!$P$24=\"\",\"\",'Compressive Strength'!$P$24)","v":4},{"$f":"IF('Compressive Strength'!$P$26=\"\",\"\",'Compressive Strength'!$P$26)","v":"4-1"}]
[86,{"$f":"IF('Compressive Strength'!$Q$32=\"\",\"\",'Compressive Strength'!$Q$32)","v":""},{"$f":"IF('Compressive Strength'!$B$6=\"\",\"\",'Compressive Strength'!$B$6)","v":"Tex-120-E : PART I"},{"$f":"IF('Compressive Strength'!$B$32=\"\",\"\",'Compressive Strength'!$B$32)","v":"Circumference, in.:"},{"$f":"IF('Compressive Strength'!$P$24=\"\",\"\",'Compressive Strength'!$P$24)","v":4},{"$f":"IF('Compressive Strength'!$Q$26=\"\",\"\",'Compressive Strength'!$Q$26)","v":"4-2"}]
[87,{"$f":"IF('Compressive Strength'!$R$32=\"\",\"\",'Compressive Strength'!$R$32)","v":""},{"$f":"IF('Compressive Strength'!$B$6=\"\",\"\",'Compressive Strength'!$B$6)","v":"Tex-120-E : PART I"},{"$f":"IF('Compressive Strength'!$B$32=\"\",\"\",'Compressive Strength'!$B$32)","v":"Circumference, in.:"},{"$f":"IF('Compressive Strength'!$P$24=\"\",\"\",'Compressive Strength'!$P$24)","v":4},{"$f":"IF('Compressive Strength'!$R$26=\"\",\"\",'Compressive Strength'!$R$26)","v":"4-3"}]
[88,{"$f":"IF('Compressive Strength'!$G$33=\"\",\"\",'Compressive Strength'!$G$33)","v":""},{"$f":"IF('Compressive Strength'!$B$6=\"\",\"\",'Compressive Strength'!$B$6)","v":"Tex-120-E : PART I"},{"$f":"IF('Compressive Strength'!$B$33=\"\",\"\",'Compressive Strength'!$B$33)","v":"Area, in.^2:"},{"$f":"IF('Compressive Strength'!$G$24=\"\",\"\",'Compressive Strength'!$G$24)","v":1},{"$f":"IF('Compressive Strength'!$G$26=\"\",\"\",'Compressive Strength'!$G$26)","v":"1-1"}]
[89,{"$f":"IF('Compressive Strength'!$H$33=\"\",\"\",'Compressive Strength'!$H$33)","v":""},{"$f":"IF('Compressive Strength'!$B$6=\"\",\"\",'Compressive Strength'!$B$6)","v":"Tex-120-E : PART I"},{"$f":"IF('Compressive Strength'!$B$33=\"\",\"\",'Compressive Strength'!$B$33)","v":"Area, in.^2:"},{"$f":"IF('Compressive Strength'!$G$24=\"\",\"\",'Compressive Strength'!$G$24)","v":1},{"$f":"IF('Compressive Strength'!$H$26=\"\",\"\",'Compressive Strength'!$H$26)","v":"1-2"}]
[90,{"$f":"IF('Compressive Strength'!$I$33=\"\",\"\",'Compressive Strength'!$I$33)","v":""},{"$f":"IF('Compressive Strength'!$B$6=\"\",\"\",'Compressive Strength'!$B$6)","v":"Tex-120-E : PART I"},{"$f":"IF('Compressive Strength'!$B$33=\"\",\"\",'Compressive Strength'!$B$33)","v":"Area, in.^2:"},{"$f":"IF('Compressive Strength'!$G$24=\"\",\"\",'Compressive Strength'!$G$24)","v":1},{"$f":"IF('Compressive Strength'!$I$26=\"\",\"\",'Compressive Strength'!$I$26)","v":"1-3"}]
[91,{"$f":"IF('Compressive Strength'!$J$33=\"\",\"\",'Compressive Strength'!$J$33)","v":""},{"$f":"IF('Compressive Strength'!$B$6=\"\",\"\",'Compressive Strength'!$B$6)","v":"Tex-120-E : PART I"},{"$f":"IF('Compressive Strength'!$B$33=\"\",\"\",'Compressive Strength'!$B$33)","v":"Area, in.^2:"},{"$f":"IF('Compressive Strength'!$J$24=\"\",\"\",'Compressive Strength'!$J$24)","v":2},{"$f":"IF('Compressive Strength'!$J$26=\"\",\"\",'Compressive Strength'!$J$26)","v":"2-1"}]
[92,{"$f":"IF('Compressive Strength'!$K$33=\"\",\"\",'Compressive Strength'!$K$33)","v":""},{"$f":"IF('Compressive Strength'!$B$6=\"\",\"\",'Compressive Strength'!$B$6)","v":"Tex-120-E : PART I"},{"$f":"IF('Compressive Strength'!$B$33=\"\",\"\",'Compressive Strength'!$B$33)","v":"Area, in.^2:"},{"$f":"IF('Compressive Strength'!$J$24=\"\",\"\",'Compressive Strength'!$J$24)","v":2},{"$f":"IF('Compressive Strength'!$K$26=\"\",\"\",'Compressive Strength'!$K$26)","v":"2-2"}]
[93,{"$f":"IF('Compressive Strength'!$L$33=\"\",\"\",'Compressive Strength'!$L$33)","v":""},{"$f":"IF('Compressive Strength'!$B$6=\"\",\"\",'Compressive Strength'!$B$6)","v":"Tex-120-E : PART I"},{"$f":"IF('Compressive Strength'!$B$33=\"\",\"\",'Compressive Strength'!$B$33)","v":"Area, in.^2:"},{"$f":"IF('Compressive Strength'!$J$24=\"\",\"\",'Compressive Strength'!$J$24)","v":2},{"$f":"IF('Compressive Strength'!$L$26=\"\",\"\",'Compressive Strength'!$L$26)","v":"2-3"}]
[94,{"$f":"IF('Compressive Strength'!$M$33=\"\",\"\",'Compressive Strength'!$M$33)","v":""},{"$f":"IF('Compressive Strength'!$B$6=\"\",\"\",'Compressive Strength'!$B$6)","v":"Tex-120-E : PART I"},{"$f":"IF('Compressive Strength'!$B$33=\"\",\"\",'Compressive Strength'!$B$33)","v":"Area, in.^2:"},{"$f":"IF('Compressive Strength'!$M$24=\"\",\"\",'Compressive Strength'!$M$24)","v":3},{"$f":"IF('Compressive Strength'!$M$26=\"\",\"\",'Compressive Strength'!$M$26)","v":"3-1"}]
[95,{"$f":"IF('Compressive Strength'!$N$33=\"\",\"\",'Compressive Strength'!$N$33)","v":""},{"$f":"IF('Compressive Strength'!$B$6=\"\",\"\",'Compressive Strength'!$B$6)","v":"Tex-120-E : PART I"},{"$f":"IF('Compressive Strength'!$B$33=\"\",\"\",'Compressive Strength'!$B$33)","v":"Area, in.^2:"},{"$f":"IF('Compressive Strength'!$M$24=\"\",\"\",'Compressive Strength'!$M$24)","v":3},{"$f":"IF('Compressive Strength'!$N$26=\"\",\"\",'Compressive Strength'!$N$26)","v":"3-2"}]
[96,{"$f":"IF('Compressive Strength'!$O$33=\"\",\"\",'Compressive Strength'!$O$33)","v":""},{"$f":"IF('Compressive Strength'!$B$6=\"\",\"\",'Compressive Strength'!$B$6)","v":"Tex-120-E : PART I"},{"$f":"IF('Compressive Strength'!$B$33=\"\",\"\",'Compressive Strength'!$B$33)","v":"Area, in.^2:"},{"$f":"IF('Compressive Strength'!$M$24=\"\",\"\",'Compressive Strength'!$M$24)","v":3},{"$f":"IF('Compressive Strength'!$O$26=\"\",\"\",'Compressive Strength'!$O$26)","v":"3-3"}]
[97,{"$f":"IF('Compressive Strength'!$P$33=\"\",\"\",'Compressive Strength'!$P$33)","v":""},{"$f":"IF('Compressive Strength'!$B$6=\"\",\"\",'Compressive Strength'!$B$6)","v":"Tex-120-E : PART I"},{"$f":"IF('Compressive Strength'!$B$33=\"\",\"\",'Compressive Strength'!$B$33)","v":"Area, in.^2:"},{"$f":"IF('Compressive Strength'!$P$24=\"\",\"\",'Compressive Strength'!$P$24)","v":4},{"$f":"IF('Compressive Strength'!$P$26=\"\",\"\",'Compressive Strength'!$P$26)","v":"4-1"}]
[98,{"$f":"IF('Compressive Strength'!$Q$33=\"\",\"\",'Compressive Strength'!$Q$33)","v":""},{"$f":"IF('Compressive Strength'!$B$6=\"\",\"\",'Compressive Strength'!$B$6)","v":"Tex-120-E : PART I"},{"$f":"IF('Compressive Strength'!$B$33=\"\",\"\",'Compressive Strength'!$B$33)","v":"Area, in.^2:"},{"$f":"IF('Compressive Strength'!$P$24=\"\",\"\",'Compressive Strength'!$P$24)","v":4},{"$f":"IF('Compressive Strength'!$Q$26=\"\",\"\",'Compressive Strength'!$Q$26)","v":"4-2"}]
[99,{"$f":"IF('Compressive Strength'!$R$33=\"\",\"\",'Compressive Strength'!$R$33)","v":""},{"$f":"IF('Compressive Strength'!$B$6=\"\",\"\",'Compressive Strength'!$B$6)","v":"Tex-120-E : PART I"},{"$f":"IF('Compressive Strength'!$B$33=\"\",\"\",'Compressive Strength'!$B$33)","v":"Area, in.^2:"},{"$f":"IF('Compressive Strength'!$P$24=\"\",\"\",'Compressive Strength'!$P$24)","v":4},{"$f":"IF('Compressive Strength'!$R$26=\"\",\"\",'Compressive Strength'!$R$26)","v":"4-3"}]
[100,{"$f":"IF('Compressive Strength'!$G$34=\"\",\"\",'Compressive Strength'!$G$34)","v":""},{"$f":"IF('Compressive Strength'!$B$6=\"\",\"\",'Compressive Strength'!$B$6)","v":"Tex-120-E : PART I"},{"$f":"IF('Compressive Strength'!$B$34=\"\",\"\",'Compressive Strength'!$B$34)","v":"Avg. Cross Sectional Area, in^2:"},{"$f":"IF('Compressive Strength'!$G$24=\"\",\"\",'Compressive Strength'!$G$24)","v":1},{"$f":"IF('Compressive Strength'!$G$26=\"\",\"\",'Compressive Strength'!$G$26)","v":"1-1"}]
[101,{"$f":"IF('Compressive Strength'!$H$34=\"\",\"\",'Compressive Strength'!$H$34)","v":""},{"$f":"IF('Compressive Strength'!$B$6=\"\",\"\",'Compressive Strength'!$B$6)","v":"Tex-120-E : PART I"},{"$f":"IF('Compressive Strength'!$B$34=\"\",\"\",'Compressive Strength'!$B$34)","v":"Avg. Cross Sectional Area, in^2:"},{"$f":"IF('Compressive Strength'!$G$24=\"\",\"\",'Compressive Strength'!$G$24)","v":1},{"$f":"IF('Compressive Strength'!$H$26=\"\",\"\",'Compressive Strength'!$H$26)","v":"1-2"}]
[102,{"$f":"IF('Compressive Strength'!$I$34=\"\",\"\",'Compressive Strength'!$I$34)","v":""},{"$f":"IF('Compressive Strength'!$B$6=\"\",\"\",'Compressive Strength'!$B$6)","v":"Tex-120-E : PART I"},{"$f":"IF('Compressive Strength'!$B$34=\"\",\"\",'Compressive Strength'!$B$34)","v":"Avg. Cross Sectional Area, in^2:"},{"$f":"IF('Compressive Strength'!$G$24=\"\",\"\",'Compressive Strength'!$G$24)","v":1},{"$f":"IF('Compressive Strength'!$I$26=\"\",\"\",'Compressive Strength'!$I$26)","v":"1-3"}]
[103,{"$f":"IF('Compressive Strength'!$J$34=\"\",\"\",'Compressive Strength'!$J$34)","v":""},{"$f":"IF('Compressive Strength'!$B$6=\"\",\"\",'Compressive Strength'!$B$6)","v":"Tex-120-E : PART I"},{"$f":"IF('Compressive Strength'!$B$34=\"\",\"\",'Compressive Strength'!$B$34)","v":"Avg. Cross Sectional Area, in^2:"},{"$f":"IF('Compressive Strength'!$J$24=\"\",\"\",'Compressive Strength'!$J$24)","v":2},{"$f":"IF('Compressive Strength'!$J$26=\"\",\"\",'Compressive Strength'!$J$26)","v":"2-1"}]
[104,{"$f":"IF('Compressive Strength'!$K$34=\"\",\"\",'Compressive Strength'!$K$34)","v":""},{"$f":"IF('Compressive Strength'!$B$6=\"\",\"\",'Compressive Strength'!$B$6)","v":"Tex-120-E : PART I"},{"$f":"IF('Compressive Strength'!$B$34=\"\",\"\",'Compressive Strength'!$B$34)","v":"Avg. Cross Sectional Area, in^2:"},{"$f":"IF('Compressive Strength'!$J$24=\"\",\"\",'Compressive Strength'!$J$24)","v":2},{"$f":"IF('Compressive Strength'!$K$26=\"\",\"\",'Compressive Strength'!$K$26)","v":"2-2"}]
[105,{"$f":"IF('Compressive Strength'!$L$34=\"\",\"\",'Compressive Strength'!$L$34)","v":""},{"$f":"IF('Compressive Strength'!$B$6=\"\",\"\",'Compressive Strength'!$B$6)","v":"Tex-120-E : PART I"},{"$f":"IF('Compressive Strength'!$B$34=\"\",\"\",'Compressive Strength'!$B$34)","v":"Avg. Cross Sectional Area, in^2:"},{"$f":"IF('Compressive Strength'!$J$24=\"\",\"\",'Compressive Strength'!$J$24)","v":2},{"$f":"IF('Compressive Strength'!$L$26=\"\",\"\",'Compressive Strength'!$L$26)","v":"2-3"}]
[106,{"$f":"IF('Compressive Strength'!$M$34=\"\",\"\",'Compressive Strength'!$M$34)","v":""},{"$f":"IF('Compressive Strength'!$B$6=\"\",\"\",'Compressive Strength'!$B$6)","v":"Tex-120-E : PART I"},{"$f":"IF('Compressive Strength'!$B$34=\"\",\"\",'Compressive Strength'!$B$34)","v":"Avg. Cross Sectional Area, in^2:"},{"$f":"IF('Compressive Strength'!$M$24=\"\",\"\",'Compressive Strength'!$M$24)","v":3},{"$f":"IF('Compressive Strength'!$M$26=\"\",\"\",'Compressive Strength'!$M$26)","v":"3-1"}]
[107,{"$f":"IF('Compressive Strength'!$N$34=\"\",\"\",'Compressive Strength'!$N$34)","v":""},{"$f":"IF('Compressive Strength'!$B$6=\"\",\"\",'Compressive Strength'!$B$6)","v":"Tex-120-E : PART I"},{"$f":"IF('Compressive Strength'!$B$34=\"\",\"\",'Compressive Strength'!$B$34)","v":"Avg. Cross Sectional Area, in^2:"},{"$f":"IF('Compressive Strength'!$M$24=\"\",\"\",'Compressive Strength'!$M$24)","v":3},{"$f":"IF('Compressive Strength'!$N$26=\"\",\"\",'Compressive Strength'!$N$26)","v":"3-2"}]
[108,{"$f":"IF('Compressive Strength'!$O$34=\"\",\"\",'Compressive Strength'!$O$34)","v":""},{"$f":"IF('Compressive Strength'!$B$6=\"\",\"\",'Compressive Strength'!$B$6)","v":"Tex-120-E : PART I"},{"$f":"IF('Compressive Strength'!$B$34=\"\",\"\",'Compressive Strength'!$B$34)","v":"Avg. Cross Sectional Area, in^2:"},{"$f":"IF('Compressive Strength'!$M$24=\"\",\"\",'Compressive Strength'!$M$24)","v":3},{"$f":"IF('Compressive Strength'!$O$26=\"\",\"\",'Compressive Strength'!$O$26)","v":"3-3"}]
[109,{"$f":"IF('Compressive Strength'!$P$34=\"\",\"\",'Compressive Strength'!$P$34)","v":""},{"$f":"IF('Compressive Strength'!$B$6=\"\",\"\",'Compressive Strength'!$B$6)","v":"Tex-120-E : PART I"},{"$f":"IF('Compressive Strength'!$B$34=\"\",\"\",'Compressive Strength'!$B$34)","v":"Avg. Cross Sectional Area, in^2:"},{"$f":"IF('Compressive Strength'!$P$24=\"\",\"\",'Compressive Strength'!$P$24)","v":4},{"$f":"IF('Compressive Strength'!$P$26=\"\",\"\",'Compressive Strength'!$P$26)","v":"4-1"}]
[110,{"$f":"IF('Compressive Strength'!$Q$34=\"\",\"\",'Compressive Strength'!$Q$34)","v":""},{"$f":"IF('Compressive Strength'!$B$6=\"\",\"\",'Compressive Strength'!$B$6)","v":"Tex-120-E : PART I"},{"$f":"IF('Compressive Strength'!$B$34=\"\",\"\",'Compressive Strength'!$B$34)","v":"Avg. Cross Sectional Area, in^2:"},{"$f":"IF('Compressive Strength'!$P$24=\"\",\"\",'Compressive Strength'!$P$24)","v":4},{"$f":"IF('Compressive Strength'!$Q$26=\"\",\"\",'Compressive Strength'!$Q$26)","v":"4-2"}]
[111,{"$f":"IF('Compressive Strength'!$R$34=\"\",\"\",'Compressive Strength'!$R$34)","v":""},{"$f":"IF('Compressive Strength'!$B$6=\"\",\"\",'Compressive Strength'!$B$6)","v":"Tex-120-E : PART I"},{"$f":"IF('Compressive Strength'!$B$34=\"\",\"\",'Compressive Strength'!$B$34)","v":"Avg. Cross Sectional Area, in^2:"},{"$f":"IF('Compressive Strength'!$P$24=\"\",\"\",'Compressive Strength'!$P$24)","v":4},{"$f":"IF('Compressive Strength'!$R$26=\"\",\"\",'Compressive Strength'!$R$26)","v":"4-3"}]
[112,{"$f":"IF('Compressive Strength'!$G$35=\"\",\"\",'Compressive Strength'!$G$35)","v":""},{"$f":"IF('Compressive Strength'!$B$6=\"\",\"\",'Compressive Strength'!$B$6)","v":"Tex-120-E : PART I"},{"$f":"IF('Compressive Strength'!$B$35=\"\",\"\",'Compressive Strength'!$B$35)","v":"Lateral Pressure, psi.:"},{"$f":"IF('Compressive Strength'!$G$24=\"\",\"\",'Compressive Strength'!$G$24)","v":1},{"$f":"IF('Compressive Strength'!$G$26=\"\",\"\",'Compressive Strength'!$G$26)","v":"1-1"}]
[113,{"$f":"IF('Compressive Strength'!$H$35=\"\",\"\",'Compressive Strength'!$H$35)","v":""},{"$f":"IF('Compressive Strength'!$B$6=\"\",\"\",'Compressive Strength'!$B$6)","v":"Tex-120-E : PART I"},{"$f":"IF('Compressive Strength'!$B$35=\"\",\"\",'Compressive Strength'!$B$35)","v":"Lateral Pressure, psi.:"},{"$f":"IF('Compressive Strength'!$G$24=\"\",\"\",'Compressive Strength'!$G$24)","v":1},{"$f":"IF('Compressive Strength'!$H$26=\"\",\"\",'Compressive Strength'!$H$26)","v":"1-2"}]
[114,{"$f":"IF('Compressive Strength'!$I$35=\"\",\"\",'Compressive Strength'!$I$35)","v":""},{"$f":"IF('Compressive Strength'!$B$6=\"\",\"\",'Compressive Strength'!$B$6)","v":"Tex-120-E : PART I"},{"$f":"IF('Compressive Strength'!$B$35=\"\",\"\",'Compressive Strength'!$B$35)","v":"Lateral Pressure, psi.:"},{"$f":"IF('Compressive Strength'!$G$24=\"\",\"\",'Compressive Strength'!$G$24)","v":1},{"$f":"IF('Compressive Strength'!$I$26=\"\",\"\",'Compressive Strength'!$I$26)","v":"1-3"}]
[115,{"$f":"IF('Compressive Strength'!$J$35=\"\",\"\",'Compressive Strength'!$J$35)","v":""},{"$f":"IF('Compressive Strength'!$B$6=\"\",\"\",'Compressive Strength'!$B$6)","v":"Tex-120-E : PART I"},{"$f":"IF('Compressive Strength'!$B$35=\"\",\"\",'Compressive Strength'!$B$35)","v":"Lateral Pressure, psi.:"},{"$f":"IF('Compressive Strength'!$J$24=\"\",\"\",'Compressive Strength'!$J$24)","v":2},{"$f":"IF('Compressive Strength'!$J$26=\"\",\"\",'Compressive Strength'!$J$26)","v":"2-1"}]
[116,{"$f":"IF('Compressive Strength'!$K$35=\"\",\"\",'Compressive Strength'!$K$35)","v":""},{"$f":"IF('Compressive Strength'!$B$6=\"\",\"\",'Compressive Strength'!$B$6)","v":"Tex-120-E : PART I"},{"$f":"IF('Compressive Strength'!$B$35=\"\",\"\",'Compressive Strength'!$B$35)","v":"Lateral Pressure, psi.:"},{"$f":"IF('Compressive Strength'!$J$24=\"\",\"\",'Compressive Strength'!$J$24)","v":2},{"$f":"IF('Compressive Strength'!$K$26=\"\",\"\",'Compressive Strength'!$K$26)","v":"2-2"}]
[117,{"$f":"IF('Compressive Strength'!$L$35=\"\",\"\",'Compressive Strength'!$L$35)","v":""},{"$f":"IF('Compressive Strength'!$B$6=\"\",\"\",'Compressive Strength'!$B$6)","v":"Tex-120-E : PART I"},{"$f":"IF('Compressive Strength'!$B$35=\"\",\"\",'Compressive Strength'!$B$35)","v":"Lateral Pressure, psi.:"},{"$f":"IF('Compressive Strength'!$J$24=\"\",\"\",'Compressive Strength'!$J$24)","v":2},{"$f":"IF('Compressive Strength'!$L$26=\"\",\"\",'Compressive Strength'!$L$26)","v":"2-3"}]
[118,{"$f":"IF('Compressive Strength'!$M$35=\"\",\"\",'Compressive Strength'!$M$35)","v":""},{"$f":"IF('Compressive Strength'!$B$6=\"\",\"\",'Compressive Strength'!$B$6)","v":"Tex-120-E : PART I"},{"$f":"IF('Compressive Strength'!$B$35=\"\",\"\",'Compressive Strength'!$B$35)","v":"Lateral Pressure, psi.:"},{"$f":"IF('Compressive Strength'!$M$24=\"\",\"\",'Compressive Strength'!$M$24)","v":3},{"$f":"IF('Compressive Strength'!$M$26=\"\",\"\",'Compressive Strength'!$M$26)","v":"3-1"}]
[119,{"$f":"IF('Compressive Strength'!$N$35=\"\",\"\",'Compressive Strength'!$N$35)","v":""},{"$f":"IF('Compressive Strength'!$B$6=\"\",\"\",'Compressive Strength'!$B$6)","v":"Tex-120-E : PART I"},{"$f":"IF('Compressive Strength'!$B$35=\"\",\"\",'Compressive Strength'!$B$35)","v":"Lateral Pressure, psi.:"},{"$f":"IF('Compressive Strength'!$M$24=\"\",\"\",'Compressive Strength'!$M$24)","v":3},{"$f":"IF('Compressive Strength'!$N$26=\"\",\"\",'Compressive Strength'!$N$26)","v":"3-2"}]
[120,{"$f":"IF('Compressive Strength'!$O$35=\"\",\"\",'Compressive Strength'!$O$35)","v":""},{"$f":"IF('Compressive Strength'!$B$6=\"\",\"\",'Compressive Strength'!$B$6)","v":"Tex-120-E : PART I"},{"$f":"IF('Compressive Strength'!$B$35=\"\",\"\",'Compressive Strength'!$B$35)","v":"Lateral Pressure, psi.:"},{"$f":"IF('Compressive Strength'!$M$24=\"\",\"\",'Compressive Strength'!$M$24)","v":3},{"$f":"IF('Compressive Strength'!$O$26=\"\",\"\",'Compressive Strength'!$O$26)","v":"3-3"}]
[121,{"$f":"IF('Compressive Strength'!$P$35=\"\",\"\",'Compressive Strength'!$P$35)","v":""},{"$f":"IF('Compressive Strength'!$B$6=\"\",\"\",'Compressive Strength'!$B$6)","v":"Tex-120-E : PART I"},{"$f":"IF('Compressive Strength'!$B$35=\"\",\"\",'Compressive Strength'!$B$35)","v":"Lateral Pressure, psi.:"},{"$f":"IF('Compressive Strength'!$P$24=\"\",\"\",'Compressive Strength'!$P$24)","v":4},{"$f":"IF('Compressive Strength'!$P$26=\"\",\"\",'Compressive Strength'!$P$26)","v":"4-1"}]
[122,{"$f":"IF('Compressive Strength'!$Q$35=\"\",\"\",'Compressive Strength'!$Q$35)","v":""},{"$f":"IF('Compressive Strength'!$B$6=\"\",\"\",'Compressive Strength'!$B$6)","v":"Tex-120-E : PART I"},{"$f":"IF('Compressive Strength'!$B$35=\"\",\"\",'Compressive Strength'!$B$35)","v":"Lateral Pressure, psi.:"},{"$f":"IF('Compressive Strength'!$P$24=\"\",\"\",'Compressive Strength'!$P$24)","v":4},{"$f":"IF('Compressive Strength'!$Q$26=\"\",\"\",'Compressive Strength'!$Q$26)","v":"4-2"}]
[123,{"$f":"IF('Compressive Strength'!$R$35=\"\",\"\",'Compressive Strength'!$R$35)","v":""},{"$f":"IF('Compressive Strength'!$B$6=\"\",\"\",'Compressive Strength'!$B$6)","v":"Tex-120-E : PART I"},{"$f":"IF('Compressive Strength'!$B$35=\"\",\"\",'Compressive Strength'!$B$35)","v":"Lateral Pressure, psi.:"},{"$f":"IF('Compressive Strength'!$P$24=\"\",\"\",'Compressive Strength'!$P$24)","v":4},{"$f":"IF('Compressive Strength'!$R$26=\"\",\"\",'Compressive Strength'!$R$26)","v":"4-3"}]
[124,{"$f":"IF('Compressive Strength'!$G$36=\"\",\"\",'Compressive Strength'!$G$36)","v":""},{"$f":"IF('Compressive Strength'!$B$6=\"\",\"\",'Compressive Strength'!$B$6)","v":"Tex-120-E : PART I"},{"$f":"IF('Compressive Strength'!$B$36=\"\",\"\",'Compressive Strength'!$B$36)","v":"Calibration Factor:"},{"$f":"IF('Compressive Strength'!$G$24=\"\",\"\",'Compressive Strength'!$G$24)","v":1},{"$f":"IF('Compressive Strength'!$G$26=\"\",\"\",'Compressive Strength'!$G$26)","v":"1-1"}]
[125,{"$f":"IF('Compressive Strength'!$H$36=\"\",\"\",'Compressive Strength'!$H$36)","v":""},{"$f":"IF('Compressive Strength'!$B$6=\"\",\"\",'Compressive Strength'!$B$6)","v":"Tex-120-E : PART I"},{"$f":"IF('Compressive Strength'!$B$36=\"\",\"\",'Compressive Strength'!$B$36)","v":"Calibration Factor:"},{"$f":"IF('Compressive Strength'!$G$24=\"\",\"\",'Compressive Strength'!$G$24)","v":1},{"$f":"IF('Compressive Strength'!$H$26=\"\",\"\",'Compressive Strength'!$H$26)","v":"1-2"}]
[126,{"$f":"IF('Compressive Strength'!$I$36=\"\",\"\",'Compressive Strength'!$I$36)","v":""},{"$f":"IF('Compressive Strength'!$B$6=\"\",\"\",'Compressive Strength'!$B$6)","v":"Tex-120-E : PART I"},{"$f":"IF('Compressive Strength'!$B$36=\"\",\"\",'Compressive Strength'!$B$36)","v":"Calibration Factor:"},{"$f":"IF('Compressive Strength'!$G$24=\"\",\"\",'Compressive Strength'!$G$24)","v":1},{"$f":"IF('Compressive Strength'!$I$26=\"\",\"\",'Compressive Strength'!$I$26)","v":"1-3"}]
[127,{"$f":"IF('Compressive Strength'!$J$36=\"\",\"\",'Compressive Strength'!$J$36)","v":""},{"$f":"IF('Compressive Strength'!$B$6=\"\",\"\",'Compressive Strength'!$B$6)","v":"Tex-120-E : PART I"},{"$f":"IF('Compressive Strength'!$B$36=\"\",\"\",'Compressive Strength'!$B$36)","v":"Calibration Factor:"},{"$f":"IF('Compressive Strength'!$J$24=\"\",\"\",'Compressive Strength'!$J$24)","v":2},{"$f":"IF('Compressive Strength'!$J$26=\"\",\"\",'Compressive Strength'!$J$26)","v":"2-1"}]
[128,{"$f":"IF('Compressive Strength'!$K$36=\"\",\"\",'Compressive Strength'!$K$36)","v":""},{"$f":"IF('Compressive Strength'!$B$6=\"\",\"\",'Compressive Strength'!$B$6)","v":"Tex-120-E : PART I"},{"$f":"IF('Compressive Strength'!$B$36=\"\",\"\",'Compressive Strength'!$B$36)","v":"Calibration Factor:"},{"$f":"IF('Compressive Strength'!$J$24=\"\",\"\",'Compressive Strength'!$J$24)","v":2},{"$f":"IF('Compressive Strength'!$K$26=\"\",\"\",'Compressive Strength'!$K$26)","v":"2-2"}]
[129,{"$f":"IF('Compressive Strength'!$L$36=\"\",\"\",'Compressive Strength'!$L$36)","v":""},{"$f":"IF('Compressive Strength'!$B$6=\"\",\"\",'Compressive Strength'!$B$6)","v":"Tex-120-E : PART I"},{"$f":"IF('Compressive Strength'!$B$36=\"\",\"\",'Compressive Strength'!$B$36)","v":"Calibration Factor:"},{"$f":"IF('Compressive Strength'!$J$24=\"\",\"\",'Compressive Strength'!$J$24)","v":2},{"$f":"IF('Compressive Strength'!$L$26=\"\",\"\",'Compressive Strength'!$L$26)","v":"2-3"}]
[130,{"$f":"IF('Compressive Strength'!$M$36=\"\",\"\",'Compressive Strength'!$M$36)","v":""},{"$f":"IF('Compressive Strength'!$B$6=\"\",\"\",'Compressive Strength'!$B$6)","v":"Tex-120-E : PART I"},{"$f":"IF('Compressive Strength'!$B$36=\"\",\"\",'Compressive Strength'!$B$36)","v":"Calibration Factor:"},{"$f":"IF('Compressive Strength'!$M$24=\"\",\"\",'Compressive Strength'!$M$24)","v":3},{"$f":"IF('Compressive Strength'!$M$26=\"\",\"\",'Compressive Strength'!$M$26)","v":"3-1"}]
[131,{"$f":"IF('Compressive Strength'!$N$36=\"\",\"\",'Compressive Strength'!$N$36)","v":""},{"$f":"IF('Compressive Strength'!$B$6=\"\",\"\",'Compressive Strength'!$B$6)","v":"Tex-120-E : PART I"},{"$f":"IF('Compressive Strength'!$B$36=\"\",\"\",'Compressive Strength'!$B$36)","v":"Calibration Factor:"},{"$f":"IF('Compressive Strength'!$M$24=\"\",\"\",'Compressive Strength'!$M$24)","v":3},{"$f":"IF('Compressive Strength'!$N$26=\"\",\"\",'Compressive Strength'!$N$26)","v":"3-2"}]
[132,{"$f":"IF('Compressive Strength'!$O$36=\"\",\"\",'Compressive Strength'!$O$36)","v":""},{"$f":"IF('Compressive Strength'!$B$6=\"\",\"\",'Compressive Strength'!$B$6)","v":"Tex-120-E : PART I"},{"$f":"IF('Compressive Strength'!$B$36=\"\",\"\",'Compressive Strength'!$B$36)","v":"Calibration Factor:"},{"$f":"IF('Compressive Strength'!$M$24=\"\",\"\",'Compressive Strength'!$M$24)","v":3},{"$f":"IF('Compressive Strength'!$O$26=\"\",\"\",'Compressive Strength'!$O$26)","v":"3-3"}]
[133,{"$f":"IF('Compressive Strength'!$P$36=\"\",\"\",'Compressive Strength'!$P$36)","v":""},{"$f":"IF('Compressive Strength'!$B$6=\"\",\"\",'Compressive Strength'!$B$6)","v":"Tex-120-E : PART I"},{"$f":"IF('Compressive Strength'!$B$36=\"\",\"\",'Compressive Strength'!$B$36)","v":"Calibration Factor:"},{"$f":"IF('Compressive Strength'!$P$24=\"\",\"\",'Compressive Strength'!$P$24)","v":4},{"$f":"IF('Compressive Strength'!$P$26=\"\",\"\",'Compressive Strength'!$P$26)","v":"4-1"}]
[134,{"$f":"IF('Compressive Strength'!$Q$36=\"\",\"\",'Compressive Strength'!$Q$36)","v":""},{"$f":"IF('Compressive Strength'!$B$6=\"\",\"\",'Compressive Strength'!$B$6)","v":"Tex-120-E : PART I"},{"$f":"IF('Compressive Strength'!$B$36=\"\",\"\",'Compressive Strength'!$B$36)","v":"Calibration Factor:"},{"$f":"IF('Compressive Strength'!$P$24=\"\",\"\",'Compressive Strength'!$P$24)","v":4},{"$f":"IF('Compressive Strength'!$Q$26=\"\",\"\",'Compressive Strength'!$Q$26)","v":"4-2"}]
[135,{"$f":"IF('Compressive Strength'!$R$36=\"\",\"\",'Compressive Strength'!$R$36)","v":""},{"$f":"IF('Compressive Strength'!$B$6=\"\",\"\",'Compressive Strength'!$B$6)","v":"Tex-120-E : PART I"},{"$f":"IF('Compressive Strength'!$B$36=\"\",\"\",'Compressive Strength'!$B$36)","v":"Calibration Factor:"},{"$f":"IF('Compressive Strength'!$P$24=\"\",\"\",'Compressive Strength'!$P$24)","v":4},{"$f":"IF('Compressive Strength'!$R$26=\"\",\"\",'Compressive Strength'!$R$26)","v":"4-3"}]
[136,{"$f":"IF('Compressive Strength'!$G$37=\"\",\"\",'Compressive Strength'!$G$37)","v":""},{"$f":"IF('Compressive Strength'!$B$6=\"\",\"\",'Compressive Strength'!$B$6)","v":"Tex-120-E : PART I"},{"$f":"IF('Compressive Strength'!$B$37=\"\",\"\",'Compressive Strength'!$B$37)","v":"Excitation:"},{"$f":"IF('Compressive Strength'!$G$24=\"\",\"\",'Compressive Strength'!$G$24)","v":1},{"$f":"IF('Compressive Strength'!$G$26=\"\",\"\",'Compressive Strength'!$G$26)","v":"1-1"}]
[137,{"$f":"IF('Compressive Strength'!$H$37=\"\",\"\",'Compressive Strength'!$H$37)","v":""},{"$f":"IF('Compressive Strength'!$B$6=\"\",\"\",'Compressive Strength'!$B$6)","v":"Tex-120-E : PART I"},{"$f":"IF('Compressive Strength'!$B$37=\"\",\"\",'Compressive Strength'!$B$37)","v":"Excitation:"},{"$f":"IF('Compressive Strength'!$G$24=\"\",\"\",'Compressive Strength'!$G$24)","v":1},{"$f":"IF('Compressive Strength'!$H$26=\"\",\"\",'Compressive Strength'!$H$26)","v":"1-2"}]
[138,{"$f":"IF('Compressive Strength'!$I$37=\"\",\"\",'Compressive Strength'!$I$37)","v":""},{"$f":"IF('Compressive Strength'!$B$6=\"\",\"\",'Compressive Strength'!$B$6)","v":"Tex-120-E : PART I"},{"$f":"IF('Compressive Strength'!$B$37=\"\",\"\",'Compressive Strength'!$B$37)","v":"Excitation:"},{"$f":"IF('Compressive Strength'!$G$24=\"\",\"\",'Compressive Strength'!$G$24)","v":1},{"$f":"IF('Compressive Strength'!$I$26=\"\",\"\",'Compressive Strength'!$I$26)","v":"1-3"}]
[139,{"$f":"IF('Compressive Strength'!$J$37=\"\",\"\",'Compressive Strength'!$J$37)","v":""},{"$f":"IF('Compressive Strength'!$B$6=\"\",\"\",'Compressive Strength'!$B$6)","v":"Tex-120-E : PART I"},{"$f":"IF('Compressive Strength'!$B$37=\"\",\"\",'Compressive Strength'!$B$37)","v":"Excitation:"},{"$f":"IF('Compressive Strength'!$J$24=\"\",\"\",'Compressive Strength'!$J$24)","v":2},{"$f":"IF('Compressive Strength'!$J$26=\"\",\"\",'Compressive Strength'!$J$26)","v":"2-1"}]
[140,{"$f":"IF('Compressive Strength'!$K$37=\"\",\"\",'Compressive Strength'!$K$37)","v":""},{"$f":"IF('Compressive Strength'!$B$6=\"\",\"\",'Compressive Strength'!$B$6)","v":"Tex-120-E : PART I"},{"$f":"IF('Compressive Strength'!$B$37=\"\",\"\",'Compressive Strength'!$B$37)","v":"Excitation:"},{"$f":"IF('Compressive Strength'!$J$24=\"\",\"\",'Compressive Strength'!$J$24)","v":2},{"$f":"IF('Compressive Strength'!$K$26=\"\",\"\",'Compressive Strength'!$K$26)","v":"2-2"}]
[141,{"$f":"IF('Compressive Strength'!$L$37=\"\",\"\",'Compressive Strength'!$L$37)","v":""},{"$f":"IF('Compressive Strength'!$B$6=\"\",\"\",'Compressive Strength'!$B$6)","v":"Tex-120-E : PART I"},{"$f":"IF('Compressive Strength'!$B$37=\"\",\"\",'Compressive Strength'!$B$37)","v":"Excitation:"},{"$f":"IF('Compressive Strength'!$J$24=\"\",\"\",'Compressive Strength'!$J$24)","v":2},{"$f":"IF('Compressive Strength'!$L$26=\"\",\"\",'Compressive Strength'!$L$26)","v":"2-3"}]
[142,{"$f":"IF('Compressive Strength'!$M$37=\"\",\"\",'Compressive Strength'!$M$37)","v":""},{"$f":"IF('Compressive Strength'!$B$6=\"\",\"\",'Compressive Strength'!$B$6)","v":"Tex-120-E : PART I"},{"$f":"IF('Compressive Strength'!$B$37=\"\",\"\",'Compressive Strength'!$B$37)","v":"Excitation:"},{"$f":"IF('Compressive Strength'!$M$24=\"\",\"\",'Compressive Strength'!$M$24)","v":3},{"$f":"IF('Compressive Strength'!$M$26=\"\",\"\",'Compressive Strength'!$M$26)","v":"3-1"}]
[143,{"$f":"IF('Compressive Strength'!$N$37=\"\",\"\",'Compressive Strength'!$N$37)","v":""},{"$f":"IF('Compressive Strength'!$B$6=\"\",\"\",'Compressive Strength'!$B$6)","v":"Tex-120-E : PART I"},{"$f":"IF('Compressive Strength'!$B$37=\"\",\"\",'Compressive Strength'!$B$37)","v":"Excitation:"},{"$f":"IF('Compressive Strength'!$M$24=\"\",\"\",'Compressive Strength'!$M$24)","v":3},{"$f":"IF('Compressive Strength'!$N$26=\"\",\"\",'Compressive Strength'!$N$26)","v":"3-2"}]
[144,{"$f":"IF('Compressive Strength'!$O$37=\"\",\"\",'Compressive Strength'!$O$37)","v":""},{"$f":"IF('Compressive Strength'!$B$6=\"\",\"\",'Compressive Strength'!$B$6)","v":"Tex-120-E : PART I"},{"$f":"IF('Compressive Strength'!$B$37=\"\",\"\",'Compressive Strength'!$B$37)","v":"Excitation:"},{"$f":"IF('Compressive Strength'!$M$24=\"\",\"\",'Compressive Strength'!$M$24)","v":3},{"$f":"IF('Compressive Strength'!$O$26=\"\",\"\",'Compressive Strength'!$O$26)","v":"3-3"}]
[145,{"$f":"IF('Compressive Strength'!$P$37=\"\",\"\",'Compressive Strength'!$P$37)","v":""},{"$f":"IF('Compressive Strength'!$B$6=\"\",\"\",'Compressive Strength'!$B$6)","v":"Tex-120-E : PART I"},{"$f":"IF('Compressive Strength'!$B$37=\"\",\"\",'Compressive Strength'!$B$37)","v":"Excitation:"},{"$f":"IF('Compressive Strength'!$P$24=\"\",\"\",'Compressive Strength'!$P$24)","v":4},{"$f":"IF('Compressive Strength'!$P$26=\"\",\"\",'Compressive Strength'!$P$26)","v":"4-1"}]
[146,{"$f":"IF('Compressive Strength'!$Q$37=\"\",\"\",'Compressive Strength'!$Q$37)","v":""},{"$f":"IF('Compressive Strength'!$B$6=\"\",\"\",'Compressive Strength'!$B$6)","v":"Tex-120-E : PART I"},{"$f":"IF('Compressive Strength'!$B$37=\"\",\"\",'Compressive Strength'!$B$37)","v":"Excitation:"},{"$f":"IF('Compressive Strength'!$P$24=\"\",\"\",'Compressive Strength'!$P$24)","v":4},{"$f":"IF('Compressive Strength'!$Q$26=\"\",\"\",'Compressive Strength'!$Q$26)","v":"4-2"}]
[147,{"$f":"IF('Compressive Strength'!$R$37=\"\",\"\",'Compressive Strength'!$R$37)","v":""},{"$f":"IF('Compressive Strength'!$B$6=\"\",\"\",'Compressive Strength'!$B$6)","v":"Tex-120-E : PART I"},{"$f":"IF('Compressive Strength'!$B$37=\"\",\"\",'Compressive Strength'!$B$37)","v":"Excitation:"},{"$f":"IF('Compressive Strength'!$P$24=\"\",\"\",'Compressive Strength'!$P$24)","v":4},{"$f":"IF('Compressive Strength'!$R$26=\"\",\"\",'Compressive Strength'!$R$26)","v":"4-3"}]
[148,{"$f":"IF('Compressive Strength'!$G$38=\"\",\"\",'Compressive Strength'!$G$38)","v":""},{"$f":"IF('Compressive Strength'!$B$6=\"\",\"\",'Compressive Strength'!$B$6)","v":"Tex-120-E : PART I"},{"$f":"IF('Compressive Strength'!$B$38=\"\",\"\",'Compressive Strength'!$B$38)","v":"Zero:"},{"$f":"IF('Compressive Strength'!$G$24=\"\",\"\",'Compressive Strength'!$G$24)","v":1},{"$f":"IF('Compressive Strength'!$G$26=\"\",\"\",'Compressive Strength'!$G$26)","v":"1-1"}]
[149,{"$f":"IF('Compressive Strength'!$H$38=\"\",\"\",'Compressive Strength'!$H$38)","v":""},{"$f":"IF('Compressive Strength'!$B$6=\"\",\"\",'Compressive Strength'!$B$6)","v":"Tex-120-E : PART I"},{"$f":"IF('Compressive Strength'!$B$38=\"\",\"\",'Compressive Strength'!$B$38)","v":"Zero:"},{"$f":"IF('Compressive Strength'!$G$24=\"\",\"\",'Compressive Strength'!$G$24)","v":1},{"$f":"IF('Compressive Strength'!$H$26=\"\",\"\",'Compressive Strength'!$H$26)","v":"1-2"}]
[150,{"$f":"IF('Compressive Strength'!$I$38=\"\",\"\",'Compressive Strength'!$I$38)","v":""},{"$f":"IF('Compressive Strength'!$B$6=\"\",\"\",'Compressive Strength'!$B$6)","v":"Tex-120-E : PART I"},{"$f":"IF('Compressive Strength'!$B$38=\"\",\"\",'Compressive Strength'!$B$38)","v":"Zero:"},{"$f":"IF('Compressive Strength'!$G$24=\"\",\"\",'Compressive Strength'!$G$24)","v":1},{"$f":"IF('Compressive Strength'!$I$26=\"\",\"\",'Compressive Strength'!$I$26)","v":"1-3"}]
[151,{"$f":"IF('Compressive Strength'!$J$38=\"\",\"\",'Compressive Strength'!$J$38)","v":""},{"$f":"IF('Compressive Strength'!$B$6=\"\",\"\",'Compressive Strength'!$B$6)","v":"Tex-120-E : PART I"},{"$f":"IF('Compressive Strength'!$B$38=\"\",\"\",'Compressive Strength'!$B$38)","v":"Zero:"},{"$f":"IF('Compressive Strength'!$J$24=\"\",\"\",'Compressive Strength'!$J$24)","v":2},{"$f":"IF('Compressive Strength'!$J$26=\"\",\"\",'Compressive Strength'!$J$26)","v":"2-1"}]
[152,{"$f":"IF('Compressive Strength'!$K$38=\"\",\"\",'Compressive Strength'!$K$38)","v":""},{"$f":"IF('Compressive Strength'!$B$6=\"\",\"\",'Compressive Strength'!$B$6)","v":"Tex-120-E : PART I"},{"$f":"IF('Compressive Strength'!$B$38=\"\",\"\",'Compressive Strength'!$B$38)","v":"Zero:"},{"$f":"IF('Compressive Strength'!$J$24=\"\",\"\",'Compressive Strength'!$J$24)","v":2},{"$f":"IF('Compressive Strength'!$K$26=\"\",\"\",'Compressive Strength'!$K$26)","v":"2-2"}]
[153,{"$f":"IF('Compressive Strength'!$L$38=\"\",\"\",'Compressive Strength'!$L$38)","v":""},{"$f":"IF('Compressive Strength'!$B$6=\"\",\"\",'Compressive Strength'!$B$6)","v":"Tex-120-E : PART I"},{"$f":"IF('Compressive Strength'!$B$38=\"\",\"\",'Compressive Strength'!$B$38)","v":"Zero:"},{"$f":"IF('Compressive Strength'!$J$24=\"\",\"\",'Compressive Strength'!$J$24)","v":2},{"$f":"IF('Compressive Strength'!$L$26=\"\",\"\",'Compressive Strength'!$L$26)","v":"2-3"}]
[154,{"$f":"IF('Compressive Strength'!$M$38=\"\",\"\",'Compressive Strength'!$M$38)","v":""},{"$f":"IF('Compressive Strength'!$B$6=\"\",\"\",'Compressive Strength'!$B$6)","v":"Tex-120-E : PART I"},{"$f":"IF('Compressive Strength'!$B$38=\"\",\"\",'Compressive Strength'!$B$38)","v":"Zero:"},{"$f":"IF('Compressive Strength'!$M$24=\"\",\"\",'Compressive Strength'!$M$24)","v":3},{"$f":"IF('Compressive Strength'!$M$26=\"\",\"\",'Compressive Strength'!$M$26)","v":"3-1"}]
[155,{"$f":"IF('Compressive Strength'!$N$38=\"\",\"\",'Compressive Strength'!$N$38)","v":""},{"$f":"IF('Compressive Strength'!$B$6=\"\",\"\",'Compressive Strength'!$B$6)","v":"Tex-120-E : PART I"},{"$f":"IF('Compressive Strength'!$B$38=\"\",\"\",'Compressive Strength'!$B$38)","v":"Zero:"},{"$f":"IF('Compressive Strength'!$M$24=\"\",\"\",'Compressive Strength'!$M$24)","v":3},{"$f":"IF('Compressive Strength'!$N$26=\"\",\"\",'Compressive Strength'!$N$26)","v":"3-2"}]
[156,{"$f":"IF('Compressive Strength'!$O$38=\"\",\"\",'Compressive Strength'!$O$38)","v":""},{"$f":"IF('Compressive Strength'!$B$6=\"\",\"\",'Compressive Strength'!$B$6)","v":"Tex-120-E : PART I"},{"$f":"IF('Compressive Strength'!$B$38=\"\",\"\",'Compressive Strength'!$B$38)","v":"Zero:"},{"$f":"IF('Compressive Strength'!$M$24=\"\",\"\",'Compressive Strength'!$M$24)","v":3},{"$f":"IF('Compressive Strength'!$O$26=\"\",\"\",'Compressive Strength'!$O$26)","v":"3-3"}]
[157,{"$f":"IF('Compressive Strength'!$P$38=\"\",\"\",'Compressive Strength'!$P$38)","v":""},{"$f":"IF('Compressive Strength'!$B$6=\"\",\"\",'Compressive Strength'!$B$6)","v":"Tex-120-E : PART I"},{"$f":"IF('Compressive Strength'!$B$38=\"\",\"\",'Compressive Strength'!$B$38)","v":"Zero:"},{"$f":"IF('Compressive Strength'!$P$24=\"\",\"\",'Compressive Strength'!$P$24)","v":4},{"$f":"IF('Compressive Strength'!$P$26=\"\",\"\",'Compressive Strength'!$P$26)","v":"4-1"}]
[158,{"$f":"IF('Compressive Strength'!$Q$38=\"\",\"\",'Compressive Strength'!$Q$38)","v":""},{"$f":"IF('Compressive Strength'!$B$6=\"\",\"\",'Compressive Strength'!$B$6)","v":"Tex-120-E : PART I"},{"$f":"IF('Compressive Strength'!$B$38=\"\",\"\",'Compressive Strength'!$B$38)","v":"Zero:"},{"$f":"IF('Compressive Strength'!$P$24=\"\",\"\",'Compressive Strength'!$P$24)","v":4},{"$f":"IF('Compressive Strength'!$Q$26=\"\",\"\",'Compressive Strength'!$Q$26)","v":"4-2"}]
[159,{"$f":"IF('Compressive Strength'!$R$38=\"\",\"\",'Compressive Strength'!$R$38)","v":""},{"$f":"IF('Compressive Strength'!$B$6=\"\",\"\",'Compressive Strength'!$B$6)","v":"Tex-120-E : PART I"},{"$f":"IF('Compressive Strength'!$B$38=\"\",\"\",'Compressive Strength'!$B$38)","v":"Zero:"},{"$f":"IF('Compressive Strength'!$P$24=\"\",\"\",'Compressive Strength'!$P$24)","v":4},{"$f":"IF('Compressive Strength'!$R$26=\"\",\"\",'Compressive Strength'!$R$26)","v":"4-3"}]
[160,{"$f":"IF('Compressive Strength'!$G$39=\"\",\"\",'Compressive Strength'!$G$39)","v":""},{"$f":"IF('Compressive Strength'!$B$6=\"\",\"\",'Compressive Strength'!$B$6)","v":"Tex-120-E : PART I"},{"$f":"IF('Compressive Strength'!$B$39=\"\",\"\",'Compressive Strength'!$B$39)","v":"Ring Factor, lbs./div"},{"$f":"IF('Compressive Strength'!$G$24=\"\",\"\",'Compressive Strength'!$G$24)","v":1},{"$f":"IF('Compressive Strength'!$G$26=\"\",\"\",'Compressive Strength'!$G$26)","v":"1-1"}]
[161,{"$f":"IF('Compressive Strength'!$H$39=\"\",\"\",'Compressive Strength'!$H$39)","v":""},{"$f":"IF('Compressive Strength'!$B$6=\"\",\"\",'Compressive Strength'!$B$6)","v":"Tex-120-E : PART I"},{"$f":"IF('Compressive Strength'!$B$39=\"\",\"\",'Compressive Strength'!$B$39)","v":"Ring Factor, lbs./div"},{"$f":"IF('Compressive Strength'!$G$24=\"\",\"\",'Compressive Strength'!$G$24)","v":1},{"$f":"IF('Compressive Strength'!$H$26=\"\",\"\",'Compressive Strength'!$H$26)","v":"1-2"}]
[162,{"$f":"IF('Compressive Strength'!$I$39=\"\",\"\",'Compressive Strength'!$I$39)","v":""},{"$f":"IF('Compressive Strength'!$B$6=\"\",\"\",'Compressive Strength'!$B$6)","v":"Tex-120-E : PART I"},{"$f":"IF('Compressive Strength'!$B$39=\"\",\"\",'Compressive Strength'!$B$39)","v":"Ring Factor, lbs./div"},{"$f":"IF('Compressive Strength'!$G$24=\"\",\"\",'Compressive Strength'!$G$24)","v":1},{"$f":"IF('Compressive Strength'!$I$26=\"\",\"\",'Compressive Strength'!$I$26)","v":"1-3"}]
[163,{"$f":"IF('Compressive Strength'!$J$39=\"\",\"\",'Compressive Strength'!$J$39)","v":""},{"$f":"IF('Compressive Strength'!$B$6=\"\",\"\",'Compressive Strength'!$B$6)","v":"Tex-120-E : PART I"},{"$f":"IF('Compressive Strength'!$B$39=\"\",\"\",'Compressive Strength'!$B$39)","v":"Ring Factor, lbs./div"},{"$f":"IF('Compressive Strength'!$J$24=\"\",\"\",'Compressive Strength'!$J$24)","v":2},{"$f":"IF('Compressive Strength'!$J$26=\"\",\"\",'Compressive Strength'!$J$26)","v":"2-1"}]
[164,{"$f":"IF('Compressive Strength'!$K$39=\"\",\"\",'Compressive Strength'!$K$39)","v":""},{"$f":"IF('Compressive Strength'!$B$6=\"\",\"\",'Compressive Strength'!$B$6)","v":"Tex-120-E : PART I"},{"$f":"IF('Compressive Strength'!$B$39=\"\",\"\",'Compressive Strength'!$B$39)","v":"Ring Factor, lbs./div"},{"$f":"IF('Compressive Strength'!$J$24=\"\",\"\",'Compressive Strength'!$J$24)","v":2},{"$f":"IF('Compressive Strength'!$K$26=\"\",\"\",'Compressive Strength'!$K$26)","v":"2-2"}]
[165,{"$f":"IF('Compressive Strength'!$L$39=\"\",\"\",'Compressive Strength'!$L$39)","v":""},{"$f":"IF('Compressive Strength'!$B$6=\"\",\"\",'Compressive Strength'!$B$6)","v":"Tex-120-E : PART I"},{"$f":"IF('Compressive Strength'!$B$39=\"\",\"\",'Compressive Strength'!$B$39)","v":"Ring Factor, lbs./div"},{"$f":"IF('Compressive Strength'!$J$24=\"\",\"\",'Compressive Strength'!$J$24)","v":2},{"$f":"IF('Compressive Strength'!$L$26=\"\",\"\",'Compressive Strength'!$L$26)","v":"2-3"}]
[166,{"$f":"IF('Compressive Strength'!$M$39=\"\",\"\",'Compressive Strength'!$M$39)","v":""},{"$f":"IF('Compressive Strength'!$B$6=\"\",\"\",'Compressive Strength'!$B$6)","v":"Tex-120-E : PART I"},{"$f":"IF('Compressive Strength'!$B$39=\"\",\"\",'Compressive Strength'!$B$39)","v":"Ring Factor, lbs./div"},{"$f":"IF('Compressive Strength'!$M$24=\"\",\"\",'Compressive Strength'!$M$24)","v":3},{"$f":"IF('Compressive Strength'!$M$26=\"\",\"\",'Compressive Strength'!$M$26)","v":"3-1"}]
[167,{"$f":"IF('Compressive Strength'!$N$39=\"\",\"\",'Compressive Strength'!$N$39)","v":""},{"$f":"IF('Compressive Strength'!$B$6=\"\",\"\",'Compressive Strength'!$B$6)","v":"Tex-120-E : PART I"},{"$f":"IF('Compressive Strength'!$B$39=\"\",\"\",'Compressive Strength'!$B$39)","v":"Ring Factor, lbs./div"},{"$f":"IF('Compressive Strength'!$M$24=\"\",\"\",'Compressive Strength'!$M$24)","v":3},{"$f":"IF('Compressive Strength'!$N$26=\"\",\"\",'Compressive Strength'!$N$26)","v":"3-2"}]
[168,{"$f":"IF('Compressive Strength'!$O$39=\"\",\"\",'Compressive Strength'!$O$39)","v":""},{"$f":"IF('Compressive Strength'!$B$6=\"\",\"\",'Compressive Strength'!$B$6)","v":"Tex-120-E : PART I"},{"$f":"IF('Compressive Strength'!$B$39=\"\",\"\",'Compressive Strength'!$B$39)","v":"Ring Factor, lbs./div"},{"$f":"IF('Compressive Strength'!$M$24=\"\",\"\",'Compressive Strength'!$M$24)","v":3},{"$f":"IF('Compressive Strength'!$O$26=\"\",\"\",'Compressive Strength'!$O$26)","v":"3-3"}]
[169,{"$f":"IF('Compressive Strength'!$P$39=\"\",\"\",'Compressive Strength'!$P$39)","v":""},{"$f":"IF('Compressive Strength'!$B$6=\"\",\"\",'Compressive Strength'!$B$6)","v":"Tex-120-E : PART I"},{"$f":"IF('Compressive Strength'!$B$39=\"\",\"\",'Compressive Strength'!$B$39)","v":"Ring Factor, lbs./div"},{"$f":"IF('Compressive Strength'!$P$24=\"\",\"\",'Compressive Strength'!$P$24)","v":4},{"$f":"IF('Compressive Strength'!$P$26=\"\",\"\",'Compressive Strength'!$P$26)","v":"4-1"}]
[170,{"$f":"IF('Compressive Strength'!$Q$39=\"\",\"\",'Compressive Strength'!$Q$39)","v":""},{"$f":"IF('Compressive Strength'!$B$6=\"\",\"\",'Compressive Strength'!$B$6)","v":"Tex-120-E : PART I"},{"$f":"IF('Compressive Strength'!$B$39=\"\",\"\",'Compressive Strength'!$B$39)","v":"Ring Factor, lbs./div"},{"$f":"IF('Compressive Strength'!$P$24=\"\",\"\",'Compressive Strength'!$P$24)","v":4},{"$f":"IF('Compressive Strength'!$Q$26=\"\",\"\",'Compressive Strength'!$Q$26)","v":"4-2"}]
[171,{"$f":"IF('Compressive Strength'!$R$39=\"\",\"\",'Compressive Strength'!$R$39)","v":""},{"$f":"IF('Compressive Strength'!$B$6=\"\",\"\",'Compressive Strength'!$B$6)","v":"Tex-120-E : PART I"},{"$f":"IF('Compressive Strength'!$B$39=\"\",\"\",'Compressive Strength'!$B$39)","v":"Ring Factor, lbs./div"},{"$f":"IF('Compressive Strength'!$P$24=\"\",\"\",'Compressive Strength'!$P$24)","v":4},{"$f":"IF('Compressive Strength'!$R$26=\"\",\"\",'Compressive Strength'!$R$26)","v":"4-3"}]
[172,{"$f":"IF('Compressive Strength'!$G$40=\"\",\"\",'Compressive Strength'!$G$40)","v":""},{"$f":"IF('Compressive Strength'!$B$6=\"\",\"\",'Compressive Strength'!$B$6)","v":"Tex-120-E : PART I"},{"$f":"IF('Compressive Strength'!$B$40=\"\",\"\",'Compressive Strength'!$B$40)","v":"Dead Load, lbs.:"},{"$f":"IF('Compressive Strength'!$G$24=\"\",\"\",'Compressive Strength'!$G$24)","v":1},{"$f":"IF('Compressive Strength'!$G$26=\"\",\"\",'Compressive Strength'!$G$26)","v":"1-1"}]
[173,{"$f":"IF('Compressive Strength'!$H$40=\"\",\"\",'Compressive Strength'!$H$40)","v":""},{"$f":"IF('Compressive Strength'!$B$6=\"\",\"\",'Compressive Strength'!$B$6)","v":"Tex-120-E : PART I"},{"$f":"IF('Compressive Strength'!$B$40=\"\",\"\",'Compressive Strength'!$B$40)","v":"Dead Load, lbs.:"},{"$f":"IF('Compressive Strength'!$G$24=\"\",\"\",'Compressive Strength'!$G$24)","v":1},{"$f":"IF('Compressive Strength'!$H$26=\"\",\"\",'Compressive Strength'!$H$26)","v":"1-2"}]
[174,{"$f":"IF('Compressive Strength'!$I$40=\"\",\"\",'Compressive Strength'!$I$40)","v":""},{"$f":"IF('Compressive Strength'!$B$6=\"\",\"\",'Compressive Strength'!$B$6)","v":"Tex-120-E : PART I"},{"$f":"IF('Compressive Strength'!$B$40=\"\",\"\",'Compressive Strength'!$B$40)","v":"Dead Load, lbs.:"},{"$f":"IF('Compressive Strength'!$G$24=\"\",\"\",'Compressive Strength'!$G$24)","v":1},{"$f":"IF('Compressive Strength'!$I$26=\"\",\"\",'Compressive Strength'!$I$26)","v":"1-3"}]
[175,{"$f":"IF('Compressive Strength'!$J$40=\"\",\"\",'Compressive Strength'!$J$40)","v":""},{"$f":"IF('Compressive Strength'!$B$6=\"\",\"\",'Compressive Strength'!$B$6)","v":"Tex-120-E : PART I"},{"$f":"IF('Compressive Strength'!$B$40=\"\",\"\",'Compressive Strength'!$B$40)","v":"Dead Load, lbs.:"},{"$f":"IF('Compressive Strength'!$J$24=\"\",\"\",'Compressive Strength'!$J$24)","v":2},{"$f":"IF('Compressive Strength'!$J$26=\"\",\"\",'Compressive Strength'!$J$26)","v":"2-1"}]
[176,{"$f":"IF('Compressive Strength'!$K$40=\"\",\"\",'Compressive Strength'!$K$40)","v":""},{"$f":"IF('Compressive Strength'!$B$6=\"\",\"\",'Compressive Strength'!$B$6)","v":"Tex-120-E : PART I"},{"$f":"IF('Compressive Strength'!$B$40=\"\",\"\",'Compressive Strength'!$B$40)","v":"Dead Load, lbs.:"},{"$f":"IF('Compressive Strength'!$J$24=\"\",\"\",'Compressive Strength'!$J$24)","v":2},{"$f":"IF('Compressive Strength'!$K$26=\"\",\"\",'Compressive Strength'!$K$26)","v":"2-2"}]
[177,{"$f":"IF('Compressive Strength'!$L$40=\"\",\"\",'Compressive Strength'!$L$40)","v":""},{"$f":"IF('Compressive Strength'!$B$6=\"\",\"\",'Compressive Strength'!$B$6)","v":"Tex-120-E : PART I"},{"$f":"IF('Compressive Strength'!$B$40=\"\",\"\",'Compressive Strength'!$B$40)","v":"Dead Load, lbs.:"},{"$f":"IF('Compressive Strength'!$J$24=\"\",\"\",'Compressive Strength'!$J$24)","v":2},{"$f":"IF('Compressive Strength'!$L$26=\"\",\"\",'Compressive Strength'!$L$26)","v":"2-3"}]
[178,{"$f":"IF('Compressive Strength'!$M$40=\"\",\"\",'Compressive Strength'!$M$40)","v":""},{"$f":"IF('Compressive Strength'!$B$6=\"\",\"\",'Compressive Strength'!$B$6)","v":"Tex-120-E : PART I"},{"$f":"IF('Compressive Strength'!$B$40=\"\",\"\",'Compressive Strength'!$B$40)","v":"Dead Load, lbs.:"},{"$f":"IF('Compressive Strength'!$M$24=\"\",\"\",'Compressive Strength'!$M$24)","v":3},{"$f":"IF('Compressive Strength'!$M$26=\"\",\"\",'Compressive Strength'!$M$26)","v":"3-1"}]
[179,{"$f":"IF('Compressive Strength'!$N$40=\"\",\"\",'Compressive Strength'!$N$40)","v":""},{"$f":"IF('Compressive Strength'!$B$6=\"\",\"\",'Compressive Strength'!$B$6)","v":"Tex-120-E : PART I"},{"$f":"IF('Compressive Strength'!$B$40=\"\",\"\",'Compressive Strength'!$B$40)","v":"Dead Load, lbs.:"},{"$f":"IF('Compressive Strength'!$M$24=\"\",\"\",'Compressive Strength'!$M$24)","v":3},{"$f":"IF('Compressive Strength'!$N$26=\"\",\"\",'Compressive Strength'!$N$26)","v":"3-2"}]
[180,{"$f":"IF('Compressive Strength'!$O$40=\"\",\"\",'Compressive Strength'!$O$40)","v":""},{"$f":"IF('Compressive Strength'!$B$6=\"\",\"\",'Compressive Strength'!$B$6)","v":"Tex-120-E : PART I"},{"$f":"IF('Compressive Strength'!$B$40=\"\",\"\",'Compressive Strength'!$B$40)","v":"Dead Load, lbs.:"},{"$f":"IF('Compressive Strength'!$M$24=\"\",\"\",'Compressive Strength'!$M$24)","v":3},{"$f":"IF('Compressive Strength'!$O$26=\"\",\"\",'Compressive Strength'!$O$26)","v":"3-3"}]
[181,{"$f":"IF('Compressive Strength'!$P$40=\"\",\"\",'Compressive Strength'!$P$40)","v":""},{"$f":"IF('Compressive Strength'!$B$6=\"\",\"\",'Compressive Strength'!$B$6)","v":"Tex-120-E : PART I"},{"$f":"IF('Compressive Strength'!$B$40=\"\",\"\",'Compressive Strength'!$B$40)","v":"Dead Load, lbs.:"},{"$f":"IF('Compressive Strength'!$P$24=\"\",\"\",'Compressive Strength'!$P$24)","v":4},{"$f":"IF('Compressive Strength'!$P$26=\"\",\"\",'Compressive Strength'!$P$26)","v":"4-1"}]
[182,{"$f":"IF('Compressive Strength'!$Q$40=\"\",\"\",'Compressive Strength'!$Q$40)","v":""},{"$f":"IF('Compressive Strength'!$B$6=\"\",\"\",'Compressive Strength'!$B$6)","v":"Tex-120-E : PART I"},{"$f":"IF('Compressive Strength'!$B$40=\"\",\"\",'Compressive Strength'!$B$40)","v":"Dead Load, lbs.:"},{"$f":"IF('Compressive Strength'!$P$24=\"\",\"\",'Compressive Strength'!$P$24)","v":4},{"$f":"IF('Compressive Strength'!$Q$26=\"\",\"\",'Compressive Strength'!$Q$26)","v":"4-2"}]
[183,{"$f":"IF('Compressive Strength'!$R$40=\"\",\"\",'Compressive Strength'!$R$40)","v":""},{"$f":"IF('Compressive Strength'!$B$6=\"\",\"\",'Compressive Strength'!$B$6)","v":"Tex-120-E : PART I"},{"$f":"IF('Compressive Strength'!$B$40=\"\",\"\",'Compressive Strength'!$B$40)","v":"Dead Load, lbs.:"},{"$f":"IF('Compressive Strength'!$P$24=\"\",\"\",'Compressive Strength'!$P$24)","v":4},{"$f":"IF('Compressive Strength'!$R$26=\"\",\"\",'Compressive Strength'!$R$26)","v":"4-3"}]
[184,{"$f":"IF('Compressive Strength'!$G$41=\"\",\"\",'Compressive Strength'!$G$41)","v":""},{"$f":"IF('Compressive Strength'!$B$6=\"\",\"\",'Compressive Strength'!$B$6)","v":"Tex-120-E : PART I"},{"$f":"IF('Compressive Strength'!$B$41=\"\",\"\",'Compressive Strength'!$B$41)","v":"Piston Correction, lbs.:"},{"$f":"IF('Compressive Strength'!$G$24=\"\",\"\",'Compressive Strength'!$G$24)","v":1},{"$f":"IF('Compressive Strength'!$G$26=\"\",\"\",'Compressive Strength'!$G$26)","v":"1-1"}]
[185,{"$f":"IF('Compressive Strength'!$H$41=\"\",\"\",'Compressive Strength'!$H$41)","v":""},{"$f":"IF('Compressive Strength'!$B$6=\"\",\"\",'Compressive Strength'!$B$6)","v":"Tex-120-E : PART I"},{"$f":"IF('Compressive Strength'!$B$41=\"\",\"\",'Compressive Strength'!$B$41)","v":"Piston Correction, lbs.:"},{"$f":"IF('Compressive Strength'!$G$24=\"\",\"\",'Compressive Strength'!$G$24)","v":1},{"$f":"IF('Compressive Strength'!$H$26=\"\",\"\",'Compressive Strength'!$H$26)","v":"1-2"}]
[186,{"$f":"IF('Compressive Strength'!$I$41=\"\",\"\",'Compressive Strength'!$I$41)","v":""},{"$f":"IF('Compressive Strength'!$B$6=\"\",\"\",'Compressive Strength'!$B$6)","v":"Tex-120-E : PART I"},{"$f":"IF('Compressive Strength'!$B$41=\"\",\"\",'Compressive Strength'!$B$41)","v":"Piston Correction, lbs.:"},{"$f":"IF('Compressive Strength'!$G$24=\"\",\"\",'Compressive Strength'!$G$24)","v":1},{"$f":"IF('Compressive Strength'!$I$26=\"\",\"\",'Compressive Strength'!$I$26)","v":"1-3"}]
[187,{"$f":"IF('Compressive Strength'!$J$41=\"\",\"\",'Compressive Strength'!$J$41)","v":""},{"$f":"IF('Compressive Strength'!$B$6=\"\",\"\",'Compressive Strength'!$B$6)","v":"Tex-120-E : PART I"},{"$f":"IF('Compressive Strength'!$B$41=\"\",\"\",'Compressive Strength'!$B$41)","v":"Piston Correction, lbs.:"},{"$f":"IF('Compressive Strength'!$J$24=\"\",\"\",'Compressive Strength'!$J$24)","v":2},{"$f":"IF('Compressive Strength'!$J$26=\"\",\"\",'Compressive Strength'!$J$26)","v":"2-1"}]
[188,{"$f":"IF('Compressive Strength'!$K$41=\"\",\"\",'Compressive Strength'!$K$41)","v":""},{"$f":"IF('Compressive Strength'!$B$6=\"\",\"\",'Compressive Strength'!$B$6)","v":"Tex-120-E : PART I"},{"$f":"IF('Compressive Strength'!$B$41=\"\",\"\",'Compressive Strength'!$B$41)","v":"Piston Correction, lbs.:"},{"$f":"IF('Compressive Strength'!$J$24=\"\",\"\",'Compressive Strength'!$J$24)","v":2},{"$f":"IF('Compressive Strength'!$K$26=\"\",\"\",'Compressive Strength'!$K$26)","v":"2-2"}]
[189,{"$f":"IF('Compressive Strength'!$L$41=\"\",\"\",'Compressive Strength'!$L$41)","v":""},{"$f":"IF('Compressive Strength'!$B$6=\"\",\"\",'Compressive Strength'!$B$6)","v":"Tex-120-E : PART I"},{"$f":"IF('Compressive Strength'!$B$41=\"\",\"\",'Compressive Strength'!$B$41)","v":"Piston Correction, lbs.:"},{"$f":"IF('Compressive Strength'!$J$24=\"\",\"\",'Compressive Strength'!$J$24)","v":2},{"$f":"IF('Compressive Strength'!$L$26=\"\",\"\",'Compressive Strength'!$L$26)","v":"2-3"}]
[190,{"$f":"IF('Compressive Strength'!$M$41=\"\",\"\",'Compressive Strength'!$M$41)","v":""},{"$f":"IF('Compressive Strength'!$B$6=\"\",\"\",'Compressive Strength'!$B$6)","v":"Tex-120-E : PART I"},{"$f":"IF('Compressive Strength'!$B$41=\"\",\"\",'Compressive Strength'!$B$41)","v":"Piston Correction, lbs.:"},{"$f":"IF('Compressive Strength'!$M$24=\"\",\"\",'Compressive Strength'!$M$24)","v":3},{"$f":"IF('Compressive Strength'!$M$26=\"\",\"\",'Compressive Strength'!$M$26)","v":"3-1"}]
[191,{"$f":"IF('Compressive Strength'!$N$41=\"\",\"\",'Compressive Strength'!$N$41)","v":""},{"$f":"IF('Compressive Strength'!$B$6=\"\",\"\",'Compressive Strength'!$B$6)","v":"Tex-120-E : PART I"},{"$f":"IF('Compressive Strength'!$B$41=\"\",\"\",'Compressive Strength'!$B$41)","v":"Piston Correction, lbs.:"},{"$f":"IF('Compressive Strength'!$M$24=\"\",\"\",'Compressive Strength'!$M$24)","v":3},{"$f":"IF('Compressive Strength'!$N$26=\"\",\"\",'Compressive Strength'!$N$26)","v":"3-2"}]
[192,{"$f":"IF('Compressive Strength'!$O$41=\"\",\"\",'Compressive Strength'!$O$41)","v":""},{"$f":"IF('Compressive Strength'!$B$6=\"\",\"\",'Compressive Strength'!$B$6)","v":"Tex-120-E : PART I"},{"$f":"IF('Compressive Strength'!$B$41=\"\",\"\",'Compressive Strength'!$B$41)","v":"Piston Correction, lbs.:"},{"$f":"IF('Compressive Strength'!$M$24=\"\",\"\",'Compressive Strength'!$M$24)","v":3},{"$f":"IF('Compressive Strength'!$O$26=\"\",\"\",'Compressive Strength'!$O$26)","v":"3-3"}]
[193,{"$f":"IF('Compressive Strength'!$P$41=\"\",\"\",'Compressive Strength'!$P$41)","v":""},{"$f":"IF('Compressive Strength'!$B$6=\"\",\"\",'Compressive Strength'!$B$6)","v":"Tex-120-E : PART I"},{"$f":"IF('Compressive Strength'!$B$41=\"\",\"\",'Compressive Strength'!$B$41)","v":"Piston Correction, lbs.:"},{"$f":"IF('Compressive Strength'!$P$24=\"\",\"\",'Compressive Strength'!$P$24)","v":4},{"$f":"IF('Compressive Strength'!$P$26=\"\",\"\",'Compressive Strength'!$P$26)","v":"4-1"}]
[194,{"$f":"IF('Compressive Strength'!$Q$41=\"\",\"\",'Compressive Strength'!$Q$41)","v":""},{"$f":"IF('Compressive Strength'!$B$6=\"\",\"\",'Compressive Strength'!$B$6)","v":"Tex-120-E : PART I"},{"$f":"IF('Compressive Strength'!$B$41=\"\",\"\",'Compressive Strength'!$B$41)","v":"Piston Correction, lbs.:"},{"$f":"IF('Compressive Strength'!$P$24=\"\",\"\",'Compressive Strength'!$P$24)","v":4},{"$f":"IF('Compressive Strength'!$Q$26=\"\",\"\",'Compressive Strength'!$Q$26)","v":"4-2"}]
[195,{"$f":"IF('Compressive Strength'!$R$41=\"\",\"\",'Compressive Strength'!$R$41)","v":""},{"$f":"IF('Compressive Strength'!$B$6=\"\",\"\",'Compressive Strength'!$B$6)","v":"Tex-120-E : PART I"},{"$f":"IF('Compressive Strength'!$B$41=\"\",\"\",'Compressive Strength'!$B$41)","v":"Piston Correction, lbs.:"},{"$f":"IF('Compressive Strength'!$P$24=\"\",\"\",'Compressive Strength'!$P$24)","v":4},{"$f":"IF('Compressive Strength'!$R$26=\"\",\"\",'Compressive Strength'!$R$26)","v":"4-3"}]
[196,{"$f":"IF('Compressive Strength'!$G$42=\"\",\"\",'Compressive Strength'!$G$42)","v":""},{"$f":"IF('Compressive Strength'!$B$6=\"\",\"\",'Compressive Strength'!$B$6)","v":"Tex-120-E : PART I"},{"$f":"IF('Compressive Strength'!$B$42=\"\",\"\",'Compressive Strength'!$B$42)","v":"Max. Load Reading, div.:"},{"$f":"IF('Compressive Strength'!$G$24=\"\",\"\",'Compressive Strength'!$G$24)","v":1},{"$f":"IF('Compressive Strength'!$G$26=\"\",\"\",'Compressive Strength'!$G$26)","v":"1-1"}]
[197,{"$f":"IF('Compressive Strength'!$H$42=\"\",\"\",'Compressive Strength'!$H$42)","v":""},{"$f":"IF('Compressive Strength'!$B$6=\"\",\"\",'Compressive Strength'!$B$6)","v":"Tex-120-E : PART I"},{"$f":"IF('Compressive Strength'!$B$42=\"\",\"\",'Compressive Strength'!$B$42)","v":"Max. Load Reading, div.:"},{"$f":"IF('Compressive Strength'!$G$24=\"\",\"\",'Compressive Strength'!$G$24)","v":1},{"$f":"IF('Compressive Strength'!$H$26=\"\",\"\",'Compressive Strength'!$H$26)","v":"1-2"}]
[198,{"$f":"IF('Compressive Strength'!$I$42=\"\",\"\",'Compressive Strength'!$I$42)","v":""},{"$f":"IF('Compressive Strength'!$B$6=\"\",\"\",'Compressive Strength'!$B$6)","v":"Tex-120-E : PART I"},{"$f":"IF('Compressive Strength'!$B$42=\"\",\"\",'Compressive Strength'!$B$42)","v":"Max. Load Reading, div.:"},{"$f":"IF('Compressive Strength'!$G$24=\"\",\"\",'Compressive Strength'!$G$24)","v":1},{"$f":"IF('Compressive Strength'!$I$26=\"\",\"\",'Compressive Strength'!$I$26)","v":"1-3"}]
[199,{"$f":"IF('Compressive Strength'!$J$42=\"\",\"\",'Compressive Strength'!$J$42)","v":""},{"$f":"IF('Compressive Strength'!$B$6=\"\",\"\",'Compressive Strength'!$B$6)","v":"Tex-120-E : PART I"},{"$f":"IF('Compressive Strength'!$B$42=\"\",\"\",'Compressive Strength'!$B$42)","v":"Max. Load Reading, div.:"},{"$f":"IF('Compressive Strength'!$J$24=\"\",\"\",'Compressive Strength'!$J$24)","v":2},{"$f":"IF('Compressive Strength'!$J$26=\"\",\"\",'Compressive Strength'!$J$26)","v":"2-1"}]
[200,{"$f":"IF('Compressive Strength'!$K$42=\"\",\"\",'Compressive Strength'!$K$42)","v":""},{"$f":"IF('Compressive Strength'!$B$6=\"\",\"\",'Compressive Strength'!$B$6)","v":"Tex-120-E : PART I"},{"$f":"IF('Compressive Strength'!$B$42=\"\",\"\",'Compressive Strength'!$B$42)","v":"Max. Load Reading, div.:"},{"$f":"IF('Compressive Strength'!$J$24=\"\",\"\",'Compressive Strength'!$J$24)","v":2},{"$f":"IF('Compressive Strength'!$K$26=\"\",\"\",'Compressive Strength'!$K$26)","v":"2-2"}]
[201,{"$f":"IF('Compressive Strength'!$L$42=\"\",\"\",'Compressive Strength'!$L$42)","v":""},{"$f":"IF('Compressive Strength'!$B$6=\"\",\"\",'Compressive Strength'!$B$6)","v":"Tex-120-E : PART I"},{"$f":"IF('Compressive Strength'!$B$42=\"\",\"\",'Compressive Strength'!$B$42)","v":"Max. Load Reading, div.:"},{"$f":"IF('Compressive Strength'!$J$24=\"\",\"\",'Compressive Strength'!$J$24)","v":2},{"$f":"IF('Compressive Strength'!$L$26=\"\",\"\",'Compressive Strength'!$L$26)","v":"2-3"}]
[202,{"$f":"IF('Compressive Strength'!$M$42=\"\",\"\",'Compressive Strength'!$M$42)","v":""},{"$f":"IF('Compressive Strength'!$B$6=\"\",\"\",'Compressive Strength'!$B$6)","v":"Tex-120-E : PART I"},{"$f":"IF('Compressive Strength'!$B$42=\"\",\"\",'Compressive Strength'!$B$42)","v":"Max. Load Reading, div.:"},{"$f":"IF('Compressive Strength'!$M$24=\"\",\"\",'Compressive Strength'!$M$24)","v":3},{"$f":"IF('Compressive Strength'!$M$26=\"\",\"\",'Compressive Strength'!$M$26)","v":"3-1"}]
[203,{"$f":"IF('Compressive Strength'!$N$42=\"\",\"\",'Compressive Strength'!$N$42)","v":""},{"$f":"IF('Compressive Strength'!$B$6=\"\",\"\",'Compressive Strength'!$B$6)","v":"Tex-120-E : PART I"},{"$f":"IF('Compressive Strength'!$B$42=\"\",\"\",'Compressive Strength'!$B$42)","v":"Max. Load Reading, div.:"},{"$f":"IF('Compressive Strength'!$M$24=\"\",\"\",'Compressive Strength'!$M$24)","v":3},{"$f":"IF('Compressive Strength'!$N$26=\"\",\"\",'Compressive Strength'!$N$26)","v":"3-2"}]
[204,{"$f":"IF('Compressive Strength'!$O$42=\"\",\"\",'Compressive Strength'!$O$42)","v":""},{"$f":"IF('Compressive Strength'!$B$6=\"\",\"\",'Compressive Strength'!$B$6)","v":"Tex-120-E : PART I"},{"$f":"IF('Compressive Strength'!$B$42=\"\",\"\",'Compressive Strength'!$B$42)","v":"Max. Load Reading, div.:"},{"$f":"IF('Compressive Strength'!$M$24=\"\",\"\",'Compressive Strength'!$M$24)","v":3},{"$f":"IF('Compressive Strength'!$O$26=\"\",\"\",'Compressive Strength'!$O$26)","v":"3-3"}]
[205,{"$f":"IF('Compressive Strength'!$P$42=\"\",\"\",'Compressive Strength'!$P$42)","v":""},{"$f":"IF('Compressive Strength'!$B$6=\"\",\"\",'Compressive Strength'!$B$6)","v":"Tex-120-E : PART I"},{"$f":"IF('Compressive Strength'!$B$42=\"\",\"\",'Compressive Strength'!$B$42)","v":"Max. Load Reading, div.:"},{"$f":"IF('Compressive Strength'!$P$24=\"\",\"\",'Compressive Strength'!$P$24)","v":4},{"$f":"IF('Compressive Strength'!$P$26=\"\",\"\",'Compressive Strength'!$P$26)","v":"4-1"}]
[206,{"$f":"IF('Compressive Strength'!$Q$42=\"\",\"\",'Compressive Strength'!$Q$42)","v":""},{"$f":"IF('Compressive Strength'!$B$6=\"\",\"\",'Compressive Strength'!$B$6)","v":"Tex-120-E : PART I"},{"$f":"IF('Compressive Strength'!$B$42=\"\",\"\",'Compressive Strength'!$B$42)","v":"Max. Load Reading, div.:"},{"$f":"IF('Compressive Strength'!$P$24=\"\",\"\",'Compressive Strength'!$P$24)","v":4},{"$f":"IF('Compressive Strength'!$Q$26=\"\",\"\",'Compressive Strength'!$Q$26)","v":"4-2"}]
[207,{"$f":"IF('Compressive Strength'!$R$42=\"\",\"\",'Compressive Strength'!$R$42)","v":""},{"$f":"IF('Compressive Strength'!$B$6=\"\",\"\",'Compressive Strength'!$B$6)","v":"Tex-120-E : PART I"},{"$f":"IF('Compressive Strength'!$B$42=\"\",\"\",'Compressive Strength'!$B$42)","v":"Max. Load Reading, div.:"},{"$f":"IF('Compressive Strength'!$P$24=\"\",\"\",'Compressive Strength'!$P$24)","v":4},{"$f":"IF('Compressive Strength'!$R$26=\"\",\"\",'Compressive Strength'!$R$26)","v":"4-3"}]
[208,{"$f":"IF('Compressive Strength'!$G$43=\"\",\"\",'Compressive Strength'!$G$43)","v":""},{"$f":"IF('Compressive Strength'!$B$6=\"\",\"\",'Compressive Strength'!$B$6)","v":"Tex-120-E : PART I"},{"$f":"IF('Compressive Strength'!$B$43=\"\",\"\",'Compressive Strength'!$B$43)","v":"Max Load, lbs.:"},{"$f":"IF('Compressive Strength'!$G$24=\"\",\"\",'Compressive Strength'!$G$24)","v":1},{"$f":"IF('Compressive Strength'!$G$26=\"\",\"\",'Compressive Strength'!$G$26)","v":"1-1"}]
[209,{"$f":"IF('Compressive Strength'!$H$43=\"\",\"\",'Compressive Strength'!$H$43)","v":""},{"$f":"IF('Compressive Strength'!$B$6=\"\",\"\",'Compressive Strength'!$B$6)","v":"Tex-120-E : PART I"},{"$f":"IF('Compressive Strength'!$B$43=\"\",\"\",'Compressive Strength'!$B$43)","v":"Max Load, lbs.:"},{"$f":"IF('Compressive Strength'!$G$24=\"\",\"\",'Compressive Strength'!$G$24)","v":1},{"$f":"IF('Compressive Strength'!$H$26=\"\",\"\",'Compressive Strength'!$H$26)","v":"1-2"}]
[210,{"$f":"IF('Compressive Strength'!$I$43=\"\",\"\",'Compressive Strength'!$I$43)","v":""},{"$f":"IF('Compressive Strength'!$B$6=\"\",\"\",'Compressive Strength'!$B$6)","v":"Tex-120-E : PART I"},{"$f":"IF('Compressive Strength'!$B$43=\"\",\"\",'Compressive Strength'!$B$43)","v":"Max Load, lbs.:"},{"$f":"IF('Compressive Strength'!$G$24=\"\",\"\",'Compressive Strength'!$G$24)","v":1},{"$f":"IF('Compressive Strength'!$I$26=\"\",\"\",'Compressive Strength'!$I$26)","v":"1-3"}]
[211,{"$f":"IF('Compressive Strength'!$J$43=\"\",\"\",'Compressive Strength'!$J$43)","v":""},{"$f":"IF('Compressive Strength'!$B$6=\"\",\"\",'Compressive Strength'!$B$6)","v":"Tex-120-E : PART I"},{"$f":"IF('Compressive Strength'!$B$43=\"\",\"\",'Compressive Strength'!$B$43)","v":"Max Load, lbs.:"},{"$f":"IF('Compressive Strength'!$J$24=\"\",\"\",'Compressive Strength'!$J$24)","v":2},{"$f":"IF('Compressive Strength'!$J$26=\"\",\"\",'Compressive Strength'!$J$26)","v":"2-1"}]
[212,{"$f":"IF('Compressive Strength'!$K$43=\"\",\"\",'Compressive Strength'!$K$43)","v":""},{"$f":"IF('Compressive Strength'!$B$6=\"\",\"\",'Compressive Strength'!$B$6)","v":"Tex-120-E : PART I"},{"$f":"IF('Compressive Strength'!$B$43=\"\",\"\",'Compressive Strength'!$B$43)","v":"Max Load, lbs.:"},{"$f":"IF('Compressive Strength'!$J$24=\"\",\"\",'Compressive Strength'!$J$24)","v":2},{"$f":"IF('Compressive Strength'!$K$26=\"\",\"\",'Compressive Strength'!$K$26)","v":"2-2"}]
[213,{"$f":"IF('Compressive Strength'!$L$43=\"\",\"\",'Compressive Strength'!$L$43)","v":""},{"$f":"IF('Compressive Strength'!$B$6=\"\",\"\",'Compressive Strength'!$B$6)","v":"Tex-120-E : PART I"},{"$f":"IF('Compressive Strength'!$B$43=\"\",\"\",'Compressive Strength'!$B$43)","v":"Max Load, lbs.:"},{"$f":"IF('Compressive Strength'!$J$24=\"\",\"\",'Compressive Strength'!$J$24)","v":2},{"$f":"IF('Compressive Strength'!$L$26=\"\",\"\",'Compressive Strength'!$L$26)","v":"2-3"}]
[214,{"$f":"IF('Compressive Strength'!$M$43=\"\",\"\",'Compressive Strength'!$M$43)","v":""},{"$f":"IF('Compressive Strength'!$B$6=\"\",\"\",'Compressive Strength'!$B$6)","v":"Tex-120-E : PART I"},{"$f":"IF('Compressive Strength'!$B$43=\"\",\"\",'Compressive Strength'!$B$43)","v":"Max Load, lbs.:"},{"$f":"IF('Compressive Strength'!$M$24=\"\",\"\",'Compressive Strength'!$M$24)","v":3},{"$f":"IF('Compressive Strength'!$M$26=\"\",\"\",'Compressive Strength'!$M$26)","v":"3-1"}]
[215,{"$f":"IF('Compressive Strength'!$N$43=\"\",\"\",'Compressive Strength'!$N$43)","v":""},{"$f":"IF('Compressive Strength'!$B$6=\"\",\"\",'Compressive Strength'!$B$6)","v":"Tex-120-E : PART I"},{"$f":"IF('Compressive Strength'!$B$43=\"\",\"\",'Compressive Strength'!$B$43)","v":"Max Load, lbs.:"},{"$f":"IF('Compressive Strength'!$M$24=\"\",\"\",'Compressive Strength'!$M$24)","v":3},{"$f":"IF('Compressive Strength'!$N$26=\"\",\"\",'Compressive Strength'!$N$26)","v":"3-2"}]
[216,{"$f":"IF('Compressive Strength'!$O$43=\"\",\"\",'Compressive Strength'!$O$43)","v":""},{"$f":"IF('Compressive Strength'!$B$6=\"\",\"\",'Compressive Strength'!$B$6)","v":"Tex-120-E : PART I"},{"$f":"IF('Compressive Strength'!$B$43=\"\",\"\",'Compressive Strength'!$B$43)","v":"Max Load, lbs.:"},{"$f":"IF('Compressive Strength'!$M$24=\"\",\"\",'Compressive Strength'!$M$24)","v":3},{"$f":"IF('Compressive Strength'!$O$26=\"\",\"\",'Compressive Strength'!$O$26)","v":"3-3"}]
[217,{"$f":"IF('Compressive Strength'!$P$43=\"\",\"\",'Compressive Strength'!$P$43)","v":""},{"$f":"IF('Compressive Strength'!$B$6=\"\",\"\",'Compressive Strength'!$B$6)","v":"Tex-120-E : PART I"},{"$f":"IF('Compressive Strength'!$B$43=\"\",\"\",'Compressive Strength'!$B$43)","v":"Max Load, lbs.:"},{"$f":"IF('Compressive Strength'!$P$24=\"\",\"\",'Compressive Strength'!$P$24)","v":4},{"$f":"IF('Compressive Strength'!$P$26=\"\",\"\",'Compressive Strength'!$P$26)","v":"4-1"}]
[218,{"$f":"IF('Compressive Strength'!$Q$43=\"\",\"\",'Compressive Strength'!$Q$43)","v":""},{"$f":"IF('Compressive Strength'!$B$6=\"\",\"\",'Compressive Strength'!$B$6)","v":"Tex-120-E : PART I"},{"$f":"IF('Compressive Strength'!$B$43=\"\",\"\",'Compressive Strength'!$B$43)","v":"Max Load, lbs.:"},{"$f":"IF('Compressive Strength'!$P$24=\"\",\"\",'Compressive Strength'!$P$24)","v":4},{"$f":"IF('Compressive Strength'!$Q$26=\"\",\"\",'Compressive Strength'!$Q$26)","v":"4-2"}]
[219,{"$f":"IF('Compressive Strength'!$R$43=\"\",\"\",'Compressive Strength'!$R$43)","v":""},{"$f":"IF('Compressive Strength'!$B$6=\"\",\"\",'Compressive Strength'!$B$6)","v":"Tex-120-E : PART I"},{"$f":"IF('Compressive Strength'!$B$43=\"\",\"\",'Compressive Strength'!$B$43)","v":"Max Load, lbs.:"},{"$f":"IF('Compressive Strength'!$P$24=\"\",\"\",'Compressive Strength'!$P$24)","v":4},{"$f":"IF('Compressive Strength'!$R$26=\"\",\"\",'Compressive Strength'!$R$26)","v":"4-3"}]
[220,{"$f":"IF('Compressive Strength'!$G$44=\"\",\"\",'Compressive Strength'!$G$44)","v":""},{"$f":"IF('Compressive Strength'!$B$6=\"\",\"\",'Compressive Strength'!$B$6)","v":"Tex-120-E : PART I"},{"$f":"IF('Compressive Strength'!$B$44=\"\",\"\",'Compressive Strength'!$B$44)","v":"Deformation at Max Load, in.:"},{"$f":"IF('Compressive Strength'!$G$24=\"\",\"\",'Compressive Strength'!$G$24)","v":1},{"$f":"IF('Compressive Strength'!$G$26=\"\",\"\",'Compressive Strength'!$G$26)","v":"1-1"}]
[221,{"$f":"IF('Compressive Strength'!$H$44=\"\",\"\",'Compressive Strength'!$H$44)","v":""},{"$f":"IF('Compressive Strength'!$B$6=\"\",\"\",'Compressive Strength'!$B$6)","v":"Tex-120-E : PART I"},{"$f":"IF('Compressive Strength'!$B$44=\"\",\"\",'Compressive Strength'!$B$44)","v":"Deformation at Max Load, in.:"},{"$f":"IF('Compressive Strength'!$G$24=\"\",\"\",'Compressive Strength'!$G$24)","v":1},{"$f":"IF('Compressive Strength'!$H$26=\"\",\"\",'Compressive Strength'!$H$26)","v":"1-2"}]
[222,{"$f":"IF('Compressive Strength'!$I$44=\"\",\"\",'Compressive Strength'!$I$44)","v":""},{"$f":"IF('Compressive Strength'!$B$6=\"\",\"\",'Compressive Strength'!$B$6)","v":"Tex-120-E : PART I"},{"$f":"IF('Compressive Strength'!$B$44=\"\",\"\",'Compressive Strength'!$B$44)","v":"Deformation at Max Load, in.:"},{"$f":"IF('Compressive Strength'!$G$24=\"\",\"\",'Compressive Strength'!$G$24)","v":1},{"$f":"IF('Compressive Strength'!$I$26=\"\",\"\",'Compressive Strength'!$I$26)","v":"1-3"}]
[223,{"$f":"IF('Compressive Strength'!$J$44=\"\",\"\",'Compressive Strength'!$J$44)","v":""},{"$f":"IF('Compressive Strength'!$B$6=\"\",\"\",'Compressive Strength'!$B$6)","v":"Tex-120-E : PART I"},{"$f":"IF('Compressive Strength'!$B$44=\"\",\"\",'Compressive Strength'!$B$44)","v":"Deformation at Max Load, in.:"},{"$f":"IF('Compressive Strength'!$J$24=\"\",\"\",'Compressive Strength'!$J$24)","v":2},{"$f":"IF('Compressive Strength'!$J$26=\"\",\"\",'Compressive Strength'!$J$26)","v":"2-1"}]
[224,{"$f":"IF('Compressive Strength'!$K$44=\"\",\"\",'Compressive Strength'!$K$44)","v":""},{"$f":"IF('Compressive Strength'!$B$6=\"\",\"\",'Compressive Strength'!$B$6)","v":"Tex-120-E : PART I"},{"$f":"IF('Compressive Strength'!$B$44=\"\",\"\",'Compressive Strength'!$B$44)","v":"Deformation at Max Load, in.:"},{"$f":"IF('Compressive Strength'!$J$24=\"\",\"\",'Compressive Strength'!$J$24)","v":2},{"$f":"IF('Compressive Strength'!$K$26=\"\",\"\",'Compressive Strength'!$K$26)","v":"2-2"}]
[225,{"$f":"IF('Compressive Strength'!$L$44=\"\",\"\",'Compressive Strength'!$L$44)","v":""},{"$f":"IF('Compressive Strength'!$B$6=\"\",\"\",'Compressive Strength'!$B$6)","v":"Tex-120-E : PART I"},{"$f":"IF('Compressive Strength'!$B$44=\"\",\"\",'Compressive Strength'!$B$44)","v":"Deformation at Max Load, in.:"},{"$f":"IF('Compressive Strength'!$J$24=\"\",\"\",'Compressive Strength'!$J$24)","v":2},{"$f":"IF('Compressive Strength'!$L$26=\"\",\"\",'Compressive Strength'!$L$26)","v":"2-3"}]
[226,{"$f":"IF('Compressive Strength'!$M$44=\"\",\"\",'Compressive Strength'!$M$44)","v":""},{"$f":"IF('Compressive Strength'!$B$6=\"\",\"\",'Compressive Strength'!$B$6)","v":"Tex-120-E : PART I"},{"$f":"IF('Compressive Strength'!$B$44=\"\",\"\",'Compressive Strength'!$B$44)","v":"Deformation at Max Load, in.:"},{"$f":"IF('Compressive Strength'!$M$24=\"\",\"\",'Compressive Strength'!$M$24)","v":3},{"$f":"IF('Compressive Strength'!$M$26=\"\",\"\",'Compressive Strength'!$M$26)","v":"3-1"}]
[227,{"$f":"IF('Compressive Strength'!$N$44=\"\",\"\",'Compressive Strength'!$N$44)","v":""},{"$f":"IF('Compressive Strength'!$B$6=\"\",\"\",'Compressive Strength'!$B$6)","v":"Tex-120-E : PART I"},{"$f":"IF('Compressive Strength'!$B$44=\"\",\"\",'Compressive Strength'!$B$44)","v":"Deformation at Max Load, in.:"},{"$f":"IF('Compressive Strength'!$M$24=\"\",\"\",'Compressive Strength'!$M$24)","v":3},{"$f":"IF('Compressive Strength'!$N$26=\"\",\"\",'Compressive Strength'!$N$26)","v":"3-2"}]
[228,{"$f":"IF('Compressive Strength'!$O$44=\"\",\"\",'Compressive Strength'!$O$44)","v":""},{"$f":"IF('Compressive Strength'!$B$6=\"\",\"\",'Compressive Strength'!$B$6)","v":"Tex-120-E : PART I"},{"$f":"IF('Compressive Strength'!$B$44=\"\",\"\",'Compressive Strength'!$B$44)","v":"Deformation at Max Load, in.:"},{"$f":"IF('Compressive Strength'!$M$24=\"\",\"\",'Compressive Strength'!$M$24)","v":3},{"$f":"IF('Compressive Strength'!$O$26=\"\",\"\",'Compressive Strength'!$O$26)","v":"3-3"}]
[229,{"$f":"IF('Compressive Strength'!$P$44=\"\",\"\",'Compressive Strength'!$P$44)","v":""},{"$f":"IF('Compressive Strength'!$B$6=\"\",\"\",'Compressive Strength'!$B$6)","v":"Tex-120-E : PART I"},{"$f":"IF('Compressive Strength'!$B$44=\"\",\"\",'Compressive Strength'!$B$44)","v":"Deformation at Max Load, in.:"},{"$f":"IF('Compressive Strength'!$P$24=\"\",\"\",'Compressive Strength'!$P$24)","v":4},{"$f":"IF('Compressive Strength'!$P$26=\"\",\"\",'Compressive Strength'!$P$26)","v":"4-1"}]
[230,{"$f":"IF('Compressive Strength'!$Q$44=\"\",\"\",'Compressive Strength'!$Q$44)","v":""},{"$f":"IF('Compressive Strength'!$B$6=\"\",\"\",'Compressive Strength'!$B$6)","v":"Tex-120-E : PART I"},{"$f":"IF('Compressive Strength'!$B$44=\"\",\"\",'Compressive Strength'!$B$44)","v":"Deformation at Max Load, in.:"},{"$f":"IF('Compressive Strength'!$P$24=\"\",\"\",'Compressive Strength'!$P$24)","v":4},{"$f":"IF('Compressive Strength'!$Q$26=\"\",\"\",'Compressive Strength'!$Q$26)","v":"4-2"}]
[231,{"$f":"IF('Compressive Strength'!$R$44=\"\",\"\",'Compressive Strength'!$R$44)","v":""},{"$f":"IF('Compressive Strength'!$B$6=\"\",\"\",'Compressive Strength'!$B$6)","v":"Tex-120-E : PART I"},{"$f":"IF('Compressive Strength'!$B$44=\"\",\"\",'Compressive Strength'!$B$44)","v":"Deformation at Max Load, in.:"},{"$f":"IF('Compressive Strength'!$P$24=\"\",\"\",'Compressive Strength'!$P$24)","v":4},{"$f":"IF('Compressive Strength'!$R$26=\"\",\"\",'Compressive Strength'!$R$26)","v":"4-3"}]
[232,{"$f":"IF('Compressive Strength'!$G$45=\"\",\"\",'Compressive Strength'!$G$45)","v":""},{"$f":"IF('Compressive Strength'!$B$6=\"\",\"\",'Compressive Strength'!$B$6)","v":"Tex-120-E : PART I"},{"$f":"IF('Compressive Strength'!$B$45=\"\",\"\",'Compressive Strength'!$B$45)","v":"Max. Load Reading, div."},{"$f":"IF('Compressive Strength'!$G$24=\"\",\"\",'Compressive Strength'!$G$24)","v":1},{"$f":"IF('Compressive Strength'!$G$26=\"\",\"\",'Compressive Strength'!$G$26)","v":"1-1"}]
[233,{"$f":"IF('Compressive Strength'!$H$45=\"\",\"\",'Compressive Strength'!$H$45)","v":""},{"$f":"IF('Compressive Strength'!$B$6=\"\",\"\",'Compressive Strength'!$B$6)","v":"Tex-120-E : PART I"},{"$f":"IF('Compressive Strength'!$B$45=\"\",\"\",'Compressive Strength'!$B$45)","v":"Max. Load Reading, div."},{"$f":"IF('Compressive Strength'!$G$24=\"\",\"\",'Compressive Strength'!$G$24)","v":1},{"$f":"IF('Compressive Strength'!$H$26=\"\",\"\",'Compressive Strength'!$H$26)","v":"1-2"}]
[234,{"$f":"IF('Compressive Strength'!$I$45=\"\",\"\",'Compressive Strength'!$I$45)","v":""},{"$f":"IF('Compressive Strength'!$B$6=\"\",\"\",'Compressive Strength'!$B$6)","v":"Tex-120-E : PART I"},{"$f":"IF('Compressive Strength'!$B$45=\"\",\"\",'Compressive Strength'!$B$45)","v":"Max. Load Reading, div."},{"$f":"IF('Compressive Strength'!$G$24=\"\",\"\",'Compressive Strength'!$G$24)","v":1},{"$f":"IF('Compressive Strength'!$I$26=\"\",\"\",'Compressive Strength'!$I$26)","v":"1-3"}]
[235,{"$f":"IF('Compressive Strength'!$J$45=\"\",\"\",'Compressive Strength'!$J$45)","v":""},{"$f":"IF('Compressive Strength'!$B$6=\"\",\"\",'Compressive Strength'!$B$6)","v":"Tex-120-E : PART I"},{"$f":"IF('Compressive Strength'!$B$45=\"\",\"\",'Compressive Strength'!$B$45)","v":"Max. Load Reading, div."},{"$f":"IF('Compressive Strength'!$J$24=\"\",\"\",'Compressive Strength'!$J$24)","v":2},{"$f":"IF('Compressive Strength'!$J$26=\"\",\"\",'Compressive Strength'!$J$26)","v":"2-1"}]
[236,{"$f":"IF('Compressive Strength'!$K$45=\"\",\"\",'Compressive Strength'!$K$45)","v":""},{"$f":"IF('Compressive Strength'!$B$6=\"\",\"\",'Compressive Strength'!$B$6)","v":"Tex-120-E : PART I"},{"$f":"IF('Compressive Strength'!$B$45=\"\",\"\",'Compressive Strength'!$B$45)","v":"Max. Load Reading, div."},{"$f":"IF('Compressive Strength'!$J$24=\"\",\"\",'Compressive Strength'!$J$24)","v":2},{"$f":"IF('Compressive Strength'!$K$26=\"\",\"\",'Compressive Strength'!$K$26)","v":"2-2"}]
[237,{"$f":"IF('Compressive Strength'!$L$45=\"\",\"\",'Compressive Strength'!$L$45)","v":""},{"$f":"IF('Compressive Strength'!$B$6=\"\",\"\",'Compressive Strength'!$B$6)","v":"Tex-120-E : PART I"},{"$f":"IF('Compressive Strength'!$B$45=\"\",\"\",'Compressive Strength'!$B$45)","v":"Max. Load Reading, div."},{"$f":"IF('Compressive Strength'!$J$24=\"\",\"\",'Compressive Strength'!$J$24)","v":2},{"$f":"IF('Compressive Strength'!$L$26=\"\",\"\",'Compressive Strength'!$L$26)","v":"2-3"}]
[238,{"$f":"IF('Compressive Strength'!$M$45=\"\",\"\",'Compressive Strength'!$M$45)","v":""},{"$f":"IF('Compressive Strength'!$B$6=\"\",\"\",'Compressive Strength'!$B$6)","v":"Tex-120-E : PART I"},{"$f":"IF('Compressive Strength'!$B$45=\"\",\"\",'Compressive Strength'!$B$45)","v":"Max. Load Reading, div."},{"$f":"IF('Compressive Strength'!$M$24=\"\",\"\",'Compressive Strength'!$M$24)","v":3},{"$f":"IF('Compressive Strength'!$M$26=\"\",\"\",'Compressive Strength'!$M$26)","v":"3-1"}]
[239,{"$f":"IF('Compressive Strength'!$N$45=\"\",\"\",'Compressive Strength'!$N$45)","v":""},{"$f":"IF('Compressive Strength'!$B$6=\"\",\"\",'Compressive Strength'!$B$6)","v":"Tex-120-E : PART I"},{"$f":"IF('Compressive Strength'!$B$45=\"\",\"\",'Compressive Strength'!$B$45)","v":"Max. Load Reading, div."},{"$f":"IF('Compressive Strength'!$M$24=\"\",\"\",'Compressive Strength'!$M$24)","v":3},{"$f":"IF('Compressive Strength'!$N$26=\"\",\"\",'Compressive Strength'!$N$26)","v":"3-2"}]
[240,{"$f":"IF('Compressive Strength'!$O$45=\"\",\"\",'Compressive Strength'!$O$45)","v":""},{"$f":"IF('Compressive Strength'!$B$6=\"\",\"\",'Compressive Strength'!$B$6)","v":"Tex-120-E : PART I"},{"$f":"IF('Compressive Strength'!$B$45=\"\",\"\",'Compressive Strength'!$B$45)","v":"Max. Load Reading, div."},{"$f":"IF('Compressive Strength'!$M$24=\"\",\"\",'Compressive Strength'!$M$24)","v":3},{"$f":"IF('Compressive Strength'!$O$26=\"\",\"\",'Compressive Strength'!$O$26)","v":"3-3"}]
[241,{"$f":"IF('Compressive Strength'!$P$45=\"\",\"\",'Compressive Strength'!$P$45)","v":""},{"$f":"IF('Compressive Strength'!$B$6=\"\",\"\",'Compressive Strength'!$B$6)","v":"Tex-120-E : PART I"},{"$f":"IF('Compressive Strength'!$B$45=\"\",\"\",'Compressive Strength'!$B$45)","v":"Max. Load Reading, div."},{"$f":"IF('Compressive Strength'!$P$24=\"\",\"\",'Compressive Strength'!$P$24)","v":4},{"$f":"IF('Compressive Strength'!$P$26=\"\",\"\",'Compressive Strength'!$P$26)","v":"4-1"}]
[242,{"$f":"IF('Compressive Strength'!$Q$45=\"\",\"\",'Compressive Strength'!$Q$45)","v":""},{"$f":"IF('Compressive Strength'!$B$6=\"\",\"\",'Compressive Strength'!$B$6)","v":"Tex-120-E : PART I"},{"$f":"IF('Compressive Strength'!$B$45=\"\",\"\",'Compressive Strength'!$B$45)","v":"Max. Load Reading, div."},{"$f":"IF('Compressive Strength'!$P$24=\"\",\"\",'Compressive Strength'!$P$24)","v":4},{"$f":"IF('Compressive Strength'!$Q$26=\"\",\"\",'Compressive Strength'!$Q$26)","v":"4-2"}]
[243,{"$f":"IF('Compressive Strength'!$R$45=\"\",\"\",'Compressive Strength'!$R$45)","v":""},{"$f":"IF('Compressive Strength'!$B$6=\"\",\"\",'Compressive Strength'!$B$6)","v":"Tex-120-E : PART I"},{"$f":"IF('Compressive Strength'!$B$45=\"\",\"\",'Compressive Strength'!$B$45)","v":"Max. Load Reading, div."},{"$f":"IF('Compressive Strength'!$P$24=\"\",\"\",'Compressive Strength'!$P$24)","v":4},{"$f":"IF('Compressive Strength'!$R$26=\"\",\"\",'Compressive Strength'!$R$26)","v":"4-3"}]
[244,{"$f":"IF('Compressive Strength'!$G$46=\"\",\"\",'Compressive Strength'!$G$46)","v":""},{"$f":"IF('Compressive Strength'!$B$6=\"\",\"\",'Compressive Strength'!$B$6)","v":"Tex-120-E : PART I"},{"$f":"IF('Compressive Strength'!$B$46=\"\",\"\",'Compressive Strength'!$B$46)","v":"Deformation at Max Load, in."},{"$f":"IF('Compressive Strength'!$G$24=\"\",\"\",'Compressive Strength'!$G$24)","v":1},{"$f":"IF('Compressive Strength'!$G$26=\"\",\"\",'Compressive Strength'!$G$26)","v":"1-1"}]
[245,{"$f":"IF('Compressive Strength'!$H$46=\"\",\"\",'Compressive Strength'!$H$46)","v":""},{"$f":"IF('Compressive Strength'!$B$6=\"\",\"\",'Compressive Strength'!$B$6)","v":"Tex-120-E : PART I"},{"$f":"IF('Compressive Strength'!$B$46=\"\",\"\",'Compressive Strength'!$B$46)","v":"Deformation at Max Load, in."},{"$f":"IF('Compressive Strength'!$G$24=\"\",\"\",'Compressive Strength'!$G$24)","v":1},{"$f":"IF('Compressive Strength'!$H$26=\"\",\"\",'Compressive Strength'!$H$26)","v":"1-2"}]
[246,{"$f":"IF('Compressive Strength'!$I$46=\"\",\"\",'Compressive Strength'!$I$46)","v":""},{"$f":"IF('Compressive Strength'!$B$6=\"\",\"\",'Compressive Strength'!$B$6)","v":"Tex-120-E : PART I"},{"$f":"IF('Compressive Strength'!$B$46=\"\",\"\",'Compressive Strength'!$B$46)","v":"Deformation at Max Load, in."},{"$f":"IF('Compressive Strength'!$G$24=\"\",\"\",'Compressive Strength'!$G$24)","v":1},{"$f":"IF('Compressive Strength'!$I$26=\"\",\"\",'Compressive Strength'!$I$26)","v":"1-3"}]
[247,{"$f":"IF('Compressive Strength'!$J$46=\"\",\"\",'Compressive Strength'!$J$46)","v":""},{"$f":"IF('Compressive Strength'!$B$6=\"\",\"\",'Compressive Strength'!$B$6)","v":"Tex-120-E : PART I"},{"$f":"IF('Compressive Strength'!$B$46=\"\",\"\",'Compressive Strength'!$B$46)","v":"Deformation at Max Load, in."},{"$f":"IF('Compressive Strength'!$J$24=\"\",\"\",'Compressive Strength'!$J$24)","v":2},{"$f":"IF('Compressive Strength'!$J$26=\"\",\"\",'Compressive Strength'!$J$26)","v":"2-1"}]
[248,{"$f":"IF('Compressive Strength'!$K$46=\"\",\"\",'Compressive Strength'!$K$46)","v":""},{"$f":"IF('Compressive Strength'!$B$6=\"\",\"\",'Compressive Strength'!$B$6)","v":"Tex-120-E : PART I"},{"$f":"IF('Compressive Strength'!$B$46=\"\",\"\",'Compressive Strength'!$B$46)","v":"Deformation at Max Load, in."},{"$f":"IF('Compressive Strength'!$J$24=\"\",\"\",'Compressive Strength'!$J$24)","v":2},{"$f":"IF('Compressive Strength'!$K$26=\"\",\"\",'Compressive Strength'!$K$26)","v":"2-2"}]
[249,{"$f":"IF('Compressive Strength'!$L$46=\"\",\"\",'Compressive Strength'!$L$46)","v":""},{"$f":"IF('Compressive Strength'!$B$6=\"\",\"\",'Compressive Strength'!$B$6)","v":"Tex-120-E : PART I"},{"$f":"IF('Compressive Strength'!$B$46=\"\",\"\",'Compressive Strength'!$B$46)","v":"Deformation at Max Load, in."},{"$f":"IF('Compressive Strength'!$J$24=\"\",\"\",'Compressive Strength'!$J$24)","v":2},{"$f":"IF('Compressive Strength'!$L$26=\"\",\"\",'Compressive Strength'!$L$26)","v":"2-3"}]
[250,{"$f":"IF('Compressive Strength'!$M$46=\"\",\"\",'Compressive Strength'!$M$46)","v":""},{"$f":"IF('Compressive Strength'!$B$6=\"\",\"\",'Compressive Strength'!$B$6)","v":"Tex-120-E : PART I"},{"$f":"IF('Compressive Strength'!$B$46=\"\",\"\",'Compressive Strength'!$B$46)","v":"Deformation at Max Load, in."},{"$f":"IF('Compressive Strength'!$M$24=\"\",\"\",'Compressive Strength'!$M$24)","v":3},{"$f":"IF('Compressive Strength'!$M$26=\"\",\"\",'Compressive Strength'!$M$26)","v":"3-1"}]
[251,{"$f":"IF('Compressive Strength'!$N$46=\"\",\"\",'Compressive Strength'!$N$46)","v":""},{"$f":"IF('Compressive Strength'!$B$6=\"\",\"\",'Compressive Strength'!$B$6)","v":"Tex-120-E : PART I"},{"$f":"IF('Compressive Strength'!$B$46=\"\",\"\",'Compressive Strength'!$B$46)","v":"Deformation at Max Load, in."},{"$f":"IF('Compressive Strength'!$M$24=\"\",\"\",'Compressive Strength'!$M$24)","v":3},{"$f":"IF('Compressive Strength'!$N$26=\"\",\"\",'Compressive Strength'!$N$26)","v":"3-2"}]
[252,{"$f":"IF('Compressive Strength'!$O$46=\"\",\"\",'Compressive Strength'!$O$46)","v":""},{"$f":"IF('Compressive Strength'!$B$6=\"\",\"\",'Compressive Strength'!$B$6)","v":"Tex-120-E : PART I"},{"$f":"IF('Compressive Strength'!$B$46=\"\",\"\",'Compressive Strength'!$B$46)","v":"Deformation at Max Load, in."},{"$f":"IF('Compressive Strength'!$M$24=\"\",\"\",'Compressive Strength'!$M$24)","v":3},{"$f":"IF('Compressive Strength'!$O$26=\"\",\"\",'Compressive Strength'!$O$26)","v":"3-3"}]
[253,{"$f":"IF('Compressive Strength'!$P$46=\"\",\"\",'Compressive Strength'!$P$46)","v":""},{"$f":"IF('Compressive Strength'!$B$6=\"\",\"\",'Compressive Strength'!$B$6)","v":"Tex-120-E : PART I"},{"$f":"IF('Compressive Strength'!$B$46=\"\",\"\",'Compressive Strength'!$B$46)","v":"Deformation at Max Load, in."},{"$f":"IF('Compressive Strength'!$P$24=\"\",\"\",'Compressive Strength'!$P$24)","v":4},{"$f":"IF('Compressive Strength'!$P$26=\"\",\"\",'Compressive Strength'!$P$26)","v":"4-1"}]
[254,{"$f":"IF('Compressive Strength'!$Q$46=\"\",\"\",'Compressive Strength'!$Q$46)","v":""},{"$f":"IF('Compressive Strength'!$B$6=\"\",\"\",'Compressive Strength'!$B$6)","v":"Tex-120-E : PART I"},{"$f":"IF('Compressive Strength'!$B$46=\"\",\"\",'Compressive Strength'!$B$46)","v":"Deformation at Max Load, in."},{"$f":"IF('Compressive Strength'!$P$24=\"\",\"\",'Compressive Strength'!$P$24)","v":4},{"$f":"IF('Compressive Strength'!$Q$26=\"\",\"\",'Compressive Strength'!$Q$26)","v":"4-2"}]
[255,{"$f":"IF('Compressive Strength'!$R$46=\"\",\"\",'Compressive Strength'!$R$46)","v":""},{"$f":"IF('Compressive Strength'!$B$6=\"\",\"\",'Compressive Strength'!$B$6)","v":"Tex-120-E : PART I"},{"$f":"IF('Compressive Strength'!$B$46=\"\",\"\",'Compressive Strength'!$B$46)","v":"Deformation at Max Load, in."},{"$f":"IF('Compressive Strength'!$P$24=\"\",\"\",'Compressive Strength'!$P$24)","v":4},{"$f":"IF('Compressive Strength'!$R$26=\"\",\"\",'Compressive Strength'!$R$26)","v":"4-3"}]
[256,{"$f":"IF('Compressive Strength'!$G$47=\"\",\"\",'Compressive Strength'!$G$47)","v":""},{"$f":"IF('Compressive Strength'!$B$6=\"\",\"\",'Compressive Strength'!$B$6)","v":"Tex-120-E : PART I"},{"$f":"IF('Compressive Strength'!$B$47=\"\",\"\",'Compressive Strength'!$B$47)","v":"Uncorr'd Stress, psi.:"},{"$f":"IF('Compressive Strength'!$G$24=\"\",\"\",'Compressive Strength'!$G$24)","v":1},{"$f":"IF('Compressive Strength'!$G$26=\"\",\"\",'Compressive Strength'!$G$26)","v":"1-1"}]
[257,{"$f":"IF('Compressive Strength'!$H$47=\"\",\"\",'Compressive Strength'!$H$47)","v":""},{"$f":"IF('Compressive Strength'!$B$6=\"\",\"\",'Compressive Strength'!$B$6)","v":"Tex-120-E : PART I"},{"$f":"IF('Compressive Strength'!$B$47=\"\",\"\",'Compressive Strength'!$B$47)","v":"Uncorr'd Stress, psi.:"},{"$f":"IF('Compressive Strength'!$G$24=\"\",\"\",'Compressive Strength'!$G$24)","v":1},{"$f":"IF('Compressive Strength'!$H$26=\"\",\"\",'Compressive Strength'!$H$26)","v":"1-2"}]
[258,{"$f":"IF('Compressive Strength'!$I$47=\"\",\"\",'Compressive Strength'!$I$47)","v":""},{"$f":"IF('Compressive Strength'!$B$6=\"\",\"\",'Compressive Strength'!$B$6)","v":"Tex-120-E : PART I"},{"$f":"IF('Compressive Strength'!$B$47=\"\",\"\",'Compressive Strength'!$B$47)","v":"Uncorr'd Stress, psi.:"},{"$f":"IF('Compressive Strength'!$G$24=\"\",\"\",'Compressive Strength'!$G$24)","v":1},{"$f":"IF('Compressive Strength'!$I$26=\"\",\"\",'Compressive Strength'!$I$26)","v":"1-3"}]
[259,{"$f":"IF('Compressive Strength'!$J$47=\"\",\"\",'Compressive Strength'!$J$47)","v":""},{"$f":"IF('Compressive Strength'!$B$6=\"\",\"\",'Compressive Strength'!$B$6)","v":"Tex-120-E : PART I"},{"$f":"IF('Compressive Strength'!$B$47=\"\",\"\",'Compressive Strength'!$B$47)","v":"Uncorr'd Stress, psi.:"},{"$f":"IF('Compressive Strength'!$J$24=\"\",\"\",'Compressive Strength'!$J$24)","v":2},{"$f":"IF('Compressive Strength'!$J$26=\"\",\"\",'Compressive Strength'!$J$26)","v":"2-1"}]
[260,{"$f":"IF('Compressive Strength'!$K$47=\"\",\"\",'Compressive Strength'!$K$47)","v":""},{"$f":"IF('Compressive Strength'!$B$6=\"\",\"\",'Compressive Strength'!$B$6)","v":"Tex-120-E : PART I"},{"$f":"IF('Compressive Strength'!$B$47=\"\",\"\",'Compressive Strength'!$B$47)","v":"Uncorr'd Stress, psi.:"},{"$f":"IF('Compressive Strength'!$J$24=\"\",\"\",'Compressive Strength'!$J$24)","v":2},{"$f":"IF('Compressive Strength'!$K$26=\"\",\"\",'Compressive Strength'!$K$26)","v":"2-2"}]
[261,{"$f":"IF('Compressive Strength'!$L$47=\"\",\"\",'Compressive Strength'!$L$47)","v":""},{"$f":"IF('Compressive Strength'!$B$6=\"\",\"\",'Compressive Strength'!$B$6)","v":"Tex-120-E : PART I"},{"$f":"IF('Compressive Strength'!$B$47=\"\",\"\",'Compressive Strength'!$B$47)","v":"Uncorr'd Stress, psi.:"},{"$f":"IF('Compressive Strength'!$J$24=\"\",\"\",'Compressive Strength'!$J$24)","v":2},{"$f":"IF('Compressive Strength'!$L$26=\"\",\"\",'Compressive Strength'!$L$26)","v":"2-3"}]
[262,{"$f":"IF('Compressive Strength'!$M$47=\"\",\"\",'Compressive Strength'!$M$47)","v":""},{"$f":"IF('Compressive Strength'!$B$6=\"\",\"\",'Compressive Strength'!$B$6)","v":"Tex-120-E : PART I"},{"$f":"IF('Compressive Strength'!$B$47=\"\",\"\",'Compressive Strength'!$B$47)","v":"Uncorr'd Stress, psi.:"},{"$f":"IF('Compressive Strength'!$M$24=\"\",\"\",'Compressive Strength'!$M$24)","v":3},{"$f":"IF('Compressive Strength'!$M$26=\"\",\"\",'Compressive Strength'!$M$26)","v":"3-1"}]
[263,{"$f":"IF('Compressive Strength'!$N$47=\"\",\"\",'Compressive Strength'!$N$47)","v":""},{"$f":"IF('Compressive Strength'!$B$6=\"\",\"\",'Compressive Strength'!$B$6)","v":"Tex-120-E : PART I"},{"$f":"IF('Compressive Strength'!$B$47=\"\",\"\",'Compressive Strength'!$B$47)","v":"Uncorr'd Stress, psi.:"},{"$f":"IF('Compressive Strength'!$M$24=\"\",\"\",'Compressive Strength'!$M$24)","v":3},{"$f":"IF('Compressive Strength'!$N$26=\"\",\"\",'Compressive Strength'!$N$26)","v":"3-2"}]
[264,{"$f":"IF('Compressive Strength'!$O$47=\"\",\"\",'Compressive Strength'!$O$47)","v":""},{"$f":"IF('Compressive Strength'!$B$6=\"\",\"\",'Compressive Strength'!$B$6)","v":"Tex-120-E : PART I"},{"$f":"IF('Compressive Strength'!$B$47=\"\",\"\",'Compressive Strength'!$B$47)","v":"Uncorr'd Stress, psi.:"},{"$f":"IF('Compressive Strength'!$M$24=\"\",\"\",'Compressive Strength'!$M$24)","v":3},{"$f":"IF('Compressive Strength'!$O$26=\"\",\"\",'Compressive Strength'!$O$26)","v":"3-3"}]
[265,{"$f":"IF('Compressive Strength'!$P$47=\"\",\"\",'Compressive Strength'!$P$47)","v":""},{"$f":"IF('Compressive Strength'!$B$6=\"\",\"\",'Compressive Strength'!$B$6)","v":"Tex-120-E : PART I"},{"$f":"IF('Compressive Strength'!$B$47=\"\",\"\",'Compressive Strength'!$B$47)","v":"Uncorr'd Stress, psi.:"},{"$f":"IF('Compressive Strength'!$P$24=\"\",\"\",'Compressive Strength'!$P$24)","v":4},{"$f":"IF('Compressive Strength'!$P$26=\"\",\"\",'Compressive Strength'!$P$26)","v":"4-1"}]
[266,{"$f":"IF('Compressive Strength'!$Q$47=\"\",\"\",'Compressive Strength'!$Q$47)","v":""},{"$f":"IF('Compressive Strength'!$B$6=\"\",\"\",'Compressive Strength'!$B$6)","v":"Tex-120-E : PART I"},{"$f":"IF('Compressive Strength'!$B$47=\"\",\"\",'Compressive Strength'!$B$47)","v":"Uncorr'd Stress, psi.:"},{"$f":"IF('Compressive Strength'!$P$24=\"\",\"\",'Compressive Strength'!$P$24)","v":4},{"$f":"IF('Compressive Strength'!$Q$26=\"\",\"\",'Compressive Strength'!$Q$26)","v":"4-2"}]
[267,{"$f":"IF('Compressive Strength'!$R$47=\"\",\"\",'Compressive Strength'!$R$47)","v":""},{"$f":"IF('Compressive Strength'!$B$6=\"\",\"\",'Compressive Strength'!$B$6)","v":"Tex-120-E : PART I"},{"$f":"IF('Compressive Strength'!$B$47=\"\",\"\",'Compressive Strength'!$B$47)","v":"Uncorr'd Stress, psi.:"},{"$f":"IF('Compressive Strength'!$P$24=\"\",\"\",'Compressive Strength'!$P$24)","v":4},{"$f":"IF('Compressive Strength'!$R$26=\"\",\"\",'Compressive Strength'!$R$26)","v":"4-3"}]
[268,{"$f":"IF('Compressive Strength'!$G$48=\"\",\"\",'Compressive Strength'!$G$48)","v":""},{"$f":"IF('Compressive Strength'!$B$6=\"\",\"\",'Compressive Strength'!$B$6)","v":"Tex-120-E : PART I"},{"$f":"IF('Compressive Strength'!$B$48=\"\",\"\",'Compressive Strength'!$B$48)","v":"% Strain , in./in.:"},{"$f":"IF('Compressive Strength'!$G$24=\"\",\"\",'Compressive Strength'!$G$24)","v":1},{"$f":"IF('Compressive Strength'!$G$26=\"\",\"\",'Compressive Strength'!$G$26)","v":"1-1"}]
[269,{"$f":"IF('Compressive Strength'!$H$48=\"\",\"\",'Compressive Strength'!$H$48)","v":""},{"$f":"IF('Compressive Strength'!$B$6=\"\",\"\",'Compressive Strength'!$B$6)","v":"Tex-120-E : PART I"},{"$f":"IF('Compressive Strength'!$B$48=\"\",\"\",'Compressive Strength'!$B$48)","v":"% Strain , in./in.:"},{"$f":"IF('Compressive Strength'!$G$24=\"\",\"\",'Compressive Strength'!$G$24)","v":1},{"$f":"IF('Compressive Strength'!$H$26=\"\",\"\",'Compressive Strength'!$H$26)","v":"1-2"}]
[270,{"$f":"IF('Compressive Strength'!$I$48=\"\",\"\",'Compressive Strength'!$I$48)","v":""},{"$f":"IF('Compressive Strength'!$B$6=\"\",\"\",'Compressive Strength'!$B$6)","v":"Tex-120-E : PART I"},{"$f":"IF('Compressive Strength'!$B$48=\"\",\"\",'Compressive Strength'!$B$48)","v":"% Strain , in./in.:"},{"$f":"IF('Compressive Strength'!$G$24=\"\",\"\",'Compressive Strength'!$G$24)","v":1},{"$f":"IF('Compressive Strength'!$I$26=\"\",\"\",'Compressive Strength'!$I$26)","v":"1-3"}]
[271,{"$f":"IF('Compressive Strength'!$J$48=\"\",\"\",'Compressive Strength'!$J$48)","v":""},{"$f":"IF('Compressive Strength'!$B$6=\"\",\"\",'Compressive Strength'!$B$6)","v":"Tex-120-E : PART I"},{"$f":"IF('Compressive Strength'!$B$48=\"\",\"\",'Compressive Strength'!$B$48)","v":"% Strain , in./in.:"},{"$f":"IF('Compressive Strength'!$J$24=\"\",\"\",'Compressive Strength'!$J$24)","v":2},{"$f":"IF('Compressive Strength'!$J$26=\"\",\"\",'Compressive Strength'!$J$26)","v":"2-1"}]
[272,{"$f":"IF('Compressive Strength'!$K$48=\"\",\"\",'Compressive Strength'!$K$48)","v":""},{"$f":"IF('Compressive Strength'!$B$6=\"\",\"\",'Compressive Strength'!$B$6)","v":"Tex-120-E : PART I"},{"$f":"IF('Compressive Strength'!$B$48=\"\",\"\",'Compressive Strength'!$B$48)","v":"% Strain , in./in.:"},{"$f":"IF('Compressive Strength'!$J$24=\"\",\"\",'Compressive Strength'!$J$24)","v":2},{"$f":"IF('Compressive Strength'!$K$26=\"\",\"\",'Compressive Strength'!$K$26)","v":"2-2"}]
[273,{"$f":"IF('Compressive Strength'!$L$48=\"\",\"\",'Compressive Strength'!$L$48)","v":""},{"$f":"IF('Compressive Strength'!$B$6=\"\",\"\",'Compressive Strength'!$B$6)","v":"Tex-120-E : PART I"},{"$f":"IF('Compressive Strength'!$B$48=\"\",\"\",'Compressive Strength'!$B$48)","v":"% Strain , in./in.:"},{"$f":"IF('Compressive Strength'!$J$24=\"\",\"\",'Compressive Strength'!$J$24)","v":2},{"$f":"IF('Compressive Strength'!$L$26=\"\",\"\",'Compressive Strength'!$L$26)","v":"2-3"}]
[274,{"$f":"IF('Compressive Strength'!$M$48=\"\",\"\",'Compressive Strength'!$M$48)","v":""},{"$f":"IF('Compressive Strength'!$B$6=\"\",\"\",'Compressive Strength'!$B$6)","v":"Tex-120-E : PART I"},{"$f":"IF('Compressive Strength'!$B$48=\"\",\"\",'Compressive Strength'!$B$48)","v":"% Strain , in./in.:"},{"$f":"IF('Compressive Strength'!$M$24=\"\",\"\",'Compressive Strength'!$M$24)","v":3},{"$f":"IF('Compressive Strength'!$M$26=\"\",\"\",'Compressive Strength'!$M$26)","v":"3-1"}]
[275,{"$f":"IF('Compressive Strength'!$N$48=\"\",\"\",'Compressive Strength'!$N$48)","v":""},{"$f":"IF('Compressive Strength'!$B$6=\"\",\"\",'Compressive Strength'!$B$6)","v":"Tex-120-E : PART I"},{"$f":"IF('Compressive Strength'!$B$48=\"\",\"\",'Compressive Strength'!$B$48)","v":"% Strain , in./in.:"},{"$f":"IF('Compressive Strength'!$M$24=\"\",\"\",'Compressive Strength'!$M$24)","v":3},{"$f":"IF('Compressive Strength'!$N$26=\"\",\"\",'Compressive Strength'!$N$26)","v":"3-2"}]
[276,{"$f":"IF('Compressive Strength'!$O$48=\"\",\"\",'Compressive Strength'!$O$48)","v":""},{"$f":"IF('Compressive Strength'!$B$6=\"\",\"\",'Compressive Strength'!$B$6)","v":"Tex-120-E : PART I"},{"$f":"IF('Compressive Strength'!$B$48=\"\",\"\",'Compressive Strength'!$B$48)","v":"% Strain , in./in.:"},{"$f":"IF('Compressive Strength'!$M$24=\"\",\"\",'Compressive Strength'!$M$24)","v":3},{"$f":"IF('Compressive Strength'!$O$26=\"\",\"\",'Compressive Strength'!$O$26)","v":"3-3"}]
[277,{"$f":"IF('Compressive Strength'!$P$48=\"\",\"\",'Compressive Strength'!$P$48)","v":""},{"$f":"IF('Compressive Strength'!$B$6=\"\",\"\",'Compressive Strength'!$B$6)","v":"Tex-120-E : PART I"},{"$f":"IF('Compressive Strength'!$B$48=\"\",\"\",'Compressive Strength'!$B$48)","v":"% Strain , in./in.:"},{"$f":"IF('Compressive Strength'!$P$24=\"\",\"\",'Compressive Strength'!$P$24)","v":4},{"$f":"IF('Compressive Strength'!$P$26=\"\",\"\",'Compressive Strength'!$P$26)","v":"4-1"}]
[278,{"$f":"IF('Compressive Strength'!$Q$48=\"\",\"\",'Compressive Strength'!$Q$48)","v":""},{"$f":"IF('Compressive Strength'!$B$6=\"\",\"\",'Compressive Strength'!$B$6)","v":"Tex-120-E : PART I"},{"$f":"IF('Compressive Strength'!$B$48=\"\",\"\",'Compressive Strength'!$B$48)","v":"% Strain , in./in.:"},{"$f":"IF('Compressive Strength'!$P$24=\"\",\"\",'Compressive Strength'!$P$24)","v":4},{"$f":"IF('Compressive Strength'!$Q$26=\"\",\"\",'Compressive Strength'!$Q$26)","v":"4-2"}]
[279,{"$f":"IF('Compressive Strength'!$R$48=\"\",\"\",'Compressive Strength'!$R$48)","v":""},{"$f":"IF('Compressive Strength'!$B$6=\"\",\"\",'Compressive Strength'!$B$6)","v":"Tex-120-E : PART I"},{"$f":"IF('Compressive Strength'!$B$48=\"\",\"\",'Compressive Strength'!$B$48)","v":"% Strain , in./in.:"},{"$f":"IF('Compressive Strength'!$P$24=\"\",\"\",'Compressive Strength'!$P$24)","v":4},{"$f":"IF('Compressive Strength'!$R$26=\"\",\"\",'Compressive Strength'!$R$26)","v":"4-3"}]
[280,{"$f":"IF('Compressive Strength'!$G$49=\"\",\"\",'Compressive Strength'!$G$49)","v":""},{"$f":"IF('Compressive Strength'!$B$6=\"\",\"\",'Compressive Strength'!$B$6)","v":"Tex-120-E : PART I"},{"$f":"IF('Compressive Strength'!$B$49=\"\",\"\",'Compressive Strength'!$B$49)","v":"I-Strain, in./in.:"},{"$f":"IF('Compressive Strength'!$G$24=\"\",\"\",'Compressive Strength'!$G$24)","v":1},{"$f":"IF('Compressive Strength'!$G$26=\"\",\"\",'Compressive Strength'!$G$26)","v":"1-1"}]
[281,{"$f":"IF('Compressive Strength'!$H$49=\"\",\"\",'Compressive Strength'!$H$49)","v":""},{"$f":"IF('Compressive Strength'!$B$6=\"\",\"\",'Compressive Strength'!$B$6)","v":"Tex-120-E : PART I"},{"$f":"IF('Compressive Strength'!$B$49=\"\",\"\",'Compressive Strength'!$B$49)","v":"I-Strain, in./in.:"},{"$f":"IF('Compressive Strength'!$G$24=\"\",\"\",'Compressive Strength'!$G$24)","v":1},{"$f":"IF('Compressive Strength'!$H$26=\"\",\"\",'Compressive Strength'!$H$26)","v":"1-2"}]
[282,{"$f":"IF('Compressive Strength'!$I$49=\"\",\"\",'Compressive Strength'!$I$49)","v":""},{"$f":"IF('Compressive Strength'!$B$6=\"\",\"\",'Compressive Strength'!$B$6)","v":"Tex-120-E : PART I"},{"$f":"IF('Compressive Strength'!$B$49=\"\",\"\",'Compressive Strength'!$B$49)","v":"I-Strain, in./in.:"},{"$f":"IF('Compressive Strength'!$G$24=\"\",\"\",'Compressive Strength'!$G$24)","v":1},{"$f":"IF('Compressive Strength'!$I$26=\"\",\"\",'Compressive Strength'!$I$26)","v":"1-3"}]
[283,{"$f":"IF('Compressive Strength'!$J$49=\"\",\"\",'Compressive Strength'!$J$49)","v":""},{"$f":"IF('Compressive Strength'!$B$6=\"\",\"\",'Compressive Strength'!$B$6)","v":"Tex-120-E : PART I"},{"$f":"IF('Compressive Strength'!$B$49=\"\",\"\",'Compressive Strength'!$B$49)","v":"I-Strain, in./in.:"},{"$f":"IF('Compressive Strength'!$J$24=\"\",\"\",'Compressive Strength'!$J$24)","v":2},{"$f":"IF('Compressive Strength'!$J$26=\"\",\"\",'Compressive Strength'!$J$26)","v":"2-1"}]
[284,{"$f":"IF('Compressive Strength'!$K$49=\"\",\"\",'Compressive Strength'!$K$49)","v":""},{"$f":"IF('Compressive Strength'!$B$6=\"\",\"\",'Compressive Strength'!$B$6)","v":"Tex-120-E : PART I"},{"$f":"IF('Compressive Strength'!$B$49=\"\",\"\",'Compressive Strength'!$B$49)","v":"I-Strain, in./in.:"},{"$f":"IF('Compressive Strength'!$J$24=\"\",\"\",'Compressive Strength'!$J$24)","v":2},{"$f":"IF('Compressive Strength'!$K$26=\"\",\"\",'Compressive Strength'!$K$26)","v":"2-2"}]
[285,{"$f":"IF('Compressive Strength'!$L$49=\"\",\"\",'Compressive Strength'!$L$49)","v":""},{"$f":"IF('Compressive Strength'!$B$6=\"\",\"\",'Compressive Strength'!$B$6)","v":"Tex-120-E : PART I"},{"$f":"IF('Compressive Strength'!$B$49=\"\",\"\",'Compressive Strength'!$B$49)","v":"I-Strain, in./in.:"},{"$f":"IF('Compressive Strength'!$J$24=\"\",\"\",'Compressive Strength'!$J$24)","v":2},{"$f":"IF('Compressive Strength'!$L$26=\"\",\"\",'Compressive Strength'!$L$26)","v":"2-3"}]
[286,{"$f":"IF('Compressive Strength'!$M$49=\"\",\"\",'Compressive Strength'!$M$49)","v":""},{"$f":"IF('Compressive Strength'!$B$6=\"\",\"\",'Compressive Strength'!$B$6)","v":"Tex-120-E : PART I"},{"$f":"IF('Compressive Strength'!$B$49=\"\",\"\",'Compressive Strength'!$B$49)","v":"I-Strain, in./in.:"},{"$f":"IF('Compressive Strength'!$M$24=\"\",\"\",'Compressive Strength'!$M$24)","v":3},{"$f":"IF('Compressive Strength'!$M$26=\"\",\"\",'Compressive Strength'!$M$26)","v":"3-1"}]
[287,{"$f":"IF('Compressive Strength'!$N$49=\"\",\"\",'Compressive Strength'!$N$49)","v":""},{"$f":"IF('Compressive Strength'!$B$6=\"\",\"\",'Compressive Strength'!$B$6)","v":"Tex-120-E : PART I"},{"$f":"IF('Compressive Strength'!$B$49=\"\",\"\",'Compressive Strength'!$B$49)","v":"I-Strain, in./in.:"},{"$f":"IF('Compressive Strength'!$M$24=\"\",\"\",'Compressive Strength'!$M$24)","v":3},{"$f":"IF('Compressive Strength'!$N$26=\"\",\"\",'Compressive Strength'!$N$26)","v":"3-2"}]
[288,{"$f":"IF('Compressive Strength'!$O$49=\"\",\"\",'Compressive Strength'!$O$49)","v":""},{"$f":"IF('Compressive Strength'!$B$6=\"\",\"\",'Compressive Strength'!$B$6)","v":"Tex-120-E : PART I"},{"$f":"IF('Compressive Strength'!$B$49=\"\",\"\",'Compressive Strength'!$B$49)","v":"I-Strain, in./in.:"},{"$f":"IF('Compressive Strength'!$M$24=\"\",\"\",'Compressive Strength'!$M$24)","v":3},{"$f":"IF('Compressive Strength'!$O$26=\"\",\"\",'Compressive Strength'!$O$26)","v":"3-3"}]
[289,{"$f":"IF('Compressive Strength'!$P$49=\"\",\"\",'Compressive Strength'!$P$49)","v":""},{"$f":"IF('Compressive Strength'!$B$6=\"\",\"\",'Compressive Strength'!$B$6)","v":"Tex-120-E : PART I"},{"$f":"IF('Compressive Strength'!$B$49=\"\",\"\",'Compressive Strength'!$B$49)","v":"I-Strain, in./in.:"},{"$f":"IF('Compressive Strength'!$P$24=\"\",\"\",'Compressive Strength'!$P$24)","v":4},{"$f":"IF('Compressive Strength'!$P$26=\"\",\"\",'Compressive Strength'!$P$26)","v":"4-1"}]
[290,{"$f":"IF('Compressive Strength'!$Q$49=\"\",\"\",'Compressive Strength'!$Q$49)","v":""},{"$f":"IF('Compressive Strength'!$B$6=\"\",\"\",'Compressive Strength'!$B$6)","v":"Tex-120-E : PART I"},{"$f":"IF('Compressive Strength'!$B$49=\"\",\"\",'Compressive Strength'!$B$49)","v":"I-Strain, in./in.:"},{"$f":"IF('Compressive Strength'!$P$24=\"\",\"\",'Compressive Strength'!$P$24)","v":4},{"$f":"IF('Compressive Strength'!$Q$26=\"\",\"\",'Compressive Strength'!$Q$26)","v":"4-2"}]
[291,{"$f":"IF('Compressive Strength'!$R$49=\"\",\"\",'Compressive Strength'!$R$49)","v":""},{"$f":"IF('Compressive Strength'!$B$6=\"\",\"\",'Compressive Strength'!$B$6)","v":"Tex-120-E : PART I"},{"$f":"IF('Compressive Strength'!$B$49=\"\",\"\",'Compressive Strength'!$B$49)","v":"I-Strain, in./in.:"},{"$f":"IF('Compressive Strength'!$P$24=\"\",\"\",'Compressive Strength'!$P$24)","v":4},{"$f":"IF('Compressive Strength'!$R$26=\"\",\"\",'Compressive Strength'!$R$26)","v":"4-3"}]
[292,{"$f":"IF('Compressive Strength'!$G$50=\"\",\"\",'Compressive Strength'!$G$50)","v":""},{"$f":"IF('Compressive Strength'!$B$6=\"\",\"\",'Compressive Strength'!$B$6)","v":"Tex-120-E : PART I"},{"$f":"IF('Compressive Strength'!$B$50=\"\",\"\",'Compressive Strength'!$B$50)","v":"Corrected Stress, psi.:"},{"$f":"IF('Compressive Strength'!$G$24=\"\",\"\",'Compressive Strength'!$G$24)","v":1},{"$f":"IF('Compressive Strength'!$G$26=\"\",\"\",'Compressive Strength'!$G$26)","v":"1-1"}]
[293,{"$f":"IF('Compressive Strength'!$H$50=\"\",\"\",'Compressive Strength'!$H$50)","v":""},{"$f":"IF('Compressive Strength'!$B$6=\"\",\"\",'Compressive Strength'!$B$6)","v":"Tex-120-E : PART I"},{"$f":"IF('Compressive Strength'!$B$50=\"\",\"\",'Compressive Strength'!$B$50)","v":"Corrected Stress, psi.:"},{"$f":"IF('Compressive Strength'!$G$24=\"\",\"\",'Compressive Strength'!$G$24)","v":1},{"$f":"IF('Compressive Strength'!$H$26=\"\",\"\",'Compressive Strength'!$H$26)","v":"1-2"}]
[294,{"$f":"IF('Compressive Strength'!$I$50=\"\",\"\",'Compressive Strength'!$I$50)","v":""},{"$f":"IF('Compressive Strength'!$B$6=\"\",\"\",'Compressive Strength'!$B$6)","v":"Tex-120-E : PART I"},{"$f":"IF('Compressive Strength'!$B$50=\"\",\"\",'Compressive Strength'!$B$50)","v":"Corrected Stress, psi.:"},{"$f":"IF('Compressive Strength'!$G$24=\"\",\"\",'Compressive Strength'!$G$24)","v":1},{"$f":"IF('Compressive Strength'!$I$26=\"\",\"\",'Compressive Strength'!$I$26)","v":"1-3"}]
[295,{"$f":"IF('Compressive Strength'!$J$50=\"\",\"\",'Compressive Strength'!$J$50)","v":""},{"$f":"IF('Compressive Strength'!$B$6=\"\",\"\",'Compressive Strength'!$B$6)","v":"Tex-120-E : PART I"},{"$f":"IF('Compressive Strength'!$B$50=\"\",\"\",'Compressive Strength'!$B$50)","v":"Corrected Stress, psi.:"},{"$f":"IF('Compressive Strength'!$J$24=\"\",\"\",'Compressive Strength'!$J$24)","v":2},{"$f":"IF('Compressive Strength'!$J$26=\"\",\"\",'Compressive Strength'!$J$26)","v":"2-1"}]
[296,{"$f":"IF('Compressive Strength'!$K$50=\"\",\"\",'Compressive Strength'!$K$50)","v":""},{"$f":"IF('Compressive Strength'!$B$6=\"\",\"\",'Compressive Strength'!$B$6)","v":"Tex-120-E : PART I"},{"$f":"IF('Compressive Strength'!$B$50=\"\",\"\",'Compressive Strength'!$B$50)","v":"Corrected Stress, psi.:"},{"$f":"IF('Compressive Strength'!$J$24=\"\",\"\",'Compressive Strength'!$J$24)","v":2},{"$f":"IF('Compressive Strength'!$K$26=\"\",\"\",'Compressive Strength'!$K$26)","v":"2-2"}]
[297,{"$f":"IF('Compressive Strength'!$L$50=\"\",\"\",'Compressive Strength'!$L$50)","v":""},{"$f":"IF('Compressive Strength'!$B$6=\"\",\"\",'Compressive Strength'!$B$6)","v":"Tex-120-E : PART I"},{"$f":"IF('Compressive Strength'!$B$50=\"\",\"\",'Compressive Strength'!$B$50)","v":"Corrected Stress, psi.:"},{"$f":"IF('Compressive Strength'!$J$24=\"\",\"\",'Compressive Strength'!$J$24)","v":2},{"$f":"IF('Compressive Strength'!$L$26=\"\",\"\",'Compressive Strength'!$L$26)","v":"2-3"}]
[298,{"$f":"IF('Compressive Strength'!$M$50=\"\",\"\",'Compressive Strength'!$M$50)","v":""},{"$f":"IF('Compressive Strength'!$B$6=\"\",\"\",'Compressive Strength'!$B$6)","v":"Tex-120-E : PART I"},{"$f":"IF('Compressive Strength'!$B$50=\"\",\"\",'Compressive Strength'!$B$50)","v":"Corrected Stress, psi.:"},{"$f":"IF('Compressive Strength'!$M$24=\"\",\"\",'Compressive Strength'!$M$24)","v":3},{"$f":"IF('Compressive Strength'!$M$26=\"\",\"\",'Compressive Strength'!$M$26)","v":"3-1"}]
[299,{"$f":"IF('Compressive Strength'!$N$50=\"\",\"\",'Compressive Strength'!$N$50)","v":""},{"$f":"IF('Compressive Strength'!$B$6=\"\",\"\",'Compressive Strength'!$B$6)","v":"Tex-120-E : PART I"},{"$f":"IF('Compressive Strength'!$B$50=\"\",\"\",'Compressive Strength'!$B$50)","v":"Corrected Stress, psi.:"},{"$f":"IF('Compressive Strength'!$M$24=\"\",\"\",'Compressive Strength'!$M$24)","v":3},{"$f":"IF('Compressive Strength'!$N$26=\"\",\"\",'Compressive Strength'!$N$26)","v":"3-2"}]
[300,{"$f":"IF('Compressive Strength'!$O$50=\"\",\"\",'Compressive Strength'!$O$50)","v":""},{"$f":"IF('Compressive Strength'!$B$6=\"\",\"\",'Compressive Strength'!$B$6)","v":"Tex-120-E : PART I"},{"$f":"IF('Compressive Strength'!$B$50=\"\",\"\",'Compressive Strength'!$B$50)","v":"Corrected Stress, psi.:"},{"$f":"IF('Compressive Strength'!$M$24=\"\",\"\",'Compressive Strength'!$M$24)","v":3},{"$f":"IF('Compressive Strength'!$O$26=\"\",\"\",'Compressive Strength'!$O$26)","v":"3-3"}]
[301,{"$f":"IF('Compressive Strength'!$P$50=\"\",\"\",'Compressive Strength'!$P$50)","v":""},{"$f":"IF('Compressive Strength'!$B$6=\"\",\"\",'Compressive Strength'!$B$6)","v":"Tex-120-E : PART I"},{"$f":"IF('Compressive Strength'!$B$50=\"\",\"\",'Compressive Strength'!$B$50)","v":"Corrected Stress, psi.:"},{"$f":"IF('Compressive Strength'!$P$24=\"\",\"\",'Compressive Strength'!$P$24)","v":4},{"$f":"IF('Compressive Strength'!$P$26=\"\",\"\",'Compressive Strength'!$P$26)","v":"4-1"}]
[302,{"$f":"IF('Compressive Strength'!$Q$50=\"\",\"\",'Compressive Strength'!$Q$50)","v":""},{"$f":"IF('Compressive Strength'!$B$6=\"\",\"\",'Compressive Strength'!$B$6)","v":"Tex-120-E : PART I"},{"$f":"IF('Compressive Strength'!$B$50=\"\",\"\",'Compressive Strength'!$B$50)","v":"Corrected Stress, psi.:"},{"$f":"IF('Compressive Strength'!$P$24=\"\",\"\",'Compressive Strength'!$P$24)","v":4},{"$f":"IF('Compressive Strength'!$Q$26=\"\",\"\",'Compressive Strength'!$Q$26)","v":"4-2"}]
[303,{"$f":"IF('Compressive Strength'!$R$50=\"\",\"\",'Compressive Strength'!$R$50)","v":""},{"$f":"IF('Compressive Strength'!$B$6=\"\",\"\",'Compressive Strength'!$B$6)","v":"Tex-120-E : PART I"},{"$f":"IF('Compressive Strength'!$B$50=\"\",\"\",'Compressive Strength'!$B$50)","v":"Corrected Stress, psi.:"},{"$f":"IF('Compressive Strength'!$P$24=\"\",\"\",'Compressive Strength'!$P$24)","v":4},{"$f":"IF('Compressive Strength'!$R$26=\"\",\"\",'Compressive Strength'!$R$26)","v":"4-3"}]
[304,{"$f":"IF('Compressive Strength'!$I$52=\"\",\"\",'Compressive Strength'!$I$52)","v":""},{"$f":"IF('Compressive Strength'!$B$6=\"\",\"\",'Compressive Strength'!$B$6)","v":"Tex-120-E : PART I"},{"$f":"IF('Compressive Strength'!$B$52=\"\",\"\",'Compressive Strength'!$B$52)","v":"Avg. Corrected Stress, psi:"},{"$f":"IF('Compressive Strength'!$G$24=\"\",\"\",'Compressive Strength'!$G$24)","v":1}]
[305,{"$f":"IF('Compressive Strength'!$L$52=\"\",\"\",'Compressive Strength'!$L$52)","v":""},{"$f":"IF('Compressive Strength'!$B$6=\"\",\"\",'Compressive Strength'!$B$6)","v":"Tex-120-E : PART I"},{"$f":"IF('Compressive Strength'!$B$52=\"\",\"\",'Compressive Strength'!$B$52)","v":"Avg. Corrected Stress, psi:"},{"$f":"IF('Compressive Strength'!$J$24=\"\",\"\",'Compressive Strength'!$J$24)","v":2}]
[306,{"$f":"IF('Compressive Strength'!$O$52=\"\",\"\",'Compressive Strength'!$O$52)","v":""},{"$f":"IF('Compressive Strength'!$B$6=\"\",\"\",'Compressive Strength'!$B$6)","v":"Tex-120-E : PART I"},{"$f":"IF('Compressive Strength'!$B$52=\"\",\"\",'Compressive Strength'!$B$52)","v":"Avg. Corrected Stress, psi:"},{"$f":"IF('Compressive Strength'!$M$24=\"\",\"\",'Compressive Strength'!$M$24)","v":3}]
[307,{"$f":"IF('Compressive Strength'!$R$52=\"\",\"\",'Compressive Strength'!$R$52)","v":""},{"$f":"IF('Compressive Strength'!$B$6=\"\",\"\",'Compressive Strength'!$B$6)","v":"Tex-120-E : PART I"},{"$f":"IF('Compressive Strength'!$B$52=\"\",\"\",'Compressive Strength'!$B$52)","v":"Avg. Corrected Stress, psi:"},{"$f":"IF('Compressive Strength'!$P$24=\"\",\"\",'Compressive Strength'!$P$24)","v":4}]
[308,{"$f":"IF('Compressive Strength'!$G$55=\"\",\"\",'Compressive Strength'!$G$55)","v":""},{"$f":"IF('Compressive Strength'!$B$6=\"\",\"\",'Compressive Strength'!$B$6)","v":"Tex-120-E : PART I"},{"$f":"IF('Compressive Strength'!$B$55=\"\",\"\",'Compressive Strength'!$B$55)","v":"Percent Cement, (%)"},{"$f":"IF('Compressive Strength'!$G$54=\"\",\"\",'Compressive Strength'!$G$54)","v":1}]
[309,{"$f":"IF('Compressive Strength'!$H$55=\"\",\"\",'Compressive Strength'!$H$55)","v":""},{"$f":"IF('Compressive Strength'!$B$6=\"\",\"\",'Compressive Strength'!$B$6)","v":"Tex-120-E : PART I"},{"$f":"IF('Compressive Strength'!$B$55=\"\",\"\",'Compressive Strength'!$B$55)","v":"Percent Cement, (%)"},{"$f":"IF('Compressive Strength'!$H$54=\"\",\"\",'Compressive Strength'!$H$54)","v":2}]
[310,{"$f":"IF('Compressive Strength'!$I$55=\"\",\"\",'Compressive Strength'!$I$55)","v":""},{"$f":"IF('Compressive Strength'!$B$6=\"\",\"\",'Compressive Strength'!$B$6)","v":"Tex-120-E : PART I"},{"$f":"IF('Compressive Strength'!$B$55=\"\",\"\",'Compressive Strength'!$B$55)","v":"Percent Cement, (%)"},{"$f":"IF('Compressive Strength'!$I$54=\"\",\"\",'Compressive Strength'!$I$54)","v":3}]
[311,{"$f":"IF('Compressive Strength'!$J$55=\"\",\"\",'Compressive Strength'!$J$55)","v":""},{"$f":"IF('Compressive Strength'!$B$6=\"\",\"\",'Compressive Strength'!$B$6)","v":"Tex-120-E : PART I"},{"$f":"IF('Compressive Strength'!$B$55=\"\",\"\",'Compressive Strength'!$B$55)","v":"Percent Cement, (%)"},{"$f":"IF('Compressive Strength'!$J$54=\"\",\"\",'Compressive Strength'!$J$54)","v":4}]
[312,{"$f":"IF('Compressive Strength'!$G$56=\"\",\"\",'Compressive Strength'!$G$56)","v":""},{"$f":"IF('Compressive Strength'!$B$6=\"\",\"\",'Compressive Strength'!$B$6)","v":"Tex-120-E : PART I"},{"$f":"IF('Compressive Strength'!$B$56=\"\",\"\",'Compressive Strength'!$B$56)","v":"Avg. Corrected Stress, psi:"},{"$f":"IF('Compressive Strength'!$G$54=\"\",\"\",'Compressive Strength'!$G$54)","v":1}]
[313,{"$f":"IF('Compressive Strength'!$H$56=\"\",\"\",'Compressive Strength'!$H$56)","v":""},{"$f":"IF('Compressive Strength'!$B$6=\"\",\"\",'Compressive Strength'!$B$6)","v":"Tex-120-E : PART I"},{"$f":"IF('Compressive Strength'!$B$56=\"\",\"\",'Compressive Strength'!$B$56)","v":"Avg. Corrected Stress, psi:"},{"$f":"IF('Compressive Strength'!$H$54=\"\",\"\",'Compressive Strength'!$H$54)","v":2}]
[314,{"$f":"IF('Compressive Strength'!$I$56=\"\",\"\",'Compressive Strength'!$I$56)","v":""},{"$f":"IF('Compressive Strength'!$B$6=\"\",\"\",'Compressive Strength'!$B$6)","v":"Tex-120-E : PART I"},{"$f":"IF('Compressive Strength'!$B$56=\"\",\"\",'Compressive Strength'!$B$56)","v":"Avg. Corrected Stress, psi:"},{"$f":"IF('Compressive Strength'!$I$54=\"\",\"\",'Compressive Strength'!$I$54)","v":3}]
[315,{"$f":"IF('Compressive Strength'!$J$56=\"\",\"\",'Compressive Strength'!$J$56)","v":""},{"$f":"IF('Compressive Strength'!$B$6=\"\",\"\",'Compressive Strength'!$B$6)","v":"Tex-120-E : PART I"},{"$f":"IF('Compressive Strength'!$B$56=\"\",\"\",'Compressive Strength'!$B$56)","v":"Avg. Corrected Stress, psi:"},{"$f":"IF('Compressive Strength'!$J$54=\"\",\"\",'Compressive Strength'!$J$54)","v":4}]
[316,{"$f":"IF('Compressive Strength'!$G$58=\"\",\"\",'Compressive Strength'!$G$58)","v":""},{"$f":"IF('Compressive Strength'!$B$6=\"\",\"\",'Compressive Strength'!$B$6)","v":"Tex-120-E : PART I"},{"$f":"IF('Compressive Strength'!$B$58=\"\",\"\",'Compressive Strength'!$B$58)","v":"Target Stress, psi:"}]
[317,{"$f":"IF('Compressive Strength'!$G$60=\"\",\"\",'Compressive Strength'!$G$60)","v":""},{"$f":"IF('Compressive Strength'!$B$6=\"\",\"\",'Compressive Strength'!$B$6)","v":"Tex-120-E : PART I"},{"$f":"IF('Compressive Strength'!$B$60=\"\",\"\",'Compressive Strength'!$B$60)","v":"Target Percent Cement, %:"}]
[318,{"$f":"IF('Tex-113,4-E'!$E$21=\"\",\"\",'Tex-113,4-E'!$E$21)","v":""},{"$f":"IF('Tex-113,4-E'!$B$6=\"\",\"\",'Tex-113,4-E'!$B$6)","v":"TEX-113-E or Tex-114-E"},{"$f":"IF('Tex-113,4-E'!$B$21=\"\",\"\",'Tex-113,4-E'!$B$21)","v":"Percent Cement, (%):"}]
[319,{"$f":"IF('Tex-113,4-E'!$E$22=\"\",\"\",'Tex-113,4-E'!$E$22)","v":""},{"$f":"IF('Tex-113,4-E'!$B$6=\"\",\"\",'Tex-113,4-E'!$B$6)","v":"TEX-113-E or Tex-114-E"},{"$f":"IF('Tex-113,4-E'!$B$22=\"\",\"\",'Tex-113,4-E'!$B$22)","v":"Oven Dry Weight, (g):"}]
[320,{"$f":"IF('Tex-113,4-E'!$E$23=\"\",\"\",'Tex-113,4-E'!$E$23)","v":""},{"$f":"IF('Tex-113,4-E'!$B$6=\"\",\"\",'Tex-113,4-E'!$B$6)","v":"TEX-113-E or Tex-114-E"},{"$f":"IF('Tex-113,4-E'!$B$23=\"\",\"\",'Tex-113,4-E'!$B$23)","v":"Weight of Pycnometer & Water, (g):"}]
[321,{"$f":"IF('Tex-113,4-E'!$E$24=\"\",\"\",'Tex-113,4-E'!$E$24)","v":""},{"$f":"IF('Tex-113,4-E'!$B$6=\"\",\"\",'Tex-113,4-E'!$B$6)","v":"TEX-113-E or Tex-114-E"},{"$f":"IF('Tex-113,4-E'!$B$24=\"\",\"\",'Tex-113,4-E'!$B$24)","v":"Weight of Aggr., Pycn.& Water, (g):"}]
[322,{"$f":"IF('Tex-113,4-E'!$E$25=\"\",\"\",'Tex-113,4-E'!$E$25)","v":""},{"$f":"IF('Tex-113,4-E'!$B$6=\"\",\"\",'Tex-113,4-E'!$B$6)","v":"TEX-113-E or Tex-114-E"},{"$f":"IF('Tex-113,4-E'!$B$25=\"\",\"\",'Tex-113,4-E'!$B$25)","v":"Specific Gravity (Apparent):"}]
[323,{"$f":"IF('Tex-113,4-E'!$E$27=\"\",\"\",'Tex-113,4-E'!$E$27)","v":""},{"$f":"IF('Tex-113,4-E'!$B$6=\"\",\"\",'Tex-113,4-E'!$B$6)","v":"TEX-113-E or Tex-114-E"},{"$f":"IF('Tex-113,4-E'!$B$27=\"\",\"\",'Tex-113,4-E'!$B$27)","v":"Hygroscopic Moisture, (%):"}]
[324,{"$f":"IF('Tex-113,4-E'!$E$30=\"\",\"\",'Tex-113,4-E'!$E$30)","v":""},{"$f":"IF('Tex-113,4-E'!$B$6=\"\",\"\",'Tex-113,4-E'!$B$6)","v":"TEX-113-E or Tex-114-E"},{"$f":"IF('Tex-113,4-E'!$B$30=\"\",\"\",'Tex-113,4-E'!$B$30)","v":"Percent Water Content, (%):"},{"$f":"IF('Tex-113,4-E'!$E$29=\"\",\"\",'Tex-113,4-E'!$E$29)","v":1}]
[325,{"$f":"IF('Tex-113,4-E'!$F$30=\"\",\"\",'Tex-113,4-E'!$F$30)","v":""},{"$f":"IF('Tex-113,4-E'!$B$6=\"\",\"\",'Tex-113,4-E'!$B$6)","v":"TEX-113-E or Tex-114-E"},{"$f":"IF('Tex-113,4-E'!$B$30=\"\",\"\",'Tex-113,4-E'!$B$30)","v":"Percent Water Content, (%):"},{"$f":"IF('Tex-113,4-E'!$F$29=\"\",\"\",'Tex-113,4-E'!$F$29)","v":2}]
[326,{"$f":"IF('Tex-113,4-E'!$G$30=\"\",\"\",'Tex-113,4-E'!$G$30)","v":""},{"$f":"IF('Tex-113,4-E'!$B$6=\"\",\"\",'Tex-113,4-E'!$B$6)","v":"TEX-113-E or Tex-114-E"},{"$f":"IF('Tex-113,4-E'!$B$30=\"\",\"\",'Tex-113,4-E'!$B$30)","v":"Percent Water Content, (%):"},{"$f":"IF('Tex-113,4-E'!$G$29=\"\",\"\",'Tex-113,4-E'!$G$29)","v":3}]
[327,{"$f":"IF('Tex-113,4-E'!$H$30=\"\",\"\",'Tex-113,4-E'!$H$30)","v":""},{"$f":"IF('Tex-113,4-E'!$B$6=\"\",\"\",'Tex-113,4-E'!$B$6)","v":"TEX-113-E or Tex-114-E"},{"$f":"IF('Tex-113,4-E'!$B$30=\"\",\"\",'Tex-113,4-E'!$B$30)","v":"Percent Water Content, (%):"},{"$f":"IF('Tex-113,4-E'!$H$29=\"\",\"\",'Tex-113,4-E'!$H$29)","v":4}]
[328,{"$f":"IF('Tex-113,4-E'!$E$31=\"\",\"\",'Tex-113,4-E'!$E$31)","v":""},{"$f":"IF('Tex-113,4-E'!$B$6=\"\",\"\",'Tex-113,4-E'!$B$6)","v":"TEX-113-E or Tex-114-E"},{"$f":"IF('Tex-113,4-E'!$B$31=\"\",\"\",'Tex-113,4-E'!$B$31)","v":"Percent Cement, (%):"},{"$f":"IF('Tex-113,4-E'!$E$29=\"\",\"\",'Tex-113,4-E'!$E$29)","v":1}]
[329,{"$f":"IF('Tex-113,4-E'!$F$31=\"\",\"\",'Tex-113,4-E'!$F$31)","v":""},{"$f":"IF('Tex-113,4-E'!$B$6=\"\",\"\",'Tex-113,4-E'!$B$6)","v":"TEX-113-E or Tex-114-E"},{"$f":"IF('Tex-113,4-E'!$B$31=\"\",\"\",'Tex-113,4-E'!$B$31)","v":"Percent Cement, (%):"},{"$f":"IF('Tex-113,4-E'!$F$29=\"\",\"\",'Tex-113,4-E'!$F$29)","v":2}]
[330,{"$f":"IF('Tex-113,4-E'!$G$31=\"\",\"\",'Tex-113,4-E'!$G$31)","v":""},{"$f":"IF('Tex-113,4-E'!$B$6=\"\",\"\",'Tex-113,4-E'!$B$6)","v":"TEX-113-E or Tex-114-E"},{"$f":"IF('Tex-113,4-E'!$B$31=\"\",\"\",'Tex-113,4-E'!$B$31)","v":"Percent Cement, (%):"},{"$f":"IF('Tex-113,4-E'!$G$29=\"\",\"\",'Tex-113,4-E'!$G$29)","v":3}]
[331,{"$f":"IF('Tex-113,4-E'!$H$31=\"\",\"\",'Tex-113,4-E'!$H$31)","v":""},{"$f":"IF('Tex-113,4-E'!$B$6=\"\",\"\",'Tex-113,4-E'!$B$6)","v":"TEX-113-E or Tex-114-E"},{"$f":"IF('Tex-113,4-E'!$B$31=\"\",\"\",'Tex-113,4-E'!$B$31)","v":"Percent Cement, (%):"},{"$f":"IF('Tex-113,4-E'!$H$29=\"\",\"\",'Tex-113,4-E'!$H$29)","v":4}]
[332,{"$f":"IF('Tex-113,4-E'!$E$32=\"\",\"\",'Tex-113,4-E'!$E$32)","v":""},{"$f":"IF('Tex-113,4-E'!$B$6=\"\",\"\",'Tex-113,4-E'!$B$6)","v":"TEX-113-E or Tex-114-E"},{"$f":"IF('Tex-113,4-E'!$B$32=\"\",\"\",'Tex-113,4-E'!$B$32)","v":"Mass Material, (lb):"},{"$f":"IF('Tex-113,4-E'!$E$29=\"\",\"\",'Tex-113,4-E'!$E$29)","v":1}]
[333,{"$f":"IF('Tex-113,4-E'!$F$32=\"\",\"\",'Tex-113,4-E'!$F$32)","v":""},{"$f":"IF('Tex-113,4-E'!$B$6=\"\",\"\",'Tex-113,4-E'!$B$6)","v":"TEX-113-E or Tex-114-E"},{"$f":"IF('Tex-113,4-E'!$B$32=\"\",\"\",'Tex-113,4-E'!$B$32)","v":"Mass Material, (lb):"},{"$f":"IF('Tex-113,4-E'!$F$29=\"\",\"\",'Tex-113,4-E'!$F$29)","v":2}]
[334,{"$f":"IF('Tex-113,4-E'!$G$32=\"\",\"\",'Tex-113,4-E'!$G$32)","v":""},{"$f":"IF('Tex-113,4-E'!$B$6=\"\",\"\",'Tex-113,4-E'!$B$6)","v":"TEX-113-E or Tex-114-E"},{"$f":"IF('Tex-113,4-E'!$B$32=\"\",\"\",'Tex-113,4-E'!$B$32)","v":"Mass Material, (lb):"},{"$f":"IF('Tex-113,4-E'!$G$29=\"\",\"\",'Tex-113,4-E'!$G$29)","v":3}]
[335,{"$f":"IF('Tex-113,4-E'!$H$32=\"\",\"\",'Tex-113,4-E'!$H$32)","v":""},{"$f":"IF('Tex-113,4-E'!$B$6=\"\",\"\",'Tex-113,4-E'!$B$6)","v":"TEX-113-E or Tex-114-E"},{"$f":"IF('Tex-113,4-E'!$B$32=\"\",\"\",'Tex-113,4-E'!$B$32)","v":"Mass Material, (lb):"},{"$f":"IF('Tex-113,4-E'!$H$29=\"\",\"\",'Tex-113,4-E'!$H$29)","v":4}]
[336,{"$f":"IF('Tex-113,4-E'!$E$33=\"\",\"\",'Tex-113,4-E'!$E$33)","v":""},{"$f":"IF('Tex-113,4-E'!$B$6=\"\",\"\",'Tex-113,4-E'!$B$6)","v":"TEX-113-E or Tex-114-E"},{"$f":"IF('Tex-113,4-E'!$B$33=\"\",\"\",'Tex-113,4-E'!$B$33)","v":"Mass Water Added, (lb):"},{"$f":"IF('Tex-113,4-E'!$E$29=\"\",\"\",'Tex-113,4-E'!$E$29)","v":1}]
[337,{"$f":"IF('Tex-113,4-E'!$F$33=\"\",\"\",'Tex-113,4-E'!$F$33)","v":""},{"$f":"IF('Tex-113,4-E'!$B$6=\"\",\"\",'Tex-113,4-E'!$B$6)","v":"TEX-113-E or Tex-114-E"},{"$f":"IF('Tex-113,4-E'!$B$33=\"\",\"\",'Tex-113,4-E'!$B$33)","v":"Mass Water Added, (lb):"},{"$f":"IF('Tex-113,4-E'!$F$29=\"\",\"\",'Tex-113,4-E'!$F$29)","v":2}]
[338,{"$f":"IF('Tex-113,4-E'!$G$33=\"\",\"\",'Tex-113,4-E'!$G$33)","v":""},{"$f":"IF('Tex-113,4-E'!$B$6=\"\",\"\",'Tex-113,4-E'!$B$6)","v":"TEX-113-E or Tex-114-E"},{"$f":"IF('Tex-113,4-E'!$B$33=\"\",\"\",'Tex-113,4-E'!$B$33)","v":"Mass Water Added, (lb):"},{"$f":"IF('Tex-113,4-E'!$G$29=\"\",\"\",'Tex-113,4-E'!$G$29)","v":3}]
[339,{"$f":"IF('Tex-113,4-E'!$H$33=\"\",\"\",'Tex-113,4-E'!$H$33)","v":""},{"$f":"IF('Tex-113,4-E'!$B$6=\"\",\"\",'Tex-113,4-E'!$B$6)","v":"TEX-113-E or Tex-114-E"},{"$f":"IF('Tex-113,4-E'!$B$33=\"\",\"\",'Tex-113,4-E'!$B$33)","v":"Mass Water Added, (lb):"},{"$f":"IF('Tex-113,4-E'!$H$29=\"\",\"\",'Tex-113,4-E'!$H$29)","v":4}]
[340,{"$f":"IF('Tex-113,4-E'!$E$34=\"\",\"\",'Tex-113,4-E'!$E$34)","v":""},{"$f":"IF('Tex-113,4-E'!$B$6=\"\",\"\",'Tex-113,4-E'!$B$6)","v":"TEX-113-E or Tex-114-E"},{"$f":"IF('Tex-113,4-E'!$B$34=\"\",\"\",'Tex-113,4-E'!$B$34)","v":"Mass Cement Added, (lb):"},{"$f":"IF('Tex-113,4-E'!$E$29=\"\",\"\",'Tex-113,4-E'!$E$29)","v":1}]
[341,{"$f":"IF('Tex-113,4-E'!$F$34=\"\",\"\",'Tex-113,4-E'!$F$34)","v":""},{"$f":"IF('Tex-113,4-E'!$B$6=\"\",\"\",'Tex-113,4-E'!$B$6)","v":"TEX-113-E or Tex-114-E"},{"$f":"IF('Tex-113,4-E'!$B$34=\"\",\"\",'Tex-113,4-E'!$B$34)","v":"Mass Cement Added, (lb):"},{"$f":"IF('Tex-113,4-E'!$F$29=\"\",\"\",'Tex-113,4-E'!$F$29)","v":2}]
[342,{"$f":"IF('Tex-113,4-E'!$G$34=\"\",\"\",'Tex-113,4-E'!$G$34)","v":""},{"$f":"IF('Tex-113,4-E'!$B$6=\"\",\"\",'Tex-113,4-E'!$B$6)","v":"TEX-113-E or Tex-114-E"},{"$f":"IF('Tex-113,4-E'!$B$34=\"\",\"\",'Tex-113,4-E'!$B$34)","v":"Mass Cement Added, (lb):"},{"$f":"IF('Tex-113,4-E'!$G$29=\"\",\"\",'Tex-113,4-E'!$G$29)","v":3}]
[343,{"$f":"IF('Tex-113,4-E'!$H$34=\"\",\"\",'Tex-113,4-E'!$H$34)","v":""},{"$f":"IF('Tex-113,4-E'!$B$6=\"\",\"\",'Tex-113,4-E'!$B$6)","v":"TEX-113-E or Tex-114-E"},{"$f":"IF('Tex-113,4-E'!$B$34=\"\",\"\",'Tex-113,4-E'!$B$34)","v":"Mass Cement Added, (lb):"},{"$f":"IF('Tex-113,4-E'!$H$29=\"\",\"\",'Tex-113,4-E'!$H$29)","v":4}]
[344,{"$f":"IF('Tex-113,4-E'!$E$35=\"\",\"\",'Tex-113,4-E'!$E$35)","v":""},{"$f":"IF('Tex-113,4-E'!$B$6=\"\",\"\",'Tex-113,4-E'!$B$6)","v":"TEX-113-E or Tex-114-E"},{"$f":"IF('Tex-113,4-E'!$B$35=\"\",\"\",'Tex-113,4-E'!$B$35)","v":"Wet Mass Specimen & Mold, (lb):"},{"$f":"IF('Tex-113,4-E'!$E$29=\"\",\"\",'Tex-113,4-E'!$E$29)","v":1}]
[345,{"$f":"IF('Tex-113,4-E'!$F$35=\"\",\"\",'Tex-113,4-E'!$F$35)","v":""},{"$f":"IF('Tex-113,4-E'!$B$6=\"\",\"\",'Tex-113,4-E'!$B$6)","v":"TEX-113-E or Tex-114-E"},{"$f":"IF('Tex-113,4-E'!$B$35=\"\",\"\",'Tex-113,4-E'!$B$35)","v":"Wet Mass Specimen & Mold, (lb):"},{"$f":"IF('Tex-113,4-E'!$F$29=\"\",\"\",'Tex-113,4-E'!$F$29)","v":2}]
[346,{"$f":"IF('Tex-113,4-E'!$G$35=\"\",\"\",'Tex-113,4-E'!$G$35)","v":""},{"$f":"IF('Tex-113,4-E'!$B$6=\"\",\"\",'Tex-113,4-E'!$B$6)","v":"TEX-113-E or Tex-114-E"},{"$f":"IF('Tex-113,4-E'!$B$35=\"\",\"\",'Tex-113,4-E'!$B$35)","v":"Wet Mass Specimen & Mold, (lb):"},{"$f":"IF('Tex-113,4-E'!$G$29=\"\",\"\",'Tex-113,4-E'!$G$29)","v":3}]
[347,{"$f":"IF('Tex-113,4-E'!$H$35=\"\",\"\",'Tex-113,4-E'!$H$35)","v":""},{"$f":"IF('Tex-113,4-E'!$B$6=\"\",\"\",'Tex-113,4-E'!$B$6)","v":"TEX-113-E or Tex-114-E"},{"$f":"IF('Tex-113,4-E'!$B$35=\"\",\"\",'Tex-113,4-E'!$B$35)","v":"Wet Mass Specimen & Mold, (lb):"},{"$f":"IF('Tex-113,4-E'!$H$29=\"\",\"\",'Tex-113,4-E'!$H$29)","v":4}]
[348,{"$f":"IF('Tex-113,4-E'!$E$36=\"\",\"\",'Tex-113,4-E'!$E$36)","v":""},{"$f":"IF('Tex-113,4-E'!$B$6=\"\",\"\",'Tex-113,4-E'!$B$6)","v":"TEX-113-E or Tex-114-E"},{"$f":"IF('Tex-113,4-E'!$B$36=\"\",\"\",'Tex-113,4-E'!$B$36)","v":"Tare Mass Mold, (lb):"},{"$f":"IF('Tex-113,4-E'!$E$29=\"\",\"\",'Tex-113,4-E'!$E$29)","v":1}]
[349,{"$f":"IF('Tex-113,4-E'!$F$36=\"\",\"\",'Tex-113,4-E'!$F$36)","v":""},{"$f":"IF('Tex-113,4-E'!$B$6=\"\",\"\",'Tex-113,4-E'!$B$6)","v":"TEX-113-E or Tex-114-E"},{"$f":"IF('Tex-113,4-E'!$B$36=\"\",\"\",'Tex-113,4-E'!$B$36)","v":"Tare Mass Mold, (lb):"},{"$f":"IF('Tex-113,4-E'!$F$29=\"\",\"\",'Tex-113,4-E'!$F$29)","v":2}]
[350,{"$f":"IF('Tex-113,4-E'!$G$36=\"\",\"\",'Tex-113,4-E'!$G$36)","v":""},{"$f":"IF('Tex-113,4-E'!$B$6=\"\",\"\",'Tex-113,4-E'!$B$6)","v":"TEX-113-E or Tex-114-E"},{"$f":"IF('Tex-113,4-E'!$B$36=\"\",\"\",'Tex-113,4-E'!$B$36)","v":"Tare Mass Mold, (lb):"},{"$f":"IF('Tex-113,4-E'!$G$29=\"\",\"\",'Tex-113,4-E'!$G$29)","v":3}]
[351,{"$f":"IF('Tex-113,4-E'!$H$36=\"\",\"\",'Tex-113,4-E'!$H$36)","v":""},{"$f":"IF('Tex-113,4-E'!$B$6=\"\",\"\",'Tex-113,4-E'!$B$6)","v":"TEX-113-E or Tex-114-E"},{"$f":"IF('Tex-113,4-E'!$B$36=\"\",\"\",'Tex-113,4-E'!$B$36)","v":"Tare Mass Mold, (lb):"},{"$f":"IF('Tex-113,4-E'!$H$29=\"\",\"\",'Tex-113,4-E'!$H$29)","v":4}]
[352,{"$f":"IF('Tex-113,4-E'!$E$37=\"\",\"\",'Tex-113,4-E'!$E$37)","v":""},{"$f":"IF('Tex-113,4-E'!$B$6=\"\",\"\",'Tex-113,4-E'!$B$6)","v":"TEX-113-E or Tex-114-E"},{"$f":"IF('Tex-113,4-E'!$B$37=\"\",\"\",'Tex-113,4-E'!$B$37)","v":"Wet Mass Specimen, (lb):"},{"$f":"IF('Tex-113,4-E'!$E$29=\"\",\"\",'Tex-113,4-E'!$E$29)","v":1}]
[353,{"$f":"IF('Tex-113,4-E'!$F$37=\"\",\"\",'Tex-113,4-E'!$F$37)","v":""},{"$f":"IF('Tex-113,4-E'!$B$6=\"\",\"\",'Tex-113,4-E'!$B$6)","v":"TEX-113-E or Tex-114-E"},{"$f":"IF('Tex-113,4-E'!$B$37=\"\",\"\",'Tex-113,4-E'!$B$37)","v":"Wet Mass Specimen, (lb):"},{"$f":"IF('Tex-113,4-E'!$F$29=\"\",\"\",'Tex-113,4-E'!$F$29)","v":2}]
[354,{"$f":"IF('Tex-113,4-E'!$G$37=\"\",\"\",'Tex-113,4-E'!$G$37)","v":""},{"$f":"IF('Tex-113,4-E'!$B$6=\"\",\"\",'Tex-113,4-E'!$B$6)","v":"TEX-113-E or Tex-114-E"},{"$f":"IF('Tex-113,4-E'!$B$37=\"\",\"\",'Tex-113,4-E'!$B$37)","v":"Wet Mass Specimen, (lb):"},{"$f":"IF('Tex-113,4-E'!$G$29=\"\",\"\",'Tex-113,4-E'!$G$29)","v":3}]
[355,{"$f":"IF('Tex-113,4-E'!$H$37=\"\",\"\",'Tex-113,4-E'!$H$37)","v":""},{"$f":"IF('Tex-113,4-E'!$B$6=\"\",\"\",'Tex-113,4-E'!$B$6)","v":"TEX-113-E or Tex-114-E"},{"$f":"IF('Tex-113,4-E'!$B$37=\"\",\"\",'Tex-113,4-E'!$B$37)","v":"Wet Mass Specimen, (lb):"},{"$f":"IF('Tex-113,4-E'!$H$29=\"\",\"\",'Tex-113,4-E'!$H$29)","v":4}]
[356,{"$f":"IF('Tex-113,4-E'!$E$38=\"\",\"\",'Tex-113,4-E'!$E$38)","v":""},{"$f":"IF('Tex-113,4-E'!$B$6=\"\",\"\",'Tex-113,4-E'!$B$6)","v":"TEX-113-E or Tex-114-E"},{"$f":"IF('Tex-113,4-E'!$B$38=\"\",\"\",'Tex-113,4-E'!$B$38)","v":"Height of Specimen, (in.):"},{"$f":"IF('Tex-113,4-E'!$E$29=\"\",\"\",'Tex-113,4-E'!$E$29)","v":1}]
[357,{"$f":"IF('Tex-113,4-E'!$F$38=\"\",\"\",'Tex-113,4-E'!$F$38)","v":""},{"$f":"IF('Tex-113,4-E'!$B$6=\"\",\"\",'Tex-113,4-E'!$B$6)","v":"TEX-113-E or Tex-114-E"},{"$f":"IF('Tex-113,4-E'!$B$38=\"\",\"\",'Tex-113,4-E'!$B$38)","v":"Height of Specimen, (in.):"},{"$f":"IF('Tex-113,4-E'!$F$29=\"\",\"\",'Tex-113,4-E'!$F$29)","v":2}]
[358,{"$f":"IF('Tex-113,4-E'!$G$38=\"\",\"\",'Tex-113,4-E'!$G$38)","v":""},{"$f":"IF('Tex-113,4-E'!$B$6=\"\",\"\",'Tex-113,4-E'!$B$6)","v":"TEX-113-E or Tex-114-E"},{"$f":"IF('Tex-113,4-E'!$B$38=\"\",\"\",'Tex-113,4-E'!$B$38)","v":"Height of Specimen, (in.):"},{"$f":"IF('Tex-113,4-E'!$G$29=\"\",\"\",'Tex-113,4-E'!$G$29)","v":3}]
[359,{"$f":"IF('Tex-113,4-E'!$H$38=\"\",\"\",'Tex-113,4-E'!$H$38)","v":""},{"$f":"IF('Tex-113,4-E'!$B$6=\"\",\"\",'Tex-113,4-E'!$B$6)","v":"TEX-113-E or Tex-114-E"},{"$f":"IF('Tex-113,4-E'!$B$38=\"\",\"\",'Tex-113,4-E'!$B$38)","v":"Height of Specimen, (in.):"},{"$f":"IF('Tex-113,4-E'!$H$29=\"\",\"\",'Tex-113,4-E'!$H$29)","v":4}]
[360,{"$f":"IF('Tex-113,4-E'!$E$39=\"\",\"\",'Tex-113,4-E'!$E$39)","v":""},{"$f":"IF('Tex-113,4-E'!$B$6=\"\",\"\",'Tex-113,4-E'!$B$6)","v":"TEX-113-E or Tex-114-E"},{"$f":"IF('Tex-113,4-E'!$B$39=\"\",\"\",'Tex-113,4-E'!$B$39)","v":"Volume per Linear mm., (in.):"},{"$f":"IF('Tex-113,4-E'!$E$29=\"\",\"\",'Tex-113,4-E'!$E$29)","v":1}]
[361,{"$f":"IF('Tex-113,4-E'!$F$39=\"\",\"\",'Tex-113,4-E'!$F$39)","v":""},{"$f":"IF('Tex-113,4-E'!$B$6=\"\",\"\",'Tex-113,4-E'!$B$6)","v":"TEX-113-E or Tex-114-E"},{"$f":"IF('Tex-113,4-E'!$B$39=\"\",\"\",'Tex-113,4-E'!$B$39)","v":"Volume per Linear mm., (in.):"},{"$f":"IF('Tex-113,4-E'!$F$29=\"\",\"\",'Tex-113,4-E'!$F$29)","v":2}]
[362,{"$f":"IF('Tex-113,4-E'!$G$39=\"\",\"\",'Tex-113,4-E'!$G$39)","v":""},{"$f":"IF('Tex-113,4-E'!$B$6=\"\",\"\",'Tex-113,4-E'!$B$6)","v":"TEX-113-E or Tex-114-E"},{"$f":"IF('Tex-113,4-E'!$B$39=\"\",\"\",'Tex-113,4-E'!$B$39)","v":"Volume per Linear mm., (in.):"},{"$f":"IF('Tex-113,4-E'!$G$29=\"\",\"\",'Tex-113,4-E'!$G$29)","v":3}]
[363,{"$f":"IF('Tex-113,4-E'!$H$39=\"\",\"\",'Tex-113,4-E'!$H$39)","v":""},{"$f":"IF('Tex-113,4-E'!$B$6=\"\",\"\",'Tex-113,4-E'!$B$6)","v":"TEX-113-E or Tex-114-E"},{"$f":"IF('Tex-113,4-E'!$B$39=\"\",\"\",'Tex-113,4-E'!$B$39)","v":"Volume per Linear mm., (in.):"},{"$f":"IF('Tex-113,4-E'!$H$29=\"\",\"\",'Tex-113,4-E'!$H$29)","v":4}]
[364,{"$f":"IF('Tex-113,4-E'!$E$40=\"\",\"\",'Tex-113,4-E'!$E$40)","v":""},{"$f":"IF('Tex-113,4-E'!$B$6=\"\",\"\",'Tex-113,4-E'!$B$6)","v":"TEX-113-E or Tex-114-E"},{"$f":"IF('Tex-113,4-E'!$B$40=\"\",\"\",'Tex-113,4-E'!$B$40)","v":"Volume of Specimen, (ft^3):"},{"$f":"IF('Tex-113,4-E'!$E$29=\"\",\"\",'Tex-113,4-E'!$E$29)","v":1}]
[365,{"$f":"IF('Tex-113,4-E'!$F$40=\"\",\"\",'Tex-113,4-E'!$F$40)","v":""},{"$f":"IF('Tex-113,4-E'!$B$6=\"\",\"\",'Tex-113,4-E'!$B$6)","v":"TEX-113-E or Tex-114-E"},{"$f":"IF('Tex-113,4-E'!$B$40=\"\",\"\",'Tex-113,4-E'!$B$40)","v":"Volume of Specimen, (ft^3):"},{"$f":"IF('Tex-113,4-E'!$F$29=\"\",\"\",'Tex-113,4-E'!$F$29)","v":2}]
[366,{"$f":"IF('Tex-113,4-E'!$G$40=\"\",\"\",'Tex-113,4-E'!$G$40)","v":""},{"$f":"IF('Tex-113,4-E'!$B$6=\"\",\"\",'Tex-113,4-E'!$B$6)","v":"TEX-113-E or Tex-114-E"},{"$f":"IF('Tex-113,4-E'!$B$40=\"\",\"\",'Tex-113,4-E'!$B$40)","v":"Volume of Specimen, (ft^3):"},{"$f":"IF('Tex-113,4-E'!$G$29=\"\",\"\",'Tex-113,4-E'!$G$29)","v":3}]
[367,{"$f":"IF('Tex-113,4-E'!$H$40=\"\",\"\",'Tex-113,4-E'!$H$40)","v":""},{"$f":"IF('Tex-113,4-E'!$B$6=\"\",\"\",'Tex-113,4-E'!$B$6)","v":"TEX-113-E or Tex-114-E"},{"$f":"IF('Tex-113,4-E'!$B$40=\"\",\"\",'Tex-113,4-E'!$B$40)","v":"Volume of Specimen, (ft^3):"},{"$f":"IF('Tex-113,4-E'!$H$29=\"\",\"\",'Tex-113,4-E'!$H$29)","v":4}]
[368,{"$f":"IF('Tex-113,4-E'!$E$41=\"\",\"\",'Tex-113,4-E'!$E$41)","v":""},{"$f":"IF('Tex-113,4-E'!$B$6=\"\",\"\",'Tex-113,4-E'!$B$6)","v":"TEX-113-E or Tex-114-E"},{"$f":"IF('Tex-113,4-E'!$B$41=\"\",\"\",'Tex-113,4-E'!$B$41)","v":"Wet Density of Specimen, (lb):"},{"$f":"IF('Tex-113,4-E'!$E$29=\"\",\"\",'Tex-113,4-E'!$E$29)","v":1}]
[369,{"$f":"IF('Tex-113,4-E'!$F$41=\"\",\"\",'Tex-113,4-E'!$F$41)","v":""},{"$f":"IF('Tex-113,4-E'!$B$6=\"\",\"\",'Tex-113,4-E'!$B$6)","v":"TEX-113-E or Tex-114-E"},{"$f":"IF('Tex-113,4-E'!$B$41=\"\",\"\",'Tex-113,4-E'!$B$41)","v":"Wet Density of Specimen, (lb):"},{"$f":"IF('Tex-113,4-E'!$F$29=\"\",\"\",'Tex-113,4-E'!$F$29)","v":2}]
[370,{"$f":"IF('Tex-113,4-E'!$G$41=\"\",\"\",'Tex-113,4-E'!$G$41)","v":""},{"$f":"IF('Tex-113,4-E'!$B$6=\"\",\"\",'Tex-113,4-E'!$B$6)","v":"TEX-113-E or Tex-114-E"},{"$f":"IF('Tex-113,4-E'!$B$41=\"\",\"\",'Tex-113,4-E'!$B$41)","v":"Wet Density of Specimen, (lb):"},{"$f":"IF('Tex-113,4-E'!$G$29=\"\",\"\",'Tex-113,4-E'!$G$29)","v":3}]
[371,{"$f":"IF('Tex-113,4-E'!$H$41=\"\",\"\",'Tex-113,4-E'!$H$41)","v":""},{"$f":"IF('Tex-113,4-E'!$B$6=\"\",\"\",'Tex-113,4-E'!$B$6)","v":"TEX-113-E or Tex-114-E"},{"$f":"IF('Tex-113,4-E'!$B$41=\"\",\"\",'Tex-113,4-E'!$B$41)","v":"Wet Density of Specimen, (lb):"},{"$f":"IF('Tex-113,4-E'!$H$29=\"\",\"\",'Tex-113,4-E'!$H$29)","v":4}]
[372,{"$f":"IF('Tex-113,4-E'!$E$42=\"\",\"\",'Tex-113,4-E'!$E$42)","v":""},{"$f":"IF('Tex-113,4-E'!$B$6=\"\",\"\",'Tex-113,4-E'!$B$6)","v":"TEX-113-E or Tex-114-E"},{"$f":"IF('Tex-113,4-E'!$B$42=\"\",\"\",'Tex-113,4-E'!$B$42)","v":"Wet Mass of Pan & Specimen, (lb):"},{"$f":"IF('Tex-113,4-E'!$E$29=\"\",\"\",'Tex-113,4-E'!$E$29)","v":1}]
[373,{"$f":"IF('Tex-113,4-E'!$F$42=\"\",\"\",'Tex-113,4-E'!$F$42)","v":""},{"$f":"IF('Tex-113,4-E'!$B$6=\"\",\"\",'Tex-113,4-E'!$B$6)","v":"TEX-113-E or Tex-114-E"},{"$f":"IF('Tex-113,4-E'!$B$42=\"\",\"\",'Tex-113,4-E'!$B$42)","v":"Wet Mass of Pan & Specimen, (lb):"},{"$f":"IF('Tex-113,4-E'!$F$29=\"\",\"\",'Tex-113,4-E'!$F$29)","v":2}]
[374,{"$f":"IF('Tex-113,4-E'!$G$42=\"\",\"\",'Tex-113,4-E'!$G$42)","v":""},{"$f":"IF('Tex-113,4-E'!$B$6=\"\",\"\",'Tex-113,4-E'!$B$6)","v":"TEX-113-E or Tex-114-E"},{"$f":"IF('Tex-113,4-E'!$B$42=\"\",\"\",'Tex-113,4-E'!$B$42)","v":"Wet Mass of Pan & Specimen, (lb):"},{"$f":"IF('Tex-113,4-E'!$G$29=\"\",\"\",'Tex-113,4-E'!$G$29)","v":3}]
[375,{"$f":"IF('Tex-113,4-E'!$H$42=\"\",\"\",'Tex-113,4-E'!$H$42)","v":""},{"$f":"IF('Tex-113,4-E'!$B$6=\"\",\"\",'Tex-113,4-E'!$B$6)","v":"TEX-113-E or Tex-114-E"},{"$f":"IF('Tex-113,4-E'!$B$42=\"\",\"\",'Tex-113,4-E'!$B$42)","v":"Wet Mass of Pan & Specimen, (lb):"},{"$f":"IF('Tex-113,4-E'!$H$29=\"\",\"\",'Tex-113,4-E'!$H$29)","v":4}]
[376,{"$f":"IF('Tex-113,4-E'!$E$43=\"\",\"\",'Tex-113,4-E'!$E$43)","v":""},{"$f":"IF('Tex-113,4-E'!$B$6=\"\",\"\",'Tex-113,4-E'!$B$6)","v":"TEX-113-E or Tex-114-E"},{"$f":"IF('Tex-113,4-E'!$B$43=\"\",\"\",'Tex-113,4-E'!$B$43)","v":"Dry Mass Pan & Specimen, (lb):"},{"$f":"IF('Tex-113,4-E'!$E$29=\"\",\"\",'Tex-113,4-E'!$E$29)","v":1}]
[377,{"$f":"IF('Tex-113,4-E'!$F$43=\"\",\"\",'Tex-113,4-E'!$F$43)","v":""},{"$f":"IF('Tex-113,4-E'!$B$6=\"\",\"\",'Tex-113,4-E'!$B$6)","v":"TEX-113-E or Tex-114-E"},{"$f":"IF('Tex-113,4-E'!$B$43=\"\",\"\",'Tex-113,4-E'!$B$43)","v":"Dry Mass Pan & Specimen, (lb):"},{"$f":"IF('Tex-113,4-E'!$F$29=\"\",\"\",'Tex-113,4-E'!$F$29)","v":2}]
[378,{"$f":"IF('Tex-113,4-E'!$G$43=\"\",\"\",'Tex-113,4-E'!$G$43)","v":""},{"$f":"IF('Tex-113,4-E'!$B$6=\"\",\"\",'Tex-113,4-E'!$B$6)","v":"TEX-113-E or Tex-114-E"},{"$f":"IF('Tex-113,4-E'!$B$43=\"\",\"\",'Tex-113,4-E'!$B$43)","v":"Dry Mass Pan & Specimen, (lb):"},{"$f":"IF('Tex-113,4-E'!$G$29=\"\",\"\",'Tex-113,4-E'!$G$29)","v":3}]
[379,{"$f":"IF('Tex-113,4-E'!$H$43=\"\",\"\",'Tex-113,4-E'!$H$43)","v":""},{"$f":"IF('Tex-113,4-E'!$B$6=\"\",\"\",'Tex-113,4-E'!$B$6)","v":"TEX-113-E or Tex-114-E"},{"$f":"IF('Tex-113,4-E'!$B$43=\"\",\"\",'Tex-113,4-E'!$B$43)","v":"Dry Mass Pan & Specimen, (lb):"},{"$f":"IF('Tex-113,4-E'!$H$29=\"\",\"\",'Tex-113,4-E'!$H$29)","v":4}]
[380,{"$f":"IF('Tex-113,4-E'!$E$44=\"\",\"\",'Tex-113,4-E'!$E$44)","v":""},{"$f":"IF('Tex-113,4-E'!$B$6=\"\",\"\",'Tex-113,4-E'!$B$6)","v":"TEX-113-E or Tex-114-E"},{"$f":"IF('Tex-113,4-E'!$B$44=\"\",\"\",'Tex-113,4-E'!$B$44)","v":"Tare Mass Pan, (lb):"},{"$f":"IF('Tex-113,4-E'!$E$29=\"\",\"\",'Tex-113,4-E'!$E$29)","v":1}]
[381,{"$f":"IF('Tex-113,4-E'!$F$44=\"\",\"\",'Tex-113,4-E'!$F$44)","v":""},{"$f":"IF('Tex-113,4-E'!$B$6=\"\",\"\",'Tex-113,4-E'!$B$6)","v":"TEX-113-E or Tex-114-E"},{"$f":"IF('Tex-113,4-E'!$B$44=\"\",\"\",'Tex-113,4-E'!$B$44)","v":"Tare Mass Pan, (lb):"},{"$f":"IF('Tex-113,4-E'!$F$29=\"\",\"\",'Tex-113,4-E'!$F$29)","v":2}]
[382,{"$f":"IF('Tex-113,4-E'!$G$44=\"\",\"\",'Tex-113,4-E'!$G$44)","v":""},{"$f":"IF('Tex-113,4-E'!$B$6=\"\",\"\",'Tex-113,4-E'!$B$6)","v":"TEX-113-E or Tex-114-E"},{"$f":"IF('Tex-113,4-E'!$B$44=\"\",\"\",'Tex-113,4-E'!$B$44)","v":"Tare Mass Pan, (lb):"},{"$f":"IF('Tex-113,4-E'!$G$29=\"\",\"\",'Tex-113,4-E'!$G$29)","v":3}]
[383,{"$f":"IF('Tex-113,4-E'!$H$44=\"\",\"\",'Tex-113,4-E'!$H$44)","v":""},{"$f":"IF('Tex-113,4-E'!$B$6=\"\",\"\",'Tex-113,4-E'!$B$6)","v":"TEX-113-E or Tex-114-E"},{"$f":"IF('Tex-113,4-E'!$B$44=\"\",\"\",'Tex-113,4-E'!$B$44)","v":"Tare Mass Pan, (lb):"},{"$f":"IF('Tex-113,4-E'!$H$29=\"\",\"\",'Tex-113,4-E'!$H$29)","v":4}]
[384,{"$f":"IF('Tex-113,4-E'!$E$45=\"\",\"\",'Tex-113,4-E'!$E$45)","v":""},{"$f":"IF('Tex-113,4-E'!$B$6=\"\",\"\",'Tex-113,4-E'!$B$6)","v":"TEX-113-E or Tex-114-E"},{"$f":"IF('Tex-113,4-E'!$B$45=\"\",\"\",'Tex-113,4-E'!$B$45)","v":"Dry Mass Material , (lb):"},{"$f":"IF('Tex-113,4-E'!$E$29=\"\",\"\",'Tex-113,4-E'!$E$29)","v":1}]
[385,{"$f":"IF('Tex-113,4-E'!$F$45=\"\",\"\",'Tex-113,4-E'!$F$45)","v":""},{"$f":"IF('Tex-113,4-E'!$B$6=\"\",\"\",'Tex-113,4-E'!$B$6)","v":"TEX-113-E or Tex-114-E"},{"$f":"IF('Tex-113,4-E'!$B$45=\"\",\"\",'Tex-113,4-E'!$B$45)","v":"Dry Mass Material , (lb):"},{"$f":"IF('Tex-113,4-E'!$F$29=\"\",\"\",'Tex-113,4-E'!$F$29)","v":2}]
[386,{"$f":"IF('Tex-113,4-E'!$G$45=\"\",\"\",'Tex-113,4-E'!$G$45)","v":""},{"$f":"IF('Tex-113,4-E'!$B$6=\"\",\"\",'Tex-113,4-E'!$B$6)","v":"TEX-113-E or Tex-114-E"},{"$f":"IF('Tex-113,4-E'!$B$45=\"\",\"\",'Tex-113,4-E'!$B$45)","v":"Dry Mass Material , (lb):"},{"$f":"IF('Tex-113,4-E'!$G$29=\"\",\"\",'Tex-113,4-E'!$G$29)","v":3}]
[387,{"$f":"IF('Tex-113,4-E'!$H$45=\"\",\"\",'Tex-113,4-E'!$H$45)","v":""},{"$f":"IF('Tex-113,4-E'!$B$6=\"\",\"\",'Tex-113,4-E'!$B$6)","v":"TEX-113-E or Tex-114-E"},{"$f":"IF('Tex-113,4-E'!$B$45=\"\",\"\",'Tex-113,4-E'!$B$45)","v":"Dry Mass Material , (lb):"},{"$f":"IF('Tex-113,4-E'!$H$29=\"\",\"\",'Tex-113,4-E'!$H$29)","v":4}]
[388,{"$f":"IF('Tex-113,4-E'!$E$46=\"\",\"\",'Tex-113,4-E'!$E$46)","v":""},{"$f":"IF('Tex-113,4-E'!$B$6=\"\",\"\",'Tex-113,4-E'!$B$6)","v":"TEX-113-E or Tex-114-E"},{"$f":"IF('Tex-113,4-E'!$B$46=\"\",\"\",'Tex-113,4-E'!$B$46)","v":"Mass Water, (lb):"},{"$f":"IF('Tex-113,4-E'!$E$29=\"\",\"\",'Tex-113,4-E'!$E$29)","v":1}]
[389,{"$f":"IF('Tex-113,4-E'!$F$46=\"\",\"\",'Tex-113,4-E'!$F$46)","v":""},{"$f":"IF('Tex-113,4-E'!$B$6=\"\",\"\",'Tex-113,4-E'!$B$6)","v":"TEX-113-E or Tex-114-E"},{"$f":"IF('Tex-113,4-E'!$B$46=\"\",\"\",'Tex-113,4-E'!$B$46)","v":"Mass Water, (lb):"},{"$f":"IF('Tex-113,4-E'!$F$29=\"\",\"\",'Tex-113,4-E'!$F$29)","v":2}]
[390,{"$f":"IF('Tex-113,4-E'!$G$46=\"\",\"\",'Tex-113,4-E'!$G$46)","v":""},{"$f":"IF('Tex-113,4-E'!$B$6=\"\",\"\",'Tex-113,4-E'!$B$6)","v":"TEX-113-E or Tex-114-E"},{"$f":"IF('Tex-113,4-E'!$B$46=\"\",\"\",'Tex-113,4-E'!$B$46)","v":"Mass Water, (lb):"},{"$f":"IF('Tex-113,4-E'!$G$29=\"\",\"\",'Tex-113,4-E'!$G$29)","v":3}]
[391,{"$f":"IF('Tex-113,4-E'!$H$46=\"\",\"\",'Tex-113,4-E'!$H$46)","v":""},{"$f":"IF('Tex-113,4-E'!$B$6=\"\",\"\",'Tex-113,4-E'!$B$6)","v":"TEX-113-E or Tex-114-E"},{"$f":"IF('Tex-113,4-E'!$B$46=\"\",\"\",'Tex-113,4-E'!$B$46)","v":"Mass Water, (lb):"},{"$f":"IF('Tex-113,4-E'!$H$29=\"\",\"\",'Tex-113,4-E'!$H$29)","v":4}]
[392,{"$f":"IF('Tex-113,4-E'!$E$47=\"\",\"\",'Tex-113,4-E'!$E$47)","v":""},{"$f":"IF('Tex-113,4-E'!$B$6=\"\",\"\",'Tex-113,4-E'!$B$6)","v":"TEX-113-E or Tex-114-E"},{"$f":"IF('Tex-113,4-E'!$B$47=\"\",\"\",'Tex-113,4-E'!$B$47)","v":"Percent Water on Total , (%):"},{"$f":"IF('Tex-113,4-E'!$E$29=\"\",\"\",'Tex-113,4-E'!$E$29)","v":1}]
[393,{"$f":"IF('Tex-113,4-E'!$F$47=\"\",\"\",'Tex-113,4-E'!$F$47)","v":""},{"$f":"IF('Tex-113,4-E'!$B$6=\"\",\"\",'Tex-113,4-E'!$B$6)","v":"TEX-113-E or Tex-114-E"},{"$f":"IF('Tex-113,4-E'!$B$47=\"\",\"\",'Tex-113,4-E'!$B$47)","v":"Percent Water on Total , (%):"},{"$f":"IF('Tex-113,4-E'!$F$29=\"\",\"\",'Tex-113,4-E'!$F$29)","v":2}]
[394,{"$f":"IF('Tex-113,4-E'!$G$47=\"\",\"\",'Tex-113,4-E'!$G$47)","v":""},{"$f":"IF('Tex-113,4-E'!$B$6=\"\",\"\",'Tex-113,4-E'!$B$6)","v":"TEX-113-E or Tex-114-E"},{"$f":"IF('Tex-113,4-E'!$B$47=\"\",\"\",'Tex-113,4-E'!$B$47)","v":"Percent Water on Total , (%):"},{"$f":"IF('Tex-113,4-E'!$G$29=\"\",\"\",'Tex-113,4-E'!$G$29)","v":3}]
[395,{"$f":"IF('Tex-113,4-E'!$H$47=\"\",\"\",'Tex-113,4-E'!$H$47)","v":""},{"$f":"IF('Tex-113,4-E'!$B$6=\"\",\"\",'Tex-113,4-E'!$B$6)","v":"TEX-113-E or Tex-114-E"},{"$f":"IF('Tex-113,4-E'!$B$47=\"\",\"\",'Tex-113,4-E'!$B$47)","v":"Percent Water on Total , (%):"},{"$f":"IF('Tex-113,4-E'!$H$29=\"\",\"\",'Tex-113,4-E'!$H$29)","v":4}]
[396,{"$f":"IF('Tex-113,4-E'!$E$48=\"\",\"\",'Tex-113,4-E'!$E$48)","v":""},{"$f":"IF('Tex-113,4-E'!$B$6=\"\",\"\",'Tex-113,4-E'!$B$6)","v":"TEX-113-E or Tex-114-E"},{"$f":"IF('Tex-113,4-E'!$B$48=\"\",\"\",'Tex-113,4-E'!$B$48)","v":"Dry Density, (pcf):"},{"$f":"IF('Tex-113,4-E'!$E$29=\"\",\"\",'Tex-113,4-E'!$E$29)","v":1}]
[397,{"$f":"IF('Tex-113,4-E'!$F$48=\"\",\"\",'Tex-113,4-E'!$F$48)","v":""},{"$f":"IF('Tex-113,4-E'!$B$6=\"\",\"\",'Tex-113,4-E'!$B$6)","v":"TEX-113-E or Tex-114-E"},{"$f":"IF('Tex-113,4-E'!$B$48=\"\",\"\",'Tex-113,4-E'!$B$48)","v":"Dry Density, (pcf):"},{"$f":"IF('Tex-113,4-E'!$F$29=\"\",\"\",'Tex-113,4-E'!$F$29)","v":2}]
[398,{"$f":"IF('Tex-113,4-E'!$G$48=\"\",\"\",'Tex-113,4-E'!$G$48)","v":""},{"$f":"IF('Tex-113,4-E'!$B$6=\"\",\"\",'Tex-113,4-E'!$B$6)","v":"TEX-113-E or Tex-114-E"},{"$f":"IF('Tex-113,4-E'!$B$48=\"\",\"\",'Tex-113,4-E'!$B$48)","v":"Dry Density, (pcf):"},{"$f":"IF('Tex-113,4-E'!$G$29=\"\",\"\",'Tex-113,4-E'!$G$29)","v":3}]
[399,{"$f":"IF('Tex-113,4-E'!$H$48=\"\",\"\",'Tex-113,4-E'!$H$48)","v":""},{"$f":"IF('Tex-113,4-E'!$B$6=\"\",\"\",'Tex-113,4-E'!$B$6)","v":"TEX-113-E or Tex-114-E"},{"$f":"IF('Tex-113,4-E'!$B$48=\"\",\"\",'Tex-113,4-E'!$B$48)","v":"Dry Density, (pcf):"},{"$f":"IF('Tex-113,4-E'!$H$29=\"\",\"\",'Tex-113,4-E'!$H$29)","v":4}]
[400,{"$f":"IF('Tex-113,4-E'!$E$49=\"\",\"\",'Tex-113,4-E'!$E$49)","v":""},{"$f":"IF('Tex-113,4-E'!$B$6=\"\",\"\",'Tex-113,4-E'!$B$6)","v":"TEX-113-E or Tex-114-E"},{"$f":"IF('Tex-113,4-E'!$B$49=\"\",\"\",'Tex-113,4-E'!$B$49)","v":"Estimated Dry Density, (pcf):"},{"$f":"IF('Tex-113,4-E'!$E$29=\"\",\"\",'Tex-113,4-E'!$E$29)","v":1}]
[401,{"$f":"IF('Tex-113,4-E'!$F$49=\"\",\"\",'Tex-113,4-E'!$F$49)","v":""},{"$f":"IF('Tex-113,4-E'!$B$6=\"\",\"\",'Tex-113,4-E'!$B$6)","v":"TEX-113-E or Tex-114-E"},{"$f":"IF('Tex-113,4-E'!$B$49=\"\",\"\",'Tex-113,4-E'!$B$49)","v":"Estimated Dry Density, (pcf):"},{"$f":"IF('Tex-113,4-E'!$F$29=\"\",\"\",'Tex-113,4-E'!$F$29)","v":2}]
[402,{"$f":"IF('Tex-113,4-E'!$G$49=\"\",\"\",'Tex-113,4-E'!$G$49)","v":""},{"$f":"IF('Tex-113,4-E'!$B$6=\"\",\"\",'Tex-113,4-E'!$B$6)","v":"TEX-113-E or Tex-114-E"},{"$f":"IF('Tex-113,4-E'!$B$49=\"\",\"\",'Tex-113,4-E'!$B$49)","v":"Estimated Dry Density, (pcf):"},{"$f":"IF('Tex-113,4-E'!$G$29=\"\",\"\",'Tex-113,4-E'!$G$29)","v":3}]
[403,{"$f":"IF('Tex-113,4-E'!$H$49=\"\",\"\",'Tex-113,4-E'!$H$49)","v":""},{"$f":"IF('Tex-113,4-E'!$B$6=\"\",\"\",'Tex-113,4-E'!$B$6)","v":"TEX-113-E or Tex-114-E"},{"$f":"IF('Tex-113,4-E'!$B$49=\"\",\"\",'Tex-113,4-E'!$B$49)","v":"Estimated Dry Density, (pcf):"},{"$f":"IF('Tex-113,4-E'!$H$29=\"\",\"\",'Tex-113,4-E'!$H$29)","v":4}]
[404,{"$f":"IF('Tex-113,4-E'!$E$50=\"\",\"\",'Tex-113,4-E'!$E$50)","v":""},{"$f":"IF('Tex-113,4-E'!$B$6=\"\",\"\",'Tex-113,4-E'!$B$6)","v":"TEX-113-E or Tex-114-E"},{"$f":"IF('Tex-113,4-E'!$B$50=\"\",\"\",'Tex-113,4-E'!$B$50)","v":"Max Density, (pcf):"}]
[405,{"$f":"IF('Tex-113,4-E'!$E$51=\"\",\"\",'Tex-113,4-E'!$E$51)","v":""},{"$f":"IF('Tex-113,4-E'!$B$6=\"\",\"\",'Tex-113,4-E'!$B$6)","v":"TEX-113-E or Tex-114-E"},{"$f":"IF('Tex-113,4-E'!$B$51=\"\",\"\",'Tex-113,4-E'!$B$51)","v":"Max Density, (kg/m3):"}]
[406,{"$f":"IF('Tex-113,4-E'!$E$52=\"\",\"\",'Tex-113,4-E'!$E$52)","v":""},{"$f":"IF('Tex-113,4-E'!$B$6=\"\",\"\",'Tex-113,4-E'!$B$6)","v":"TEX-113-E or Tex-114-E"},{"$f":"IF('Tex-113,4-E'!$B$52=\"\",\"\",'Tex-113,4-E'!$B$52)","v":"Optimum Moisture, (%):"}]
[407,{"$f":"IF('Optimum Moisture'!$G$23=\"\",\"\",'Optimum Moisture'!$G$23)","v":""},{"$f":"IF('Optimum Moisture'!$B$6=\"\",\"\",'Optimum Moisture'!$B$6)","v":"Tex-120-E : PART II"},{"$f":"IF('Optimum Moisture'!$B$23=\"\",\"\",'Optimum Moisture'!$B$23)","v":"Specific Gravity="}]
[408,{"$f":"IF('Optimum Moisture'!$G$24=\"\",\"\",'Optimum Moisture'!$G$24)","v":""},{"$f":"IF('Optimum Moisture'!$B$6=\"\",\"\",'Optimum Moisture'!$B$6)","v":"Tex-120-E : PART II"},{"$f":"IF('Optimum Moisture'!$B$24=\"\",\"\",'Optimum Moisture'!$B$24)","v":"Hygroscopic Moisture, (%):"}]
[409,{"$f":"IF('Optimum Moisture'!$G$27=\"\",\"\",'Optimum Moisture'!$G$27)","v":""},{"$f":"IF('Optimum Moisture'!$B$6=\"\",\"\",'Optimum Moisture'!$B$6)","v":"Tex-120-E : PART II"},{"$f":"IF('Optimum Moisture'!$B$27=\"\",\"\",'Optimum Moisture'!$B$27)","v":"Percent Cement, (%)"},{"$f":"IF('Optimum Moisture'!$G$26=\"\",\"\",'Optimum Moisture'!$G$26)","v":1}]
[410,{"$f":"IF('Optimum Moisture'!$J$27=\"\",\"\",'Optimum Moisture'!$J$27)","v":""},{"$f":"IF('Optimum Moisture'!$B$6=\"\",\"\",'Optimum Moisture'!$B$6)","v":"Tex-120-E : PART II"},{"$f":"IF('Optimum Moisture'!$B$27=\"\",\"\",'Optimum Moisture'!$B$27)","v":"Percent Cement, (%)"},{"$f":"IF('Optimum Moisture'!$J$26=\"\",\"\",'Optimum Moisture'!$J$26)","v":2}]
[411,{"$f":"IF('Optimum Moisture'!$M$27=\"\",\"\",'Optimum Moisture'!$M$27)","v":""},{"$f":"IF('Optimum Moisture'!$B$6=\"\",\"\",'Optimum Moisture'!$B$6)","v":"Tex-120-E : PART II"},{"$f":"IF('Optimum Moisture'!$B$27=\"\",\"\",'Optimum Moisture'!$B$27)","v":"Percent Cement, (%)"},{"$f":"IF('Optimum Moisture'!$M$26=\"\",\"\",'Optimum Moisture'!$M$26)","v":3}]
[412,{"$f":"IF('Optimum Moisture'!$P$27=\"\",\"\",'Optimum Moisture'!$P$27)","v":""},{"$f":"IF('Optimum Moisture'!$B$6=\"\",\"\",'Optimum Moisture'!$B$6)","v":"Tex-120-E : PART II"},{"$f":"IF('Optimum Moisture'!$B$27=\"\",\"\",'Optimum Moisture'!$B$27)","v":"Percent Cement, (%)"},{"$f":"IF('Optimum Moisture'!$P$26=\"\",\"\",'Optimum Moisture'!$P$26)","v":4}]
[413,{"$f":"IF('Optimum Moisture'!$G$29=\"\",\"\",'Optimum Moisture'!$G$29)","v":""},{"$f":"IF('Optimum Moisture'!$B$6=\"\",\"\",'Optimum Moisture'!$B$6)","v":"Tex-120-E : PART II"},{"$f":"IF('Optimum Moisture'!$B$29=\"\",\"\",'Optimum Moisture'!$B$29)","v":"Percent Water Content, (%):"},{"$f":"IF('Optimum Moisture'!$G$26=\"\",\"\",'Optimum Moisture'!$G$26)","v":1},{"$f":"IF('Optimum Moisture'!$G$28=\"\",\"\",'Optimum Moisture'!$G$28)","v":"1-1"}]
[414,{"$f":"IF('Optimum Moisture'!$H$29=\"\",\"\",'Optimum Moisture'!$H$29)","v":""},{"$f":"IF('Optimum Moisture'!$B$6=\"\",\"\",'Optimum Moisture'!$B$6)","v":"Tex-120-E : PART II"},{"$f":"IF('Optimum Moisture'!$B$29=\"\",\"\",'Optimum Moisture'!$B$29)","v":"Percent Water Content, (%):"},{"$f":"IF('Optimum Moisture'!$G$26=\"\",\"\",'Optimum Moisture'!$G$26)","v":1},{"$f":"IF('Optimum Moisture'!$H$28=\"\",\"\",'Optimum Moisture'!$H$28)","v":"1-2"}]
[415,{"$f":"IF('Optimum Moisture'!$I$29=\"\",\"\",'Optimum Moisture'!$I$29)","v":""},{"$f":"IF('Optimum Moisture'!$B$6=\"\",\"\",'Optimum Moisture'!$B$6)","v":"Tex-120-E : PART II"},{"$f":"IF('Optimum Moisture'!$B$29=\"\",\"\",'Optimum Moisture'!$B$29)","v":"Percent Water Content, (%):"},{"$f":"IF('Optimum Moisture'!$G$26=\"\",\"\",'Optimum Moisture'!$G$26)","v":1},{"$f":"IF('Optimum Moisture'!$I$28=\"\",\"\",'Optimum Moisture'!$I$28)","v":"1-3"}]
[416,{"$f":"IF('Optimum Moisture'!$J$29=\"\",\"\",'Optimum Moisture'!$J$29)","v":""},{"$f":"IF('Optimum Moisture'!$B$6=\"\",\"\",'Optimum Moisture'!$B$6)","v":"Tex-120-E : PART II"},{"$f":"IF('Optimum Moisture'!$B$29=\"\",\"\",'Optimum Moisture'!$B$29)","v":"Percent Water Content, (%):"},{"$f":"IF('Optimum Moisture'!$J$26=\"\",\"\",'Optimum Moisture'!$J$26)","v":2},{"$f":"IF('Optimum Moisture'!$J$28=\"\",\"\",'Optimum Moisture'!$J$28)","v":"2-1"}]
[417,{"$f":"IF('Optimum Moisture'!$K$29=\"\",\"\",'Optimum Moisture'!$K$29)","v":""},{"$f":"IF('Optimum Moisture'!$B$6=\"\",\"\",'Optimum Moisture'!$B$6)","v":"Tex-120-E : PART II"},{"$f":"IF('Optimum Moisture'!$B$29=\"\",\"\",'Optimum Moisture'!$B$29)","v":"Percent Water Content, (%):"},{"$f":"IF('Optimum Moisture'!$J$26=\"\",\"\",'Optimum Moisture'!$J$26)","v":2},{"$f":"IF('Optimum Moisture'!$K$28=\"\",\"\",'Optimum Moisture'!$K$28)","v":"2-2"}]
[418,{"$f":"IF('Optimum Moisture'!$L$29=\"\",\"\",'Optimum Moisture'!$L$29)","v":""},{"$f":"IF('Optimum Moisture'!$B$6=\"\",\"\",'Optimum Moisture'!$B$6)","v":"Tex-120-E : PART II"},{"$f":"IF('Optimum Moisture'!$B$29=\"\",\"\",'Optimum Moisture'!$B$29)","v":"Percent Water Content, (%):"},{"$f":"IF('Optimum Moisture'!$J$26=\"\",\"\",'Optimum Moisture'!$J$26)","v":2},{"$f":"IF('Optimum Moisture'!$L$28=\"\",\"\",'Optimum Moisture'!$L$28)","v":"2-3"}]
[419,{"$f":"IF('Optimum Moisture'!$M$29=\"\",\"\",'Optimum Moisture'!$M$29)","v":""},{"$f":"IF('Optimum Moisture'!$B$6=\"\",\"\",'Optimum Moisture'!$B$6)","v":"Tex-120-E : PART II"},{"$f":"IF('Optimum Moisture'!$B$29=\"\",\"\",'Optimum Moisture'!$B$29)","v":"Percent Water Content, (%):"},{"$f":"IF('Optimum Moisture'!$M$26=\"\",\"\",'Optimum Moisture'!$M$26)","v":3},{"$f":"IF('Optimum Moisture'!$M$28=\"\",\"\",'Optimum Moisture'!$M$28)","v":"3-1"}]
[420,{"$f":"IF('Optimum Moisture'!$N$29=\"\",\"\",'Optimum Moisture'!$N$29)","v":""},{"$f":"IF('Optimum Moisture'!$B$6=\"\",\"\",'Optimum Moisture'!$B$6)","v":"Tex-120-E : PART II"},{"$f":"IF('Optimum Moisture'!$B$29=\"\",\"\",'Optimum Moisture'!$B$29)","v":"Percent Water Content, (%):"},{"$f":"IF('Optimum Moisture'!$M$26=\"\",\"\",'Optimum Moisture'!$M$26)","v":3},{"$f":"IF('Optimum Moisture'!$N$28=\"\",\"\",'Optimum Moisture'!$N$28)","v":"3-2"}]
[421,{"$f":"IF('Optimum Moisture'!$O$29=\"\",\"\",'Optimum Moisture'!$O$29)","v":""},{"$f":"IF('Optimum Moisture'!$B$6=\"\",\"\",'Optimum Moisture'!$B$6)","v":"Tex-120-E : PART II"},{"$f":"IF('Optimum Moisture'!$B$29=\"\",\"\",'Optimum Moisture'!$B$29)","v":"Percent Water Content, (%):"},{"$f":"IF('Optimum Moisture'!$M$26=\"\",\"\",'Optimum Moisture'!$M$26)","v":3},{"$f":"IF('Optimum Moisture'!$O$28=\"\",\"\",'Optimum Moisture'!$O$28)","v":"3-3"}]
[422,{"$f":"IF('Optimum Moisture'!$P$29=\"\",\"\",'Optimum Moisture'!$P$29)","v":""},{"$f":"IF('Optimum Moisture'!$B$6=\"\",\"\",'Optimum Moisture'!$B$6)","v":"Tex-120-E : PART II"},{"$f":"IF('Optimum Moisture'!$B$29=\"\",\"\",'Optimum Moisture'!$B$29)","v":"Percent Water Content, (%):"},{"$f":"IF('Optimum Moisture'!$P$26=\"\",\"\",'Optimum Moisture'!$P$26)","v":4},{"$f":"IF('Optimum Moisture'!$P$28=\"\",\"\",'Optimum Moisture'!$P$28)","v":"4-1"}]
[423,{"$f":"IF('Optimum Moisture'!$Q$29=\"\",\"\",'Optimum Moisture'!$Q$29)","v":""},{"$f":"IF('Optimum Moisture'!$B$6=\"\",\"\",'Optimum Moisture'!$B$6)","v":"Tex-120-E : PART II"},{"$f":"IF('Optimum Moisture'!$B$29=\"\",\"\",'Optimum Moisture'!$B$29)","v":"Percent Water Content, (%):"},{"$f":"IF('Optimum Moisture'!$P$26=\"\",\"\",'Optimum Moisture'!$P$26)","v":4},{"$f":"IF('Optimum Moisture'!$Q$28=\"\",\"\",'Optimum Moisture'!$Q$28)","v":"4-2"}]
[424,{"$f":"IF('Optimum Moisture'!$R$29=\"\",\"\",'Optimum Moisture'!$R$29)","v":""},{"$f":"IF('Optimum Moisture'!$B$6=\"\",\"\",'Optimum Moisture'!$B$6)","v":"Tex-120-E : PART II"},{"$f":"IF('Optimum Moisture'!$B$29=\"\",\"\",'Optimum Moisture'!$B$29)","v":"Percent Water Content, (%):"},{"$f":"IF('Optimum Moisture'!$P$26=\"\",\"\",'Optimum Moisture'!$P$26)","v":4},{"$f":"IF('Optimum Moisture'!$R$28=\"\",\"\",'Optimum Moisture'!$R$28)","v":"4-3"}]
[425,{"$f":"IF('Optimum Moisture'!$G$30=\"\",\"\",'Optimum Moisture'!$G$30)","v":""},{"$f":"IF('Optimum Moisture'!$B$6=\"\",\"\",'Optimum Moisture'!$B$6)","v":"Tex-120-E : PART II"},{"$f":"IF('Optimum Moisture'!$B$30=\"\",\"\",'Optimum Moisture'!$B$30)","v":"Mass Material, lbs."},{"$f":"IF('Optimum Moisture'!$G$26=\"\",\"\",'Optimum Moisture'!$G$26)","v":1},{"$f":"IF('Optimum Moisture'!$G$28=\"\",\"\",'Optimum Moisture'!$G$28)","v":"1-1"}]
[426,{"$f":"IF('Optimum Moisture'!$H$30=\"\",\"\",'Optimum Moisture'!$H$30)","v":""},{"$f":"IF('Optimum Moisture'!$B$6=\"\",\"\",'Optimum Moisture'!$B$6)","v":"Tex-120-E : PART II"},{"$f":"IF('Optimum Moisture'!$B$30=\"\",\"\",'Optimum Moisture'!$B$30)","v":"Mass Material, lbs."},{"$f":"IF('Optimum Moisture'!$G$26=\"\",\"\",'Optimum Moisture'!$G$26)","v":1},{"$f":"IF('Optimum Moisture'!$H$28=\"\",\"\",'Optimum Moisture'!$H$28)","v":"1-2"}]
[427,{"$f":"IF('Optimum Moisture'!$I$30=\"\",\"\",'Optimum Moisture'!$I$30)","v":""},{"$f":"IF('Optimum Moisture'!$B$6=\"\",\"\",'Optimum Moisture'!$B$6)","v":"Tex-120-E : PART II"},{"$f":"IF('Optimum Moisture'!$B$30=\"\",\"\",'Optimum Moisture'!$B$30)","v":"Mass Material, lbs."},{"$f":"IF('Optimum Moisture'!$G$26=\"\",\"\",'Optimum Moisture'!$G$26)","v":1},{"$f":"IF('Optimum Moisture'!$I$28=\"\",\"\",'Optimum Moisture'!$I$28)","v":"1-3"}]
[428,{"$f":"IF('Optimum Moisture'!$J$30=\"\",\"\",'Optimum Moisture'!$J$30)","v":""},{"$f":"IF('Optimum Moisture'!$B$6=\"\",\"\",'Optimum Moisture'!$B$6)","v":"Tex-120-E : PART II"},{"$f":"IF('Optimum Moisture'!$B$30=\"\",\"\",'Optimum Moisture'!$B$30)","v":"Mass Material, lbs."},{"$f":"IF('Optimum Moisture'!$J$26=\"\",\"\",'Optimum Moisture'!$J$26)","v":2},{"$f":"IF('Optimum Moisture'!$J$28=\"\",\"\",'Optimum Moisture'!$J$28)","v":"2-1"}]
[429,{"$f":"IF('Optimum Moisture'!$K$30=\"\",\"\",'Optimum Moisture'!$K$30)","v":""},{"$f":"IF('Optimum Moisture'!$B$6=\"\",\"\",'Optimum Moisture'!$B$6)","v":"Tex-120-E : PART II"},{"$f":"IF('Optimum Moisture'!$B$30=\"\",\"\",'Optimum Moisture'!$B$30)","v":"Mass Material, lbs."},{"$f":"IF('Optimum Moisture'!$J$26=\"\",\"\",'Optimum Moisture'!$J$26)","v":2},{"$f":"IF('Optimum Moisture'!$K$28=\"\",\"\",'Optimum Moisture'!$K$28)","v":"2-2"}]
[430,{"$f":"IF('Optimum Moisture'!$L$30=\"\",\"\",'Optimum Moisture'!$L$30)","v":""},{"$f":"IF('Optimum Moisture'!$B$6=\"\",\"\",'Optimum Moisture'!$B$6)","v":"Tex-120-E : PART II"},{"$f":"IF('Optimum Moisture'!$B$30=\"\",\"\",'Optimum Moisture'!$B$30)","v":"Mass Material, lbs."},{"$f":"IF('Optimum Moisture'!$J$26=\"\",\"\",'Optimum Moisture'!$J$26)","v":2},{"$f":"IF('Optimum Moisture'!$L$28=\"\",\"\",'Optimum Moisture'!$L$28)","v":"2-3"}]
[431,{"$f":"IF('Optimum Moisture'!$M$30=\"\",\"\",'Optimum Moisture'!$M$30)","v":""},{"$f":"IF('Optimum Moisture'!$B$6=\"\",\"\",'Optimum Moisture'!$B$6)","v":"Tex-120-E : PART II"},{"$f":"IF('Optimum Moisture'!$B$30=\"\",\"\",'Optimum Moisture'!$B$30)","v":"Mass Material, lbs."},{"$f":"IF('Optimum Moisture'!$M$26=\"\",\"\",'Optimum Moisture'!$M$26)","v":3},{"$f":"IF('Optimum Moisture'!$M$28=\"\",\"\",'Optimum Moisture'!$M$28)","v":"3-1"}]
[432,{"$f":"IF('Optimum Moisture'!$N$30=\"\",\"\",'Optimum Moisture'!$N$30)","v":""},{"$f":"IF('Optimum Moisture'!$B$6=\"\",\"\",'Optimum Moisture'!$B$6)","v":"Tex-120-E : PART II"},{"$f":"IF('Optimum Moisture'!$B$30=\"\",\"\",'Optimum Moisture'!$B$30)","v":"Mass Material, lbs."},{"$f":"IF('Optimum Moisture'!$M$26=\"\",\"\",'Optimum Moisture'!$M$26)","v":3},{"$f":"IF('Optimum Moisture'!$N$28=\"\",\"\",'Optimum Moisture'!$N$28)","v":"3-2"}]
[433,{"$f":"IF('Optimum Moisture'!$O$30=\"\",\"\",'Optimum Moisture'!$O$30)","v":""},{"$f":"IF('Optimum Moisture'!$B$6=\"\",\"\",'Optimum Moisture'!$B$6)","v":"Tex-120-E : PART II"},{"$f":"IF('Optimum Moisture'!$B$30=\"\",\"\",'Optimum Moisture'!$B$30)","v":"Mass Material, lbs."},{"$f":"IF('Optimum Moisture'!$M$26=\"\",\"\",'Optimum Moisture'!$M$26)","v":3},{"$f":"IF('Optimum Moisture'!$O$28=\"\",\"\",'Optimum Moisture'!$O$28)","v":"3-3"}]
[434,{"$f":"IF('Optimum Moisture'!$P$30=\"\",\"\",'Optimum Moisture'!$P$30)","v":""},{"$f":"IF('Optimum Moisture'!$B$6=\"\",\"\",'Optimum Moisture'!$B$6)","v":"Tex-120-E : PART II"},{"$f":"IF('Optimum Moisture'!$B$30=\"\",\"\",'Optimum Moisture'!$B$30)","v":"Mass Material, lbs."},{"$f":"IF('Optimum Moisture'!$P$26=\"\",\"\",'Optimum Moisture'!$P$26)","v":4},{"$f":"IF('Optimum Moisture'!$P$28=\"\",\"\",'Optimum Moisture'!$P$28)","v":"4-1"}]
[435,{"$f":"IF('Optimum Moisture'!$Q$30=\"\",\"\",'Optimum Moisture'!$Q$30)","v":""},{"$f":"IF('Optimum Moisture'!$B$6=\"\",\"\",'Optimum Moisture'!$B$6)","v":"Tex-120-E : PART II"},{"$f":"IF('Optimum Moisture'!$B$30=\"\",\"\",'Optimum Moisture'!$B$30)","v":"Mass Material, lbs."},{"$f":"IF('Optimum Moisture'!$P$26=\"\",\"\",'Optimum Moisture'!$P$26)","v":4},{"$f":"IF('Optimum Moisture'!$Q$28=\"\",\"\",'Optimum Moisture'!$Q$28)","v":"4-2"}]
[436,{"$f":"IF('Optimum Moisture'!$R$30=\"\",\"\",'Optimum Moisture'!$R$30)","v":""},{"$f":"IF('Optimum Moisture'!$B$6=\"\",\"\",'Optimum Moisture'!$B$6)","v":"Tex-120-E : PART II"},{"$f":"IF('Optimum Moisture'!$B$30=\"\",\"\",'Optimum Moisture'!$B$30)","v":"Mass Material, lbs."},{"$f":"IF('Optimum Moisture'!$P$26=\"\",\"\",'Optimum Moisture'!$P$26)","v":4},{"$f":"IF('Optimum Moisture'!$R$28=\"\",\"\",'Optimum Moisture'!$R$28)","v":"4-3"}]
[437,{"$f":"IF('Optimum Moisture'!$G$31=\"\",\"\",'Optimum Moisture'!$G$31)","v":""},{"$f":"IF('Optimum Moisture'!$B$6=\"\",\"\",'Optimum Moisture'!$B$6)","v":"Tex-120-E : PART II"},{"$f":"IF('Optimum Moisture'!$B$31=\"\",\"\",'Optimum Moisture'!$B$31)","v":"Mass Water Added, lbs."},{"$f":"IF('Optimum Moisture'!$G$26=\"\",\"\",'Optimum Moisture'!$G$26)","v":1},{"$f":"IF('Optimum Moisture'!$G$28=\"\",\"\",'Optimum Moisture'!$G$28)","v":"1-1"}]
[438,{"$f":"IF('Optimum Moisture'!$H$31=\"\",\"\",'Optimum Moisture'!$H$31)","v":""},{"$f":"IF('Optimum Moisture'!$B$6=\"\",\"\",'Optimum Moisture'!$B$6)","v":"Tex-120-E : PART II"},{"$f":"IF('Optimum Moisture'!$B$31=\"\",\"\",'Optimum Moisture'!$B$31)","v":"Mass Water Added, lbs."},{"$f":"IF('Optimum Moisture'!$G$26=\"\",\"\",'Optimum Moisture'!$G$26)","v":1},{"$f":"IF('Optimum Moisture'!$H$28=\"\",\"\",'Optimum Moisture'!$H$28)","v":"1-2"}]
[439,{"$f":"IF('Optimum Moisture'!$I$31=\"\",\"\",'Optimum Moisture'!$I$31)","v":""},{"$f":"IF('Optimum Moisture'!$B$6=\"\",\"\",'Optimum Moisture'!$B$6)","v":"Tex-120-E : PART II"},{"$f":"IF('Optimum Moisture'!$B$31=\"\",\"\",'Optimum Moisture'!$B$31)","v":"Mass Water Added, lbs."},{"$f":"IF('Optimum Moisture'!$G$26=\"\",\"\",'Optimum Moisture'!$G$26)","v":1},{"$f":"IF('Optimum Moisture'!$I$28=\"\",\"\",'Optimum Moisture'!$I$28)","v":"1-3"}]
[440,{"$f":"IF('Optimum Moisture'!$J$31=\"\",\"\",'Optimum Moisture'!$J$31)","v":""},{"$f":"IF('Optimum Moisture'!$B$6=\"\",\"\",'Optimum Moisture'!$B$6)","v":"Tex-120-E : PART II"},{"$f":"IF('Optimum Moisture'!$B$31=\"\",\"\",'Optimum Moisture'!$B$31)","v":"Mass Water Added, lbs."},{"$f":"IF('Optimum Moisture'!$J$26=\"\",\"\",'Optimum Moisture'!$J$26)","v":2},{"$f":"IF('Optimum Moisture'!$J$28=\"\",\"\",'Optimum Moisture'!$J$28)","v":"2-1"}]
[441,{"$f":"IF('Optimum Moisture'!$K$31=\"\",\"\",'Optimum Moisture'!$K$31)","v":""},{"$f":"IF('Optimum Moisture'!$B$6=\"\",\"\",'Optimum Moisture'!$B$6)","v":"Tex-120-E : PART II"},{"$f":"IF('Optimum Moisture'!$B$31=\"\",\"\",'Optimum Moisture'!$B$31)","v":"Mass Water Added, lbs."},{"$f":"IF('Optimum Moisture'!$J$26=\"\",\"\",'Optimum Moisture'!$J$26)","v":2},{"$f":"IF('Optimum Moisture'!$K$28=\"\",\"\",'Optimum Moisture'!$K$28)","v":"2-2"}]
[442,{"$f":"IF('Optimum Moisture'!$L$31=\"\",\"\",'Optimum Moisture'!$L$31)","v":""},{"$f":"IF('Optimum Moisture'!$B$6=\"\",\"\",'Optimum Moisture'!$B$6)","v":"Tex-120-E : PART II"},{"$f":"IF('Optimum Moisture'!$B$31=\"\",\"\",'Optimum Moisture'!$B$31)","v":"Mass Water Added, lbs."},{"$f":"IF('Optimum Moisture'!$J$26=\"\",\"\",'Optimum Moisture'!$J$26)","v":2},{"$f":"IF('Optimum Moisture'!$L$28=\"\",\"\",'Optimum Moisture'!$L$28)","v":"2-3"}]
[443,{"$f":"IF('Optimum Moisture'!$M$31=\"\",\"\",'Optimum Moisture'!$M$31)","v":""},{"$f":"IF('Optimum Moisture'!$B$6=\"\",\"\",'Optimum Moisture'!$B$6)","v":"Tex-120-E : PART II"},{"$f":"IF('Optimum Moisture'!$B$31=\"\",\"\",'Optimum Moisture'!$B$31)","v":"Mass Water Added, lbs."},{"$f":"IF('Optimum Moisture'!$M$26=\"\",\"\",'Optimum Moisture'!$M$26)","v":3},{"$f":"IF('Optimum Moisture'!$M$28=\"\",\"\",'Optimum Moisture'!$M$28)","v":"3-1"}]
[444,{"$f":"IF('Optimum Moisture'!$N$31=\"\",\"\",'Optimum Moisture'!$N$31)","v":""},{"$f":"IF('Optimum Moisture'!$B$6=\"\",\"\",'Optimum Moisture'!$B$6)","v":"Tex-120-E : PART II"},{"$f":"IF('Optimum Moisture'!$B$31=\"\",\"\",'Optimum Moisture'!$B$31)","v":"Mass Water Added, lbs."},{"$f":"IF('Optimum Moisture'!$M$26=\"\",\"\",'Optimum Moisture'!$M$26)","v":3},{"$f":"IF('Optimum Moisture'!$N$28=\"\",\"\",'Optimum Moisture'!$N$28)","v":"3-2"}]
[445,{"$f":"IF('Optimum Moisture'!$O$31=\"\",\"\",'Optimum Moisture'!$O$31)","v":""},{"$f":"IF('Optimum Moisture'!$B$6=\"\",\"\",'Optimum Moisture'!$B$6)","v":"Tex-120-E : PART II"},{"$f":"IF('Optimum Moisture'!$B$31=\"\",\"\",'Optimum Moisture'!$B$31)","v":"Mass Water Added, lbs."},{"$f":"IF('Optimum Moisture'!$M$26=\"\",\"\",'Optimum Moisture'!$M$26)","v":3},{"$f":"IF('Optimum Moisture'!$O$28=\"\",\"\",'Optimum Moisture'!$O$28)","v":"3-3"}]
[446,{"$f":"IF('Optimum Moisture'!$P$31=\"\",\"\",'Optimum Moisture'!$P$31)","v":""},{"$f":"IF('Optimum Moisture'!$B$6=\"\",\"\",'Optimum Moisture'!$B$6)","v":"Tex-120-E : PART II"},{"$f":"IF('Optimum Moisture'!$B$31=\"\",\"\",'Optimum Moisture'!$B$31)","v":"Mass Water Added, lbs."},{"$f":"IF('Optimum Moisture'!$P$26=\"\",\"\",'Optimum Moisture'!$P$26)","v":4},{"$f":"IF('Optimum Moisture'!$P$28=\"\",\"\",'Optimum Moisture'!$P$28)","v":"4-1"}]
[447,{"$f":"IF('Optimum Moisture'!$Q$31=\"\",\"\",'Optimum Moisture'!$Q$31)","v":""},{"$f":"IF('Optimum Moisture'!$B$6=\"\",\"\",'Optimum Moisture'!$B$6)","v":"Tex-120-E : PART II"},{"$f":"IF('Optimum Moisture'!$B$31=\"\",\"\",'Optimum Moisture'!$B$31)","v":"Mass Water Added, lbs."},{"$f":"IF('Optimum Moisture'!$P$26=\"\",\"\",'Optimum Moisture'!$P$26)","v":4},{"$f":"IF('Optimum Moisture'!$Q$28=\"\",\"\",'Optimum Moisture'!$Q$28)","v":"4-2"}]
[448,{"$f":"IF('Optimum Moisture'!$R$31=\"\",\"\",'Optimum Moisture'!$R$31)","v":""},{"$f":"IF('Optimum Moisture'!$B$6=\"\",\"\",'Optimum Moisture'!$B$6)","v":"Tex-120-E : PART II"},{"$f":"IF('Optimum Moisture'!$B$31=\"\",\"\",'Optimum Moisture'!$B$31)","v":"Mass Water Added, lbs."},{"$f":"IF('Optimum Moisture'!$P$26=\"\",\"\",'Optimum Moisture'!$P$26)","v":4},{"$f":"IF('Optimum Moisture'!$R$28=\"\",\"\",'Optimum Moisture'!$R$28)","v":"4-3"}]
[449,{"$f":"IF('Optimum Moisture'!$G$32=\"\",\"\",'Optimum Moisture'!$G$32)","v":""},{"$f":"IF('Optimum Moisture'!$B$6=\"\",\"\",'Optimum Moisture'!$B$6)","v":"Tex-120-E : PART II"},{"$f":"IF('Optimum Moisture'!$B$32=\"\",\"\",'Optimum Moisture'!$B$32)","v":"Mass Cement Added, lbs."},{"$f":"IF('Optimum Moisture'!$G$26=\"\",\"\",'Optimum Moisture'!$G$26)","v":1},{"$f":"IF('Optimum Moisture'!$G$28=\"\",\"\",'Optimum Moisture'!$G$28)","v":"1-1"}]
[450,{"$f":"IF('Optimum Moisture'!$H$32=\"\",\"\",'Optimum Moisture'!$H$32)","v":""},{"$f":"IF('Optimum Moisture'!$B$6=\"\",\"\",'Optimum Moisture'!$B$6)","v":"Tex-120-E : PART II"},{"$f":"IF('Optimum Moisture'!$B$32=\"\",\"\",'Optimum Moisture'!$B$32)","v":"Mass Cement Added, lbs."},{"$f":"IF('Optimum Moisture'!$G$26=\"\",\"\",'Optimum Moisture'!$G$26)","v":1},{"$f":"IF('Optimum Moisture'!$H$28=\"\",\"\",'Optimum Moisture'!$H$28)","v":"1-2"}]
[451,{"$f":"IF('Optimum Moisture'!$I$32=\"\",\"\",'Optimum Moisture'!$I$32)","v":""},{"$f":"IF('Optimum Moisture'!$B$6=\"\",\"\",'Optimum Moisture'!$B$6)","v":"Tex-120-E : PART II"},{"$f":"IF('Optimum Moisture'!$B$32=\"\",\"\",'Optimum Moisture'!$B$32)","v":"Mass Cement Added, lbs."},{"$f":"IF('Optimum Moisture'!$G$26=\"\",\"\",'Optimum Moisture'!$G$26)","v":1},{"$f":"IF('Optimum Moisture'!$I$28=\"\",\"\",'Optimum Moisture'!$I$28)","v":"1-3"}]
[452,{"$f":"IF('Optimum Moisture'!$J$32=\"\",\"\",'Optimum Moisture'!$J$32)","v":""},{"$f":"IF('Optimum Moisture'!$B$6=\"\",\"\",'Optimum Moisture'!$B$6)","v":"Tex-120-E : PART II"},{"$f":"IF('Optimum Moisture'!$B$32=\"\",\"\",'Optimum Moisture'!$B$32)","v":"Mass Cement Added, lbs."},{"$f":"IF('Optimum Moisture'!$J$26=\"\",\"\",'Optimum Moisture'!$J$26)","v":2},{"$f":"IF('Optimum Moisture'!$J$28=\"\",\"\",'Optimum Moisture'!$J$28)","v":"2-1"}]
[453,{"$f":"IF('Optimum Moisture'!$K$32=\"\",\"\",'Optimum Moisture'!$K$32)","v":""},{"$f":"IF('Optimum Moisture'!$B$6=\"\",\"\",'Optimum Moisture'!$B$6)","v":"Tex-120-E : PART II"},{"$f":"IF('Optimum Moisture'!$B$32=\"\",\"\",'Optimum Moisture'!$B$32)","v":"Mass Cement Added, lbs."},{"$f":"IF('Optimum Moisture'!$J$26=\"\",\"\",'Optimum Moisture'!$J$26)","v":2},{"$f":"IF('Optimum Moisture'!$K$28=\"\",\"\",'Optimum Moisture'!$K$28)","v":"2-2"}]
[454,{"$f":"IF('Optimum Moisture'!$L$32=\"\",\"\",'Optimum Moisture'!$L$32)","v":""},{"$f":"IF('Optimum Moisture'!$B$6=\"\",\"\",'Optimum Moisture'!$B$6)","v":"Tex-120-E : PART II"},{"$f":"IF('Optimum Moisture'!$B$32=\"\",\"\",'Optimum Moisture'!$B$32)","v":"Mass Cement Added, lbs."},{"$f":"IF('Optimum Moisture'!$J$26=\"\",\"\",'Optimum Moisture'!$J$26)","v":2},{"$f":"IF('Optimum Moisture'!$L$28=\"\",\"\",'Optimum Moisture'!$L$28)","v":"2-3"}]
[455,{"$f":"IF('Optimum Moisture'!$M$32=\"\",\"\",'Optimum Moisture'!$M$32)","v":""},{"$f":"IF('Optimum Moisture'!$B$6=\"\",\"\",'Optimum Moisture'!$B$6)","v":"Tex-120-E : PART II"},{"$f":"IF('Optimum Moisture'!$B$32=\"\",\"\",'Optimum Moisture'!$B$32)","v":"Mass Cement Added, lbs."},{"$f":"IF('Optimum Moisture'!$M$26=\"\",\"\",'Optimum Moisture'!$M$26)","v":3},{"$f":"IF('Optimum Moisture'!$M$28=\"\",\"\",'Optimum Moisture'!$M$28)","v":"3-1"}]
[456,{"$f":"IF('Optimum Moisture'!$N$32=\"\",\"\",'Optimum Moisture'!$N$32)","v":""},{"$f":"IF('Optimum Moisture'!$B$6=\"\",\"\",'Optimum Moisture'!$B$6)","v":"Tex-120-E : PART II"},{"$f":"IF('Optimum Moisture'!$B$32=\"\",\"\",'Optimum Moisture'!$B$32)","v":"Mass Cement Added, lbs."},{"$f":"IF('Optimum Moisture'!$M$26=\"\",\"\",'Optimum Moisture'!$M$26)","v":3},{"$f":"IF('Optimum Moisture'!$N$28=\"\",\"\",'Optimum Moisture'!$N$28)","v":"3-2"}]
[457,{"$f":"IF('Optimum Moisture'!$O$32=\"\",\"\",'Optimum Moisture'!$O$32)","v":""},{"$f":"IF('Optimum Moisture'!$B$6=\"\",\"\",'Optimum Moisture'!$B$6)","v":"Tex-120-E : PART II"},{"$f":"IF('Optimum Moisture'!$B$32=\"\",\"\",'Optimum Moisture'!$B$32)","v":"Mass Cement Added, lbs."},{"$f":"IF('Optimum Moisture'!$M$26=\"\",\"\",'Optimum Moisture'!$M$26)","v":3},{"$f":"IF('Optimum Moisture'!$O$28=\"\",\"\",'Optimum Moisture'!$O$28)","v":"3-3"}]
[458,{"$f":"IF('Optimum Moisture'!$P$32=\"\",\"\",'Optimum Moisture'!$P$32)","v":""},{"$f":"IF('Optimum Moisture'!$B$6=\"\",\"\",'Optimum Moisture'!$B$6)","v":"Tex-120-E : PART II"},{"$f":"IF('Optimum Moisture'!$B$32=\"\",\"\",'Optimum Moisture'!$B$32)","v":"Mass Cement Added, lbs."},{"$f":"IF('Optimum Moisture'!$P$26=\"\",\"\",'Optimum Moisture'!$P$26)","v":4},{"$f":"IF('Optimum Moisture'!$P$28=\"\",\"\",'Optimum Moisture'!$P$28)","v":"4-1"}]
[459,{"$f":"IF('Optimum Moisture'!$Q$32=\"\",\"\",'Optimum Moisture'!$Q$32)","v":""},{"$f":"IF('Optimum Moisture'!$B$6=\"\",\"\",'Optimum Moisture'!$B$6)","v":"Tex-120-E : PART II"},{"$f":"IF('Optimum Moisture'!$B$32=\"\",\"\",'Optimum Moisture'!$B$32)","v":"Mass Cement Added, lbs."},{"$f":"IF('Optimum Moisture'!$P$26=\"\",\"\",'Optimum Moisture'!$P$26)","v":4},{"$f":"IF('Optimum Moisture'!$Q$28=\"\",\"\",'Optimum Moisture'!$Q$28)","v":"4-2"}]
[460,{"$f":"IF('Optimum Moisture'!$R$32=\"\",\"\",'Optimum Moisture'!$R$32)","v":""},{"$f":"IF('Optimum Moisture'!$B$6=\"\",\"\",'Optimum Moisture'!$B$6)","v":"Tex-120-E : PART II"},{"$f":"IF('Optimum Moisture'!$B$32=\"\",\"\",'Optimum Moisture'!$B$32)","v":"Mass Cement Added, lbs."},{"$f":"IF('Optimum Moisture'!$P$26=\"\",\"\",'Optimum Moisture'!$P$26)","v":4},{"$f":"IF('Optimum Moisture'!$R$28=\"\",\"\",'Optimum Moisture'!$R$28)","v":"4-3"}]
[461,{"$f":"IF('Optimum Moisture'!$G$33=\"\",\"\",'Optimum Moisture'!$G$33)","v":""},{"$f":"IF('Optimum Moisture'!$B$6=\"\",\"\",'Optimum Moisture'!$B$6)","v":"Tex-120-E : PART II"},{"$f":"IF('Optimum Moisture'!$B$33=\"\",\"\",'Optimum Moisture'!$B$33)","v":"Wet Mass Specimen & Mold,lb"},{"$f":"IF('Optimum Moisture'!$G$26=\"\",\"\",'Optimum Moisture'!$G$26)","v":1},{"$f":"IF('Optimum Moisture'!$G$28=\"\",\"\",'Optimum Moisture'!$G$28)","v":"1-1"}]
[462,{"$f":"IF('Optimum Moisture'!$H$33=\"\",\"\",'Optimum Moisture'!$H$33)","v":""},{"$f":"IF('Optimum Moisture'!$B$6=\"\",\"\",'Optimum Moisture'!$B$6)","v":"Tex-120-E : PART II"},{"$f":"IF('Optimum Moisture'!$B$33=\"\",\"\",'Optimum Moisture'!$B$33)","v":"Wet Mass Specimen & Mold,lb"},{"$f":"IF('Optimum Moisture'!$G$26=\"\",\"\",'Optimum Moisture'!$G$26)","v":1},{"$f":"IF('Optimum Moisture'!$H$28=\"\",\"\",'Optimum Moisture'!$H$28)","v":"1-2"}]
[463,{"$f":"IF('Optimum Moisture'!$I$33=\"\",\"\",'Optimum Moisture'!$I$33)","v":""},{"$f":"IF('Optimum Moisture'!$B$6=\"\",\"\",'Optimum Moisture'!$B$6)","v":"Tex-120-E : PART II"},{"$f":"IF('Optimum Moisture'!$B$33=\"\",\"\",'Optimum Moisture'!$B$33)","v":"Wet Mass Specimen & Mold,lb"},{"$f":"IF('Optimum Moisture'!$G$26=\"\",\"\",'Optimum Moisture'!$G$26)","v":1},{"$f":"IF('Optimum Moisture'!$I$28=\"\",\"\",'Optimum Moisture'!$I$28)","v":"1-3"}]
[464,{"$f":"IF('Optimum Moisture'!$J$33=\"\",\"\",'Optimum Moisture'!$J$33)","v":""},{"$f":"IF('Optimum Moisture'!$B$6=\"\",\"\",'Optimum Moisture'!$B$6)","v":"Tex-120-E : PART II"},{"$f":"IF('Optimum Moisture'!$B$33=\"\",\"\",'Optimum Moisture'!$B$33)","v":"Wet Mass Specimen & Mold,lb"},{"$f":"IF('Optimum Moisture'!$J$26=\"\",\"\",'Optimum Moisture'!$J$26)","v":2},{"$f":"IF('Optimum Moisture'!$J$28=\"\",\"\",'Optimum Moisture'!$J$28)","v":"2-1"}]
[465,{"$f":"IF('Optimum Moisture'!$K$33=\"\",\"\",'Optimum Moisture'!$K$33)","v":""},{"$f":"IF('Optimum Moisture'!$B$6=\"\",\"\",'Optimum Moisture'!$B$6)","v":"Tex-120-E : PART II"},{"$f":"IF('Optimum Moisture'!$B$33=\"\",\"\",'Optimum Moisture'!$B$33)","v":"Wet Mass Specimen & Mold,lb"},{"$f":"IF('Optimum Moisture'!$J$26=\"\",\"\",'Optimum Moisture'!$J$26)","v":2},{"$f":"IF('Optimum Moisture'!$K$28=\"\",\"\",'Optimum Moisture'!$K$28)","v":"2-2"}]
[466,{"$f":"IF('Optimum Moisture'!$L$33=\"\",\"\",'Optimum Moisture'!$L$33)","v":""},{"$f":"IF('Optimum Moisture'!$B$6=\"\",\"\",'Optimum Moisture'!$B$6)","v":"Tex-120-E : PART II"},{"$f":"IF('Optimum Moisture'!$B$33=\"\",\"\",'Optimum Moisture'!$B$33)","v":"Wet Mass Specimen & Mold,lb"},{"$f":"IF('Optimum Moisture'!$J$26=\"\",\"\",'Optimum Moisture'!$J$26)","v":2},{"$f":"IF('Optimum Moisture'!$L$28=\"\",\"\",'Optimum Moisture'!$L$28)","v":"2-3"}]
[467,{"$f":"IF('Optimum Moisture'!$M$33=\"\",\"\",'Optimum Moisture'!$M$33)","v":""},{"$f":"IF('Optimum Moisture'!$B$6=\"\",\"\",'Optimum Moisture'!$B$6)","v":"Tex-120-E : PART II"},{"$f":"IF('Optimum Moisture'!$B$33=\"\",\"\",'Optimum Moisture'!$B$33)","v":"Wet Mass Specimen & Mold,lb"},{"$f":"IF('Optimum Moisture'!$M$26=\"\",\"\",'Optimum Moisture'!$M$26)","v":3},{"$f":"IF('Optimum Moisture'!$M$28=\"\",\"\",'Optimum Moisture'!$M$28)","v":"3-1"}]
[468,{"$f":"IF('Optimum Moisture'!$N$33=\"\",\"\",'Optimum Moisture'!$N$33)","v":""},{"$f":"IF('Optimum Moisture'!$B$6=\"\",\"\",'Optimum Moisture'!$B$6)","v":"Tex-120-E : PART II"},{"$f":"IF('Optimum Moisture'!$B$33=\"\",\"\",'Optimum Moisture'!$B$33)","v":"Wet Mass Specimen & Mold,lb"},{"$f":"IF('Optimum Moisture'!$M$26=\"\",\"\",'Optimum Moisture'!$M$26)","v":3},{"$f":"IF('Optimum Moisture'!$N$28=\"\",\"\",'Optimum Moisture'!$N$28)","v":"3-2"}]
[469,{"$f":"IF('Optimum Moisture'!$O$33=\"\",\"\",'Optimum Moisture'!$O$33)","v":""},{"$f":"IF('Optimum Moisture'!$B$6=\"\",\"\",'Optimum Moisture'!$B$6)","v":"Tex-120-E : PART II"},{"$f":"IF('Optimum Moisture'!$B$33=\"\",\"\",'Optimum Moisture'!$B$33)","v":"Wet Mass Specimen & Mold,lb"},{"$f":"IF('Optimum Moisture'!$M$26=\"\",\"\",'Optimum Moisture'!$M$26)","v":3},{"$f":"IF('Optimum Moisture'!$O$28=\"\",\"\",'Optimum Moisture'!$O$28)","v":"3-3"}]
[470,{"$f":"IF('Optimum Moisture'!$P$33=\"\",\"\",'Optimum Moisture'!$P$33)","v":""},{"$f":"IF('Optimum Moisture'!$B$6=\"\",\"\",'Optimum Moisture'!$B$6)","v":"Tex-120-E : PART II"},{"$f":"IF('Optimum Moisture'!$B$33=\"\",\"\",'Optimum Moisture'!$B$33)","v":"Wet Mass Specimen & Mold,lb"},{"$f":"IF('Optimum Moisture'!$P$26=\"\",\"\",'Optimum Moisture'!$P$26)","v":4},{"$f":"IF('Optimum Moisture'!$P$28=\"\",\"\",'Optimum Moisture'!$P$28)","v":"4-1"}]
[471,{"$f":"IF('Optimum Moisture'!$Q$33=\"\",\"\",'Optimum Moisture'!$Q$33)","v":""},{"$f":"IF('Optimum Moisture'!$B$6=\"\",\"\",'Optimum Moisture'!$B$6)","v":"Tex-120-E : PART II"},{"$f":"IF('Optimum Moisture'!$B$33=\"\",\"\",'Optimum Moisture'!$B$33)","v":"Wet Mass Specimen & Mold,lb"},{"$f":"IF('Optimum Moisture'!$P$26=\"\",\"\",'Optimum Moisture'!$P$26)","v":4},{"$f":"IF('Optimum Moisture'!$Q$28=\"\",\"\",'Optimum Moisture'!$Q$28)","v":"4-2"}]
[472,{"$f":"IF('Optimum Moisture'!$R$33=\"\",\"\",'Optimum Moisture'!$R$33)","v":""},{"$f":"IF('Optimum Moisture'!$B$6=\"\",\"\",'Optimum Moisture'!$B$6)","v":"Tex-120-E : PART II"},{"$f":"IF('Optimum Moisture'!$B$33=\"\",\"\",'Optimum Moisture'!$B$33)","v":"Wet Mass Specimen & Mold,lb"},{"$f":"IF('Optimum Moisture'!$P$26=\"\",\"\",'Optimum Moisture'!$P$26)","v":4},{"$f":"IF('Optimum Moisture'!$R$28=\"\",\"\",'Optimum Moisture'!$R$28)","v":"4-3"}]
[473,{"$f":"IF('Optimum Moisture'!$G$34=\"\",\"\",'Optimum Moisture'!$G$34)","v":""},{"$f":"IF('Optimum Moisture'!$B$6=\"\",\"\",'Optimum Moisture'!$B$6)","v":"Tex-120-E : PART II"},{"$f":"IF('Optimum Moisture'!$B$34=\"\",\"\",'Optimum Moisture'!$B$34)","v":"Tare Mass Mold, lb"},{"$f":"IF('Optimum Moisture'!$G$26=\"\",\"\",'Optimum Moisture'!$G$26)","v":1},{"$f":"IF('Optimum Moisture'!$G$28=\"\",\"\",'Optimum Moisture'!$G$28)","v":"1-1"}]
[474,{"$f":"IF('Optimum Moisture'!$H$34=\"\",\"\",'Optimum Moisture'!$H$34)","v":""},{"$f":"IF('Optimum Moisture'!$B$6=\"\",\"\",'Optimum Moisture'!$B$6)","v":"Tex-120-E : PART II"},{"$f":"IF('Optimum Moisture'!$B$34=\"\",\"\",'Optimum Moisture'!$B$34)","v":"Tare Mass Mold, lb"},{"$f":"IF('Optimum Moisture'!$G$26=\"\",\"\",'Optimum Moisture'!$G$26)","v":1},{"$f":"IF('Optimum Moisture'!$H$28=\"\",\"\",'Optimum Moisture'!$H$28)","v":"1-2"}]
[475,{"$f":"IF('Optimum Moisture'!$I$34=\"\",\"\",'Optimum Moisture'!$I$34)","v":""},{"$f":"IF('Optimum Moisture'!$B$6=\"\",\"\",'Optimum Moisture'!$B$6)","v":"Tex-120-E : PART II"},{"$f":"IF('Optimum Moisture'!$B$34=\"\",\"\",'Optimum Moisture'!$B$34)","v":"Tare Mass Mold, lb"},{"$f":"IF('Optimum Moisture'!$G$26=\"\",\"\",'Optimum Moisture'!$G$26)","v":1},{"$f":"IF('Optimum Moisture'!$I$28=\"\",\"\",'Optimum Moisture'!$I$28)","v":"1-3"}]
[476,{"$f":"IF('Optimum Moisture'!$J$34=\"\",\"\",'Optimum Moisture'!$J$34)","v":""},{"$f":"IF('Optimum Moisture'!$B$6=\"\",\"\",'Optimum Moisture'!$B$6)","v":"Tex-120-E : PART II"},{"$f":"IF('Optimum Moisture'!$B$34=\"\",\"\",'Optimum Moisture'!$B$34)","v":"Tare Mass Mold, lb"},{"$f":"IF('Optimum Moisture'!$J$26=\"\",\"\",'Optimum Moisture'!$J$26)","v":2},{"$f":"IF('Optimum Moisture'!$J$28=\"\",\"\",'Optimum Moisture'!$J$28)","v":"2-1"}]
[477,{"$f":"IF('Optimum Moisture'!$K$34=\"\",\"\",'Optimum Moisture'!$K$34)","v":""},{"$f":"IF('Optimum Moisture'!$B$6=\"\",\"\",'Optimum Moisture'!$B$6)","v":"Tex-120-E : PART II"},{"$f":"IF('Optimum Moisture'!$B$34=\"\",\"\",'Optimum Moisture'!$B$34)","v":"Tare Mass Mold, lb"},{"$f":"IF('Optimum Moisture'!$J$26=\"\",\"\",'Optimum Moisture'!$J$26)","v":2},{"$f":"IF('Optimum Moisture'!$K$28=\"\",\"\",'Optimum Moisture'!$K$28)","v":"2-2"}]
[478,{"$f":"IF('Optimum Moisture'!$L$34=\"\",\"\",'Optimum Moisture'!$L$34)","v":""},{"$f":"IF('Optimum Moisture'!$B$6=\"\",\"\",'Optimum Moisture'!$B$6)","v":"Tex-120-E : PART II"},{"$f":"IF('Optimum Moisture'!$B$34=\"\",\"\",'Optimum Moisture'!$B$34)","v":"Tare Mass Mold, lb"},{"$f":"IF('Optimum Moisture'!$J$26=\"\",\"\",'Optimum Moisture'!$J$26)","v":2},{"$f":"IF('Optimum Moisture'!$L$28=\"\",\"\",'Optimum Moisture'!$L$28)","v":"2-3"}]
[479,{"$f":"IF('Optimum Moisture'!$M$34=\"\",\"\",'Optimum Moisture'!$M$34)","v":""},{"$f":"IF('Optimum Moisture'!$B$6=\"\",\"\",'Optimum Moisture'!$B$6)","v":"Tex-120-E : PART II"},{"$f":"IF('Optimum Moisture'!$B$34=\"\",\"\",'Optimum Moisture'!$B$34)","v":"Tare Mass Mold, lb"},{"$f":"IF('Optimum Moisture'!$M$26=\"\",\"\",'Optimum Moisture'!$M$26)","v":3},{"$f":"IF('Optimum Moisture'!$M$28=\"\",\"\",'Optimum Moisture'!$M$28)","v":"3-1"}]
[480,{"$f":"IF('Optimum Moisture'!$N$34=\"\",\"\",'Optimum Moisture'!$N$34)","v":""},{"$f":"IF('Optimum Moisture'!$B$6=\"\",\"\",'Optimum Moisture'!$B$6)","v":"Tex-120-E : PART II"},{"$f":"IF('Optimum Moisture'!$B$34=\"\",\"\",'Optimum Moisture'!$B$34)","v":"Tare Mass Mold, lb"},{"$f":"IF('Optimum Moisture'!$M$26=\"\",\"\",'Optimum Moisture'!$M$26)","v":3},{"$f":"IF('Optimum Moisture'!$N$28=\"\",\"\",'Optimum Moisture'!$N$28)","v":"3-2"}]
[481,{"$f":"IF('Optimum Moisture'!$O$34=\"\",\"\",'Optimum Moisture'!$O$34)","v":""},{"$f":"IF('Optimum Moisture'!$B$6=\"\",\"\",'Optimum Moisture'!$B$6)","v":"Tex-120-E : PART II"},{"$f":"IF('Optimum Moisture'!$B$34=\"\",\"\",'Optimum Moisture'!$B$34)","v":"Tare Mass Mold, lb"},{"$f":"IF('Optimum Moisture'!$M$26=\"\",\"\",'Optimum Moisture'!$M$26)","v":3},{"$f":"IF('Optimum Moisture'!$O$28=\"\",\"\",'Optimum Moisture'!$O$28)","v":"3-3"}]
[482,{"$f":"IF('Optimum Moisture'!$P$34=\"\",\"\",'Optimum Moisture'!$P$34)","v":""},{"$f":"IF('Optimum Moisture'!$B$6=\"\",\"\",'Optimum Moisture'!$B$6)","v":"Tex-120-E : PART II"},{"$f":"IF('Optimum Moisture'!$B$34=\"\",\"\",'Optimum Moisture'!$B$34)","v":"Tare Mass Mold, lb"},{"$f":"IF('Optimum Moisture'!$P$26=\"\",\"\",'Optimum Moisture'!$P$26)","v":4},{"$f":"IF('Optimum Moisture'!$P$28=\"\",\"\",'Optimum Moisture'!$P$28)","v":"4-1"}]
[483,{"$f":"IF('Optimum Moisture'!$Q$34=\"\",\"\",'Optimum Moisture'!$Q$34)","v":""},{"$f":"IF('Optimum Moisture'!$B$6=\"\",\"\",'Optimum Moisture'!$B$6)","v":"Tex-120-E : PART II"},{"$f":"IF('Optimum Moisture'!$B$34=\"\",\"\",'Optimum Moisture'!$B$34)","v":"Tare Mass Mold, lb"},{"$f":"IF('Optimum Moisture'!$P$26=\"\",\"\",'Optimum Moisture'!$P$26)","v":4},{"$f":"IF('Optimum Moisture'!$Q$28=\"\",\"\",'Optimum Moisture'!$Q$28)","v":"4-2"}]
[484,{"$f":"IF('Optimum Moisture'!$R$34=\"\",\"\",'Optimum Moisture'!$R$34)","v":""},{"$f":"IF('Optimum Moisture'!$B$6=\"\",\"\",'Optimum Moisture'!$B$6)","v":"Tex-120-E : PART II"},{"$f":"IF('Optimum Moisture'!$B$34=\"\",\"\",'Optimum Moisture'!$B$34)","v":"Tare Mass Mold, lb"},{"$f":"IF('Optimum Moisture'!$P$26=\"\",\"\",'Optimum Moisture'!$P$26)","v":4},{"$f":"IF('Optimum Moisture'!$R$28=\"\",\"\",'Optimum Moisture'!$R$28)","v":"4-3"}]
[485,{"$f":"IF('Optimum Moisture'!$G$35=\"\",\"\",'Optimum Moisture'!$G$35)","v":""},{"$f":"IF('Optimum Moisture'!$B$6=\"\",\"\",'Optimum Moisture'!$B$6)","v":"Tex-120-E : PART II"},{"$f":"IF('Optimum Moisture'!$B$35=\"\",\"\",'Optimum Moisture'!$B$35)","v":"Wet Mass Specimen, lb"},{"$f":"IF('Optimum Moisture'!$G$26=\"\",\"\",'Optimum Moisture'!$G$26)","v":1},{"$f":"IF('Optimum Moisture'!$G$28=\"\",\"\",'Optimum Moisture'!$G$28)","v":"1-1"}]
[486,{"$f":"IF('Optimum Moisture'!$H$35=\"\",\"\",'Optimum Moisture'!$H$35)","v":""},{"$f":"IF('Optimum Moisture'!$B$6=\"\",\"\",'Optimum Moisture'!$B$6)","v":"Tex-120-E : PART II"},{"$f":"IF('Optimum Moisture'!$B$35=\"\",\"\",'Optimum Moisture'!$B$35)","v":"Wet Mass Specimen, lb"},{"$f":"IF('Optimum Moisture'!$G$26=\"\",\"\",'Optimum Moisture'!$G$26)","v":1},{"$f":"IF('Optimum Moisture'!$H$28=\"\",\"\",'Optimum Moisture'!$H$28)","v":"1-2"}]
[487,{"$f":"IF('Optimum Moisture'!$I$35=\"\",\"\",'Optimum Moisture'!$I$35)","v":""},{"$f":"IF('Optimum Moisture'!$B$6=\"\",\"\",'Optimum Moisture'!$B$6)","v":"Tex-120-E : PART II"},{"$f":"IF('Optimum Moisture'!$B$35=\"\",\"\",'Optimum Moisture'!$B$35)","v":"Wet Mass Specimen, lb"},{"$f":"IF('Optimum Moisture'!$G$26=\"\",\"\",'Optimum Moisture'!$G$26)","v":1},{"$f":"IF('Optimum Moisture'!$I$28=\"\",\"\",'Optimum Moisture'!$I$28)","v":"1-3"}]
[488,{"$f":"IF('Optimum Moisture'!$J$35=\"\",\"\",'Optimum Moisture'!$J$35)","v":""},{"$f":"IF('Optimum Moisture'!$B$6=\"\",\"\",'Optimum Moisture'!$B$6)","v":"Tex-120-E : PART II"},{"$f":"IF('Optimum Moisture'!$B$35=\"\",\"\",'Optimum Moisture'!$B$35)","v":"Wet Mass Specimen, lb"},{"$f":"IF('Optimum Moisture'!$J$26=\"\",\"\",'Optimum Moisture'!$J$26)","v":2},{"$f":"IF('Optimum Moisture'!$J$28=\"\",\"\",'Optimum Moisture'!$J$28)","v":"2-1"}]
[489,{"$f":"IF('Optimum Moisture'!$K$35=\"\",\"\",'Optimum Moisture'!$K$35)","v":""},{"$f":"IF('Optimum Moisture'!$B$6=\"\",\"\",'Optimum Moisture'!$B$6)","v":"Tex-120-E : PART II"},{"$f":"IF('Optimum Moisture'!$B$35=\"\",\"\",'Optimum Moisture'!$B$35)","v":"Wet Mass Specimen, lb"},{"$f":"IF('Optimum Moisture'!$J$26=\"\",\"\",'Optimum Moisture'!$J$26)","v":2},{"$f":"IF('Optimum Moisture'!$K$28=\"\",\"\",'Optimum Moisture'!$K$28)","v":"2-2"}]
[490,{"$f":"IF('Optimum Moisture'!$L$35=\"\",\"\",'Optimum Moisture'!$L$35)","v":""},{"$f":"IF('Optimum Moisture'!$B$6=\"\",\"\",'Optimum Moisture'!$B$6)","v":"Tex-120-E : PART II"},{"$f":"IF('Optimum Moisture'!$B$35=\"\",\"\",'Optimum Moisture'!$B$35)","v":"Wet Mass Specimen, lb"},{"$f":"IF('Optimum Moisture'!$J$26=\"\",\"\",'Optimum Moisture'!$J$26)","v":2},{"$f":"IF('Optimum Moisture'!$L$28=\"\",\"\",'Optimum Moisture'!$L$28)","v":"2-3"}]
[491,{"$f":"IF('Optimum Moisture'!$M$35=\"\",\"\",'Optimum Moisture'!$M$35)","v":""},{"$f":"IF('Optimum Moisture'!$B$6=\"\",\"\",'Optimum Moisture'!$B$6)","v":"Tex-120-E : PART II"},{"$f":"IF('Optimum Moisture'!$B$35=\"\",\"\",'Optimum Moisture'!$B$35)","v":"Wet Mass Specimen, lb"},{"$f":"IF('Optimum Moisture'!$M$26=\"\",\"\",'Optimum Moisture'!$M$26)","v":3},{"$f":"IF('Optimum Moisture'!$M$28=\"\",\"\",'Optimum Moisture'!$M$28)","v":"3-1"}]
[492,{"$f":"IF('Optimum Moisture'!$N$35=\"\",\"\",'Optimum Moisture'!$N$35)","v":""},{"$f":"IF('Optimum Moisture'!$B$6=\"\",\"\",'Optimum Moisture'!$B$6)","v":"Tex-120-E : PART II"},{"$f":"IF('Optimum Moisture'!$B$35=\"\",\"\",'Optimum Moisture'!$B$35)","v":"Wet Mass Specimen, lb"},{"$f":"IF('Optimum Moisture'!$M$26=\"\",\"\",'Optimum Moisture'!$M$26)","v":3},{"$f":"IF('Optimum Moisture'!$N$28=\"\",\"\",'Optimum Moisture'!$N$28)","v":"3-2"}]
[493,{"$f":"IF('Optimum Moisture'!$O$35=\"\",\"\",'Optimum Moisture'!$O$35)","v":""},{"$f":"IF('Optimum Moisture'!$B$6=\"\",\"\",'Optimum Moisture'!$B$6)","v":"Tex-120-E : PART II"},{"$f":"IF('Optimum Moisture'!$B$35=\"\",\"\",'Optimum Moisture'!$B$35)","v":"Wet Mass Specimen, lb"},{"$f":"IF('Optimum Moisture'!$M$26=\"\",\"\",'Optimum Moisture'!$M$26)","v":3},{"$f":"IF('Optimum Moisture'!$O$28=\"\",\"\",'Optimum Moisture'!$O$28)","v":"3-3"}]
[494,{"$f":"IF('Optimum Moisture'!$P$35=\"\",\"\",'Optimum Moisture'!$P$35)","v":""},{"$f":"IF('Optimum Moisture'!$B$6=\"\",\"\",'Optimum Moisture'!$B$6)","v":"Tex-120-E : PART II"},{"$f":"IF('Optimum Moisture'!$B$35=\"\",\"\",'Optimum Moisture'!$B$35)","v":"Wet Mass Specimen, lb"},{"$f":"IF('Optimum Moisture'!$P$26=\"\",\"\",'Optimum Moisture'!$P$26)","v":4},{"$f":"IF('Optimum Moisture'!$P$28=\"\",\"\",'Optimum Moisture'!$P$28)","v":"4-1"}]
[495,{"$f":"IF('Optimum Moisture'!$Q$35=\"\",\"\",'Optimum Moisture'!$Q$35)","v":""},{"$f":"IF('Optimum Moisture'!$B$6=\"\",\"\",'Optimum Moisture'!$B$6)","v":"Tex-120-E : PART II"},{"$f":"IF('Optimum Moisture'!$B$35=\"\",\"\",'Optimum Moisture'!$B$35)","v":"Wet Mass Specimen, lb"},{"$f":"IF('Optimum Moisture'!$P$26=\"\",\"\",'Optimum Moisture'!$P$26)","v":4},{"$f":"IF('Optimum Moisture'!$Q$28=\"\",\"\",'Optimum Moisture'!$Q$28)","v":"4-2"}]
[496,{"$f":"IF('Optimum Moisture'!$R$35=\"\",\"\",'Optimum Moisture'!$R$35)","v":""},{"$f":"IF('Optimum Moisture'!$B$6=\"\",\"\",'Optimum Moisture'!$B$6)","v":"Tex-120-E : PART II"},{"$f":"IF('Optimum Moisture'!$B$35=\"\",\"\",'Optimum Moisture'!$B$35)","v":"Wet Mass Specimen, lb"},{"$f":"IF('Optimum Moisture'!$P$26=\"\",\"\",'Optimum Moisture'!$P$26)","v":4},{"$f":"IF('Optimum Moisture'!$R$28=\"\",\"\",'Optimum Moisture'!$R$28)","v":"4-3"}]
[497,{"$f":"IF('Optimum Moisture'!$G$36=\"\",\"\",'Optimum Moisture'!$G$36)","v":""},{"$f":"IF('Optimum Moisture'!$B$6=\"\",\"\",'Optimum Moisture'!$B$6)","v":"Tex-120-E : PART II"},{"$f":"IF('Optimum Moisture'!$B$36=\"\",\"\",'Optimum Moisture'!$B$36)","v":"Height of Specimen, in."},{"$f":"IF('Optimum Moisture'!$G$26=\"\",\"\",'Optimum Moisture'!$G$26)","v":1},{"$f":"IF('Optimum Moisture'!$G$28=\"\",\"\",'Optimum Moisture'!$G$28)","v":"1-1"}]
[498,{"$f":"IF('Optimum Moisture'!$H$36=\"\",\"\",'Optimum Moisture'!$H$36)","v":""},{"$f":"IF('Optimum Moisture'!$B$6=\"\",\"\",'Optimum Moisture'!$B$6)","v":"Tex-120-E : PART II"},{"$f":"IF('Optimum Moisture'!$B$36=\"\",\"\",'Optimum Moisture'!$B$36)","v":"Height of Specimen, in."},{"$f":"IF('Optimum Moisture'!$G$26=\"\",\"\",'Optimum Moisture'!$G$26)","v":1},{"$f":"IF('Optimum Moisture'!$H$28=\"\",\"\",'Optimum Moisture'!$H$28)","v":"1-2"}]
[499,{"$f":"IF('Optimum Moisture'!$I$36=\"\",\"\",'Optimum Moisture'!$I$36)","v":""},{"$f":"IF('Optimum Moisture'!$B$6=\"\",\"\",'Optimum Moisture'!$B$6)","v":"Tex-120-E : PART II"},{"$f":"IF('Optimum Moisture'!$B$36=\"\",\"\",'Optimum Moisture'!$B$36)","v":"Height of Specimen, in."},{"$f":"IF('Optimum Moisture'!$G$26=\"\",\"\",'Optimum Moisture'!$G$26)","v":1},{"$f":"IF('Optimum Moisture'!$I$28=\"\",\"\",'Optimum Moisture'!$I$28)","v":"1-3"}]
[500,{"$f":"IF('Optimum Moisture'!$J$36=\"\",\"\",'Optimum Moisture'!$J$36)","v":""},{"$f":"IF('Optimum Moisture'!$B$6=\"\",\"\",'Optimum Moisture'!$B$6)","v":"Tex-120-E : PART II"},{"$f":"IF('Optimum Moisture'!$B$36=\"\",\"\",'Optimum Moisture'!$B$36)","v":"Height of Specimen, in."},{"$f":"IF('Optimum Moisture'!$J$26=\"\",\"\",'Optimum Moisture'!$J$26)","v":2},{"$f":"IF('Optimum Moisture'!$J$28=\"\",\"\",'Optimum Moisture'!$J$28)","v":"2-1"}]
[501,{"$f":"IF('Optimum Moisture'!$K$36=\"\",\"\",'Optimum Moisture'!$K$36)","v":""},{"$f":"IF('Optimum Moisture'!$B$6=\"\",\"\",'Optimum Moisture'!$B$6)","v":"Tex-120-E : PART II"},{"$f":"IF('Optimum Moisture'!$B$36=\"\",\"\",'Optimum Moisture'!$B$36)","v":"Height of Specimen, in."},{"$f":"IF('Optimum Moisture'!$J$26=\"\",\"\",'Optimum Moisture'!$J$26)","v":2},{"$f":"IF('Optimum Moisture'!$K$28=\"\",\"\",'Optimum Moisture'!$K$28)","v":"2-2"}]
[502,{"$f":"IF('Optimum Moisture'!$L$36=\"\",\"\",'Optimum Moisture'!$L$36)","v":""},{"$f":"IF('Optimum Moisture'!$B$6=\"\",\"\",'Optimum Moisture'!$B$6)","v":"Tex-120-E : PART II"},{"$f":"IF('Optimum Moisture'!$B$36=\"\",\"\",'Optimum Moisture'!$B$36)","v":"Height of Specimen, in."},{"$f":"IF('Optimum Moisture'!$J$26=\"\",\"\",'Optimum Moisture'!$J$26)","v":2},{"$f":"IF('Optimum Moisture'!$L$28=\"\",\"\",'Optimum Moisture'!$L$28)","v":"2-3"}]
[503,{"$f":"IF('Optimum Moisture'!$M$36=\"\",\"\",'Optimum Moisture'!$M$36)","v":""},{"$f":"IF('Optimum Moisture'!$B$6=\"\",\"\",'Optimum Moisture'!$B$6)","v":"Tex-120-E : PART II"},{"$f":"IF('Optimum Moisture'!$B$36=\"\",\"\",'Optimum Moisture'!$B$36)","v":"Height of Specimen, in."},{"$f":"IF('Optimum Moisture'!$M$26=\"\",\"\",'Optimum Moisture'!$M$26)","v":3},{"$f":"IF('Optimum Moisture'!$M$28=\"\",\"\",'Optimum Moisture'!$M$28)","v":"3-1"}]
[504,{"$f":"IF('Optimum Moisture'!$N$36=\"\",\"\",'Optimum Moisture'!$N$36)","v":""},{"$f":"IF('Optimum Moisture'!$B$6=\"\",\"\",'Optimum Moisture'!$B$6)","v":"Tex-120-E : PART II"},{"$f":"IF('Optimum Moisture'!$B$36=\"\",\"\",'Optimum Moisture'!$B$36)","v":"Height of Specimen, in."},{"$f":"IF('Optimum Moisture'!$M$26=\"\",\"\",'Optimum Moisture'!$M$26)","v":3},{"$f":"IF('Optimum Moisture'!$N$28=\"\",\"\",'Optimum Moisture'!$N$28)","v":"3-2"}]
[505,{"$f":"IF('Optimum Moisture'!$O$36=\"\",\"\",'Optimum Moisture'!$O$36)","v":""},{"$f":"IF('Optimum Moisture'!$B$6=\"\",\"\",'Optimum Moisture'!$B$6)","v":"Tex-120-E : PART II"},{"$f":"IF('Optimum Moisture'!$B$36=\"\",\"\",'Optimum Moisture'!$B$36)","v":"Height of Specimen, in."},{"$f":"IF('Optimum Moisture'!$M$26=\"\",\"\",'Optimum Moisture'!$M$26)","v":3},{"$f":"IF('Optimum Moisture'!$O$28=\"\",\"\",'Optimum Moisture'!$O$28)","v":"3-3"}]
[506,{"$f":"IF('Optimum Moisture'!$P$36=\"\",\"\",'Optimum Moisture'!$P$36)","v":""},{"$f":"IF('Optimum Moisture'!$B$6=\"\",\"\",'Optimum Moisture'!$B$6)","v":"Tex-120-E : PART II"},{"$f":"IF('Optimum Moisture'!$B$36=\"\",\"\",'Optimum Moisture'!$B$36)","v":"Height of Specimen, in."},{"$f":"IF('Optimum Moisture'!$P$26=\"\",\"\",'Optimum Moisture'!$P$26)","v":4},{"$f":"IF('Optimum Moisture'!$P$28=\"\",\"\",'Optimum Moisture'!$P$28)","v":"4-1"}]
[507,{"$f":"IF('Optimum Moisture'!$Q$36=\"\",\"\",'Optimum Moisture'!$Q$36)","v":""},{"$f":"IF('Optimum Moisture'!$B$6=\"\",\"\",'Optimum Moisture'!$B$6)","v":"Tex-120-E : PART II"},{"$f":"IF('Optimum Moisture'!$B$36=\"\",\"\",'Optimum Moisture'!$B$36)","v":"Height of Specimen, in."},{"$f":"IF('Optimum Moisture'!$P$26=\"\",\"\",'Optimum Moisture'!$P$26)","v":4},{"$f":"IF('Optimum Moisture'!$Q$28=\"\",\"\",'Optimum Moisture'!$Q$28)","v":"4-2"}]
[508,{"$f":"IF('Optimum Moisture'!$R$36=\"\",\"\",'Optimum Moisture'!$R$36)","v":""},{"$f":"IF('Optimum Moisture'!$B$6=\"\",\"\",'Optimum Moisture'!$B$6)","v":"Tex-120-E : PART II"},{"$f":"IF('Optimum Moisture'!$B$36=\"\",\"\",'Optimum Moisture'!$B$36)","v":"Height of Specimen, in."},{"$f":"IF('Optimum Moisture'!$P$26=\"\",\"\",'Optimum Moisture'!$P$26)","v":4},{"$f":"IF('Optimum Moisture'!$R$28=\"\",\"\",'Optimum Moisture'!$R$28)","v":"4-3"}]
[509,{"$f":"IF('Optimum Moisture'!$G$37=\"\",\"\",'Optimum Moisture'!$G$37)","v":""},{"$f":"IF('Optimum Moisture'!$B$6=\"\",\"\",'Optimum Moisture'!$B$6)","v":"Tex-120-E : PART II"},{"$f":"IF('Optimum Moisture'!$B$37=\"\",\"\",'Optimum Moisture'!$B$37)","v":"Vol. per Linear mm.(in.)"},{"$f":"IF('Optimum Moisture'!$G$26=\"\",\"\",'Optimum Moisture'!$G$26)","v":1},{"$f":"IF('Optimum Moisture'!$G$28=\"\",\"\",'Optimum Moisture'!$G$28)","v":"1-1"}]
[510,{"$f":"IF('Optimum Moisture'!$H$37=\"\",\"\",'Optimum Moisture'!$H$37)","v":""},{"$f":"IF('Optimum Moisture'!$B$6=\"\",\"\",'Optimum Moisture'!$B$6)","v":"Tex-120-E : PART II"},{"$f":"IF('Optimum Moisture'!$B$37=\"\",\"\",'Optimum Moisture'!$B$37)","v":"Vol. per Linear mm.(in.)"},{"$f":"IF('Optimum Moisture'!$G$26=\"\",\"\",'Optimum Moisture'!$G$26)","v":1},{"$f":"IF('Optimum Moisture'!$H$28=\"\",\"\",'Optimum Moisture'!$H$28)","v":"1-2"}]
[511,{"$f":"IF('Optimum Moisture'!$I$37=\"\",\"\",'Optimum Moisture'!$I$37)","v":""},{"$f":"IF('Optimum Moisture'!$B$6=\"\",\"\",'Optimum Moisture'!$B$6)","v":"Tex-120-E : PART II"},{"$f":"IF('Optimum Moisture'!$B$37=\"\",\"\",'Optimum Moisture'!$B$37)","v":"Vol. per Linear mm.(in.)"},{"$f":"IF('Optimum Moisture'!$G$26=\"\",\"\",'Optimum Moisture'!$G$26)","v":1},{"$f":"IF('Optimum Moisture'!$I$28=\"\",\"\",'Optimum Moisture'!$I$28)","v":"1-3"}]
[512,{"$f":"IF('Optimum Moisture'!$J$37=\"\",\"\",'Optimum Moisture'!$J$37)","v":""},{"$f":"IF('Optimum Moisture'!$B$6=\"\",\"\",'Optimum Moisture'!$B$6)","v":"Tex-120-E : PART II"},{"$f":"IF('Optimum Moisture'!$B$37=\"\",\"\",'Optimum Moisture'!$B$37)","v":"Vol. per Linear mm.(in.)"},{"$f":"IF('Optimum Moisture'!$J$26=\"\",\"\",'Optimum Moisture'!$J$26)","v":2},{"$f":"IF('Optimum Moisture'!$J$28=\"\",\"\",'Optimum Moisture'!$J$28)","v":"2-1"}]
[513,{"$f":"IF('Optimum Moisture'!$K$37=\"\",\"\",'Optimum Moisture'!$K$37)","v":""},{"$f":"IF('Optimum Moisture'!$B$6=\"\",\"\",'Optimum Moisture'!$B$6)","v":"Tex-120-E : PART II"},{"$f":"IF('Optimum Moisture'!$B$37=\"\",\"\",'Optimum Moisture'!$B$37)","v":"Vol. per Linear mm.(in.)"},{"$f":"IF('Optimum Moisture'!$J$26=\"\",\"\",'Optimum Moisture'!$J$26)","v":2},{"$f":"IF('Optimum Moisture'!$K$28=\"\",\"\",'Optimum Moisture'!$K$28)","v":"2-2"}]
[514,{"$f":"IF('Optimum Moisture'!$L$37=\"\",\"\",'Optimum Moisture'!$L$37)","v":""},{"$f":"IF('Optimum Moisture'!$B$6=\"\",\"\",'Optimum Moisture'!$B$6)","v":"Tex-120-E : PART II"},{"$f":"IF('Optimum Moisture'!$B$37=\"\",\"\",'Optimum Moisture'!$B$37)","v":"Vol. per Linear mm.(in.)"},{"$f":"IF('Optimum Moisture'!$J$26=\"\",\"\",'Optimum Moisture'!$J$26)","v":2},{"$f":"IF('Optimum Moisture'!$L$28=\"\",\"\",'Optimum Moisture'!$L$28)","v":"2-3"}]
[515,{"$f":"IF('Optimum Moisture'!$M$37=\"\",\"\",'Optimum Moisture'!$M$37)","v":""},{"$f":"IF('Optimum Moisture'!$B$6=\"\",\"\",'Optimum Moisture'!$B$6)","v":"Tex-120-E : PART II"},{"$f":"IF('Optimum Moisture'!$B$37=\"\",\"\",'Optimum Moisture'!$B$37)","v":"Vol. per Linear mm.(in.)"},{"$f":"IF('Optimum Moisture'!$M$26=\"\",\"\",'Optimum Moisture'!$M$26)","v":3},{"$f":"IF('Optimum Moisture'!$M$28=\"\",\"\",'Optimum Moisture'!$M$28)","v":"3-1"}]
[516,{"$f":"IF('Optimum Moisture'!$N$37=\"\",\"\",'Optimum Moisture'!$N$37)","v":""},{"$f":"IF('Optimum Moisture'!$B$6=\"\",\"\",'Optimum Moisture'!$B$6)","v":"Tex-120-E : PART II"},{"$f":"IF('Optimum Moisture'!$B$37=\"\",\"\",'Optimum Moisture'!$B$37)","v":"Vol. per Linear mm.(in.)"},{"$f":"IF('Optimum Moisture'!$M$26=\"\",\"\",'Optimum Moisture'!$M$26)","v":3},{"$f":"IF('Optimum Moisture'!$N$28=\"\",\"\",'Optimum Moisture'!$N$28)","v":"3-2"}]
[517,{"$f":"IF('Optimum Moisture'!$O$37=\"\",\"\",'Optimum Moisture'!$O$37)","v":""},{"$f":"IF('Optimum Moisture'!$B$6=\"\",\"\",'Optimum Moisture'!$B$6)","v":"Tex-120-E : PART II"},{"$f":"IF('Optimum Moisture'!$B$37=\"\",\"\",'Optimum Moisture'!$B$37)","v":"Vol. per Linear mm.(in.)"},{"$f":"IF('Optimum Moisture'!$M$26=\"\",\"\",'Optimum Moisture'!$M$26)","v":3},{"$f":"IF('Optimum Moisture'!$O$28=\"\",\"\",'Optimum Moisture'!$O$28)","v":"3-3"}]
[518,{"$f":"IF('Optimum Moisture'!$P$37=\"\",\"\",'Optimum Moisture'!$P$37)","v":""},{"$f":"IF('Optimum Moisture'!$B$6=\"\",\"\",'Optimum Moisture'!$B$6)","v":"Tex-120-E : PART II"},{"$f":"IF('Optimum Moisture'!$B$37=\"\",\"\",'Optimum Moisture'!$B$37)","v":"Vol. per Linear mm.(in.)"},{"$f":"IF('Optimum Moisture'!$P$26=\"\",\"\",'Optimum Moisture'!$P$26)","v":4},{"$f":"IF('Optimum Moisture'!$P$28=\"\",\"\",'Optimum Moisture'!$P$28)","v":"4-1"}]
[519,{"$f":"IF('Optimum Moisture'!$Q$37=\"\",\"\",'Optimum Moisture'!$Q$37)","v":""},{"$f":"IF('Optimum Moisture'!$B$6=\"\",\"\",'Optimum Moisture'!$B$6)","v":"Tex-120-E : PART II"},{"$f":"IF('Optimum Moisture'!$B$37=\"\",\"\",'Optimum Moisture'!$B$37)","v":"Vol. per Linear mm.(in.)"},{"$f":"IF('Optimum Moisture'!$P$26=\"\",\"\",'Optimum Moisture'!$P$26)","v":4},{"$f":"IF('Optimum Moisture'!$Q$28=\"\",\"\",'Optimum Moisture'!$Q$28)","v":"4-2"}]
[520,{"$f":"IF('Optimum Moisture'!$R$37=\"\",\"\",'Optimum Moisture'!$R$37)","v":""},{"$f":"IF('Optimum Moisture'!$B$6=\"\",\"\",'Optimum Moisture'!$B$6)","v":"Tex-120-E : PART II"},{"$f":"IF('Optimum Moisture'!$B$37=\"\",\"\",'Optimum Moisture'!$B$37)","v":"Vol. per Linear mm.(in.)"},{"$f":"IF('Optimum Moisture'!$P$26=\"\",\"\",'Optimum Moisture'!$P$26)","v":4},{"$f":"IF('Optimum Moisture'!$R$28=\"\",\"\",'Optimum Moisture'!$R$28)","v":"4-3"}]
[521,{"$f":"IF('Optimum Moisture'!$G$38=\"\",\"\",'Optimum Moisture'!$G$38)","v":""},{"$f":"IF('Optimum Moisture'!$B$6=\"\",\"\",'Optimum Moisture'!$B$6)","v":"Tex-120-E : PART II"},{"$f":"IF('Optimum Moisture'!$B$38=\"\",\"\",'Optimum Moisture'!$B$38)","v":"Vol. of Specimen, ft^3"},{"$f":"IF('Optimum Moisture'!$G$26=\"\",\"\",'Optimum Moisture'!$G$26)","v":1},{"$f":"IF('Optimum Moisture'!$G$28=\"\",\"\",'Optimum Moisture'!$G$28)","v":"1-1"}]
[522,{"$f":"IF('Optimum Moisture'!$H$38=\"\",\"\",'Optimum Moisture'!$H$38)","v":""},{"$f":"IF('Optimum Moisture'!$B$6=\"\",\"\",'Optimum Moisture'!$B$6)","v":"Tex-120-E : PART II"},{"$f":"IF('Optimum Moisture'!$B$38=\"\",\"\",'Optimum Moisture'!$B$38)","v":"Vol. of Specimen, ft^3"},{"$f":"IF('Optimum Moisture'!$G$26=\"\",\"\",'Optimum Moisture'!$G$26)","v":1},{"$f":"IF('Optimum Moisture'!$H$28=\"\",\"\",'Optimum Moisture'!$H$28)","v":"1-2"}]
[523,{"$f":"IF('Optimum Moisture'!$I$38=\"\",\"\",'Optimum Moisture'!$I$38)","v":""},{"$f":"IF('Optimum Moisture'!$B$6=\"\",\"\",'Optimum Moisture'!$B$6)","v":"Tex-120-E : PART II"},{"$f":"IF('Optimum Moisture'!$B$38=\"\",\"\",'Optimum Moisture'!$B$38)","v":"Vol. of Specimen, ft^3"},{"$f":"IF('Optimum Moisture'!$G$26=\"\",\"\",'Optimum Moisture'!$G$26)","v":1},{"$f":"IF('Optimum Moisture'!$I$28=\"\",\"\",'Optimum Moisture'!$I$28)","v":"1-3"}]
[524,{"$f":"IF('Optimum Moisture'!$J$38=\"\",\"\",'Optimum Moisture'!$J$38)","v":""},{"$f":"IF('Optimum Moisture'!$B$6=\"\",\"\",'Optimum Moisture'!$B$6)","v":"Tex-120-E : PART II"},{"$f":"IF('Optimum Moisture'!$B$38=\"\",\"\",'Optimum Moisture'!$B$38)","v":"Vol. of Specimen, ft^3"},{"$f":"IF('Optimum Moisture'!$J$26=\"\",\"\",'Optimum Moisture'!$J$26)","v":2},{"$f":"IF('Optimum Moisture'!$J$28=\"\",\"\",'Optimum Moisture'!$J$28)","v":"2-1"}]
[525,{"$f":"IF('Optimum Moisture'!$K$38=\"\",\"\",'Optimum Moisture'!$K$38)","v":""},{"$f":"IF('Optimum Moisture'!$B$6=\"\",\"\",'Optimum Moisture'!$B$6)","v":"Tex-120-E : PART II"},{"$f":"IF('Optimum Moisture'!$B$38=\"\",\"\",'Optimum Moisture'!$B$38)","v":"Vol. of Specimen, ft^3"},{"$f":"IF('Optimum Moisture'!$J$26=\"\",\"\",'Optimum Moisture'!$J$26)","v":2},{"$f":"IF('Optimum Moisture'!$K$28=\"\",\"\",'Optimum Moisture'!$K$28)","v":"2-2"}]
[526,{"$f":"IF('Optimum Moisture'!$L$38=\"\",\"\",'Optimum Moisture'!$L$38)","v":""},{"$f":"IF('Optimum Moisture'!$B$6=\"\",\"\",'Optimum Moisture'!$B$6)","v":"Tex-120-E : PART II"},{"$f":"IF('Optimum Moisture'!$B$38=\"\",\"\",'Optimum Moisture'!$B$38)","v":"Vol. of Specimen, ft^3"},{"$f":"IF('Optimum Moisture'!$J$26=\"\",\"\",'Optimum Moisture'!$J$26)","v":2},{"$f":"IF('Optimum Moisture'!$L$28=\"\",\"\",'Optimum Moisture'!$L$28)","v":"2-3"}]
[527,{"$f":"IF('Optimum Moisture'!$M$38=\"\",\"\",'Optimum Moisture'!$M$38)","v":""},{"$f":"IF('Optimum Moisture'!$B$6=\"\",\"\",'Optimum Moisture'!$B$6)","v":"Tex-120-E : PART II"},{"$f":"IF('Optimum Moisture'!$B$38=\"\",\"\",'Optimum Moisture'!$B$38)","v":"Vol. of Specimen, ft^3"},{"$f":"IF('Optimum Moisture'!$M$26=\"\",\"\",'Optimum Moisture'!$M$26)","v":3},{"$f":"IF('Optimum Moisture'!$M$28=\"\",\"\",'Optimum Moisture'!$M$28)","v":"3-1"}]
[528,{"$f":"IF('Optimum Moisture'!$N$38=\"\",\"\",'Optimum Moisture'!$N$38)","v":""},{"$f":"IF('Optimum Moisture'!$B$6=\"\",\"\",'Optimum Moisture'!$B$6)","v":"Tex-120-E : PART II"},{"$f":"IF('Optimum Moisture'!$B$38=\"\",\"\",'Optimum Moisture'!$B$38)","v":"Vol. of Specimen, ft^3"},{"$f":"IF('Optimum Moisture'!$M$26=\"\",\"\",'Optimum Moisture'!$M$26)","v":3},{"$f":"IF('Optimum Moisture'!$N$28=\"\",\"\",'Optimum Moisture'!$N$28)","v":"3-2"}]
[529,{"$f":"IF('Optimum Moisture'!$O$38=\"\",\"\",'Optimum Moisture'!$O$38)","v":""},{"$f":"IF('Optimum Moisture'!$B$6=\"\",\"\",'Optimum Moisture'!$B$6)","v":"Tex-120-E : PART II"},{"$f":"IF('Optimum Moisture'!$B$38=\"\",\"\",'Optimum Moisture'!$B$38)","v":"Vol. of Specimen, ft^3"},{"$f":"IF('Optimum Moisture'!$M$26=\"\",\"\",'Optimum Moisture'!$M$26)","v":3},{"$f":"IF('Optimum Moisture'!$O$28=\"\",\"\",'Optimum Moisture'!$O$28)","v":"3-3"}]
[530,{"$f":"IF('Optimum Moisture'!$P$38=\"\",\"\",'Optimum Moisture'!$P$38)","v":""},{"$f":"IF('Optimum Moisture'!$B$6=\"\",\"\",'Optimum Moisture'!$B$6)","v":"Tex-120-E : PART II"},{"$f":"IF('Optimum Moisture'!$B$38=\"\",\"\",'Optimum Moisture'!$B$38)","v":"Vol. of Specimen, ft^3"},{"$f":"IF('Optimum Moisture'!$P$26=\"\",\"\",'Optimum Moisture'!$P$26)","v":4},{"$f":"IF('Optimum Moisture'!$P$28=\"\",\"\",'Optimum Moisture'!$P$28)","v":"4-1"}]
[531,{"$f":"IF('Optimum Moisture'!$Q$38=\"\",\"\",'Optimum Moisture'!$Q$38)","v":""},{"$f":"IF('Optimum Moisture'!$B$6=\"\",\"\",'Optimum Moisture'!$B$6)","v":"Tex-120-E : PART II"},{"$f":"IF('Optimum Moisture'!$B$38=\"\",\"\",'Optimum Moisture'!$B$38)","v":"Vol. of Specimen, ft^3"},{"$f":"IF('Optimum Moisture'!$P$26=\"\",\"\",'Optimum Moisture'!$P$26)","v":4},{"$f":"IF('Optimum Moisture'!$Q$28=\"\",\"\",'Optimum Moisture'!$Q$28)","v":"4-2"}]
[532,{"$f":"IF('Optimum Moisture'!$R$38=\"\",\"\",'Optimum Moisture'!$R$38)","v":""},{"$f":"IF('Optimum Moisture'!$B$6=\"\",\"\",'Optimum Moisture'!$B$6)","v":"Tex-120-E : PART II"},{"$f":"IF('Optimum Moisture'!$B$38=\"\",\"\",'Optimum Moisture'!$B$38)","v":"Vol. of Specimen, ft^3"},{"$f":"IF('Optimum Moisture'!$P$26=\"\",\"\",'Optimum Moisture'!$P$26)","v":4},{"$f":"IF('Optimum Moisture'!$R$28=\"\",\"\",'Optimum Moisture'!$R$28)","v":"4-3"}]
[533,{"$f":"IF('Optimum Moisture'!$G$39=\"\",\"\",'Optimum Moisture'!$G$39)","v":""},{"$f":"IF('Optimum Moisture'!$B$6=\"\",\"\",'Optimum Moisture'!$B$6)","v":"Tex-120-E : PART II"},{"$f":"IF('Optimum Moisture'!$B$39=\"\",\"\",'Optimum Moisture'!$B$39)","v":"Wet Density of Specimen"},{"$f":"IF('Optimum Moisture'!$G$26=\"\",\"\",'Optimum Moisture'!$G$26)","v":1},{"$f":"IF('Optimum Moisture'!$G$28=\"\",\"\",'Optimum Moisture'!$G$28)","v":"1-1"}]
[534,{"$f":"IF('Optimum Moisture'!$H$39=\"\",\"\",'Optimum Moisture'!$H$39)","v":""},{"$f":"IF('Optimum Moisture'!$B$6=\"\",\"\",'Optimum Moisture'!$B$6)","v":"Tex-120-E : PART II"},{"$f":"IF('Optimum Moisture'!$B$39=\"\",\"\",'Optimum Moisture'!$B$39)","v":"Wet Density of Specimen"},{"$f":"IF('Optimum Moisture'!$G$26=\"\",\"\",'Optimum Moisture'!$G$26)","v":1},{"$f":"IF('Optimum Moisture'!$H$28=\"\",\"\",'Optimum Moisture'!$H$28)","v":"1-2"}]
[535,{"$f":"IF('Optimum Moisture'!$I$39=\"\",\"\",'Optimum Moisture'!$I$39)","v":""},{"$f":"IF('Optimum Moisture'!$B$6=\"\",\"\",'Optimum Moisture'!$B$6)","v":"Tex-120-E : PART II"},{"$f":"IF('Optimum Moisture'!$B$39=\"\",\"\",'Optimum Moisture'!$B$39)","v":"Wet Density of Specimen"},{"$f":"IF('Optimum Moisture'!$G$26=\"\",\"\",'Optimum Moisture'!$G$26)","v":1},{"$f":"IF('Optimum Moisture'!$I$28=\"\",\"\",'Optimum Moisture'!$I$28)","v":"1-3"}]
[536,{"$f":"IF('Optimum Moisture'!$J$39=\"\",\"\",'Optimum Moisture'!$J$39)","v":""},{"$f":"IF('Optimum Moisture'!$B$6=\"\",\"\",'Optimum Moisture'!$B$6)","v":"Tex-120-E : PART II"},{"$f":"IF('Optimum Moisture'!$B$39=\"\",\"\",'Optimum Moisture'!$B$39)","v":"Wet Density of Specimen"},{"$f":"IF('Optimum Moisture'!$J$26=\"\",\"\",'Optimum Moisture'!$J$26)","v":2},{"$f":"IF('Optimum Moisture'!$J$28=\"\",\"\",'Optimum Moisture'!$J$28)","v":"2-1"}]
[537,{"$f":"IF('Optimum Moisture'!$K$39=\"\",\"\",'Optimum Moisture'!$K$39)","v":""},{"$f":"IF('Optimum Moisture'!$B$6=\"\",\"\",'Optimum Moisture'!$B$6)","v":"Tex-120-E : PART II"},{"$f":"IF('Optimum Moisture'!$B$39=\"\",\"\",'Optimum Moisture'!$B$39)","v":"Wet Density of Specimen"},{"$f":"IF('Optimum Moisture'!$J$26=\"\",\"\",'Optimum Moisture'!$J$26)","v":2},{"$f":"IF('Optimum Moisture'!$K$28=\"\",\"\",'Optimum Moisture'!$K$28)","v":"2-2"}]
[538,{"$f":"IF('Optimum Moisture'!$L$39=\"\",\"\",'Optimum Moisture'!$L$39)","v":""},{"$f":"IF('Optimum Moisture'!$B$6=\"\",\"\",'Optimum Moisture'!$B$6)","v":"Tex-120-E : PART II"},{"$f":"IF('Optimum Moisture'!$B$39=\"\",\"\",'Optimum Moisture'!$B$39)","v":"Wet Density of Specimen"},{"$f":"IF('Optimum Moisture'!$J$26=\"\",\"\",'Optimum Moisture'!$J$26)","v":2},{"$f":"IF('Optimum Moisture'!$L$28=\"\",\"\",'Optimum Moisture'!$L$28)","v":"2-3"}]
[539,{"$f":"IF('Optimum Moisture'!$M$39=\"\",\"\",'Optimum Moisture'!$M$39)","v":""},{"$f":"IF('Optimum Moisture'!$B$6=\"\",\"\",'Optimum Moisture'!$B$6)","v":"Tex-120-E : PART II"},{"$f":"IF('Optimum Moisture'!$B$39=\"\",\"\",'Optimum Moisture'!$B$39)","v":"Wet Density of Specimen"},{"$f":"IF('Optimum Moisture'!$M$26=\"\",\"\",'Optimum Moisture'!$M$26)","v":3},{"$f":"IF('Optimum Moisture'!$M$28=\"\",\"\",'Optimum Moisture'!$M$28)","v":"3-1"}]
[540,{"$f":"IF('Optimum Moisture'!$N$39=\"\",\"\",'Optimum Moisture'!$N$39)","v":""},{"$f":"IF('Optimum Moisture'!$B$6=\"\",\"\",'Optimum Moisture'!$B$6)","v":"Tex-120-E : PART II"},{"$f":"IF('Optimum Moisture'!$B$39=\"\",\"\",'Optimum Moisture'!$B$39)","v":"Wet Density of Specimen"},{"$f":"IF('Optimum Moisture'!$M$26=\"\",\"\",'Optimum Moisture'!$M$26)","v":3},{"$f":"IF('Optimum Moisture'!$N$28=\"\",\"\",'Optimum Moisture'!$N$28)","v":"3-2"}]
[541,{"$f":"IF('Optimum Moisture'!$O$39=\"\",\"\",'Optimum Moisture'!$O$39)","v":""},{"$f":"IF('Optimum Moisture'!$B$6=\"\",\"\",'Optimum Moisture'!$B$6)","v":"Tex-120-E : PART II"},{"$f":"IF('Optimum Moisture'!$B$39=\"\",\"\",'Optimum Moisture'!$B$39)","v":"Wet Density of Specimen"},{"$f":"IF('Optimum Moisture'!$M$26=\"\",\"\",'Optimum Moisture'!$M$26)","v":3},{"$f":"IF('Optimum Moisture'!$O$28=\"\",\"\",'Optimum Moisture'!$O$28)","v":"3-3"}]
[542,{"$f":"IF('Optimum Moisture'!$P$39=\"\",\"\",'Optimum Moisture'!$P$39)","v":""},{"$f":"IF('Optimum Moisture'!$B$6=\"\",\"\",'Optimum Moisture'!$B$6)","v":"Tex-120-E : PART II"},{"$f":"IF('Optimum Moisture'!$B$39=\"\",\"\",'Optimum Moisture'!$B$39)","v":"Wet Density of Specimen"},{"$f":"IF('Optimum Moisture'!$P$26=\"\",\"\",'Optimum Moisture'!$P$26)","v":4},{"$f":"IF('Optimum Moisture'!$P$28=\"\",\"\",'Optimum Moisture'!$P$28)","v":"4-1"}]
[543,{"$f":"IF('Optimum Moisture'!$Q$39=\"\",\"\",'Optimum Moisture'!$Q$39)","v":""},{"$f":"IF('Optimum Moisture'!$B$6=\"\",\"\",'Optimum Moisture'!$B$6)","v":"Tex-120-E : PART II"},{"$f":"IF('Optimum Moisture'!$B$39=\"\",\"\",'Optimum Moisture'!$B$39)","v":"Wet Density of Specimen"},{"$f":"IF('Optimum Moisture'!$P$26=\"\",\"\",'Optimum Moisture'!$P$26)","v":4},{"$f":"IF('Optimum Moisture'!$Q$28=\"\",\"\",'Optimum Moisture'!$Q$28)","v":"4-2"}]
[544,{"$f":"IF('Optimum Moisture'!$R$39=\"\",\"\",'Optimum Moisture'!$R$39)","v":""},{"$f":"IF('Optimum Moisture'!$B$6=\"\",\"\",'Optimum Moisture'!$B$6)","v":"Tex-120-E : PART II"},{"$f":"IF('Optimum Moisture'!$B$39=\"\",\"\",'Optimum Moisture'!$B$39)","v":"Wet Density of Specimen"},{"$f":"IF('Optimum Moisture'!$P$26=\"\",\"\",'Optimum Moisture'!$P$26)","v":4},{"$f":"IF('Optimum Moisture'!$R$28=\"\",\"\",'Optimum Moisture'!$R$28)","v":"4-3"}]
[545,{"$f":"IF('Optimum Moisture'!$G$40=\"\",\"\",'Optimum Moisture'!$G$40)","v":""},{"$f":"IF('Optimum Moisture'!$B$6=\"\",\"\",'Optimum Moisture'!$B$6)","v":"Tex-120-E : PART II"},{"$f":"IF('Optimum Moisture'!$B$40=\"\",\"\",'Optimum Moisture'!$B$40)","v":"Wet Mass of Pan & Specimen"},{"$f":"IF('Optimum Moisture'!$G$26=\"\",\"\",'Optimum Moisture'!$G$26)","v":1},{"$f":"IF('Optimum Moisture'!$G$28=\"\",\"\",'Optimum Moisture'!$G$28)","v":"1-1"}]
[546,{"$f":"IF('Optimum Moisture'!$H$40=\"\",\"\",'Optimum Moisture'!$H$40)","v":""},{"$f":"IF('Optimum Moisture'!$B$6=\"\",\"\",'Optimum Moisture'!$B$6)","v":"Tex-120-E : PART II"},{"$f":"IF('Optimum Moisture'!$B$40=\"\",\"\",'Optimum Moisture'!$B$40)","v":"Wet Mass of Pan & Specimen"},{"$f":"IF('Optimum Moisture'!$G$26=\"\",\"\",'Optimum Moisture'!$G$26)","v":1},{"$f":"IF('Optimum Moisture'!$H$28=\"\",\"\",'Optimum Moisture'!$H$28)","v":"1-2"}]
[547,{"$f":"IF('Optimum Moisture'!$I$40=\"\",\"\",'Optimum Moisture'!$I$40)","v":""},{"$f":"IF('Optimum Moisture'!$B$6=\"\",\"\",'Optimum Moisture'!$B$6)","v":"Tex-120-E : PART II"},{"$f":"IF('Optimum Moisture'!$B$40=\"\",\"\",'Optimum Moisture'!$B$40)","v":"Wet Mass of Pan & Specimen"},{"$f":"IF('Optimum Moisture'!$G$26=\"\",\"\",'Optimum Moisture'!$G$26)","v":1},{"$f":"IF('Optimum Moisture'!$I$28=\"\",\"\",'Optimum Moisture'!$I$28)","v":"1-3"}]
[548,{"$f":"IF('Optimum Moisture'!$J$40=\"\",\"\",'Optimum Moisture'!$J$40)","v":""},{"$f":"IF('Optimum Moisture'!$B$6=\"\",\"\",'Optimum Moisture'!$B$6)","v":"Tex-120-E : PART II"},{"$f":"IF('Optimum Moisture'!$B$40=\"\",\"\",'Optimum Moisture'!$B$40)","v":"Wet Mass of Pan & Specimen"},{"$f":"IF('Optimum Moisture'!$J$26=\"\",\"\",'Optimum Moisture'!$J$26)","v":2},{"$f":"IF('Optimum Moisture'!$J$28=\"\",\"\",'Optimum Moisture'!$J$28)","v":"2-1"}]
[549,{"$f":"IF('Optimum Moisture'!$K$40=\"\",\"\",'Optimum Moisture'!$K$40)","v":""},{"$f":"IF('Optimum Moisture'!$B$6=\"\",\"\",'Optimum Moisture'!$B$6)","v":"Tex-120-E : PART II"},{"$f":"IF('Optimum Moisture'!$B$40=\"\",\"\",'Optimum Moisture'!$B$40)","v":"Wet Mass of Pan & Specimen"},{"$f":"IF('Optimum Moisture'!$J$26=\"\",\"\",'Optimum Moisture'!$J$26)","v":2},{"$f":"IF('Optimum Moisture'!$K$28=\"\",\"\",'Optimum Moisture'!$K$28)","v":"2-2"}]
[550,{"$f":"IF('Optimum Moisture'!$L$40=\"\",\"\",'Optimum Moisture'!$L$40)","v":""},{"$f":"IF('Optimum Moisture'!$B$6=\"\",\"\",'Optimum Moisture'!$B$6)","v":"Tex-120-E : PART II"},{"$f":"IF('Optimum Moisture'!$B$40=\"\",\"\",'Optimum Moisture'!$B$40)","v":"Wet Mass of Pan & Specimen"},{"$f":"IF('Optimum Moisture'!$J$26=\"\",\"\",'Optimum Moisture'!$J$26)","v":2},{"$f":"IF('Optimum Moisture'!$L$28=\"\",\"\",'Optimum Moisture'!$L$28)","v":"2-3"}]
[551,{"$f":"IF('Optimum Moisture'!$M$40=\"\",\"\",'Optimum Moisture'!$M$40)","v":""},{"$f":"IF('Optimum Moisture'!$B$6=\"\",\"\",'Optimum Moisture'!$B$6)","v":"Tex-120-E : PART II"},{"$f":"IF('Optimum Moisture'!$B$40=\"\",\"\",'Optimum Moisture'!$B$40)","v":"Wet Mass of Pan & Specimen"},{"$f":"IF('Optimum Moisture'!$M$26=\"\",\"\",'Optimum Moisture'!$M$26)","v":3},{"$f":"IF('Optimum Moisture'!$M$28=\"\",\"\",'Optimum Moisture'!$M$28)","v":"3-1"}]
[552,{"$f":"IF('Optimum Moisture'!$N$40=\"\",\"\",'Optimum Moisture'!$N$40)","v":""},{"$f":"IF('Optimum Moisture'!$B$6=\"\",\"\",'Optimum Moisture'!$B$6)","v":"Tex-120-E : PART II"},{"$f":"IF('Optimum Moisture'!$B$40=\"\",\"\",'Optimum Moisture'!$B$40)","v":"Wet Mass of Pan & Specimen"},{"$f":"IF('Optimum Moisture'!$M$26=\"\",\"\",'Optimum Moisture'!$M$26)","v":3},{"$f":"IF('Optimum Moisture'!$N$28=\"\",\"\",'Optimum Moisture'!$N$28)","v":"3-2"}]
[553,{"$f":"IF('Optimum Moisture'!$O$40=\"\",\"\",'Optimum Moisture'!$O$40)","v":""},{"$f":"IF('Optimum Moisture'!$B$6=\"\",\"\",'Optimum Moisture'!$B$6)","v":"Tex-120-E : PART II"},{"$f":"IF('Optimum Moisture'!$B$40=\"\",\"\",'Optimum Moisture'!$B$40)","v":"Wet Mass of Pan & Specimen"},{"$f":"IF('Optimum Moisture'!$M$26=\"\",\"\",'Optimum Moisture'!$M$26)","v":3},{"$f":"IF('Optimum Moisture'!$O$28=\"\",\"\",'Optimum Moisture'!$O$28)","v":"3-3"}]
[554,{"$f":"IF('Optimum Moisture'!$P$40=\"\",\"\",'Optimum Moisture'!$P$40)","v":""},{"$f":"IF('Optimum Moisture'!$B$6=\"\",\"\",'Optimum Moisture'!$B$6)","v":"Tex-120-E : PART II"},{"$f":"IF('Optimum Moisture'!$B$40=\"\",\"\",'Optimum Moisture'!$B$40)","v":"Wet Mass of Pan & Specimen"},{"$f":"IF('Optimum Moisture'!$P$26=\"\",\"\",'Optimum Moisture'!$P$26)","v":4},{"$f":"IF('Optimum Moisture'!$P$28=\"\",\"\",'Optimum Moisture'!$P$28)","v":"4-1"}]
[555,{"$f":"IF('Optimum Moisture'!$Q$40=\"\",\"\",'Optimum Moisture'!$Q$40)","v":""},{"$f":"IF('Optimum Moisture'!$B$6=\"\",\"\",'Optimum Moisture'!$B$6)","v":"Tex-120-E : PART II"},{"$f":"IF('Optimum Moisture'!$B$40=\"\",\"\",'Optimum Moisture'!$B$40)","v":"Wet Mass of Pan & Specimen"},{"$f":"IF('Optimum Moisture'!$P$26=\"\",\"\",'Optimum Moisture'!$P$26)","v":4},{"$f":"IF('Optimum Moisture'!$Q$28=\"\",\"\",'Optimum Moisture'!$Q$28)","v":"4-2"}]
[556,{"$f":"IF('Optimum Moisture'!$R$40=\"\",\"\",'Optimum Moisture'!$R$40)","v":""},{"$f":"IF('Optimum Moisture'!$B$6=\"\",\"\",'Optimum Moisture'!$B$6)","v":"Tex-120-E : PART II"},{"$f":"IF('Optimum Moisture'!$B$40=\"\",\"\",'Optimum Moisture'!$B$40)","v":"Wet Mass of Pan & Specimen"},{"$f":"IF('Optimum Moisture'!$P$26=\"\",\"\",'Optimum Moisture'!$P$26)","v":4},{"$f":"IF('Optimum Moisture'!$R$28=\"\",\"\",'Optimum Moisture'!$R$28)","v":"4-3"}]
[557,{"$f":"IF('Optimum Moisture'!$G$41=\"\",\"\",'Optimum Moisture'!$G$41)","v":""},{"$f":"IF('Optimum Moisture'!$B$6=\"\",\"\",'Optimum Moisture'!$B$6)","v":"Tex-120-E : PART II"},{"$f":"IF('Optimum Moisture'!$B$41=\"\",\"\",'Optimum Moisture'!$B$41)","v":"Dry Mass Pan & Specimen,lb"},{"$f":"IF('Optimum Moisture'!$G$26=\"\",\"\",'Optimum Moisture'!$G$26)","v":1},{"$f":"IF('Optimum Moisture'!$G$28=\"\",\"\",'Optimum Moisture'!$G$28)","v":"1-1"}]
[558,{"$f":"IF('Optimum Moisture'!$H$41=\"\",\"\",'Optimum Moisture'!$H$41)","v":""},{"$f":"IF('Optimum Moisture'!$B$6=\"\",\"\",'Optimum Moisture'!$B$6)","v":"Tex-120-E : PART II"},{"$f":"IF('Optimum Moisture'!$B$41=\"\",\"\",'Optimum Moisture'!$B$41)","v":"Dry Mass Pan & Specimen,lb"},{"$f":"IF('Optimum Moisture'!$G$26=\"\",\"\",'Optimum Moisture'!$G$26)","v":1},{"$f":"IF('Optimum Moisture'!$H$28=\"\",\"\",'Optimum Moisture'!$H$28)","v":"1-2"}]
[559,{"$f":"IF('Optimum Moisture'!$I$41=\"\",\"\",'Optimum Moisture'!$I$41)","v":""},{"$f":"IF('Optimum Moisture'!$B$6=\"\",\"\",'Optimum Moisture'!$B$6)","v":"Tex-120-E : PART II"},{"$f":"IF('Optimum Moisture'!$B$41=\"\",\"\",'Optimum Moisture'!$B$41)","v":"Dry Mass Pan & Specimen,lb"},{"$f":"IF('Optimum Moisture'!$G$26=\"\",\"\",'Optimum Moisture'!$G$26)","v":1},{"$f":"IF('Optimum Moisture'!$I$28=\"\",\"\",'Optimum Moisture'!$I$28)","v":"1-3"}]
[560,{"$f":"IF('Optimum Moisture'!$J$41=\"\",\"\",'Optimum Moisture'!$J$41)","v":""},{"$f":"IF('Optimum Moisture'!$B$6=\"\",\"\",'Optimum Moisture'!$B$6)","v":"Tex-120-E : PART II"},{"$f":"IF('Optimum Moisture'!$B$41=\"\",\"\",'Optimum Moisture'!$B$41)","v":"Dry Mass Pan & Specimen,lb"},{"$f":"IF('Optimum Moisture'!$J$26=\"\",\"\",'Optimum Moisture'!$J$26)","v":2},{"$f":"IF('Optimum Moisture'!$J$28=\"\",\"\",'Optimum Moisture'!$J$28)","v":"2-1"}]
[561,{"$f":"IF('Optimum Moisture'!$K$41=\"\",\"\",'Optimum Moisture'!$K$41)","v":""},{"$f":"IF('Optimum Moisture'!$B$6=\"\",\"\",'Optimum Moisture'!$B$6)","v":"Tex-120-E : PART II"},{"$f":"IF('Optimum Moisture'!$B$41=\"\",\"\",'Optimum Moisture'!$B$41)","v":"Dry Mass Pan & Specimen,lb"},{"$f":"IF('Optimum Moisture'!$J$26=\"\",\"\",'Optimum Moisture'!$J$26)","v":2},{"$f":"IF('Optimum Moisture'!$K$28=\"\",\"\",'Optimum Moisture'!$K$28)","v":"2-2"}]
[562,{"$f":"IF('Optimum Moisture'!$L$41=\"\",\"\",'Optimum Moisture'!$L$41)","v":""},{"$f":"IF('Optimum Moisture'!$B$6=\"\",\"\",'Optimum Moisture'!$B$6)","v":"Tex-120-E : PART II"},{"$f":"IF('Optimum Moisture'!$B$41=\"\",\"\",'Optimum Moisture'!$B$41)","v":"Dry Mass Pan & Specimen,lb"},{"$f":"IF('Optimum Moisture'!$J$26=\"\",\"\",'Optimum Moisture'!$J$26)","v":2},{"$f":"IF('Optimum Moisture'!$L$28=\"\",\"\",'Optimum Moisture'!$L$28)","v":"2-3"}]
[563,{"$f":"IF('Optimum Moisture'!$M$41=\"\",\"\",'Optimum Moisture'!$M$41)","v":""},{"$f":"IF('Optimum Moisture'!$B$6=\"\",\"\",'Optimum Moisture'!$B$6)","v":"Tex-120-E : PART II"},{"$f":"IF('Optimum Moisture'!$B$41=\"\",\"\",'Optimum Moisture'!$B$41)","v":"Dry Mass Pan & Specimen,lb"},{"$f":"IF('Optimum Moisture'!$M$26=\"\",\"\",'Optimum Moisture'!$M$26)","v":3},{"$f":"IF('Optimum Moisture'!$M$28=\"\",\"\",'Optimum Moisture'!$M$28)","v":"3-1"}]
[564,{"$f":"IF('Optimum Moisture'!$N$41=\"\",\"\",'Optimum Moisture'!$N$41)","v":""},{"$f":"IF('Optimum Moisture'!$B$6=\"\",\"\",'Optimum Moisture'!$B$6)","v":"Tex-120-E : PART II"},{"$f":"IF('Optimum Moisture'!$B$41=\"\",\"\",'Optimum Moisture'!$B$41)","v":"Dry Mass Pan & Specimen,lb"},{"$f":"IF('Optimum Moisture'!$M$26=\"\",\"\",'Optimum Moisture'!$M$26)","v":3},{"$f":"IF('Optimum Moisture'!$N$28=\"\",\"\",'Optimum Moisture'!$N$28)","v":"3-2"}]
[565,{"$f":"IF('Optimum Moisture'!$O$41=\"\",\"\",'Optimum Moisture'!$O$41)","v":""},{"$f":"IF('Optimum Moisture'!$B$6=\"\",\"\",'Optimum Moisture'!$B$6)","v":"Tex-120-E : PART II"},{"$f":"IF('Optimum Moisture'!$B$41=\"\",\"\",'Optimum Moisture'!$B$41)","v":"Dry Mass Pan & Specimen,lb"},{"$f":"IF('Optimum Moisture'!$M$26=\"\",\"\",'Optimum Moisture'!$M$26)","v":3},{"$f":"IF('Optimum Moisture'!$O$28=\"\",\"\",'Optimum Moisture'!$O$28)","v":"3-3"}]
[566,{"$f":"IF('Optimum Moisture'!$P$41=\"\",\"\",'Optimum Moisture'!$P$41)","v":""},{"$f":"IF('Optimum Moisture'!$B$6=\"\",\"\",'Optimum Moisture'!$B$6)","v":"Tex-120-E : PART II"},{"$f":"IF('Optimum Moisture'!$B$41=\"\",\"\",'Optimum Moisture'!$B$41)","v":"Dry Mass Pan & Specimen,lb"},{"$f":"IF('Optimum Moisture'!$P$26=\"\",\"\",'Optimum Moisture'!$P$26)","v":4},{"$f":"IF('Optimum Moisture'!$P$28=\"\",\"\",'Optimum Moisture'!$P$28)","v":"4-1"}]
[567,{"$f":"IF('Optimum Moisture'!$Q$41=\"\",\"\",'Optimum Moisture'!$Q$41)","v":""},{"$f":"IF('Optimum Moisture'!$B$6=\"\",\"\",'Optimum Moisture'!$B$6)","v":"Tex-120-E : PART II"},{"$f":"IF('Optimum Moisture'!$B$41=\"\",\"\",'Optimum Moisture'!$B$41)","v":"Dry Mass Pan & Specimen,lb"},{"$f":"IF('Optimum Moisture'!$P$26=\"\",\"\",'Optimum Moisture'!$P$26)","v":4},{"$f":"IF('Optimum Moisture'!$Q$28=\"\",\"\",'Optimum Moisture'!$Q$28)","v":"4-2"}]
[568,{"$f":"IF('Optimum Moisture'!$R$41=\"\",\"\",'Optimum Moisture'!$R$41)","v":""},{"$f":"IF('Optimum Moisture'!$B$6=\"\",\"\",'Optimum Moisture'!$B$6)","v":"Tex-120-E : PART II"},{"$f":"IF('Optimum Moisture'!$B$41=\"\",\"\",'Optimum Moisture'!$B$41)","v":"Dry Mass Pan & Specimen,lb"},{"$f":"IF('Optimum Moisture'!$P$26=\"\",\"\",'Optimum Moisture'!$P$26)","v":4},{"$f":"IF('Optimum Moisture'!$R$28=\"\",\"\",'Optimum Moisture'!$R$28)","v":"4-3"}]
[569,{"$f":"IF('Optimum Moisture'!$G$42=\"\",\"\",'Optimum Moisture'!$G$42)","v":""},{"$f":"IF('Optimum Moisture'!$B$6=\"\",\"\",'Optimum Moisture'!$B$6)","v":"Tex-120-E : PART II"},{"$f":"IF('Optimum Moisture'!$B$42=\"\",\"\",'Optimum Moisture'!$B$42)","v":"Tare Mass Pan ,lb"},{"$f":"IF('Optimum Moisture'!$G$26=\"\",\"\",'Optimum Moisture'!$G$26)","v":1},{"$f":"IF('Optimum Moisture'!$G$28=\"\",\"\",'Optimum Moisture'!$G$28)","v":"1-1"}]
[570,{"$f":"IF('Optimum Moisture'!$H$42=\"\",\"\",'Optimum Moisture'!$H$42)","v":""},{"$f":"IF('Optimum Moisture'!$B$6=\"\",\"\",'Optimum Moisture'!$B$6)","v":"Tex-120-E : PART II"},{"$f":"IF('Optimum Moisture'!$B$42=\"\",\"\",'Optimum Moisture'!$B$42)","v":"Tare Mass Pan ,lb"},{"$f":"IF('Optimum Moisture'!$G$26=\"\",\"\",'Optimum Moisture'!$G$26)","v":1},{"$f":"IF('Optimum Moisture'!$H$28=\"\",\"\",'Optimum Moisture'!$H$28)","v":"1-2"}]
[571,{"$f":"IF('Optimum Moisture'!$I$42=\"\",\"\",'Optimum Moisture'!$I$42)","v":""},{"$f":"IF('Optimum Moisture'!$B$6=\"\",\"\",'Optimum Moisture'!$B$6)","v":"Tex-120-E : PART II"},{"$f":"IF('Optimum Moisture'!$B$42=\"\",\"\",'Optimum Moisture'!$B$42)","v":"Tare Mass Pan ,lb"},{"$f":"IF('Optimum Moisture'!$G$26=\"\",\"\",'Optimum Moisture'!$G$26)","v":1},{"$f":"IF('Optimum Moisture'!$I$28=\"\",\"\",'Optimum Moisture'!$I$28)","v":"1-3"}]
[572,{"$f":"IF('Optimum Moisture'!$J$42=\"\",\"\",'Optimum Moisture'!$J$42)","v":""},{"$f":"IF('Optimum Moisture'!$B$6=\"\",\"\",'Optimum Moisture'!$B$6)","v":"Tex-120-E : PART II"},{"$f":"IF('Optimum Moisture'!$B$42=\"\",\"\",'Optimum Moisture'!$B$42)","v":"Tare Mass Pan ,lb"},{"$f":"IF('Optimum Moisture'!$J$26=\"\",\"\",'Optimum Moisture'!$J$26)","v":2},{"$f":"IF('Optimum Moisture'!$J$28=\"\",\"\",'Optimum Moisture'!$J$28)","v":"2-1"}]
[573,{"$f":"IF('Optimum Moisture'!$K$42=\"\",\"\",'Optimum Moisture'!$K$42)","v":""},{"$f":"IF('Optimum Moisture'!$B$6=\"\",\"\",'Optimum Moisture'!$B$6)","v":"Tex-120-E : PART II"},{"$f":"IF('Optimum Moisture'!$B$42=\"\",\"\",'Optimum Moisture'!$B$42)","v":"Tare Mass Pan ,lb"},{"$f":"IF('Optimum Moisture'!$J$26=\"\",\"\",'Optimum Moisture'!$J$26)","v":2},{"$f":"IF('Optimum Moisture'!$K$28=\"\",\"\",'Optimum Moisture'!$K$28)","v":"2-2"}]
[574,{"$f":"IF('Optimum Moisture'!$L$42=\"\",\"\",'Optimum Moisture'!$L$42)","v":""},{"$f":"IF('Optimum Moisture'!$B$6=\"\",\"\",'Optimum Moisture'!$B$6)","v":"Tex-120-E : PART II"},{"$f":"IF('Optimum Moisture'!$B$42=\"\",\"\",'Optimum Moisture'!$B$42)","v":"Tare Mass Pan ,lb"},{"$f":"IF('Optimum Moisture'!$J$26=\"\",\"\",'Optimum Moisture'!$J$26)","v":2},{"$f":"IF('Optimum Moisture'!$L$28=\"\",\"\",'Optimum Moisture'!$L$28)","v":"2-3"}]
[575,{"$f":"IF('Optimum Moisture'!$M$42=\"\",\"\",'Optimum Moisture'!$M$42)","v":""},{"$f":"IF('Optimum Moisture'!$B$6=\"\",\"\",'Optimum Moisture'!$B$6)","v":"Tex-120-E : PART II"},{"$f":"IF('Optimum Moisture'!$B$42=\"\",\"\",'Optimum Moisture'!$B$42)","v":"Tare Mass Pan ,lb"},{"$f":"IF('Optimum Moisture'!$M$26=\"\",\"\",'Optimum Moisture'!$M$26)","v":3},{"$f":"IF('Optimum Moisture'!$M$28=\"\",\"\",'Optimum Moisture'!$M$28)","v":"3-1"}]
[576,{"$f":"IF('Optimum Moisture'!$N$42=\"\",\"\",'Optimum Moisture'!$N$42)","v":""},{"$f":"IF('Optimum Moisture'!$B$6=\"\",\"\",'Optimum Moisture'!$B$6)","v":"Tex-120-E : PART II"},{"$f":"IF('Optimum Moisture'!$B$42=\"\",\"\",'Optimum Moisture'!$B$42)","v":"Tare Mass Pan ,lb"},{"$f":"IF('Optimum Moisture'!$M$26=\"\",\"\",'Optimum Moisture'!$M$26)","v":3},{"$f":"IF('Optimum Moisture'!$N$28=\"\",\"\",'Optimum Moisture'!$N$28)","v":"3-2"}]
[577,{"$f":"IF('Optimum Moisture'!$O$42=\"\",\"\",'Optimum Moisture'!$O$42)","v":""},{"$f":"IF('Optimum Moisture'!$B$6=\"\",\"\",'Optimum Moisture'!$B$6)","v":"Tex-120-E : PART II"},{"$f":"IF('Optimum Moisture'!$B$42=\"\",\"\",'Optimum Moisture'!$B$42)","v":"Tare Mass Pan ,lb"},{"$f":"IF('Optimum Moisture'!$M$26=\"\",\"\",'Optimum Moisture'!$M$26)","v":3},{"$f":"IF('Optimum Moisture'!$O$28=\"\",\"\",'Optimum Moisture'!$O$28)","v":"3-3"}]
[578,{"$f":"IF('Optimum Moisture'!$P$42=\"\",\"\",'Optimum Moisture'!$P$42)","v":""},{"$f":"IF('Optimum Moisture'!$B$6=\"\",\"\",'Optimum Moisture'!$B$6)","v":"Tex-120-E : PART II"},{"$f":"IF('Optimum Moisture'!$B$42=\"\",\"\",'Optimum Moisture'!$B$42)","v":"Tare Mass Pan ,lb"},{"$f":"IF('Optimum Moisture'!$P$26=\"\",\"\",'Optimum Moisture'!$P$26)","v":4},{"$f":"IF('Optimum Moisture'!$P$28=\"\",\"\",'Optimum Moisture'!$P$28)","v":"4-1"}]
[579,{"$f":"IF('Optimum Moisture'!$Q$42=\"\",\"\",'Optimum Moisture'!$Q$42)","v":""},{"$f":"IF('Optimum Moisture'!$B$6=\"\",\"\",'Optimum Moisture'!$B$6)","v":"Tex-120-E : PART II"},{"$f":"IF('Optimum Moisture'!$B$42=\"\",\"\",'Optimum Moisture'!$B$42)","v":"Tare Mass Pan ,lb"},{"$f":"IF('Optimum Moisture'!$P$26=\"\",\"\",'Optimum Moisture'!$P$26)","v":4},{"$f":"IF('Optimum Moisture'!$Q$28=\"\",\"\",'Optimum Moisture'!$Q$28)","v":"4-2"}]
[580,{"$f":"IF('Optimum Moisture'!$R$42=\"\",\"\",'Optimum Moisture'!$R$42)","v":""},{"$f":"IF('Optimum Moisture'!$B$6=\"\",\"\",'Optimum Moisture'!$B$6)","v":"Tex-120-E : PART II"},{"$f":"IF('Optimum Moisture'!$B$42=\"\",\"\",'Optimum Moisture'!$B$42)","v":"Tare Mass Pan ,lb"},{"$f":"IF('Optimum Moisture'!$P$26=\"\",\"\",'Optimum Moisture'!$P$26)","v":4},{"$f":"IF('Optimum Moisture'!$R$28=\"\",\"\",'Optimum Moisture'!$R$28)","v":"4-3"}]
[581,{"$f":"IF('Optimum Moisture'!$G$43=\"\",\"\",'Optimum Moisture'!$G$43)","v":""},{"$f":"IF('Optimum Moisture'!$B$6=\"\",\"\",'Optimum Moisture'!$B$6)","v":"Tex-120-E : PART II"},{"$f":"IF('Optimum Moisture'!$B$43=\"\",\"\",'Optimum Moisture'!$B$43)","v":"Dry Mass Material , lb"},{"$f":"IF('Optimum Moisture'!$G$26=\"\",\"\",'Optimum Moisture'!$G$26)","v":1},{"$f":"IF('Optimum Moisture'!$G$28=\"\",\"\",'Optimum Moisture'!$G$28)","v":"1-1"}]
[582,{"$f":"IF('Optimum Moisture'!$H$43=\"\",\"\",'Optimum Moisture'!$H$43)","v":""},{"$f":"IF('Optimum Moisture'!$B$6=\"\",\"\",'Optimum Moisture'!$B$6)","v":"Tex-120-E : PART II"},{"$f":"IF('Optimum Moisture'!$B$43=\"\",\"\",'Optimum Moisture'!$B$43)","v":"Dry Mass Material , lb"},{"$f":"IF('Optimum Moisture'!$G$26=\"\",\"\",'Optimum Moisture'!$G$26)","v":1},{"$f":"IF('Optimum Moisture'!$H$28=\"\",\"\",'Optimum Moisture'!$H$28)","v":"1-2"}]
[583,{"$f":"IF('Optimum Moisture'!$I$43=\"\",\"\",'Optimum Moisture'!$I$43)","v":""},{"$f":"IF('Optimum Moisture'!$B$6=\"\",\"\",'Optimum Moisture'!$B$6)","v":"Tex-120-E : PART II"},{"$f":"IF('Optimum Moisture'!$B$43=\"\",\"\",'Optimum Moisture'!$B$43)","v":"Dry Mass Material , lb"},{"$f":"IF('Optimum Moisture'!$G$26=\"\",\"\",'Optimum Moisture'!$G$26)","v":1},{"$f":"IF('Optimum Moisture'!$I$28=\"\",\"\",'Optimum Moisture'!$I$28)","v":"1-3"}]
[584,{"$f":"IF('Optimum Moisture'!$J$43=\"\",\"\",'Optimum Moisture'!$J$43)","v":""},{"$f":"IF('Optimum Moisture'!$B$6=\"\",\"\",'Optimum Moisture'!$B$6)","v":"Tex-120-E : PART II"},{"$f":"IF('Optimum Moisture'!$B$43=\"\",\"\",'Optimum Moisture'!$B$43)","v":"Dry Mass Material , lb"},{"$f":"IF('Optimum Moisture'!$J$26=\"\",\"\",'Optimum Moisture'!$J$26)","v":2},{"$f":"IF('Optimum Moisture'!$J$28=\"\",\"\",'Optimum Moisture'!$J$28)","v":"2-1"}]
[585,{"$f":"IF('Optimum Moisture'!$K$43=\"\",\"\",'Optimum Moisture'!$K$43)","v":""},{"$f":"IF('Optimum Moisture'!$B$6=\"\",\"\",'Optimum Moisture'!$B$6)","v":"Tex-120-E : PART II"},{"$f":"IF('Optimum Moisture'!$B$43=\"\",\"\",'Optimum Moisture'!$B$43)","v":"Dry Mass Material , lb"},{"$f":"IF('Optimum Moisture'!$J$26=\"\",\"\",'Optimum Moisture'!$J$26)","v":2},{"$f":"IF('Optimum Moisture'!$K$28=\"\",\"\",'Optimum Moisture'!$K$28)","v":"2-2"}]
[586,{"$f":"IF('Optimum Moisture'!$L$43=\"\",\"\",'Optimum Moisture'!$L$43)","v":""},{"$f":"IF('Optimum Moisture'!$B$6=\"\",\"\",'Optimum Moisture'!$B$6)","v":"Tex-120-E : PART II"},{"$f":"IF('Optimum Moisture'!$B$43=\"\",\"\",'Optimum Moisture'!$B$43)","v":"Dry Mass Material , lb"},{"$f":"IF('Optimum Moisture'!$J$26=\"\",\"\",'Optimum Moisture'!$J$26)","v":2},{"$f":"IF('Optimum Moisture'!$L$28=\"\",\"\",'Optimum Moisture'!$L$28)","v":"2-3"}]
[587,{"$f":"IF('Optimum Moisture'!$M$43=\"\",\"\",'Optimum Moisture'!$M$43)","v":""},{"$f":"IF('Optimum Moisture'!$B$6=\"\",\"\",'Optimum Moisture'!$B$6)","v":"Tex-120-E : PART II"},{"$f":"IF('Optimum Moisture'!$B$43=\"\",\"\",'Optimum Moisture'!$B$43)","v":"Dry Mass Material , lb"},{"$f":"IF('Optimum Moisture'!$M$26=\"\",\"\",'Optimum Moisture'!$M$26)","v":3},{"$f":"IF('Optimum Moisture'!$M$28=\"\",\"\",'Optimum Moisture'!$M$28)","v":"3-1"}]
[588,{"$f":"IF('Optimum Moisture'!$N$43=\"\",\"\",'Optimum Moisture'!$N$43)","v":""},{"$f":"IF('Optimum Moisture'!$B$6=\"\",\"\",'Optimum Moisture'!$B$6)","v":"Tex-120-E : PART II"},{"$f":"IF('Optimum Moisture'!$B$43=\"\",\"\",'Optimum Moisture'!$B$43)","v":"Dry Mass Material , lb"},{"$f":"IF('Optimum Moisture'!$M$26=\"\",\"\",'Optimum Moisture'!$M$26)","v":3},{"$f":"IF('Optimum Moisture'!$N$28=\"\",\"\",'Optimum Moisture'!$N$28)","v":"3-2"}]
[589,{"$f":"IF('Optimum Moisture'!$O$43=\"\",\"\",'Optimum Moisture'!$O$43)","v":""},{"$f":"IF('Optimum Moisture'!$B$6=\"\",\"\",'Optimum Moisture'!$B$6)","v":"Tex-120-E : PART II"},{"$f":"IF('Optimum Moisture'!$B$43=\"\",\"\",'Optimum Moisture'!$B$43)","v":"Dry Mass Material , lb"},{"$f":"IF('Optimum Moisture'!$M$26=\"\",\"\",'Optimum Moisture'!$M$26)","v":3},{"$f":"IF('Optimum Moisture'!$O$28=\"\",\"\",'Optimum Moisture'!$O$28)","v":"3-3"}]
[590,{"$f":"IF('Optimum Moisture'!$P$43=\"\",\"\",'Optimum Moisture'!$P$43)","v":""},{"$f":"IF('Optimum Moisture'!$B$6=\"\",\"\",'Optimum Moisture'!$B$6)","v":"Tex-120-E : PART II"},{"$f":"IF('Optimum Moisture'!$B$43=\"\",\"\",'Optimum Moisture'!$B$43)","v":"Dry Mass Material , lb"},{"$f":"IF('Optimum Moisture'!$P$26=\"\",\"\",'Optimum Moisture'!$P$26)","v":4},{"$f":"IF('Optimum Moisture'!$P$28=\"\",\"\",'Optimum Moisture'!$P$28)","v":"4-1"}]
[591,{"$f":"IF('Optimum Moisture'!$Q$43=\"\",\"\",'Optimum Moisture'!$Q$43)","v":""},{"$f":"IF('Optimum Moisture'!$B$6=\"\",\"\",'Optimum Moisture'!$B$6)","v":"Tex-120-E : PART II"},{"$f":"IF('Optimum Moisture'!$B$43=\"\",\"\",'Optimum Moisture'!$B$43)","v":"Dry Mass Material , lb"},{"$f":"IF('Optimum Moisture'!$P$26=\"\",\"\",'Optimum Moisture'!$P$26)","v":4},{"$f":"IF('Optimum Moisture'!$Q$28=\"\",\"\",'Optimum Moisture'!$Q$28)","v":"4-2"}]
[592,{"$f":"IF('Optimum Moisture'!$R$43=\"\",\"\",'Optimum Moisture'!$R$43)","v":""},{"$f":"IF('Optimum Moisture'!$B$6=\"\",\"\",'Optimum Moisture'!$B$6)","v":"Tex-120-E : PART II"},{"$f":"IF('Optimum Moisture'!$B$43=\"\",\"\",'Optimum Moisture'!$B$43)","v":"Dry Mass Material , lb"},{"$f":"IF('Optimum Moisture'!$P$26=\"\",\"\",'Optimum Moisture'!$P$26)","v":4},{"$f":"IF('Optimum Moisture'!$R$28=\"\",\"\",'Optimum Moisture'!$R$28)","v":"4-3"}]
[593,{"$f":"IF('Optimum Moisture'!$G$44=\"\",\"\",'Optimum Moisture'!$G$44)","v":""},{"$f":"IF('Optimum Moisture'!$B$6=\"\",\"\",'Optimum Moisture'!$B$6)","v":"Tex-120-E : PART II"},{"$f":"IF('Optimum Moisture'!$B$44=\"\",\"\",'Optimum Moisture'!$B$44)","v":"Mass Water,lb"},{"$f":"IF('Optimum Moisture'!$G$26=\"\",\"\",'Optimum Moisture'!$G$26)","v":1},{"$f":"IF('Optimum Moisture'!$G$28=\"\",\"\",'Optimum Moisture'!$G$28)","v":"1-1"}]
[594,{"$f":"IF('Optimum Moisture'!$H$44=\"\",\"\",'Optimum Moisture'!$H$44)","v":""},{"$f":"IF('Optimum Moisture'!$B$6=\"\",\"\",'Optimum Moisture'!$B$6)","v":"Tex-120-E : PART II"},{"$f":"IF('Optimum Moisture'!$B$44=\"\",\"\",'Optimum Moisture'!$B$44)","v":"Mass Water,lb"},{"$f":"IF('Optimum Moisture'!$G$26=\"\",\"\",'Optimum Moisture'!$G$26)","v":1},{"$f":"IF('Optimum Moisture'!$H$28=\"\",\"\",'Optimum Moisture'!$H$28)","v":"1-2"}]
[595,{"$f":"IF('Optimum Moisture'!$I$44=\"\",\"\",'Optimum Moisture'!$I$44)","v":""},{"$f":"IF('Optimum Moisture'!$B$6=\"\",\"\",'Optimum Moisture'!$B$6)","v":"Tex-120-E : PART II"},{"$f":"IF('Optimum Moisture'!$B$44=\"\",\"\",'Optimum Moisture'!$B$44)","v":"Mass Water,lb"},{"$f":"IF('Optimum Moisture'!$G$26=\"\",\"\",'Optimum Moisture'!$G$26)","v":1},{"$f":"IF('Optimum Moisture'!$I$28=\"\",\"\",'Optimum Moisture'!$I$28)","v":"1-3"}]
[596,{"$f":"IF('Optimum Moisture'!$J$44=\"\",\"\",'Optimum Moisture'!$J$44)","v":""},{"$f":"IF('Optimum Moisture'!$B$6=\"\",\"\",'Optimum Moisture'!$B$6)","v":"Tex-120-E : PART II"},{"$f":"IF('Optimum Moisture'!$B$44=\"\",\"\",'Optimum Moisture'!$B$44)","v":"Mass Water,lb"},{"$f":"IF('Optimum Moisture'!$J$26=\"\",\"\",'Optimum Moisture'!$J$26)","v":2},{"$f":"IF('Optimum Moisture'!$J$28=\"\",\"\",'Optimum Moisture'!$J$28)","v":"2-1"}]
[597,{"$f":"IF('Optimum Moisture'!$K$44=\"\",\"\",'Optimum Moisture'!$K$44)","v":""},{"$f":"IF('Optimum Moisture'!$B$6=\"\",\"\",'Optimum Moisture'!$B$6)","v":"Tex-120-E : PART II"},{"$f":"IF('Optimum Moisture'!$B$44=\"\",\"\",'Optimum Moisture'!$B$44)","v":"Mass Water,lb"},{"$f":"IF('Optimum Moisture'!$J$26=\"\",\"\",'Optimum Moisture'!$J$26)","v":2},{"$f":"IF('Optimum Moisture'!$K$28=\"\",\"\",'Optimum Moisture'!$K$28)","v":"2-2"}]
[598,{"$f":"IF('Optimum Moisture'!$L$44=\"\",\"\",'Optimum Moisture'!$L$44)","v":""},{"$f":"IF('Optimum Moisture'!$B$6=\"\",\"\",'Optimum Moisture'!$B$6)","v":"Tex-120-E : PART II"},{"$f":"IF('Optimum Moisture'!$B$44=\"\",\"\",'Optimum Moisture'!$B$44)","v":"Mass Water,lb"},{"$f":"IF('Optimum Moisture'!$J$26=\"\",\"\",'Optimum Moisture'!$J$26)","v":2},{"$f":"IF('Optimum Moisture'!$L$28=\"\",\"\",'Optimum Moisture'!$L$28)","v":"2-3"}]
[599,{"$f":"IF('Optimum Moisture'!$M$44=\"\",\"\",'Optimum Moisture'!$M$44)","v":""},{"$f":"IF('Optimum Moisture'!$B$6=\"\",\"\",'Optimum Moisture'!$B$6)","v":"Tex-120-E : PART II"},{"$f":"IF('Optimum Moisture'!$B$44=\"\",\"\",'Optimum Moisture'!$B$44)","v":"Mass Water,lb"},{"$f":"IF('Optimum Moisture'!$M$26=\"\",\"\",'Optimum Moisture'!$M$26)","v":3},{"$f":"IF('Optimum Moisture'!$M$28=\"\",\"\",'Optimum Moisture'!$M$28)","v":"3-1"}]
[600,{"$f":"IF('Optimum Moisture'!$N$44=\"\",\"\",'Optimum Moisture'!$N$44)","v":""},{"$f":"IF('Optimum Moisture'!$B$6=\"\",\"\",'Optimum Moisture'!$B$6)","v":"Tex-120-E : PART II"},{"$f":"IF('Optimum Moisture'!$B$44=\"\",\"\",'Optimum Moisture'!$B$44)","v":"Mass Water,lb"},{"$f":"IF('Optimum Moisture'!$M$26=\"\",\"\",'Optimum Moisture'!$M$26)","v":3},{"$f":"IF('Optimum Moisture'!$N$28=\"\",\"\",'Optimum Moisture'!$N$28)","v":"3-2"}]
[601,{"$f":"IF('Optimum Moisture'!$O$44=\"\",\"\",'Optimum Moisture'!$O$44)","v":""},{"$f":"IF('Optimum Moisture'!$B$6=\"\",\"\",'Optimum Moisture'!$B$6)","v":"Tex-120-E : PART II"},{"$f":"IF('Optimum Moisture'!$B$44=\"\",\"\",'Optimum Moisture'!$B$44)","v":"Mass Water,lb"},{"$f":"IF('Optimum Moisture'!$M$26=\"\",\"\",'Optimum Moisture'!$M$26)","v":3},{"$f":"IF('Optimum Moisture'!$O$28=\"\",\"\",'Optimum Moisture'!$O$28)","v":"3-3"}]
[602,{"$f":"IF('Optimum Moisture'!$P$44=\"\",\"\",'Optimum Moisture'!$P$44)","v":""},{"$f":"IF('Optimum Moisture'!$B$6=\"\",\"\",'Optimum Moisture'!$B$6)","v":"Tex-120-E : PART II"},{"$f":"IF('Optimum Moisture'!$B$44=\"\",\"\",'Optimum Moisture'!$B$44)","v":"Mass Water,lb"},{"$f":"IF('Optimum Moisture'!$P$26=\"\",\"\",'Optimum Moisture'!$P$26)","v":4},{"$f":"IF('Optimum Moisture'!$P$28=\"\",\"\",'Optimum Moisture'!$P$28)","v":"4-1"}]
[603,{"$f":"IF('Optimum Moisture'!$Q$44=\"\",\"\",'Optimum Moisture'!$Q$44)","v":""},{"$f":"IF('Optimum Moisture'!$B$6=\"\",\"\",'Optimum Moisture'!$B$6)","v":"Tex-120-E : PART II"},{"$f":"IF('Optimum Moisture'!$B$44=\"\",\"\",'Optimum Moisture'!$B$44)","v":"Mass Water,lb"},{"$f":"IF('Optimum Moisture'!$P$26=\"\",\"\",'Optimum Moisture'!$P$26)","v":4},{"$f":"IF('Optimum Moisture'!$Q$28=\"\",\"\",'Optimum Moisture'!$Q$28)","v":"4-2"}]
[604,{"$f":"IF('Optimum Moisture'!$R$44=\"\",\"\",'Optimum Moisture'!$R$44)","v":""},{"$f":"IF('Optimum Moisture'!$B$6=\"\",\"\",'Optimum Moisture'!$B$6)","v":"Tex-120-E : PART II"},{"$f":"IF('Optimum Moisture'!$B$44=\"\",\"\",'Optimum Moisture'!$B$44)","v":"Mass Water,lb"},{"$f":"IF('Optimum Moisture'!$P$26=\"\",\"\",'Optimum Moisture'!$P$26)","v":4},{"$f":"IF('Optimum Moisture'!$R$28=\"\",\"\",'Optimum Moisture'!$R$28)","v":"4-3"}]
[605,{"$f":"IF('Optimum Moisture'!$G$45=\"\",\"\",'Optimum Moisture'!$G$45)","v":""},{"$f":"IF('Optimum Moisture'!$B$6=\"\",\"\",'Optimum Moisture'!$B$6)","v":"Tex-120-E : PART II"},{"$f":"IF('Optimum Moisture'!$B$45=\"\",\"\",'Optimum Moisture'!$B$45)","v":"Percent Water on Total ,%"},{"$f":"IF('Optimum Moisture'!$G$26=\"\",\"\",'Optimum Moisture'!$G$26)","v":1},{"$f":"IF('Optimum Moisture'!$G$28=\"\",\"\",'Optimum Moisture'!$G$28)","v":"1-1"}]
[606,{"$f":"IF('Optimum Moisture'!$H$45=\"\",\"\",'Optimum Moisture'!$H$45)","v":""},{"$f":"IF('Optimum Moisture'!$B$6=\"\",\"\",'Optimum Moisture'!$B$6)","v":"Tex-120-E : PART II"},{"$f":"IF('Optimum Moisture'!$B$45=\"\",\"\",'Optimum Moisture'!$B$45)","v":"Percent Water on Total ,%"},{"$f":"IF('Optimum Moisture'!$G$26=\"\",\"\",'Optimum Moisture'!$G$26)","v":1},{"$f":"IF('Optimum Moisture'!$H$28=\"\",\"\",'Optimum Moisture'!$H$28)","v":"1-2"}]
[607,{"$f":"IF('Optimum Moisture'!$I$45=\"\",\"\",'Optimum Moisture'!$I$45)","v":""},{"$f":"IF('Optimum Moisture'!$B$6=\"\",\"\",'Optimum Moisture'!$B$6)","v":"Tex-120-E : PART II"},{"$f":"IF('Optimum Moisture'!$B$45=\"\",\"\",'Optimum Moisture'!$B$45)","v":"Percent Water on Total ,%"},{"$f":"IF('Optimum Moisture'!$G$26=\"\",\"\",'Optimum Moisture'!$G$26)","v":1},{"$f":"IF('Optimum Moisture'!$I$28=\"\",\"\",'Optimum Moisture'!$I$28)","v":"1-3"}]
[608,{"$f":"IF('Optimum Moisture'!$J$45=\"\",\"\",'Optimum Moisture'!$J$45)","v":""},{"$f":"IF('Optimum Moisture'!$B$6=\"\",\"\",'Optimum Moisture'!$B$6)","v":"Tex-120-E : PART II"},{"$f":"IF('Optimum Moisture'!$B$45=\"\",\"\",'Optimum Moisture'!$B$45)","v":"Percent Water on Total ,%"},{"$f":"IF('Optimum Moisture'!$J$26=\"\",\"\",'Optimum Moisture'!$J$26)","v":2},{"$f":"IF('Optimum Moisture'!$J$28=\"\",\"\",'Optimum Moisture'!$J$28)","v":"2-1"}]
[609,{"$f":"IF('Optimum Moisture'!$K$45=\"\",\"\",'Optimum Moisture'!$K$45)","v":""},{"$f":"IF('Optimum Moisture'!$B$6=\"\",\"\",'Optimum Moisture'!$B$6)","v":"Tex-120-E : PART II"},{"$f":"IF('Optimum Moisture'!$B$45=\"\",\"\",'Optimum Moisture'!$B$45)","v":"Percent Water on Total ,%"},{"$f":"IF('Optimum Moisture'!$J$26=\"\",\"\",'Optimum Moisture'!$J$26)","v":2},{"$f":"IF('Optimum Moisture'!$K$28=\"\",\"\",'Optimum Moisture'!$K$28)","v":"2-2"}]
[610,{"$f":"IF('Optimum Moisture'!$L$45=\"\",\"\",'Optimum Moisture'!$L$45)","v":""},{"$f":"IF('Optimum Moisture'!$B$6=\"\",\"\",'Optimum Moisture'!$B$6)","v":"Tex-120-E : PART II"},{"$f":"IF('Optimum Moisture'!$B$45=\"\",\"\",'Optimum Moisture'!$B$45)","v":"Percent Water on Total ,%"},{"$f":"IF('Optimum Moisture'!$J$26=\"\",\"\",'Optimum Moisture'!$J$26)","v":2},{"$f":"IF('Optimum Moisture'!$L$28=\"\",\"\",'Optimum Moisture'!$L$28)","v":"2-3"}]
[611,{"$f":"IF('Optimum Moisture'!$M$45=\"\",\"\",'Optimum Moisture'!$M$45)","v":""},{"$f":"IF('Optimum Moisture'!$B$6=\"\",\"\",'Optimum Moisture'!$B$6)","v":"Tex-120-E : PART II"},{"$f":"IF('Optimum Moisture'!$B$45=\"\",\"\",'Optimum Moisture'!$B$45)","v":"Percent Water on Total ,%"},{"$f":"IF('Optimum Moisture'!$M$26=\"\",\"\",'Optimum Moisture'!$M$26)","v":3},{"$f":"IF('Optimum Moisture'!$M$28=\"\",\"\",'Optimum Moisture'!$M$28)","v":"3-1"}]
[612,{"$f":"IF('Optimum Moisture'!$N$45=\"\",\"\",'Optimum Moisture'!$N$45)","v":""},{"$f":"IF('Optimum Moisture'!$B$6=\"\",\"\",'Optimum Moisture'!$B$6)","v":"Tex-120-E : PART II"},{"$f":"IF('Optimum Moisture'!$B$45=\"\",\"\",'Optimum Moisture'!$B$45)","v":"Percent Water on Total ,%"},{"$f":"IF('Optimum Moisture'!$M$26=\"\",\"\",'Optimum Moisture'!$M$26)","v":3},{"$f":"IF('Optimum Moisture'!$N$28=\"\",\"\",'Optimum Moisture'!$N$28)","v":"3-2"}]
[613,{"$f":"IF('Optimum Moisture'!$O$45=\"\",\"\",'Optimum Moisture'!$O$45)","v":""},{"$f":"IF('Optimum Moisture'!$B$6=\"\",\"\",'Optimum Moisture'!$B$6)","v":"Tex-120-E : PART II"},{"$f":"IF('Optimum Moisture'!$B$45=\"\",\"\",'Optimum Moisture'!$B$45)","v":"Percent Water on Total ,%"},{"$f":"IF('Optimum Moisture'!$M$26=\"\",\"\",'Optimum Moisture'!$M$26)","v":3},{"$f":"IF('Optimum Moisture'!$O$28=\"\",\"\",'Optimum Moisture'!$O$28)","v":"3-3"}]
[614,{"$f":"IF('Optimum Moisture'!$P$45=\"\",\"\",'Optimum Moisture'!$P$45)","v":""},{"$f":"IF('Optimum Moisture'!$B$6=\"\",\"\",'Optimum Moisture'!$B$6)","v":"Tex-120-E : PART II"},{"$f":"IF('Optimum Moisture'!$B$45=\"\",\"\",'Optimum Moisture'!$B$45)","v":"Percent Water on Total ,%"},{"$f":"IF('Optimum Moisture'!$P$26=\"\",\"\",'Optimum Moisture'!$P$26)","v":4},{"$f":"IF('Optimum Moisture'!$P$28=\"\",\"\",'Optimum Moisture'!$P$28)","v":"4-1"}]
[615,{"$f":"IF('Optimum Moisture'!$Q$45=\"\",\"\",'Optimum Moisture'!$Q$45)","v":""},{"$f":"IF('Optimum Moisture'!$B$6=\"\",\"\",'Optimum Moisture'!$B$6)","v":"Tex-120-E : PART II"},{"$f":"IF('Optimum Moisture'!$B$45=\"\",\"\",'Optimum Moisture'!$B$45)","v":"Percent Water on Total ,%"},{"$f":"IF('Optimum Moisture'!$P$26=\"\",\"\",'Optimum Moisture'!$P$26)","v":4},{"$f":"IF('Optimum Moisture'!$Q$28=\"\",\"\",'Optimum Moisture'!$Q$28)","v":"4-2"}]
[616,{"$f":"IF('Optimum Moisture'!$R$45=\"\",\"\",'Optimum Moisture'!$R$45)","v":""},{"$f":"IF('Optimum Moisture'!$B$6=\"\",\"\",'Optimum Moisture'!$B$6)","v":"Tex-120-E : PART II"},{"$f":"IF('Optimum Moisture'!$B$45=\"\",\"\",'Optimum Moisture'!$B$45)","v":"Percent Water on Total ,%"},{"$f":"IF('Optimum Moisture'!$P$26=\"\",\"\",'Optimum Moisture'!$P$26)","v":4},{"$f":"IF('Optimum Moisture'!$R$28=\"\",\"\",'Optimum Moisture'!$R$28)","v":"4-3"}]
[617,{"$f":"IF('Optimum Moisture'!$G$46=\"\",\"\",'Optimum Moisture'!$G$46)","v":""},{"$f":"IF('Optimum Moisture'!$B$6=\"\",\"\",'Optimum Moisture'!$B$6)","v":"Tex-120-E : PART II"},{"$f":"IF('Optimum Moisture'!$B$46=\"\",\"\",'Optimum Moisture'!$B$46)","v":"Dry Density (pcf)"},{"$f":"IF('Optimum Moisture'!$G$26=\"\",\"\",'Optimum Moisture'!$G$26)","v":1},{"$f":"IF('Optimum Moisture'!$G$28=\"\",\"\",'Optimum Moisture'!$G$28)","v":"1-1"}]
[618,{"$f":"IF('Optimum Moisture'!$H$46=\"\",\"\",'Optimum Moisture'!$H$46)","v":""},{"$f":"IF('Optimum Moisture'!$B$6=\"\",\"\",'Optimum Moisture'!$B$6)","v":"Tex-120-E : PART II"},{"$f":"IF('Optimum Moisture'!$B$46=\"\",\"\",'Optimum Moisture'!$B$46)","v":"Dry Density (pcf)"},{"$f":"IF('Optimum Moisture'!$G$26=\"\",\"\",'Optimum Moisture'!$G$26)","v":1},{"$f":"IF('Optimum Moisture'!$H$28=\"\",\"\",'Optimum Moisture'!$H$28)","v":"1-2"}]
[619,{"$f":"IF('Optimum Moisture'!$I$46=\"\",\"\",'Optimum Moisture'!$I$46)","v":""},{"$f":"IF('Optimum Moisture'!$B$6=\"\",\"\",'Optimum Moisture'!$B$6)","v":"Tex-120-E : PART II"},{"$f":"IF('Optimum Moisture'!$B$46=\"\",\"\",'Optimum Moisture'!$B$46)","v":"Dry Density (pcf)"},{"$f":"IF('Optimum Moisture'!$G$26=\"\",\"\",'Optimum Moisture'!$G$26)","v":1},{"$f":"IF('Optimum Moisture'!$I$28=\"\",\"\",'Optimum Moisture'!$I$28)","v":"1-3"}]
[620,{"$f":"IF('Optimum Moisture'!$J$46=\"\",\"\",'Optimum Moisture'!$J$46)","v":""},{"$f":"IF('Optimum Moisture'!$B$6=\"\",\"\",'Optimum Moisture'!$B$6)","v":"Tex-120-E : PART II"},{"$f":"IF('Optimum Moisture'!$B$46=\"\",\"\",'Optimum Moisture'!$B$46)","v":"Dry Density (pcf)"},{"$f":"IF('Optimum Moisture'!$J$26=\"\",\"\",'Optimum Moisture'!$J$26)","v":2},{"$f":"IF('Optimum Moisture'!$J$28=\"\",\"\",'Optimum Moisture'!$J$28)","v":"2-1"}]
[621,{"$f":"IF('Optimum Moisture'!$K$46=\"\",\"\",'Optimum Moisture'!$K$46)","v":""},{"$f":"IF('Optimum Moisture'!$B$6=\"\",\"\",'Optimum Moisture'!$B$6)","v":"Tex-120-E : PART II"},{"$f":"IF('Optimum Moisture'!$B$46=\"\",\"\",'Optimum Moisture'!$B$46)","v":"Dry Density (pcf)"},{"$f":"IF('Optimum Moisture'!$J$26=\"\",\"\",'Optimum Moisture'!$J$26)","v":2},{"$f":"IF('Optimum Moisture'!$K$28=\"\",\"\",'Optimum Moisture'!$K$28)","v":"2-2"}]
[622,{"$f":"IF('Optimum Moisture'!$L$46=\"\",\"\",'Optimum Moisture'!$L$46)","v":""},{"$f":"IF('Optimum Moisture'!$B$6=\"\",\"\",'Optimum Moisture'!$B$6)","v":"Tex-120-E : PART II"},{"$f":"IF('Optimum Moisture'!$B$46=\"\",\"\",'Optimum Moisture'!$B$46)","v":"Dry Density (pcf)"},{"$f":"IF('Optimum Moisture'!$J$26=\"\",\"\",'Optimum Moisture'!$J$26)","v":2},{"$f":"IF('Optimum Moisture'!$L$28=\"\",\"\",'Optimum Moisture'!$L$28)","v":"2-3"}]
[623,{"$f":"IF('Optimum Moisture'!$M$46=\"\",\"\",'Optimum Moisture'!$M$46)","v":""},{"$f":"IF('Optimum Moisture'!$B$6=\"\",\"\",'Optimum Moisture'!$B$6)","v":"Tex-120-E : PART II"},{"$f":"IF('Optimum Moisture'!$B$46=\"\",\"\",'Optimum Moisture'!$B$46)","v":"Dry Density (pcf)"},{"$f":"IF('Optimum Moisture'!$M$26=\"\",\"\",'Optimum Moisture'!$M$26)","v":3},{"$f":"IF('Optimum Moisture'!$M$28=\"\",\"\",'Optimum Moisture'!$M$28)","v":"3-1"}]
[624,{"$f":"IF('Optimum Moisture'!$N$46=\"\",\"\",'Optimum Moisture'!$N$46)","v":""},{"$f":"IF('Optimum Moisture'!$B$6=\"\",\"\",'Optimum Moisture'!$B$6)","v":"Tex-120-E : PART II"},{"$f":"IF('Optimum Moisture'!$B$46=\"\",\"\",'Optimum Moisture'!$B$46)","v":"Dry Density (pcf)"},{"$f":"IF('Optimum Moisture'!$M$26=\"\",\"\",'Optimum Moisture'!$M$26)","v":3},{"$f":"IF('Optimum Moisture'!$N$28=\"\",\"\",'Optimum Moisture'!$N$28)","v":"3-2"}]
[625,{"$f":"IF('Optimum Moisture'!$O$46=\"\",\"\",'Optimum Moisture'!$O$46)","v":""},{"$f":"IF('Optimum Moisture'!$B$6=\"\",\"\",'Optimum Moisture'!$B$6)","v":"Tex-120-E : PART II"},{"$f":"IF('Optimum Moisture'!$B$46=\"\",\"\",'Optimum Moisture'!$B$46)","v":"Dry Density (pcf)"},{"$f":"IF('Optimum Moisture'!$M$26=\"\",\"\",'Optimum Moisture'!$M$26)","v":3},{"$f":"IF('Optimum Moisture'!$O$28=\"\",\"\",'Optimum Moisture'!$O$28)","v":"3-3"}]
[626,{"$f":"IF('Optimum Moisture'!$P$46=\"\",\"\",'Optimum Moisture'!$P$46)","v":""},{"$f":"IF('Optimum Moisture'!$B$6=\"\",\"\",'Optimum Moisture'!$B$6)","v":"Tex-120-E : PART II"},{"$f":"IF('Optimum Moisture'!$B$46=\"\",\"\",'Optimum Moisture'!$B$46)","v":"Dry Density (pcf)"},{"$f":"IF('Optimum Moisture'!$P$26=\"\",\"\",'Optimum Moisture'!$P$26)","v":4},{"$f":"IF('Optimum Moisture'!$P$28=\"\",\"\",'Optimum Moisture'!$P$28)","v":"4-1"}]
[627,{"$f":"IF('Optimum Moisture'!$Q$46=\"\",\"\",'Optimum Moisture'!$Q$46)","v":""},{"$f":"IF('Optimum Moisture'!$B$6=\"\",\"\",'Optimum Moisture'!$B$6)","v":"Tex-120-E : PART II"},{"$f":"IF('Optimum Moisture'!$B$46=\"\",\"\",'Optimum Moisture'!$B$46)","v":"Dry Density (pcf)"},{"$f":"IF('Optimum Moisture'!$P$26=\"\",\"\",'Optimum Moisture'!$P$26)","v":4},{"$f":"IF('Optimum Moisture'!$Q$28=\"\",\"\",'Optimum Moisture'!$Q$28)","v":"4-2"}]
[628,{"$f":"IF('Optimum Moisture'!$R$46=\"\",\"\",'Optimum Moisture'!$R$46)","v":""},{"$f":"IF('Optimum Moisture'!$B$6=\"\",\"\",'Optimum Moisture'!$B$6)","v":"Tex-120-E : PART II"},{"$f":"IF('Optimum Moisture'!$B$46=\"\",\"\",'Optimum Moisture'!$B$46)","v":"Dry Density (pcf)"},{"$f":"IF('Optimum Moisture'!$P$26=\"\",\"\",'Optimum Moisture'!$P$26)","v":4},{"$f":"IF('Optimum Moisture'!$R$28=\"\",\"\",'Optimum Moisture'!$R$28)","v":"4-3"}]
[629,{"$f":"IF('Optimum Moisture'!$G$47=\"\",\"\",'Optimum Moisture'!$G$47)","v":""},{"$f":"IF('Optimum Moisture'!$B$6=\"\",\"\",'Optimum Moisture'!$B$6)","v":"Tex-120-E : PART II"},{"$f":"IF('Optimum Moisture'!$B$47=\"\",\"\",'Optimum Moisture'!$B$47)","v":"Estimated Dry Density (pcf)"},{"$f":"IF('Optimum Moisture'!$G$26=\"\",\"\",'Optimum Moisture'!$G$26)","v":1},{"$f":"IF('Optimum Moisture'!$G$28=\"\",\"\",'Optimum Moisture'!$G$28)","v":"1-1"}]
[630,{"$f":"IF('Optimum Moisture'!$H$47=\"\",\"\",'Optimum Moisture'!$H$47)","v":""},{"$f":"IF('Optimum Moisture'!$B$6=\"\",\"\",'Optimum Moisture'!$B$6)","v":"Tex-120-E : PART II"},{"$f":"IF('Optimum Moisture'!$B$47=\"\",\"\",'Optimum Moisture'!$B$47)","v":"Estimated Dry Density (pcf)"},{"$f":"IF('Optimum Moisture'!$G$26=\"\",\"\",'Optimum Moisture'!$G$26)","v":1},{"$f":"IF('Optimum Moisture'!$H$28=\"\",\"\",'Optimum Moisture'!$H$28)","v":"1-2"}]
[631,{"$f":"IF('Optimum Moisture'!$I$47=\"\",\"\",'Optimum Moisture'!$I$47)","v":""},{"$f":"IF('Optimum Moisture'!$B$6=\"\",\"\",'Optimum Moisture'!$B$6)","v":"Tex-120-E : PART II"},{"$f":"IF('Optimum Moisture'!$B$47=\"\",\"\",'Optimum Moisture'!$B$47)","v":"Estimated Dry Density (pcf)"},{"$f":"IF('Optimum Moisture'!$G$26=\"\",\"\",'Optimum Moisture'!$G$26)","v":1},{"$f":"IF('Optimum Moisture'!$I$28=\"\",\"\",'Optimum Moisture'!$I$28)","v":"1-3"}]
[632,{"$f":"IF('Optimum Moisture'!$J$47=\"\",\"\",'Optimum Moisture'!$J$47)","v":""},{"$f":"IF('Optimum Moisture'!$B$6=\"\",\"\",'Optimum Moisture'!$B$6)","v":"Tex-120-E : PART II"},{"$f":"IF('Optimum Moisture'!$B$47=\"\",\"\",'Optimum Moisture'!$B$47)","v":"Estimated Dry Density (pcf)"},{"$f":"IF('Optimum Moisture'!$J$26=\"\",\"\",'Optimum Moisture'!$J$26)","v":2},{"$f":"IF('Optimum Moisture'!$J$28=\"\",\"\",'Optimum Moisture'!$J$28)","v":"2-1"}]
[633,{"$f":"IF('Optimum Moisture'!$K$47=\"\",\"\",'Optimum Moisture'!$K$47)","v":""},{"$f":"IF('Optimum Moisture'!$B$6=\"\",\"\",'Optimum Moisture'!$B$6)","v":"Tex-120-E : PART II"},{"$f":"IF('Optimum Moisture'!$B$47=\"\",\"\",'Optimum Moisture'!$B$47)","v":"Estimated Dry Density (pcf)"},{"$f":"IF('Optimum Moisture'!$J$26=\"\",\"\",'Optimum Moisture'!$J$26)","v":2},{"$f":"IF('Optimum Moisture'!$K$28=\"\",\"\",'Optimum Moisture'!$K$28)","v":"2-2"}]
[634,{"$f":"IF('Optimum Moisture'!$L$47=\"\",\"\",'Optimum Moisture'!$L$47)","v":""},{"$f":"IF('Optimum Moisture'!$B$6=\"\",\"\",'Optimum Moisture'!$B$6)","v":"Tex-120-E : PART II"},{"$f":"IF('Optimum Moisture'!$B$47=\"\",\"\",'Optimum Moisture'!$B$47)","v":"Estimated Dry Density (pcf)"},{"$f":"IF('Optimum Moisture'!$J$26=\"\",\"\",'Optimum Moisture'!$J$26)","v":2},{"$f":"IF('Optimum Moisture'!$L$28=\"\",\"\",'Optimum Moisture'!$L$28)","v":"2-3"}]
[635,{"$f":"IF('Optimum Moisture'!$M$47=\"\",\"\",'Optimum Moisture'!$M$47)","v":""},{"$f":"IF('Optimum Moisture'!$B$6=\"\",\"\",'Optimum Moisture'!$B$6)","v":"Tex-120-E : PART II"},{"$f":"IF('Optimum Moisture'!$B$47=\"\",\"\",'Optimum Moisture'!$B$47)","v":"Estimated Dry Density (pcf)"},{"$f":"IF('Optimum Moisture'!$M$26=\"\",\"\",'Optimum Moisture'!$M$26)","v":3},{"$f":"IF('Optimum Moisture'!$M$28=\"\",\"\",'Optimum Moisture'!$M$28)","v":"3-1"}]
[636,{"$f":"IF('Optimum Moisture'!$N$47=\"\",\"\",'Optimum Moisture'!$N$47)","v":""},{"$f":"IF('Optimum Moisture'!$B$6=\"\",\"\",'Optimum Moisture'!$B$6)","v":"Tex-120-E : PART II"},{"$f":"IF('Optimum Moisture'!$B$47=\"\",\"\",'Optimum Moisture'!$B$47)","v":"Estimated Dry Density (pcf)"},{"$f":"IF('Optimum Moisture'!$M$26=\"\",\"\",'Optimum Moisture'!$M$26)","v":3},{"$f":"IF('Optimum Moisture'!$N$28=\"\",\"\",'Optimum Moisture'!$N$28)","v":"3-2"}]
[637,{"$f":"IF('Optimum Moisture'!$O$47=\"\",\"\",'Optimum Moisture'!$O$47)","v":""},{"$f":"IF('Optimum Moisture'!$B$6=\"\",\"\",'Optimum Moisture'!$B$6)","v":"Tex-120-E : PART II"},{"$f":"IF('Optimum Moisture'!$B$47=\"\",\"\",'Optimum Moisture'!$B$47)","v":"Estimated Dry Density (pcf)"},{"$f":"IF('Optimum Moisture'!$M$26=\"\",\"\",'Optimum Moisture'!$M$26)","v":3},{"$f":"IF('Optimum Moisture'!$O$28=\"\",\"\",'Optimum Moisture'!$O$28)","v":"3-3"}]
[638,{"$f":"IF('Optimum Moisture'!$P$47=\"\",\"\",'Optimum Moisture'!$P$47)","v":""},{"$f":"IF('Optimum Moisture'!$B$6=\"\",\"\",'Optimum Moisture'!$B$6)","v":"Tex-120-E : PART II"},{"$f":"IF('Optimum Moisture'!$B$47=\"\",\"\",'Optimum Moisture'!$B$47)","v":"Estimated Dry Density (pcf)"},{"$f":"IF('Optimum Moisture'!$P$26=\"\",\"\",'Optimum Moisture'!$P$26)","v":4},{"$f":"IF('Optimum Moisture'!$P$28=\"\",\"\",'Optimum Moisture'!$P$28)","v":"4-1"}]
[639,{"$f":"IF('Optimum Moisture'!$Q$47=\"\",\"\",'Optimum Moisture'!$Q$47)","v":""},{"$f":"IF('Optimum Moisture'!$B$6=\"\",\"\",'Optimum Moisture'!$B$6)","v":"Tex-120-E : PART II"},{"$f":"IF('Optimum Moisture'!$B$47=\"\",\"\",'Optimum Moisture'!$B$47)","v":"Estimated Dry Density (pcf)"},{"$f":"IF('Optimum Moisture'!$P$26=\"\",\"\",'Optimum Moisture'!$P$26)","v":4},{"$f":"IF('Optimum Moisture'!$Q$28=\"\",\"\",'Optimum Moisture'!$Q$28)","v":"4-2"}]
[640,{"$f":"IF('Optimum Moisture'!$R$47=\"\",\"\",'Optimum Moisture'!$R$47)","v":""},{"$f":"IF('Optimum Moisture'!$B$6=\"\",\"\",'Optimum Moisture'!$B$6)","v":"Tex-120-E : PART II"},{"$f":"IF('Optimum Moisture'!$B$47=\"\",\"\",'Optimum Moisture'!$B$47)","v":"Estimated Dry Density (pcf)"},{"$f":"IF('Optimum Moisture'!$P$26=\"\",\"\",'Optimum Moisture'!$P$26)","v":4},{"$f":"IF('Optimum Moisture'!$R$28=\"\",\"\",'Optimum Moisture'!$R$28)","v":"4-3"}]
[641,{"$f":"IF('Optimum Moisture'!$I$49=\"\",\"\",'Optimum Moisture'!$I$49)","v":""},{"$f":"IF('Optimum Moisture'!$B$6=\"\",\"\",'Optimum Moisture'!$B$6)","v":"Tex-120-E : PART II"},{"$f":"IF('Optimum Moisture'!$B$49=\"\",\"\",'Optimum Moisture'!$B$49)","v":"Max Density(pcf)"},{"$f":"IF('Optimum Moisture'!$G$26=\"\",\"\",'Optimum Moisture'!$G$26)","v":1}]
[642,{"$f":"IF('Optimum Moisture'!$I$50=\"\",\"\",'Optimum Moisture'!$I$50)","v":""},{"$f":"IF('Optimum Moisture'!$B$6=\"\",\"\",'Optimum Moisture'!$B$6)","v":"Tex-120-E : PART II"},{"$f":"IF('Optimum Moisture'!$B$50=\"\",\"\",'Optimum Moisture'!$B$50)","v":"Max Density (kg/m3)"},{"$f":"IF('Optimum Moisture'!$G$26=\"\",\"\",'Optimum Moisture'!$G$26)","v":1}]
[643,{"$f":"IF('Optimum Moisture'!$I$51=\"\",\"\",'Optimum Moisture'!$I$51)","v":""},{"$f":"IF('Optimum Moisture'!$B$6=\"\",\"\",'Optimum Moisture'!$B$6)","v":"Tex-120-E : PART II"},{"$f":"IF('Optimum Moisture'!$B$51=\"\",\"\",'Optimum Moisture'!$B$51)","v":"Optimum Moisture(%)"},{"$f":"IF('Optimum Moisture'!$G$26=\"\",\"\",'Optimum Moisture'!$G$26)","v":1}]
[644,{"$f":"IF('Optimum Moisture'!$L$49=\"\",\"\",'Optimum Moisture'!$L$49)","v":""},{"$f":"IF('Optimum Moisture'!$B$6=\"\",\"\",'Optimum Moisture'!$B$6)","v":"Tex-120-E : PART II"},{"$f":"IF('Optimum Moisture'!$B$49=\"\",\"\",'Optimum Moisture'!$B$49)","v":"Max Density(pcf)"},{"$f":"IF('Optimum Moisture'!$J$26=\"\",\"\",'Optimum Moisture'!$J$26)","v":2}]
[645,{"$f":"IF('Optimum Moisture'!$L$50=\"\",\"\",'Optimum Moisture'!$L$50)","v":""},{"$f":"IF('Optimum Moisture'!$B$6=\"\",\"\",'Optimum Moisture'!$B$6)","v":"Tex-120-E : PART II"},{"$f":"IF('Optimum Moisture'!$B$50=\"\",\"\",'Optimum Moisture'!$B$50)","v":"Max Density (kg/m3)"},{"$f":"IF('Optimum Moisture'!$J$26=\"\",\"\",'Optimum Moisture'!$J$26)","v":2}]
[646,{"$f":"IF('Optimum Moisture'!$L$51=\"\",\"\",'Optimum Moisture'!$L$51)","v":""},{"$f":"IF('Optimum Moisture'!$B$6=\"\",\"\",'Optimum Moisture'!$B$6)","v":"Tex-120-E : PART II"},{"$f":"IF('Optimum Moisture'!$B$51=\"\",\"\",'Optimum Moisture'!$B$51)","v":"Optimum Moisture(%)"},{"$f":"IF('Optimum Moisture'!$J$26=\"\",\"\",'Optimum Moisture'!$J$26)","v":2}]
[647,{"$f":"IF('Optimum Moisture'!$O$49=\"\",\"\",'Optimum Moisture'!$O$49)","v":""},{"$f":"IF('Optimum Moisture'!$B$6=\"\",\"\",'Optimum Moisture'!$B$6)","v":"Tex-120-E : PART II"},{"$f":"IF('Optimum Moisture'!$B$49=\"\",\"\",'Optimum Moisture'!$B$49)","v":"Max Density(pcf)"},{"$f":"IF('Optimum Moisture'!$M$26=\"\",\"\",'Optimum Moisture'!$M$26)","v":3}]
[648,{"$f":"IF('Optimum Moisture'!$O$50=\"\",\"\",'Optimum Moisture'!$O$50)","v":""},{"$f":"IF('Optimum Moisture'!$B$6=\"\",\"\",'Optimum Moisture'!$B$6)","v":"Tex-120-E : PART II"},{"$f":"IF('Optimum Moisture'!$B$50=\"\",\"\",'Optimum Moisture'!$B$50)","v":"Max Density (kg/m3)"},{"$f":"IF('Optimum Moisture'!$M$26=\"\",\"\",'Optimum Moisture'!$M$26)","v":3}]
[649,{"$f":"IF('Optimum Moisture'!$O$51=\"\",\"\",'Optimum Moisture'!$O$51)","v":""},{"$f":"IF('Optimum Moisture'!$B$6=\"\",\"\",'Optimum Moisture'!$B$6)","v":"Tex-120-E : PART II"},{"$f":"IF('Optimum Moisture'!$B$51=\"\",\"\",'Optimum Moisture'!$B$51)","v":"Optimum Moisture(%)"},{"$f":"IF('Optimum Moisture'!$M$26=\"\",\"\",'Optimum Moisture'!$M$26)","v":3}]
[650,{"$f":"IF('Optimum Moisture'!$R$49=\"\",\"\",'Optimum Moisture'!$R$49)","v":""},{"$f":"IF('Optimum Moisture'!$B$6=\"\",\"\",'Optimum Moisture'!$B$6)","v":"Tex-120-E : PART II"},{"$f":"IF('Optimum Moisture'!$B$49=\"\",\"\",'Optimum Moisture'!$B$49)","v":"Max Density(pcf)"},{"$f":"IF('Optimum Moisture'!$P$26=\"\",\"\",'Optimum Moisture'!$P$26)","v":4}]
[651,{"$f":"IF('Optimum Moisture'!$R$50=\"\",\"\",'Optimum Moisture'!$R$50)","v":""},{"$f":"IF('Optimum Moisture'!$B$6=\"\",\"\",'Optimum Moisture'!$B$6)","v":"Tex-120-E : PART II"},{"$f":"IF('Optimum Moisture'!$B$50=\"\",\"\",'Optimum Moisture'!$B$50)","v":"Max Density (kg/m3)"},{"$f":"IF('Optimum Moisture'!$P$26=\"\",\"\",'Optimum Moisture'!$P$26)","v":4}]
[652,{"$f":"IF('Optimum Moisture'!$R$51=\"\",\"\",'Optimum Moisture'!$R$51)","v":""},{"$f":"IF('Optimum Moisture'!$B$6=\"\",\"\",'Optimum Moisture'!$B$6)","v":"Tex-120-E : PART II"},{"$f":"IF('Optimum Moisture'!$B$51=\"\",\"\",'Optimum Moisture'!$B$51)","v":"Optimum Moisture(%)"},{"$f":"IF('Optimum Moisture'!$P$26=\"\",\"\",'Optimum Moisture'!$P$26)","v":4}]
[653,{"$f":"IF('Compressive Strength'!$D$69=\"\",\"\",'Compressive Strength'!$D$69)","v":""},"Sampled By",{"$f":"IF('Compressive Strength'!$B$69=\"\",\"\",'Compressive Strength'!$B$69)","v":"TX100"}]
[654,{"$f":"IF('Compressive Strength'!$J$69=\"\",\"\",'Compressive Strength'!$J$69)","v":""},"Sampled Date",{"$f":"IF('Compressive Strength'!$B$69=\"\",\"\",'Compressive Strength'!$B$69)","v":"TX100"}]
[655,{"$f":"IF('Compressive Strength'!$D$71=\"\",\"\",'Compressive Strength'!$D$71)","v":""},"Sampled By",{"$f":"IF('Compressive Strength'!$B$71=\"\",\"\",'Compressive Strength'!$B$71)","v":"TX400"}]
[656,{"$f":"IF('Compressive Strength'!$J$71=\"\",\"\",'Compressive Strength'!$J$71)","v":""},"Sampled Date",{"$f":"IF('Compressive Strength'!$B$71=\"\",\"\",'Compressive Strength'!$B$71)","v":"TX400"}]

{"sheet":"Log","index":4,"n_rows":7,"n_cols":1,"rows_kept":7,"cut":false,"hidden":true,"merged":[]}
["*** Add Range Name \"Version\" Cell K68 =IF(AuthorizedDate<38257,\"1\",\"2\")"]
[]
[]
["*** New  =IF(G25=0,0,IF(AutoMan=\"automated\",(G41+G38)/IF(Version=\"1\",G32,G31),(((G43*G37)+G38)/G31)))"]
["*** Old   =IF(G25=0,0,IF(AutoMan=\"automated\",(G41+G38)/G31,(((G43*G37)+G38)/G31))"]
[]
["11/1/2010 changed the % cement to a tenth of a decimal on compressive strength sheet Row 25."]

{"sheet":"Reference","index":5,"n_rows":201,"n_cols":5,"rows_kept":201,"cut":false,"hidden":true,"merged":[]}
["m1",{"$f":"(B12-B11)/(C12-C11)","v":{"$error":"#VALUE!"}}]
["b1",{"$f":"B11-B1*C11","v":{"$error":"#VALUE!"}},"X-Peak",{"$f":"(B4-B2)/(B1-B3)","v":{"$error":"#VALUE!"}}]
["m2",{"$f":"IF(AND(B13>0,'Tex-113,4-E'!H46=0),B1*-1,(B14-B13)/(C14-C13))","v":{"$error":"#VALUE!"}},"Y-Peak",{"$f":"B1*D2+B2","v":{"$error":"#VALUE!"}}]
["b2",{"$f":"B13-C13*B3","v":{"$error":"#VALUE!"}}]
[]
[]
[]
[]
[]
["N","Y","X","X^2"]
[1,{"$f":"'Tex-113,4-E'!E48","v":""},{"$f":"'Tex-113,4-E'!E47","v":""},{"$f":"C11^2","v":{"$error":"#VALUE!"}}]
[2,{"$f":"'Tex-113,4-E'!F48","v":""},{"$f":"'Tex-113,4-E'!F47","v":""},{"$error":"#VALUE!"}]
[3,{"$f":"'Tex-113,4-E'!G48","v":""},{"$f":"'Tex-113,4-E'!G47","v":""},{"$error":"#VALUE!"}]
[4,{"$f":"IF(AND(B13>0,'Tex-113,4-E'!H46=0),D3,'Tex-113,4-E'!H48)","v":""},{"$f":"IF(AND(C13>0,'Tex-113,4-E'!H46=0),D2,'Tex-113,4-E'!H47)","v":""},{"$error":"#VALUE!"}]
[5,{"$f":"D3","v":{"$error":"#VALUE!"}},{"$f":"$D$2","v":{"$error":"#VALUE!"}},{"$error":"#VALUE!"}]
[6,{"$f":"D3","v":{"$error":"#VALUE!"}},{"$f":"$D$2","v":{"$error":"#VALUE!"}},{"$error":"#VALUE!"}]
[7,{"$f":"D3","v":{"$error":"#VALUE!"}},{"$f":"$D$2","v":{"$error":"#VALUE!"}},{"$error":"#VALUE!"}]
[8,{"$f":"D3","v":{"$error":"#VALUE!"}},{"$f":"D2","v":{"$error":"#VALUE!"}},{"$error":"#VALUE!"}]
["SUM",{"$f":"SUM(B13:B17)","v":{"$error":"#VALUE!"}},{"$f":"SUM(C13:C17)","v":{"$error":"#VALUE!"}},{"$f":"SUM(D11:D17)","v":{"$error":"#VALUE!"}}]
[]
[]
["MAX DEN",{"$f":"B27*B23^2+B26*B23+B25","v":{"$error":"#VALUE!"}}]
["MAX  W",{"$f":"-B26/(2*B27)","v":{"$error":"#VALUE!"}}]
[]
["Ao",{"$f":"INDEX(LINEST($B$11:$B$14,$C$11:$D$14),3)","v":{"$error":"#VALUE!"}}]
["A1",{"$f":"INDEX(LINEST($B$11:$B$14,$C$11:$D$14),2)","v":{"$error":"#VALUE!"}},null,"SG",{"$f":"IF(AND('Tex-113,4-E'!E24>0,'Tex-113,4-E'!E23>0),'Tex-113,4-E'!E25,\"\")","v":""}]
["A2",{"$f":"INDEX(LINEST($B$11:$B$14,$C$11:$D$14),1)","v":{"$error":"#VALUE!"}}]
[]
["W","dry density","zav"]
[{"$f":"IF('Tex-113,4-E'!H30>0,'Tex-113,4-E'!H30+8,'Tex-113,4-E'!G30+8)","v":8},{"$f":"$B$25+$B$26*A30+$B$27*A30^2","v":{"$error":"#VALUE!"}},{"$f":"($E$26*62.4)/(1+(A30/100)*$E$26)","v":{"$error":"#VALUE!"}}]
[{"$f":"A30-0.1","v":7.9},{"$error":"#VALUE!"},{"$error":"#VALUE!"}]
[7.8,{"$error":"#VALUE!"},{"$error":"#VALUE!"}]
[7.7,{"$error":"#VALUE!"},{"$error":"#VALUE!"}]
[7.6,{"$error":"#VALUE!"},{"$error":"#VALUE!"}]
[7.5,{"$error":"#VALUE!"},{"$error":"#VALUE!"}]
[7.4,{"$error":"#VALUE!"},{"$error":"#VALUE!"}]
[7.3,{"$error":"#VALUE!"},{"$error":"#VALUE!"}]
[7.2,{"$error":"#VALUE!"},{"$error":"#VALUE!"}]
[7.1,{"$error":"#VALUE!"},{"$error":"#VALUE!"}]
[7,{"$error":"#VALUE!"},{"$error":"#VALUE!"}]
[6.9,{"$error":"#VALUE!"},{"$error":"#VALUE!"}]
[6.8,{"$error":"#VALUE!"},{"$error":"#VALUE!"}]
[6.7,{"$error":"#VALUE!"},{"$error":"#VALUE!"}]
[6.6,{"$error":"#VALUE!"},{"$error":"#VALUE!"}]
[6.5,{"$error":"#VALUE!"},{"$error":"#VALUE!"}]
[6.4,{"$error":"#VALUE!"},{"$error":"#VALUE!"}]
[6.3,{"$error":"#VALUE!"},{"$error":"#VALUE!"}]
[6.2,{"$error":"#VALUE!"},{"$error":"#VALUE!"}]
[6.1,{"$error":"#VALUE!"},{"$error":"#VALUE!"}]
[6,{"$error":"#VALUE!"},{"$error":"#VALUE!"}]
[5.9,{"$error":"#VALUE!"},{"$error":"#VALUE!"}]
[5.8,{"$error":"#VALUE!"},{"$error":"#VALUE!"}]
[5.7,{"$error":"#VALUE!"},{"$error":"#VALUE!"}]
[5.6,{"$error":"#VALUE!"},{"$error":"#VALUE!"}]
[5.5,{"$error":"#VALUE!"},{"$error":"#VALUE!"}]
[5.4,{"$error":"#VALUE!"},{"$error":"#VALUE!"}]
[5.3,{"$error":"#VALUE!"},{"$error":"#VALUE!"}]
[5.2,{"$error":"#VALUE!"},{"$error":"#VALUE!"}]
[5.0999999999999996,{"$error":"#VALUE!"},{"$error":"#VALUE!"}]
[5,{"$error":"#VALUE!"},{"$error":"#VALUE!"}]
[4.9000000000000004,{"$error":"#VALUE!"},{"$error":"#VALUE!"}]
[4.8,{"$f":"$B$25+$B$26*A62+$B$27*A62^2","v":{"$error":"#VALUE!"}},{"$f":"($E$26*62.4)/(1+(A62/100)*$E$26)","v":{"$error":"#VALUE!"}}]
[{"$f":"A62-0.1","v":4.7},{"$error":"#VALUE!"},{"$error":"#VALUE!"}]
[4.5999999999999996,{"$error":"#VALUE!"},{"$error":"#VALUE!"}]
[4.5,{"$error":"#VALUE!"},{"$error":"#VALUE!"}]
[4.4000000000000004,{"$error":"#VALUE!"},{"$error":"#VALUE!"}]
[4.3,{"$error":"#VALUE!"},{"$error":"#VALUE!"}]
[4.2,{"$error":"#VALUE!"},{"$error":"#VALUE!"}]
[4.0999999999999996,{"$error":"#VALUE!"},{"$error":"#VALUE!"}]
[4,{"$error":"#VALUE!"},{"$error":"#VALUE!"}]
[3.9,{"$error":"#VALUE!"},{"$error":"#VALUE!"}]
[3.8,{"$error":"#VALUE!"},{"$error":"#VALUE!"}]
[3.7,{"$error":"#VALUE!"},{"$error":"#VALUE!"}]
[3.6,{"$error":"#VALUE!"},{"$error":"#VALUE!"}]
[3.5,{"$error":"#VALUE!"},{"$error":"#VALUE!"}]
[3.4,{"$error":"#VALUE!"},{"$error":"#VALUE!"}]
[3.3,{"$error":"#VALUE!"},{"$error":"#VALUE!"}]
[3.2,{"$error":"#VALUE!"},{"$error":"#VALUE!"}]
[3.1,{"$error":"#VALUE!"},{"$error":"#VALUE!"}]
[3,{"$error":"#VALUE!"},{"$error":"#VALUE!"}]
[2.9,{"$error":"#VALUE!"},{"$error":"#VALUE!"}]
[2.8,{"$error":"#VALUE!"},{"$error":"#VALUE!"}]
[2.7,{"$error":"#VALUE!"},{"$error":"#VALUE!"}]
[2.6,{"$error":"#VALUE!"},{"$error":"#VALUE!"}]
[2.5,{"$error":"#VALUE!"},{"$error":"#VALUE!"}]
[2.4,{"$error":"#VALUE!"},{"$error":"#VALUE!"}]
[2.2999999999999998,{"$error":"#VALUE!"},{"$error":"#VALUE!"}]
[2.2000000000000002,{"$error":"#VALUE!"},{"$error":"#VALUE!"}]
[2.1,{"$error":"#VALUE!"},{"$error":"#VALUE!"}]
[2,{"$error":"#VALUE!"},{"$error":"#VALUE!"}]
[1.9,{"$error":"#VALUE!"},{"$error":"#VALUE!"}]
[1.8,{"$error":"#VALUE!"},{"$error":"#VALUE!"}]
[1.7,{"$error":"#VALUE!"},{"$error":"#VALUE!"}]
[1.6,{"$f":"$B$25+$B$26*A94+$B$27*A94^2","v":{"$error":"#VALUE!"}},{"$f":"($E$26*62.4)/(1+(A94/100)*$E$26)","v":{"$error":"#VALUE!"}}]
[{"$f":"A94-0.1","v":1.5},{"$error":"#VALUE!"},{"$error":"#VALUE!"}]
[1.4,{"$error":"#VALUE!"},{"$error":"#VALUE!"}]
[1.3,{"$error":"#VALUE!"},{"$error":"#VALUE!"}]
[1.2,{"$error":"#VALUE!"},{"$error":"#VALUE!"}]
[1.1000000000000001,{"$error":"#VALUE!"},{"$error":"#VALUE!"}]
[1,{"$error":"#VALUE!"},{"$error":"#VALUE!"}]
[0.9,{"$error":"#VALUE!"},{"$error":"#VALUE!"}]
[0.8,{"$error":"#VALUE!"},{"$error":"#VALUE!"}]
[0.7,{"$error":"#VALUE!"},{"$error":"#VALUE!"}]
[0.6,{"$error":"#VALUE!"},{"$error":"#VALUE!"}]
[0.5,{"$error":"#VALUE!"},{"$error":"#VALUE!"}]
[0.4,{"$error":"#VALUE!"},{"$error":"#VALUE!"}]
[0.3,{"$error":"#VALUE!"},{"$error":"#VALUE!"}]
[0.2,{"$error":"#VALUE!"},{"$error":"#VALUE!"}]
[0.1,{"$error":"#VALUE!"},{"$error":"#VALUE!"}]
[0,{"$error":"#VALUE!"},{"$error":"#VALUE!"}]
[-0.1,{"$error":"#VALUE!"},{"$error":"#VALUE!"}]
[-0.2,{"$error":"#VALUE!"},{"$error":"#VALUE!"}]
[-0.3,{"$error":"#VALUE!"},{"$error":"#VALUE!"}]
[-0.4,{"$error":"#VALUE!"},{"$error":"#VALUE!"}]
[-0.5,{"$error":"#VALUE!"},{"$error":"#VALUE!"}]
[-0.6,{"$error":"#VALUE!"},{"$error":"#VALUE!"}]
[-0.7,{"$error":"#VALUE!"},{"$error":"#VALUE!"}]
[-0.8,{"$error":"#VALUE!"},{"$error":"#VALUE!"}]
[-0.9,{"$error":"#VALUE!"},{"$error":"#VALUE!"}]
[-1,{"$error":"#VALUE!"},{"$error":"#VALUE!"}]
[-1.1000000000000001,{"$error":"#VALUE!"},{"$error":"#VALUE!"}]
[-1.2,{"$error":"#VALUE!"},{"$error":"#VALUE!"}]
[-1.3,{"$error":"#VALUE!"},{"$error":"#VALUE!"}]
[-1.4,{"$error":"#VALUE!"},{"$error":"#VALUE!"}]
[-1.5,{"$error":"#VALUE!"},{"$error":"#VALUE!"}]
[-1.6,{"$f":"$B$25+$B$26*A126+$B$27*A126^2","v":{"$error":"#VALUE!"}},{"$f":"($E$26*62.4)/(1+(A126/100)*$E$26)","v":{"$error":"#VALUE!"}}]
[{"$f":"A126-0.1","v":-1.7},{"$error":"#VALUE!"},{"$error":"#VALUE!"}]
[-1.8,{"$error":"#VALUE!"},{"$error":"#VALUE!"}]
[-1.9,{"$error":"#VALUE!"},{"$error":"#VALUE!"}]
[-2,{"$error":"#VALUE!"},{"$error":"#VALUE!"}]
[-2.1,{"$error":"#VALUE!"},{"$error":"#VALUE!"}]
[-2.2000000000000002,{"$error":"#VALUE!"},{"$error":"#VALUE!"}]
[-2.2999999999999998,{"$error":"#VALUE!"},{"$error":"#VALUE!"}]
[-2.4,{"$error":"#VALUE!"},{"$error":"#VALUE!"}]
[-2.5,{"$error":"#VALUE!"},{"$error":"#VALUE!"}]
[-2.6,{"$error":"#VALUE!"},{"$error":"#VALUE!"}]
[-2.7,{"$error":"#VALUE!"},{"$error":"#VALUE!"}]
[-2.8,{"$error":"#VALUE!"},{"$error":"#VALUE!"}]
[-2.9,{"$error":"#VALUE!"},{"$error":"#VALUE!"}]
[-3,{"$error":"#VALUE!"},{"$error":"#VALUE!"}]
[-3.1,{"$error":"#VALUE!"},{"$error":"#VALUE!"}]
[-3.2,{"$error":"#VALUE!"},{"$error":"#VALUE!"}]
[-3.3,{"$error":"#VALUE!"},{"$error":"#VALUE!"}]
[-3.4,{"$error":"#VALUE!"},{"$error":"#VALUE!"}]
[-3.5,{"$error":"#VALUE!"},{"$error":"#VALUE!"}]
[-3.6,{"$error":"#VALUE!"},{"$error":"#VALUE!"}]
[-3.7,{"$error":"#VALUE!"},{"$error":"#VALUE!"}]
[-3.8,{"$error":"#VALUE!"},{"$error":"#VALUE!"}]
[-3.9,{"$error":"#VALUE!"},{"$error":"#VALUE!"}]
[-4,{"$error":"#VALUE!"},{"$error":"#VALUE!"}]
[-4.0999999999999996,{"$error":"#VALUE!"},{"$error":"#VALUE!"}]
[-4.2,{"$error":"#VALUE!"},{"$error":"#VALUE!"}]
[-4.3,{"$error":"#VALUE!"},{"$error":"#VALUE!"}]
[-4.4000000000000004,{"$error":"#VALUE!"},{"$error":"#VALUE!"}]
[-4.5,{"$error":"#VALUE!"},{"$error":"#VALUE!"}]
[-4.5999999999999996,{"$error":"#VALUE!"},{"$error":"#VALUE!"}]
[-4.7,{"$error":"#VALUE!"},{"$error":"#VALUE!"}]
[-4.8,{"$f":"$B$25+$B$26*A158+$B$27*A158^2","v":{"$error":"#VALUE!"}},{"$f":"($E$26*62.4)/(1+(A158/100)*$E$26)","v":{"$error":"#VALUE!"}}]
[{"$f":"A158-0.1","v":-4.9000000000000004},{"$error":"#VALUE!"},{"$error":"#VALUE!"}]
[-5,{"$error":"#VALUE!"},{"$error":"#VALUE!"}]
[-5.0999999999999996,{"$error":"#VALUE!"},{"$error":"#VALUE!"}]
[-5.2,{"$error":"#VALUE!"},{"$error":"#VALUE!"}]
[-5.3,{"$error":"#VALUE!"},{"$error":"#VALUE!"}]
[-5.4,{"$error":"#VALUE!"},{"$error":"#VALUE!"}]
[-5.5,{"$error":"#VALUE!"},{"$error":"#VALUE!"}]
[-5.6,{"$error":"#VALUE!"},{"$error":"#VALUE!"}]
[-5.7,{"$error":"#VALUE!"},{"$error":"#VALUE!"}]
[-5.8,{"$error":"#VALUE!"},{"$error":"#VALUE!"}]
[-5.9,{"$error":"#VALUE!"},{"$error":"#VALUE!"}]
[-6,{"$error":"#VALUE!"},{"$error":"#VALUE!"}]
[-6.1,{"$error":"#VALUE!"},{"$error":"#VALUE!"}]
[-6.2,{"$error":"#VALUE!"},{"$error":"#VALUE!"}]
[-6.3,{"$error":"#VALUE!"},{"$error":"#VALUE!"}]
[-6.4,{"$error":"#VALUE!"},{"$error":"#VALUE!"}]
[-6.5,{"$error":"#VALUE!"},{"$error":"#VALUE!"}]
[-6.6,{"$error":"#VALUE!"},{"$error":"#VALUE!"}]
[-6.7,{"$error":"#VALUE!"},{"$error":"#VALUE!"}]
[-6.8,{"$error":"#VALUE!"},{"$error":"#VALUE!"}]
[-6.9,{"$error":"#VALUE!"},{"$error":"#VALUE!"}]
[-7,{"$error":"#VALUE!"},{"$error":"#VALUE!"}]
[-7.1,{"$error":"#VALUE!"},{"$error":"#VALUE!"}]
[-7.2,{"$error":"#VALUE!"},{"$error":"#VALUE!"}]
[-7.3,{"$error":"#VALUE!"},{"$error":"#VALUE!"}]
[-7.4,{"$error":"#VALUE!"},{"$error":"#VALUE!"}]
[-7.5,{"$error":"#VALUE!"},{"$error":"#VALUE!"}]
[-7.6,{"$error":"#VALUE!"},{"$error":"#VALUE!"}]
[-7.7,{"$error":"#VALUE!"},{"$error":"#VALUE!"}]
[-7.8,{"$error":"#VALUE!"},{"$error":"#VALUE!"}]
[-7.9,{"$error":"#VALUE!"},{"$error":"#VALUE!"}]
[-8,{"$f":"$B$25+$B$26*A190+$B$27*A190^2","v":{"$error":"#VALUE!"}},{"$f":"($E$26*62.4)/(1+(A190/100)*$E$26)","v":{"$error":"#VALUE!"}}]
[{"$f":"A190-0.1","v":-8.1},{"$error":"#VALUE!"},{"$error":"#VALUE!"}]
[-8.1999999999999993,{"$error":"#VALUE!"},{"$error":"#VALUE!"}]
[-8.3000000000000007,{"$error":"#VALUE!"},{"$error":"#VALUE!"}]
[-8.4,{"$error":"#VALUE!"},{"$error":"#VALUE!"}]
[-8.5,{"$error":"#VALUE!"},{"$error":"#VALUE!"}]
[-8.6,{"$error":"#VALUE!"},{"$error":"#VALUE!"}]
[-8.6999999999999993,{"$error":"#VALUE!"},{"$error":"#VALUE!"}]
[-8.8000000000000007,{"$error":"#VALUE!"},{"$error":"#VALUE!"}]
[-8.9,{"$error":"#VALUE!"},{"$error":"#VALUE!"}]
[-9,{"$error":"#VALUE!"},{"$error":"#VALUE!"}]
[-9.1,{"$error":"#VALUE!"},{"$error":"#VALUE!"}]

{"sheet":"Reference (2)","index":6,"n_rows":201,"n_cols":5,"rows_kept":201,"cut":false,"hidden":true,"merged":[]}
["m1",{"$f":"(B12-B11)/(C12-C11)","v":{"$error":"#VALUE!"}}]
["b1",{"$f":"B11-B1*C11","v":{"$error":"#VALUE!"}},"X-Peak",{"$f":"(B4-B2)/(B1-B3)","v":{"$error":"#VALUE!"}}]
["m2",{"$f":"IF(B13>0,B1*-1,(B14-B13)/(C14-C13))","v":{"$error":"#VALUE!"}},"Y-Peak",{"$f":"B1*D2+B2","v":{"$error":"#VALUE!"}}]
["b2",{"$f":"B13-C13*B3","v":{"$error":"#VALUE!"}}]
[]
[]
[]
[]
[]
["N","Y","X","X^2"]
[1,{"$f":"'Optimum Moisture'!G46","v":""},{"$f":"'Optimum Moisture'!G45","v":""},{"$f":"C11^2","v":{"$error":"#VALUE!"}}]
[2,{"$f":"'Optimum Moisture'!H46","v":""},{"$f":"'Optimum Moisture'!H45","v":""},{"$error":"#VALUE!"}]
[3,{"$f":"'Optimum Moisture'!I46","v":""},{"$f":"'Optimum Moisture'!I45","v":""},{"$error":"#VALUE!"}]
[4,{"$f":"D3","v":{"$error":"#VALUE!"}},{"$f":"D2","v":{"$error":"#VALUE!"}},{"$error":"#VALUE!"}]
[5,{"$f":"D3","v":{"$error":"#VALUE!"}},{"$f":"$D$2","v":{"$error":"#VALUE!"}},{"$error":"#VALUE!"}]
[6,{"$f":"D3","v":{"$error":"#VALUE!"}},{"$f":"$D$2","v":{"$error":"#VALUE!"}},{"$error":"#VALUE!"}]
[7,{"$f":"D3","v":{"$error":"#VALUE!"}},{"$f":"$D$2","v":{"$error":"#VALUE!"}},{"$error":"#VALUE!"}]
[8,{"$f":"D3","v":{"$error":"#VALUE!"}},{"$f":"D2","v":{"$error":"#VALUE!"}},{"$error":"#VALUE!"}]
["SUM",{"$f":"SUM(B13:B17)","v":{"$error":"#VALUE!"}},{"$f":"SUM(C13:C17)","v":{"$error":"#VALUE!"}},{"$f":"SUM(D11:D17)","v":{"$error":"#VALUE!"}}]
[]
[]
["MAX DEN",{"$f":"B27*B23^2+B26*B23+B25","v":{"$error":"#VALUE!"}}]
["MAX  W",{"$f":"-B26/(2*B27)","v":{"$error":"#VALUE!"}}]
[]
["Ao",{"$f":"INDEX(LINEST($B$11:$B$14,$C$11:$D$14),3)","v":{"$error":"#VALUE!"}}]
["A1",{"$f":"INDEX(LINEST($B$11:$B$14,$C$11:$D$14),2)","v":{"$error":"#VALUE!"}},null,"SG",{"$f":"SpecificGravity","v":""}]
["A2",{"$f":"INDEX(LINEST($B$11:$B$14,$C$11:$D$14),1)","v":{"$error":"#VALUE!"}}]
[]
["W","dry density","zav"]
[{"$f":"'Optimum Moisture'!$I$29","v":0},{"$f":"$B$25+$B$26*A30+$B$27*A30^2","v":{"$error":"#VALUE!"}},{"$f":"($E$26*62.4)/(1+(A30/100)*$E$26)","v":{"$error":"#VALUE!"}}]
[{"$f":"A30-0.1","v":-0.1},{"$error":"#VALUE!"},{"$error":"#VALUE!"}]
[-0.2,{"$error":"#VALUE!"},{"$error":"#VALUE!"}]
[-0.3,{"$error":"#VALUE!"},{"$error":"#VALUE!"}]
[-0.4,{"$error":"#VALUE!"},{"$error":"#VALUE!"}]
[-0.5,{"$error":"#VALUE!"},{"$error":"#VALUE!"}]
[-0.6,{"$error":"#VALUE!"},{"$error":"#VALUE!"}]
[-0.7,{"$error":"#VALUE!"},{"$error":"#VALUE!"}]
[-0.8,{"$error":"#VALUE!"},{"$error":"#VALUE!"}]
[-0.9,{"$error":"#VALUE!"},{"$error":"#VALUE!"}]
[-1,{"$error":"#VALUE!"},{"$error":"#VALUE!"}]
[-1.1000000000000001,{"$error":"#VALUE!"},{"$error":"#VALUE!"}]
[-1.2,{"$error":"#VALUE!"},{"$error":"#VALUE!"}]
[-1.3,{"$error":"#VALUE!"},{"$error":"#VALUE!"}]
[-1.4,{"$error":"#VALUE!"},{"$error":"#VALUE!"}]
[-1.5,{"$error":"#VALUE!"},{"$error":"#VALUE!"}]
[-1.6,{"$error":"#VALUE!"},{"$error":"#VALUE!"}]
[-1.7,{"$error":"#VALUE!"},{"$error":"#VALUE!"}]
[-1.8,{"$error":"#VALUE!"},{"$error":"#VALUE!"}]
[-1.9,{"$error":"#VALUE!"},{"$error":"#VALUE!"}]
[-2,{"$error":"#VALUE!"},{"$error":"#VALUE!"}]
[-2.1,{"$error":"#VALUE!"},{"$error":"#VALUE!"}]
[-2.2000000000000002,{"$error":"#VALUE!"},{"$error":"#VALUE!"}]
[-2.2999999999999998,{"$error":"#VALUE!"},{"$error":"#VALUE!"}]
[-2.4,{"$error":"#VALUE!"},{"$error":"#VALUE!"}]
[-2.5,{"$error":"#VALUE!"},{"$error":"#VALUE!"}]
[-2.6,{"$error":"#VALUE!"},{"$error":"#VALUE!"}]
[-2.7,{"$error":"#VALUE!"},{"$error":"#VALUE!"}]
[-2.8,{"$error":"#VALUE!"},{"$error":"#VALUE!"}]
[-2.9,{"$error":"#VALUE!"},{"$error":"#VALUE!"}]
[-3,{"$error":"#VALUE!"},{"$error":"#VALUE!"}]
[-3.1,{"$error":"#VALUE!"},{"$error":"#VALUE!"}]
[-3.2,{"$f":"$B$25+$B$26*A62+$B$27*A62^2","v":{"$error":"#VALUE!"}},{"$f":"($E$26*62.4)/(1+(A62/100)*$E$26)","v":{"$error":"#VALUE!"}}]
[{"$f":"A62-0.1","v":-3.3},{"$error":"#VALUE!"},{"$error":"#VALUE!"}]
[-3.4,{"$error":"#VALUE!"},{"$error":"#VALUE!"}]
[-3.5,{"$error":"#VALUE!"},{"$error":"#VALUE!"}]
[-3.6,{"$error":"#VALUE!"},{"$error":"#VALUE!"}]
[-3.7,{"$error":"#VALUE!"},{"$error":"#VALUE!"}]
[-3.8,{"$error":"#VALUE!"},{"$error":"#VALUE!"}]
[-3.9,{"$error":"#VALUE!"},{"$error":"#VALUE!"}]
[-4,{"$error":"#VALUE!"},{"$error":"#VALUE!"}]
[-4.0999999999999996,{"$error":"#VALUE!"},{"$error":"#VALUE!"}]
[-4.2,{"$error":"#VALUE!"},{"$error":"#VALUE!"}]
[-4.3,{"$error":"#VALUE!"},{"$error":"#VALUE!"}]
[-4.4000000000000004,{"$error":"#VALUE!"},{"$error":"#VALUE!"}]
[-4.5,{"$error":"#VALUE!"},{"$error":"#VALUE!"}]
[-4.5999999999999996,{"$error":"#VALUE!"},{"$error":"#VALUE!"}]
[-4.7,{"$error":"#VALUE!"},{"$error":"#VALUE!"}]
[-4.8,{"$error":"#VALUE!"},{"$error":"#VALUE!"}]
[-4.9000000000000004,{"$error":"#VALUE!"},{"$error":"#VALUE!"}]
[-5,{"$error":"#VALUE!"},{"$error":"#VALUE!"}]
[-5.0999999999999996,{"$error":"#VALUE!"},{"$error":"#VALUE!"}]
[-5.2,{"$error":"#VALUE!"},{"$error":"#VALUE!"}]
[-5.3,{"$error":"#VALUE!"},{"$error":"#VALUE!"}]
[-5.4,{"$error":"#VALUE!"},{"$error":"#VALUE!"}]
[-5.5,{"$error":"#VALUE!"},{"$error":"#VALUE!"}]
[-5.6,{"$error":"#VALUE!"},{"$error":"#VALUE!"}]
[-5.7,{"$error":"#VALUE!"},{"$error":"#VALUE!"}]
[-5.8,{"$error":"#VALUE!"},{"$error":"#VALUE!"}]
[-5.9,{"$error":"#VALUE!"},{"$error":"#VALUE!"}]
[-6,{"$error":"#VALUE!"},{"$error":"#VALUE!"}]
[-6.1,{"$error":"#VALUE!"},{"$error":"#VALUE!"}]
[-6.2,{"$error":"#VALUE!"},{"$error":"#VALUE!"}]
[-6.3,{"$error":"#VALUE!"},{"$error":"#VALUE!"}]
[-6.4,{"$f":"$B$25+$B$26*A94+$B$27*A94^2","v":{"$error":"#VALUE!"}},{"$f":"($E$26*62.4)/(1+(A94/100)*$E$26)","v":{"$error":"#VALUE!"}}]
[{"$f":"A94-0.1","v":-6.5},{"$error":"#VALUE!"},{"$error":"#VALUE!"}]
[-6.6,{"$error":"#VALUE!"},{"$error":"#VALUE!"}]
[-6.7,{"$error":"#VALUE!"},{"$error":"#VALUE!"}]
[-6.8,{"$error":"#VALUE!"},{"$error":"#VALUE!"}]
[-6.9,{"$error":"#VALUE!"},{"$error":"#VALUE!"}]
[-7,{"$error":"#VALUE!"},{"$error":"#VALUE!"}]
[-7.1,{"$error":"#VALUE!"},{"$error":"#VALUE!"}]
[-7.2,{"$error":"#VALUE!"},{"$error":"#VALUE!"}]
[-7.3,{"$error":"#VALUE!"},{"$error":"#VALUE!"}]
[-7.4,{"$error":"#VALUE!"},{"$error":"#VALUE!"}]
[-7.5,{"$error":"#VALUE!"},{"$error":"#VALUE!"}]
[-7.6,{"$error":"#VALUE!"},{"$error":"#VALUE!"}]
[-7.7,{"$error":"#VALUE!"},{"$error":"#VALUE!"}]
[-7.8,{"$error":"#VALUE!"},{"$error":"#VALUE!"}]
[-7.9,{"$error":"#VALUE!"},{"$error":"#VALUE!"}]
[-8,{"$error":"#VALUE!"},{"$error":"#VALUE!"}]
[-8.1,{"$error":"#VALUE!"},{"$error":"#VALUE!"}]
[-8.1999999999999993,{"$error":"#VALUE!"},{"$error":"#VALUE!"}]
[-8.3000000000000007,{"$error":"#VALUE!"},{"$error":"#VALUE!"}]
[-8.4,{"$error":"#VALUE!"},{"$error":"#VALUE!"}]
[-8.5,{"$error":"#VALUE!"},{"$error":"#VALUE!"}]
[-8.6,{"$error":"#VALUE!"},{"$error":"#VALUE!"}]
[-8.6999999999999993,{"$error":"#VALUE!"},{"$error":"#VALUE!"}]
[-8.8000000000000007,{"$error":"#VALUE!"},{"$error":"#VALUE!"}]
[-8.9,{"$error":"#VALUE!"},{"$error":"#VALUE!"}]
[-9,{"$error":"#VALUE!"},{"$error":"#VALUE!"}]
[-9.1,{"$error":"#VALUE!"},{"$error":"#VALUE!"}]
[-9.1999999999999993,{"$error":"#VALUE!"},{"$error":"#VALUE!"}]
[-9.3000000000000007,{"$error":"#VALUE!"},{"$error":"#VALUE!"}]
[-9.4,{"$error":"#VALUE!"},{"$error":"#VALUE!"}]
[-9.5,{"$error":"#VALUE!"},{"$error":"#VALUE!"}]
[-9.6,{"$f":"$B$25+$B$26*A126+$B$27*A126^2","v":{"$error":"#VALUE!"}},{"$f":"($E$26*62.4)/(1+(A126/100)*$E$26)","v":{"$error":"#VALUE!"}}]
[{"$f":"A126-0.1","v":-9.6999999999999993},{"$error":"#VALUE!"},{"$error":"#VALUE!"}]
[-9.8000000000000007,{"$error":"#VALUE!"},{"$error":"#VALUE!"}]
[-9.9,{"$error":"#VALUE!"},{"$error":"#VALUE!"}]
[-10,{"$error":"#VALUE!"},{"$error":"#VALUE!"}]
[-10.1,{"$error":"#VALUE!"},{"$error":"#VALUE!"}]
[-10.199999999999999,{"$error":"#VALUE!"},{"$error":"#VALUE!"}]
[-10.3,{"$error":"#VALUE!"},{"$error":"#VALUE!"}]
[-10.4,{"$error":"#VALUE!"},{"$error":"#VALUE!"}]
[-10.5,{"$error":"#VALUE!"},{"$error":"#VALUE!"}]
[-10.6,{"$error":"#VALUE!"},{"$error":"#VALUE!"}]
[-10.7,{"$error":"#VALUE!"},{"$error":"#VALUE!"}]
[-10.8,{"$error":"#VALUE!"},{"$error":"#VALUE!"}]
[-10.9,{"$error":"#VALUE!"},{"$error":"#VALUE!"}]
[-11,{"$error":"#VALUE!"},{"$error":"#VALUE!"}]
[-11.1,{"$error":"#VALUE!"},{"$error":"#VALUE!"}]
[-11.2,{"$error":"#VALUE!"},{"$error":"#VALUE!"}]
[-11.3,{"$error":"#VALUE!"},{"$error":"#VALUE!"}]
[-11.4,{"$error":"#VALUE!"},{"$error":"#VALUE!"}]
[-11.5,{"$error":"#VALUE!"},{"$error":"#VALUE!"}]
[-11.6,{"$error":"#VALUE!"},{"$error":"#VALUE!"}]
[-11.7,{"$error":"#VALUE!"},{"$error":"#VALUE!"}]
[-11.8,{"$error":"#VALUE!"},{"$error":"#VALUE!"}]
[-11.9,{"$error":"#VALUE!"},{"$error":"#VALUE!"}]
[-12,{"$error":"#VALUE!"},{"$error":"#VALUE!"}]
[-12.1,{"$error":"#VALUE!"},{"$error":"#VALUE!"}]
[-12.2,{"$error":"#VALUE!"},{"$error":"#VALUE!"}]
[-12.3,{"$error":"#VALUE!"},{"$error":"#VALUE!"}]
[-12.4,{"$error":"#VALUE!"},{"$error":"#VALUE!"}]
[-12.5,{"$error":"#VALUE!"},{"$error":"#VALUE!"}]
[-12.6,{"$error":"#VALUE!"},{"$error":"#VALUE!"}]
[-12.7,{"$error":"#VALUE!"},{"$error":"#VALUE!"}]
[-12.8,{"$f":"$B$25+$B$26*A158+$B$27*A158^2","v":{"$error":"#VALUE!"}},{"$f":"($E$26*62.4)/(1+(A158/100)*$E$26)","v":{"$error":"#VALUE!"}}]
[{"$f":"A158-0.1","v":-12.9},{"$error":"#VALUE!"},{"$error":"#VALUE!"}]
[-13,{"$error":"#VALUE!"},{"$error":"#VALUE!"}]
[-13.1,{"$error":"#VALUE!"},{"$error":"#VALUE!"}]
[-13.2,{"$error":"#VALUE!"},{"$error":"#VALUE!"}]
[-13.3,{"$error":"#VALUE!"},{"$error":"#VALUE!"}]
[-13.4,{"$error":"#VALUE!"},{"$error":"#VALUE!"}]
[-13.5,{"$error":"#VALUE!"},{"$error":"#VALUE!"}]
[-13.6,{"$error":"#VALUE!"},{"$error":"#VALUE!"}]
[-13.7,{"$error":"#VALUE!"},{"$error":"#VALUE!"}]
[-13.8,{"$error":"#VALUE!"},{"$error":"#VALUE!"}]
[-13.9,{"$error":"#VALUE!"},{"$error":"#VALUE!"}]
[-14,{"$error":"#VALUE!"},{"$error":"#VALUE!"}]
[-14.1,{"$error":"#VALUE!"},{"$error":"#VALUE!"}]
[-14.2,{"$error":"#VALUE!"},{"$error":"#VALUE!"}]
[-14.3,{"$error":"#VALUE!"},{"$error":"#VALUE!"}]
[-14.4,{"$error":"#VALUE!"},{"$error":"#VALUE!"}]
[-14.5,{"$error":"#VALUE!"},{"$error":"#VALUE!"}]
[-14.6,{"$error":"#VALUE!"},{"$error":"#VALUE!"}]
[-14.7,{"$error":"#VALUE!"},{"$error":"#VALUE!"}]
[-14.8,{"$error":"#VALUE!"},{"$error":"#VALUE!"}]
[-14.9,{"$error":"#VALUE!"},{"$error":"#VALUE!"}]
[-15,{"$error":"#VALUE!"},{"$error":"#VALUE!"}]
[-15.1,{"$error":"#VALUE!"},{"$error":"#VALUE!"}]
[-15.2,{"$error":"#VALUE!"},{"$error":"#VALUE!"}]
[-15.3,{"$error":"#VALUE!"},{"$error":"#VALUE!"}]
[-15.4,{"$error":"#VALUE!"},{"$error":"#VALUE!"}]
[-15.5,{"$error":"#VALUE!"},{"$error":"#VALUE!"}]
[-15.6,{"$error":"#VALUE!"},{"$error":"#VALUE!"}]
[-15.7,{"$error":"#VALUE!"},{"$error":"#VALUE!"}]
[-15.8,{"$error":"#VALUE!"},{"$error":"#VALUE!"}]
[-15.9,{"$error":"#VALUE!"},{"$error":"#VALUE!"}]
[-16,{"$f":"$B$25+$B$26*A190+$B$27*A190^2","v":{"$error":"#VALUE!"}},{"$f":"($E$26*62.4)/(1+(A190/100)*$E$26)","v":{"$error":"#VALUE!"}}]
[{"$f":"A190-0.1","v":-16.100000000000001},{"$error":"#VALUE!"},{"$error":"#VALUE!"}]
[-16.2,{"$error":"#VALUE!"},{"$error":"#VALUE!"}]
[-16.3,{"$error":"#VALUE!"},{"$error":"#VALUE!"}]
[-16.399999999999999,{"$error":"#VALUE!"},{"$error":"#VALUE!"}]
[-16.5,{"$error":"#VALUE!"},{"$error":"#VALUE!"}]
[-16.600000000000001,{"$error":"#VALUE!"},{"$error":"#VALUE!"}]
[-16.7,{"$error":"#VALUE!"},{"$error":"#VALUE!"}]
[-16.8,{"$error":"#VALUE!"},{"$error":"#VALUE!"}]
[-16.899999999999999,{"$error":"#VALUE!"},{"$error":"#VALUE!"}]
[-17,{"$error":"#VALUE!"},{"$error":"#VALUE!"}]
[-17.100000000000001,{"$error":"#VALUE!"},{"$error":"#VALUE!"}]

{"sheet":"Reference (3)","index":7,"n_rows":201,"n_cols":5,"rows_kept":201,"cut":false,"hidden":true,"merged":[]}
["m1",{"$f":"(B12-B11)/(C12-C11)","v":{"$error":"#VALUE!"}}]
["b1",{"$f":"B11-B1*C11","v":{"$error":"#VALUE!"}},"X-Peak",{"$f":"(B4-B2)/(B1-B3)","v":{"$error":"#VALUE!"}}]
["m2",{"$f":"IF(B13>0,B1*-1,(B14-B13)/(C14-C13))","v":{"$error":"#VALUE!"}},"Y-Peak",{"$f":"B1*D2+B2","v":{"$error":"#VALUE!"}}]
["b2",{"$f":"B13-C13*B3","v":{"$error":"#VALUE!"}}]
[]
[]
[]
[]
[]
["N","Y","X","X^2"]
[1,{"$f":"'Optimum Moisture'!J46","v":""},{"$f":"'Optimum Moisture'!J45","v":""},{"$f":"C11^2","v":{"$error":"#VALUE!"}}]
[2,{"$f":"'Optimum Moisture'!K46","v":""},{"$f":"'Optimum Moisture'!K45","v":""},{"$error":"#VALUE!"}]
[3,{"$f":"'Optimum Moisture'!L46","v":""},{"$f":"'Optimum Moisture'!L45","v":""},{"$error":"#VALUE!"}]
[4,{"$f":"D3","v":{"$error":"#VALUE!"}},{"$f":"D2","v":{"$error":"#VALUE!"}},{"$error":"#VALUE!"}]
[5,{"$f":"D3","v":{"$error":"#VALUE!"}},{"$f":"$D$2","v":{"$error":"#VALUE!"}},{"$error":"#VALUE!"}]
[6,{"$f":"D3","v":{"$error":"#VALUE!"}},{"$f":"$D$2","v":{"$error":"#VALUE!"}},{"$error":"#VALUE!"}]
[7,{"$f":"D3","v":{"$error":"#VALUE!"}},{"$f":"$D$2","v":{"$error":"#VALUE!"}},{"$error":"#VALUE!"}]
[8,{"$f":"D3","v":{"$error":"#VALUE!"}},{"$f":"D2","v":{"$error":"#VALUE!"}},{"$error":"#VALUE!"}]
["SUM",{"$f":"SUM(B13:B17)","v":{"$error":"#VALUE!"}},{"$f":"SUM(C13:C17)","v":{"$error":"#VALUE!"}},{"$f":"SUM(D11:D17)","v":{"$error":"#VALUE!"}}]
[]
[]
["MAX DEN",{"$f":"B27*B23^2+B26*B23+B25","v":{"$error":"#VALUE!"}}]
["MAX  W",{"$f":"-B26/(2*B27)","v":{"$error":"#VALUE!"}}]
[]
["Ao",{"$f":"INDEX(LINEST($B$11:$B$14,$C$11:$D$14),3)","v":{"$error":"#VALUE!"}}]
["A1",{"$f":"INDEX(LINEST($B$11:$B$14,$C$11:$D$14),2)","v":{"$error":"#VALUE!"}},null,"SG",{"$f":"SpecificGravity","v":""}]
["A2",{"$f":"INDEX(LINEST($B$11:$B$14,$C$11:$D$14),1)","v":{"$error":"#VALUE!"}}]
[]
["W","dry density","zav"]
[{"$f":"'Optimum Moisture'!$L$29","v":0},{"$f":"$B$25+$B$26*A30+$B$27*A30^2","v":{"$error":"#VALUE!"}},{"$f":"($E$26*62.4)/(1+(A30/100)*$E$26)","v":{"$error":"#VALUE!"}}]
[{"$f":"A30-0.1","v":-0.1},{"$error":"#VALUE!"},{"$error":"#VALUE!"}]
[-0.2,{"$error":"#VALUE!"},{"$error":"#VALUE!"}]
[-0.3,{"$error":"#VALUE!"},{"$error":"#VALUE!"}]
[-0.4,{"$error":"#VALUE!"},{"$error":"#VALUE!"}]
[-0.5,{"$error":"#VALUE!"},{"$error":"#VALUE!"}]
[-0.6,{"$error":"#VALUE!"},{"$error":"#VALUE!"}]
[-0.7,{"$error":"#VALUE!"},{"$error":"#VALUE!"}]
[-0.8,{"$error":"#VALUE!"},{"$error":"#VALUE!"}]
[-0.9,{"$error":"#VALUE!"},{"$error":"#VALUE!"}]
[-1,{"$error":"#VALUE!"},{"$error":"#VALUE!"}]
[-1.1000000000000001,{"$error":"#VALUE!"},{"$error":"#VALUE!"}]
[-1.2,{"$error":"#VALUE!"},{"$error":"#VALUE!"}]
[-1.3,{"$error":"#VALUE!"},{"$error":"#VALUE!"}]
[-1.4,{"$error":"#VALUE!"},{"$error":"#VALUE!"}]
[-1.5,{"$error":"#VALUE!"},{"$error":"#VALUE!"}]
[-1.6,{"$error":"#VALUE!"},{"$error":"#VALUE!"}]
[-1.7,{"$error":"#VALUE!"},{"$error":"#VALUE!"}]
[-1.8,{"$error":"#VALUE!"},{"$error":"#VALUE!"}]
[-1.9,{"$error":"#VALUE!"},{"$error":"#VALUE!"}]
[-2,{"$error":"#VALUE!"},{"$error":"#VALUE!"}]
[-2.1,{"$error":"#VALUE!"},{"$error":"#VALUE!"}]
[-2.2000000000000002,{"$error":"#VALUE!"},{"$error":"#VALUE!"}]
[-2.2999999999999998,{"$error":"#VALUE!"},{"$error":"#VALUE!"}]
[-2.4,{"$error":"#VALUE!"},{"$error":"#VALUE!"}]
[-2.5,{"$error":"#VALUE!"},{"$error":"#VALUE!"}]
[-2.6,{"$error":"#VALUE!"},{"$error":"#VALUE!"}]
[-2.7,{"$error":"#VALUE!"},{"$error":"#VALUE!"}]
[-2.8,{"$error":"#VALUE!"},{"$error":"#VALUE!"}]
[-2.9,{"$error":"#VALUE!"},{"$error":"#VALUE!"}]
[-3,{"$error":"#VALUE!"},{"$error":"#VALUE!"}]
[-3.1,{"$error":"#VALUE!"},{"$error":"#VALUE!"}]
[-3.2,{"$error":"#VALUE!"},{"$error":"#VALUE!"}]
[-3.3,{"$error":"#VALUE!"},{"$error":"#VALUE!"}]
[-3.4,{"$error":"#VALUE!"},{"$error":"#VALUE!"}]
[-3.5,{"$error":"#VALUE!"},{"$error":"#VALUE!"}]
[-3.6,{"$error":"#VALUE!"},{"$error":"#VALUE!"}]
[-3.7,{"$error":"#VALUE!"},{"$error":"#VALUE!"}]
[-3.8,{"$error":"#VALUE!"},{"$error":"#VALUE!"}]
[-3.9,{"$error":"#VALUE!"},{"$error":"#VALUE!"}]
[-4,{"$error":"#VALUE!"},{"$error":"#VALUE!"}]
[-4.0999999999999996,{"$error":"#VALUE!"},{"$error":"#VALUE!"}]
[-4.2,{"$error":"#VALUE!"},{"$error":"#VALUE!"}]
[-4.3,{"$error":"#VALUE!"},{"$error":"#VALUE!"}]
[-4.4000000000000004,{"$error":"#VALUE!"},{"$error":"#VALUE!"}]
[-4.5,{"$error":"#VALUE!"},{"$error":"#VALUE!"}]
[-4.5999999999999996,{"$error":"#VALUE!"},{"$error":"#VALUE!"}]
[-4.7,{"$error":"#VALUE!"},{"$error":"#VALUE!"}]
[-4.8,{"$error":"#VALUE!"},{"$error":"#VALUE!"}]
[-4.9000000000000004,{"$error":"#VALUE!"},{"$error":"#VALUE!"}]
[-5,{"$error":"#VALUE!"},{"$error":"#VALUE!"}]
[-5.0999999999999996,{"$error":"#VALUE!"},{"$error":"#VALUE!"}]
[-5.2,{"$error":"#VALUE!"},{"$error":"#VALUE!"}]
[-5.3,{"$error":"#VALUE!"},{"$error":"#VALUE!"}]
[-5.4,{"$error":"#VALUE!"},{"$error":"#VALUE!"}]
[-5.5,{"$error":"#VALUE!"},{"$error":"#VALUE!"}]
[-5.6,{"$error":"#VALUE!"},{"$error":"#VALUE!"}]
[-5.7,{"$error":"#VALUE!"},{"$error":"#VALUE!"}]
[-5.8,{"$error":"#VALUE!"},{"$error":"#VALUE!"}]
[-5.9,{"$error":"#VALUE!"},{"$error":"#VALUE!"}]
[-6,{"$error":"#VALUE!"},{"$error":"#VALUE!"}]
[-6.1,{"$error":"#VALUE!"},{"$error":"#VALUE!"}]
[-6.2,{"$error":"#VALUE!"},{"$error":"#VALUE!"}]
[-6.3,{"$error":"#VALUE!"},{"$error":"#VALUE!"}]
[-6.4,{"$f":"$B$25+$B$26*A94+$B$27*A94^2","v":{"$error":"#VALUE!"}},{"$f":"($E$26*62.4)/(1+(A94/100)*$E$26)","v":{"$error":"#VALUE!"}}]
[{"$f":"A94-0.1","v":-6.5},{"$error":"#VALUE!"},{"$error":"#VALUE!"}]
[-6.6,{"$error":"#VALUE!"},{"$error":"#VALUE!"}]
[-6.7,{"$error":"#VALUE!"},{"$error":"#VALUE!"}]
[-6.8,{"$error":"#VALUE!"},{"$error":"#VALUE!"}]
[-6.9,{"$error":"#VALUE!"},{"$error":"#VALUE!"}]
[-7,{"$error":"#VALUE!"},{"$error":"#VALUE!"}]
[-7.1,{"$error":"#VALUE!"},{"$error":"#VALUE!"}]
[-7.2,{"$error":"#VALUE!"},{"$error":"#VALUE!"}]
[-7.3,{"$error":"#VALUE!"},{"$error":"#VALUE!"}]
[-7.4,{"$error":"#VALUE!"},{"$error":"#VALUE!"}]
[-7.5,{"$error":"#VALUE!"},{"$error":"#VALUE!"}]
[-7.6,{"$error":"#VALUE!"},{"$error":"#VALUE!"}]
[-7.7,{"$error":"#VALUE!"},{"$error":"#VALUE!"}]
[-7.8,{"$error":"#VALUE!"},{"$error":"#VALUE!"}]
[-7.9,{"$error":"#VALUE!"},{"$error":"#VALUE!"}]
[-8,{"$error":"#VALUE!"},{"$error":"#VALUE!"}]
[-8.1,{"$error":"#VALUE!"},{"$error":"#VALUE!"}]
[-8.1999999999999993,{"$error":"#VALUE!"},{"$error":"#VALUE!"}]
[-8.3000000000000007,{"$error":"#VALUE!"},{"$error":"#VALUE!"}]
[-8.4,{"$error":"#VALUE!"},{"$error":"#VALUE!"}]
[-8.5,{"$error":"#VALUE!"},{"$error":"#VALUE!"}]
[-8.6,{"$error":"#VALUE!"},{"$error":"#VALUE!"}]
[-8.6999999999999993,{"$error":"#VALUE!"},{"$error":"#VALUE!"}]
[-8.8000000000000007,{"$error":"#VALUE!"},{"$error":"#VALUE!"}]
[-8.9,{"$error":"#VALUE!"},{"$error":"#VALUE!"}]
[-9,{"$error":"#VALUE!"},{"$error":"#VALUE!"}]
[-9.1,{"$error":"#VALUE!"},{"$error":"#VALUE!"}]
[-9.1999999999999993,{"$error":"#VALUE!"},{"$error":"#VALUE!"}]
[-9.3000000000000007,{"$error":"#VALUE!"},{"$error":"#VALUE!"}]
[-9.4,{"$error":"#VALUE!"},{"$error":"#VALUE!"}]
[-9.5,{"$error":"#VALUE!"},{"$error":"#VALUE!"}]
[-9.6,{"$error":"#VALUE!"},{"$error":"#VALUE!"}]
[-9.6999999999999993,{"$error":"#VALUE!"},{"$error":"#VALUE!"}]
[-9.8000000000000007,{"$error":"#VALUE!"},{"$error":"#VALUE!"}]
[-9.9,{"$error":"#VALUE!"},{"$error":"#VALUE!"}]
[-10,{"$error":"#VALUE!"},{"$error":"#VALUE!"}]
[-10.1,{"$error":"#VALUE!"},{"$error":"#VALUE!"}]
[-10.199999999999999,{"$error":"#VALUE!"},{"$error":"#VALUE!"}]
[-10.3,{"$error":"#VALUE!"},{"$error":"#VALUE!"}]
[-10.4,{"$error":"#VALUE!"},{"$error":"#VALUE!"}]
[-10.5,{"$error":"#VALUE!"},{"$error":"#VALUE!"}]
[-10.6,{"$error":"#VALUE!"},{"$error":"#VALUE!"}]
[-10.7,{"$error":"#VALUE!"},{"$error":"#VALUE!"}]
[-10.8,{"$error":"#VALUE!"},{"$error":"#VALUE!"}]
[-10.9,{"$error":"#VALUE!"},{"$error":"#VALUE!"}]
[-11,{"$error":"#VALUE!"},{"$error":"#VALUE!"}]
[-11.1,{"$error":"#VALUE!"},{"$error":"#VALUE!"}]
[-11.2,{"$error":"#VALUE!"},{"$error":"#VALUE!"}]
[-11.3,{"$error":"#VALUE!"},{"$error":"#VALUE!"}]
[-11.4,{"$error":"#VALUE!"},{"$error":"#VALUE!"}]
[-11.5,{"$error":"#VALUE!"},{"$error":"#VALUE!"}]
[-11.6,{"$error":"#VALUE!"},{"$error":"#VALUE!"}]
[-11.7,{"$error":"#VALUE!"},{"$error":"#VALUE!"}]
[-11.8,{"$error":"#VALUE!"},{"$error":"#VALUE!"}]
[-11.9,{"$error":"#VALUE!"},{"$error":"#VALUE!"}]
[-12,{"$error":"#VALUE!"},{"$error":"#VALUE!"}]
[-12.1,{"$error":"#VALUE!"},{"$error":"#VALUE!"}]
[-12.2,{"$error":"#VALUE!"},{"$error":"#VALUE!"}]
[-12.3,{"$error":"#VALUE!"},{"$error":"#VALUE!"}]
[-12.4,{"$error":"#VALUE!"},{"$error":"#VALUE!"}]
[-12.5,{"$error":"#VALUE!"},{"$error":"#VALUE!"}]
[-12.6,{"$error":"#VALUE!"},{"$error":"#VALUE!"}]
[-12.7,{"$error":"#VALUE!"},{"$error":"#VALUE!"}]
[-12.8,{"$f":"$B$25+$B$26*A158+$B$27*A158^2","v":{"$error":"#VALUE!"}},{"$f":"($E$26*62.4)/(1+(A158/100)*$E$26)","v":{"$error":"#VALUE!"}}]
[{"$f":"A158-0.1","v":-12.9},{"$error":"#VALUE!"},{"$error":"#VALUE!"}]
[-13,{"$error":"#VALUE!"},{"$error":"#VALUE!"}]
[-13.1,{"$error":"#VALUE!"},{"$error":"#VALUE!"}]
[-13.2,{"$error":"#VALUE!"},{"$error":"#VALUE!"}]
[-13.3,{"$error":"#VALUE!"},{"$error":"#VALUE!"}]
[-13.4,{"$error":"#VALUE!"},{"$error":"#VALUE!"}]
[-13.5,{"$error":"#VALUE!"},{"$error":"#VALUE!"}]
[-13.6,{"$error":"#VALUE!"},{"$error":"#VALUE!"}]
[-13.7,{"$error":"#VALUE!"},{"$error":"#VALUE!"}]
[-13.8,{"$error":"#VALUE!"},{"$error":"#VALUE!"}]
[-13.9,{"$error":"#VALUE!"},{"$error":"#VALUE!"}]
[-14,{"$error":"#VALUE!"},{"$error":"#VALUE!"}]
[-14.1,{"$error":"#VALUE!"},{"$error":"#VALUE!"}]
[-14.2,{"$error":"#VALUE!"},{"$error":"#VALUE!"}]
[-14.3,{"$error":"#VALUE!"},{"$error":"#VALUE!"}]
[-14.4,{"$error":"#VALUE!"},{"$error":"#VALUE!"}]
[-14.5,{"$error":"#VALUE!"},{"$error":"#VALUE!"}]
[-14.6,{"$error":"#VALUE!"},{"$error":"#VALUE!"}]
[-14.7,{"$error":"#VALUE!"},{"$error":"#VALUE!"}]
[-14.8,{"$error":"#VALUE!"},{"$error":"#VALUE!"}]
[-14.9,{"$error":"#VALUE!"},{"$error":"#VALUE!"}]
[-15,{"$error":"#VALUE!"},{"$error":"#VALUE!"}]
[-15.1,{"$error":"#VALUE!"},{"$error":"#VALUE!"}]
[-15.2,{"$error":"#VALUE!"},{"$error":"#VALUE!"}]
[-15.3,{"$error":"#VALUE!"},{"$error":"#VALUE!"}]
[-15.4,{"$error":"#VALUE!"},{"$error":"#VALUE!"}]
[-15.5,{"$error":"#VALUE!"},{"$error":"#VALUE!"}]
[-15.6,{"$error":"#VALUE!"},{"$error":"#VALUE!"}]
[-15.7,{"$error":"#VALUE!"},{"$error":"#VALUE!"}]
[-15.8,{"$error":"#VALUE!"},{"$error":"#VALUE!"}]
[-15.9,{"$error":"#VALUE!"},{"$error":"#VALUE!"}]
[-16,{"$error":"#VALUE!"},{"$error":"#VALUE!"}]
[-16.100000000000001,{"$error":"#VALUE!"},{"$error":"#VALUE!"}]
[-16.2,{"$error":"#VALUE!"},{"$error":"#VALUE!"}]
[-16.3,{"$error":"#VALUE!"},{"$error":"#VALUE!"}]
[-16.399999999999999,{"$error":"#VALUE!"},{"$error":"#VALUE!"}]
[-16.5,{"$error":"#VALUE!"},{"$error":"#VALUE!"}]
[-16.600000000000001,{"$error":"#VALUE!"},{"$error":"#VALUE!"}]
[-16.7,{"$error":"#VALUE!"},{"$error":"#VALUE!"}]
[-16.8,{"$error":"#VALUE!"},{"$error":"#VALUE!"}]
[-16.899999999999999,{"$error":"#VALUE!"},{"$error":"#VALUE!"}]
[-17,{"$error":"#VALUE!"},{"$error":"#VALUE!"}]
[-17.100000000000001,{"$error":"#VALUE!"},{"$error":"#VALUE!"}]

{"sheet":"Reference (4)","index":8,"n_rows":201,"n_cols":5,"rows_kept":201,"cut":false,"hidden":true,"merged":[]}
["m1",{"$f":"(B12-B11)/(C12-C11)","v":{"$error":"#VALUE!"}}]
["b1",{"$f":"B11-B1*C11","v":{"$error":"#VALUE!"}},"X-Peak",{"$f":"(B4-B2)/(B1-B3)","v":{"$error":"#VALUE!"}}]
["m2",{"$f":"IF(B13>0,B1*-1,(B14-B13)/(C14-C13))","v":{"$error":"#VALUE!"}},"Y-Peak",{"$f":"B1*D2+B2","v":{"$error":"#VALUE!"}}]
["b2",{"$f":"B13-C13*B3","v":{"$error":"#VALUE!"}}]
[]
[]
[]
[]
[]
["N","Y","X","X^2"]
[1,{"$f":"'Optimum Moisture'!M46","v":""},{"$f":"'Optimum Moisture'!M45","v":""},{"$f":"C11^2","v":{"$error":"#VALUE!"}}]
[2,{"$f":"'Optimum Moisture'!N46","v":""},{"$f":"'Optimum Moisture'!N45","v":""},{"$error":"#VALUE!"}]
[3,{"$f":"'Optimum Moisture'!O46","v":""},{"$f":"'Optimum Moisture'!O45","v":""},{"$error":"#VALUE!"}]
[4,{"$f":"D3","v":{"$error":"#VALUE!"}},{"$f":"D2","v":{"$error":"#VALUE!"}},{"$error":"#VALUE!"}]
[5,{"$f":"D3","v":{"$error":"#VALUE!"}},{"$f":"$D$2","v":{"$error":"#VALUE!"}},{"$error":"#VALUE!"}]
[6,{"$f":"D3","v":{"$error":"#VALUE!"}},{"$f":"$D$2","v":{"$error":"#VALUE!"}},{"$error":"#VALUE!"}]
[7,{"$f":"D3","v":{"$error":"#VALUE!"}},{"$f":"$D$2","v":{"$error":"#VALUE!"}},{"$error":"#VALUE!"}]
[8,{"$f":"D3","v":{"$error":"#VALUE!"}},{"$f":"D2","v":{"$error":"#VALUE!"}},{"$error":"#VALUE!"}]
["SUM",{"$f":"SUM(B13:B17)","v":{"$error":"#VALUE!"}},{"$f":"SUM(C13:C17)","v":{"$error":"#VALUE!"}},{"$f":"SUM(D11:D17)","v":{"$error":"#VALUE!"}}]
[]
[]
["MAX DEN",{"$f":"B27*B23^2+B26*B23+B25","v":{"$error":"#VALUE!"}}]
["MAX  W",{"$f":"-B26/(2*B27)","v":{"$error":"#VALUE!"}}]
[]
["Ao",{"$f":"INDEX(LINEST($B$11:$B$14,$C$11:$D$14),3)","v":{"$error":"#VALUE!"}}]
["A1",{"$f":"INDEX(LINEST($B$11:$B$14,$C$11:$D$14),2)","v":{"$error":"#VALUE!"}},null,"SG",{"$f":"SpecificGravity","v":""}]
["A2",{"$f":"INDEX(LINEST($B$11:$B$14,$C$11:$D$14),1)","v":{"$error":"#VALUE!"}}]
[]
["W","dry density","zav"]
[{"$f":"'Optimum Moisture'!$O$29","v":0},{"$f":"$B$25+$B$26*A30+$B$27*A30^2","v":{"$error":"#VALUE!"}},{"$f":"($E$26*62.4)/(1+(A30/100)*$E$26)","v":{"$error":"#VALUE!"}}]
[{"$f":"A30-0.1","v":-0.1},{"$error":"#VALUE!"},{"$error":"#VALUE!"}]
[-0.2,{"$error":"#VALUE!"},{"$error":"#VALUE!"}]
[-0.3,{"$error":"#VALUE!"},{"$error":"#VALUE!"}]
[-0.4,{"$error":"#VALUE!"},{"$error":"#VALUE!"}]
[-0.5,{"$error":"#VALUE!"},{"$error":"#VALUE!"}]
[-0.6,{"$error":"#VALUE!"},{"$error":"#VALUE!"}]
[-0.7,{"$error":"#VALUE!"},{"$error":"#VALUE!"}]
[-0.8,{"$error":"#VALUE!"},{"$error":"#VALUE!"}]
[-0.9,{"$error":"#VALUE!"},{"$error":"#VALUE!"}]
[-1,{"$error":"#VALUE!"},{"$error":"#VALUE!"}]
[-1.1000000000000001,{"$error":"#VALUE!"},{"$error":"#VALUE!"}]
[-1.2,{"$error":"#VALUE!"},{"$error":"#VALUE!"}]
[-1.3,{"$error":"#VALUE!"},{"$error":"#VALUE!"}]
[-1.4,{"$error":"#VALUE!"},{"$error":"#VALUE!"}]
[-1.5,{"$error":"#VALUE!"},{"$error":"#VALUE!"}]
[-1.6,{"$error":"#VALUE!"},{"$error":"#VALUE!"}]
[-1.7,{"$error":"#VALUE!"},{"$error":"#VALUE!"}]
[-1.8,{"$error":"#VALUE!"},{"$error":"#VALUE!"}]
[-1.9,{"$error":"#VALUE!"},{"$error":"#VALUE!"}]
[-2,{"$error":"#VALUE!"},{"$error":"#VALUE!"}]
[-2.1,{"$error":"#VALUE!"},{"$error":"#VALUE!"}]
[-2.2000000000000002,{"$error":"#VALUE!"},{"$error":"#VALUE!"}]
[-2.2999999999999998,{"$error":"#VALUE!"},{"$error":"#VALUE!"}]
[-2.4,{"$error":"#VALUE!"},{"$error":"#VALUE!"}]
[-2.5,{"$error":"#VALUE!"},{"$error":"#VALUE!"}]
[-2.6,{"$error":"#VALUE!"},{"$error":"#VALUE!"}]
[-2.7,{"$error":"#VALUE!"},{"$error":"#VALUE!"}]
[-2.8,{"$error":"#VALUE!"},{"$error":"#VALUE!"}]
[-2.9,{"$error":"#VALUE!"},{"$error":"#VALUE!"}]
[-3,{"$error":"#VALUE!"},{"$error":"#VALUE!"}]
[-3.1,{"$error":"#VALUE!"},{"$error":"#VALUE!"}]
[-3.2,{"$error":"#VALUE!"},{"$error":"#VALUE!"}]
[-3.3,{"$error":"#VALUE!"},{"$error":"#VALUE!"}]
[-3.4,{"$error":"#VALUE!"},{"$error":"#VALUE!"}]
[-3.5,{"$error":"#VALUE!"},{"$error":"#VALUE!"}]
[-3.6,{"$error":"#VALUE!"},{"$error":"#VALUE!"}]
[-3.7,{"$error":"#VALUE!"},{"$error":"#VALUE!"}]
[-3.8,{"$error":"#VALUE!"},{"$error":"#VALUE!"}]
[-3.9,{"$error":"#VALUE!"},{"$error":"#VALUE!"}]
[-4,{"$error":"#VALUE!"},{"$error":"#VALUE!"}]
[-4.0999999999999996,{"$error":"#VALUE!"},{"$error":"#VALUE!"}]
[-4.2,{"$error":"#VALUE!"},{"$error":"#VALUE!"}]
[-4.3,{"$error":"#VALUE!"},{"$error":"#VALUE!"}]
[-4.4000000000000004,{"$error":"#VALUE!"},{"$error":"#VALUE!"}]
[-4.5,{"$error":"#VALUE!"},{"$error":"#VALUE!"}]
[-4.5999999999999996,{"$error":"#VALUE!"},{"$error":"#VALUE!"}]
[-4.7,{"$error":"#VALUE!"},{"$error":"#VALUE!"}]
[-4.8,{"$error":"#VALUE!"},{"$error":"#VALUE!"}]
[-4.9000000000000004,{"$error":"#VALUE!"},{"$error":"#VALUE!"}]
[-5,{"$error":"#VALUE!"},{"$error":"#VALUE!"}]
[-5.0999999999999996,{"$error":"#VALUE!"},{"$error":"#VALUE!"}]
[-5.2,{"$error":"#VALUE!"},{"$error":"#VALUE!"}]
[-5.3,{"$error":"#VALUE!"},{"$error":"#VALUE!"}]
[-5.4,{"$error":"#VALUE!"},{"$error":"#VALUE!"}]
[-5.5,{"$error":"#VALUE!"},{"$error":"#VALUE!"}]
[-5.6,{"$error":"#VALUE!"},{"$error":"#VALUE!"}]
[-5.7,{"$error":"#VALUE!"},{"$error":"#VALUE!"}]
[-5.8,{"$error":"#VALUE!"},{"$error":"#VALUE!"}]
[-5.9,{"$error":"#VALUE!"},{"$error":"#VALUE!"}]
[-6,{"$error":"#VALUE!"},{"$error":"#VALUE!"}]
[-6.1,{"$error":"#VALUE!"},{"$error":"#VALUE!"}]
[-6.2,{"$error":"#VALUE!"},{"$error":"#VALUE!"}]
[-6.3,{"$error":"#VALUE!"},{"$error":"#VALUE!"}]
[-6.4,{"$f":"$B$25+$B$26*A94+$B$27*A94^2","v":{"$error":"#VALUE!"}},{"$f":"($E$26*62.4)/(1+(A94/100)*$E$26)","v":{"$error":"#VALUE!"}}]
[{"$f":"A94-0.1","v":-6.5},{"$error":"#VALUE!"},{"$error":"#VALUE!"}]
[-6.6,{"$error":"#VALUE!"},{"$error":"#VALUE!"}]
[-6.7,{"$error":"#VALUE!"},{"$error":"#VALUE!"}]
[-6.8,{"$error":"#VALUE!"},{"$error":"#VALUE!"}]
[-6.9,{"$error":"#VALUE!"},{"$error":"#VALUE!"}]
[-7,{"$error":"#VALUE!"},{"$error":"#VALUE!"}]
[-7.1,{"$error":"#VALUE!"},{"$error":"#VALUE!"}]
[-7.2,{"$error":"#VALUE!"},{"$error":"#VALUE!"}]
[-7.3,{"$error":"#VALUE!"},{"$error":"#VALUE!"}]
[-7.4,{"$error":"#VALUE!"},{"$error":"#VALUE!"}]
[-7.5,{"$error":"#VALUE!"},{"$error":"#VALUE!"}]
[-7.6,{"$error":"#VALUE!"},{"$error":"#VALUE!"}]
[-7.7,{"$error":"#VALUE!"},{"$error":"#VALUE!"}]
[-7.8,{"$error":"#VALUE!"},{"$error":"#VALUE!"}]
[-7.9,{"$error":"#VALUE!"},{"$error":"#VALUE!"}]
[-8,{"$error":"#VALUE!"},{"$error":"#VALUE!"}]
[-8.1,{"$error":"#VALUE!"},{"$error":"#VALUE!"}]
[-8.1999999999999993,{"$error":"#VALUE!"},{"$error":"#VALUE!"}]
[-8.3000000000000007,{"$error":"#VALUE!"},{"$error":"#VALUE!"}]
[-8.4,{"$error":"#VALUE!"},{"$error":"#VALUE!"}]
[-8.5,{"$error":"#VALUE!"},{"$error":"#VALUE!"}]
[-8.6,{"$error":"#VALUE!"},{"$error":"#VALUE!"}]
[-8.6999999999999993,{"$error":"#VALUE!"},{"$error":"#VALUE!"}]
[-8.8000000000000007,{"$error":"#VALUE!"},{"$error":"#VALUE!"}]
[-8.9,{"$error":"#VALUE!"},{"$error":"#VALUE!"}]
[-9,{"$error":"#VALUE!"},{"$error":"#VALUE!"}]
[-9.1,{"$error":"#VALUE!"},{"$error":"#VALUE!"}]
[-9.1999999999999993,{"$error":"#VALUE!"},{"$error":"#VALUE!"}]
[-9.3000000000000007,{"$error":"#VALUE!"},{"$error":"#VALUE!"}]
[-9.4,{"$error":"#VALUE!"},{"$error":"#VALUE!"}]
[-9.5,{"$error":"#VALUE!"},{"$error":"#VALUE!"}]
[-9.6,{"$error":"#VALUE!"},{"$error":"#VALUE!"}]
[-9.6999999999999993,{"$error":"#VALUE!"},{"$error":"#VALUE!"}]
[-9.8000000000000007,{"$error":"#VALUE!"},{"$error":"#VALUE!"}]
[-9.9,{"$error":"#VALUE!"},{"$error":"#VALUE!"}]
[-10,{"$error":"#VALUE!"},{"$error":"#VALUE!"}]
[-10.1,{"$error":"#VALUE!"},{"$error":"#VALUE!"}]
[-10.199999999999999,{"$error":"#VALUE!"},{"$error":"#VALUE!"}]
[-10.3,{"$error":"#VALUE!"},{"$error":"#VALUE!"}]
[-10.4,{"$error":"#VALUE!"},{"$error":"#VALUE!"}]
[-10.5,{"$error":"#VALUE!"},{"$error":"#VALUE!"}]
[-10.6,{"$error":"#VALUE!"},{"$error":"#VALUE!"}]
[-10.7,{"$error":"#VALUE!"},{"$error":"#VALUE!"}]
[-10.8,{"$error":"#VALUE!"},{"$error":"#VALUE!"}]
[-10.9,{"$error":"#VALUE!"},{"$error":"#VALUE!"}]
[-11,{"$error":"#VALUE!"},{"$error":"#VALUE!"}]
[-11.1,{"$error":"#VALUE!"},{"$error":"#VALUE!"}]
[-11.2,{"$error":"#VALUE!"},{"$error":"#VALUE!"}]
[-11.3,{"$error":"#VALUE!"},{"$error":"#VALUE!"}]
[-11.4,{"$error":"#VALUE!"},{"$error":"#VALUE!"}]
[-11.5,{"$error":"#VALUE!"},{"$error":"#VALUE!"}]
[-11.6,{"$error":"#VALUE!"},{"$error":"#VALUE!"}]
[-11.7,{"$error":"#VALUE!"},{"$error":"#VALUE!"}]
[-11.8,{"$error":"#VALUE!"},{"$error":"#VALUE!"}]
[-11.9,{"$error":"#VALUE!"},{"$error":"#VALUE!"}]
[-12,{"$error":"#VALUE!"},{"$error":"#VALUE!"}]
[-12.1,{"$error":"#VALUE!"},{"$error":"#VALUE!"}]
[-12.2,{"$error":"#VALUE!"},{"$error":"#VALUE!"}]
[-12.3,{"$error":"#VALUE!"},{"$error":"#VALUE!"}]
[-12.4,{"$error":"#VALUE!"},{"$error":"#VALUE!"}]
[-12.5,{"$error":"#VALUE!"},{"$error":"#VALUE!"}]
[-12.6,{"$error":"#VALUE!"},{"$error":"#VALUE!"}]
[-12.7,{"$error":"#VALUE!"},{"$error":"#VALUE!"}]
[-12.8,{"$f":"$B$25+$B$26*A158+$B$27*A158^2","v":{"$error":"#VALUE!"}},{"$f":"($E$26*62.4)/(1+(A158/100)*$E$26)","v":{"$error":"#VALUE!"}}]
[{"$f":"A158-0.1","v":-12.9},{"$error":"#VALUE!"},{"$error":"#VALUE!"}]
[-13,{"$error":"#VALUE!"},{"$error":"#VALUE!"}]
[-13.1,{"$error":"#VALUE!"},{"$error":"#VALUE!"}]
[-13.2,{"$error":"#VALUE!"},{"$error":"#VALUE!"}]
[-13.3,{"$error":"#VALUE!"},{"$error":"#VALUE!"}]
[-13.4,{"$error":"#VALUE!"},{"$error":"#VALUE!"}]
[-13.5,{"$error":"#VALUE!"},{"$error":"#VALUE!"}]
[-13.6,{"$error":"#VALUE!"},{"$error":"#VALUE!"}]
[-13.7,{"$error":"#VALUE!"},{"$error":"#VALUE!"}]
[-13.8,{"$error":"#VALUE!"},{"$error":"#VALUE!"}]
[-13.9,{"$error":"#VALUE!"},{"$error":"#VALUE!"}]
[-14,{"$error":"#VALUE!"},{"$error":"#VALUE!"}]
[-14.1,{"$error":"#VALUE!"},{"$error":"#VALUE!"}]
[-14.2,{"$error":"#VALUE!"},{"$error":"#VALUE!"}]
[-14.3,{"$error":"#VALUE!"},{"$error":"#VALUE!"}]
[-14.4,{"$error":"#VALUE!"},{"$error":"#VALUE!"}]
[-14.5,{"$error":"#VALUE!"},{"$error":"#VALUE!"}]
[-14.6,{"$error":"#VALUE!"},{"$error":"#VALUE!"}]
[-14.7,{"$error":"#VALUE!"},{"$error":"#VALUE!"}]
[-14.8,{"$error":"#VALUE!"},{"$error":"#VALUE!"}]
[-14.9,{"$error":"#VALUE!"},{"$error":"#VALUE!"}]
[-15,{"$error":"#VALUE!"},{"$error":"#VALUE!"}]
[-15.1,{"$error":"#VALUE!"},{"$error":"#VALUE!"}]
[-15.2,{"$error":"#VALUE!"},{"$error":"#VALUE!"}]
[-15.3,{"$error":"#VALUE!"},{"$error":"#VALUE!"}]
[-15.4,{"$error":"#VALUE!"},{"$error":"#VALUE!"}]
[-15.5,{"$error":"#VALUE!"},{"$error":"#VALUE!"}]
[-15.6,{"$error":"#VALUE!"},{"$error":"#VALUE!"}]
[-15.7,{"$error":"#VALUE!"},{"$error":"#VALUE!"}]
[-15.8,{"$error":"#VALUE!"},{"$error":"#VALUE!"}]
[-15.9,{"$error":"#VALUE!"},{"$error":"#VALUE!"}]
[-16,{"$error":"#VALUE!"},{"$error":"#VALUE!"}]
[-16.100000000000001,{"$error":"#VALUE!"},{"$error":"#VALUE!"}]
[-16.2,{"$error":"#VALUE!"},{"$error":"#VALUE!"}]
[-16.3,{"$error":"#VALUE!"},{"$error":"#VALUE!"}]
[-16.399999999999999,{"$error":"#VALUE!"},{"$error":"#VALUE!"}]
[-16.5,{"$error":"#VALUE!"},{"$error":"#VALUE!"}]
[-16.600000000000001,{"$error":"#VALUE!"},{"$error":"#VALUE!"}]
[-16.7,{"$error":"#VALUE!"},{"$error":"#VALUE!"}]
[-16.8,{"$error":"#VALUE!"},{"$error":"#VALUE!"}]
[-16.899999999999999,{"$error":"#VALUE!"},{"$error":"#VALUE!"}]
[-17,{"$error":"#VALUE!"},{"$error":"#VALUE!"}]
[-17.100000000000001,{"$error":"#VALUE!"},{"$error":"#VALUE!"}]

{"sheet":"Reference (5)","index":9,"n_rows":201,"n_cols":5,"rows_kept":201,"cut":false,"hidden":true,"merged":[]}
["m1",{"$f":"(B12-B11)/(C12-C11)","v":{"$error":"#VALUE!"}}]
["b1",{"$f":"B11-B1*C11","v":{"$error":"#VALUE!"}},"X-Peak",{"$f":"(B4-B2)/(B1-B3)","v":{"$error":"#VALUE!"}}]
["m2",{"$f":"IF(B13>0,B1*-1,(B14-B13)/(C14-C13))","v":{"$error":"#VALUE!"}},"Y-Peak",{"$f":"B1*D2+B2","v":{"$error":"#VALUE!"}}]
["b2",{"$f":"B13-C13*B3","v":{"$error":"#VALUE!"}}]
[]
[]
[]
[]
[]
["N","Y","X","X^2"]
[1,{"$f":"'Optimum Moisture'!P46","v":""},{"$f":"'Optimum Moisture'!P45","v":""},{"$f":"C11^2","v":{"$error":"#VALUE!"}}]
[2,{"$f":"'Optimum Moisture'!Q46","v":""},{"$f":"'Optimum Moisture'!Q45","v":""},{"$error":"#VALUE!"}]
[3,{"$f":"'Optimum Moisture'!R46","v":""},{"$f":"'Optimum Moisture'!R45","v":""},{"$error":"#VALUE!"}]
[4,{"$f":"D3","v":{"$error":"#VALUE!"}},{"$f":"D2","v":{"$error":"#VALUE!"}},{"$error":"#VALUE!"}]
[5,{"$f":"D3","v":{"$error":"#VALUE!"}},{"$f":"$D$2","v":{"$error":"#VALUE!"}},{"$error":"#VALUE!"}]
[6,{"$f":"D3","v":{"$error":"#VALUE!"}},{"$f":"$D$2","v":{"$error":"#VALUE!"}},{"$error":"#VALUE!"}]
[7,{"$f":"D3","v":{"$error":"#VALUE!"}},{"$f":"$D$2","v":{"$error":"#VALUE!"}},{"$error":"#VALUE!"}]
[8,{"$f":"D3","v":{"$error":"#VALUE!"}},{"$f":"D2","v":{"$error":"#VALUE!"}},{"$error":"#VALUE!"}]
["SUM",{"$f":"SUM(B13:B17)","v":{"$error":"#VALUE!"}},{"$f":"SUM(C13:C17)","v":{"$error":"#VALUE!"}},{"$f":"SUM(D11:D17)","v":{"$error":"#VALUE!"}}]
[]
[]
["MAX DEN",{"$f":"B27*B23^2+B26*B23+B25","v":{"$error":"#VALUE!"}}]
["MAX  W",{"$f":"-B26/(2*B27)","v":{"$error":"#VALUE!"}}]
[]
["Ao",{"$f":"INDEX(LINEST($B$11:$B$14,$C$11:$D$14),3)","v":{"$error":"#VALUE!"}}]
["A1",{"$f":"INDEX(LINEST($B$11:$B$14,$C$11:$D$14),2)","v":{"$error":"#VALUE!"}},null,"SG",{"$f":"SpecificGravity","v":""}]
["A2",{"$f":"INDEX(LINEST($B$11:$B$14,$C$11:$D$14),1)","v":{"$error":"#VALUE!"}}]
[]
["W","dry density","zav"]
[{"$f":"'Optimum Moisture'!$R$29","v":0},{"$f":"$B$25+$B$26*A30+$B$27*A30^2","v":{"$error":"#VALUE!"}},{"$f":"($E$26*62.4)/(1+(A30/100)*$E$26)","v":{"$error":"#VALUE!"}}]
[{"$f":"A30-0.1","v":-0.1},{"$error":"#VALUE!"},{"$error":"#VALUE!"}]
[-0.2,{"$error":"#VALUE!"},{"$error":"#VALUE!"}]
[-0.3,{"$error":"#VALUE!"},{"$error":"#VALUE!"}]
[-0.4,{"$error":"#VALUE!"},{"$error":"#VALUE!"}]
[-0.5,{"$error":"#VALUE!"},{"$error":"#VALUE!"}]
[-0.6,{"$error":"#VALUE!"},{"$error":"#VALUE!"}]
[-0.7,{"$error":"#VALUE!"},{"$error":"#VALUE!"}]
[-0.8,{"$error":"#VALUE!"},{"$error":"#VALUE!"}]
[-0.9,{"$error":"#VALUE!"},{"$error":"#VALUE!"}]
[-1,{"$error":"#VALUE!"},{"$error":"#VALUE!"}]
[-1.1000000000000001,{"$error":"#VALUE!"},{"$error":"#VALUE!"}]
[-1.2,{"$error":"#VALUE!"},{"$error":"#VALUE!"}]
[-1.3,{"$error":"#VALUE!"},{"$error":"#VALUE!"}]
[-1.4,{"$error":"#VALUE!"},{"$error":"#VALUE!"}]
[-1.5,{"$error":"#VALUE!"},{"$error":"#VALUE!"}]
[-1.6,{"$error":"#VALUE!"},{"$error":"#VALUE!"}]
[-1.7,{"$error":"#VALUE!"},{"$error":"#VALUE!"}]
[-1.8,{"$error":"#VALUE!"},{"$error":"#VALUE!"}]
[-1.9,{"$error":"#VALUE!"},{"$error":"#VALUE!"}]
[-2,{"$error":"#VALUE!"},{"$error":"#VALUE!"}]
[-2.1,{"$error":"#VALUE!"},{"$error":"#VALUE!"}]
[-2.2000000000000002,{"$error":"#VALUE!"},{"$error":"#VALUE!"}]
[-2.2999999999999998,{"$error":"#VALUE!"},{"$error":"#VALUE!"}]
[-2.4,{"$error":"#VALUE!"},{"$error":"#VALUE!"}]
[-2.5,{"$error":"#VALUE!"},{"$error":"#VALUE!"}]
[-2.6,{"$error":"#VALUE!"},{"$error":"#VALUE!"}]
[-2.7,{"$error":"#VALUE!"},{"$error":"#VALUE!"}]
[-2.8,{"$error":"#VALUE!"},{"$error":"#VALUE!"}]
[-2.9,{"$error":"#VALUE!"},{"$error":"#VALUE!"}]
[-3,{"$error":"#VALUE!"},{"$error":"#VALUE!"}]
[-3.1,{"$error":"#VALUE!"},{"$error":"#VALUE!"}]
[-3.2,{"$error":"#VALUE!"},{"$error":"#VALUE!"}]
[-3.3,{"$error":"#VALUE!"},{"$error":"#VALUE!"}]
[-3.4,{"$error":"#VALUE!"},{"$error":"#VALUE!"}]
[-3.5,{"$error":"#VALUE!"},{"$error":"#VALUE!"}]
[-3.6,{"$error":"#VALUE!"},{"$error":"#VALUE!"}]
[-3.7,{"$error":"#VALUE!"},{"$error":"#VALUE!"}]
[-3.8,{"$error":"#VALUE!"},{"$error":"#VALUE!"}]
[-3.9,{"$error":"#VALUE!"},{"$error":"#VALUE!"}]
[-4,{"$error":"#VALUE!"},{"$error":"#VALUE!"}]
[-4.0999999999999996,{"$error":"#VALUE!"},{"$error":"#VALUE!"}]
[-4.2,{"$error":"#VALUE!"},{"$error":"#VALUE!"}]
[-4.3,{"$error":"#VALUE!"},{"$error":"#VALUE!"}]
[-4.4000000000000004,{"$error":"#VALUE!"},{"$error":"#VALUE!"}]
[-4.5,{"$error":"#VALUE!"},{"$error":"#VALUE!"}]
[-4.5999999999999996,{"$error":"#VALUE!"},{"$error":"#VALUE!"}]
[-4.7,{"$error":"#VALUE!"},{"$error":"#VALUE!"}]
[-4.8,{"$error":"#VALUE!"},{"$error":"#VALUE!"}]
[-4.9000000000000004,{"$error":"#VALUE!"},{"$error":"#VALUE!"}]
[-5,{"$error":"#VALUE!"},{"$error":"#VALUE!"}]
[-5.0999999999999996,{"$error":"#VALUE!"},{"$error":"#VALUE!"}]
[-5.2,{"$error":"#VALUE!"},{"$error":"#VALUE!"}]
[-5.3,{"$error":"#VALUE!"},{"$error":"#VALUE!"}]
[-5.4,{"$error":"#VALUE!"},{"$error":"#VALUE!"}]
[-5.5,{"$error":"#VALUE!"},{"$error":"#VALUE!"}]
[-5.6,{"$error":"#VALUE!"},{"$error":"#VALUE!"}]
[-5.7,{"$error":"#VALUE!"},{"$error":"#VALUE!"}]
[-5.8,{"$error":"#VALUE!"},{"$error":"#VALUE!"}]
[-5.9,{"$error":"#VALUE!"},{"$error":"#VALUE!"}]
[-6,{"$error":"#VALUE!"},{"$error":"#VALUE!"}]
[-6.1,{"$error":"#VALUE!"},{"$error":"#VALUE!"}]
[-6.2,{"$error":"#VALUE!"},{"$error":"#VALUE!"}]
[-6.3,{"$error":"#VALUE!"},{"$error":"#VALUE!"}]
[-6.4,{"$f":"$B$25+$B$26*A94+$B$27*A94^2","v":{"$error":"#VALUE!"}},{"$f":"($E$26*62.4)/(1+(A94/100)*$E$26)","v":{"$error":"#VALUE!"}}]
[{"$f":"A94-0.1","v":-6.5},{"$error":"#VALUE!"},{"$error":"#VALUE!"}]
[-6.6,{"$error":"#VALUE!"},{"$error":"#VALUE!"}]
[-6.7,{"$error":"#VALUE!"},{"$error":"#VALUE!"}]
[-6.8,{"$error":"#VALUE!"},{"$error":"#VALUE!"}]
[-6.9,{"$error":"#VALUE!"},{"$error":"#VALUE!"}]
[-7,{"$error":"#VALUE!"},{"$error":"#VALUE!"}]
[-7.1,{"$error":"#VALUE!"},{"$error":"#VALUE!"}]
[-7.2,{"$error":"#VALUE!"},{"$error":"#VALUE!"}]
[-7.3,{"$error":"#VALUE!"},{"$error":"#VALUE!"}]
[-7.4,{"$error":"#VALUE!"},{"$error":"#VALUE!"}]
[-7.5,{"$error":"#VALUE!"},{"$error":"#VALUE!"}]
[-7.6,{"$error":"#VALUE!"},{"$error":"#VALUE!"}]
[-7.7,{"$error":"#VALUE!"},{"$error":"#VALUE!"}]
[-7.8,{"$error":"#VALUE!"},{"$error":"#VALUE!"}]
[-7.9,{"$error":"#VALUE!"},{"$error":"#VALUE!"}]
[-8,{"$error":"#VALUE!"},{"$error":"#VALUE!"}]
[-8.1,{"$error":"#VALUE!"},{"$error":"#VALUE!"}]
[-8.1999999999999993,{"$error":"#VALUE!"},{"$error":"#VALUE!"}]
[-8.3000000000000007,{"$error":"#VALUE!"},{"$error":"#VALUE!"}]
[-8.4,{"$error":"#VALUE!"},{"$error":"#VALUE!"}]
[-8.5,{"$error":"#VALUE!"},{"$error":"#VALUE!"}]
[-8.6,{"$error":"#VALUE!"},{"$error":"#VALUE!"}]
[-8.6999999999999993,{"$error":"#VALUE!"},{"$error":"#VALUE!"}]
[-8.8000000000000007,{"$error":"#VALUE!"},{"$error":"#VALUE!"}]
[-8.9,{"$error":"#VALUE!"},{"$error":"#VALUE!"}]
[-9,{"$error":"#VALUE!"},{"$error":"#VALUE!"}]
[-9.1,{"$error":"#VALUE!"},{"$error":"#VALUE!"}]
[-9.1999999999999993,{"$error":"#VALUE!"},{"$error":"#VALUE!"}]
[-9.3000000000000007,{"$error":"#VALUE!"},{"$error":"#VALUE!"}]
[-9.4,{"$error":"#VALUE!"},{"$error":"#VALUE!"}]
[-9.5,{"$error":"#VALUE!"},{"$error":"#VALUE!"}]
[-9.6,{"$error":"#VALUE!"},{"$error":"#VALUE!"}]
[-9.6999999999999993,{"$error":"#VALUE!"},{"$error":"#VALUE!"}]
[-9.8000000000000007,{"$error":"#VALUE!"},{"$error":"#VALUE!"}]
[-9.9,{"$error":"#VALUE!"},{"$error":"#VALUE!"}]
[-10,{"$error":"#VALUE!"},{"$error":"#VALUE!"}]
[-10.1,{"$error":"#VALUE!"},{"$error":"#VALUE!"}]
[-10.199999999999999,{"$error":"#VALUE!"},{"$error":"#VALUE!"}]
[-10.3,{"$error":"#VALUE!"},{"$error":"#VALUE!"}]
[-10.4,{"$error":"#VALUE!"},{"$error":"#VALUE!"}]
[-10.5,{"$error":"#VALUE!"},{"$error":"#VALUE!"}]
[-10.6,{"$error":"#VALUE!"},{"$error":"#VALUE!"}]
[-10.7,{"$error":"#VALUE!"},{"$error":"#VALUE!"}]
[-10.8,{"$error":"#VALUE!"},{"$error":"#VALUE!"}]
[-10.9,{"$error":"#VALUE!"},{"$error":"#VALUE!"}]
[-11,{"$error":"#VALUE!"},{"$error":"#VALUE!"}]
[-11.1,{"$error":"#VALUE!"},{"$error":"#VALUE!"}]
[-11.2,{"$error":"#VALUE!"},{"$error":"#VALUE!"}]
[-11.3,{"$error":"#VALUE!"},{"$error":"#VALUE!"}]
[-11.4,{"$error":"#VALUE!"},{"$error":"#VALUE!"}]
[-11.5,{"$error":"#VALUE!"},{"$error":"#VALUE!"}]
[-11.6,{"$error":"#VALUE!"},{"$error":"#VALUE!"}]
[-11.7,{"$error":"#VALUE!"},{"$error":"#VALUE!"}]
[-11.8,{"$error":"#VALUE!"},{"$error":"#VALUE!"}]
[-11.9,{"$error":"#VALUE!"},{"$error":"#VALUE!"}]
[-12,{"$error":"#VALUE!"},{"$error":"#VALUE!"}]
[-12.1,{"$error":"#VALUE!"},{"$error":"#VALUE!"}]
[-12.2,{"$error":"#VALUE!"},{"$error":"#VALUE!"}]
[-12.3,{"$error":"#VALUE!"},{"$error":"#VALUE!"}]
[-12.4,{"$error":"#VALUE!"},{"$error":"#VALUE!"}]
[-12.5,{"$error":"#VALUE!"},{"$error":"#VALUE!"}]
[-12.6,{"$error":"#VALUE!"},{"$error":"#VALUE!"}]
[-12.7,{"$error":"#VALUE!"},{"$error":"#VALUE!"}]
[-12.8,{"$f":"$B$25+$B$26*A158+$B$27*A158^2","v":{"$error":"#VALUE!"}},{"$f":"($E$26*62.4)/(1+(A158/100)*$E$26)","v":{"$error":"#VALUE!"}}]
[{"$f":"A158-0.1","v":-12.9},{"$error":"#VALUE!"},{"$error":"#VALUE!"}]
[-13,{"$error":"#VALUE!"},{"$error":"#VALUE!"}]
[-13.1,{"$error":"#VALUE!"},{"$error":"#VALUE!"}]
[-13.2,{"$error":"#VALUE!"},{"$error":"#VALUE!"}]
[-13.3,{"$error":"#VALUE!"},{"$error":"#VALUE!"}]
[-13.4,{"$error":"#VALUE!"},{"$error":"#VALUE!"}]
[-13.5,{"$error":"#VALUE!"},{"$error":"#VALUE!"}]
[-13.6,{"$error":"#VALUE!"},{"$error":"#VALUE!"}]
[-13.7,{"$error":"#VALUE!"},{"$error":"#VALUE!"}]
[-13.8,{"$error":"#VALUE!"},{"$error":"#VALUE!"}]
[-13.9,{"$error":"#VALUE!"},{"$error":"#VALUE!"}]
[-14,{"$error":"#VALUE!"},{"$error":"#VALUE!"}]
[-14.1,{"$error":"#VALUE!"},{"$error":"#VALUE!"}]
[-14.2,{"$error":"#VALUE!"},{"$error":"#VALUE!"}]
[-14.3,{"$error":"#VALUE!"},{"$error":"#VALUE!"}]
[-14.4,{"$error":"#VALUE!"},{"$error":"#VALUE!"}]
[-14.5,{"$error":"#VALUE!"},{"$error":"#VALUE!"}]
[-14.6,{"$error":"#VALUE!"},{"$error":"#VALUE!"}]
[-14.7,{"$error":"#VALUE!"},{"$error":"#VALUE!"}]
[-14.8,{"$error":"#VALUE!"},{"$error":"#VALUE!"}]
[-14.9,{"$error":"#VALUE!"},{"$error":"#VALUE!"}]
[-15,{"$error":"#VALUE!"},{"$error":"#VALUE!"}]
[-15.1,{"$error":"#VALUE!"},{"$error":"#VALUE!"}]
[-15.2,{"$error":"#VALUE!"},{"$error":"#VALUE!"}]
[-15.3,{"$error":"#VALUE!"},{"$error":"#VALUE!"}]
[-15.4,{"$error":"#VALUE!"},{"$error":"#VALUE!"}]
[-15.5,{"$error":"#VALUE!"},{"$error":"#VALUE!"}]
[-15.6,{"$error":"#VALUE!"},{"$error":"#VALUE!"}]
[-15.7,{"$error":"#VALUE!"},{"$error":"#VALUE!"}]
[-15.8,{"$error":"#VALUE!"},{"$error":"#VALUE!"}]
[-15.9,{"$error":"#VALUE!"},{"$error":"#VALUE!"}]
[-16,{"$error":"#VALUE!"},{"$error":"#VALUE!"}]
[-16.100000000000001,{"$error":"#VALUE!"},{"$error":"#VALUE!"}]
[-16.2,{"$error":"#VALUE!"},{"$error":"#VALUE!"}]
[-16.3,{"$error":"#VALUE!"},{"$error":"#VALUE!"}]
[-16.399999999999999,{"$error":"#VALUE!"},{"$error":"#VALUE!"}]
[-16.5,{"$error":"#VALUE!"},{"$error":"#VALUE!"}]
[-16.600000000000001,{"$error":"#VALUE!"},{"$error":"#VALUE!"}]
[-16.7,{"$error":"#VALUE!"},{"$error":"#VALUE!"}]
[-16.8,{"$error":"#VALUE!"},{"$error":"#VALUE!"}]
[-16.899999999999999,{"$error":"#VALUE!"},{"$error":"#VALUE!"}]
[-17,{"$error":"#VALUE!"},{"$error":"#VALUE!"}]
[-17.100000000000001,{"$error":"#VALUE!"},{"$error":"#VALUE!"}]

{"sheet":"Set 1(a)","index":10,"n_rows":23,"n_cols":4,"rows_kept":23,"cut":false,"hidden":true,"merged":[[0,4,0,9]]}
["[HEADER]"]
["Project:","Project1"]
["Date:",37036,"Time:",0.41158564814814802]
["Boring:","Boring1","Sample:",2]
["Specimen:",2,"Depth (ft):",10]
["Diameter (inch):",null,"Height (inch):"]
["Piston Correction (lbs):"]
["Comments:"]
[]
["[SENSORS]"]
["Name","External Load Cell","Cell Pressure","Load Frame Encoder"]
["ID","LC54032","PS9170013","N/A"]
["Module","Load Frame Adc","Load Frame Adc","N/A"]
["Channel",1,3,"N/A"]
["Unit","lbs","psi","inch"]
["Cal. Factor",null,10000]
["Excitation",null,10.029999999999999,"N/A"]
["Zero",null,-1.7200000000000001E-4,"N/A"]
["Min. Reading",-10000,-14,0]
["Max. Reading",10000,98,3.5]
[]
["[SHEAR]"]
["Time          ","External Load Cell","Cell Pressure","Platen Position"]

{"sheet":"Set 1(b)","index":11,"n_rows":23,"n_cols":4,"rows_kept":23,"cut":false,"hidden":true,"merged":[[0,4,0,9]]}
["[HEADER]"]
["Project:","Project1"]
["Date:",37036,"Time:",0.41158564814814802]
["Boring:","Boring1","Sample:",2]
["Specimen:",2,"Depth (ft):",10]
["Diameter (inch):",null,"Height (inch):"]
["Piston Correction (lbs):"]
["Comments:"]
[]
["[SENSORS]"]
["Name","External Load Cell","Cell Pressure","Load Frame Encoder"]
["ID","LC54032","PS9170013","N/A"]
["Module","Load Frame Adc","Load Frame Adc","N/A"]
["Channel",1,3,"N/A"]
["Unit","lbs","psi","inch"]
["Cal. Factor",null,10000]
["Excitation",null,10.029999999999999,"N/A"]
["Zero",null,-1.7200000000000001E-4,"N/A"]
["Min. Reading",-10000,-14,0]
["Max. Reading",10000,98,3.5]
[]
["[SHEAR]"]
["Time          ","External Load Cell","Cell Pressure","Platen Position"]

{"sheet":"Set 1(c)","index":12,"n_rows":23,"n_cols":4,"rows_kept":23,"cut":false,"hidden":true,"merged":[[0,4,0,9]]}
["[HEADER]"]
["Project:","Project1"]
["Date:",37036,"Time:",0.44061342592592601]
["Boring:","Boring1","Sample:",5]
["Specimen:",5,"Depth (ft):",10]
["Diameter (inch):",null,"Height (inch):"]
["Piston Correction (lbs):"]
["Comments:"]
[]
["[SENSORS]"]
["Name","External Load Cell","Cell Pressure","Load Frame Encoder"]
["ID","LC54032","PS9170013","N/A"]
["Module","Load Frame Adc","Load Frame Adc","N/A"]
["Channel",1,3,"N/A"]
["Unit","lbs","psi","inch"]
["Cal. Factor",null,10000]
["Excitation",null,10.029999999999999,"N/A"]
["Zero",null,-1.7200000000000001E-4,"N/A"]
["Min. Reading",-10000,-14,0]
["Max. Reading",10000,98,3.5]
[]
["[SHEAR]"]
["Time          ","External Load Cell","Cell Pressure","Platen Position"]

{"sheet":"Set 2(a)","index":13,"n_rows":23,"n_cols":4,"rows_kept":23,"cut":false,"hidden":true,"merged":[[0,4,0,9]]}
["[HEADER]"]
["Project:","Project1"]
["Date:",37036,"Time:",0.42736111111111103]
["Boring:","Boring1","Sample:",1]
["Specimen:",1,"Depth (ft):",10]
["Diameter (inch):",null,"Height (inch):"]
["Piston Correction (lbs):"]
["Comments:"]
[]
["[SENSORS]"]
["Name","External Load Cell","Cell Pressure","Load Frame Encoder"]
["ID","LC54032","PS9170013","N/A"]
["Module","Load Frame Adc","Load Frame Adc","N/A"]
["Channel",1,3,"N/A"]
["Unit","lbs","psi","inch"]
["Cal. Factor",null,10000]
["Excitation",null,10.029999999999999,"N/A"]
["Zero",null,-1.7200000000000001E-4,"N/A"]
["Min. Reading",-10000,-14,0]
["Max. Reading",10000,98,3.5]
[]
["[SHEAR]"]
["Time          ","External Load Cell","Cell Pressure","Platen Position"]

{"sheet":"Set 2(b)","index":14,"n_rows":23,"n_cols":4,"rows_kept":23,"cut":false,"hidden":true,"merged":[[0,4,0,9]]}
["Created by Sigma-1 UU Version 3.7.5; Copyright 2003, GEOTAC"]
["Project:","Amarillo "]
["Date:",38279,"Time:",0.422337962962963]
["Boring:","3% Cement Base","Sample:","04-E-131"]
["Specimen:","Specimen 2","Depth (ft):",0]
["Diameter (inch):",null,"Height (inch):"]
["Piston Correction (lbs):"]
["Comments:"]
[]
["[SENSORS]"]
["Name","External Load Cell","Cell Pressure","Load Frame Encoder"]
["ID",118521,"ID2","N/A"]
["Module","Load Frame ADIO","Load Frame ADIO","N/A"]
["Channel",1,4,"N/A"]
["Unit","lbs","psi","inch"]
["Cal. Factor",null,20000]
["Excitation",null,9.9759063720703107,"N/A"]
["Zero",null,0,"N/A"]
["Min. Reading",-10000,-14,0]
["Max. Reading",50000,190,3.5]
[]
["[SHEAR]"]
["Time          ","External Load Cell","Cell Pressure","Platen Position"]

{"sheet":"Set 2(c)","index":15,"n_rows":23,"n_cols":4,"rows_kept":23,"cut":false,"hidden":true,"merged":[[0,4,0,9]]}
["Created by Sigma-1 UU Version 3.7.5; Copyright 2003, GEOTAC"]
["Project:","Amarillo "]
["Date:",38279,"Time:",0.43348379629629602]
["Boring:","3% Cement Base","Sample:","04-E-131"]
["Specimen:","Specimen 4","Depth (ft):",0]
["Diameter (inch):",null,"Height (inch):"]
["Piston Correction (lbs):"]
["Comments:"]
[]
["[SENSORS]"]
["Name","External Load Cell","Cell Pressure","Load Frame Encoder"]
["ID",118521,"ID2","N/A"]
["Module","Load Frame ADIO","Load Frame ADIO","N/A"]
["Channel",1,4,"N/A"]
["Unit","lbs","psi","inch"]
["Cal. Factor",null,20000]
["Excitation",null,9.9759063720703107,"N/A"]
["Zero",null,0,"N/A"]
["Min. Reading",-10000,-14,0]
["Max. Reading",50000,190,3.5]
[]
["[SHEAR]"]
["Time          ","External Load Cell","Cell Pressure","Platen Position"]

{"sheet":"Set 3(a)","index":16,"n_rows":23,"n_cols":4,"rows_kept":23,"cut":false,"hidden":true,"merged":[[0,4,0,9]]}
["[HEADER]"]
["Project:","Project1"]
["Date:",37036,"Time:",0.42031249999999998]
["Boring:","Boring1","Sample:",3]
["Specimen:",3,"Depth (ft):",10]
["Diameter (inch):",null,"Height (inch):"]
["Piston Correction (lbs):"]
["Comments:"]
[]
["[SENSORS]"]
["Name","External Load Cell","Cell Pressure","Load Frame Encoder"]
["ID","LC54032","PS9170013","N/A"]
["Module","Load Frame Adc","Load Frame Adc","N/A"]
["Channel",1,3,"N/A"]
["Unit","lbs","psi","inch"]
["Cal. Factor",null,10000]
["Excitation",null,10.029999999999999,"N/A"]
["Zero",null,-1.7200000000000001E-4,"N/A"]
["Min. Reading",-10000,-14,0]
["Max. Reading",10000,98,3.5]
[]
["[SHEAR]"]
["Time          ","External Load Cell","Cell Pressure","Platen Position"]

{"sheet":"Set 3(b)","index":17,"n_rows":23,"n_cols":4,"rows_kept":23,"cut":false,"hidden":true,"merged":[[0,4,0,9]]}
["Created by Sigma-1 UU Version 3.7.5; Copyright 2003, GEOTAC"]
["Project:","Amarillo "]
["Date:",38279,"Time:",0.404212962962963]
["Boring:","4% Cement Base","Sample:","04-E-131"]
["Specimen:","Specimen 3","Depth (ft):",0]
["Diameter (inch):",null,"Height (inch):"]
["Piston Correction (lbs):"]
["Comments:"]
[]
["[SENSORS]"]
["Name","External Load Cell","Cell Pressure","Load Frame Encoder"]
["ID",118521,"ID2","N/A"]
["Module","Load Frame ADIO","Load Frame ADIO","N/A"]
["Channel",1,4,"N/A"]
["Unit","lbs","psi","inch"]
["Cal. Factor",null,20000]
["Excitation",null,9.9759063720703107,"N/A"]
["Zero",null,0,"N/A"]
["Min. Reading",-10000,-14,0]
["Max. Reading",50000,190,3.5]
[]
["[SHEAR]"]
["Time          ","External Load Cell","Cell Pressure","Platen Position"]

{"sheet":"Set 3(c)","index":18,"n_rows":23,"n_cols":4,"rows_kept":23,"cut":false,"hidden":true,"merged":[[0,4,0,9]]}
["Created by Sigma-1 UU Version 3.7.5; Copyright 2003, GEOTAC"]
["Project:"]
["Date:",null,"Time:"]
["Boring:",null,"Sample:"]
["Specimen:",null,"Depth (ft):"]
["Diameter (inch):",null,"Height (inch):"]
["Piston Correction (lbs):"]
["Comments:"]
[]
["[SENSORS]"]
["Name","External Load Cell","Cell Pressure","Load Frame Encoder"]
["ID"]
["Module"]
["Channel"]
["Unit"]
["Cal. Factor"]
["Excitation"]
["Zero"]
["Min. Reading"]
["Max. Reading"]
[]
["[SHEAR]"]
["Time          ","External Load Cell","Cell Pressure","Platen Position"]

{"sheet":"Set 4(a)","index":19,"n_rows":23,"n_cols":4,"rows_kept":23,"cut":false,"hidden":true,"merged":[[0,4,0,9]]}
["Created by Sigma-1 UU Version 3.7.5; Copyright 2003, GEOTAC"]
["Project:","Amarillo "]
["Date:",38279,"Time:",0.351793981481481]
["Boring:","5 % Cement Base","Sample:","04-E-131"]
["Specimen:","Specimen 2","Depth (ft):",0]
["Diameter (inch):",null,"Height (inch):"]
["Piston Correction (lbs):"]
["Comments:"]
[]
["[SENSORS]"]
["Name","External Load Cell","Cell Pressure","Load Frame Encoder"]
["ID",118521,"ID2","N/A"]
["Module","Load Frame ADIO","Load Frame ADIO","N/A"]
["Channel",1,4,"N/A"]
["Unit","lbs","psi","inch"]
["Cal. Factor",null,20000]
["Excitation",null,9.9759063720703107,"N/A"]
["Zero",null,0,"N/A"]
["Min. Reading",-10000,-14,0]
["Max. Reading",50000,190,3.5]
[]
["[SHEAR]"]
["Time          ","External Load Cell","Cell Pressure","Platen Position"]

{"sheet":"Set 4(b)","index":20,"n_rows":23,"n_cols":4,"rows_kept":23,"cut":false,"hidden":true,"merged":[[0,4,0,9]]}
["[HEADER]"]
["Project:","Project1"]
["Date:",37036,"Time:",0.40013888888888899]
["Boring:","Boring1","Sample:",6]
["Specimen:",6,"Depth (ft):",10]
["Diameter (inch):",null,"Height (inch):"]
["Piston Correction (lbs):"]
["Comments:"]
[]
["[SENSORS]"]
["Name","External Load Cell","Cell Pressure","Load Frame Encoder"]
["ID","LC54032","PS9170013","N/A"]
["Module","Load Frame Adc","Load Frame Adc","N/A"]
["Channel",1,3,"N/A"]
["Unit","lbs","psi","inch"]
["Cal. Factor",null,10000]
["Excitation",null,10.029999999999999,"N/A"]
["Zero",null,-1.7200000000000001E-4,"N/A"]
["Min. Reading",-10000,-14,0]
["Max. Reading",10000,98,3.5]
[]
["[SHEAR]"]
["Time          ","External Load Cell","Cell Pressure","Platen Position"]

{"sheet":"Set 4(c)","index":21,"n_rows":23,"n_cols":4,"rows_kept":23,"cut":false,"hidden":true,"merged":[[0,4,0,9]]}
["[HEADER]"]
["Project:","Project1"]
["Date:",37036,"Time:",0.40276620370370397]
["Boring:","Boring1","Sample:",6]
["Specimen:",6,"Depth (ft):",10]
["Diameter (inch):",null,"Height (inch):"]
["Piston Correction (lbs):"]
["Comments:"]
[]
["[SENSORS]"]
["Name","External Load Cell","Cell Pressure","Load Frame Encoder"]
["ID","LC54032","PS9170013","N/A"]
["Module","Load Frame Adc","Load Frame Adc","N/A"]
["Channel",1,3,"N/A"]
["Unit","lbs","psi","inch"]
["Cal. Factor",null,10000]
["Excitation",null,10.029999999999999,"N/A"]
["Zero",null,-1.7200000000000001E-4,"N/A"]
["Min. Reading",-10000,-14,0]
["Max. Reading",10000,98,3.5]
[]
["[SHEAR]"]
["Time          ","External Load Cell","Cell Pressure","Platen Position"]