{"text_format":"1","workbook":"xlsx","n_sheets":18,"sheets":["Worksheet","Tex-113,4-E","Reference","00 psi","03 psi","05 psi","07 psi","10 psi","15 psi","00 psi (2)","20 psi","Summary","Mohr Analysis","Mohr Circles","Classification","Classification Chart","RX","Revisions"],"not_rendered":{"charts":6,"images":1,"macros":1,"external_links":0,"defined_names":416,"comments":1,"pivot_tables":0},"unopened":[{"sheet":"Mohr Circles","index":13,"reason":"not_a_worksheet"},{"sheet":"Classification Chart","index":15,"reason":"not_a_worksheet"}],"bounds":{"document_bytes":16777216,"sheet_cells":100000,"rows_first":2000,"rows_last":500,"rows_between":2000,"halvings":0,"cell_chars":16384,"cell_head_chars":4096},"cells_cut":0,"cells_raw":0,"read":"whole","date_system":"1900"}

{"sheet":"Worksheet","index":0,"n_rows":71,"n_cols":11,"rows_kept":71,"cut":false,"hidden":false,"merged":[[7,3,7,4],[7,7,7,8],[0,0,0,1],[45,1,45,2],[46,1,46,2],[37,1,37,2],[28,1,28,2],[43,1,43,2],[44,1,44,2],[38,1,38,2],[36,1,36,2],[25,1,25,2],[9,7,9,8],[8,3,8,4],[8,7,8,8],[10,3,10,4],[30,1,30,2],[31,1,31,2],[32,1,32,2],[29,1,29,2],[35,1,35,2],[33,1,33,2],[20,5,20,6],[23,1,23,2],[26,1,26,2],[24,1,24,2],[27,1,27,2],[20,1,20,4],[22,1,22,10],[9,3,9,4],[16,7,16,8],[10,7,10,8],[11,7,11,8],[11,3,11,4],[12,3,12,4],[12,7,12,8],[15,3,15,8],[13,7,13,8],[13,3,13,4],[16,3,16,4],[14,3,14,8],[39,1,39,2],[34,1,34,2],[40,1,40,2],[67,1,67,3],[63,2,63,4],[62,2,62,4],[42,1,42,2],[59,1,59,8],[56,1,57,8],[58,1,58,8],[52,7,52,10],[52,1,52,2],[51,7,51,8],[50,1,50,2],[47,1,47,2],[49,1,49,2],[67,6,67,8],[71,1,71,3],[65,2,65,4],[64,2,64,4],[41,1,41,2],[50,7,50,8],[51,1,51,2],[60,2,60,4],[61,2,61,4]]}
["TxDOT Manuals >",null,null,"Tex-121-E","Tex-117-E"]
[null,"TEXAS DEPARTMENT OF TRANSPORTATION",null,null,null,null,null,null,null,null,288]
[null,null,null,null,null,null,null,null,null,null,3]
[null,null,null,null,null,null,null,null,null,null,"tx121.xlsm::45505.684178"]
[null,"SOIL-LIME TESTING: TEX-121-E"]
[null,"TRIAXIAL COMPRESSION TEST Tex-117-E"]
[null,null,null,null,null,null,null,null,{"$f":"\"File Version: \" & TEXT(MID(sn,SEARCH(\"::\",sn,1)+2,20),\"mm/dd/yy hh:mm:ss\")","v":"File Version: 08/01/24 16:25:13"}]
[null,null,"SAMPLE ID:",null,null,null,"SAMPLED DATE:"]
[null,null,"TEST NUMBER:",null,null,null,"LETTING DATE:"]
[null,null,"SAMPLE STATUS:",null,null,null,"CONTROLLING CSJ:"]
[null,null,"COUNTY:",null,null,null,"SPEC YEAR:"]
[null,null,"SAMPLED BY:",null,null,null,"SPEC ITEM:"]
[null,null,"SAMPLE LOCATION:",null,null,null,"SPECIAL PROVISION:"]
[null,null,"MATERIAL CODE:",null,null,null,"GRADE:"]
[null,null,"MATERIAL NAME:"]
[null,null,"PRODUCER:",""]
[null,null,"AREA ENGINEER:",null,null,null,"PROJECT MANAGER:"]
[]
[null,null,"COURSE\\LIFT:",null,"STATION:",null,null,"DIST. FROM CL:"]
[]
[null,{"$f":"\"Performed By Tex-117-E:\" & AutoMan","v":"Performed By Tex-117-E:"},null,null,null,null,null," <-- Select method of data collection."]
[]
[null,"Triaxial Test Data Sheet"]
[null,"Specimen Number:",null,1,2,3,4,5,6,7,8]
[null,"Initial Height of Specimen, in.:"]
[null,"Height of Stone 1, in."]
[null,"Height of Stone 2, in."]
[null,"New Height of Specimen, in.:",null,{"$f":"IF(LEFT(AutoMan,4)=\"Auto\",IF('00 psi'!$D$6=\"\",\"\",'00 psi'!$D$6),IF(COUNTBLANK(D25:D27)=3,\"\",D25-D26-D27))","v":""},{"$f":"IF(LEFT(AutoMan,4)=\"Auto\",IF('03 psi'!$D$6=\"\",\"\",'03 psi'!$D$6),IF(COUNTBLANK(E25:E27)=3,\"\",E25-E26-E27))","v":""},{"$f":"IF(LEFT(AutoMan,4)=\"Auto\",IF('05 psi'!$D$6=\"\",\"\",'05 psi'!$D$6),IF(COUNTBLANK(F25:F27)=3,\"\",F25-F26-F27))","v":""},{"$f":"IF(LEFT(AutoMan,4)=\"Auto\",IF('07 psi'!$D$6=\"\",\"\",'07 psi'!$D$6),IF(COUNTBLANK(G25:G27)=3,\"\",G25-G26-G27))","v":""},{"$f":"IF(LEFT(AutoMan,4)=\"Auto\",IF('10 psi'!$D$6=\"\",\"\",'10 psi'!$D$6),IF(COUNTBLANK(H25:H27)=3,\"\",H25-H26-H27))","v":""},{"$f":"IF(LEFT(AutoMan,4)=\"Auto\",IF('15 psi'!$D$6=\"\",\"\",'15 psi'!$D$6),IF(COUNTBLANK(I25:I27)=3,\"\",I25-I26-I27))","v":""},{"$f":"IF(LEFT(AutoMan,4)=\"Auto\",IF('00 psi (2)'!$D$6=\"\",\"\",'00 psi (2)'!$D$6),IF(COUNTBLANK(J25:J27)=3,\"\",J25-J26-J27))","v":""},{"$f":"IF(LEFT(AutoMan,4)=\"Auto\",IF('20 psi'!$D$6=\"\",\"\",'20 psi'!$D$6),IF(COUNTBLANK(K25:K27)=3,\"\",K25-K26-K27))","v":""}]
[null,"Average Diameter, in.:",null,{"$f":"IF(D25=0,\"\",IF(LEFT(AutoMan,4)=\"Auto\",'00 psi'!$B$6,+D30/PI()))","v":""},{"$f":"IF(E25=0,\"\",IF(LEFT(AutoMan,4)=\"Auto\",'03 psi'!$B$6,+E30/PI()))","v":""},{"$f":"IF(F25=0,\"\",IF(LEFT(AutoMan,4)=\"Auto\",'05 psi'!$B$6,+F30/PI()))","v":""},{"$f":"IF(G25=0,\"\",IF(LEFT(AutoMan,4)=\"Auto\",'07 psi'!$B$6,+G30/PI()))","v":""},{"$f":"IF(H25=0,\"\",IF(LEFT(AutoMan,4)=\"Auto\",'10 psi'!$B$6,+H30/PI()))","v":""},{"$f":"IF(I25=0,\"\",IF(LEFT(AutoMan,4)=\"Auto\",'15 psi'!$B$6,+I30/PI()))","v":""},{"$f":"IF(J25=0,\"\",IF(LEFT(AutoMan,4)=\"Auto\",'00 psi (2)'!B$6,+J30/PI()))","v":""},{"$f":"IF(K25=0,\"\",IF(LEFT(AutoMan,4)=\"Auto\",'20 psi'!$B$6,+K30/PI()))","v":""}]
[null,"Circumference, in.:"]
[null,"Area, in.^2:",null,{"$f":"IF(D25=0,\"\",D30*(D29/4))","v":""},{"$f":"IF(E25=0,\"\",E30*(E29/4))","v":""},"","","","","",""]
[null,"Avg. Cross Sectional Area, in^2:",null,{"$f":"IF(D25=0,\"\",+D31/D47)","v":""},{"$f":"IF(E25=0,\"\",+E31/E47)","v":""},"","","","","",""]
[null,"Lateral Pressure, psi.:"]
[null,"Calibration Factor:",null,{"$f":"IF('00 psi'!$B$16=\"\",\"\",'00 psi'!$B$16)","v":""},{"$f":"IF('03 psi'!$B$16=\"\",\"\",'03 psi'!$B$16)","v":""},{"$f":"IF('05 psi'!$B$16=\"\",\"\",'05 psi'!$B$16)","v":""},{"$f":"IF('07 psi'!$B$16=\"\",\"\",'07 psi'!$B$16)","v":""},{"$f":"IF('10 psi'!$B$16=\"\",\"\",'10 psi'!$B$16)","v":""},{"$f":"IF('15 psi'!$B$16=\"\",\"\",'15 psi'!$B$16)","v":""},{"$f":"IF('00 psi (2)'!$B$16=\"\",\"\",'00 psi (2)'!$B$16)","v":""},{"$f":"IF('20 psi'!$B$16=\"\",\"\",'20 psi'!$B$16)","v":""}]
[null,"Excitation:",null,{"$f":"IF('00 psi'!$B$17=\"\",\"\",'00 psi'!$B$17)","v":""},{"$f":"IF('03 psi'!$B$17=\"\",\"\",'03 psi'!$B$17)","v":""},{"$f":"IF('05 psi'!$B$17=\"\",\"\",'05 psi'!$B$17)","v":""},{"$f":"IF('07 psi'!$B$17=\"\",\"\",'07 psi'!$B$17)","v":""},{"$f":"IF('10 psi'!$B$17=\"\",\"\",'10 psi'!$B$17)","v":""},{"$f":"IF('15 psi'!$B$17=\"\",\"\",'15 psi'!$B$17)","v":""},{"$f":"IF('00 psi (2)'!$B$17=\"\",\"\",'00 psi (2)'!$B$17)","v":""},{"$f":"IF('20 psi'!$B$17=\"\",\"\",'20 psi'!$B$17)","v":""}]
[null,"Zero:",null,{"$f":"IF('00 psi'!$B$18=\"\",\"\",'00 psi'!$B$18)","v":""},{"$f":"IF('03 psi'!$B$18=\"\",\"\",'03 psi'!$B$18)","v":""},{"$f":"IF('05 psi'!$B$18=\"\",\"\",'05 psi'!$B$18)","v":""},{"$f":"IF('07 psi'!$B$18=\"\",\"\",'07 psi'!$B$18)","v":""},{"$f":"IF('10 psi'!$B$18=\"\",\"\",'10 psi'!$B$18)","v":""},{"$f":"IF('15 psi'!$B$18=\"\",\"\",'15 psi'!$B$18)","v":""},{"$f":"IF('00 psi (2)'!$B$18=\"\",\"\",'00 psi (2)'!$B$18)","v":""},{"$f":"IF('20 psi'!$B$18=\"\",\"\",'20 psi'!$B$18)","v":""}]
[null,"Ring Factor, lbs./div"]
[null,"Dead Load, lbs.:"]
[null,"Piston Correction, lbs.:",null,{"$f":"IF('00 psi'!$B$7=\"\",\"\",'00 psi'!$B$7)","v":""},{"$f":"IF('03 psi'!$B$7=\"\",\"\",'03 psi'!$B$7)","v":""},{"$f":"IF('05 psi'!$B$7=\"\",\"\",'05 psi'!$B$7)","v":""},{"$f":"IF('07 psi'!$B$7=\"\",\"\",'07 psi'!$B$7)","v":""},{"$f":"IF('10 psi'!$B$7=\"\",\"\",'10 psi'!$B$7)","v":""},{"$f":"IF('15 psi'!$B$7=\"\",\"\",'15 psi'!$B$7)","v":""},{"$f":"IF('00 psi (2)'!$B$7=\"\",\"\",'00 psi (2)'!$B$7)","v":""},{"$f":"IF('20 psi'!$B$7=\"\",\"\",'20 psi'!$B$7)","v":""}]
[null,"Max. Load Reading, div.:",null,{"$f":"IF('00 psi'!$B$25=\"\",\"\",'00 psi'!$B$25)","v":""},{"$f":"IF('03 psi'!$B$25=\"\",\"\",'03 psi'!$B$25)","v":""},{"$f":"IF('05 psi'!$B$25=\"\",\"\",'05 psi'!$B$25)","v":""},{"$f":"IF('07 psi'!$B$25=\"\",\"\",'07 psi'!$B$25)","v":""},{"$f":"IF('10 psi'!$B$25=\"\",\"\",'10 psi'!$B$25)","v":""},{"$f":"IF('15 psi'!$B$25=\"\",\"\",'15 psi'!$B$25)","v":""},{"$f":"IF('00 psi (2)'!$B$25=\"\",\"\",'00 psi (2)'!$B$25)","v":""},{"$f":"IF('20 psi'!$B$25=\"\",\"\",'20 psi'!$B$25)","v":""}]
[null,"Max Load, lbs.:",null,{"$f":"IF(D40=\"\",\"\",(((D$40-D$36)*D$34)/D$35)+D$39)","v":""},{"$f":"IF(E40=\"\",\"\",(((E$40-E$36)*E$34)/E$35)+E$39)","v":""},"","","","","",""]
[null,"Deformation at Max Load, in.:",null,{"$f":"IF(D40=\"\",\"\",('00 psi'!$D$26-'00 psi'!$D$24)/'00 psi'!$D$16)","v":""},{"$f":"IF(E40=\"\",\"\",('03 psi'!$D$26-'03 psi'!$D$24)/'03 psi'!$D$16)","v":""},{"$f":"IF(F40=\"\",\"\",('05 psi'!$D$26-'05 psi'!$D$24)/'05 psi'!$D$16)","v":""},{"$f":"IF(G40=\"\",\"\",('07 psi'!$D$26-'07 psi'!$D$24)/'07 psi'!$D$16)","v":""},{"$f":"IF(H40=\"\",\"\",('10 psi'!$D$26-'10 psi'!$D$24)/'10 psi'!$D$16)","v":""},{"$f":"IF(I40=\"\",\"\",('15 psi'!$D$26-'15 psi'!$D$24)/'15 psi'!$D$16)","v":""},{"$f":"IF(J40=\"\",\"\",('00 psi (2)'!$D$26-'00 psi (2)'!$D$24)/'00 psi (2)'!$D$16)","v":""},{"$f":"IF(K40=\"\",\"\",('20 psi'!$D$26-'20 psi'!$D$24)/'20 psi'!$D$16)","v":""}]
[null,"Max. Load Reading, div."]
[null,"Deformation at Max Load, in."]
[null,"Uncorrected Stress, psi.:",null,{"$f":"IF(D25=0,\"\",IF(LEFT(AutoMan,4)=\"Auto\",(D41+D38)/D32,(((D43*D37)+D38)/D31)))","v":""},"","","","","","",""]
[null,"% Strain , in./in.:",null,{"$f":"IF(D25=0,\"\",IF(LEFT(AutoMan,4)=\"Auto\",(D42/D28)*100,(D44/D28)*100))","v":""},"","","","","","",""]
[null,"I-Strain, in./in.:",null,{"$f":"IF(D25=0,\"\",IF(LEFT(AutoMan,4)=\"Auto\",1-(D42/D28),1-(D44/D28)))","v":""},"","","","","","",""]
[null,"Corrected Stress, psi.:",null,{"$f":"IF(D25=0,\"\",IF(LEFT(AutoMan,4)=\"Auto\",(D47*D45),((D37*D43)+D38)/D32))","v":""},"","","","","","",""]
[]
[null,"Classification:",null,{"$f":"IF(ISERROR(Classification!B24),\"\",Classification!B24)","v":""},null,null,null,null,null,"00 psi","15 psi"]
[null,"Internal Angle of Friction:",null,{"$f":"IF(ISERROR('Mohr Analysis'!H15),\"\",'Mohr Analysis'!H15)","v":""},null,null,null,"Average Corrected Strength:",null,{"$f":"IF(ISERROR(AVERAGE(IF(D33:K33=0,D48:K48))),\"\",AVERAGE(IF(D33:K33=0,D48:K48)))","v":""},{"$f":"IF(ISERROR(AVERAGE(IF(D33:K33=15,D48:K48))),\"\",AVERAGE(IF(D33:K33=15,D48:K48)))","v":""}]
[null,"Cohesion, psi:",null,{"$f":"IF(ISERROR('Mohr Analysis'!G16),\"\",'Mohr Analysis'!G16)","v":""},null,null,null,"Grade:",null,{"$f":"IF(J51=\"\",\"\",IF(J51>=45,1,IF(J51<35,3,2)))","v":""},{"$f":"IF(K51=\"\",\"\",IF(K51>=175,1,3))","v":""}]
[null,"Correlation Factor:",null,{"$f":"IF(ISERROR('Mohr Analysis'!G17),\"\",'Mohr Analysis'!G17)","v":""},null,null,null,{"$f":"IF(K52=1,\"Meets Requirements for Grade\" & IF(J52=1,\"1\",IF(J52=2,\"2\")),\"Does Not Meet Any Grade Requirements\")","v":"Does Not Meet Any Grade Requirements"}]
[]
[]
[null,"Remarks:",{"$f":"NOW()","v":"2024-08-01T16:25:13.530"}]
[]
[]
[]
[]
[null,"Sample Method:","Sampled By:",null,null,"Sampled Date:"]
[null,"TX100"]
[]
[null,"TX400"]
[null,"Test Method:","Tested By:",null,null,"Tested Date:"]
[null,"TX117"]
[null,"Test Stamp Code:",null,null,"Omit Test:","Completed Date:","Reviewed By:"]
[]
[null,"Locked By:","TxDOT:","District:","Area:"]
[null,"","","",""]
[null,"Authorized By:",null,null,"Authorized Date:"]

{"sheet":"Tex-113,4-E","index":1,"n_rows":61,"n_cols":10,"rows_kept":61,"cut":false,"hidden":false,"merged":[[60,2,60,4],[57,2,57,4],[58,2,58,4],[50,1,50,3],[51,1,51,3],[52,1,52,3],[55,1,56,8],[0,0,0,1],[46,1,46,3],[47,1,47,3],[48,1,48,3],[27,1,27,3],[30,1,30,3],[32,1,32,3],[33,1,33,3],[35,1,35,3],[36,1,36,3],[16,3,16,8],[17,3,17,4],[17,7,17,8],[37,1,37,3],[21,1,21,3],[31,1,31,3],[49,1,49,3],[42,1,42,3],[43,1,43,3],[38,1,38,3],[39,1,39,3],[40,1,40,3],[41,1,41,3],[45,1,45,3],[44,1,44,3],[34,1,34,3],[22,1,22,3],[23,1,23,3],[24,1,24,3],[25,1,25,3],[8,3,8,4],[11,3,11,4],[14,3,14,4],[15,3,15,8],[8,7,8,8],[9,3,9,4],[9,7,9,8],[10,3,10,4],[10,7,10,8],[11,7,11,8],[12,3,12,4],[12,7,12,8],[13,3,13,4],[13,7,13,8],[14,7,14,8]]}
["TxDOT Manuals >",null,null,"Tex-113-E"]
[null,"TEXAS DEPARTMENT OF TRANSPORTATION"]
[null,{"$f":"IF(Location=\"\",\"\",Location)","v":""}]
[null,null,null,null,null,null,null,null,null,"Tx113,4.xls::37445.433542"]
[null,"SOIL-LIME TESTING: TEX-121-E",null,null,null,null,null,null,null,45]
[null,"Moisture-Density Relations of Base Material & Sand or Subgrade & Embankment Soils"]
[null,"TEX-113-E or Tex-114-E"]
[null,null,null,null,null,null,null,null,{"$f":"\"Tx113,4 File Version: \" & TEXT(MID(_sn113,SEARCH(\"::\",_sn113,1)+2,20),\"mm/dd/yy hh:mm:ss\")","v":"Tx113,4 File Version: 07/08/02 10:24:18"}]
[null,null,"SAMPLE ID:",{"$f":"IF(SampleId=\"\",\"\",SampleId)","v":""},{"$f":"IF(Location=\"\",\"\",Location)","v":""},null,"SAMPLED DATE:",{"$f":"IF(SampledDate=\"\",\"\",SampledDate)","v":""},{"$f":"IF(Location=\"\",\"\",Location)","v":""}]
[null,null,"TEST NUMBER:",{"$f":"IF(TestNumber=\"\",\"\",TestNumber)","v":""},"",null,"LETTING DATE:",{"$f":"IF(LettingDate=\"\",\"\",LettingDate)","v":""},""]
[null,null,"SAMPLE STATUS:",{"$f":"IF(Status=\"\",\"\",Status)","v":""},"",null,"CONTROLLING CSJ:",{"$f":"IF(CCSJ=\"\",\"\",CCSJ)","v":""},""]
[null,null,"COUNTY:",{"$f":"IF(County=\"\",\"\",County)","v":""},"",null,"SPEC YEAR:",{"$f":"IF(SpecYear=\"\",\"\",SpecYear)","v":""},""]
[null,null,"SAMPLED BY:",{"$f":"IF(SampledBy=\"\",\"\",SampledBy)","v":""},"",null,"SPEC ITEM:",{"$f":"IF(SpecItem=\"\",\"\",SpecItem)","v":""},""]
[null,null,"SAMPLE LOCATION:",{"$f":"IF(SampleLocation=\"\",\"\",SampleLocation)","v":""},"",null,"SPECIAL PROVISION:",{"$f":"IF(SpecialProvision=\"\",\"\",SpecialProvision)","v":""},""]
[null,null,"MATERIAL CODE:",{"$f":"IF(Material=\"\",\"\",Material)","v":""},"",null,"GRADE:",{"$f":"IF(Grade=\"\",\"\",Grade)","v":""},""]
[null,null,"MATERIAL NAME:",{"$f":"IF(matl_nm=\"\",\"\",matl_nm)","v":""}]
[null,null,"PRODUCER:",{"$f":"IF(Producer=\"\",\"\",Producer)","v":""},{"$f":"IF(Location=\"\",\"\",Location)","v":""},{"$f":"IF(Location=\"\",\"\",Location)","v":""},{"$f":"IF(Location=\"\",\"\",Location)","v":""},"",""]
[null,null,"AREA ENGINEER:",{"$f":"IF(AreaEngineer=\"\",\"\",AreaEngineer)","v":""},{"$f":"IF(Location=\"\",\"\",Location)","v":""},null,"PROJECT MANAGER:",{"$f":"IF(ProjectManager=\"\",\"\",ProjectManager)","v":""},""]
[]
[null,null,"COURSE\\LIFT:",{"$f":"IF(CourseLift=\"\",\"\",CourseLift)","v":""},"STATION:",{"$f":"IF(Station=\"\",\"\",Station)","v":""},null,"DIST. FROM CL:",{"$f":"IF(DistFromCL=\"\",\"\",DistFromCL)","v":""}]
[null,"Moisture-Density Work Sheet"]
[null,"Percent of Lime, (%)"]
[null,"Oven Dry Weight, (g):"]
[null,"Weight of Pycnometer & Water, (g):"]
[null,"Weight of Aggr., Pycn.& Water, (g):"]
[null,"Specific Gravity (Apparent):",null,null,{"$f":"IF(ISERROR(E23/(E23+E24-E25)),\"\",E23/(E23+E24-E25))","v":""}]
[]
[null,"Hygroscopic Moisture, (%):"]
[]
[null,null,null,null,1,2,3,4]
[null,"Percent Water Content, (%):"]
[null,"Percent Lime, (%):",null,null,{"$f":"IF(OR(E31=\"\",PerLime=\"\"),\"\",PerLime)","v":""},{"$f":"IF(OR(E31=\"\",PerLime=\"\"),\"\",PerLime)","v":""},{"$f":"IF(OR(E31=\"\",PerLime=\"\"),\"\",PerLime)","v":""},{"$f":"IF(OR(E31=\"\",PerLime=\"\"),\"\",PerLime)","v":""}]
[null,"Mass Material, (lb):"]
[null,"Mass Water Added, (lb):",null,null,{"$f":"IF(AND(E31=\"\",E33=\"\"),\"\",(E31/100)*E33)","v":""},{"$f":"IF(AND(F31=\"\",F33=\"\"),\"\",(F31/100)*F33)","v":""},{"$f":"IF(AND(G31=\"\",G33=\"\"),\"\",(G31/100)*G33)","v":""},{"$f":"IF(AND(H31=\"\",H33=\"\"),\"\",(H31/100)*H33)","v":""}]
[null,"Mass Lime Added, (lb):",null,null,{"$f":"IF(AND(E32=\"\",E33=\"\",E28=\"\"),\"\",IF(ISERROR((E32/100)*(E33-(E33*$E$28))),\"\",(E32/100)*(E33-(E33*$E$28))))","v":""},{"$f":"IF(AND(F32=\"\",F33=\"\",E28=\"\"),\"\",IF(ISERROR((F32/100)*(F33-(F33*$E$28))),\"\",(F32/100)*(F33-(F33*$E$28))))","v":""},{"$f":"IF(AND(G32=\"\",G33=\"\",E28=\"\"),\"\",IF(ISERROR((G32/100)*(G33-(G33*$E$28))),\"\",(G32/100)*(G33-(G33*$E$28))))","v":""},{"$f":"IF(AND(H32=\"\",H33=\"\",E28=\"\"),\"\",IF(ISERROR((H32/100)*(H33-(H33*$E$28))),\"\",(H32/100)*(H33-(H33*$E$28))))","v":""}]
[null,"Wet Mass Specimen & Mold, (lb):"]
[null,"Tare Mass Mold, (lb):"]
[null,"Wet Mass Specimen, (lb):",null,null,{"$f":"IF(AND(E36=\"\",E37=\"\"),\"\",E36-E37)","v":""},{"$f":"IF(AND(F36=\"\",F37=\"\"),\"\",F36-F37)","v":""},{"$f":"IF(AND(G36=\"\",G37=\"\"),\"\",G36-G37)","v":""},{"$f":"IF(AND(H36=\"\",H37=\"\"),\"\",H36-H37)","v":""}]
[null,"Height of Specimen, (in.):"]
[null,"Volume per Linear mm., (in.):"]
[null,"Volume of Specimen, (ft^3):",null,null,{"$f":"IF(AND(E40=\"\",E39=\"\"),\"\",E40*E39)","v":""},{"$f":"IF(AND(F40=\"\",F39=\"\"),\"\",F40*F39)","v":""},{"$f":"IF(AND(G40=\"\",G39=\"\"),\"\",G40*G39)","v":""},{"$f":"IF(AND(H40=\"\",H39=\"\"),\"\",H40*H39)","v":""}]
[null,"Wet Density of Specimen, (lb):",null,null,{"$f":"IF(ISERROR(E38/E41),\"\",E38/E41)","v":""},{"$f":"IF(ISERROR(F38/F41),\"\",F38/F41)","v":""},{"$f":"IF(ISERROR(G38/G41),\"\",G38/G41)","v":""},{"$f":"IF(ISERROR(H38/H41),\"\",H38/H41)","v":""}]
[null,"Wet Mass of Pan & Specimen, (lb):"]
[null,"Dry Mass Pan & Specimen, (lb):"]
[null,"Tare Mass Pan, (lb):"]
[null,"Dry Mass Material , (lb):",null,null,{"$f":"IF(AND(E44=\"\",E45=\"\"),\"\",E44-E45)","v":""},{"$f":"IF(AND(F44=\"\",F45=\"\"),\"\",F44-F45)","v":""},{"$f":"IF(AND(G44=\"\",G45=\"\"),\"\",G44-G45)","v":""},{"$f":"IF(AND(H44=\"\",H45=\"\"),\"\",H44-H45)","v":""}]
[null,"Mass Water, (lb):",null,null,{"$f":"IF(AND(E43=\"\",E44=\"\"),\"\",E43-E44)","v":""},{"$f":"IF(AND(F43=\"\",F44=\"\"),\"\",F43-F44)","v":""},{"$f":"IF(AND(G43=\"\",G44=\"\"),\"\",G43-G44)","v":""},{"$f":"IF(AND(H43=\"\",H44=\"\"),\"\",H43-H44)","v":""}]
[null,"Percent Water on Total , (%):",null,null,{"$f":"IF(ISERROR((E47/E46)*100),\"\",(E47/E46)*100)","v":""},{"$f":"IF(ISERROR((F47/F46)*100),\"\",(F47/F46)*100)","v":""},{"$f":"IF(ISERROR((G47/G46)*100),\"\",(G47/G46)*100)","v":""},{"$f":"IF(ISERROR((H47/H46)*100),\"\",(H47/H46)*100)","v":""}]
[null,"Dry Density, (pcf):",null,null,{"$f":"IF(ISERROR(E42/(1+(E48/100))),\"\",E42/(1+(E48/100)))","v":""},{"$f":"IF(ISERROR(F42/(1+(F48/100))),\"\",F42/(1+(F48/100)))","v":""},{"$f":"IF(ISERROR(G42/(1+(G48/100))),\"\",G42/(1+(G48/100)))","v":""},{"$f":"IF(ISERROR(H42/(1+(H48/100))),\"\",H42/(1+(H48/100)))","v":""}]
[null,"Estimated Dry Density, (pcf):",null,null,{"$f":"IF(ISERROR(E42/(1+(E31/100))),\"\",E42/(1+(E31/100)))","v":""},{"$f":"IF(ISERROR(F42/(1+(F31/100))),\"\",F42/(1+(F31/100)))","v":""},{"$f":"IF(ISERROR(G42/(1+(G31/100))),\"\",G42/(1+(G31/100)))","v":""},{"$f":"IF(ISERROR(H42/(1+(H31/100))),\"\",H42/(1+(H31/100)))","v":""}]
[null,"Max Density, (pcf):",null,null,{"$f":"IF(AND(E24=\"\",E25=\"\",H47=\"\"),\"\",IF(AND(E24>0,E25>0),Reference!B22,IF(H47>0,Reference!B22,\"Need SG\")))","v":""}]
[null,"Max Density, (kg/m3):",null,null,{"$f":"IF(ISERROR(E51*(0.4536/0.02832)),\"\",E51*(0.4536/0.02832))","v":""}]
[null,"Optimum Moisture, (%):",null,null,{"$f":"IF(ISERROR(Reference!B23),\"\",Reference!B23)","v":""}]
[]
[null,"Remarks:",{"$f":"NOW()","v":"2024-08-01T16:25:13.530"}]
[]
[]
[null,"Test Method:","Tested By:",null,null,"Date:"]
[null,"TX113"]
[]
[null,"TX114"]

{"sheet":"Reference","index":2,"n_rows":201,"n_cols":5,"rows_kept":201,"cut":false,"hidden":true,"merged":[]}
["m1",{"$f":"(B12-B11)/(C12-C11)","v":{"$error":"#VALUE!"}}]
["b1",{"$f":"B11-B1*C11","v":{"$error":"#VALUE!"}},"X-Peak",{"$f":"(B4-B2)/(B1-B3)","v":{"$error":"#VALUE!"}}]
["m2",{"$f":"IF(AND(B13>0,'Tex-113,4-E'!H47=0),B1*-1,(B14-B13)/(C14-C13))","v":{"$error":"#VALUE!"}},"Y-Peak",{"$f":"B1*D2+B2","v":{"$error":"#VALUE!"}}]
["b2",{"$f":"B13-C13*B3","v":{"$error":"#VALUE!"}}]
[]
[]
[]
[]
[]
["N","Y","X","X^2"]
[1,{"$f":"'Tex-113,4-E'!E49","v":""},{"$f":"'Tex-113,4-E'!E48","v":""},{"$f":"C11^2","v":{"$error":"#VALUE!"}}]
[2,{"$f":"'Tex-113,4-E'!F49","v":""},{"$f":"'Tex-113,4-E'!F48","v":""},{"$error":"#VALUE!"}]
[3,{"$f":"'Tex-113,4-E'!G49","v":""},{"$f":"'Tex-113,4-E'!G48","v":""},{"$error":"#VALUE!"}]
[4,{"$f":"IF(AND(B13>0,'Tex-113,4-E'!H47=0),D3,'Tex-113,4-E'!H49)","v":""},{"$f":"IF(AND(C13>0,'Tex-113,4-E'!H47=0),D2,'Tex-113,4-E'!H48)","v":""},{"$error":"#VALUE!"}]
[5,{"$f":"D3","v":{"$error":"#VALUE!"}},{"$f":"$D$2","v":{"$error":"#VALUE!"}},{"$error":"#VALUE!"}]
[6,{"$f":"D3","v":{"$error":"#VALUE!"}},{"$f":"$D$2","v":{"$error":"#VALUE!"}},{"$error":"#VALUE!"}]
[7,{"$f":"D3","v":{"$error":"#VALUE!"}},{"$f":"$D$2","v":{"$error":"#VALUE!"}},{"$error":"#VALUE!"}]
[8,{"$f":"D3","v":{"$error":"#VALUE!"}},{"$f":"D2","v":{"$error":"#VALUE!"}},{"$error":"#VALUE!"}]
["SUM",{"$f":"SUM(B13:B17)","v":{"$error":"#VALUE!"}},{"$f":"SUM(C13:C17)","v":{"$error":"#VALUE!"}},{"$f":"SUM(D11:D17)","v":{"$error":"#VALUE!"}}]
[]
[]
["MAX DEN",{"$f":"B27*B23^2+B26*B23+B25","v":{"$error":"#VALUE!"}}]
["MAX  W",{"$f":"-B26/(2*B27)","v":{"$error":"#VALUE!"}}]
[]
["Ao",{"$f":"INDEX(LINEST($B$11:$B$14,$C$11:$D$14),3)","v":{"$error":"#VALUE!"}}]
["A1",{"$f":"INDEX(LINEST($B$11:$B$14,$C$11:$D$14),2)","v":{"$error":"#VALUE!"}},null,"SG",{"$f":"IF(AND('Tex-113,4-E'!E25>0,'Tex-113,4-E'!E24>0),'Tex-113,4-E'!E26,\"\")","v":""}]
["A2",{"$f":"INDEX(LINEST($B$11:$B$14,$C$11:$D$14),1)","v":{"$error":"#VALUE!"}}]
[]
["W","Dry Density","ZAV"]
[{"$f":"IF('Tex-113,4-E'!H48>0,'Tex-113,4-E'!H48+8,'Tex-113,4-E'!G48+8)","v":{"$error":"#VALUE!"}},{"$f":"$B$25+$B$26*A30+$B$27*A30^2","v":{"$error":"#VALUE!"}},{"$f":"($E$26*62.4)/(1+(A30/100)*$E$26)","v":{"$error":"#VALUE!"}}]
[{"$f":"A30-0.2","v":{"$error":"#VALUE!"}},{"$error":"#VALUE!"},{"$error":"#VALUE!"}]
[{"$f":"A31-0.2","v":{"$error":"#VALUE!"}},{"$error":"#VALUE!"},{"$error":"#VALUE!"}]
[{"$error":"#VALUE!"},{"$error":"#VALUE!"},{"$error":"#VALUE!"}]
[{"$error":"#VALUE!"},{"$error":"#VALUE!"},{"$error":"#VALUE!"}]
[{"$error":"#VALUE!"},{"$error":"#VALUE!"},{"$error":"#VALUE!"}]
[{"$error":"#VALUE!"},{"$error":"#VALUE!"},{"$error":"#VALUE!"}]
[{"$error":"#VALUE!"},{"$error":"#VALUE!"},{"$error":"#VALUE!"}]
[{"$error":"#VALUE!"},{"$error":"#VALUE!"},{"$error":"#VALUE!"}]
[{"$error":"#VALUE!"},{"$error":"#VALUE!"},{"$error":"#VALUE!"}]
[{"$error":"#VALUE!"},{"$error":"#VALUE!"},{"$error":"#VALUE!"}]
[{"$error":"#VALUE!"},{"$error":"#VALUE!"},{"$error":"#VALUE!"}]
[{"$error":"#VALUE!"},{"$error":"#VALUE!"},{"$error":"#VALUE!"}]
[{"$error":"#VALUE!"},{"$error":"#VALUE!"},{"$error":"#VALUE!"}]
[{"$error":"#VALUE!"},{"$error":"#VALUE!"},{"$error":"#VALUE!"}]
[{"$error":"#VALUE!"},{"$error":"#VALUE!"},{"$error":"#VALUE!"}]
[{"$error":"#VALUE!"},{"$error":"#VALUE!"},{"$error":"#VALUE!"}]
[{"$error":"#VALUE!"},{"$error":"#VALUE!"},{"$error":"#VALUE!"}]
[{"$error":"#VALUE!"},{"$error":"#VALUE!"},{"$error":"#VALUE!"}]
[{"$error":"#VALUE!"},{"$error":"#VALUE!"},{"$error":"#VALUE!"}]
[{"$error":"#VALUE!"},{"$error":"#VALUE!"},{"$error":"#VALUE!"}]
[{"$error":"#VALUE!"},{"$error":"#VALUE!"},{"$error":"#VALUE!"}]
[{"$error":"#VALUE!"},{"$error":"#VALUE!"},{"$error":"#VALUE!"}]
[{"$error":"#VALUE!"},{"$error":"#VALUE!"},{"$error":"#VALUE!"}]
[{"$error":"#VALUE!"},{"$error":"#VALUE!"},{"$error":"#VALUE!"}]
[{"$error":"#VALUE!"},{"$error":"#VALUE!"},{"$error":"#VALUE!"}]
[{"$error":"#VALUE!"},{"$error":"#VALUE!"},{"$error":"#VALUE!"}]
[{"$error":"#VALUE!"},{"$error":"#VALUE!"},{"$error":"#VALUE!"}]
[{"$error":"#VALUE!"},{"$error":"#VALUE!"},{"$error":"#VALUE!"}]
[{"$error":"#VALUE!"},{"$error":"#VALUE!"},{"$error":"#VALUE!"}]
[{"$error":"#VALUE!"},{"$error":"#VALUE!"},{"$error":"#VALUE!"}]
[{"$error":"#VALUE!"},{"$error":"#VALUE!"},{"$error":"#VALUE!"}]
[{"$error":"#VALUE!"},{"$error":"#VALUE!"},{"$error":"#VALUE!"}]
[{"$error":"#VALUE!"},{"$error":"#VALUE!"},{"$error":"#VALUE!"}]
[{"$error":"#VALUE!"},{"$error":"#VALUE!"},{"$error":"#VALUE!"}]
[{"$error":"#VALUE!"},{"$error":"#VALUE!"},{"$error":"#VALUE!"}]
[{"$error":"#VALUE!"},{"$error":"#VALUE!"},{"$error":"#VALUE!"}]
[{"$error":"#VALUE!"},{"$error":"#VALUE!"},{"$error":"#VALUE!"}]
[{"$error":"#VALUE!"},{"$error":"#VALUE!"},{"$error":"#VALUE!"}]
[{"$error":"#VALUE!"},{"$error":"#VALUE!"},{"$error":"#VALUE!"}]
[{"$error":"#VALUE!"},{"$error":"#VALUE!"},{"$error":"#VALUE!"}]
[{"$error":"#VALUE!"},{"$error":"#VALUE!"},{"$error":"#VALUE!"}]
[{"$error":"#VALUE!"},{"$error":"#VALUE!"},{"$error":"#VALUE!"}]
[{"$error":"#VALUE!"},{"$error":"#VALUE!"},{"$error":"#VALUE!"}]
[{"$error":"#VALUE!"},{"$error":"#VALUE!"},{"$error":"#VALUE!"}]
[{"$error":"#VALUE!"},{"$error":"#VALUE!"},{"$error":"#VALUE!"}]
[{"$error":"#VALUE!"},{"$error":"#VALUE!"},{"$error":"#VALUE!"}]
[{"$error":"#VALUE!"},{"$error":"#VALUE!"},{"$error":"#VALUE!"}]
[{"$error":"#VALUE!"},{"$error":"#VALUE!"},{"$error":"#VALUE!"}]
[{"$error":"#VALUE!"},{"$error":"#VALUE!"},{"$error":"#VALUE!"}]
[{"$error":"#VALUE!"},{"$error":"#VALUE!"},{"$error":"#VALUE!"}]
[{"$error":"#VALUE!"},{"$error":"#VALUE!"},{"$error":"#VALUE!"}]
[{"$error":"#VALUE!"},{"$error":"#VALUE!"},{"$error":"#VALUE!"}]
[{"$error":"#VALUE!"},{"$error":"#VALUE!"},{"$error":"#VALUE!"}]
[{"$error":"#VALUE!"},{"$error":"#VALUE!"},{"$error":"#VALUE!"}]
[{"$error":"#VALUE!"},{"$error":"#VALUE!"},{"$error":"#VALUE!"}]
[{"$error":"#VALUE!"},{"$error":"#VALUE!"},{"$error":"#VALUE!"}]
[{"$error":"#VALUE!"},{"$error":"#VALUE!"},{"$error":"#VALUE!"}]
[{"$error":"#VALUE!"},{"$error":"#VALUE!"},{"$error":"#VALUE!"}]
[{"$error":"#VALUE!"},{"$error":"#VALUE!"},{"$error":"#VALUE!"}]
[{"$error":"#VALUE!"},{"$error":"#VALUE!"},{"$error":"#VALUE!"}]
[{"$error":"#VALUE!"},{"$error":"#VALUE!"},{"$error":"#VALUE!"}]
[{"$error":"#VALUE!"},{"$error":"#VALUE!"},{"$error":"#VALUE!"}]
[{"$error":"#VALUE!"},{"$error":"#VALUE!"},{"$error":"#VALUE!"}]
[{"$error":"#VALUE!"},{"$f":"$B$25+$B$26*A94+$B$27*A94^2","v":{"$error":"#VALUE!"}},{"$f":"($E$26*62.4)/(1+(A94/100)*$E$26)","v":{"$error":"#VALUE!"}}]
[{"$error":"#VALUE!"},{"$error":"#VALUE!"},{"$error":"#VALUE!"}]
[{"$f":"A95-0.2","v":{"$error":"#VALUE!"}},{"$error":"#VALUE!"},{"$error":"#VALUE!"}]
[{"$error":"#VALUE!"},{"$error":"#VALUE!"},{"$error":"#VALUE!"}]
[{"$error":"#VALUE!"},{"$error":"#VALUE!"},{"$error":"#VALUE!"}]
[{"$error":"#VALUE!"},{"$error":"#VALUE!"},{"$error":"#VALUE!"}]
[{"$error":"#VALUE!"},{"$error":"#VALUE!"},{"$error":"#VALUE!"}]
[{"$error":"#VALUE!"},{"$error":"#VALUE!"},{"$error":"#VALUE!"}]
[{"$error":"#VALUE!"},{"$error":"#VALUE!"},{"$error":"#VALUE!"}]
[{"$error":"#VALUE!"},{"$error":"#VALUE!"},{"$error":"#VALUE!"}]
[{"$error":"#VALUE!"},{"$error":"#VALUE!"},{"$error":"#VALUE!"}]
[{"$error":"#VALUE!"},{"$error":"#VALUE!"},{"$error":"#VALUE!"}]
[{"$error":"#VALUE!"},{"$error":"#VALUE!"},{"$error":"#VALUE!"}]
[{"$error":"#VALUE!"},{"$error":"#VALUE!"},{"$error":"#VALUE!"}]
[{"$error":"#VALUE!"},{"$error":"#VALUE!"},{"$error":"#VALUE!"}]
[{"$error":"#VALUE!"},{"$error":"#VALUE!"},{"$error":"#VALUE!"}]
[{"$error":"#VALUE!"},{"$error":"#VALUE!"},{"$error":"#VALUE!"}]
[{"$error":"#VALUE!"},{"$error":"#VALUE!"},{"$error":"#VALUE!"}]
[{"$error":"#VALUE!"},{"$error":"#VALUE!"},{"$error":"#VALUE!"}]
[{"$error":"#VALUE!"},{"$error":"#VALUE!"},{"$error":"#VALUE!"}]
[{"$error":"#VALUE!"},{"$error":"#VALUE!"},{"$error":"#VALUE!"}]
[{"$error":"#VALUE!"},{"$error":"#VALUE!"},{"$error":"#VALUE!"}]
[{"$error":"#VALUE!"},{"$error":"#VALUE!"},{"$error":"#VALUE!"}]
[{"$error":"#VALUE!"},{"$error":"#VALUE!"},{"$error":"#VALUE!"}]
[{"$error":"#VALUE!"},{"$error":"#VALUE!"},{"$error":"#VALUE!"}]
[{"$error":"#VALUE!"},{"$error":"#VALUE!"},{"$error":"#VALUE!"}]
[{"$error":"#VALUE!"},{"$error":"#VALUE!"},{"$error":"#VALUE!"}]
[{"$error":"#VALUE!"},{"$error":"#VALUE!"},{"$error":"#VALUE!"}]
[{"$error":"#VALUE!"},{"$error":"#VALUE!"},{"$error":"#VALUE!"}]
[{"$error":"#VALUE!"},{"$error":"#VALUE!"},{"$error":"#VALUE!"}]
[{"$error":"#VALUE!"},{"$error":"#VALUE!"},{"$error":"#VALUE!"}]
[{"$error":"#VALUE!"},{"$error":"#VALUE!"},{"$error":"#VALUE!"}]
[{"$error":"#VALUE!"},{"$error":"#VALUE!"},{"$error":"#VALUE!"}]
[{"$error":"#VALUE!"},{"$error":"#VALUE!"},{"$error":"#VALUE!"}]
[{"$error":"#VALUE!"},{"$error":"#VALUE!"},{"$error":"#VALUE!"}]
[{"$error":"#VALUE!"},{"$error":"#VALUE!"},{"$error":"#VALUE!"}]
[{"$error":"#VALUE!"},{"$error":"#VALUE!"},{"$error":"#VALUE!"}]
[{"$error":"#VALUE!"},{"$error":"#VALUE!"},{"$error":"#VALUE!"}]
[{"$error":"#VALUE!"},{"$error":"#VALUE!"},{"$error":"#VALUE!"}]
[{"$error":"#VALUE!"},{"$error":"#VALUE!"},{"$error":"#VALUE!"}]
[{"$error":"#VALUE!"},{"$error":"#VALUE!"},{"$error":"#VALUE!"}]
[{"$error":"#VALUE!"},{"$error":"#VALUE!"},{"$error":"#VALUE!"}]
[{"$error":"#VALUE!"},{"$error":"#VALUE!"},{"$error":"#VALUE!"}]
[{"$error":"#VALUE!"},{"$error":"#VALUE!"},{"$error":"#VALUE!"}]
[{"$error":"#VALUE!"},{"$error":"#VALUE!"},{"$error":"#VALUE!"}]
[{"$error":"#VALUE!"},{"$error":"#VALUE!"},{"$error":"#VALUE!"}]
[{"$error":"#VALUE!"},{"$error":"#VALUE!"},{"$error":"#VALUE!"}]
[{"$error":"#VALUE!"},{"$error":"#VALUE!"},{"$error":"#VALUE!"}]
[{"$error":"#VALUE!"},{"$error":"#VALUE!"},{"$error":"#VALUE!"}]
[{"$error":"#VALUE!"},{"$error":"#VALUE!"},{"$error":"#VALUE!"}]
[{"$error":"#VALUE!"},{"$error":"#VALUE!"},{"$error":"#VALUE!"}]
[{"$error":"#VALUE!"},{"$error":"#VALUE!"},{"$error":"#VALUE!"}]
[{"$error":"#VALUE!"},{"$error":"#VALUE!"},{"$error":"#VALUE!"}]
[{"$error":"#VALUE!"},{"$error":"#VALUE!"},{"$error":"#VALUE!"}]
[{"$error":"#VALUE!"},{"$error":"#VALUE!"},{"$error":"#VALUE!"}]
[{"$error":"#VALUE!"},{"$error":"#VALUE!"},{"$error":"#VALUE!"}]
[{"$error":"#VALUE!"},{"$error":"#VALUE!"},{"$error":"#VALUE!"}]
[{"$error":"#VALUE!"},{"$error":"#VALUE!"},{"$error":"#VALUE!"}]
[{"$error":"#VALUE!"},{"$error":"#VALUE!"},{"$error":"#VALUE!"}]
[{"$error":"#VALUE!"},{"$error":"#VALUE!"},{"$error":"#VALUE!"}]
[{"$error":"#VALUE!"},{"$error":"#VALUE!"},{"$error":"#VALUE!"}]
[{"$error":"#VALUE!"},{"$error":"#VALUE!"},{"$error":"#VALUE!"}]
[{"$error":"#VALUE!"},{"$error":"#VALUE!"},{"$error":"#VALUE!"}]
[{"$error":"#VALUE!"},{"$error":"#VALUE!"},{"$error":"#VALUE!"}]
[{"$error":"#VALUE!"},{"$f":"$B$25+$B$26*A158+$B$27*A158^2","v":{"$error":"#VALUE!"}},{"$f":"($E$26*62.4)/(1+(A158/100)*$E$26)","v":{"$error":"#VALUE!"}}]
[{"$error":"#VALUE!"},{"$error":"#VALUE!"},{"$error":"#VALUE!"}]
[{"$f":"A159-0.2","v":{"$error":"#VALUE!"}},{"$error":"#VALUE!"},{"$error":"#VALUE!"}]
[{"$error":"#VALUE!"},{"$error":"#VALUE!"},{"$error":"#VALUE!"}]
[{"$error":"#VALUE!"},{"$error":"#VALUE!"},{"$error":"#VALUE!"}]
[{"$error":"#VALUE!"},{"$error":"#VALUE!"},{"$error":"#VALUE!"}]
[{"$error":"#VALUE!"},{"$error":"#VALUE!"},{"$error":"#VALUE!"}]
[{"$error":"#VALUE!"},{"$error":"#VALUE!"},{"$error":"#VALUE!"}]
[{"$error":"#VALUE!"},{"$error":"#VALUE!"},{"$error":"#VALUE!"}]
[{"$error":"#VALUE!"},{"$error":"#VALUE!"},{"$error":"#VALUE!"}]
[{"$error":"#VALUE!"},{"$error":"#VALUE!"},{"$error":"#VALUE!"}]
[{"$error":"#VALUE!"},{"$error":"#VALUE!"},{"$error":"#VALUE!"}]
[{"$error":"#VALUE!"},{"$error":"#VALUE!"},{"$error":"#VALUE!"}]
[{"$error":"#VALUE!"},{"$error":"#VALUE!"},{"$error":"#VALUE!"}]
[{"$error":"#VALUE!"},{"$error":"#VALUE!"},{"$error":"#VALUE!"}]
[{"$error":"#VALUE!"},{"$error":"#VALUE!"},{"$error":"#VALUE!"}]
[{"$error":"#VALUE!"},{"$error":"#VALUE!"},{"$error":"#VALUE!"}]
[{"$error":"#VALUE!"},{"$error":"#VALUE!"},{"$error":"#VALUE!"}]
[{"$error":"#VALUE!"},{"$error":"#VALUE!"},{"$error":"#VALUE!"}]
[{"$error":"#VALUE!"},{"$error":"#VALUE!"},{"$error":"#VALUE!"}]
[{"$error":"#VALUE!"},{"$error":"#VALUE!"},{"$error":"#VALUE!"}]
[{"$error":"#VALUE!"},{"$error":"#VALUE!"},{"$error":"#VALUE!"}]
[{"$error":"#VALUE!"},{"$error":"#VALUE!"},{"$error":"#VALUE!"}]
[{"$error":"#VALUE!"},{"$error":"#VALUE!"},{"$error":"#VALUE!"}]
[{"$error":"#VALUE!"},{"$error":"#VALUE!"},{"$error":"#VALUE!"}]
[{"$error":"#VALUE!"},{"$error":"#VALUE!"},{"$error":"#VALUE!"}]
[{"$error":"#VALUE!"},{"$error":"#VALUE!"},{"$error":"#VALUE!"}]
[{"$error":"#VALUE!"},{"$error":"#VALUE!"},{"$error":"#VALUE!"}]
[{"$error":"#VALUE!"},{"$error":"#VALUE!"},{"$error":"#VALUE!"}]
[{"$error":"#VALUE!"},{"$error":"#VALUE!"},{"$error":"#VALUE!"}]
[{"$error":"#VALUE!"},{"$error":"#VALUE!"},{"$error":"#VALUE!"}]
[{"$error":"#VALUE!"},{"$error":"#VALUE!"},{"$error":"#VALUE!"}]
[{"$error":"#VALUE!"},{"$error":"#VALUE!"},{"$error":"#VALUE!"}]
[{"$error":"#VALUE!"},{"$error":"#VALUE!"},{"$error":"#VALUE!"}]
[{"$error":"#VALUE!"},{"$error":"#VALUE!"},{"$error":"#VALUE!"}]
[{"$error":"#VALUE!"},{"$error":"#VALUE!"},{"$error":"#VALUE!"}]
[{"$error":"#VALUE!"},{"$error":"#VALUE!"},{"$error":"#VALUE!"}]
[{"$error":"#VALUE!"},{"$error":"#VALUE!"},{"$error":"#VALUE!"}]
[{"$error":"#VALUE!"},{"$error":"#VALUE!"},{"$error":"#VALUE!"}]
[{"$error":"#VALUE!"},{"$error":"#VALUE!"},{"$error":"#VALUE!"}]
[{"$error":"#VALUE!"},{"$error":"#VALUE!"},{"$error":"#VALUE!"}]
[{"$error":"#VALUE!"},{"$error":"#VALUE!"},{"$error":"#VALUE!"}]
[{"$error":"#VALUE!"},{"$error":"#VALUE!"},{"$error":"#VALUE!"}]
[{"$error":"#VALUE!"},{"$error":"#VALUE!"},{"$error":"#VALUE!"}]

{"sheet":"00 psi","index":3,"n_rows":26,"n_cols":5,"rows_kept":26,"cut":false,"hidden":true,"merged":[[0,4,0,9]]}
["[HEADER]",null,null,"File Name:"]
["Project:","Project1"]
["Date:",37036,"Time:",0.40276620370370397]
["Boring:","Boring1","Sample:",6]
["Specimen:",6,"Depth (ft):",10]
["Diameter (inch):",null,"Height (inch):"]
["Piston Correction (lbs):"]
["Comments:"]
[]
["[SENSORS]"]
["Name","External Load Cell","Cell Pressure","Load Frame Encoder"]
["ID","LC54032","PS9170013","N/A"]
["Module","Load Frame Adc","Load Frame Adc","N/A"]
["Channel",1,3,"N/A"]
["Unit","lbs","psi","inch"]
["Cal. Factor",null,10000]
["Excitation",null,10.029999999999999,"N/A"]
["Zero",null,-1.7200000000000001E-4,"N/A"]
["Min. Reading",-10000,-14,0]
["Max. Reading",10000,98,3.5]
[]
["[SHEAR]"]
["Time          ","External Load Cell","Cell Pressure","Platen Position"]
[null,null,null,null,"< Zero Value Platen Position"]
[null,null,null,null,"< Minimum Value Load Cell"]
[null,null,null,null,"< Minimum Value Platen Position"]

{"sheet":"03 psi","index":4,"n_rows":26,"n_cols":5,"rows_kept":26,"cut":false,"hidden":true,"merged":[[0,4,0,9]]}
["[HEADER]",null,null,"File Name:"]
["Project:","Project1"]
["Date:",37036,"Time:",0.42031249999999998]
["Boring:","Boring1","Sample:",3]
["Specimen:",3,"Depth (ft):",10]
["Diameter (inch):",null,"Height (inch):"]
["Piston Correction (lbs):"]
["Comments:"]
[]
["[SENSORS]"]
["Name","External Load Cell","Cell Pressure","Load Frame Encoder"]
["ID","LC54032","PS9170013","N/A"]
["Module","Load Frame Adc","Load Frame Adc","N/A"]
["Channel",1,3,"N/A"]
["Unit","lbs","psi","inch"]
["Cal. Factor",null,10000]
["Excitation",null,10.029999999999999,"N/A"]
["Zero",null,-1.7200000000000001E-4,"N/A"]
["Min. Reading",-10000,-14,0]
["Max. Reading",10000,98,3.5]
[]
["[SHEAR]"]
["Time          ","External Load Cell","Cell Pressure","Platen Position"]
[null,null,null,null,"< Zero Value Platen Position"]
[null,null,null,null,"< Minimum Value Load Cell"]
[null,null,null,null,"< Minimum Value Platen Position"]

{"sheet":"05 psi","index":5,"n_rows":26,"n_cols":5,"rows_kept":26,"cut":false,"hidden":true,"merged":[[0,4,0,9]]}
["[HEADER]",null,null,"File Name:"]
["Project:","Project1"]
["Date:",37036,"Time:",0.42736111111111103]
["Boring:","Boring1","Sample:",1]
["Specimen:",1,"Depth (ft):",10]
["Diameter (inch):",null,"Height (inch):"]
["Piston Correction (lbs):"]
["Comments:"]
[]
["[SENSORS]"]
["Name","External Load Cell","Cell Pressure","Load Frame Encoder"]
["ID","LC54032","PS9170013","N/A"]
["Module","Load Frame Adc","Load Frame Adc","N/A"]
["Channel",1,3,"N/A"]
["Unit","lbs","psi","inch"]
["Cal. Factor",null,10000]
["Excitation",null,10.029999999999999,"N/A"]
["Zero",null,-1.7200000000000001E-4,"N/A"]
["Min. Reading",-10000,-14,0]
["Max. Reading",10000,98,3.5]
[]
["[SHEAR]"]
["Time          ","External Load Cell","Cell Pressure","Platen Position"]
[null,null,null,null,"< Zero Value Platen Position"]
[null,null,null,null,"< Minimum Value Load Cell"]
[null,null,null,null,"< Minimum Value Platen Position"]

{"sheet":"07 psi","index":6,"n_rows":26,"n_cols":5,"rows_kept":26,"cut":false,"hidden":true,"merged":[[0,4,0,9]]}
["[HEADER]",null,null,"File Name:"]
["Project:","Project1"]
["Date:",37440,"Time:",0.47509259259259301]
["Boring:","Boring1","Sample:",4]
["Specimen:",4,"Depth (ft):",10]
["Diameter (inch):",null,"Height (inch):"]
["Piston Correction (lbs):"]
["Comments:"]
[]
["[SENSORS]"]
["Name","External Load Cell","Cell Pressure","Load Frame Encoder"]
["ID","lc54032","PS9170013","N/A"]
["Module","Load Frame Adc","Load Frame Adc","N/A"]
["Channel",1,3,"N/A"]
["Unit","lbs","psi","inch"]
["Cal. Factor",null,10000]
["Excitation",null,10.029999999999999,"N/A"]
["Zero",null,-1.3899999999999999E-4,"N/A"]
["Min. Reading",-10000,-14,0]
["Max. Reading",10000,98,3.5]
[]
["[SHEAR]"]
["Time          ","External Load Cell","Cell Pressure","Platen Position"]
[null,null,null,null,"< Zero Value Platen Position"]
[null,null,null,null,"< Minimum Value Load Cell"]
[null,null,null,null,"< Minimum Value Platen Position"]

{"sheet":"10 psi","index":7,"n_rows":26,"n_cols":5,"rows_kept":26,"cut":false,"hidden":true,"merged":[[0,4,0,9]]}
["[HEADER]",null,null,"File Name:"]
["Project:","Project1"]
["Date:",37036,"Time:",0.44061342592592601]
["Boring:","Boring1","Sample:",5]
["Specimen:",5,"Depth (ft):",10]
["Diameter (inch):",null,"Height (inch):"]
["Piston Correction (lbs):"]
["Comments:"]
[]
["[SENSORS]"]
["Name","External Load Cell","Cell Pressure","Load Frame Encoder"]
["ID","LC54032","PS9170013","N/A"]
["Module","Load Frame Adc","Load Frame Adc","N/A"]
["Channel",1,3,"N/A"]
["Unit","lbs","psi","inch"]
["Cal. Factor",null,10000]
["Excitation",null,10.029999999999999,"N/A"]
["Zero",null,-1.7200000000000001E-4,"N/A"]
["Min. Reading",-10000,-14,0]
["Max. Reading",10000,98,3.5]
[]
["[SHEAR]"]
["Time          ","External Load Cell","Cell Pressure","Platen Position"]
[null,null,null,null,"< Zero Value Platen Position"]
[null,null,null,null,"< Minimum Value Load Cell"]
[null,null,null,null,"< Minimum Value Platen Position"]

{"sheet":"15 psi","index":8,"n_rows":26,"n_cols":5,"rows_kept":26,"cut":false,"hidden":true,"merged":[[0,4,0,9]]}
["[HEADER]",null,null,"File Name:"]
["Project:","Project1"]
["Date:",37036,"Time:",0.41158564814814802]
["Boring:","Boring1","Sample:",2]
["Specimen:",2,"Depth (ft):",10]
["Diameter (inch):",null,"Height (inch):"]
["Piston Correction (lbs):"]
["Comments:"]
[]
["[SENSORS]"]
["Name","External Load Cell","Cell Pressure","Load Frame Encoder"]
["ID","LC54032","PS9170013","N/A"]
["Module","Load Frame Adc","Load Frame Adc","N/A"]
["Channel",1,3,"N/A"]
["Unit","lbs","psi","inch"]
["Cal. Factor",null,10000]
["Excitation",null,10.029999999999999,"N/A"]
["Zero",null,-1.7200000000000001E-4,"N/A"]
["Min. Reading",-10000,-14,0]
["Max. Reading",10000,98,3.5]
[]
["[SHEAR]"]
["Time          ","External Load Cell","Cell Pressure","Platen Position"]
[null,null,null,null,"< Zero Value Platen Position"]
[null,null,null,null,"< Minimum Value Load Cell"]
[null,null,null,null,"< Minimum Value Platen Position"]

{"sheet":"00 psi (2)","index":9,"n_rows":26,"n_cols":5,"rows_kept":26,"cut":false,"hidden":true,"merged":[[0,4,0,9]]}
["[HEADER]",null,null,"File Name:"]
["Project:","Project1"]
["Date:",37036,"Time:",0.40013888888888899]
["Boring:","Boring1","Sample:",6]
["Specimen:",6,"Depth (ft):",10]
["Diameter (inch):",null,"Height (inch):"]
["Piston Correction (lbs):"]
["Comments:"]
[]
["[SENSORS]"]
["Name","External Load Cell","Cell Pressure","Load Frame Encoder"]
["ID","LC54032","PS9170013","N/A"]
["Module","Load Frame Adc","Load Frame Adc","N/A"]
["Channel",1,3,"N/A"]
["Unit","lbs","psi","inch"]
["Cal. Factor",null,10000]
["Excitation",null,10.029999999999999,"N/A"]
["Zero",null,-1.7200000000000001E-4,"N/A"]
["Min. Reading",-10000,-14,0]
["Max. Reading",10000,98,3.5]
[]
["[SHEAR]"]
["Time          ","External Load Cell","Cell Pressure","Platen Position"]
[null,null,null,null,"< Zero Value Platen Position"]
[null,null,null,null,"< Minimum Value Load Cell"]
[null,null,null,null,"< Minimum Value Platen Position"]

{"sheet":"20 psi","index":10,"n_rows":26,"n_cols":5,"rows_kept":26,"cut":false,"hidden":true,"merged":[[0,4,0,9]]}
["[HEADER]",null,null,"File Name:"]
["Project:"]
["Date:",null,"Time:"]
["Boring:",null,"Sample:"]
["Specimen:",null,"Depth (ft):"]
["Diameter (inch):",null,"Height (inch):"]
["Piston Correction (lbs):"]
["Comments:"]
[]
["[SENSORS]"]
["Name","External Load Cell","Cell Pressure","Load Frame Encoder"]
["ID"]
["Module"]
["Channel"]
["Unit"]
["Cal. Factor"]
["Excitation"]
["Zero"]
["Min. Reading"]
["Max. Reading"]
[]
["[SHEAR]"]
["Time          ","External Load Cell","Cell Pressure","Platen Position"]
[null,null,null,null,"< Zero Value Platen Position"]
[null,null,null,null,"< Minimum Value Load Cell"]
[null,null,null,null,"< Minimum Value Platen Position"]

{"sheet":"Summary","index":11,"n_rows":42,"n_cols":11,"rows_kept":42,"cut":false,"hidden":false,"merged":[[33,6,33,7],[34,6,34,7],[41,6,41,7],[32,1,32,3],[33,1,33,3],[34,1,34,3],[37,6,37,7],[35,6,35,7],[36,6,36,7],[38,6,38,7],[39,8,39,9],[33,8,33,9],[34,8,34,9],[35,8,35,9],[36,8,36,9],[41,10,41,11],[32,6,32,11],[40,8,40,9],[41,8,41,9],[33,10,33,11],[34,10,34,11],[35,10,35,11],[36,10,36,11],[37,10,37,11],[38,10,38,11],[39,10,39,11],[40,10,40,11],[39,6,39,7],[40,6,40,7],[37,8,37,9],[38,8,38,9]]}
[]
[]
[]
[]
[]
[]
[]
[]
[]
[]
[]
[]
[]
[]
[]
[]
[]
[]
[]
[]
[]
[]
[]
[]
[]
[]
[]
[]
[]
[]
[]
[]
[null,"Classification",null,null,{"$f":"#REF!","v":{"$error":"#REF!"}},null,"Failure Stresses"]
[null,"Internal Angle of Friction",null,null,{"$f":"#REF!","v":{"$error":"#REF!"}},null,"Lateral Stress (psi)",null,"Normal Stress (psi)",null,"Shear Stress (psi)"]
[null,"Cohesion (psi)",null,null,{"$f":"#REF!","v":{"$error":"#REF!"}},null,{"$f":"'Mohr Analysis'!B5","v":0},null,{"$f":"'Mohr Analysis'!F5","v":{"$error":"#VALUE!"}},null,{"$f":"'Mohr Analysis'!G5","v":{"$error":"#VALUE!"}}]
[null,null,null,null,null,null,{"$f":"'Mohr Analysis'!B6","v":0},null,{"$f":"'Mohr Analysis'!F6","v":{"$error":"#VALUE!"}},null,{"$f":"'Mohr Analysis'!G6","v":{"$error":"#VALUE!"}}]
[null,null,null,null,null,null,{"$f":"'Mohr Analysis'!B7","v":0},null,{"$f":"'Mohr Analysis'!F7","v":{"$error":"#VALUE!"}},null,{"$f":"'Mohr Analysis'!G7","v":{"$error":"#VALUE!"}}]
[null,null,null,null,null,null,{"$f":"'Mohr Analysis'!B8","v":0},null,{"$f":"'Mohr Analysis'!F8","v":{"$error":"#VALUE!"}},null,{"$f":"'Mohr Analysis'!G8","v":{"$error":"#VALUE!"}}]
[null,null,null,null,null,null,{"$f":"'Mohr Analysis'!B9","v":0},null,{"$f":"'Mohr Analysis'!F9","v":{"$error":"#VALUE!"}},null,{"$f":"'Mohr Analysis'!G9","v":{"$error":"#VALUE!"}}]
[null,null,null,null,null,null,{"$f":"'Mohr Analysis'!B10","v":0},null,{"$f":"'Mohr Analysis'!F10","v":{"$error":"#VALUE!"}},null,{"$f":"'Mohr Analysis'!G10","v":{"$error":"#VALUE!"}}]
[null,null,null,null,null,null,{"$f":"'Mohr Analysis'!B11","v":0},null,{"$f":"'Mohr Analysis'!F11","v":{"$error":"#VALUE!"}},null,{"$f":"'Mohr Analysis'!G11","v":{"$error":"#VALUE!"}}]
[null,null,null,null,null,null,{"$f":"'Mohr Analysis'!B12","v":0},null,{"$f":"'Mohr Analysis'!F12","v":{"$error":"#VALUE!"}},null,{"$f":"'Mohr Analysis'!G12","v":{"$error":"#VALUE!"}}]

{"sheet":"Mohr Analysis","index":12,"n_rows":1270,"n_cols":21,"rows_kept":1270,"cut":false,"hidden":false,"merged":[]}
[null,null,"        Mohr's Circle Analysis",null,null,null,null,null,"Standard:"]
[null,null,null,null,null,null,null,null,null,null,null,"          s3=5",null,"          s3=10",null,"          s3=15"]
[null,null,null,null,null,"            Failure Strengths",null,null,null,"2ai","2ai","tf","t max","tf","t max","tf ","t max",null,null,"s","t"]
[null,"s3","s1","Max Shear Stress","Center Stress","Normal Stress","Shear Strength",null,"Class 1 ",145,{"$f":"J4*(PI()/180)","v":2.5306999999999999},null,null,null,null,null,null,{"$f":"IF(OR(AND(J13>M5,J14>O5,J15>Q5)),1,0)","v":{"$error":"#N/A"}},{"$f":"IF(R4=1,145,1000)","v":{"$error":"#N/A"}},{"$f":"D5*COS($S$11)+E5","v":{"$error":"#VALUE!"}},{"$f":"D5*SIN($S$11)","v":{"$error":"#VALUE!"}}]
[1,{"$f":"Worksheet!D33","v":0},{"$f":"Worksheet!D48","v":""},{"$f":"(C5-B5)/2","v":{"$error":"#VALUE!"}},{"$f":"(C5+B5)/2","v":{"$error":"#VALUE!"}},{"$f":"D5*COS($B$16)+E5","v":{"$error":"#VALUE!"}},{"$f":"D5*SIN($B$16)","v":{"$error":"#VALUE!"}},null,"Class 2",140,2.4434999999999998,15,{"$f":"L5/SIN(PI()-K5)","v":23.3369433971977},23.4,{"$f":"N5/SIN(PI()-K5)","v":36.405631699628401},30,{"$f":"P5/SIN(PI()-K5)","v":46.673886794395301},{"$f":"IF(OR(AND(M5>=J13,J13>M6),AND(O5>=J14,J14>O6),AND(Q5>=J15,J15>Q6)),1,0)","v":{"$error":"#N/A"}},{"$f":"IF(R5=1,140,1000)","v":{"$error":"#N/A"}},{"$error":"#VALUE!"},{"$error":"#VALUE!"}]
[2,{"$f":"Worksheet!E33","v":0},{"$f":"Worksheet!E48","v":""},{"$error":"#VALUE!"},{"$error":"#VALUE!"},{"$f":"D6*COS($B$16)+E6","v":{"$error":"#VALUE!"}},{"$error":"#VALUE!"},null,"Class 3",135,2.3561999999999999,11.4,{"$f":"L6/SIN(PI()-K6)","v":16.122123441097202},17.8,{"$f":"N6/SIN(PI()-K6)","v":25.173140109783301},22.3,{"$f":"P6/SIN(PI()-K6)","v":31.5371362049532},{"$f":"IF(OR(AND(M6>=J13,J13>M7),AND(O6>=J14,J14>O7),AND(Q6>=J15,J15>Q7)),1,0)","v":{"$error":"#N/A"}},{"$f":"IF(R6=1,135,1000)","v":{"$error":"#N/A"}},{"$error":"#VALUE!"},{"$error":"#VALUE!"}]
[3,{"$f":"Worksheet!F33","v":0},{"$f":"Worksheet!F48","v":""},{"$error":"#VALUE!"},{"$error":"#VALUE!"},{"$error":"#VALUE!"},{"$error":"#VALUE!"},null,"Class 4",125,2.1817000000000002,6.2,{"$f":"L7/SIN(PI()-K7)","v":7.5690061566512696},11.3,{"$f":"N7/SIN(PI()-K7)","v":13.795124124219299},15.4,{"$f":"P7/SIN(PI()-K7)","v":18.800434647166099},{"$f":"IF(OR(AND(M7>=J13),AND(O7>=J14,J14>O8),AND(Q7>=J15,J15>Q8)),1,0)","v":{"$error":"#N/A"}},{"$f":"IF(R7=1,125,1000)","v":{"$error":"#N/A"}},{"$error":"#VALUE!"},{"$error":"#VALUE!"}]
[4,{"$f":"Worksheet!G33","v":0},{"$f":"Worksheet!G48","v":""},{"$error":"#VALUE!"},{"$error":"#VALUE!"},{"$error":"#VALUE!"},{"$error":"#VALUE!"},null,"Class 5",120,2.0943999999999998,null,null,6.3,{"$f":"N8/SIN(PI()-K8)","v":7.2746339618832696},7.9,{"$f":"P8/SIN(PI()-K8)","v":9.1221600474409303},{"$f":"IF(OR(AND(O8>=J14,J14>O9),AND(Q8>=J15,J15>Q9)),1,0)","v":{"$error":"#N/A"}},{"$f":"IF(R8=1,120,1000)","v":{"$error":"#N/A"}},{"$error":"#VALUE!"},{"$error":"#VALUE!"}]
[5,{"$f":"Worksheet!H33","v":0},{"$f":"Worksheet!H48","v":""},{"$error":"#VALUE!"},{"$error":"#VALUE!"},{"$error":"#VALUE!"},{"$error":"#VALUE!"},null,"Class 6",110,1.9198999999999999,null,null,3.8,{"$f":"N9/SIN(PI()-K9)","v":4.04393120857711},4.7,{"$f":"P9/SIN(PI()-K9)","v":5.0017043895558997},{"$f":"IF(AND(J14<O9,J15<Q9),1,0)","v":{"$error":"#N/A"}},{"$f":"IF(R9=1,110,1000)","v":{"$error":"#N/A"}},{"$error":"#VALUE!"},{"$error":"#VALUE!"}]
[6,{"$f":"Worksheet!I33","v":0},{"$f":"Worksheet!I48","v":""},{"$error":"#VALUE!"},{"$error":"#VALUE!"},{"$error":"#VALUE!"},{"$error":"#VALUE!"},null,null,null,null,null,null,null,null,null,null,"2ai=",{"$f":"MIN(S4:S9)","v":{"$error":"#N/A"}},{"$error":"#VALUE!"},{"$error":"#VALUE!"}]
[7,{"$f":"Worksheet!J33","v":0},{"$f":"Worksheet!J48","v":""},{"$error":"#VALUE!"},{"$error":"#VALUE!"},{"$error":"#VALUE!"},{"$error":"#VALUE!"},null,"Calculation of","2a:",null,null,null,null,null,null,null,null,{"$f":"S10*(PI()/180)","v":{"$error":"#N/A"}}]
[8,{"$f":"Worksheet!K33","v":0},{"$f":"Worksheet!K48","v":""},{"$error":"#VALUE!"},{"$error":"#VALUE!"},{"$error":"#VALUE!"},{"$error":"#VALUE!"},null,null,null,null,null,null,5,6,7]
[null,null,null,null,null,null,null,null,"t max @ 5",{"$f":"VLOOKUP(K13,B5:D12,3,0)","v":{"$error":"#N/A"}},5,null,"m=",{"$f":"IF(AND(U8>0,U9=0),INDEX(LINEST(U4:U8,T4:T8),1),0)","v":{"$error":"#VALUE!"}},{"$f":"IF(AND(U9>0,U10=0),INDEX(LINEST(U4:U9,T4:T9),1),0)","v":{"$error":"#VALUE!"}},{"$f":"IF(U10>0,INDEX(LINEST(U4:U10,T4:T10),1),0)","v":{"$error":"#VALUE!"}},{"$f":"MAX(N13:P13)","v":{"$error":"#VALUE!"}}]
[null,null,null,5,6,7,"Linear Regression",null,"t max @10",{"$f":"VLOOKUP(K14,B5:D12,3,0)","v":{"$error":"#N/A"}},10,null,"b=",{"$f":"IF(AND(T8>0,T9=0),INDEX(LINEST(U4:U8,T4:T8),2),0)","v":{"$error":"#VALUE!"}},{"$f":"IF(AND(T9>0,T10=0),INDEX(LINEST(U4:U9,T4:T9),2),0)","v":{"$error":"#VALUE!"}},{"$f":"IF(T10>0,INDEX(LINEST(U4:U10,T4:T10),2),0)","v":{"$error":"#VALUE!"}},{"$f":"MAX(N14:P14)","v":{"$error":"#VALUE!"}}]
["2a=",{"$f":"Q16","v":{"$error":"#VALUE!"}},"m=",{"$f":"IF(AND(C9>0,C10=0),INDEX(LINEST(G5:G9,F5:F9),1),0)","v":0},{"$f":"IF(AND(C10>0,C11=0),INDEX(LINEST(G5:G10,F5:F10),1),0)","v":0},{"$f":"IF(C11>0,INDEX(LINEST(G5:G11,F5:F11),1),0)","v":{"$error":"#VALUE!"}},{"$f":"MAX(D15:F15)","v":{"$error":"#VALUE!"}},{"$f":"ATAN(G15)*(180/PI())","v":{"$error":"#VALUE!"}},"t max @15",{"$f":"VLOOKUP(K15,B5:D12,3,0)","v":{"$error":"#N/A"}},15,null,"F=",{"$f":"ATAN(N13)*(180/PI())","v":{"$error":"#VALUE!"}},{"$f":"ATAN(O13)*(180/PI())","v":{"$error":"#VALUE!"}},{"$f":"ATAN(P13)*(180/PI())","v":{"$error":"#VALUE!"}},{"$f":"MAX(N15:P15)","v":{"$error":"#VALUE!"}}]
[null,{"$f":"B15*(PI()/180)","v":{"$error":"#VALUE!"}},"b=",{"$f":"IF(AND(C9>0,C10=0),INDEX(LINEST(G5:G9,F5:F9),2),0)","v":0},{"$f":"IF(AND(C10>0,C11=0),INDEX(LINEST(G5:G10,F5:F10),2),0)","v":0},{"$f":"IF(C11>0,INDEX(LINEST(G5:G11,F5:F11),2),0)","v":{"$error":"#VALUE!"}},{"$f":"MAX(D16:F16)","v":{"$error":"#VALUE!"}},null,null,null,null,null,"2a=",{"$f":"90+N15","v":{"$error":"#VALUE!"}},{"$f":"90+O15","v":{"$error":"#VALUE!"}},{"$f":"90+P15","v":{"$error":"#VALUE!"}},{"$f":"MAX(N16:P16)","v":{"$error":"#VALUE!"}}]
[null,null,"R^2=",{"$f":"IF(AND(C9>0,C10=0),CORREL(F5:F9,G5:G9),0)","v":0},{"$f":"IF(AND(C10>0,C11=0),CORREL(F5:F10,G5:G10),0)","v":0},{"$f":"IF(C11>0,CORREL(F5:F11,G5:G11),0)","v":{"$error":"#VALUE!"}},{"$f":"MAX(D17:F17)","v":{"$error":"#VALUE!"}}]
[]
["Normal Stress","Line","Circle 1","Circle 2","Circle 3","Circle 4","Circle 5","Circle 6","Circle 7","Circle 8"]
[0,{"$f":"$G$15*A20+$G$16","v":{"$error":"#VALUE!"}},{"$f":"IF(AND($C$5>=A20,A20>=$B$5),($D$5^2-(A20-$E$5)^2)^0.5,0)","v":{"$error":"#VALUE!"}},{"$f":"IF(AND($C$6>=A20,A20>=$B$6),($D$6^2-(A20-$E$6)^2)^0.5,0)","v":{"$error":"#VALUE!"}},{"$f":"IF(AND($C$7>=A20,A20>$B$7),($D$7^2-(A20-$E$7)^2)^0.5,0)","v":0},{"$f":"IF(AND($C$8>=A20,A20>=$B$8),($D$8^2-(A20-$E$8)^2)^0.5,0)","v":{"$error":"#VALUE!"}},{"$f":"IF(AND($C$9>=A20,A20>=$B$9),($D$9^2-(A20-$E$9)^2)^0.5,0)","v":{"$error":"#VALUE!"}},{"$f":"IF(AND($C$10>=A20,A20>=$B$10),($D$10^2-(A20-$E$10)^2)^0.5,0)","v":{"$error":"#VALUE!"}},{"$f":"IF(AND($C$11>=A20,A20>=$B$11),($D$11^2-(A20-$E$11)^2)^0.5,0)","v":{"$error":"#VALUE!"}},{"$f":"IF(AND($C$12>=A20,A20>=$B$12),($D$12^2-(A20-$E$12)^2)^0.5,0)","v":{"$error":"#VALUE!"}}]
[{"$f":"A20+0.2","v":0.2},{"$f":"$G$15*A21+$G$16","v":{"$error":"#VALUE!"}},{"$error":"#VALUE!"},{"$error":"#VALUE!"},{"$error":"#VALUE!"},{"$error":"#VALUE!"},{"$error":"#VALUE!"},{"$error":"#VALUE!"},{"$error":"#VALUE!"},{"$f":"IF(AND($C$12>=A21,A21>=$B$12),($D$12^2-(A21-$E$12)^2)^0.5,0)","v":{"$error":"#VALUE!"}}]
[{"$f":"A21+0.2","v":0.4},{"$error":"#VALUE!"},{"$error":"#VALUE!"},{"$error":"#VALUE!"},{"$error":"#VALUE!"},{"$error":"#VALUE!"},{"$error":"#VALUE!"},{"$error":"#VALUE!"},{"$error":"#VALUE!"},{"$error":"#VALUE!"}]
[0.6,{"$error":"#VALUE!"},{"$error":"#VALUE!"},{"$error":"#VALUE!"},{"$error":"#VALUE!"},{"$error":"#VALUE!"},{"$error":"#VALUE!"},{"$error":"#VALUE!"},{"$error":"#VALUE!"},{"$error":"#VALUE!"}]
[0.8,{"$error":"#VALUE!"},{"$error":"#VALUE!"},{"$error":"#VALUE!"},{"$error":"#VALUE!"},{"$error":"#VALUE!"},{"$error":"#VALUE!"},{"$error":"#VALUE!"},{"$error":"#VALUE!"},{"$error":"#VALUE!"}]
[1,{"$error":"#VALUE!"},{"$error":"#VALUE!"},{"$error":"#VALUE!"},{"$error":"#VALUE!"},{"$error":"#VALUE!"},{"$error":"#VALUE!"},{"$error":"#VALUE!"},{"$error":"#VALUE!"},{"$error":"#VALUE!"}]
[1.2,{"$error":"#VALUE!"},{"$error":"#VALUE!"},{"$error":"#VALUE!"},{"$error":"#VALUE!"},{"$error":"#VALUE!"},{"$error":"#VALUE!"},{"$error":"#VALUE!"},{"$error":"#VALUE!"},{"$error":"#VALUE!"}]
[1.4,{"$error":"#VALUE!"},{"$error":"#VALUE!"},{"$error":"#VALUE!"},{"$error":"#VALUE!"},{"$error":"#VALUE!"},{"$error":"#VALUE!"},{"$error":"#VALUE!"},{"$error":"#VALUE!"},{"$error":"#VALUE!"}]
[1.6,{"$error":"#VALUE!"},{"$error":"#VALUE!"},{"$error":"#VALUE!"},{"$error":"#VALUE!"},{"$error":"#VALUE!"},{"$error":"#VALUE!"},{"$error":"#VALUE!"},{"$error":"#VALUE!"},{"$error":"#VALUE!"}]
[1.8,{"$error":"#VALUE!"},{"$error":"#VALUE!"},{"$error":"#VALUE!"},{"$error":"#VALUE!"},{"$error":"#VALUE!"},{"$error":"#VALUE!"},{"$error":"#VALUE!"},{"$error":"#VALUE!"},{"$error":"#VALUE!"}]
[2,{"$error":"#VALUE!"},{"$error":"#VALUE!"},{"$error":"#VALUE!"},{"$error":"#VALUE!"},{"$error":"#VALUE!"},{"$error":"#VALUE!"},{"$error":"#VALUE!"},{"$error":"#VALUE!"},{"$error":"#VALUE!"}]
[2.2000000000000002,{"$error":"#VALUE!"},{"$error":"#VALUE!"},{"$error":"#VALUE!"},{"$error":"#VALUE!"},{"$error":"#VALUE!"},{"$error":"#VALUE!"},{"$error":"#VALUE!"},{"$error":"#VALUE!"},{"$error":"#VALUE!"}]
[2.4,{"$error":"#VALUE!"},{"$error":"#VALUE!"},{"$error":"#VALUE!"},{"$error":"#VALUE!"},{"$error":"#VALUE!"},{"$error":"#VALUE!"},{"$error":"#VALUE!"},{"$error":"#VALUE!"},{"$error":"#VALUE!"}]
[2.6,{"$error":"#VALUE!"},{"$error":"#VALUE!"},{"$error":"#VALUE!"},{"$error":"#VALUE!"},{"$error":"#VALUE!"},{"$error":"#VALUE!"},{"$error":"#VALUE!"},{"$error":"#VALUE!"},{"$error":"#VALUE!"}]
[2.8,{"$error":"#VALUE!"},{"$error":"#VALUE!"},{"$error":"#VALUE!"},{"$error":"#VALUE!"},{"$error":"#VALUE!"},{"$error":"#VALUE!"},{"$error":"#VALUE!"},{"$error":"#VALUE!"},{"$error":"#VALUE!"}]
[3,{"$error":"#VALUE!"},{"$error":"#VALUE!"},{"$error":"#VALUE!"},{"$error":"#VALUE!"},{"$error":"#VALUE!"},{"$error":"#VALUE!"},{"$error":"#VALUE!"},{"$error":"#VALUE!"},{"$error":"#VALUE!"}]
[3.2,{"$error":"#VALUE!"},{"$error":"#VALUE!"},{"$error":"#VALUE!"},{"$error":"#VALUE!"},{"$error":"#VALUE!"},{"$error":"#VALUE!"},{"$error":"#VALUE!"},{"$error":"#VALUE!"},{"$error":"#VALUE!"}]
[3.4,{"$error":"#VALUE!"},{"$error":"#VALUE!"},{"$error":"#VALUE!"},{"$error":"#VALUE!"},{"$error":"#VALUE!"},{"$error":"#VALUE!"},{"$error":"#VALUE!"},{"$error":"#VALUE!"},{"$error":"#VALUE!"}]
[3.6,{"$error":"#VALUE!"},{"$error":"#VALUE!"},{"$error":"#VALUE!"},{"$error":"#VALUE!"},{"$error":"#VALUE!"},{"$error":"#VALUE!"},{"$error":"#VALUE!"},{"$error":"#VALUE!"},{"$error":"#VALUE!"}]
[3.8,{"$error":"#VALUE!"},{"$error":"#VALUE!"},{"$error":"#VALUE!"},{"$error":"#VALUE!"},{"$error":"#VALUE!"},{"$error":"#VALUE!"},{"$error":"#VALUE!"},{"$error":"#VALUE!"},{"$error":"#VALUE!"}]
[4,{"$error":"#VALUE!"},{"$error":"#VALUE!"},{"$error":"#VALUE!"},{"$error":"#VALUE!"},{"$error":"#VALUE!"},{"$error":"#VALUE!"},{"$error":"#VALUE!"},{"$error":"#VALUE!"},{"$error":"#VALUE!"}]
[4.2,{"$error":"#VALUE!"},{"$error":"#VALUE!"},{"$error":"#VALUE!"},{"$error":"#VALUE!"},{"$error":"#VALUE!"},{"$error":"#VALUE!"},{"$error":"#VALUE!"},{"$error":"#VALUE!"},{"$error":"#VALUE!"}]
[4.4000000000000004,{"$error":"#VALUE!"},{"$error":"#VALUE!"},{"$error":"#VALUE!"},{"$error":"#VALUE!"},{"$error":"#VALUE!"},{"$error":"#VALUE!"},{"$error":"#VALUE!"},{"$error":"#VALUE!"},{"$error":"#VALUE!"}]
[4.5999999999999996,{"$error":"#VALUE!"},{"$error":"#VALUE!"},{"$error":"#VALUE!"},{"$error":"#VALUE!"},{"$error":"#VALUE!"},{"$error":"#VALUE!"},{"$error":"#VALUE!"},{"$error":"#VALUE!"},{"$error":"#VALUE!"}]
[4.8,{"$error":"#VALUE!"},{"$error":"#VALUE!"},{"$error":"#VALUE!"},{"$error":"#VALUE!"},{"$error":"#VALUE!"},{"$error":"#VALUE!"},{"$error":"#VALUE!"},{"$error":"#VALUE!"},{"$error":"#VALUE!"}]
[5,{"$error":"#VALUE!"},{"$error":"#VALUE!"},{"$error":"#VALUE!"},{"$error":"#VALUE!"},{"$error":"#VALUE!"},{"$error":"#VALUE!"},{"$error":"#VALUE!"},{"$error":"#VALUE!"},{"$error":"#VALUE!"}]
[5.2,{"$error":"#VALUE!"},{"$error":"#VALUE!"},{"$error":"#VALUE!"},{"$error":"#VALUE!"},{"$error":"#VALUE!"},{"$error":"#VALUE!"},{"$error":"#VALUE!"},{"$error":"#VALUE!"},{"$error":"#VALUE!"}]
[5.4,{"$error":"#VALUE!"},{"$error":"#VALUE!"},{"$error":"#VALUE!"},{"$error":"#VALUE!"},{"$error":"#VALUE!"},{"$error":"#VALUE!"},{"$error":"#VALUE!"},{"$error":"#VALUE!"},{"$error":"#VALUE!"}]
[5.6,{"$error":"#VALUE!"},{"$error":"#VALUE!"},{"$error":"#VALUE!"},{"$error":"#VALUE!"},{"$error":"#VALUE!"},{"$error":"#VALUE!"},{"$error":"#VALUE!"},{"$error":"#VALUE!"},{"$error":"#VALUE!"}]
[5.8,{"$error":"#VALUE!"},{"$error":"#VALUE!"},{"$error":"#VALUE!"},{"$error":"#VALUE!"},{"$error":"#VALUE!"},{"$error":"#VALUE!"},{"$error":"#VALUE!"},{"$error":"#VALUE!"},{"$error":"#VALUE!"}]
[6,{"$error":"#VALUE!"},{"$error":"#VALUE!"},{"$error":"#VALUE!"},{"$error":"#VALUE!"},{"$error":"#VALUE!"},{"$error":"#VALUE!"},{"$error":"#VALUE!"},{"$error":"#VALUE!"},{"$error":"#VALUE!"}]
[6.2,{"$error":"#VALUE!"},{"$error":"#VALUE!"},{"$error":"#VALUE!"},{"$error":"#VALUE!"},{"$error":"#VALUE!"},{"$error":"#VALUE!"},{"$error":"#VALUE!"},{"$error":"#VALUE!"},{"$error":"#VALUE!"}]
[6.4,{"$error":"#VALUE!"},{"$error":"#VALUE!"},{"$error":"#VALUE!"},{"$error":"#VALUE!"},{"$error":"#VALUE!"},{"$error":"#VALUE!"},{"$error":"#VALUE!"},{"$error":"#VALUE!"},{"$error":"#VALUE!"}]
[6.6,{"$error":"#VALUE!"},{"$error":"#VALUE!"},{"$error":"#VALUE!"},{"$error":"#VALUE!"},{"$error":"#VALUE!"},{"$error":"#VALUE!"},{"$error":"#VALUE!"},{"$error":"#VALUE!"},{"$error":"#VALUE!"}]
[6.8,{"$error":"#VALUE!"},{"$error":"#VALUE!"},{"$error":"#VALUE!"},{"$error":"#VALUE!"},{"$error":"#VALUE!"},{"$error":"#VALUE!"},{"$error":"#VALUE!"},{"$error":"#VALUE!"},{"$error":"#VALUE!"}]
[7,{"$error":"#VALUE!"},{"$error":"#VALUE!"},{"$error":"#VALUE!"},{"$error":"#VALUE!"},{"$error":"#VALUE!"},{"$error":"#VALUE!"},{"$error":"#VALUE!"},{"$error":"#VALUE!"},{"$error":"#VALUE!"}]
[7.2,{"$error":"#VALUE!"},{"$error":"#VALUE!"},{"$error":"#VALUE!"},{"$error":"#VALUE!"},{"$error":"#VALUE!"},{"$error":"#VALUE!"},{"$error":"#VALUE!"},{"$error":"#VALUE!"},{"$error":"#VALUE!"}]
[7.4,{"$error":"#VALUE!"},{"$error":"#VALUE!"},{"$error":"#VALUE!"},{"$error":"#VALUE!"},{"$error":"#VALUE!"},{"$error":"#VALUE!"},{"$error":"#VALUE!"},{"$error":"#VALUE!"},{"$error":"#VALUE!"}]
[7.6,{"$error":"#VALUE!"},{"$error":"#VALUE!"},{"$error":"#VALUE!"},{"$error":"#VALUE!"},{"$error":"#VALUE!"},{"$error":"#VALUE!"},{"$error":"#VALUE!"},{"$error":"#VALUE!"},{"$error":"#VALUE!"}]
[7.8,{"$error":"#VALUE!"},{"$error":"#VALUE!"},{"$error":"#VALUE!"},{"$error":"#VALUE!"},{"$error":"#VALUE!"},{"$error":"#VALUE!"},{"$error":"#VALUE!"},{"$error":"#VALUE!"},{"$error":"#VALUE!"}]
[8,{"$error":"#VALUE!"},{"$error":"#VALUE!"},{"$error":"#VALUE!"},{"$error":"#VALUE!"},{"$error":"#VALUE!"},{"$error":"#VALUE!"},{"$error":"#VALUE!"},{"$error":"#VALUE!"},{"$error":"#VALUE!"}]
[8.1999999999999993,{"$error":"#VALUE!"},{"$error":"#VALUE!"},{"$error":"#VALUE!"},{"$error":"#VALUE!"},{"$error":"#VALUE!"},{"$error":"#VALUE!"},{"$error":"#VALUE!"},{"$error":"#VALUE!"},{"$error":"#VALUE!"}]
[8.4,{"$error":"#VALUE!"},{"$error":"#VALUE!"},{"$error":"#VALUE!"},{"$error":"#VALUE!"},{"$error":"#VALUE!"},{"$error":"#VALUE!"},{"$error":"#VALUE!"},{"$error":"#VALUE!"},{"$error":"#VALUE!"}]
[8.6,{"$error":"#VALUE!"},{"$error":"#VALUE!"},{"$error":"#VALUE!"},{"$error":"#VALUE!"},{"$error":"#VALUE!"},{"$error":"#VALUE!"},{"$error":"#VALUE!"},{"$error":"#VALUE!"},{"$error":"#VALUE!"}]
[8.8000000000000007,{"$error":"#VALUE!"},{"$error":"#VALUE!"},{"$error":"#VALUE!"},{"$error":"#VALUE!"},{"$error":"#VALUE!"},{"$error":"#VALUE!"},{"$error":"#VALUE!"},{"$error":"#VALUE!"},{"$error":"#VALUE!"}]
[9,{"$error":"#VALUE!"},{"$error":"#VALUE!"},{"$error":"#VALUE!"},{"$error":"#VALUE!"},{"$error":"#VALUE!"},{"$error":"#VALUE!"},{"$error":"#VALUE!"},{"$error":"#VALUE!"},{"$error":"#VALUE!"}]
[9.1999999999999993,{"$error":"#VALUE!"},{"$error":"#VALUE!"},{"$error":"#VALUE!"},{"$error":"#VALUE!"},{"$error":"#VALUE!"},{"$error":"#VALUE!"},{"$error":"#VALUE!"},{"$error":"#VALUE!"},{"$error":"#VALUE!"}]
[9.4,{"$error":"#VALUE!"},{"$error":"#VALUE!"},{"$error":"#VALUE!"},{"$error":"#VALUE!"},{"$error":"#VALUE!"},{"$error":"#VALUE!"},{"$error":"#VALUE!"},{"$error":"#VALUE!"},{"$error":"#VALUE!"}]
[9.6,{"$error":"#VALUE!"},{"$error":"#VALUE!"},{"$error":"#VALUE!"},{"$error":"#VALUE!"},{"$error":"#VALUE!"},{"$error":"#VALUE!"},{"$error":"#VALUE!"},{"$error":"#VALUE!"},{"$error":"#VALUE!"}]
[9.8000000000000007,{"$error":"#VALUE!"},{"$error":"#VALUE!"},{"$error":"#VALUE!"},{"$error":"#VALUE!"},{"$error":"#VALUE!"},{"$error":"#VALUE!"},{"$error":"#VALUE!"},{"$error":"#VALUE!"},{"$error":"#VALUE!"}]
[10,{"$error":"#VALUE!"},{"$error":"#VALUE!"},{"$error":"#VALUE!"},{"$error":"#VALUE!"},{"$error":"#VALUE!"},{"$error":"#VALUE!"},{"$error":"#VALUE!"},{"$error":"#VALUE!"},{"$error":"#VALUE!"}]
[10.199999999999999,{"$error":"#VALUE!"},{"$error":"#VALUE!"},{"$error":"#VALUE!"},{"$error":"#VALUE!"},{"$error":"#VALUE!"},{"$error":"#VALUE!"},{"$error":"#VALUE!"},{"$error":"#VALUE!"},{"$error":"#VALUE!"}]
[10.4,{"$error":"#VALUE!"},{"$error":"#VALUE!"},{"$error":"#VALUE!"},{"$error":"#VALUE!"},{"$error":"#VALUE!"},{"$error":"#VALUE!"},{"$error":"#VALUE!"},{"$error":"#VALUE!"},{"$error":"#VALUE!"}]
[10.6,{"$error":"#VALUE!"},{"$error":"#VALUE!"},{"$error":"#VALUE!"},{"$error":"#VALUE!"},{"$error":"#VALUE!"},{"$error":"#VALUE!"},{"$error":"#VALUE!"},{"$error":"#VALUE!"},{"$error":"#VALUE!"}]
[10.8,{"$error":"#VALUE!"},{"$error":"#VALUE!"},{"$error":"#VALUE!"},{"$error":"#VALUE!"},{"$error":"#VALUE!"},{"$error":"#VALUE!"},{"$error":"#VALUE!"},{"$error":"#VALUE!"},{"$error":"#VALUE!"}]
[11,{"$error":"#VALUE!"},{"$error":"#VALUE!"},{"$error":"#VALUE!"},{"$error":"#VALUE!"},{"$error":"#VALUE!"},{"$error":"#VALUE!"},{"$error":"#VALUE!"},{"$error":"#VALUE!"},{"$error":"#VALUE!"}]
[11.2,{"$error":"#VALUE!"},{"$error":"#VALUE!"},{"$error":"#VALUE!"},{"$error":"#VALUE!"},{"$error":"#VALUE!"},{"$error":"#VALUE!"},{"$error":"#VALUE!"},{"$error":"#VALUE!"},{"$error":"#VALUE!"}]
[11.4,{"$error":"#VALUE!"},{"$error":"#VALUE!"},{"$error":"#VALUE!"},{"$error":"#VALUE!"},{"$error":"#VALUE!"},{"$error":"#VALUE!"},{"$error":"#VALUE!"},{"$error":"#VALUE!"},{"$error":"#VALUE!"}]
[11.6,{"$error":"#VALUE!"},{"$error":"#VALUE!"},{"$error":"#VALUE!"},{"$error":"#VALUE!"},{"$error":"#VALUE!"},{"$error":"#VALUE!"},{"$error":"#VALUE!"},{"$error":"#VALUE!"},{"$error":"#VALUE!"}]
[11.8,{"$error":"#VALUE!"},{"$error":"#VALUE!"},{"$error":"#VALUE!"},{"$error":"#VALUE!"},{"$error":"#VALUE!"},{"$error":"#VALUE!"},{"$error":"#VALUE!"},{"$error":"#VALUE!"},{"$error":"#VALUE!"}]
[12,{"$error":"#VALUE!"},{"$error":"#VALUE!"},{"$error":"#VALUE!"},{"$error":"#VALUE!"},{"$error":"#VALUE!"},{"$error":"#VALUE!"},{"$error":"#VALUE!"},{"$error":"#VALUE!"},{"$error":"#VALUE!"}]
[12.2,{"$error":"#VALUE!"},{"$error":"#VALUE!"},{"$error":"#VALUE!"},{"$error":"#VALUE!"},{"$error":"#VALUE!"},{"$error":"#VALUE!"},{"$error":"#VALUE!"},{"$error":"#VALUE!"},{"$error":"#VALUE!"}]
[12.4,{"$error":"#VALUE!"},{"$error":"#VALUE!"},{"$error":"#VALUE!"},{"$error":"#VALUE!"},{"$error":"#VALUE!"},{"$error":"#VALUE!"},{"$error":"#VALUE!"},{"$error":"#VALUE!"},{"$error":"#VALUE!"}]
[12.6,{"$error":"#VALUE!"},{"$error":"#VALUE!"},{"$error":"#VALUE!"},{"$error":"#VALUE!"},{"$error":"#VALUE!"},{"$error":"#VALUE!"},{"$error":"#VALUE!"},{"$error":"#VALUE!"},{"$error":"#VALUE!"}]
[12.8,{"$error":"#VALUE!"},{"$f":"IF(AND($C$5>=A84,A84>=$B$5),($D$5^2-(A84-$E$5)^2)^0.5,0)","v":{"$error":"#VALUE!"}},{"$f":"IF(AND($C$6>=A84,A84>=$B$6),($D$6^2-(A84-$E$6)^2)^0.5,0)","v":{"$error":"#VALUE!"}},{"$f":"IF(AND($C$7>=A84,A84>$B$7),($D$7^2-(A84-$E$7)^2)^0.5,0)","v":{"$error":"#VALUE!"}},{"$f":"IF(AND($C$8>=A84,A84>=$B$8),($D$8^2-(A84-$E$8)^2)^0.5,0)","v":{"$error":"#VALUE!"}},{"$f":"IF(AND($C$9>=A84,A84>=$B$9),($D$9^2-(A84-$E$9)^2)^0.5,0)","v":{"$error":"#VALUE!"}},{"$f":"IF(AND($C$10>=A84,A84>=$B$10),($D$10^2-(A84-$E$10)^2)^0.5,0)","v":{"$error":"#VALUE!"}},{"$f":"IF(AND($C$11>=A84,A84>=$B$11),($D$11^2-(A84-$E$11)^2)^0.5,0)","v":{"$error":"#VALUE!"}},{"$error":"#VALUE!"}]
[13,{"$f":"$G$15*A85+$G$16","v":{"$error":"#VALUE!"}},{"$error":"#VALUE!"},{"$error":"#VALUE!"},{"$error":"#VALUE!"},{"$error":"#VALUE!"},{"$error":"#VALUE!"},{"$error":"#VALUE!"},{"$error":"#VALUE!"},{"$f":"IF(AND($C$12>=A85,A85>=$B$12),($D$12^2-(A85-$E$12)^2)^0.5,0)","v":{"$error":"#VALUE!"}}]
[{"$f":"A85+0.2","v":13.2},{"$error":"#VALUE!"},{"$error":"#VALUE!"},{"$error":"#VALUE!"},{"$error":"#VALUE!"},{"$error":"#VALUE!"},{"$error":"#VALUE!"},{"$error":"#VALUE!"},{"$error":"#VALUE!"},{"$error":"#VALUE!"}]
[13.4,{"$error":"#VALUE!"},{"$error":"#VALUE!"},{"$error":"#VALUE!"},{"$error":"#VALUE!"},{"$error":"#VALUE!"},{"$error":"#VALUE!"},{"$error":"#VALUE!"},{"$error":"#VALUE!"},{"$error":"#VALUE!"}]
[13.6,{"$error":"#VALUE!"},{"$error":"#VALUE!"},{"$error":"#VALUE!"},{"$error":"#VALUE!"},{"$error":"#VALUE!"},{"$error":"#VALUE!"},{"$error":"#VALUE!"},{"$error":"#VALUE!"},{"$error":"#VALUE!"}]
[13.8,{"$error":"#VALUE!"},{"$error":"#VALUE!"},{"$error":"#VALUE!"},{"$error":"#VALUE!"},{"$error":"#VALUE!"},{"$error":"#VALUE!"},{"$error":"#VALUE!"},{"$error":"#VALUE!"},{"$error":"#VALUE!"}]
[14,{"$error":"#VALUE!"},{"$error":"#VALUE!"},{"$error":"#VALUE!"},{"$error":"#VALUE!"},{"$error":"#VALUE!"},{"$error":"#VALUE!"},{"$error":"#VALUE!"},{"$error":"#VALUE!"},{"$error":"#VALUE!"}]
[14.2,{"$error":"#VALUE!"},{"$error":"#VALUE!"},{"$error":"#VALUE!"},{"$error":"#VALUE!"},{"$error":"#VALUE!"},{"$error":"#VALUE!"},{"$error":"#VALUE!"},{"$error":"#VALUE!"},{"$error":"#VALUE!"}]
[14.4,{"$error":"#VALUE!"},{"$error":"#VALUE!"},{"$error":"#VALUE!"},{"$error":"#VALUE!"},{"$error":"#VALUE!"},{"$error":"#VALUE!"},{"$error":"#VALUE!"},{"$error":"#VALUE!"},{"$error":"#VALUE!"}]
[14.6,{"$error":"#VALUE!"},{"$error":"#VALUE!"},{"$error":"#VALUE!"},{"$error":"#VALUE!"},{"$error":"#VALUE!"},{"$error":"#VALUE!"},{"$error":"#VALUE!"},{"$error":"#VALUE!"},{"$error":"#VALUE!"}]
[14.8,{"$error":"#VALUE!"},{"$error":"#VALUE!"},{"$error":"#VALUE!"},{"$error":"#VALUE!"},{"$error":"#VALUE!"},{"$error":"#VALUE!"},{"$error":"#VALUE!"},{"$error":"#VALUE!"},{"$error":"#VALUE!"}]
[15,{"$error":"#VALUE!"},{"$error":"#VALUE!"},{"$error":"#VALUE!"},{"$error":"#VALUE!"},{"$error":"#VALUE!"},{"$error":"#VALUE!"},{"$error":"#VALUE!"},{"$error":"#VALUE!"},{"$error":"#VALUE!"}]
[15.2,{"$error":"#VALUE!"},{"$error":"#VALUE!"},{"$error":"#VALUE!"},{"$error":"#VALUE!"},{"$error":"#VALUE!"},{"$error":"#VALUE!"},{"$error":"#VALUE!"},{"$error":"#VALUE!"},{"$error":"#VALUE!"}]
[15.4,{"$error":"#VALUE!"},{"$error":"#VALUE!"},{"$error":"#VALUE!"},{"$error":"#VALUE!"},{"$error":"#VALUE!"},{"$error":"#VALUE!"},{"$error":"#VALUE!"},{"$error":"#VALUE!"},{"$error":"#VALUE!"}]
[15.6,{"$error":"#VALUE!"},{"$error":"#VALUE!"},{"$error":"#VALUE!"},{"$error":"#VALUE!"},{"$error":"#VALUE!"},{"$error":"#VALUE!"},{"$error":"#VALUE!"},{"$error":"#VALUE!"},{"$error":"#VALUE!"}]
[15.8,{"$error":"#VALUE!"},{"$error":"#VALUE!"},{"$error":"#VALUE!"},{"$error":"#VALUE!"},{"$error":"#VALUE!"},{"$error":"#VALUE!"},{"$error":"#VALUE!"},{"$error":"#VALUE!"},{"$error":"#VALUE!"}]
[16,{"$error":"#VALUE!"},{"$error":"#VALUE!"},{"$error":"#VALUE!"},{"$error":"#VALUE!"},{"$error":"#VALUE!"},{"$error":"#VALUE!"},{"$error":"#VALUE!"},{"$error":"#VALUE!"},{"$error":"#VALUE!"}]
[16.2,{"$error":"#VALUE!"},{"$error":"#VALUE!"},{"$error":"#VALUE!"},{"$error":"#VALUE!"},{"$error":"#VALUE!"},{"$error":"#VALUE!"},{"$error":"#VALUE!"},{"$error":"#VALUE!"},{"$error":"#VALUE!"}]
[16.399999999999999,{"$error":"#VALUE!"},{"$error":"#VALUE!"},{"$error":"#VALUE!"},{"$error":"#VALUE!"},{"$error":"#VALUE!"},{"$error":"#VALUE!"},{"$error":"#VALUE!"},{"$error":"#VALUE!"},{"$error":"#VALUE!"}]
[16.600000000000001,{"$error":"#VALUE!"},{"$error":"#VALUE!"},{"$error":"#VALUE!"},{"$error":"#VALUE!"},{"$error":"#VALUE!"},{"$error":"#VALUE!"},{"$error":"#VALUE!"},{"$error":"#VALUE!"},{"$error":"#VALUE!"}]
[16.8,{"$error":"#VALUE!"},{"$error":"#VALUE!"},{"$error":"#VALUE!"},{"$error":"#VALUE!"},{"$error":"#VALUE!"},{"$error":"#VALUE!"},{"$error":"#VALUE!"},{"$error":"#VALUE!"},{"$error":"#VALUE!"}]
[17,{"$error":"#VALUE!"},{"$error":"#VALUE!"},{"$error":"#VALUE!"},{"$error":"#VALUE!"},{"$error":"#VALUE!"},{"$error":"#VALUE!"},{"$error":"#VALUE!"},{"$error":"#VALUE!"},{"$error":"#VALUE!"}]
[17.2,{"$error":"#VALUE!"},{"$error":"#VALUE!"},{"$error":"#VALUE!"},{"$error":"#VALUE!"},{"$error":"#VALUE!"},{"$error":"#VALUE!"},{"$error":"#VALUE!"},{"$error":"#VALUE!"},{"$error":"#VALUE!"}]
[17.399999999999999,{"$error":"#VALUE!"},{"$error":"#VALUE!"},{"$error":"#VALUE!"},{"$error":"#VALUE!"},{"$error":"#VALUE!"},{"$error":"#VALUE!"},{"$error":"#VALUE!"},{"$error":"#VALUE!"},{"$error":"#VALUE!"}]
[17.600000000000001,{"$error":"#VALUE!"},{"$error":"#VALUE!"},{"$error":"#VALUE!"},{"$error":"#VALUE!"},{"$error":"#VALUE!"},{"$error":"#VALUE!"},{"$error":"#VALUE!"},{"$error":"#VALUE!"},{"$error":"#VALUE!"}]
[17.8,{"$error":"#VALUE!"},{"$error":"#VALUE!"},{"$error":"#VALUE!"},{"$error":"#VALUE!"},{"$error":"#VALUE!"},{"$error":"#VALUE!"},{"$error":"#VALUE!"},{"$error":"#VALUE!"},{"$error":"#VALUE!"}]
[18,{"$error":"#VALUE!"},{"$error":"#VALUE!"},{"$error":"#VALUE!"},{"$error":"#VALUE!"},{"$error":"#VALUE!"},{"$error":"#VALUE!"},{"$error":"#VALUE!"},{"$error":"#VALUE!"},{"$error":"#VALUE!"}]
[18.2,{"$error":"#VALUE!"},{"$error":"#VALUE!"},{"$error":"#VALUE!"},{"$error":"#VALUE!"},{"$error":"#VALUE!"},{"$error":"#VALUE!"},{"$error":"#VALUE!"},{"$error":"#VALUE!"},{"$error":"#VALUE!"}]
[18.399999999999999,{"$error":"#VALUE!"},{"$error":"#VALUE!"},{"$error":"#VALUE!"},{"$error":"#VALUE!"},{"$error":"#VALUE!"},{"$error":"#VALUE!"},{"$error":"#VALUE!"},{"$error":"#VALUE!"},{"$error":"#VALUE!"}]
[18.600000000000001,{"$error":"#VALUE!"},{"$error":"#VALUE!"},{"$error":"#VALUE!"},{"$error":"#VALUE!"},{"$error":"#VALUE!"},{"$error":"#VALUE!"},{"$error":"#VALUE!"},{"$error":"#VALUE!"},{"$error":"#VALUE!"}]
[18.8,{"$error":"#VALUE!"},{"$error":"#VALUE!"},{"$error":"#VALUE!"},{"$error":"#VALUE!"},{"$error":"#VALUE!"},{"$error":"#VALUE!"},{"$error":"#VALUE!"},{"$error":"#VALUE!"},{"$error":"#VALUE!"}]
[19,{"$error":"#VALUE!"},{"$error":"#VALUE!"},{"$error":"#VALUE!"},{"$error":"#VALUE!"},{"$error":"#VALUE!"},{"$error":"#VALUE!"},{"$error":"#VALUE!"},{"$error":"#VALUE!"},{"$error":"#VALUE!"}]
[19.2,{"$error":"#VALUE!"},{"$error":"#VALUE!"},{"$error":"#VALUE!"},{"$error":"#VALUE!"},{"$error":"#VALUE!"},{"$error":"#VALUE!"},{"$error":"#VALUE!"},{"$error":"#VALUE!"},{"$error":"#VALUE!"}]
[19.399999999999999,{"$error":"#VALUE!"},{"$error":"#VALUE!"},{"$error":"#VALUE!"},{"$error":"#VALUE!"},{"$error":"#VALUE!"},{"$error":"#VALUE!"},{"$error":"#VALUE!"},{"$error":"#VALUE!"},{"$error":"#VALUE!"}]
[19.600000000000001,{"$error":"#VALUE!"},{"$error":"#VALUE!"},{"$error":"#VALUE!"},{"$error":"#VALUE!"},{"$error":"#VALUE!"},{"$error":"#VALUE!"},{"$error":"#VALUE!"},{"$error":"#VALUE!"},{"$error":"#VALUE!"}]
[19.8,{"$error":"#VALUE!"},{"$error":"#VALUE!"},{"$error":"#VALUE!"},{"$error":"#VALUE!"},{"$error":"#VALUE!"},{"$error":"#VALUE!"},{"$error":"#VALUE!"},{"$error":"#VALUE!"},{"$error":"#VALUE!"}]
[20,{"$error":"#VALUE!"},{"$error":"#VALUE!"},{"$error":"#VALUE!"},{"$error":"#VALUE!"},{"$error":"#VALUE!"},{"$error":"#VALUE!"},{"$error":"#VALUE!"},{"$error":"#VALUE!"},{"$error":"#VALUE!"}]
[20.2,{"$error":"#VALUE!"},{"$error":"#VALUE!"},{"$error":"#VALUE!"},{"$error":"#VALUE!"},{"$error":"#VALUE!"},{"$error":"#VALUE!"},{"$error":"#VALUE!"},{"$error":"#VALUE!"},{"$error":"#VALUE!"}]
[20.399999999999999,{"$error":"#VALUE!"},{"$error":"#VALUE!"},{"$error":"#VALUE!"},{"$error":"#VALUE!"},{"$error":"#VALUE!"},{"$error":"#VALUE!"},{"$error":"#VALUE!"},{"$error":"#VALUE!"},{"$error":"#VALUE!"}]
[20.6,{"$error":"#VALUE!"},{"$error":"#VALUE!"},{"$error":"#VALUE!"},{"$error":"#VALUE!"},{"$error":"#VALUE!"},{"$error":"#VALUE!"},{"$error":"#VALUE!"},{"$error":"#VALUE!"},{"$error":"#VALUE!"}]
[20.8,{"$error":"#VALUE!"},{"$error":"#VALUE!"},{"$error":"#VALUE!"},{"$error":"#VALUE!"},{"$error":"#VALUE!"},{"$error":"#VALUE!"},{"$error":"#VALUE!"},{"$error":"#VALUE!"},{"$error":"#VALUE!"}]
[21,{"$error":"#VALUE!"},{"$error":"#VALUE!"},{"$error":"#VALUE!"},{"$error":"#VALUE!"},{"$error":"#VALUE!"},{"$error":"#VALUE!"},{"$error":"#VALUE!"},{"$error":"#VALUE!"},{"$error":"#VALUE!"}]
[21.2,{"$error":"#VALUE!"},{"$error":"#VALUE!"},{"$error":"#VALUE!"},{"$error":"#VALUE!"},{"$error":"#VALUE!"},{"$error":"#VALUE!"},{"$error":"#VALUE!"},{"$error":"#VALUE!"},{"$error":"#VALUE!"}]
[21.4,{"$error":"#VALUE!"},{"$error":"#VALUE!"},{"$error":"#VALUE!"},{"$error":"#VALUE!"},{"$error":"#VALUE!"},{"$error":"#VALUE!"},{"$error":"#VALUE!"},{"$error":"#VALUE!"},{"$error":"#VALUE!"}]
[21.6,{"$error":"#VALUE!"},{"$error":"#VALUE!"},{"$error":"#VALUE!"},{"$error":"#VALUE!"},{"$error":"#VALUE!"},{"$error":"#VALUE!"},{"$error":"#VALUE!"},{"$error":"#VALUE!"},{"$error":"#VALUE!"}]
[21.8,{"$error":"#VALUE!"},{"$error":"#VALUE!"},{"$error":"#VALUE!"},{"$error":"#VALUE!"},{"$error":"#VALUE!"},{"$error":"#VALUE!"},{"$error":"#VALUE!"},{"$error":"#VALUE!"},{"$error":"#VALUE!"}]
[22,{"$error":"#VALUE!"},{"$error":"#VALUE!"},{"$error":"#VALUE!"},{"$error":"#VALUE!"},{"$error":"#VALUE!"},{"$error":"#VALUE!"},{"$error":"#VALUE!"},{"$error":"#VALUE!"},{"$error":"#VALUE!"}]
[22.2,{"$error":"#VALUE!"},{"$error":"#VALUE!"},{"$error":"#VALUE!"},{"$error":"#VALUE!"},{"$error":"#VALUE!"},{"$error":"#VALUE!"},{"$error":"#VALUE!"},{"$error":"#VALUE!"},{"$error":"#VALUE!"}]
[22.4,{"$error":"#VALUE!"},{"$error":"#VALUE!"},{"$error":"#VALUE!"},{"$error":"#VALUE!"},{"$error":"#VALUE!"},{"$error":"#VALUE!"},{"$error":"#VALUE!"},{"$error":"#VALUE!"},{"$error":"#VALUE!"}]
[22.6,{"$error":"#VALUE!"},{"$error":"#VALUE!"},{"$error":"#VALUE!"},{"$error":"#VALUE!"},{"$error":"#VALUE!"},{"$error":"#VALUE!"},{"$error":"#VALUE!"},{"$error":"#VALUE!"},{"$error":"#VALUE!"}]
[22.8,{"$error":"#VALUE!"},{"$error":"#VALUE!"},{"$error":"#VALUE!"},{"$error":"#VALUE!"},{"$error":"#VALUE!"},{"$error":"#VALUE!"},{"$error":"#VALUE!"},{"$error":"#VALUE!"},{"$error":"#VALUE!"}]
[23,{"$error":"#VALUE!"},{"$error":"#VALUE!"},{"$error":"#VALUE!"},{"$error":"#VALUE!"},{"$error":"#VALUE!"},{"$error":"#VALUE!"},{"$error":"#VALUE!"},{"$error":"#VALUE!"},{"$error":"#VALUE!"}]
[23.2,{"$error":"#VALUE!"},{"$error":"#VALUE!"},{"$error":"#VALUE!"},{"$error":"#VALUE!"},{"$error":"#VALUE!"},{"$error":"#VALUE!"},{"$error":"#VALUE!"},{"$error":"#VALUE!"},{"$error":"#VALUE!"}]
[23.4,{"$error":"#VALUE!"},{"$error":"#VALUE!"},{"$error":"#VALUE!"},{"$error":"#VALUE!"},{"$error":"#VALUE!"},{"$error":"#VALUE!"},{"$error":"#VALUE!"},{"$error":"#VALUE!"},{"$error":"#VALUE!"}]
[23.6,{"$error":"#VALUE!"},{"$error":"#VALUE!"},{"$error":"#VALUE!"},{"$error":"#VALUE!"},{"$error":"#VALUE!"},{"$error":"#VALUE!"},{"$error":"#VALUE!"},{"$error":"#VALUE!"},{"$error":"#VALUE!"}]
[23.8,{"$error":"#VALUE!"},{"$error":"#VALUE!"},{"$error":"#VALUE!"},{"$error":"#VALUE!"},{"$error":"#VALUE!"},{"$error":"#VALUE!"},{"$error":"#VALUE!"},{"$error":"#VALUE!"},{"$error":"#VALUE!"}]
[24,{"$error":"#VALUE!"},{"$error":"#VALUE!"},{"$error":"#VALUE!"},{"$error":"#VALUE!"},{"$error":"#VALUE!"},{"$error":"#VALUE!"},{"$error":"#VALUE!"},{"$error":"#VALUE!"},{"$error":"#VALUE!"}]
[24.2,{"$error":"#VALUE!"},{"$error":"#VALUE!"},{"$error":"#VALUE!"},{"$error":"#VALUE!"},{"$error":"#VALUE!"},{"$error":"#VALUE!"},{"$error":"#VALUE!"},{"$error":"#VALUE!"},{"$error":"#VALUE!"}]
[24.4,{"$error":"#VALUE!"},{"$error":"#VALUE!"},{"$error":"#VALUE!"},{"$error":"#VALUE!"},{"$error":"#VALUE!"},{"$error":"#VALUE!"},{"$error":"#VALUE!"},{"$error":"#VALUE!"},{"$error":"#VALUE!"}]
[24.6,{"$error":"#VALUE!"},{"$error":"#VALUE!"},{"$error":"#VALUE!"},{"$error":"#VALUE!"},{"$error":"#VALUE!"},{"$error":"#VALUE!"},{"$error":"#VALUE!"},{"$error":"#VALUE!"},{"$error":"#VALUE!"}]
[24.8,{"$error":"#VALUE!"},{"$error":"#VALUE!"},{"$error":"#VALUE!"},{"$error":"#VALUE!"},{"$error":"#VALUE!"},{"$error":"#VALUE!"},{"$error":"#VALUE!"},{"$error":"#VALUE!"},{"$error":"#VALUE!"}]
[25,{"$error":"#VALUE!"},{"$error":"#VALUE!"},{"$error":"#VALUE!"},{"$error":"#VALUE!"},{"$error":"#VALUE!"},{"$error":"#VALUE!"},{"$error":"#VALUE!"},{"$error":"#VALUE!"},{"$error":"#VALUE!"}]
[25.2,{"$error":"#VALUE!"},{"$error":"#VALUE!"},{"$error":"#VALUE!"},{"$error":"#VALUE!"},{"$error":"#VALUE!"},{"$error":"#VALUE!"},{"$error":"#VALUE!"},{"$error":"#VALUE!"},{"$error":"#VALUE!"}]
[25.4,{"$error":"#VALUE!"},{"$error":"#VALUE!"},{"$error":"#VALUE!"},{"$error":"#VALUE!"},{"$error":"#VALUE!"},{"$error":"#VALUE!"},{"$error":"#VALUE!"},{"$error":"#VALUE!"},{"$error":"#VALUE!"}]
[25.6,{"$error":"#VALUE!"},{"$f":"IF(AND($C$5>=A148,A148>=$B$5),($D$5^2-(A148-$E$5)^2)^0.5,0)","v":{"$error":"#VALUE!"}},{"$f":"IF(AND($C$6>=A148,A148>=$B$6),($D$6^2-(A148-$E$6)^2)^0.5,0)","v":{"$error":"#VALUE!"}},{"$f":"IF(AND($C$7>=A148,A148>$B$7),($D$7^2-(A148-$E$7)^2)^0.5,0)","v":{"$error":"#VALUE!"}},{"$f":"IF(AND($C$8>=A148,A148>=$B$8),($D$8^2-(A148-$E$8)^2)^0.5,0)","v":{"$error":"#VALUE!"}},{"$f":"IF(AND($C$9>=A148,A148>=$B$9),($D$9^2-(A148-$E$9)^2)^0.5,0)","v":{"$error":"#VALUE!"}},{"$f":"IF(AND($C$10>=A148,A148>=$B$10),($D$10^2-(A148-$E$10)^2)^0.5,0)","v":{"$error":"#VALUE!"}},{"$f":"IF(AND($C$11>=A148,A148>=$B$11),($D$11^2-(A148-$E$11)^2)^0.5,0)","v":{"$error":"#VALUE!"}},{"$error":"#VALUE!"}]
[25.8,{"$f":"$G$15*A149+$G$16","v":{"$error":"#VALUE!"}},{"$error":"#VALUE!"},{"$error":"#VALUE!"},{"$error":"#VALUE!"},{"$error":"#VALUE!"},{"$error":"#VALUE!"},{"$error":"#VALUE!"},{"$error":"#VALUE!"},{"$f":"IF(AND($C$12>=A149,A149>=$B$12),($D$12^2-(A149-$E$12)^2)^0.5,0)","v":{"$error":"#VALUE!"}}]
[{"$f":"A149+0.2","v":26},{"$error":"#VALUE!"},{"$error":"#VALUE!"},{"$error":"#VALUE!"},{"$error":"#VALUE!"},{"$error":"#VALUE!"},{"$error":"#VALUE!"},{"$error":"#VALUE!"},{"$error":"#VALUE!"},{"$error":"#VALUE!"}]
[26.2,{"$error":"#VALUE!"},{"$error":"#VALUE!"},{"$error":"#VALUE!"},{"$error":"#VALUE!"},{"$error":"#VALUE!"},{"$error":"#VALUE!"},{"$error":"#VALUE!"},{"$error":"#VALUE!"},{"$error":"#VALUE!"}]
[26.4,{"$error":"#VALUE!"},{"$error":"#VALUE!"},{"$error":"#VALUE!"},{"$error":"#VALUE!"},{"$error":"#VALUE!"},{"$error":"#VALUE!"},{"$error":"#VALUE!"},{"$error":"#VALUE!"},{"$error":"#VALUE!"}]
[26.6,{"$error":"#VALUE!"},{"$error":"#VALUE!"},{"$error":"#VALUE!"},{"$error":"#VALUE!"},{"$error":"#VALUE!"},{"$error":"#VALUE!"},{"$error":"#VALUE!"},{"$error":"#VALUE!"},{"$error":"#VALUE!"}]
[26.8,{"$error":"#VALUE!"},{"$error":"#VALUE!"},{"$error":"#VALUE!"},{"$error":"#VALUE!"},{"$error":"#VALUE!"},{"$error":"#VALUE!"},{"$error":"#VALUE!"},{"$error":"#VALUE!"},{"$error":"#VALUE!"}]
[27,{"$error":"#VALUE!"},{"$error":"#VALUE!"},{"$error":"#VALUE!"},{"$error":"#VALUE!"},{"$error":"#VALUE!"},{"$error":"#VALUE!"},{"$error":"#VALUE!"},{"$error":"#VALUE!"},{"$error":"#VALUE!"}]
[27.2,{"$error":"#VALUE!"},{"$error":"#VALUE!"},{"$error":"#VALUE!"},{"$error":"#VALUE!"},{"$error":"#VALUE!"},{"$error":"#VALUE!"},{"$error":"#VALUE!"},{"$error":"#VALUE!"},{"$error":"#VALUE!"}]
[27.4,{"$error":"#VALUE!"},{"$error":"#VALUE!"},{"$error":"#VALUE!"},{"$error":"#VALUE!"},{"$error":"#VALUE!"},{"$error":"#VALUE!"},{"$error":"#VALUE!"},{"$error":"#VALUE!"},{"$error":"#VALUE!"}]
[27.6,{"$error":"#VALUE!"},{"$error":"#VALUE!"},{"$error":"#VALUE!"},{"$error":"#VALUE!"},{"$error":"#VALUE!"},{"$error":"#VALUE!"},{"$error":"#VALUE!"},{"$error":"#VALUE!"},{"$error":"#VALUE!"}]
[27.8,{"$error":"#VALUE!"},{"$error":"#VALUE!"},{"$error":"#VALUE!"},{"$error":"#VALUE!"},{"$error":"#VALUE!"},{"$error":"#VALUE!"},{"$error":"#VALUE!"},{"$error":"#VALUE!"},{"$error":"#VALUE!"}]
[28,{"$error":"#VALUE!"},{"$error":"#VALUE!"},{"$error":"#VALUE!"},{"$error":"#VALUE!"},{"$error":"#VALUE!"},{"$error":"#VALUE!"},{"$error":"#VALUE!"},{"$error":"#VALUE!"},{"$error":"#VALUE!"}]
[28.2,{"$error":"#VALUE!"},{"$error":"#VALUE!"},{"$error":"#VALUE!"},{"$error":"#VALUE!"},{"$error":"#VALUE!"},{"$error":"#VALUE!"},{"$error":"#VALUE!"},{"$error":"#VALUE!"},{"$error":"#VALUE!"}]
[28.4,{"$error":"#VALUE!"},{"$error":"#VALUE!"},{"$error":"#VALUE!"},{"$error":"#VALUE!"},{"$error":"#VALUE!"},{"$error":"#VALUE!"},{"$error":"#VALUE!"},{"$error":"#VALUE!"},{"$error":"#VALUE!"}]
[28.6,{"$error":"#VALUE!"},{"$error":"#VALUE!"},{"$error":"#VALUE!"},{"$error":"#VALUE!"},{"$error":"#VALUE!"},{"$error":"#VALUE!"},{"$error":"#VALUE!"},{"$error":"#VALUE!"},{"$error":"#VALUE!"}]
[28.8,{"$error":"#VALUE!"},{"$error":"#VALUE!"},{"$error":"#VALUE!"},{"$error":"#VALUE!"},{"$error":"#VALUE!"},{"$error":"#VALUE!"},{"$error":"#VALUE!"},{"$error":"#VALUE!"},{"$error":"#VALUE!"}]
[29,{"$error":"#VALUE!"},{"$error":"#VALUE!"},{"$error":"#VALUE!"},{"$error":"#VALUE!"},{"$error":"#VALUE!"},{"$error":"#VALUE!"},{"$error":"#VALUE!"},{"$error":"#VALUE!"},{"$error":"#VALUE!"}]
[29.2,{"$error":"#VALUE!"},{"$error":"#VALUE!"},{"$error":"#VALUE!"},{"$error":"#VALUE!"},{"$error":"#VALUE!"},{"$error":"#VALUE!"},{"$error":"#VALUE!"},{"$error":"#VALUE!"},{"$error":"#VALUE!"}]
[29.4,{"$error":"#VALUE!"},{"$error":"#VALUE!"},{"$error":"#VALUE!"},{"$error":"#VALUE!"},{"$error":"#VALUE!"},{"$error":"#VALUE!"},{"$error":"#VALUE!"},{"$error":"#VALUE!"},{"$error":"#VALUE!"}]
[29.6,{"$error":"#VALUE!"},{"$error":"#VALUE!"},{"$error":"#VALUE!"},{"$error":"#VALUE!"},{"$error":"#VALUE!"},{"$error":"#VALUE!"},{"$error":"#VALUE!"},{"$error":"#VALUE!"},{"$error":"#VALUE!"}]
[29.8,{"$error":"#VALUE!"},{"$error":"#VALUE!"},{"$error":"#VALUE!"},{"$error":"#VALUE!"},{"$error":"#VALUE!"},{"$error":"#VALUE!"},{"$error":"#VALUE!"},{"$error":"#VALUE!"},{"$error":"#VALUE!"}]
[30,{"$error":"#VALUE!"},{"$error":"#VALUE!"},{"$error":"#VALUE!"},{"$error":"#VALUE!"},{"$error":"#VALUE!"},{"$error":"#VALUE!"},{"$error":"#VALUE!"},{"$error":"#VALUE!"},{"$error":"#VALUE!"}]
[30.2,{"$error":"#VALUE!"},{"$error":"#VALUE!"},{"$error":"#VALUE!"},{"$error":"#VALUE!"},{"$error":"#VALUE!"},{"$error":"#VALUE!"},{"$error":"#VALUE!"},{"$error":"#VALUE!"},{"$error":"#VALUE!"}]
[30.4,{"$error":"#VALUE!"},{"$error":"#VALUE!"},{"$error":"#VALUE!"},{"$error":"#VALUE!"},{"$error":"#VALUE!"},{"$error":"#VALUE!"},{"$error":"#VALUE!"},{"$error":"#VALUE!"},{"$error":"#VALUE!"}]
[30.6,{"$error":"#VALUE!"},{"$error":"#VALUE!"},{"$error":"#VALUE!"},{"$error":"#VALUE!"},{"$error":"#VALUE!"},{"$error":"#VALUE!"},{"$error":"#VALUE!"},{"$error":"#VALUE!"},{"$error":"#VALUE!"}]
[30.8,{"$error":"#VALUE!"},{"$error":"#VALUE!"},{"$error":"#VALUE!"},{"$error":"#VALUE!"},{"$error":"#VALUE!"},{"$error":"#VALUE!"},{"$error":"#VALUE!"},{"$error":"#VALUE!"},{"$error":"#VALUE!"}]
[31,{"$error":"#VALUE!"},{"$error":"#VALUE!"},{"$error":"#VALUE!"},{"$error":"#VALUE!"},{"$error":"#VALUE!"},{"$error":"#VALUE!"},{"$error":"#VALUE!"},{"$error":"#VALUE!"},{"$error":"#VALUE!"}]
[31.2,{"$error":"#VALUE!"},{"$error":"#VALUE!"},{"$error":"#VALUE!"},{"$error":"#VALUE!"},{"$error":"#VALUE!"},{"$error":"#VALUE!"},{"$error":"#VALUE!"},{"$error":"#VALUE!"},{"$error":"#VALUE!"}]
[31.4,{"$error":"#VALUE!"},{"$error":"#VALUE!"},{"$error":"#VALUE!"},{"$error":"#VALUE!"},{"$error":"#VALUE!"},{"$error":"#VALUE!"},{"$error":"#VALUE!"},{"$error":"#VALUE!"},{"$error":"#VALUE!"}]
[31.6,{"$error":"#VALUE!"},{"$error":"#VALUE!"},{"$error":"#VALUE!"},{"$error":"#VALUE!"},{"$error":"#VALUE!"},{"$error":"#VALUE!"},{"$error":"#VALUE!"},{"$error":"#VALUE!"},{"$error":"#VALUE!"}]
[31.8,{"$error":"#VALUE!"},{"$error":"#VALUE!"},{"$error":"#VALUE!"},{"$error":"#VALUE!"},{"$error":"#VALUE!"},{"$error":"#VALUE!"},{"$error":"#VALUE!"},{"$error":"#VALUE!"},{"$error":"#VALUE!"}]
[32,{"$error":"#VALUE!"},{"$error":"#VALUE!"},{"$error":"#VALUE!"},{"$error":"#VALUE!"},{"$error":"#VALUE!"},{"$error":"#VALUE!"},{"$error":"#VALUE!"},{"$error":"#VALUE!"},{"$error":"#VALUE!"}]
[32.200000000000003,{"$error":"#VALUE!"},{"$error":"#VALUE!"},{"$error":"#VALUE!"},{"$error":"#VALUE!"},{"$error":"#VALUE!"},{"$error":"#VALUE!"},{"$error":"#VALUE!"},{"$error":"#VALUE!"},{"$error":"#VALUE!"}]
[32.4,{"$error":"#VALUE!"},{"$error":"#VALUE!"},{"$error":"#VALUE!"},{"$error":"#VALUE!"},{"$error":"#VALUE!"},{"$error":"#VALUE!"},{"$error":"#VALUE!"},{"$error":"#VALUE!"},{"$error":"#VALUE!"}]
[32.6,{"$error":"#VALUE!"},{"$error":"#VALUE!"},{"$error":"#VALUE!"},{"$error":"#VALUE!"},{"$error":"#VALUE!"},{"$error":"#VALUE!"},{"$error":"#VALUE!"},{"$error":"#VALUE!"},{"$error":"#VALUE!"}]
[32.799999999999997,{"$error":"#VALUE!"},{"$error":"#VALUE!"},{"$error":"#VALUE!"},{"$error":"#VALUE!"},{"$error":"#VALUE!"},{"$error":"#VALUE!"},{"$error":"#VALUE!"},{"$error":"#VALUE!"},{"$error":"#VALUE!"}]
[33,{"$error":"#VALUE!"},{"$error":"#VALUE!"},{"$error":"#VALUE!"},{"$error":"#VALUE!"},{"$error":"#VALUE!"},{"$error":"#VALUE!"},{"$error":"#VALUE!"},{"$error":"#VALUE!"},{"$error":"#VALUE!"}]
[33.200000000000003,{"$error":"#VALUE!"},{"$error":"#VALUE!"},{"$error":"#VALUE!"},{"$error":"#VALUE!"},{"$error":"#VALUE!"},{"$error":"#VALUE!"},{"$error":"#VALUE!"},{"$error":"#VALUE!"},{"$error":"#VALUE!"}]
[33.4,{"$error":"#VALUE!"},{"$error":"#VALUE!"},{"$error":"#VALUE!"},{"$error":"#VALUE!"},{"$error":"#VALUE!"},{"$error":"#VALUE!"},{"$error":"#VALUE!"},{"$error":"#VALUE!"},{"$error":"#VALUE!"}]
[33.6,{"$error":"#VALUE!"},{"$error":"#VALUE!"},{"$error":"#VALUE!"},{"$error":"#VALUE!"},{"$error":"#VALUE!"},{"$error":"#VALUE!"},{"$error":"#VALUE!"},{"$error":"#VALUE!"},{"$error":"#VALUE!"}]
[33.799999999999997,{"$error":"#VALUE!"},{"$error":"#VALUE!"},{"$error":"#VALUE!"},{"$error":"#VALUE!"},{"$error":"#VALUE!"},{"$error":"#VALUE!"},{"$error":"#VALUE!"},{"$error":"#VALUE!"},{"$error":"#VALUE!"}]
[34,{"$error":"#VALUE!"},{"$error":"#VALUE!"},{"$error":"#VALUE!"},{"$error":"#VALUE!"},{"$error":"#VALUE!"},{"$error":"#VALUE!"},{"$error":"#VALUE!"},{"$error":"#VALUE!"},{"$error":"#VALUE!"}]
[34.200000000000003,{"$error":"#VALUE!"},{"$error":"#VALUE!"},{"$error":"#VALUE!"},{"$error":"#VALUE!"},{"$error":"#VALUE!"},{"$error":"#VALUE!"},{"$error":"#VALUE!"},{"$error":"#VALUE!"},{"$error":"#VALUE!"}]
[34.4,{"$error":"#VALUE!"},{"$error":"#VALUE!"},{"$error":"#VALUE!"},{"$error":"#VALUE!"},{"$error":"#VALUE!"},{"$error":"#VALUE!"},{"$error":"#VALUE!"},{"$error":"#VALUE!"},{"$error":"#VALUE!"}]
[34.6,{"$error":"#VALUE!"},{"$error":"#VALUE!"},{"$error":"#VALUE!"},{"$error":"#VALUE!"},{"$error":"#VALUE!"},{"$error":"#VALUE!"},{"$error":"#VALUE!"},{"$error":"#VALUE!"},{"$error":"#VALUE!"}]
[34.799999999999997,{"$error":"#VALUE!"},{"$error":"#VALUE!"},{"$error":"#VALUE!"},{"$error":"#VALUE!"},{"$error":"#VALUE!"},{"$error":"#VALUE!"},{"$error":"#VALUE!"},{"$error":"#VALUE!"},{"$error":"#VALUE!"}]
[35,{"$error":"#VALUE!"},{"$error":"#VALUE!"},{"$error":"#VALUE!"},{"$error":"#VALUE!"},{"$error":"#VALUE!"},{"$error":"#VALUE!"},{"$error":"#VALUE!"},{"$error":"#VALUE!"},{"$error":"#VALUE!"}]
[35.200000000000003,{"$error":"#VALUE!"},{"$error":"#VALUE!"},{"$error":"#VALUE!"},{"$error":"#VALUE!"},{"$error":"#VALUE!"},{"$error":"#VALUE!"},{"$error":"#VALUE!"},{"$error":"#VALUE!"},{"$error":"#VALUE!"}]
[35.4,{"$error":"#VALUE!"},{"$error":"#VALUE!"},{"$error":"#VALUE!"},{"$error":"#VALUE!"},{"$error":"#VALUE!"},{"$error":"#VALUE!"},{"$error":"#VALUE!"},{"$error":"#VALUE!"},{"$error":"#VALUE!"}]
[35.6,{"$error":"#VALUE!"},{"$error":"#VALUE!"},{"$error":"#VALUE!"},{"$error":"#VALUE!"},{"$error":"#VALUE!"},{"$error":"#VALUE!"},{"$error":"#VALUE!"},{"$error":"#VALUE!"},{"$error":"#VALUE!"}]
[35.799999999999997,{"$error":"#VALUE!"},{"$error":"#VALUE!"},{"$error":"#VALUE!"},{"$error":"#VALUE!"},{"$error":"#VALUE!"},{"$error":"#VALUE!"},{"$error":"#VALUE!"},{"$error":"#VALUE!"},{"$error":"#VALUE!"}]
[36,{"$error":"#VALUE!"},{"$error":"#VALUE!"},{"$error":"#VALUE!"},{"$error":"#VALUE!"},{"$error":"#VALUE!"},{"$error":"#VALUE!"},{"$error":"#VALUE!"},{"$error":"#VALUE!"},{"$error":"#VALUE!"}]
[36.200000000000003,{"$error":"#VALUE!"},{"$error":"#VALUE!"},{"$error":"#VALUE!"},{"$error":"#VALUE!"},{"$error":"#VALUE!"},{"$error":"#VALUE!"},{"$error":"#VALUE!"},{"$error":"#VALUE!"},{"$error":"#VALUE!"}]
[36.4,{"$error":"#VALUE!"},{"$error":"#VALUE!"},{"$error":"#VALUE!"},{"$error":"#VALUE!"},{"$error":"#VALUE!"},{"$error":"#VALUE!"},{"$error":"#VALUE!"},{"$error":"#VALUE!"},{"$error":"#VALUE!"}]
[36.6,{"$error":"#VALUE!"},{"$error":"#VALUE!"},{"$error":"#VALUE!"},{"$error":"#VALUE!"},{"$error":"#VALUE!"},{"$error":"#VALUE!"},{"$error":"#VALUE!"},{"$error":"#VALUE!"},{"$error":"#VALUE!"}]
[36.799999999999997,{"$error":"#VALUE!"},{"$error":"#VALUE!"},{"$error":"#VALUE!"},{"$error":"#VALUE!"},{"$error":"#VALUE!"},{"$error":"#VALUE!"},{"$error":"#VALUE!"},{"$error":"#VALUE!"},{"$error":"#VALUE!"}]
[37,{"$error":"#VALUE!"},{"$error":"#VALUE!"},{"$error":"#VALUE!"},{"$error":"#VALUE!"},{"$error":"#VALUE!"},{"$error":"#VALUE!"},{"$error":"#VALUE!"},{"$error":"#VALUE!"},{"$error":"#VALUE!"}]
[37.200000000000003,{"$error":"#VALUE!"},{"$error":"#VALUE!"},{"$error":"#VALUE!"},{"$error":"#VALUE!"},{"$error":"#VALUE!"},{"$error":"#VALUE!"},{"$error":"#VALUE!"},{"$error":"#VALUE!"},{"$error":"#VALUE!"}]
[37.4,{"$error":"#VALUE!"},{"$error":"#VALUE!"},{"$error":"#VALUE!"},{"$error":"#VALUE!"},{"$error":"#VALUE!"},{"$error":"#VALUE!"},{"$error":"#VALUE!"},{"$error":"#VALUE!"},{"$error":"#VALUE!"}]
[37.6,{"$error":"#VALUE!"},{"$error":"#VALUE!"},{"$error":"#VALUE!"},{"$error":"#VALUE!"},{"$error":"#VALUE!"},{"$error":"#VALUE!"},{"$error":"#VALUE!"},{"$error":"#VALUE!"},{"$error":"#VALUE!"}]
[37.799999999999997,{"$error":"#VALUE!"},{"$error":"#VALUE!"},{"$error":"#VALUE!"},{"$error":"#VALUE!"},{"$error":"#VALUE!"},{"$error":"#VALUE!"},{"$error":"#VALUE!"},{"$error":"#VALUE!"},{"$error":"#VALUE!"}]
[38,{"$error":"#VALUE!"},{"$error":"#VALUE!"},{"$error":"#VALUE!"},{"$error":"#VALUE!"},{"$error":"#VALUE!"},{"$error":"#VALUE!"},{"$error":"#VALUE!"},{"$error":"#VALUE!"},{"$error":"#VALUE!"}]
[38.200000000000003,{"$error":"#VALUE!"},{"$error":"#VALUE!"},{"$error":"#VALUE!"},{"$error":"#VALUE!"},{"$error":"#VALUE!"},{"$error":"#VALUE!"},{"$error":"#VALUE!"},{"$error":"#VALUE!"},{"$error":"#VALUE!"}]
[38.4,{"$error":"#VALUE!"},{"$f":"IF(AND($C$5>=A212,A212>=$B$5),($D$5^2-(A212-$E$5)^2)^0.5,0)","v":{"$error":"#VALUE!"}},{"$f":"IF(AND($C$6>=A212,A212>=$B$6),($D$6^2-(A212-$E$6)^2)^0.5,0)","v":{"$error":"#VALUE!"}},{"$f":"IF(AND($C$7>=A212,A212>$B$7),($D$7^2-(A212-$E$7)^2)^0.5,0)","v":{"$error":"#VALUE!"}},{"$f":"IF(AND($C$8>=A212,A212>=$B$8),($D$8^2-(A212-$E$8)^2)^0.5,0)","v":{"$error":"#VALUE!"}},{"$f":"IF(AND($C$9>=A212,A212>=$B$9),($D$9^2-(A212-$E$9)^2)^0.5,0)","v":{"$error":"#VALUE!"}},{"$f":"IF(AND($C$10>=A212,A212>=$B$10),($D$10^2-(A212-$E$10)^2)^0.5,0)","v":{"$error":"#VALUE!"}},{"$f":"IF(AND($C$11>=A212,A212>=$B$11),($D$11^2-(A212-$E$11)^2)^0.5,0)","v":{"$error":"#VALUE!"}},{"$error":"#VALUE!"}]
[38.6,{"$f":"$G$15*A213+$G$16","v":{"$error":"#VALUE!"}},{"$error":"#VALUE!"},{"$error":"#VALUE!"},{"$error":"#VALUE!"},{"$error":"#VALUE!"},{"$error":"#VALUE!"},{"$error":"#VALUE!"},{"$error":"#VALUE!"},{"$f":"IF(AND($C$12>=A213,A213>=$B$12),($D$12^2-(A213-$E$12)^2)^0.5,0)","v":{"$error":"#VALUE!"}}]
[{"$f":"A213+0.2","v":38.799999999999997},{"$error":"#VALUE!"},{"$error":"#VALUE!"},{"$error":"#VALUE!"},{"$error":"#VALUE!"},{"$error":"#VALUE!"},{"$error":"#VALUE!"},{"$error":"#VALUE!"},{"$error":"#VALUE!"},{"$error":"#VALUE!"}]
[39,{"$error":"#VALUE!"},{"$error":"#VALUE!"},{"$error":"#VALUE!"},{"$error":"#VALUE!"},{"$error":"#VALUE!"},{"$error":"#VALUE!"},{"$error":"#VALUE!"},{"$error":"#VALUE!"},{"$error":"#VALUE!"}]
[39.200000000000003,{"$error":"#VALUE!"},{"$error":"#VALUE!"},{"$error":"#VALUE!"},{"$error":"#VALUE!"},{"$error":"#VALUE!"},{"$error":"#VALUE!"},{"$error":"#VALUE!"},{"$error":"#VALUE!"},{"$error":"#VALUE!"}]
[39.4,{"$error":"#VALUE!"},{"$error":"#VALUE!"},{"$error":"#VALUE!"},{"$error":"#VALUE!"},{"$error":"#VALUE!"},{"$error":"#VALUE!"},{"$error":"#VALUE!"},{"$error":"#VALUE!"},{"$error":"#VALUE!"}]
[39.6,{"$error":"#VALUE!"},{"$error":"#VALUE!"},{"$error":"#VALUE!"},{"$error":"#VALUE!"},{"$error":"#VALUE!"},{"$error":"#VALUE!"},{"$error":"#VALUE!"},{"$error":"#VALUE!"},{"$error":"#VALUE!"}]
[39.799999999999997,{"$error":"#VALUE!"},{"$error":"#VALUE!"},{"$error":"#VALUE!"},{"$error":"#VALUE!"},{"$error":"#VALUE!"},{"$error":"#VALUE!"},{"$error":"#VALUE!"},{"$error":"#VALUE!"},{"$error":"#VALUE!"}]
[40,{"$error":"#VALUE!"},{"$error":"#VALUE!"},{"$error":"#VALUE!"},{"$error":"#VALUE!"},{"$error":"#VALUE!"},{"$error":"#VALUE!"},{"$error":"#VALUE!"},{"$error":"#VALUE!"},{"$error":"#VALUE!"}]
[40.200000000000003,{"$error":"#VALUE!"},{"$error":"#VALUE!"},{"$error":"#VALUE!"},{"$error":"#VALUE!"},{"$error":"#VALUE!"},{"$error":"#VALUE!"},{"$error":"#VALUE!"},{"$error":"#VALUE!"},{"$error":"#VALUE!"}]
[40.4,{"$error":"#VALUE!"},{"$error":"#VALUE!"},{"$error":"#VALUE!"},{"$error":"#VALUE!"},{"$error":"#VALUE!"},{"$error":"#VALUE!"},{"$error":"#VALUE!"},{"$error":"#VALUE!"},{"$error":"#VALUE!"}]
[40.6,{"$error":"#VALUE!"},{"$error":"#VALUE!"},{"$error":"#VALUE!"},{"$error":"#VALUE!"},{"$error":"#VALUE!"},{"$error":"#VALUE!"},{"$error":"#VALUE!"},{"$error":"#VALUE!"},{"$error":"#VALUE!"}]
[40.799999999999997,{"$error":"#VALUE!"},{"$error":"#VALUE!"},{"$error":"#VALUE!"},{"$error":"#VALUE!"},{"$error":"#VALUE!"},{"$error":"#VALUE!"},{"$error":"#VALUE!"},{"$error":"#VALUE!"},{"$error":"#VALUE!"}]
[41,{"$error":"#VALUE!"},{"$error":"#VALUE!"},{"$error":"#VALUE!"},{"$error":"#VALUE!"},{"$error":"#VALUE!"},{"$error":"#VALUE!"},{"$error":"#VALUE!"},{"$error":"#VALUE!"},{"$error":"#VALUE!"}]
[41.2,{"$error":"#VALUE!"},{"$error":"#VALUE!"},{"$error":"#VALUE!"},{"$error":"#VALUE!"},{"$error":"#VALUE!"},{"$error":"#VALUE!"},{"$error":"#VALUE!"},{"$error":"#VALUE!"},{"$error":"#VALUE!"}]
[41.4,{"$error":"#VALUE!"},{"$error":"#VALUE!"},{"$error":"#VALUE!"},{"$error":"#VALUE!"},{"$error":"#VALUE!"},{"$error":"#VALUE!"},{"$error":"#VALUE!"},{"$error":"#VALUE!"},{"$error":"#VALUE!"}]
[41.6,{"$error":"#VALUE!"},{"$error":"#VALUE!"},{"$error":"#VALUE!"},{"$error":"#VALUE!"},{"$error":"#VALUE!"},{"$error":"#VALUE!"},{"$error":"#VALUE!"},{"$error":"#VALUE!"},{"$error":"#VALUE!"}]
[41.8,{"$error":"#VALUE!"},{"$error":"#VALUE!"},{"$error":"#VALUE!"},{"$error":"#VALUE!"},{"$error":"#VALUE!"},{"$error":"#VALUE!"},{"$error":"#VALUE!"},{"$error":"#VALUE!"},{"$error":"#VALUE!"}]
[42,{"$error":"#VALUE!"},{"$error":"#VALUE!"},{"$error":"#VALUE!"},{"$error":"#VALUE!"},{"$error":"#VALUE!"},{"$error":"#VALUE!"},{"$error":"#VALUE!"},{"$error":"#VALUE!"},{"$error":"#VALUE!"}]
[42.2,{"$error":"#VALUE!"},{"$error":"#VALUE!"},{"$error":"#VALUE!"},{"$error":"#VALUE!"},{"$error":"#VALUE!"},{"$error":"#VALUE!"},{"$error":"#VALUE!"},{"$error":"#VALUE!"},{"$error":"#VALUE!"}]
[42.4,{"$error":"#VALUE!"},{"$error":"#VALUE!"},{"$error":"#VALUE!"},{"$error":"#VALUE!"},{"$error":"#VALUE!"},{"$error":"#VALUE!"},{"$error":"#VALUE!"},{"$error":"#VALUE!"},{"$error":"#VALUE!"}]
[42.6,{"$error":"#VALUE!"},{"$error":"#VALUE!"},{"$error":"#VALUE!"},{"$error":"#VALUE!"},{"$error":"#VALUE!"},{"$error":"#VALUE!"},{"$error":"#VALUE!"},{"$error":"#VALUE!"},{"$error":"#VALUE!"}]
[42.8,{"$error":"#VALUE!"},{"$error":"#VALUE!"},{"$error":"#VALUE!"},{"$error":"#VALUE!"},{"$error":"#VALUE!"},{"$error":"#VALUE!"},{"$error":"#VALUE!"},{"$error":"#VALUE!"},{"$error":"#VALUE!"}]
[43,{"$error":"#VALUE!"},{"$error":"#VALUE!"},{"$error":"#VALUE!"},{"$error":"#VALUE!"},{"$error":"#VALUE!"},{"$error":"#VALUE!"},{"$error":"#VALUE!"},{"$error":"#VALUE!"},{"$error":"#VALUE!"}]
[43.2,{"$error":"#VALUE!"},{"$error":"#VALUE!"},{"$error":"#VALUE!"},{"$error":"#VALUE!"},{"$error":"#VALUE!"},{"$error":"#VALUE!"},{"$error":"#VALUE!"},{"$error":"#VALUE!"},{"$error":"#VALUE!"}]
[43.4,{"$error":"#VALUE!"},{"$error":"#VALUE!"},{"$error":"#VALUE!"},{"$error":"#VALUE!"},{"$error":"#VALUE!"},{"$error":"#VALUE!"},{"$error":"#VALUE!"},{"$error":"#VALUE!"},{"$error":"#VALUE!"}]
[43.6,{"$error":"#VALUE!"},{"$error":"#VALUE!"},{"$error":"#VALUE!"},{"$error":"#VALUE!"},{"$error":"#VALUE!"},{"$error":"#VALUE!"},{"$error":"#VALUE!"},{"$error":"#VALUE!"},{"$error":"#VALUE!"}]
[43.8,{"$error":"#VALUE!"},{"$error":"#VALUE!"},{"$error":"#VALUE!"},{"$error":"#VALUE!"},{"$error":"#VALUE!"},{"$error":"#VALUE!"},{"$error":"#VALUE!"},{"$error":"#VALUE!"},{"$error":"#VALUE!"}]
[44,{"$error":"#VALUE!"},{"$error":"#VALUE!"},{"$error":"#VALUE!"},{"$error":"#VALUE!"},{"$error":"#VALUE!"},{"$error":"#VALUE!"},{"$error":"#VALUE!"},{"$error":"#VALUE!"},{"$error":"#VALUE!"}]
[44.2,{"$error":"#VALUE!"},{"$error":"#VALUE!"},{"$error":"#VALUE!"},{"$error":"#VALUE!"},{"$error":"#VALUE!"},{"$error":"#VALUE!"},{"$error":"#VALUE!"},{"$error":"#VALUE!"},{"$error":"#VALUE!"}]
[44.4,{"$error":"#VALUE!"},{"$error":"#VALUE!"},{"$error":"#VALUE!"},{"$error":"#VALUE!"},{"$error":"#VALUE!"},{"$error":"#VALUE!"},{"$error":"#VALUE!"},{"$error":"#VALUE!"},{"$error":"#VALUE!"}]
[44.6,{"$error":"#VALUE!"},{"$error":"#VALUE!"},{"$error":"#VALUE!"},{"$error":"#VALUE!"},{"$error":"#VALUE!"},{"$error":"#VALUE!"},{"$error":"#VALUE!"},{"$error":"#VALUE!"},{"$error":"#VALUE!"}]
[44.8,{"$error":"#VALUE!"},{"$error":"#VALUE!"},{"$error":"#VALUE!"},{"$error":"#VALUE!"},{"$error":"#VALUE!"},{"$error":"#VALUE!"},{"$error":"#VALUE!"},{"$error":"#VALUE!"},{"$error":"#VALUE!"}]
[45,{"$error":"#VALUE!"},{"$error":"#VALUE!"},{"$error":"#VALUE!"},{"$error":"#VALUE!"},{"$error":"#VALUE!"},{"$error":"#VALUE!"},{"$error":"#VALUE!"},{"$error":"#VALUE!"},{"$error":"#VALUE!"}]
[45.2,{"$error":"#VALUE!"},{"$error":"#VALUE!"},{"$error":"#VALUE!"},{"$error":"#VALUE!"},{"$error":"#VALUE!"},{"$error":"#VALUE!"},{"$error":"#VALUE!"},{"$error":"#VALUE!"},{"$error":"#VALUE!"}]
[45.4,{"$error":"#VALUE!"},{"$error":"#VALUE!"},{"$error":"#VALUE!"},{"$error":"#VALUE!"},{"$error":"#VALUE!"},{"$error":"#VALUE!"},{"$error":"#VALUE!"},{"$error":"#VALUE!"},{"$error":"#VALUE!"}]
[45.6,{"$error":"#VALUE!"},{"$error":"#VALUE!"},{"$error":"#VALUE!"},{"$error":"#VALUE!"},{"$error":"#VALUE!"},{"$error":"#VALUE!"},{"$error":"#VALUE!"},{"$error":"#VALUE!"},{"$error":"#VALUE!"}]
[45.8,{"$error":"#VALUE!"},{"$error":"#VALUE!"},{"$error":"#VALUE!"},{"$error":"#VALUE!"},{"$error":"#VALUE!"},{"$error":"#VALUE!"},{"$error":"#VALUE!"},{"$error":"#VALUE!"},{"$error":"#VALUE!"}]
[46,{"$error":"#VALUE!"},{"$error":"#VALUE!"},{"$error":"#VALUE!"},{"$error":"#VALUE!"},{"$error":"#VALUE!"},{"$error":"#VALUE!"},{"$error":"#VALUE!"},{"$error":"#VALUE!"},{"$error":"#VALUE!"}]
[46.2,{"$error":"#VALUE!"},{"$error":"#VALUE!"},{"$error":"#VALUE!"},{"$error":"#VALUE!"},{"$error":"#VALUE!"},{"$error":"#VALUE!"},{"$error":"#VALUE!"},{"$error":"#VALUE!"},{"$error":"#VALUE!"}]
[46.4,{"$error":"#VALUE!"},{"$error":"#VALUE!"},{"$error":"#VALUE!"},{"$error":"#VALUE!"},{"$error":"#VALUE!"},{"$error":"#VALUE!"},{"$error":"#VALUE!"},{"$error":"#VALUE!"},{"$error":"#VALUE!"}]
[46.6,{"$error":"#VALUE!"},{"$error":"#VALUE!"},{"$error":"#VALUE!"},{"$error":"#VALUE!"},{"$error":"#VALUE!"},{"$error":"#VALUE!"},{"$error":"#VALUE!"},{"$error":"#VALUE!"},{"$error":"#VALUE!"}]
[46.8,{"$error":"#VALUE!"},{"$error":"#VALUE!"},{"$error":"#VALUE!"},{"$error":"#VALUE!"},{"$error":"#VALUE!"},{"$error":"#VALUE!"},{"$error":"#VALUE!"},{"$error":"#VALUE!"},{"$error":"#VALUE!"}]
[47,{"$error":"#VALUE!"},{"$error":"#VALUE!"},{"$error":"#VALUE!"},{"$error":"#VALUE!"},{"$error":"#VALUE!"},{"$error":"#VALUE!"},{"$error":"#VALUE!"},{"$error":"#VALUE!"},{"$error":"#VALUE!"}]
[47.2,{"$error":"#VALUE!"},{"$error":"#VALUE!"},{"$error":"#VALUE!"},{"$error":"#VALUE!"},{"$error":"#VALUE!"},{"$error":"#VALUE!"},{"$error":"#VALUE!"},{"$error":"#VALUE!"},{"$error":"#VALUE!"}]
[47.4,{"$error":"#VALUE!"},{"$error":"#VALUE!"},{"$error":"#VALUE!"},{"$error":"#VALUE!"},{"$error":"#VALUE!"},{"$error":"#VALUE!"},{"$error":"#VALUE!"},{"$error":"#VALUE!"},{"$error":"#VALUE!"}]
[47.6,{"$error":"#VALUE!"},{"$error":"#VALUE!"},{"$error":"#VALUE!"},{"$error":"#VALUE!"},{"$error":"#VALUE!"},{"$error":"#VALUE!"},{"$error":"#VALUE!"},{"$error":"#VALUE!"},{"$error":"#VALUE!"}]
[47.8,{"$error":"#VALUE!"},{"$error":"#VALUE!"},{"$error":"#VALUE!"},{"$error":"#VALUE!"},{"$error":"#VALUE!"},{"$error":"#VALUE!"},{"$error":"#VALUE!"},{"$error":"#VALUE!"},{"$error":"#VALUE!"}]
[48,{"$error":"#VALUE!"},{"$error":"#VALUE!"},{"$error":"#VALUE!"},{"$error":"#VALUE!"},{"$error":"#VALUE!"},{"$error":"#VALUE!"},{"$error":"#VALUE!"},{"$error":"#VALUE!"},{"$error":"#VALUE!"}]
[48.2,{"$error":"#VALUE!"},{"$error":"#VALUE!"},{"$error":"#VALUE!"},{"$error":"#VALUE!"},{"$error":"#VALUE!"},{"$error":"#VALUE!"},{"$error":"#VALUE!"},{"$error":"#VALUE!"},{"$error":"#VALUE!"}]
[48.4,{"$error":"#VALUE!"},{"$error":"#VALUE!"},{"$error":"#VALUE!"},{"$error":"#VALUE!"},{"$error":"#VALUE!"},{"$error":"#VALUE!"},{"$error":"#VALUE!"},{"$error":"#VALUE!"},{"$error":"#VALUE!"}]
[48.6,{"$error":"#VALUE!"},{"$error":"#VALUE!"},{"$error":"#VALUE!"},{"$error":"#VALUE!"},{"$error":"#VALUE!"},{"$error":"#VALUE!"},{"$error":"#VALUE!"},{"$error":"#VALUE!"},{"$error":"#VALUE!"}]
[48.8,{"$error":"#VALUE!"},{"$error":"#VALUE!"},{"$error":"#VALUE!"},{"$error":"#VALUE!"},{"$error":"#VALUE!"},{"$error":"#VALUE!"},{"$error":"#VALUE!"},{"$error":"#VALUE!"},{"$error":"#VALUE!"}]
[49,{"$error":"#VALUE!"},{"$error":"#VALUE!"},{"$error":"#VALUE!"},{"$error":"#VALUE!"},{"$error":"#VALUE!"},{"$error":"#VALUE!"},{"$error":"#VALUE!"},{"$error":"#VALUE!"},{"$error":"#VALUE!"}]
[49.2,{"$error":"#VALUE!"},{"$error":"#VALUE!"},{"$error":"#VALUE!"},{"$error":"#VALUE!"},{"$error":"#VALUE!"},{"$error":"#VALUE!"},{"$error":"#VALUE!"},{"$error":"#VALUE!"},{"$error":"#VALUE!"}]
[49.4,{"$error":"#VALUE!"},{"$error":"#VALUE!"},{"$error":"#VALUE!"},{"$error":"#VALUE!"},{"$error":"#VALUE!"},{"$error":"#VALUE!"},{"$error":"#VALUE!"},{"$error":"#VALUE!"},{"$error":"#VALUE!"}]
[49.6,{"$error":"#VALUE!"},{"$error":"#VALUE!"},{"$error":"#VALUE!"},{"$error":"#VALUE!"},{"$error":"#VALUE!"},{"$error":"#VALUE!"},{"$error":"#VALUE!"},{"$error":"#VALUE!"},{"$error":"#VALUE!"}]
[49.8,{"$error":"#VALUE!"},{"$error":"#VALUE!"},{"$error":"#VALUE!"},{"$error":"#VALUE!"},{"$error":"#VALUE!"},{"$error":"#VALUE!"},{"$error":"#VALUE!"},{"$error":"#VALUE!"},{"$error":"#VALUE!"}]
[50,{"$error":"#VALUE!"},{"$error":"#VALUE!"},{"$error":"#VALUE!"},{"$error":"#VALUE!"},{"$error":"#VALUE!"},{"$error":"#VALUE!"},{"$error":"#VALUE!"},{"$error":"#VALUE!"},{"$error":"#VALUE!"}]
[50.2,{"$error":"#VALUE!"},{"$error":"#VALUE!"},{"$error":"#VALUE!"},{"$error":"#VALUE!"},{"$error":"#VALUE!"},{"$error":"#VALUE!"},{"$error":"#VALUE!"},{"$error":"#VALUE!"},{"$error":"#VALUE!"}]
[50.4,{"$error":"#VALUE!"},{"$error":"#VALUE!"},{"$error":"#VALUE!"},{"$error":"#VALUE!"},{"$error":"#VALUE!"},{"$error":"#VALUE!"},{"$error":"#VALUE!"},{"$error":"#VALUE!"},{"$error":"#VALUE!"}]
[50.6,{"$error":"#VALUE!"},{"$error":"#VALUE!"},{"$error":"#VALUE!"},{"$error":"#VALUE!"},{"$error":"#VALUE!"},{"$error":"#VALUE!"},{"$error":"#VALUE!"},{"$error":"#VALUE!"},{"$error":"#VALUE!"}]
[50.8,{"$error":"#VALUE!"},{"$error":"#VALUE!"},{"$error":"#VALUE!"},{"$error":"#VALUE!"},{"$error":"#VALUE!"},{"$error":"#VALUE!"},{"$error":"#VALUE!"},{"$error":"#VALUE!"},{"$error":"#VALUE!"}]
[51,{"$error":"#VALUE!"},{"$error":"#VALUE!"},{"$error":"#VALUE!"},{"$error":"#VALUE!"},{"$error":"#VALUE!"},{"$error":"#VALUE!"},{"$error":"#VALUE!"},{"$error":"#VALUE!"},{"$error":"#VALUE!"}]
[51.2,{"$error":"#VALUE!"},{"$f":"IF(AND($C$5>=A276,A276>=$B$5),($D$5^2-(A276-$E$5)^2)^0.5,0)","v":{"$error":"#VALUE!"}},{"$f":"IF(AND($C$6>=A276,A276>=$B$6),($D$6^2-(A276-$E$6)^2)^0.5,0)","v":{"$error":"#VALUE!"}},{"$f":"IF(AND($C$7>=A276,A276>$B$7),($D$7^2-(A276-$E$7)^2)^0.5,0)","v":{"$error":"#VALUE!"}},{"$f":"IF(AND($C$8>=A276,A276>=$B$8),($D$8^2-(A276-$E$8)^2)^0.5,0)","v":{"$error":"#VALUE!"}},{"$f":"IF(AND($C$9>=A276,A276>=$B$9),($D$9^2-(A276-$E$9)^2)^0.5,0)","v":{"$error":"#VALUE!"}},{"$f":"IF(AND($C$10>=A276,A276>=$B$10),($D$10^2-(A276-$E$10)^2)^0.5,0)","v":{"$error":"#VALUE!"}},{"$f":"IF(AND($C$11>=A276,A276>=$B$11),($D$11^2-(A276-$E$11)^2)^0.5,0)","v":{"$error":"#VALUE!"}},{"$error":"#VALUE!"}]
[51.4,{"$f":"$G$15*A277+$G$16","v":{"$error":"#VALUE!"}},{"$error":"#VALUE!"},{"$error":"#VALUE!"},{"$error":"#VALUE!"},{"$error":"#VALUE!"},{"$error":"#VALUE!"},{"$error":"#VALUE!"},{"$error":"#VALUE!"},{"$f":"IF(AND($C$12>=A277,A277>=$B$12),($D$12^2-(A277-$E$12)^2)^0.5,0)","v":{"$error":"#VALUE!"}}]
[{"$f":"A277+0.2","v":51.6},{"$error":"#VALUE!"},{"$error":"#VALUE!"},{"$error":"#VALUE!"},{"$error":"#VALUE!"},{"$error":"#VALUE!"},{"$error":"#VALUE!"},{"$error":"#VALUE!"},{"$error":"#VALUE!"},{"$error":"#VALUE!"}]
[51.8,{"$error":"#VALUE!"},{"$error":"#VALUE!"},{"$error":"#VALUE!"},{"$error":"#VALUE!"},{"$error":"#VALUE!"},{"$error":"#VALUE!"},{"$error":"#VALUE!"},{"$error":"#VALUE!"},{"$error":"#VALUE!"}]
[52,{"$error":"#VALUE!"},{"$error":"#VALUE!"},{"$error":"#VALUE!"},{"$error":"#VALUE!"},{"$error":"#VALUE!"},{"$error":"#VALUE!"},{"$error":"#VALUE!"},{"$error":"#VALUE!"},{"$error":"#VALUE!"}]
[52.2,{"$error":"#VALUE!"},{"$error":"#VALUE!"},{"$error":"#VALUE!"},{"$error":"#VALUE!"},{"$error":"#VALUE!"},{"$error":"#VALUE!"},{"$error":"#VALUE!"},{"$error":"#VALUE!"},{"$error":"#VALUE!"}]
[52.4,{"$error":"#VALUE!"},{"$error":"#VALUE!"},{"$error":"#VALUE!"},{"$error":"#VALUE!"},{"$error":"#VALUE!"},{"$error":"#VALUE!"},{"$error":"#VALUE!"},{"$error":"#VALUE!"},{"$error":"#VALUE!"}]
[52.6,{"$error":"#VALUE!"},{"$error":"#VALUE!"},{"$error":"#VALUE!"},{"$error":"#VALUE!"},{"$error":"#VALUE!"},{"$error":"#VALUE!"},{"$error":"#VALUE!"},{"$error":"#VALUE!"},{"$error":"#VALUE!"}]
[52.8,{"$error":"#VALUE!"},{"$error":"#VALUE!"},{"$error":"#VALUE!"},{"$error":"#VALUE!"},{"$error":"#VALUE!"},{"$error":"#VALUE!"},{"$error":"#VALUE!"},{"$error":"#VALUE!"},{"$error":"#VALUE!"}]
[53,{"$error":"#VALUE!"},{"$error":"#VALUE!"},{"$error":"#VALUE!"},{"$error":"#VALUE!"},{"$error":"#VALUE!"},{"$error":"#VALUE!"},{"$error":"#VALUE!"},{"$error":"#VALUE!"},{"$error":"#VALUE!"}]
[53.2,{"$error":"#VALUE!"},{"$error":"#VALUE!"},{"$error":"#VALUE!"},{"$error":"#VALUE!"},{"$error":"#VALUE!"},{"$error":"#VALUE!"},{"$error":"#VALUE!"},{"$error":"#VALUE!"},{"$error":"#VALUE!"}]
[53.4,{"$error":"#VALUE!"},{"$error":"#VALUE!"},{"$error":"#VALUE!"},{"$error":"#VALUE!"},{"$error":"#VALUE!"},{"$error":"#VALUE!"},{"$error":"#VALUE!"},{"$error":"#VALUE!"},{"$error":"#VALUE!"}]
[53.6,{"$error":"#VALUE!"},{"$error":"#VALUE!"},{"$error":"#VALUE!"},{"$error":"#VALUE!"},{"$error":"#VALUE!"},{"$error":"#VALUE!"},{"$error":"#VALUE!"},{"$error":"#VALUE!"},{"$error":"#VALUE!"}]
[53.8,{"$error":"#VALUE!"},{"$error":"#VALUE!"},{"$error":"#VALUE!"},{"$error":"#VALUE!"},{"$error":"#VALUE!"},{"$error":"#VALUE!"},{"$error":"#VALUE!"},{"$error":"#VALUE!"},{"$error":"#VALUE!"}]
[54,{"$error":"#VALUE!"},{"$error":"#VALUE!"},{"$error":"#VALUE!"},{"$error":"#VALUE!"},{"$error":"#VALUE!"},{"$error":"#VALUE!"},{"$error":"#VALUE!"},{"$error":"#VALUE!"},{"$error":"#VALUE!"}]
[54.2,{"$error":"#VALUE!"},{"$error":"#VALUE!"},{"$error":"#VALUE!"},{"$error":"#VALUE!"},{"$error":"#VALUE!"},{"$error":"#VALUE!"},{"$error":"#VALUE!"},{"$error":"#VALUE!"},{"$error":"#VALUE!"}]
[54.4,{"$error":"#VALUE!"},{"$error":"#VALUE!"},{"$error":"#VALUE!"},{"$error":"#VALUE!"},{"$error":"#VALUE!"},{"$error":"#VALUE!"},{"$error":"#VALUE!"},{"$error":"#VALUE!"},{"$error":"#VALUE!"}]
[54.6,{"$error":"#VALUE!"},{"$error":"#VALUE!"},{"$error":"#VALUE!"},{"$error":"#VALUE!"},{"$error":"#VALUE!"},{"$error":"#VALUE!"},{"$error":"#VALUE!"},{"$error":"#VALUE!"},{"$error":"#VALUE!"}]
[54.8,{"$error":"#VALUE!"},{"$error":"#VALUE!"},{"$error":"#VALUE!"},{"$error":"#VALUE!"},{"$error":"#VALUE!"},{"$error":"#VALUE!"},{"$error":"#VALUE!"},{"$error":"#VALUE!"},{"$error":"#VALUE!"}]
[55,{"$error":"#VALUE!"},{"$error":"#VALUE!"},{"$error":"#VALUE!"},{"$error":"#VALUE!"},{"$error":"#VALUE!"},{"$error":"#VALUE!"},{"$error":"#VALUE!"},{"$error":"#VALUE!"},{"$error":"#VALUE!"}]
[55.2,{"$error":"#VALUE!"},{"$error":"#VALUE!"},{"$error":"#VALUE!"},{"$error":"#VALUE!"},{"$error":"#VALUE!"},{"$error":"#VALUE!"},{"$error":"#VALUE!"},{"$error":"#VALUE!"},{"$error":"#VALUE!"}]
[55.4,{"$error":"#VALUE!"},{"$error":"#VALUE!"},{"$error":"#VALUE!"},{"$error":"#VALUE!"},{"$error":"#VALUE!"},{"$error":"#VALUE!"},{"$error":"#VALUE!"},{"$error":"#VALUE!"},{"$error":"#VALUE!"}]
[55.6,{"$error":"#VALUE!"},{"$error":"#VALUE!"},{"$error":"#VALUE!"},{"$error":"#VALUE!"},{"$error":"#VALUE!"},{"$error":"#VALUE!"},{"$error":"#VALUE!"},{"$error":"#VALUE!"},{"$error":"#VALUE!"}]
[55.8,{"$error":"#VALUE!"},{"$error":"#VALUE!"},{"$error":"#VALUE!"},{"$error":"#VALUE!"},{"$error":"#VALUE!"},{"$error":"#VALUE!"},{"$error":"#VALUE!"},{"$error":"#VALUE!"},{"$error":"#VALUE!"}]
[56,{"$error":"#VALUE!"},{"$error":"#VALUE!"},{"$error":"#VALUE!"},{"$error":"#VALUE!"},{"$error":"#VALUE!"},{"$error":"#VALUE!"},{"$error":"#VALUE!"},{"$error":"#VALUE!"},{"$error":"#VALUE!"}]
[56.2,{"$error":"#VALUE!"},{"$error":"#VALUE!"},{"$error":"#VALUE!"},{"$error":"#VALUE!"},{"$error":"#VALUE!"},{"$error":"#VALUE!"},{"$error":"#VALUE!"},{"$error":"#VALUE!"},{"$error":"#VALUE!"}]
[56.4,{"$error":"#VALUE!"},{"$error":"#VALUE!"},{"$error":"#VALUE!"},{"$error":"#VALUE!"},{"$error":"#VALUE!"},{"$error":"#VALUE!"},{"$error":"#VALUE!"},{"$error":"#VALUE!"},{"$error":"#VALUE!"}]
[56.6,{"$error":"#VALUE!"},{"$error":"#VALUE!"},{"$error":"#VALUE!"},{"$error":"#VALUE!"},{"$error":"#VALUE!"},{"$error":"#VALUE!"},{"$error":"#VALUE!"},{"$error":"#VALUE!"},{"$error":"#VALUE!"}]
[56.8,{"$error":"#VALUE!"},{"$error":"#VALUE!"},{"$error":"#VALUE!"},{"$error":"#VALUE!"},{"$error":"#VALUE!"},{"$error":"#VALUE!"},{"$error":"#VALUE!"},{"$error":"#VALUE!"},{"$error":"#VALUE!"}]
[57,{"$error":"#VALUE!"},{"$error":"#VALUE!"},{"$error":"#VALUE!"},{"$error":"#VALUE!"},{"$error":"#VALUE!"},{"$error":"#VALUE!"},{"$error":"#VALUE!"},{"$error":"#VALUE!"},{"$error":"#VALUE!"}]
[57.2,{"$error":"#VALUE!"},{"$error":"#VALUE!"},{"$error":"#VALUE!"},{"$error":"#VALUE!"},{"$error":"#VALUE!"},{"$error":"#VALUE!"},{"$error":"#VALUE!"},{"$error":"#VALUE!"},{"$error":"#VALUE!"}]
[57.4,{"$error":"#VALUE!"},{"$error":"#VALUE!"},{"$error":"#VALUE!"},{"$error":"#VALUE!"},{"$error":"#VALUE!"},{"$error":"#VALUE!"},{"$error":"#VALUE!"},{"$error":"#VALUE!"},{"$error":"#VALUE!"}]
[57.6,{"$error":"#VALUE!"},{"$error":"#VALUE!"},{"$error":"#VALUE!"},{"$error":"#VALUE!"},{"$error":"#VALUE!"},{"$error":"#VALUE!"},{"$error":"#VALUE!"},{"$error":"#VALUE!"},{"$error":"#VALUE!"}]
[57.8,{"$error":"#VALUE!"},{"$error":"#VALUE!"},{"$error":"#VALUE!"},{"$error":"#VALUE!"},{"$error":"#VALUE!"},{"$error":"#VALUE!"},{"$error":"#VALUE!"},{"$error":"#VALUE!"},{"$error":"#VALUE!"}]
[58,{"$error":"#VALUE!"},{"$error":"#VALUE!"},{"$error":"#VALUE!"},{"$error":"#VALUE!"},{"$error":"#VALUE!"},{"$error":"#VALUE!"},{"$error":"#VALUE!"},{"$error":"#VALUE!"},{"$error":"#VALUE!"}]
[58.2,{"$error":"#VALUE!"},{"$error":"#VALUE!"},{"$error":"#VALUE!"},{"$error":"#VALUE!"},{"$error":"#VALUE!"},{"$error":"#VALUE!"},{"$error":"#VALUE!"},{"$error":"#VALUE!"},{"$error":"#VALUE!"}]
[58.4,{"$error":"#VALUE!"},{"$error":"#VALUE!"},{"$error":"#VALUE!"},{"$error":"#VALUE!"},{"$error":"#VALUE!"},{"$error":"#VALUE!"},{"$error":"#VALUE!"},{"$error":"#VALUE!"},{"$error":"#VALUE!"}]
[58.6,{"$error":"#VALUE!"},{"$error":"#VALUE!"},{"$error":"#VALUE!"},{"$error":"#VALUE!"},{"$error":"#VALUE!"},{"$error":"#VALUE!"},{"$error":"#VALUE!"},{"$error":"#VALUE!"},{"$error":"#VALUE!"}]
[58.8,{"$error":"#VALUE!"},{"$error":"#VALUE!"},{"$error":"#VALUE!"},{"$error":"#VALUE!"},{"$error":"#VALUE!"},{"$error":"#VALUE!"},{"$error":"#VALUE!"},{"$error":"#VALUE!"},{"$error":"#VALUE!"}]
[59,{"$error":"#VALUE!"},{"$error":"#VALUE!"},{"$error":"#VALUE!"},{"$error":"#VALUE!"},{"$error":"#VALUE!"},{"$error":"#VALUE!"},{"$error":"#VALUE!"},{"$error":"#VALUE!"},{"$error":"#VALUE!"}]
[59.2,{"$error":"#VALUE!"},{"$error":"#VALUE!"},{"$error":"#VALUE!"},{"$error":"#VALUE!"},{"$error":"#VALUE!"},{"$error":"#VALUE!"},{"$error":"#VALUE!"},{"$error":"#VALUE!"},{"$error":"#VALUE!"}]
[59.4,{"$error":"#VALUE!"},{"$error":"#VALUE!"},{"$error":"#VALUE!"},{"$error":"#VALUE!"},{"$error":"#VALUE!"},{"$error":"#VALUE!"},{"$error":"#VALUE!"},{"$error":"#VALUE!"},{"$error":"#VALUE!"}]
[59.6,{"$error":"#VALUE!"},{"$error":"#VALUE!"},{"$error":"#VALUE!"},{"$error":"#VALUE!"},{"$error":"#VALUE!"},{"$error":"#VALUE!"},{"$error":"#VALUE!"},{"$error":"#VALUE!"},{"$error":"#VALUE!"}]
[59.8,{"$error":"#VALUE!"},{"$error":"#VALUE!"},{"$error":"#VALUE!"},{"$error":"#VALUE!"},{"$error":"#VALUE!"},{"$error":"#VALUE!"},{"$error":"#VALUE!"},{"$error":"#VALUE!"},{"$error":"#VALUE!"}]
[60,{"$error":"#VALUE!"},{"$error":"#VALUE!"},{"$error":"#VALUE!"},{"$error":"#VALUE!"},{"$error":"#VALUE!"},{"$error":"#VALUE!"},{"$error":"#VALUE!"},{"$error":"#VALUE!"},{"$error":"#VALUE!"}]
[60.2,{"$error":"#VALUE!"},{"$error":"#VALUE!"},{"$error":"#VALUE!"},{"$error":"#VALUE!"},{"$error":"#VALUE!"},{"$error":"#VALUE!"},{"$error":"#VALUE!"},{"$error":"#VALUE!"},{"$error":"#VALUE!"}]
[60.4,{"$error":"#VALUE!"},{"$error":"#VALUE!"},{"$error":"#VALUE!"},{"$error":"#VALUE!"},{"$error":"#VALUE!"},{"$error":"#VALUE!"},{"$error":"#VALUE!"},{"$error":"#VALUE!"},{"$error":"#VALUE!"}]
[60.6,{"$error":"#VALUE!"},{"$error":"#VALUE!"},{"$error":"#VALUE!"},{"$error":"#VALUE!"},{"$error":"#VALUE!"},{"$error":"#VALUE!"},{"$error":"#VALUE!"},{"$error":"#VALUE!"},{"$error":"#VALUE!"}]
[60.8,{"$error":"#VALUE!"},{"$error":"#VALUE!"},{"$error":"#VALUE!"},{"$error":"#VALUE!"},{"$error":"#VALUE!"},{"$error":"#VALUE!"},{"$error":"#VALUE!"},{"$error":"#VALUE!"},{"$error":"#VALUE!"}]
[61,{"$error":"#VALUE!"},{"$error":"#VALUE!"},{"$error":"#VALUE!"},{"$error":"#VALUE!"},{"$error":"#VALUE!"},{"$error":"#VALUE!"},{"$error":"#VALUE!"},{"$error":"#VALUE!"},{"$error":"#VALUE!"}]
[61.2,{"$error":"#VALUE!"},{"$error":"#VALUE!"},{"$error":"#VALUE!"},{"$error":"#VALUE!"},{"$error":"#VALUE!"},{"$error":"#VALUE!"},{"$error":"#VALUE!"},{"$error":"#VALUE!"},{"$error":"#VALUE!"}]
[61.4,{"$error":"#VALUE!"},{"$error":"#VALUE!"},{"$error":"#VALUE!"},{"$error":"#VALUE!"},{"$error":"#VALUE!"},{"$error":"#VALUE!"},{"$error":"#VALUE!"},{"$error":"#VALUE!"},{"$error":"#VALUE!"}]
[61.6,{"$error":"#VALUE!"},{"$error":"#VALUE!"},{"$error":"#VALUE!"},{"$error":"#VALUE!"},{"$error":"#VALUE!"},{"$error":"#VALUE!"},{"$error":"#VALUE!"},{"$error":"#VALUE!"},{"$error":"#VALUE!"}]
[61.8,{"$error":"#VALUE!"},{"$error":"#VALUE!"},{"$error":"#VALUE!"},{"$error":"#VALUE!"},{"$error":"#VALUE!"},{"$error":"#VALUE!"},{"$error":"#VALUE!"},{"$error":"#VALUE!"},{"$error":"#VALUE!"}]
[62,{"$error":"#VALUE!"},{"$error":"#VALUE!"},{"$error":"#VALUE!"},{"$error":"#VALUE!"},{"$error":"#VALUE!"},{"$error":"#VALUE!"},{"$error":"#VALUE!"},{"$error":"#VALUE!"},{"$error":"#VALUE!"}]
[62.2,{"$error":"#VALUE!"},{"$error":"#VALUE!"},{"$error":"#VALUE!"},{"$error":"#VALUE!"},{"$error":"#VALUE!"},{"$error":"#VALUE!"},{"$error":"#VALUE!"},{"$error":"#VALUE!"},{"$error":"#VALUE!"}]
[62.4,{"$error":"#VALUE!"},{"$error":"#VALUE!"},{"$error":"#VALUE!"},{"$error":"#VALUE!"},{"$error":"#VALUE!"},{"$error":"#VALUE!"},{"$error":"#VALUE!"},{"$error":"#VALUE!"},{"$error":"#VALUE!"}]
[62.6,{"$error":"#VALUE!"},{"$error":"#VALUE!"},{"$error":"#VALUE!"},{"$error":"#VALUE!"},{"$error":"#VALUE!"},{"$error":"#VALUE!"},{"$error":"#VALUE!"},{"$error":"#VALUE!"},{"$error":"#VALUE!"}]
[62.8,{"$error":"#VALUE!"},{"$error":"#VALUE!"},{"$error":"#VALUE!"},{"$error":"#VALUE!"},{"$error":"#VALUE!"},{"$error":"#VALUE!"},{"$error":"#VALUE!"},{"$error":"#VALUE!"},{"$error":"#VALUE!"}]
[63,{"$error":"#VALUE!"},{"$error":"#VALUE!"},{"$error":"#VALUE!"},{"$error":"#VALUE!"},{"$error":"#VALUE!"},{"$error":"#VALUE!"},{"$error":"#VALUE!"},{"$error":"#VALUE!"},{"$error":"#VALUE!"}]
[63.2,{"$error":"#VALUE!"},{"$error":"#VALUE!"},{"$error":"#VALUE!"},{"$error":"#VALUE!"},{"$error":"#VALUE!"},{"$error":"#VALUE!"},{"$error":"#VALUE!"},{"$error":"#VALUE!"},{"$error":"#VALUE!"}]
[63.4,{"$error":"#VALUE!"},{"$error":"#VALUE!"},{"$error":"#VALUE!"},{"$error":"#VALUE!"},{"$error":"#VALUE!"},{"$error":"#VALUE!"},{"$error":"#VALUE!"},{"$error":"#VALUE!"},{"$error":"#VALUE!"}]
[63.6,{"$error":"#VALUE!"},{"$error":"#VALUE!"},{"$error":"#VALUE!"},{"$error":"#VALUE!"},{"$error":"#VALUE!"},{"$error":"#VALUE!"},{"$error":"#VALUE!"},{"$error":"#VALUE!"},{"$error":"#VALUE!"}]
[63.8,{"$error":"#VALUE!"},{"$error":"#VALUE!"},{"$error":"#VALUE!"},{"$error":"#VALUE!"},{"$error":"#VALUE!"},{"$error":"#VALUE!"},{"$error":"#VALUE!"},{"$error":"#VALUE!"},{"$error":"#VALUE!"}]
[64,{"$error":"#VALUE!"},{"$f":"IF(AND($C$5>=A340,A340>=$B$5),($D$5^2-(A340-$E$5)^2)^0.5,0)","v":{"$error":"#VALUE!"}},{"$f":"IF(AND($C$6>=A340,A340>=$B$6),($D$6^2-(A340-$E$6)^2)^0.5,0)","v":{"$error":"#VALUE!"}},{"$f":"IF(AND($C$7>=A340,A340>$B$7),($D$7^2-(A340-$E$7)^2)^0.5,0)","v":{"$error":"#VALUE!"}},{"$f":"IF(AND($C$8>=A340,A340>=$B$8),($D$8^2-(A340-$E$8)^2)^0.5,0)","v":{"$error":"#VALUE!"}},{"$f":"IF(AND($C$9>=A340,A340>=$B$9),($D$9^2-(A340-$E$9)^2)^0.5,0)","v":{"$error":"#VALUE!"}},{"$f":"IF(AND($C$10>=A340,A340>=$B$10),($D$10^2-(A340-$E$10)^2)^0.5,0)","v":{"$error":"#VALUE!"}},{"$f":"IF(AND($C$11>=A340,A340>=$B$11),($D$11^2-(A340-$E$11)^2)^0.5,0)","v":{"$error":"#VALUE!"}},{"$error":"#VALUE!"}]
[64.2,{"$f":"$G$15*A341+$G$16","v":{"$error":"#VALUE!"}},{"$error":"#VALUE!"},{"$error":"#VALUE!"},{"$error":"#VALUE!"},{"$error":"#VALUE!"},{"$error":"#VALUE!"},{"$error":"#VALUE!"},{"$error":"#VALUE!"},{"$f":"IF(AND($C$12>=A341,A341>=$B$12),($D$12^2-(A341-$E$12)^2)^0.5,0)","v":{"$error":"#VALUE!"}}]
[{"$f":"A341+0.2","v":64.400000000000006},{"$error":"#VALUE!"},{"$error":"#VALUE!"},{"$error":"#VALUE!"},{"$error":"#VALUE!"},{"$error":"#VALUE!"},{"$error":"#VALUE!"},{"$error":"#VALUE!"},{"$error":"#VALUE!"},{"$error":"#VALUE!"}]
[64.599999999999994,{"$error":"#VALUE!"},{"$error":"#VALUE!"},{"$error":"#VALUE!"},{"$error":"#VALUE!"},{"$error":"#VALUE!"},{"$error":"#VALUE!"},{"$error":"#VALUE!"},{"$error":"#VALUE!"},{"$error":"#VALUE!"}]
[64.8,{"$error":"#VALUE!"},{"$error":"#VALUE!"},{"$error":"#VALUE!"},{"$error":"#VALUE!"},{"$error":"#VALUE!"},{"$error":"#VALUE!"},{"$error":"#VALUE!"},{"$error":"#VALUE!"},{"$error":"#VALUE!"}]
[65,{"$error":"#VALUE!"},{"$error":"#VALUE!"},{"$error":"#VALUE!"},{"$error":"#VALUE!"},{"$error":"#VALUE!"},{"$error":"#VALUE!"},{"$error":"#VALUE!"},{"$error":"#VALUE!"},{"$error":"#VALUE!"}]
[65.2,{"$error":"#VALUE!"},{"$error":"#VALUE!"},{"$error":"#VALUE!"},{"$error":"#VALUE!"},{"$error":"#VALUE!"},{"$error":"#VALUE!"},{"$error":"#VALUE!"},{"$error":"#VALUE!"},{"$error":"#VALUE!"}]
[65.400000000000006,{"$error":"#VALUE!"},{"$error":"#VALUE!"},{"$error":"#VALUE!"},{"$error":"#VALUE!"},{"$error":"#VALUE!"},{"$error":"#VALUE!"},{"$error":"#VALUE!"},{"$error":"#VALUE!"},{"$error":"#VALUE!"}]
[65.599999999999994,{"$error":"#VALUE!"},{"$error":"#VALUE!"},{"$error":"#VALUE!"},{"$error":"#VALUE!"},{"$error":"#VALUE!"},{"$error":"#VALUE!"},{"$error":"#VALUE!"},{"$error":"#VALUE!"},{"$error":"#VALUE!"}]
[65.8,{"$error":"#VALUE!"},{"$error":"#VALUE!"},{"$error":"#VALUE!"},{"$error":"#VALUE!"},{"$error":"#VALUE!"},{"$error":"#VALUE!"},{"$error":"#VALUE!"},{"$error":"#VALUE!"},{"$error":"#VALUE!"}]
[66,{"$error":"#VALUE!"},{"$error":"#VALUE!"},{"$error":"#VALUE!"},{"$error":"#VALUE!"},{"$error":"#VALUE!"},{"$error":"#VALUE!"},{"$error":"#VALUE!"},{"$error":"#VALUE!"},{"$error":"#VALUE!"}]
[66.2,{"$error":"#VALUE!"},{"$error":"#VALUE!"},{"$error":"#VALUE!"},{"$error":"#VALUE!"},{"$error":"#VALUE!"},{"$error":"#VALUE!"},{"$error":"#VALUE!"},{"$error":"#VALUE!"},{"$error":"#VALUE!"}]
[66.400000000000006,{"$error":"#VALUE!"},{"$error":"#VALUE!"},{"$error":"#VALUE!"},{"$error":"#VALUE!"},{"$error":"#VALUE!"},{"$error":"#VALUE!"},{"$error":"#VALUE!"},{"$error":"#VALUE!"},{"$error":"#VALUE!"}]
[66.599999999999994,{"$error":"#VALUE!"},{"$error":"#VALUE!"},{"$error":"#VALUE!"},{"$error":"#VALUE!"},{"$error":"#VALUE!"},{"$error":"#VALUE!"},{"$error":"#VALUE!"},{"$error":"#VALUE!"},{"$error":"#VALUE!"}]
[66.8,{"$error":"#VALUE!"},{"$error":"#VALUE!"},{"$error":"#VALUE!"},{"$error":"#VALUE!"},{"$error":"#VALUE!"},{"$error":"#VALUE!"},{"$error":"#VALUE!"},{"$error":"#VALUE!"},{"$error":"#VALUE!"}]
[67,{"$error":"#VALUE!"},{"$error":"#VALUE!"},{"$error":"#VALUE!"},{"$error":"#VALUE!"},{"$error":"#VALUE!"},{"$error":"#VALUE!"},{"$error":"#VALUE!"},{"$error":"#VALUE!"},{"$error":"#VALUE!"}]
[67.2,{"$error":"#VALUE!"},{"$error":"#VALUE!"},{"$error":"#VALUE!"},{"$error":"#VALUE!"},{"$error":"#VALUE!"},{"$error":"#VALUE!"},{"$error":"#VALUE!"},{"$error":"#VALUE!"},{"$error":"#VALUE!"}]
[67.400000000000006,{"$error":"#VALUE!"},{"$error":"#VALUE!"},{"$error":"#VALUE!"},{"$error":"#VALUE!"},{"$error":"#VALUE!"},{"$error":"#VALUE!"},{"$error":"#VALUE!"},{"$error":"#VALUE!"},{"$error":"#VALUE!"}]
[67.599999999999994,{"$error":"#VALUE!"},{"$error":"#VALUE!"},{"$error":"#VALUE!"},{"$error":"#VALUE!"},{"$error":"#VALUE!"},{"$error":"#VALUE!"},{"$error":"#VALUE!"},{"$error":"#VALUE!"},{"$error":"#VALUE!"}]
[67.8,{"$error":"#VALUE!"},{"$error":"#VALUE!"},{"$error":"#VALUE!"},{"$error":"#VALUE!"},{"$error":"#VALUE!"},{"$error":"#VALUE!"},{"$error":"#VALUE!"},{"$error":"#VALUE!"},{"$error":"#VALUE!"}]
[68,{"$error":"#VALUE!"},{"$error":"#VALUE!"},{"$error":"#VALUE!"},{"$error":"#VALUE!"},{"$error":"#VALUE!"},{"$error":"#VALUE!"},{"$error":"#VALUE!"},{"$error":"#VALUE!"},{"$error":"#VALUE!"}]
[68.2,{"$error":"#VALUE!"},{"$error":"#VALUE!"},{"$error":"#VALUE!"},{"$error":"#VALUE!"},{"$error":"#VALUE!"},{"$error":"#VALUE!"},{"$error":"#VALUE!"},{"$error":"#VALUE!"},{"$error":"#VALUE!"}]
[68.400000000000006,{"$error":"#VALUE!"},{"$error":"#VALUE!"},{"$error":"#VALUE!"},{"$error":"#VALUE!"},{"$error":"#VALUE!"},{"$error":"#VALUE!"},{"$error":"#VALUE!"},{"$error":"#VALUE!"},{"$error":"#VALUE!"}]
[68.599999999999994,{"$error":"#VALUE!"},{"$error":"#VALUE!"},{"$error":"#VALUE!"},{"$error":"#VALUE!"},{"$error":"#VALUE!"},{"$error":"#VALUE!"},{"$error":"#VALUE!"},{"$error":"#VALUE!"},{"$error":"#VALUE!"}]
[68.8,{"$error":"#VALUE!"},{"$error":"#VALUE!"},{"$error":"#VALUE!"},{"$error":"#VALUE!"},{"$error":"#VALUE!"},{"$error":"#VALUE!"},{"$error":"#VALUE!"},{"$error":"#VALUE!"},{"$error":"#VALUE!"}]
[69,{"$error":"#VALUE!"},{"$error":"#VALUE!"},{"$error":"#VALUE!"},{"$error":"#VALUE!"},{"$error":"#VALUE!"},{"$error":"#VALUE!"},{"$error":"#VALUE!"},{"$error":"#VALUE!"},{"$error":"#VALUE!"}]
[69.2,{"$error":"#VALUE!"},{"$error":"#VALUE!"},{"$error":"#VALUE!"},{"$error":"#VALUE!"},{"$error":"#VALUE!"},{"$error":"#VALUE!"},{"$error":"#VALUE!"},{"$error":"#VALUE!"},{"$error":"#VALUE!"}]
[69.400000000000006,{"$error":"#VALUE!"},{"$error":"#VALUE!"},{"$error":"#VALUE!"},{"$error":"#VALUE!"},{"$error":"#VALUE!"},{"$error":"#VALUE!"},{"$error":"#VALUE!"},{"$error":"#VALUE!"},{"$error":"#VALUE!"}]
[69.599999999999994,{"$error":"#VALUE!"},{"$error":"#VALUE!"},{"$error":"#VALUE!"},{"$error":"#VALUE!"},{"$error":"#VALUE!"},{"$error":"#VALUE!"},{"$error":"#VALUE!"},{"$error":"#VALUE!"},{"$error":"#VALUE!"}]
[69.8,{"$error":"#VALUE!"},{"$error":"#VALUE!"},{"$error":"#VALUE!"},{"$error":"#VALUE!"},{"$error":"#VALUE!"},{"$error":"#VALUE!"},{"$error":"#VALUE!"},{"$error":"#VALUE!"},{"$error":"#VALUE!"}]
[70,{"$error":"#VALUE!"},{"$error":"#VALUE!"},{"$error":"#VALUE!"},{"$error":"#VALUE!"},{"$error":"#VALUE!"},{"$error":"#VALUE!"},{"$error":"#VALUE!"},{"$error":"#VALUE!"},{"$error":"#VALUE!"}]
[70.2,{"$error":"#VALUE!"},{"$error":"#VALUE!"},{"$error":"#VALUE!"},{"$error":"#VALUE!"},{"$error":"#VALUE!"},{"$error":"#VALUE!"},{"$error":"#VALUE!"},{"$error":"#VALUE!"},{"$error":"#VALUE!"}]
[70.400000000000006,{"$error":"#VALUE!"},{"$error":"#VALUE!"},{"$error":"#VALUE!"},{"$error":"#VALUE!"},{"$error":"#VALUE!"},{"$error":"#VALUE!"},{"$error":"#VALUE!"},{"$error":"#VALUE!"},{"$error":"#VALUE!"}]
[70.599999999999994,{"$error":"#VALUE!"},{"$error":"#VALUE!"},{"$error":"#VALUE!"},{"$error":"#VALUE!"},{"$error":"#VALUE!"},{"$error":"#VALUE!"},{"$error":"#VALUE!"},{"$error":"#VALUE!"},{"$error":"#VALUE!"}]
[70.8,{"$error":"#VALUE!"},{"$error":"#VALUE!"},{"$error":"#VALUE!"},{"$error":"#VALUE!"},{"$error":"#VALUE!"},{"$error":"#VALUE!"},{"$error":"#VALUE!"},{"$error":"#VALUE!"},{"$error":"#VALUE!"}]
[71,{"$error":"#VALUE!"},{"$error":"#VALUE!"},{"$error":"#VALUE!"},{"$error":"#VALUE!"},{"$error":"#VALUE!"},{"$error":"#VALUE!"},{"$error":"#VALUE!"},{"$error":"#VALUE!"},{"$error":"#VALUE!"}]
[71.2,{"$error":"#VALUE!"},{"$error":"#VALUE!"},{"$error":"#VALUE!"},{"$error":"#VALUE!"},{"$error":"#VALUE!"},{"$error":"#VALUE!"},{"$error":"#VALUE!"},{"$error":"#VALUE!"},{"$error":"#VALUE!"}]
[71.400000000000006,{"$error":"#VALUE!"},{"$error":"#VALUE!"},{"$error":"#VALUE!"},{"$error":"#VALUE!"},{"$error":"#VALUE!"},{"$error":"#VALUE!"},{"$error":"#VALUE!"},{"$error":"#VALUE!"},{"$error":"#VALUE!"}]
[71.599999999999994,{"$error":"#VALUE!"},{"$error":"#VALUE!"},{"$error":"#VALUE!"},{"$error":"#VALUE!"},{"$error":"#VALUE!"},{"$error":"#VALUE!"},{"$error":"#VALUE!"},{"$error":"#VALUE!"},{"$error":"#VALUE!"}]
[71.8,{"$error":"#VALUE!"},{"$error":"#VALUE!"},{"$error":"#VALUE!"},{"$error":"#VALUE!"},{"$error":"#VALUE!"},{"$error":"#VALUE!"},{"$error":"#VALUE!"},{"$error":"#VALUE!"},{"$error":"#VALUE!"}]
[72,{"$error":"#VALUE!"},{"$error":"#VALUE!"},{"$error":"#VALUE!"},{"$error":"#VALUE!"},{"$error":"#VALUE!"},{"$error":"#VALUE!"},{"$error":"#VALUE!"},{"$error":"#VALUE!"},{"$error":"#VALUE!"}]
[72.2,{"$error":"#VALUE!"},{"$error":"#VALUE!"},{"$error":"#VALUE!"},{"$error":"#VALUE!"},{"$error":"#VALUE!"},{"$error":"#VALUE!"},{"$error":"#VALUE!"},{"$error":"#VALUE!"},{"$error":"#VALUE!"}]
[72.400000000000006,{"$error":"#VALUE!"},{"$error":"#VALUE!"},{"$error":"#VALUE!"},{"$error":"#VALUE!"},{"$error":"#VALUE!"},{"$error":"#VALUE!"},{"$error":"#VALUE!"},{"$error":"#VALUE!"},{"$error":"#VALUE!"}]
[72.599999999999994,{"$error":"#VALUE!"},{"$error":"#VALUE!"},{"$error":"#VALUE!"},{"$error":"#VALUE!"},{"$error":"#VALUE!"},{"$error":"#VALUE!"},{"$error":"#VALUE!"},{"$error":"#VALUE!"},{"$error":"#VALUE!"}]
[72.8,{"$error":"#VALUE!"},{"$error":"#VALUE!"},{"$error":"#VALUE!"},{"$error":"#VALUE!"},{"$error":"#VALUE!"},{"$error":"#VALUE!"},{"$error":"#VALUE!"},{"$error":"#VALUE!"},{"$error":"#VALUE!"}]
[73,{"$error":"#VALUE!"},{"$error":"#VALUE!"},{"$error":"#VALUE!"},{"$error":"#VALUE!"},{"$error":"#VALUE!"},{"$error":"#VALUE!"},{"$error":"#VALUE!"},{"$error":"#VALUE!"},{"$error":"#VALUE!"}]
[73.2,{"$error":"#VALUE!"},{"$error":"#VALUE!"},{"$error":"#VALUE!"},{"$error":"#VALUE!"},{"$error":"#VALUE!"},{"$error":"#VALUE!"},{"$error":"#VALUE!"},{"$error":"#VALUE!"},{"$error":"#VALUE!"}]
[73.400000000000006,{"$error":"#VALUE!"},{"$error":"#VALUE!"},{"$error":"#VALUE!"},{"$error":"#VALUE!"},{"$error":"#VALUE!"},{"$error":"#VALUE!"},{"$error":"#VALUE!"},{"$error":"#VALUE!"},{"$error":"#VALUE!"}]
[73.599999999999994,{"$error":"#VALUE!"},{"$error":"#VALUE!"},{"$error":"#VALUE!"},{"$error":"#VALUE!"},{"$error":"#VALUE!"},{"$error":"#VALUE!"},{"$error":"#VALUE!"},{"$error":"#VALUE!"},{"$error":"#VALUE!"}]
[73.8,{"$error":"#VALUE!"},{"$error":"#VALUE!"},{"$error":"#VALUE!"},{"$error":"#VALUE!"},{"$error":"#VALUE!"},{"$error":"#VALUE!"},{"$error":"#VALUE!"},{"$error":"#VALUE!"},{"$error":"#VALUE!"}]
[74,{"$error":"#VALUE!"},{"$error":"#VALUE!"},{"$error":"#VALUE!"},{"$error":"#VALUE!"},{"$error":"#VALUE!"},{"$error":"#VALUE!"},{"$error":"#VALUE!"},{"$error":"#VALUE!"},{"$error":"#VALUE!"}]
[74.2,{"$error":"#VALUE!"},{"$error":"#VALUE!"},{"$error":"#VALUE!"},{"$error":"#VALUE!"},{"$error":"#VALUE!"},{"$error":"#VALUE!"},{"$error":"#VALUE!"},{"$error":"#VALUE!"},{"$error":"#VALUE!"}]
[74.400000000000006,{"$error":"#VALUE!"},{"$error":"#VALUE!"},{"$error":"#VALUE!"},{"$error":"#VALUE!"},{"$error":"#VALUE!"},{"$error":"#VALUE!"},{"$error":"#VALUE!"},{"$error":"#VALUE!"},{"$error":"#VALUE!"}]
[74.599999999999994,{"$error":"#VALUE!"},{"$error":"#VALUE!"},{"$error":"#VALUE!"},{"$error":"#VALUE!"},{"$error":"#VALUE!"},{"$error":"#VALUE!"},{"$error":"#VALUE!"},{"$error":"#VALUE!"},{"$error":"#VALUE!"}]
[74.8,{"$error":"#VALUE!"},{"$error":"#VALUE!"},{"$error":"#VALUE!"},{"$error":"#VALUE!"},{"$error":"#VALUE!"},{"$error":"#VALUE!"},{"$error":"#VALUE!"},{"$error":"#VALUE!"},{"$error":"#VALUE!"}]
[75,{"$error":"#VALUE!"},{"$error":"#VALUE!"},{"$error":"#VALUE!"},{"$error":"#VALUE!"},{"$error":"#VALUE!"},{"$error":"#VALUE!"},{"$error":"#VALUE!"},{"$error":"#VALUE!"},{"$error":"#VALUE!"}]
[75.2,{"$error":"#VALUE!"},{"$error":"#VALUE!"},{"$error":"#VALUE!"},{"$error":"#VALUE!"},{"$error":"#VALUE!"},{"$error":"#VALUE!"},{"$error":"#VALUE!"},{"$error":"#VALUE!"},{"$error":"#VALUE!"}]
[75.400000000000006,{"$error":"#VALUE!"},{"$error":"#VALUE!"},{"$error":"#VALUE!"},{"$error":"#VALUE!"},{"$error":"#VALUE!"},{"$error":"#VALUE!"},{"$error":"#VALUE!"},{"$error":"#VALUE!"},{"$error":"#VALUE!"}]
[75.599999999999994,{"$error":"#VALUE!"},{"$error":"#VALUE!"},{"$error":"#VALUE!"},{"$error":"#VALUE!"},{"$error":"#VALUE!"},{"$error":"#VALUE!"},{"$error":"#VALUE!"},{"$error":"#VALUE!"},{"$error":"#VALUE!"}]
[75.8,{"$error":"#VALUE!"},{"$error":"#VALUE!"},{"$error":"#VALUE!"},{"$error":"#VALUE!"},{"$error":"#VALUE!"},{"$error":"#VALUE!"},{"$error":"#VALUE!"},{"$error":"#VALUE!"},{"$error":"#VALUE!"}]
[76,{"$error":"#VALUE!"},{"$error":"#VALUE!"},{"$error":"#VALUE!"},{"$error":"#VALUE!"},{"$error":"#VALUE!"},{"$error":"#VALUE!"},{"$error":"#VALUE!"},{"$error":"#VALUE!"},{"$error":"#VALUE!"}]
[76.2,{"$error":"#VALUE!"},{"$error":"#VALUE!"},{"$error":"#VALUE!"},{"$error":"#VALUE!"},{"$error":"#VALUE!"},{"$error":"#VALUE!"},{"$error":"#VALUE!"},{"$error":"#VALUE!"},{"$error":"#VALUE!"}]
[76.400000000000006,{"$error":"#VALUE!"},{"$error":"#VALUE!"},{"$error":"#VALUE!"},{"$error":"#VALUE!"},{"$error":"#VALUE!"},{"$error":"#VALUE!"},{"$error":"#VALUE!"},{"$error":"#VALUE!"},{"$error":"#VALUE!"}]
[76.599999999999994,{"$error":"#VALUE!"},{"$error":"#VALUE!"},{"$error":"#VALUE!"},{"$error":"#VALUE!"},{"$error":"#VALUE!"},{"$error":"#VALUE!"},{"$error":"#VALUE!"},{"$error":"#VALUE!"},{"$error":"#VALUE!"}]
[76.8,{"$error":"#VALUE!"},{"$f":"IF(AND($C$5>=A404,A404>=$B$5),($D$5^2-(A404-$E$5)^2)^0.5,0)","v":{"$error":"#VALUE!"}},{"$f":"IF(AND($C$6>=A404,A404>=$B$6),($D$6^2-(A404-$E$6)^2)^0.5,0)","v":{"$error":"#VALUE!"}},{"$f":"IF(AND($C$7>=A404,A404>$B$7),($D$7^2-(A404-$E$7)^2)^0.5,0)","v":{"$error":"#VALUE!"}},{"$f":"IF(AND($C$8>=A404,A404>=$B$8),($D$8^2-(A404-$E$8)^2)^0.5,0)","v":{"$error":"#VALUE!"}},{"$f":"IF(AND($C$9>=A404,A404>=$B$9),($D$9^2-(A404-$E$9)^2)^0.5,0)","v":{"$error":"#VALUE!"}},{"$f":"IF(AND($C$10>=A404,A404>=$B$10),($D$10^2-(A404-$E$10)^2)^0.5,0)","v":{"$error":"#VALUE!"}},{"$f":"IF(AND($C$11>=A404,A404>=$B$11),($D$11^2-(A404-$E$11)^2)^0.5,0)","v":{"$error":"#VALUE!"}},{"$error":"#VALUE!"}]
[77,{"$f":"$G$15*A405+$G$16","v":{"$error":"#VALUE!"}},{"$error":"#VALUE!"},{"$error":"#VALUE!"},{"$error":"#VALUE!"},{"$error":"#VALUE!"},{"$error":"#VALUE!"},{"$error":"#VALUE!"},{"$error":"#VALUE!"},{"$f":"IF(AND($C$12>=A405,A405>=$B$12),($D$12^2-(A405-$E$12)^2)^0.5,0)","v":{"$error":"#VALUE!"}}]
[{"$f":"A405+0.2","v":77.2},{"$error":"#VALUE!"},{"$error":"#VALUE!"},{"$error":"#VALUE!"},{"$error":"#VALUE!"},{"$error":"#VALUE!"},{"$error":"#VALUE!"},{"$error":"#VALUE!"},{"$error":"#VALUE!"},{"$error":"#VALUE!"}]
[77.400000000000006,{"$error":"#VALUE!"},{"$error":"#VALUE!"},{"$error":"#VALUE!"},{"$error":"#VALUE!"},{"$error":"#VALUE!"},{"$error":"#VALUE!"},{"$error":"#VALUE!"},{"$error":"#VALUE!"},{"$error":"#VALUE!"}]
[77.599999999999994,{"$error":"#VALUE!"},{"$error":"#VALUE!"},{"$error":"#VALUE!"},{"$error":"#VALUE!"},{"$error":"#VALUE!"},{"$error":"#VALUE!"},{"$error":"#VALUE!"},{"$error":"#VALUE!"},{"$error":"#VALUE!"}]
[77.8,{"$error":"#VALUE!"},{"$error":"#VALUE!"},{"$error":"#VALUE!"},{"$error":"#VALUE!"},{"$error":"#VALUE!"},{"$error":"#VALUE!"},{"$error":"#VALUE!"},{"$error":"#VALUE!"},{"$error":"#VALUE!"}]
[78,{"$error":"#VALUE!"},{"$error":"#VALUE!"},{"$error":"#VALUE!"},{"$error":"#VALUE!"},{"$error":"#VALUE!"},{"$error":"#VALUE!"},{"$error":"#VALUE!"},{"$error":"#VALUE!"},{"$error":"#VALUE!"}]
[78.2,{"$error":"#VALUE!"},{"$error":"#VALUE!"},{"$error":"#VALUE!"},{"$error":"#VALUE!"},{"$error":"#VALUE!"},{"$error":"#VALUE!"},{"$error":"#VALUE!"},{"$error":"#VALUE!"},{"$error":"#VALUE!"}]
[78.400000000000006,{"$error":"#VALUE!"},{"$error":"#VALUE!"},{"$error":"#VALUE!"},{"$error":"#VALUE!"},{"$error":"#VALUE!"},{"$error":"#VALUE!"},{"$error":"#VALUE!"},{"$error":"#VALUE!"},{"$error":"#VALUE!"}]
[78.599999999999994,{"$error":"#VALUE!"},{"$error":"#VALUE!"},{"$error":"#VALUE!"},{"$error":"#VALUE!"},{"$error":"#VALUE!"},{"$error":"#VALUE!"},{"$error":"#VALUE!"},{"$error":"#VALUE!"},{"$error":"#VALUE!"}]
[78.8,{"$error":"#VALUE!"},{"$error":"#VALUE!"},{"$error":"#VALUE!"},{"$error":"#VALUE!"},{"$error":"#VALUE!"},{"$error":"#VALUE!"},{"$error":"#VALUE!"},{"$error":"#VALUE!"},{"$error":"#VALUE!"}]
[79,{"$error":"#VALUE!"},{"$error":"#VALUE!"},{"$error":"#VALUE!"},{"$error":"#VALUE!"},{"$error":"#VALUE!"},{"$error":"#VALUE!"},{"$error":"#VALUE!"},{"$error":"#VALUE!"},{"$error":"#VALUE!"}]
[79.2,{"$error":"#VALUE!"},{"$error":"#VALUE!"},{"$error":"#VALUE!"},{"$error":"#VALUE!"},{"$error":"#VALUE!"},{"$error":"#VALUE!"},{"$error":"#VALUE!"},{"$error":"#VALUE!"},{"$error":"#VALUE!"}]
[79.400000000000006,{"$error":"#VALUE!"},{"$error":"#VALUE!"},{"$error":"#VALUE!"},{"$error":"#VALUE!"},{"$error":"#VALUE!"},{"$error":"#VALUE!"},{"$error":"#VALUE!"},{"$error":"#VALUE!"},{"$error":"#VALUE!"}]
[79.599999999999994,{"$error":"#VALUE!"},{"$error":"#VALUE!"},{"$error":"#VALUE!"},{"$error":"#VALUE!"},{"$error":"#VALUE!"},{"$error":"#VALUE!"},{"$error":"#VALUE!"},{"$error":"#VALUE!"},{"$error":"#VALUE!"}]
[79.8,{"$error":"#VALUE!"},{"$error":"#VALUE!"},{"$error":"#VALUE!"},{"$error":"#VALUE!"},{"$error":"#VALUE!"},{"$error":"#VALUE!"},{"$error":"#VALUE!"},{"$error":"#VALUE!"},{"$error":"#VALUE!"}]
[80,{"$error":"#VALUE!"},{"$error":"#VALUE!"},{"$error":"#VALUE!"},{"$error":"#VALUE!"},{"$error":"#VALUE!"},{"$error":"#VALUE!"},{"$error":"#VALUE!"},{"$error":"#VALUE!"},{"$error":"#VALUE!"}]
[80.2,{"$error":"#VALUE!"},{"$error":"#VALUE!"},{"$error":"#VALUE!"},{"$error":"#VALUE!"},{"$error":"#VALUE!"},{"$error":"#VALUE!"},{"$error":"#VALUE!"},{"$error":"#VALUE!"},{"$error":"#VALUE!"}]
[80.400000000000006,{"$error":"#VALUE!"},{"$error":"#VALUE!"},{"$error":"#VALUE!"},{"$error":"#VALUE!"},{"$error":"#VALUE!"},{"$error":"#VALUE!"},{"$error":"#VALUE!"},{"$error":"#VALUE!"},{"$error":"#VALUE!"}]
[80.599999999999994,{"$error":"#VALUE!"},{"$error":"#VALUE!"},{"$error":"#VALUE!"},{"$error":"#VALUE!"},{"$error":"#VALUE!"},{"$error":"#VALUE!"},{"$error":"#VALUE!"},{"$error":"#VALUE!"},{"$error":"#VALUE!"}]
[80.8,{"$error":"#VALUE!"},{"$error":"#VALUE!"},{"$error":"#VALUE!"},{"$error":"#VALUE!"},{"$error":"#VALUE!"},{"$error":"#VALUE!"},{"$error":"#VALUE!"},{"$error":"#VALUE!"},{"$error":"#VALUE!"}]
[81,{"$error":"#VALUE!"},{"$error":"#VALUE!"},{"$error":"#VALUE!"},{"$error":"#VALUE!"},{"$error":"#VALUE!"},{"$error":"#VALUE!"},{"$error":"#VALUE!"},{"$error":"#VALUE!"},{"$error":"#VALUE!"}]
[81.2,{"$error":"#VALUE!"},{"$error":"#VALUE!"},{"$error":"#VALUE!"},{"$error":"#VALUE!"},{"$error":"#VALUE!"},{"$error":"#VALUE!"},{"$error":"#VALUE!"},{"$error":"#VALUE!"},{"$error":"#VALUE!"}]
[81.400000000000006,{"$error":"#VALUE!"},{"$error":"#VALUE!"},{"$error":"#VALUE!"},{"$error":"#VALUE!"},{"$error":"#VALUE!"},{"$error":"#VALUE!"},{"$error":"#VALUE!"},{"$error":"#VALUE!"},{"$error":"#VALUE!"}]
[81.599999999999994,{"$error":"#VALUE!"},{"$error":"#VALUE!"},{"$error":"#VALUE!"},{"$error":"#VALUE!"},{"$error":"#VALUE!"},{"$error":"#VALUE!"},{"$error":"#VALUE!"},{"$error":"#VALUE!"},{"$error":"#VALUE!"}]
[81.8,{"$error":"#VALUE!"},{"$error":"#VALUE!"},{"$error":"#VALUE!"},{"$error":"#VALUE!"},{"$error":"#VALUE!"},{"$error":"#VALUE!"},{"$error":"#VALUE!"},{"$error":"#VALUE!"},{"$error":"#VALUE!"}]
[82,{"$error":"#VALUE!"},{"$error":"#VALUE!"},{"$error":"#VALUE!"},{"$error":"#VALUE!"},{"$error":"#VALUE!"},{"$error":"#VALUE!"},{"$error":"#VALUE!"},{"$error":"#VALUE!"},{"$error":"#VALUE!"}]
[82.2,{"$error":"#VALUE!"},{"$error":"#VALUE!"},{"$error":"#VALUE!"},{"$error":"#VALUE!"},{"$error":"#VALUE!"},{"$error":"#VALUE!"},{"$error":"#VALUE!"},{"$error":"#VALUE!"},{"$error":"#VALUE!"}]
[82.4,{"$error":"#VALUE!"},{"$error":"#VALUE!"},{"$error":"#VALUE!"},{"$error":"#VALUE!"},{"$error":"#VALUE!"},{"$error":"#VALUE!"},{"$error":"#VALUE!"},{"$error":"#VALUE!"},{"$error":"#VALUE!"}]
[82.6,{"$error":"#VALUE!"},{"$error":"#VALUE!"},{"$error":"#VALUE!"},{"$error":"#VALUE!"},{"$error":"#VALUE!"},{"$error":"#VALUE!"},{"$error":"#VALUE!"},{"$error":"#VALUE!"},{"$error":"#VALUE!"}]
[82.8,{"$error":"#VALUE!"},{"$error":"#VALUE!"},{"$error":"#VALUE!"},{"$error":"#VALUE!"},{"$error":"#VALUE!"},{"$error":"#VALUE!"},{"$error":"#VALUE!"},{"$error":"#VALUE!"},{"$error":"#VALUE!"}]
[83,{"$error":"#VALUE!"},{"$error":"#VALUE!"},{"$error":"#VALUE!"},{"$error":"#VALUE!"},{"$error":"#VALUE!"},{"$error":"#VALUE!"},{"$error":"#VALUE!"},{"$error":"#VALUE!"},{"$error":"#VALUE!"}]
[83.2,{"$error":"#VALUE!"},{"$error":"#VALUE!"},{"$error":"#VALUE!"},{"$error":"#VALUE!"},{"$error":"#VALUE!"},{"$error":"#VALUE!"},{"$error":"#VALUE!"},{"$error":"#VALUE!"},{"$error":"#VALUE!"}]
[83.4,{"$error":"#VALUE!"},{"$error":"#VALUE!"},{"$error":"#VALUE!"},{"$error":"#VALUE!"},{"$error":"#VALUE!"},{"$error":"#VALUE!"},{"$error":"#VALUE!"},{"$error":"#VALUE!"},{"$error":"#VALUE!"}]
[83.6,{"$error":"#VALUE!"},{"$error":"#VALUE!"},{"$error":"#VALUE!"},{"$error":"#VALUE!"},{"$error":"#VALUE!"},{"$error":"#VALUE!"},{"$error":"#VALUE!"},{"$error":"#VALUE!"},{"$error":"#VALUE!"}]
[83.8,{"$error":"#VALUE!"},{"$error":"#VALUE!"},{"$error":"#VALUE!"},{"$error":"#VALUE!"},{"$error":"#VALUE!"},{"$error":"#VALUE!"},{"$error":"#VALUE!"},{"$error":"#VALUE!"},{"$error":"#VALUE!"}]
[84,{"$error":"#VALUE!"},{"$error":"#VALUE!"},{"$error":"#VALUE!"},{"$error":"#VALUE!"},{"$error":"#VALUE!"},{"$error":"#VALUE!"},{"$error":"#VALUE!"},{"$error":"#VALUE!"},{"$error":"#VALUE!"}]
[84.2,{"$error":"#VALUE!"},{"$error":"#VALUE!"},{"$error":"#VALUE!"},{"$error":"#VALUE!"},{"$error":"#VALUE!"},{"$error":"#VALUE!"},{"$error":"#VALUE!"},{"$error":"#VALUE!"},{"$error":"#VALUE!"}]
[84.4,{"$error":"#VALUE!"},{"$error":"#VALUE!"},{"$error":"#VALUE!"},{"$error":"#VALUE!"},{"$error":"#VALUE!"},{"$error":"#VALUE!"},{"$error":"#VALUE!"},{"$error":"#VALUE!"},{"$error":"#VALUE!"}]
[84.6,{"$error":"#VALUE!"},{"$error":"#VALUE!"},{"$error":"#VALUE!"},{"$error":"#VALUE!"},{"$error":"#VALUE!"},{"$error":"#VALUE!"},{"$error":"#VALUE!"},{"$error":"#VALUE!"},{"$error":"#VALUE!"}]
[84.8,{"$error":"#VALUE!"},{"$error":"#VALUE!"},{"$error":"#VALUE!"},{"$error":"#VALUE!"},{"$error":"#VALUE!"},{"$error":"#VALUE!"},{"$error":"#VALUE!"},{"$error":"#VALUE!"},{"$error":"#VALUE!"}]
[85,{"$error":"#VALUE!"},{"$error":"#VALUE!"},{"$error":"#VALUE!"},{"$error":"#VALUE!"},{"$error":"#VALUE!"},{"$error":"#VALUE!"},{"$error":"#VALUE!"},{"$error":"#VALUE!"},{"$error":"#VALUE!"}]
[85.2,{"$error":"#VALUE!"},{"$error":"#VALUE!"},{"$error":"#VALUE!"},{"$error":"#VALUE!"},{"$error":"#VALUE!"},{"$error":"#VALUE!"},{"$error":"#VALUE!"},{"$error":"#VALUE!"},{"$error":"#VALUE!"}]
[85.4,{"$error":"#VALUE!"},{"$error":"#VALUE!"},{"$error":"#VALUE!"},{"$error":"#VALUE!"},{"$error":"#VALUE!"},{"$error":"#VALUE!"},{"$error":"#VALUE!"},{"$error":"#VALUE!"},{"$error":"#VALUE!"}]
[85.6,{"$error":"#VALUE!"},{"$error":"#VALUE!"},{"$error":"#VALUE!"},{"$error":"#VALUE!"},{"$error":"#VALUE!"},{"$error":"#VALUE!"},{"$error":"#VALUE!"},{"$error":"#VALUE!"},{"$error":"#VALUE!"}]
[85.8,{"$error":"#VALUE!"},{"$error":"#VALUE!"},{"$error":"#VALUE!"},{"$error":"#VALUE!"},{"$error":"#VALUE!"},{"$error":"#VALUE!"},{"$error":"#VALUE!"},{"$error":"#VALUE!"},{"$error":"#VALUE!"}]
[86,{"$error":"#VALUE!"},{"$error":"#VALUE!"},{"$error":"#VALUE!"},{"$error":"#VALUE!"},{"$error":"#VALUE!"},{"$error":"#VALUE!"},{"$error":"#VALUE!"},{"$error":"#VALUE!"},{"$error":"#VALUE!"}]
[86.2,{"$error":"#VALUE!"},{"$error":"#VALUE!"},{"$error":"#VALUE!"},{"$error":"#VALUE!"},{"$error":"#VALUE!"},{"$error":"#VALUE!"},{"$error":"#VALUE!"},{"$error":"#VALUE!"},{"$error":"#VALUE!"}]
[86.4,{"$error":"#VALUE!"},{"$error":"#VALUE!"},{"$error":"#VALUE!"},{"$error":"#VALUE!"},{"$error":"#VALUE!"},{"$error":"#VALUE!"},{"$error":"#VALUE!"},{"$error":"#VALUE!"},{"$error":"#VALUE!"}]
[86.6,{"$error":"#VALUE!"},{"$error":"#VALUE!"},{"$error":"#VALUE!"},{"$error":"#VALUE!"},{"$error":"#VALUE!"},{"$error":"#VALUE!"},{"$error":"#VALUE!"},{"$error":"#VALUE!"},{"$error":"#VALUE!"}]
[86.8,{"$error":"#VALUE!"},{"$error":"#VALUE!"},{"$error":"#VALUE!"},{"$error":"#VALUE!"},{"$error":"#VALUE!"},{"$error":"#VALUE!"},{"$error":"#VALUE!"},{"$error":"#VALUE!"},{"$error":"#VALUE!"}]
[87,{"$error":"#VALUE!"},{"$error":"#VALUE!"},{"$error":"#VALUE!"},{"$error":"#VALUE!"},{"$error":"#VALUE!"},{"$error":"#VALUE!"},{"$error":"#VALUE!"},{"$error":"#VALUE!"},{"$error":"#VALUE!"}]
[87.2,{"$error":"#VALUE!"},{"$error":"#VALUE!"},{"$error":"#VALUE!"},{"$error":"#VALUE!"},{"$error":"#VALUE!"},{"$error":"#VALUE!"},{"$error":"#VALUE!"},{"$error":"#VALUE!"},{"$error":"#VALUE!"}]
[87.4,{"$error":"#VALUE!"},{"$error":"#VALUE!"},{"$error":"#VALUE!"},{"$error":"#VALUE!"},{"$error":"#VALUE!"},{"$error":"#VALUE!"},{"$error":"#VALUE!"},{"$error":"#VALUE!"},{"$error":"#VALUE!"}]
[87.6,{"$error":"#VALUE!"},{"$error":"#VALUE!"},{"$error":"#VALUE!"},{"$error":"#VALUE!"},{"$error":"#VALUE!"},{"$error":"#VALUE!"},{"$error":"#VALUE!"},{"$error":"#VALUE!"},{"$error":"#VALUE!"}]
[87.8,{"$error":"#VALUE!"},{"$error":"#VALUE!"},{"$error":"#VALUE!"},{"$error":"#VALUE!"},{"$error":"#VALUE!"},{"$error":"#VALUE!"},{"$error":"#VALUE!"},{"$error":"#VALUE!"},{"$error":"#VALUE!"}]
[88,{"$error":"#VALUE!"},{"$error":"#VALUE!"},{"$error":"#VALUE!"},{"$error":"#VALUE!"},{"$error":"#VALUE!"},{"$error":"#VALUE!"},{"$error":"#VALUE!"},{"$error":"#VALUE!"},{"$error":"#VALUE!"}]
[88.2,{"$error":"#VALUE!"},{"$error":"#VALUE!"},{"$error":"#VALUE!"},{"$error":"#VALUE!"},{"$error":"#VALUE!"},{"$error":"#VALUE!"},{"$error":"#VALUE!"},{"$error":"#VALUE!"},{"$error":"#VALUE!"}]
[88.4,{"$error":"#VALUE!"},{"$error":"#VALUE!"},{"$error":"#VALUE!"},{"$error":"#VALUE!"},{"$error":"#VALUE!"},{"$error":"#VALUE!"},{"$error":"#VALUE!"},{"$error":"#VALUE!"},{"$error":"#VALUE!"}]
[88.6,{"$error":"#VALUE!"},{"$error":"#VALUE!"},{"$error":"#VALUE!"},{"$error":"#VALUE!"},{"$error":"#VALUE!"},{"$error":"#VALUE!"},{"$error":"#VALUE!"},{"$error":"#VALUE!"},{"$error":"#VALUE!"}]
[88.8,{"$error":"#VALUE!"},{"$error":"#VALUE!"},{"$error":"#VALUE!"},{"$error":"#VALUE!"},{"$error":"#VALUE!"},{"$error":"#VALUE!"},{"$error":"#VALUE!"},{"$error":"#VALUE!"},{"$error":"#VALUE!"}]
[89,{"$error":"#VALUE!"},{"$error":"#VALUE!"},{"$error":"#VALUE!"},{"$error":"#VALUE!"},{"$error":"#VALUE!"},{"$error":"#VALUE!"},{"$error":"#VALUE!"},{"$error":"#VALUE!"},{"$error":"#VALUE!"}]
[89.2,{"$error":"#VALUE!"},{"$error":"#VALUE!"},{"$error":"#VALUE!"},{"$error":"#VALUE!"},{"$error":"#VALUE!"},{"$error":"#VALUE!"},{"$error":"#VALUE!"},{"$error":"#VALUE!"},{"$error":"#VALUE!"}]
[89.4,{"$error":"#VALUE!"},{"$error":"#VALUE!"},{"$error":"#VALUE!"},{"$error":"#VALUE!"},{"$error":"#VALUE!"},{"$error":"#VALUE!"},{"$error":"#VALUE!"},{"$error":"#VALUE!"},{"$error":"#VALUE!"}]
[89.6,{"$error":"#VALUE!"},{"$f":"IF(AND($C$5>=A468,A468>=$B$5),($D$5^2-(A468-$E$5)^2)^0.5,0)","v":{"$error":"#VALUE!"}},{"$f":"IF(AND($C$6>=A468,A468>=$B$6),($D$6^2-(A468-$E$6)^2)^0.5,0)","v":{"$error":"#VALUE!"}},{"$f":"IF(AND($C$7>=A468,A468>$B$7),($D$7^2-(A468-$E$7)^2)^0.5,0)","v":{"$error":"#VALUE!"}},{"$f":"IF(AND($C$8>=A468,A468>=$B$8),($D$8^2-(A468-$E$8)^2)^0.5,0)","v":{"$error":"#VALUE!"}},{"$f":"IF(AND($C$9>=A468,A468>=$B$9),($D$9^2-(A468-$E$9)^2)^0.5,0)","v":{"$error":"#VALUE!"}},{"$f":"IF(AND($C$10>=A468,A468>=$B$10),($D$10^2-(A468-$E$10)^2)^0.5,0)","v":{"$error":"#VALUE!"}},{"$f":"IF(AND($C$11>=A468,A468>=$B$11),($D$11^2-(A468-$E$11)^2)^0.5,0)","v":{"$error":"#VALUE!"}},{"$error":"#VALUE!"}]
[89.8,{"$f":"$G$15*A469+$G$16","v":{"$error":"#VALUE!"}},{"$error":"#VALUE!"},{"$error":"#VALUE!"},{"$error":"#VALUE!"},{"$error":"#VALUE!"},{"$error":"#VALUE!"},{"$error":"#VALUE!"},{"$error":"#VALUE!"},{"$f":"IF(AND($C$12>=A469,A469>=$B$12),($D$12^2-(A469-$E$12)^2)^0.5,0)","v":{"$error":"#VALUE!"}}]
[{"$f":"A469+0.2","v":90},{"$error":"#VALUE!"},{"$error":"#VALUE!"},{"$error":"#VALUE!"},{"$error":"#VALUE!"},{"$error":"#VALUE!"},{"$error":"#VALUE!"},{"$error":"#VALUE!"},{"$error":"#VALUE!"},{"$error":"#VALUE!"}]
[90.2,{"$error":"#VALUE!"},{"$error":"#VALUE!"},{"$error":"#VALUE!"},{"$error":"#VALUE!"},{"$error":"#VALUE!"},{"$error":"#VALUE!"},{"$error":"#VALUE!"},{"$error":"#VALUE!"},{"$error":"#VALUE!"}]
[90.4,{"$error":"#VALUE!"},{"$error":"#VALUE!"},{"$error":"#VALUE!"},{"$error":"#VALUE!"},{"$error":"#VALUE!"},{"$error":"#VALUE!"},{"$error":"#VALUE!"},{"$error":"#VALUE!"},{"$error":"#VALUE!"}]
[90.6,{"$error":"#VALUE!"},{"$error":"#VALUE!"},{"$error":"#VALUE!"},{"$error":"#VALUE!"},{"$error":"#VALUE!"},{"$error":"#VALUE!"},{"$error":"#VALUE!"},{"$error":"#VALUE!"},{"$error":"#VALUE!"}]
[90.8,{"$error":"#VALUE!"},{"$error":"#VALUE!"},{"$error":"#VALUE!"},{"$error":"#VALUE!"},{"$error":"#VALUE!"},{"$error":"#VALUE!"},{"$error":"#VALUE!"},{"$error":"#VALUE!"},{"$error":"#VALUE!"}]
[91,{"$error":"#VALUE!"},{"$error":"#VALUE!"},{"$error":"#VALUE!"},{"$error":"#VALUE!"},{"$error":"#VALUE!"},{"$error":"#VALUE!"},{"$error":"#VALUE!"},{"$error":"#VALUE!"},{"$error":"#VALUE!"}]
[91.2,{"$error":"#VALUE!"},{"$error":"#VALUE!"},{"$error":"#VALUE!"},{"$error":"#VALUE!"},{"$error":"#VALUE!"},{"$error":"#VALUE!"},{"$error":"#VALUE!"},{"$error":"#VALUE!"},{"$error":"#VALUE!"}]
[91.4,{"$error":"#VALUE!"},{"$error":"#VALUE!"},{"$error":"#VALUE!"},{"$error":"#VALUE!"},{"$error":"#VALUE!"},{"$error":"#VALUE!"},{"$error":"#VALUE!"},{"$error":"#VALUE!"},{"$error":"#VALUE!"}]
[91.6,{"$error":"#VALUE!"},{"$error":"#VALUE!"},{"$error":"#VALUE!"},{"$error":"#VALUE!"},{"$error":"#VALUE!"},{"$error":"#VALUE!"},{"$error":"#VALUE!"},{"$error":"#VALUE!"},{"$error":"#VALUE!"}]
[91.8,{"$error":"#VALUE!"},{"$error":"#VALUE!"},{"$error":"#VALUE!"},{"$error":"#VALUE!"},{"$error":"#VALUE!"},{"$error":"#VALUE!"},{"$error":"#VALUE!"},{"$error":"#VALUE!"},{"$error":"#VALUE!"}]
[92,{"$error":"#VALUE!"},{"$error":"#VALUE!"},{"$error":"#VALUE!"},{"$error":"#VALUE!"},{"$error":"#VALUE!"},{"$error":"#VALUE!"},{"$error":"#VALUE!"},{"$error":"#VALUE!"},{"$error":"#VALUE!"}]
[92.2,{"$error":"#VALUE!"},{"$error":"#VALUE!"},{"$error":"#VALUE!"},{"$error":"#VALUE!"},{"$error":"#VALUE!"},{"$error":"#VALUE!"},{"$error":"#VALUE!"},{"$error":"#VALUE!"},{"$error":"#VALUE!"}]
[92.4,{"$error":"#VALUE!"},{"$error":"#VALUE!"},{"$error":"#VALUE!"},{"$error":"#VALUE!"},{"$error":"#VALUE!"},{"$error":"#VALUE!"},{"$error":"#VALUE!"},{"$error":"#VALUE!"},{"$error":"#VALUE!"}]
[92.6,{"$error":"#VALUE!"},{"$error":"#VALUE!"},{"$error":"#VALUE!"},{"$error":"#VALUE!"},{"$error":"#VALUE!"},{"$error":"#VALUE!"},{"$error":"#VALUE!"},{"$error":"#VALUE!"},{"$error":"#VALUE!"}]
[92.8,{"$error":"#VALUE!"},{"$error":"#VALUE!"},{"$error":"#VALUE!"},{"$error":"#VALUE!"},{"$error":"#VALUE!"},{"$error":"#VALUE!"},{"$error":"#VALUE!"},{"$error":"#VALUE!"},{"$error":"#VALUE!"}]
[93,{"$error":"#VALUE!"},{"$error":"#VALUE!"},{"$error":"#VALUE!"},{"$error":"#VALUE!"},{"$error":"#VALUE!"},{"$error":"#VALUE!"},{"$error":"#VALUE!"},{"$error":"#VALUE!"},{"$error":"#VALUE!"}]
[93.2,{"$error":"#VALUE!"},{"$error":"#VALUE!"},{"$error":"#VALUE!"},{"$error":"#VALUE!"},{"$error":"#VALUE!"},{"$error":"#VALUE!"},{"$error":"#VALUE!"},{"$error":"#VALUE!"},{"$error":"#VALUE!"}]
[93.4,{"$error":"#VALUE!"},{"$error":"#VALUE!"},{"$error":"#VALUE!"},{"$error":"#VALUE!"},{"$error":"#VALUE!"},{"$error":"#VALUE!"},{"$error":"#VALUE!"},{"$error":"#VALUE!"},{"$error":"#VALUE!"}]
[93.6,{"$error":"#VALUE!"},{"$error":"#VALUE!"},{"$error":"#VALUE!"},{"$error":"#VALUE!"},{"$error":"#VALUE!"},{"$error":"#VALUE!"},{"$error":"#VALUE!"},{"$error":"#VALUE!"},{"$error":"#VALUE!"}]
[93.8,{"$error":"#VALUE!"},{"$error":"#VALUE!"},{"$error":"#VALUE!"},{"$error":"#VALUE!"},{"$error":"#VALUE!"},{"$error":"#VALUE!"},{"$error":"#VALUE!"},{"$error":"#VALUE!"},{"$error":"#VALUE!"}]
[94,{"$error":"#VALUE!"},{"$error":"#VALUE!"},{"$error":"#VALUE!"},{"$error":"#VALUE!"},{"$error":"#VALUE!"},{"$error":"#VALUE!"},{"$error":"#VALUE!"},{"$error":"#VALUE!"},{"$error":"#VALUE!"}]
[94.2,{"$error":"#VALUE!"},{"$error":"#VALUE!"},{"$error":"#VALUE!"},{"$error":"#VALUE!"},{"$error":"#VALUE!"},{"$error":"#VALUE!"},{"$error":"#VALUE!"},{"$error":"#VALUE!"},{"$error":"#VALUE!"}]
[94.4,{"$error":"#VALUE!"},{"$error":"#VALUE!"},{"$error":"#VALUE!"},{"$error":"#VALUE!"},{"$error":"#VALUE!"},{"$error":"#VALUE!"},{"$error":"#VALUE!"},{"$error":"#VALUE!"},{"$error":"#VALUE!"}]
[94.6,{"$error":"#VALUE!"},{"$error":"#VALUE!"},{"$error":"#VALUE!"},{"$error":"#VALUE!"},{"$error":"#VALUE!"},{"$error":"#VALUE!"},{"$error":"#VALUE!"},{"$error":"#VALUE!"},{"$error":"#VALUE!"}]
[94.8,{"$error":"#VALUE!"},{"$error":"#VALUE!"},{"$error":"#VALUE!"},{"$error":"#VALUE!"},{"$error":"#VALUE!"},{"$error":"#VALUE!"},{"$error":"#VALUE!"},{"$error":"#VALUE!"},{"$error":"#VALUE!"}]
[95,{"$error":"#VALUE!"},{"$error":"#VALUE!"},{"$error":"#VALUE!"},{"$error":"#VALUE!"},{"$error":"#VALUE!"},{"$error":"#VALUE!"},{"$error":"#VALUE!"},{"$error":"#VALUE!"},{"$error":"#VALUE!"}]
[95.2,{"$error":"#VALUE!"},{"$error":"#VALUE!"},{"$error":"#VALUE!"},{"$error":"#VALUE!"},{"$error":"#VALUE!"},{"$error":"#VALUE!"},{"$error":"#VALUE!"},{"$error":"#VALUE!"},{"$error":"#VALUE!"}]
[95.4,{"$error":"#VALUE!"},{"$error":"#VALUE!"},{"$error":"#VALUE!"},{"$error":"#VALUE!"},{"$error":"#VALUE!"},{"$error":"#VALUE!"},{"$error":"#VALUE!"},{"$error":"#VALUE!"},{"$error":"#VALUE!"}]
[95.6,{"$error":"#VALUE!"},{"$error":"#VALUE!"},{"$error":"#VALUE!"},{"$error":"#VALUE!"},{"$error":"#VALUE!"},{"$error":"#VALUE!"},{"$error":"#VALUE!"},{"$error":"#VALUE!"},{"$error":"#VALUE!"}]
[95.8,{"$error":"#VALUE!"},{"$error":"#VALUE!"},{"$error":"#VALUE!"},{"$error":"#VALUE!"},{"$error":"#VALUE!"},{"$error":"#VALUE!"},{"$error":"#VALUE!"},{"$error":"#VALUE!"},{"$error":"#VALUE!"}]
[96,{"$error":"#VALUE!"},{"$error":"#VALUE!"},{"$error":"#VALUE!"},{"$error":"#VALUE!"},{"$error":"#VALUE!"},{"$error":"#VALUE!"},{"$error":"#VALUE!"},{"$error":"#VALUE!"},{"$error":"#VALUE!"}]
[96.2,{"$error":"#VALUE!"},{"$error":"#VALUE!"},{"$error":"#VALUE!"},{"$error":"#VALUE!"},{"$error":"#VALUE!"},{"$error":"#VALUE!"},{"$error":"#VALUE!"},{"$error":"#VALUE!"},{"$error":"#VALUE!"}]
[96.4,{"$error":"#VALUE!"},{"$error":"#VALUE!"},{"$error":"#VALUE!"},{"$error":"#VALUE!"},{"$error":"#VALUE!"},{"$error":"#VALUE!"},{"$error":"#VALUE!"},{"$error":"#VALUE!"},{"$error":"#VALUE!"}]
[96.6,{"$error":"#VALUE!"},{"$error":"#VALUE!"},{"$error":"#VALUE!"},{"$error":"#VALUE!"},{"$error":"#VALUE!"},{"$error":"#VALUE!"},{"$error":"#VALUE!"},{"$error":"#VALUE!"},{"$error":"#VALUE!"}]
[96.8,{"$error":"#VALUE!"},{"$error":"#VALUE!"},{"$error":"#VALUE!"},{"$error":"#VALUE!"},{"$error":"#VALUE!"},{"$error":"#VALUE!"},{"$error":"#VALUE!"},{"$error":"#VALUE!"},{"$error":"#VALUE!"}]
[97,{"$error":"#VALUE!"},{"$error":"#VALUE!"},{"$error":"#VALUE!"},{"$error":"#VALUE!"},{"$error":"#VALUE!"},{"$error":"#VALUE!"},{"$error":"#VALUE!"},{"$error":"#VALUE!"},{"$error":"#VALUE!"}]
[97.2,{"$error":"#VALUE!"},{"$error":"#VALUE!"},{"$error":"#VALUE!"},{"$error":"#VALUE!"},{"$error":"#VALUE!"},{"$error":"#VALUE!"},{"$error":"#VALUE!"},{"$error":"#VALUE!"},{"$error":"#VALUE!"}]
[97.4,{"$error":"#VALUE!"},{"$error":"#VALUE!"},{"$error":"#VALUE!"},{"$error":"#VALUE!"},{"$error":"#VALUE!"},{"$error":"#VALUE!"},{"$error":"#VALUE!"},{"$error":"#VALUE!"},{"$error":"#VALUE!"}]
[97.6,{"$error":"#VALUE!"},{"$error":"#VALUE!"},{"$error":"#VALUE!"},{"$error":"#VALUE!"},{"$error":"#VALUE!"},{"$error":"#VALUE!"},{"$error":"#VALUE!"},{"$error":"#VALUE!"},{"$error":"#VALUE!"}]
[97.8,{"$error":"#VALUE!"},{"$error":"#VALUE!"},{"$error":"#VALUE!"},{"$error":"#VALUE!"},{"$error":"#VALUE!"},{"$error":"#VALUE!"},{"$error":"#VALUE!"},{"$error":"#VALUE!"},{"$error":"#VALUE!"}]
[98,{"$error":"#VALUE!"},{"$error":"#VALUE!"},{"$error":"#VALUE!"},{"$error":"#VALUE!"},{"$error":"#VALUE!"},{"$error":"#VALUE!"},{"$error":"#VALUE!"},{"$error":"#VALUE!"},{"$error":"#VALUE!"}]
[98.2,{"$error":"#VALUE!"},{"$error":"#VALUE!"},{"$error":"#VALUE!"},{"$error":"#VALUE!"},{"$error":"#VALUE!"},{"$error":"#VALUE!"},{"$error":"#VALUE!"},{"$error":"#VALUE!"},{"$error":"#VALUE!"}]
[98.4,{"$error":"#VALUE!"},{"$error":"#VALUE!"},{"$error":"#VALUE!"},{"$error":"#VALUE!"},{"$error":"#VALUE!"},{"$error":"#VALUE!"},{"$error":"#VALUE!"},{"$error":"#VALUE!"},{"$error":"#VALUE!"}]
[98.6,{"$error":"#VALUE!"},{"$error":"#VALUE!"},{"$error":"#VALUE!"},{"$error":"#VALUE!"},{"$error":"#VALUE!"},{"$error":"#VALUE!"},{"$error":"#VALUE!"},{"$error":"#VALUE!"},{"$error":"#VALUE!"}]
[98.8,{"$error":"#VALUE!"},{"$error":"#VALUE!"},{"$error":"#VALUE!"},{"$error":"#VALUE!"},{"$error":"#VALUE!"},{"$error":"#VALUE!"},{"$error":"#VALUE!"},{"$error":"#VALUE!"},{"$error":"#VALUE!"}]
[99,{"$error":"#VALUE!"},{"$error":"#VALUE!"},{"$error":"#VALUE!"},{"$error":"#VALUE!"},{"$error":"#VALUE!"},{"$error":"#VALUE!"},{"$error":"#VALUE!"},{"$error":"#VALUE!"},{"$error":"#VALUE!"}]
[99.2,{"$error":"#VALUE!"},{"$error":"#VALUE!"},{"$error":"#VALUE!"},{"$error":"#VALUE!"},{"$error":"#VALUE!"},{"$error":"#VALUE!"},{"$error":"#VALUE!"},{"$error":"#VALUE!"},{"$error":"#VALUE!"}]
[99.4,{"$error":"#VALUE!"},{"$error":"#VALUE!"},{"$error":"#VALUE!"},{"$error":"#VALUE!"},{"$error":"#VALUE!"},{"$error":"#VALUE!"},{"$error":"#VALUE!"},{"$error":"#VALUE!"},{"$error":"#VALUE!"}]
[99.6,{"$error":"#VALUE!"},{"$error":"#VALUE!"},{"$error":"#VALUE!"},{"$error":"#VALUE!"},{"$error":"#VALUE!"},{"$error":"#VALUE!"},{"$error":"#VALUE!"},{"$error":"#VALUE!"},{"$error":"#VALUE!"}]
[99.8,{"$error":"#VALUE!"},{"$error":"#VALUE!"},{"$error":"#VALUE!"},{"$error":"#VALUE!"},{"$error":"#VALUE!"},{"$error":"#VALUE!"},{"$error":"#VALUE!"},{"$error":"#VALUE!"},{"$error":"#VALUE!"}]
[100,{"$error":"#VALUE!"},{"$error":"#VALUE!"},{"$error":"#VALUE!"},{"$error":"#VALUE!"},{"$error":"#VALUE!"},{"$error":"#VALUE!"},{"$error":"#VALUE!"},{"$error":"#VALUE!"},{"$error":"#VALUE!"}]
[100.2,{"$error":"#VALUE!"},{"$error":"#VALUE!"},{"$error":"#VALUE!"},{"$error":"#VALUE!"},{"$error":"#VALUE!"},{"$error":"#VALUE!"},{"$error":"#VALUE!"},{"$error":"#VALUE!"},{"$error":"#VALUE!"}]
[100.4,{"$error":"#VALUE!"},{"$error":"#VALUE!"},{"$error":"#VALUE!"},{"$error":"#VALUE!"},{"$error":"#VALUE!"},{"$error":"#VALUE!"},{"$error":"#VALUE!"},{"$error":"#VALUE!"},{"$error":"#VALUE!"}]
[100.6,{"$error":"#VALUE!"},{"$error":"#VALUE!"},{"$error":"#VALUE!"},{"$error":"#VALUE!"},{"$error":"#VALUE!"},{"$error":"#VALUE!"},{"$error":"#VALUE!"},{"$error":"#VALUE!"},{"$error":"#VALUE!"}]
[100.8,{"$error":"#VALUE!"},{"$error":"#VALUE!"},{"$error":"#VALUE!"},{"$error":"#VALUE!"},{"$error":"#VALUE!"},{"$error":"#VALUE!"},{"$error":"#VALUE!"},{"$error":"#VALUE!"},{"$error":"#VALUE!"}]
[101,{"$error":"#VALUE!"},{"$error":"#VALUE!"},{"$error":"#VALUE!"},{"$error":"#VALUE!"},{"$error":"#VALUE!"},{"$error":"#VALUE!"},{"$error":"#VALUE!"},{"$error":"#VALUE!"},{"$error":"#VALUE!"}]
[101.2,{"$error":"#VALUE!"},{"$error":"#VALUE!"},{"$error":"#VALUE!"},{"$error":"#VALUE!"},{"$error":"#VALUE!"},{"$error":"#VALUE!"},{"$error":"#VALUE!"},{"$error":"#VALUE!"},{"$error":"#VALUE!"}]
[101.4,{"$error":"#VALUE!"},{"$error":"#VALUE!"},{"$error":"#VALUE!"},{"$error":"#VALUE!"},{"$error":"#VALUE!"},{"$error":"#VALUE!"},{"$error":"#VALUE!"},{"$error":"#VALUE!"},{"$error":"#VALUE!"}]
[101.6,{"$error":"#VALUE!"},{"$error":"#VALUE!"},{"$error":"#VALUE!"},{"$error":"#VALUE!"},{"$error":"#VALUE!"},{"$error":"#VALUE!"},{"$error":"#VALUE!"},{"$error":"#VALUE!"},{"$error":"#VALUE!"}]
[101.8,{"$error":"#VALUE!"},{"$error":"#VALUE!"},{"$error":"#VALUE!"},{"$error":"#VALUE!"},{"$error":"#VALUE!"},{"$error":"#VALUE!"},{"$error":"#VALUE!"},{"$error":"#VALUE!"},{"$error":"#VALUE!"}]
[102,{"$error":"#VALUE!"},{"$error":"#VALUE!"},{"$error":"#VALUE!"},{"$error":"#VALUE!"},{"$error":"#VALUE!"},{"$error":"#VALUE!"},{"$error":"#VALUE!"},{"$error":"#VALUE!"},{"$error":"#VALUE!"}]
[102.2,{"$error":"#VALUE!"},{"$error":"#VALUE!"},{"$error":"#VALUE!"},{"$error":"#VALUE!"},{"$error":"#VALUE!"},{"$error":"#VALUE!"},{"$error":"#VALUE!"},{"$error":"#VALUE!"},{"$error":"#VALUE!"}]
[102.4,{"$error":"#VALUE!"},{"$f":"IF(AND($C$5>=A532,A532>=$B$5),($D$5^2-(A532-$E$5)^2)^0.5,0)","v":{"$error":"#VALUE!"}},{"$f":"IF(AND($C$6>=A532,A532>=$B$6),($D$6^2-(A532-$E$6)^2)^0.5,0)","v":{"$error":"#VALUE!"}},{"$f":"IF(AND($C$7>=A532,A532>$B$7),($D$7^2-(A532-$E$7)^2)^0.5,0)","v":{"$error":"#VALUE!"}},{"$f":"IF(AND($C$8>=A532,A532>=$B$8),($D$8^2-(A532-$E$8)^2)^0.5,0)","v":{"$error":"#VALUE!"}},{"$f":"IF(AND($C$9>=A532,A532>=$B$9),($D$9^2-(A532-$E$9)^2)^0.5,0)","v":{"$error":"#VALUE!"}},{"$f":"IF(AND($C$10>=A532,A532>=$B$10),($D$10^2-(A532-$E$10)^2)^0.5,0)","v":{"$error":"#VALUE!"}},{"$f":"IF(AND($C$11>=A532,A532>=$B$11),($D$11^2-(A532-$E$11)^2)^0.5,0)","v":{"$error":"#VALUE!"}},{"$error":"#VALUE!"}]
[102.6,{"$f":"$G$15*A533+$G$16","v":{"$error":"#VALUE!"}},{"$error":"#VALUE!"},{"$error":"#VALUE!"},{"$error":"#VALUE!"},{"$error":"#VALUE!"},{"$error":"#VALUE!"},{"$error":"#VALUE!"},{"$error":"#VALUE!"},{"$f":"IF(AND($C$12>=A533,A533>=$B$12),($D$12^2-(A533-$E$12)^2)^0.5,0)","v":{"$error":"#VALUE!"}}]
[{"$f":"A533+0.2","v":102.8},{"$error":"#VALUE!"},{"$error":"#VALUE!"},{"$error":"#VALUE!"},{"$error":"#VALUE!"},{"$error":"#VALUE!"},{"$error":"#VALUE!"},{"$error":"#VALUE!"},{"$error":"#VALUE!"},{"$error":"#VALUE!"}]
[103,{"$error":"#VALUE!"},{"$error":"#VALUE!"},{"$error":"#VALUE!"},{"$error":"#VALUE!"},{"$error":"#VALUE!"},{"$error":"#VALUE!"},{"$error":"#VALUE!"},{"$error":"#VALUE!"},{"$error":"#VALUE!"}]
[103.2,{"$error":"#VALUE!"},{"$error":"#VALUE!"},{"$error":"#VALUE!"},{"$error":"#VALUE!"},{"$error":"#VALUE!"},{"$error":"#VALUE!"},{"$error":"#VALUE!"},{"$error":"#VALUE!"},{"$error":"#VALUE!"}]
[103.4,{"$error":"#VALUE!"},{"$error":"#VALUE!"},{"$error":"#VALUE!"},{"$error":"#VALUE!"},{"$error":"#VALUE!"},{"$error":"#VALUE!"},{"$error":"#VALUE!"},{"$error":"#VALUE!"},{"$error":"#VALUE!"}]
[103.6,{"$error":"#VALUE!"},{"$error":"#VALUE!"},{"$error":"#VALUE!"},{"$error":"#VALUE!"},{"$error":"#VALUE!"},{"$error":"#VALUE!"},{"$error":"#VALUE!"},{"$error":"#VALUE!"},{"$error":"#VALUE!"}]
[103.8,{"$error":"#VALUE!"},{"$error":"#VALUE!"},{"$error":"#VALUE!"},{"$error":"#VALUE!"},{"$error":"#VALUE!"},{"$error":"#VALUE!"},{"$error":"#VALUE!"},{"$error":"#VALUE!"},{"$error":"#VALUE!"}]
[104,{"$error":"#VALUE!"},{"$error":"#VALUE!"},{"$error":"#VALUE!"},{"$error":"#VALUE!"},{"$error":"#VALUE!"},{"$error":"#VALUE!"},{"$error":"#VALUE!"},{"$error":"#VALUE!"},{"$error":"#VALUE!"}]
[104.2,{"$error":"#VALUE!"},{"$error":"#VALUE!"},{"$error":"#VALUE!"},{"$error":"#VALUE!"},{"$error":"#VALUE!"},{"$error":"#VALUE!"},{"$error":"#VALUE!"},{"$error":"#VALUE!"},{"$error":"#VALUE!"}]
[104.4,{"$error":"#VALUE!"},{"$error":"#VALUE!"},{"$error":"#VALUE!"},{"$error":"#VALUE!"},{"$error":"#VALUE!"},{"$error":"#VALUE!"},{"$error":"#VALUE!"},{"$error":"#VALUE!"},{"$error":"#VALUE!"}]
[104.6,{"$error":"#VALUE!"},{"$error":"#VALUE!"},{"$error":"#VALUE!"},{"$error":"#VALUE!"},{"$error":"#VALUE!"},{"$error":"#VALUE!"},{"$error":"#VALUE!"},{"$error":"#VALUE!"},{"$error":"#VALUE!"}]
[104.8,{"$error":"#VALUE!"},{"$error":"#VALUE!"},{"$error":"#VALUE!"},{"$error":"#VALUE!"},{"$error":"#VALUE!"},{"$error":"#VALUE!"},{"$error":"#VALUE!"},{"$error":"#VALUE!"},{"$error":"#VALUE!"}]
[105,{"$error":"#VALUE!"},{"$error":"#VALUE!"},{"$error":"#VALUE!"},{"$error":"#VALUE!"},{"$error":"#VALUE!"},{"$error":"#VALUE!"},{"$error":"#VALUE!"},{"$error":"#VALUE!"},{"$error":"#VALUE!"}]
[105.2,{"$error":"#VALUE!"},{"$error":"#VALUE!"},{"$error":"#VALUE!"},{"$error":"#VALUE!"},{"$error":"#VALUE!"},{"$error":"#VALUE!"},{"$error":"#VALUE!"},{"$error":"#VALUE!"},{"$error":"#VALUE!"}]
[105.4,{"$error":"#VALUE!"},{"$error":"#VALUE!"},{"$error":"#VALUE!"},{"$error":"#VALUE!"},{"$error":"#VALUE!"},{"$error":"#VALUE!"},{"$error":"#VALUE!"},{"$error":"#VALUE!"},{"$error":"#VALUE!"}]
[105.6,{"$error":"#VALUE!"},{"$error":"#VALUE!"},{"$error":"#VALUE!"},{"$error":"#VALUE!"},{"$error":"#VALUE!"},{"$error":"#VALUE!"},{"$error":"#VALUE!"},{"$error":"#VALUE!"},{"$error":"#VALUE!"}]
[105.8,{"$error":"#VALUE!"},{"$error":"#VALUE!"},{"$error":"#VALUE!"},{"$error":"#VALUE!"},{"$error":"#VALUE!"},{"$error":"#VALUE!"},{"$error":"#VALUE!"},{"$error":"#VALUE!"},{"$error":"#VALUE!"}]
[106,{"$error":"#VALUE!"},{"$error":"#VALUE!"},{"$error":"#VALUE!"},{"$error":"#VALUE!"},{"$error":"#VALUE!"},{"$error":"#VALUE!"},{"$error":"#VALUE!"},{"$error":"#VALUE!"},{"$error":"#VALUE!"}]
[106.2,{"$error":"#VALUE!"},{"$error":"#VALUE!"},{"$error":"#VALUE!"},{"$error":"#VALUE!"},{"$error":"#VALUE!"},{"$error":"#VALUE!"},{"$error":"#VALUE!"},{"$error":"#VALUE!"},{"$error":"#VALUE!"}]
[106.4,{"$error":"#VALUE!"},{"$error":"#VALUE!"},{"$error":"#VALUE!"},{"$error":"#VALUE!"},{"$error":"#VALUE!"},{"$error":"#VALUE!"},{"$error":"#VALUE!"},{"$error":"#VALUE!"},{"$error":"#VALUE!"}]
[106.6,{"$error":"#VALUE!"},{"$error":"#VALUE!"},{"$error":"#VALUE!"},{"$error":"#VALUE!"},{"$error":"#VALUE!"},{"$error":"#VALUE!"},{"$error":"#VALUE!"},{"$error":"#VALUE!"},{"$error":"#VALUE!"}]
[106.8,{"$error":"#VALUE!"},{"$error":"#VALUE!"},{"$error":"#VALUE!"},{"$error":"#VALUE!"},{"$error":"#VALUE!"},{"$error":"#VALUE!"},{"$error":"#VALUE!"},{"$error":"#VALUE!"},{"$error":"#VALUE!"}]
[107,{"$error":"#VALUE!"},{"$error":"#VALUE!"},{"$error":"#VALUE!"},{"$error":"#VALUE!"},{"$error":"#VALUE!"},{"$error":"#VALUE!"},{"$error":"#VALUE!"},{"$error":"#VALUE!"},{"$error":"#VALUE!"}]
[107.2,{"$error":"#VALUE!"},{"$error":"#VALUE!"},{"$error":"#VALUE!"},{"$error":"#VALUE!"},{"$error":"#VALUE!"},{"$error":"#VALUE!"},{"$error":"#VALUE!"},{"$error":"#VALUE!"},{"$error":"#VALUE!"}]
[107.4,{"$error":"#VALUE!"},{"$error":"#VALUE!"},{"$error":"#VALUE!"},{"$error":"#VALUE!"},{"$error":"#VALUE!"},{"$error":"#VALUE!"},{"$error":"#VALUE!"},{"$error":"#VALUE!"},{"$error":"#VALUE!"}]
[107.6,{"$error":"#VALUE!"},{"$error":"#VALUE!"},{"$error":"#VALUE!"},{"$error":"#VALUE!"},{"$error":"#VALUE!"},{"$error":"#VALUE!"},{"$error":"#VALUE!"},{"$error":"#VALUE!"},{"$error":"#VALUE!"}]
[107.8,{"$error":"#VALUE!"},{"$error":"#VALUE!"},{"$error":"#VALUE!"},{"$error":"#VALUE!"},{"$error":"#VALUE!"},{"$error":"#VALUE!"},{"$error":"#VALUE!"},{"$error":"#VALUE!"},{"$error":"#VALUE!"}]
[108,{"$error":"#VALUE!"},{"$error":"#VALUE!"},{"$error":"#VALUE!"},{"$error":"#VALUE!"},{"$error":"#VALUE!"},{"$error":"#VALUE!"},{"$error":"#VALUE!"},{"$error":"#VALUE!"},{"$error":"#VALUE!"}]
[108.2,{"$error":"#VALUE!"},{"$error":"#VALUE!"},{"$error":"#VALUE!"},{"$error":"#VALUE!"},{"$error":"#VALUE!"},{"$error":"#VALUE!"},{"$error":"#VALUE!"},{"$error":"#VALUE!"},{"$error":"#VALUE!"}]
[108.4,{"$error":"#VALUE!"},{"$error":"#VALUE!"},{"$error":"#VALUE!"},{"$error":"#VALUE!"},{"$error":"#VALUE!"},{"$error":"#VALUE!"},{"$error":"#VALUE!"},{"$error":"#VALUE!"},{"$error":"#VALUE!"}]
[108.6,{"$error":"#VALUE!"},{"$error":"#VALUE!"},{"$error":"#VALUE!"},{"$error":"#VALUE!"},{"$error":"#VALUE!"},{"$error":"#VALUE!"},{"$error":"#VALUE!"},{"$error":"#VALUE!"},{"$error":"#VALUE!"}]
[108.8,{"$error":"#VALUE!"},{"$error":"#VALUE!"},{"$error":"#VALUE!"},{"$error":"#VALUE!"},{"$error":"#VALUE!"},{"$error":"#VALUE!"},{"$error":"#VALUE!"},{"$error":"#VALUE!"},{"$error":"#VALUE!"}]
[109,{"$error":"#VALUE!"},{"$error":"#VALUE!"},{"$error":"#VALUE!"},{"$error":"#VALUE!"},{"$error":"#VALUE!"},{"$error":"#VALUE!"},{"$error":"#VALUE!"},{"$error":"#VALUE!"},{"$error":"#VALUE!"}]
[109.2,{"$error":"#VALUE!"},{"$error":"#VALUE!"},{"$error":"#VALUE!"},{"$error":"#VALUE!"},{"$error":"#VALUE!"},{"$error":"#VALUE!"},{"$error":"#VALUE!"},{"$error":"#VALUE!"},{"$error":"#VALUE!"}]
[109.4,{"$error":"#VALUE!"},{"$error":"#VALUE!"},{"$error":"#VALUE!"},{"$error":"#VALUE!"},{"$error":"#VALUE!"},{"$error":"#VALUE!"},{"$error":"#VALUE!"},{"$error":"#VALUE!"},{"$error":"#VALUE!"}]
[109.6,{"$error":"#VALUE!"},{"$error":"#VALUE!"},{"$error":"#VALUE!"},{"$error":"#VALUE!"},{"$error":"#VALUE!"},{"$error":"#VALUE!"},{"$error":"#VALUE!"},{"$error":"#VALUE!"},{"$error":"#VALUE!"}]
[109.8,{"$error":"#VALUE!"},{"$error":"#VALUE!"},{"$error":"#VALUE!"},{"$error":"#VALUE!"},{"$error":"#VALUE!"},{"$error":"#VALUE!"},{"$error":"#VALUE!"},{"$error":"#VALUE!"},{"$error":"#VALUE!"}]
[110,{"$error":"#VALUE!"},{"$error":"#VALUE!"},{"$error":"#VALUE!"},{"$error":"#VALUE!"},{"$error":"#VALUE!"},{"$error":"#VALUE!"},{"$error":"#VALUE!"},{"$error":"#VALUE!"},{"$error":"#VALUE!"}]
[110.2,{"$error":"#VALUE!"},{"$error":"#VALUE!"},{"$error":"#VALUE!"},{"$error":"#VALUE!"},{"$error":"#VALUE!"},{"$error":"#VALUE!"},{"$error":"#VALUE!"},{"$error":"#VALUE!"},{"$error":"#VALUE!"}]
[110.4,{"$error":"#VALUE!"},{"$error":"#VALUE!"},{"$error":"#VALUE!"},{"$error":"#VALUE!"},{"$error":"#VALUE!"},{"$error":"#VALUE!"},{"$error":"#VALUE!"},{"$error":"#VALUE!"},{"$error":"#VALUE!"}]
[110.6,{"$error":"#VALUE!"},{"$error":"#VALUE!"},{"$error":"#VALUE!"},{"$error":"#VALUE!"},{"$error":"#VALUE!"},{"$error":"#VALUE!"},{"$error":"#VALUE!"},{"$error":"#VALUE!"},{"$error":"#VALUE!"}]
[110.8,{"$error":"#VALUE!"},{"$error":"#VALUE!"},{"$error":"#VALUE!"},{"$error":"#VALUE!"},{"$error":"#VALUE!"},{"$error":"#VALUE!"},{"$error":"#VALUE!"},{"$error":"#VALUE!"},{"$error":"#VALUE!"}]
[111,{"$error":"#VALUE!"},{"$error":"#VALUE!"},{"$error":"#VALUE!"},{"$error":"#VALUE!"},{"$error":"#VALUE!"},{"$error":"#VALUE!"},{"$error":"#VALUE!"},{"$error":"#VALUE!"},{"$error":"#VALUE!"}]
[111.2,{"$error":"#VALUE!"},{"$error":"#VALUE!"},{"$error":"#VALUE!"},{"$error":"#VALUE!"},{"$error":"#VALUE!"},{"$error":"#VALUE!"},{"$error":"#VALUE!"},{"$error":"#VALUE!"},{"$error":"#VALUE!"}]
[111.4,{"$error":"#VALUE!"},{"$error":"#VALUE!"},{"$error":"#VALUE!"},{"$error":"#VALUE!"},{"$error":"#VALUE!"},{"$error":"#VALUE!"},{"$error":"#VALUE!"},{"$error":"#VALUE!"},{"$error":"#VALUE!"}]
[111.6,{"$error":"#VALUE!"},{"$error":"#VALUE!"},{"$error":"#VALUE!"},{"$error":"#VALUE!"},{"$error":"#VALUE!"},{"$error":"#VALUE!"},{"$error":"#VALUE!"},{"$error":"#VALUE!"},{"$error":"#VALUE!"}]
[111.8,{"$error":"#VALUE!"},{"$error":"#VALUE!"},{"$error":"#VALUE!"},{"$error":"#VALUE!"},{"$error":"#VALUE!"},{"$error":"#VALUE!"},{"$error":"#VALUE!"},{"$error":"#VALUE!"},{"$error":"#VALUE!"}]
[112,{"$error":"#VALUE!"},{"$error":"#VALUE!"},{"$error":"#VALUE!"},{"$error":"#VALUE!"},{"$error":"#VALUE!"},{"$error":"#VALUE!"},{"$error":"#VALUE!"},{"$error":"#VALUE!"},{"$error":"#VALUE!"}]
[112.2,{"$error":"#VALUE!"},{"$error":"#VALUE!"},{"$error":"#VALUE!"},{"$error":"#VALUE!"},{"$error":"#VALUE!"},{"$error":"#VALUE!"},{"$error":"#VALUE!"},{"$error":"#VALUE!"},{"$error":"#VALUE!"}]
[112.4,{"$error":"#VALUE!"},{"$error":"#VALUE!"},{"$error":"#VALUE!"},{"$error":"#VALUE!"},{"$error":"#VALUE!"},{"$error":"#VALUE!"},{"$error":"#VALUE!"},{"$error":"#VALUE!"},{"$error":"#VALUE!"}]
[112.6,{"$error":"#VALUE!"},{"$error":"#VALUE!"},{"$error":"#VALUE!"},{"$error":"#VALUE!"},{"$error":"#VALUE!"},{"$error":"#VALUE!"},{"$error":"#VALUE!"},{"$error":"#VALUE!"},{"$error":"#VALUE!"}]
[112.8,{"$error":"#VALUE!"},{"$error":"#VALUE!"},{"$error":"#VALUE!"},{"$error":"#VALUE!"},{"$error":"#VALUE!"},{"$error":"#VALUE!"},{"$error":"#VALUE!"},{"$error":"#VALUE!"},{"$error":"#VALUE!"}]
[113,{"$error":"#VALUE!"},{"$error":"#VALUE!"},{"$error":"#VALUE!"},{"$error":"#VALUE!"},{"$error":"#VALUE!"},{"$error":"#VALUE!"},{"$error":"#VALUE!"},{"$error":"#VALUE!"},{"$error":"#VALUE!"}]
[113.2,{"$error":"#VALUE!"},{"$error":"#VALUE!"},{"$error":"#VALUE!"},{"$error":"#VALUE!"},{"$error":"#VALUE!"},{"$error":"#VALUE!"},{"$error":"#VALUE!"},{"$error":"#VALUE!"},{"$error":"#VALUE!"}]
[113.4,{"$error":"#VALUE!"},{"$error":"#VALUE!"},{"$error":"#VALUE!"},{"$error":"#VALUE!"},{"$error":"#VALUE!"},{"$error":"#VALUE!"},{"$error":"#VALUE!"},{"$error":"#VALUE!"},{"$error":"#VALUE!"}]
[113.6,{"$error":"#VALUE!"},{"$error":"#VALUE!"},{"$error":"#VALUE!"},{"$error":"#VALUE!"},{"$error":"#VALUE!"},{"$error":"#VALUE!"},{"$error":"#VALUE!"},{"$error":"#VALUE!"},{"$error":"#VALUE!"}]
[113.8,{"$error":"#VALUE!"},{"$error":"#VALUE!"},{"$error":"#VALUE!"},{"$error":"#VALUE!"},{"$error":"#VALUE!"},{"$error":"#VALUE!"},{"$error":"#VALUE!"},{"$error":"#VALUE!"},{"$error":"#VALUE!"}]
[114,{"$error":"#VALUE!"},{"$error":"#VALUE!"},{"$error":"#VALUE!"},{"$error":"#VALUE!"},{"$error":"#VALUE!"},{"$error":"#VALUE!"},{"$error":"#VALUE!"},{"$error":"#VALUE!"},{"$error":"#VALUE!"}]
[114.2,{"$error":"#VALUE!"},{"$error":"#VALUE!"},{"$error":"#VALUE!"},{"$error":"#VALUE!"},{"$error":"#VALUE!"},{"$error":"#VALUE!"},{"$error":"#VALUE!"},{"$error":"#VALUE!"},{"$error":"#VALUE!"}]
[114.4,{"$error":"#VALUE!"},{"$error":"#VALUE!"},{"$error":"#VALUE!"},{"$error":"#VALUE!"},{"$error":"#VALUE!"},{"$error":"#VALUE!"},{"$error":"#VALUE!"},{"$error":"#VALUE!"},{"$error":"#VALUE!"}]
[114.6,{"$error":"#VALUE!"},{"$error":"#VALUE!"},{"$error":"#VALUE!"},{"$error":"#VALUE!"},{"$error":"#VALUE!"},{"$error":"#VALUE!"},{"$error":"#VALUE!"},{"$error":"#VALUE!"},{"$error":"#VALUE!"}]
[114.8,{"$error":"#VALUE!"},{"$error":"#VALUE!"},{"$error":"#VALUE!"},{"$error":"#VALUE!"},{"$error":"#VALUE!"},{"$error":"#VALUE!"},{"$error":"#VALUE!"},{"$error":"#VALUE!"},{"$error":"#VALUE!"}]
[115,{"$error":"#VALUE!"},{"$error":"#VALUE!"},{"$error":"#VALUE!"},{"$error":"#VALUE!"},{"$error":"#VALUE!"},{"$error":"#VALUE!"},{"$error":"#VALUE!"},{"$error":"#VALUE!"},{"$error":"#VALUE!"}]
[115.2,{"$error":"#VALUE!"},{"$f":"IF(AND($C$5>=A596,A596>=$B$5),($D$5^2-(A596-$E$5)^2)^0.5,0)","v":{"$error":"#VALUE!"}},{"$f":"IF(AND($C$6>=A596,A596>=$B$6),($D$6^2-(A596-$E$6)^2)^0.5,0)","v":{"$error":"#VALUE!"}},{"$f":"IF(AND($C$7>=A596,A596>$B$7),($D$7^2-(A596-$E$7)^2)^0.5,0)","v":{"$error":"#VALUE!"}},{"$f":"IF(AND($C$8>=A596,A596>=$B$8),($D$8^2-(A596-$E$8)^2)^0.5,0)","v":{"$error":"#VALUE!"}},{"$f":"IF(AND($C$9>=A596,A596>=$B$9),($D$9^2-(A596-$E$9)^2)^0.5,0)","v":{"$error":"#VALUE!"}},{"$f":"IF(AND($C$10>=A596,A596>=$B$10),($D$10^2-(A596-$E$10)^2)^0.5,0)","v":{"$error":"#VALUE!"}},{"$f":"IF(AND($C$11>=A596,A596>=$B$11),($D$11^2-(A596-$E$11)^2)^0.5,0)","v":{"$error":"#VALUE!"}},{"$error":"#VALUE!"}]
[115.4,{"$f":"$G$15*A597+$G$16","v":{"$error":"#VALUE!"}},{"$error":"#VALUE!"},{"$error":"#VALUE!"},{"$error":"#VALUE!"},{"$error":"#VALUE!"},{"$error":"#VALUE!"},{"$error":"#VALUE!"},{"$error":"#VALUE!"},{"$f":"IF(AND($C$12>=A597,A597>=$B$12),($D$12^2-(A597-$E$12)^2)^0.5,0)","v":{"$error":"#VALUE!"}}]
[{"$f":"A597+0.2","v":115.6},{"$error":"#VALUE!"},{"$error":"#VALUE!"},{"$error":"#VALUE!"},{"$error":"#VALUE!"},{"$error":"#VALUE!"},{"$error":"#VALUE!"},{"$error":"#VALUE!"},{"$error":"#VALUE!"},{"$error":"#VALUE!"}]
[115.8,{"$error":"#VALUE!"},{"$error":"#VALUE!"},{"$error":"#VALUE!"},{"$error":"#VALUE!"},{"$error":"#VALUE!"},{"$error":"#VALUE!"},{"$error":"#VALUE!"},{"$error":"#VALUE!"},{"$error":"#VALUE!"}]
[116,{"$error":"#VALUE!"},{"$error":"#VALUE!"},{"$error":"#VALUE!"},{"$error":"#VALUE!"},{"$error":"#VALUE!"},{"$error":"#VALUE!"},{"$error":"#VALUE!"},{"$error":"#VALUE!"},{"$error":"#VALUE!"}]
[116.2,{"$error":"#VALUE!"},{"$error":"#VALUE!"},{"$error":"#VALUE!"},{"$error":"#VALUE!"},{"$error":"#VALUE!"},{"$error":"#VALUE!"},{"$error":"#VALUE!"},{"$error":"#VALUE!"},{"$error":"#VALUE!"}]
[116.4,{"$error":"#VALUE!"},{"$error":"#VALUE!"},{"$error":"#VALUE!"},{"$error":"#VALUE!"},{"$error":"#VALUE!"},{"$error":"#VALUE!"},{"$error":"#VALUE!"},{"$error":"#VALUE!"},{"$error":"#VALUE!"}]
[116.6,{"$error":"#VALUE!"},{"$error":"#VALUE!"},{"$error":"#VALUE!"},{"$error":"#VALUE!"},{"$error":"#VALUE!"},{"$error":"#VALUE!"},{"$error":"#VALUE!"},{"$error":"#VALUE!"},{"$error":"#VALUE!"}]
[116.8,{"$error":"#VALUE!"},{"$error":"#VALUE!"},{"$error":"#VALUE!"},{"$error":"#VALUE!"},{"$error":"#VALUE!"},{"$error":"#VALUE!"},{"$error":"#VALUE!"},{"$error":"#VALUE!"},{"$error":"#VALUE!"}]
[117,{"$error":"#VALUE!"},{"$error":"#VALUE!"},{"$error":"#VALUE!"},{"$error":"#VALUE!"},{"$error":"#VALUE!"},{"$error":"#VALUE!"},{"$error":"#VALUE!"},{"$error":"#VALUE!"},{"$error":"#VALUE!"}]
[117.2,{"$error":"#VALUE!"},{"$error":"#VALUE!"},{"$error":"#VALUE!"},{"$error":"#VALUE!"},{"$error":"#VALUE!"},{"$error":"#VALUE!"},{"$error":"#VALUE!"},{"$error":"#VALUE!"},{"$error":"#VALUE!"}]
[117.4,{"$error":"#VALUE!"},{"$error":"#VALUE!"},{"$error":"#VALUE!"},{"$error":"#VALUE!"},{"$error":"#VALUE!"},{"$error":"#VALUE!"},{"$error":"#VALUE!"},{"$error":"#VALUE!"},{"$error":"#VALUE!"}]
[117.6,{"$error":"#VALUE!"},{"$error":"#VALUE!"},{"$error":"#VALUE!"},{"$error":"#VALUE!"},{"$error":"#VALUE!"},{"$error":"#VALUE!"},{"$error":"#VALUE!"},{"$error":"#VALUE!"},{"$error":"#VALUE!"}]
[117.8,{"$error":"#VALUE!"},{"$error":"#VALUE!"},{"$error":"#VALUE!"},{"$error":"#VALUE!"},{"$error":"#VALUE!"},{"$error":"#VALUE!"},{"$error":"#VALUE!"},{"$error":"#VALUE!"},{"$error":"#VALUE!"}]
[118,{"$error":"#VALUE!"},{"$error":"#VALUE!"},{"$error":"#VALUE!"},{"$error":"#VALUE!"},{"$error":"#VALUE!"},{"$error":"#VALUE!"},{"$error":"#VALUE!"},{"$error":"#VALUE!"},{"$error":"#VALUE!"}]
[118.2,{"$error":"#VALUE!"},{"$error":"#VALUE!"},{"$error":"#VALUE!"},{"$error":"#VALUE!"},{"$error":"#VALUE!"},{"$error":"#VALUE!"},{"$error":"#VALUE!"},{"$error":"#VALUE!"},{"$error":"#VALUE!"}]
[118.4,{"$error":"#VALUE!"},{"$error":"#VALUE!"},{"$error":"#VALUE!"},{"$error":"#VALUE!"},{"$error":"#VALUE!"},{"$error":"#VALUE!"},{"$error":"#VALUE!"},{"$error":"#VALUE!"},{"$error":"#VALUE!"}]
[118.6,{"$error":"#VALUE!"},{"$error":"#VALUE!"},{"$error":"#VALUE!"},{"$error":"#VALUE!"},{"$error":"#VALUE!"},{"$error":"#VALUE!"},{"$error":"#VALUE!"},{"$error":"#VALUE!"},{"$error":"#VALUE!"}]
[118.8,{"$error":"#VALUE!"},{"$error":"#VALUE!"},{"$error":"#VALUE!"},{"$error":"#VALUE!"},{"$error":"#VALUE!"},{"$error":"#VALUE!"},{"$error":"#VALUE!"},{"$error":"#VALUE!"},{"$error":"#VALUE!"}]
[119,{"$error":"#VALUE!"},{"$error":"#VALUE!"},{"$error":"#VALUE!"},{"$error":"#VALUE!"},{"$error":"#VALUE!"},{"$error":"#VALUE!"},{"$error":"#VALUE!"},{"$error":"#VALUE!"},{"$error":"#VALUE!"}]
[119.2,{"$error":"#VALUE!"},{"$error":"#VALUE!"},{"$error":"#VALUE!"},{"$error":"#VALUE!"},{"$error":"#VALUE!"},{"$error":"#VALUE!"},{"$error":"#VALUE!"},{"$error":"#VALUE!"},{"$error":"#VALUE!"}]
[119.4,{"$error":"#VALUE!"},{"$error":"#VALUE!"},{"$error":"#VALUE!"},{"$error":"#VALUE!"},{"$error":"#VALUE!"},{"$error":"#VALUE!"},{"$error":"#VALUE!"},{"$error":"#VALUE!"},{"$error":"#VALUE!"}]
[119.6,{"$error":"#VALUE!"},{"$error":"#VALUE!"},{"$error":"#VALUE!"},{"$error":"#VALUE!"},{"$error":"#VALUE!"},{"$error":"#VALUE!"},{"$error":"#VALUE!"},{"$error":"#VALUE!"},{"$error":"#VALUE!"}]
[119.8,{"$error":"#VALUE!"},{"$error":"#VALUE!"},{"$error":"#VALUE!"},{"$error":"#VALUE!"},{"$error":"#VALUE!"},{"$error":"#VALUE!"},{"$error":"#VALUE!"},{"$error":"#VALUE!"},{"$error":"#VALUE!"}]
[120,{"$error":"#VALUE!"},{"$error":"#VALUE!"},{"$error":"#VALUE!"},{"$error":"#VALUE!"},{"$error":"#VALUE!"},{"$error":"#VALUE!"},{"$error":"#VALUE!"},{"$error":"#VALUE!"},{"$error":"#VALUE!"}]
[120.2,{"$error":"#VALUE!"},{"$error":"#VALUE!"},{"$error":"#VALUE!"},{"$error":"#VALUE!"},{"$error":"#VALUE!"},{"$error":"#VALUE!"},{"$error":"#VALUE!"},{"$error":"#VALUE!"},{"$error":"#VALUE!"}]
[120.4,{"$error":"#VALUE!"},{"$error":"#VALUE!"},{"$error":"#VALUE!"},{"$error":"#VALUE!"},{"$error":"#VALUE!"},{"$error":"#VALUE!"},{"$error":"#VALUE!"},{"$error":"#VALUE!"},{"$error":"#VALUE!"}]
[120.6,{"$error":"#VALUE!"},{"$error":"#VALUE!"},{"$error":"#VALUE!"},{"$error":"#VALUE!"},{"$error":"#VALUE!"},{"$error":"#VALUE!"},{"$error":"#VALUE!"},{"$error":"#VALUE!"},{"$error":"#VALUE!"}]
[120.8,{"$error":"#VALUE!"},{"$error":"#VALUE!"},{"$error":"#VALUE!"},{"$error":"#VALUE!"},{"$error":"#VALUE!"},{"$error":"#VALUE!"},{"$error":"#VALUE!"},{"$error":"#VALUE!"},{"$error":"#VALUE!"}]
[121,{"$error":"#VALUE!"},{"$error":"#VALUE!"},{"$error":"#VALUE!"},{"$error":"#VALUE!"},{"$error":"#VALUE!"},{"$error":"#VALUE!"},{"$error":"#VALUE!"},{"$error":"#VALUE!"},{"$error":"#VALUE!"}]
[121.2,{"$error":"#VALUE!"},{"$error":"#VALUE!"},{"$error":"#VALUE!"},{"$error":"#VALUE!"},{"$error":"#VALUE!"},{"$error":"#VALUE!"},{"$error":"#VALUE!"},{"$error":"#VALUE!"},{"$error":"#VALUE!"}]
[121.4,{"$error":"#VALUE!"},{"$error":"#VALUE!"},{"$error":"#VALUE!"},{"$error":"#VALUE!"},{"$error":"#VALUE!"},{"$error":"#VALUE!"},{"$error":"#VALUE!"},{"$error":"#VALUE!"},{"$error":"#VALUE!"}]
[121.6,{"$error":"#VALUE!"},{"$error":"#VALUE!"},{"$error":"#VALUE!"},{"$error":"#VALUE!"},{"$error":"#VALUE!"},{"$error":"#VALUE!"},{"$error":"#VALUE!"},{"$error":"#VALUE!"},{"$error":"#VALUE!"}]
[121.8,{"$error":"#VALUE!"},{"$error":"#VALUE!"},{"$error":"#VALUE!"},{"$error":"#VALUE!"},{"$error":"#VALUE!"},{"$error":"#VALUE!"},{"$error":"#VALUE!"},{"$error":"#VALUE!"},{"$error":"#VALUE!"}]
[122,{"$error":"#VALUE!"},{"$error":"#VALUE!"},{"$error":"#VALUE!"},{"$error":"#VALUE!"},{"$error":"#VALUE!"},{"$error":"#VALUE!"},{"$error":"#VALUE!"},{"$error":"#VALUE!"},{"$error":"#VALUE!"}]
[122.2,{"$error":"#VALUE!"},{"$error":"#VALUE!"},{"$error":"#VALUE!"},{"$error":"#VALUE!"},{"$error":"#VALUE!"},{"$error":"#VALUE!"},{"$error":"#VALUE!"},{"$error":"#VALUE!"},{"$error":"#VALUE!"}]
[122.4,{"$error":"#VALUE!"},{"$error":"#VALUE!"},{"$error":"#VALUE!"},{"$error":"#VALUE!"},{"$error":"#VALUE!"},{"$error":"#VALUE!"},{"$error":"#VALUE!"},{"$error":"#VALUE!"},{"$error":"#VALUE!"}]
[122.6,{"$error":"#VALUE!"},{"$error":"#VALUE!"},{"$error":"#VALUE!"},{"$error":"#VALUE!"},{"$error":"#VALUE!"},{"$error":"#VALUE!"},{"$error":"#VALUE!"},{"$error":"#VALUE!"},{"$error":"#VALUE!"}]
[122.8,{"$error":"#VALUE!"},{"$error":"#VALUE!"},{"$error":"#VALUE!"},{"$error":"#VALUE!"},{"$error":"#VALUE!"},{"$error":"#VALUE!"},{"$error":"#VALUE!"},{"$error":"#VALUE!"},{"$error":"#VALUE!"}]
[123,{"$error":"#VALUE!"},{"$error":"#VALUE!"},{"$error":"#VALUE!"},{"$error":"#VALUE!"},{"$error":"#VALUE!"},{"$error":"#VALUE!"},{"$error":"#VALUE!"},{"$error":"#VALUE!"},{"$error":"#VALUE!"}]
[123.2,{"$error":"#VALUE!"},{"$error":"#VALUE!"},{"$error":"#VALUE!"},{"$error":"#VALUE!"},{"$error":"#VALUE!"},{"$error":"#VALUE!"},{"$error":"#VALUE!"},{"$error":"#VALUE!"},{"$error":"#VALUE!"}]
[123.4,{"$error":"#VALUE!"},{"$error":"#VALUE!"},{"$error":"#VALUE!"},{"$error":"#VALUE!"},{"$error":"#VALUE!"},{"$error":"#VALUE!"},{"$error":"#VALUE!"},{"$error":"#VALUE!"},{"$error":"#VALUE!"}]
[123.6,{"$error":"#VALUE!"},{"$error":"#VALUE!"},{"$error":"#VALUE!"},{"$error":"#VALUE!"},{"$error":"#VALUE!"},{"$error":"#VALUE!"},{"$error":"#VALUE!"},{"$error":"#VALUE!"},{"$error":"#VALUE!"}]
[123.8,{"$error":"#VALUE!"},{"$error":"#VALUE!"},{"$error":"#VALUE!"},{"$error":"#VALUE!"},{"$error":"#VALUE!"},{"$error":"#VALUE!"},{"$error":"#VALUE!"},{"$error":"#VALUE!"},{"$error":"#VALUE!"}]
[124,{"$error":"#VALUE!"},{"$error":"#VALUE!"},{"$error":"#VALUE!"},{"$error":"#VALUE!"},{"$error":"#VALUE!"},{"$error":"#VALUE!"},{"$error":"#VALUE!"},{"$error":"#VALUE!"},{"$error":"#VALUE!"}]
[124.2,{"$error":"#VALUE!"},{"$error":"#VALUE!"},{"$error":"#VALUE!"},{"$error":"#VALUE!"},{"$error":"#VALUE!"},{"$error":"#VALUE!"},{"$error":"#VALUE!"},{"$error":"#VALUE!"},{"$error":"#VALUE!"}]
[124.4,{"$error":"#VALUE!"},{"$error":"#VALUE!"},{"$error":"#VALUE!"},{"$error":"#VALUE!"},{"$error":"#VALUE!"},{"$error":"#VALUE!"},{"$error":"#VALUE!"},{"$error":"#VALUE!"},{"$error":"#VALUE!"}]
[124.6,{"$error":"#VALUE!"},{"$error":"#VALUE!"},{"$error":"#VALUE!"},{"$error":"#VALUE!"},{"$error":"#VALUE!"},{"$error":"#VALUE!"},{"$error":"#VALUE!"},{"$error":"#VALUE!"},{"$error":"#VALUE!"}]
[124.8,{"$error":"#VALUE!"},{"$error":"#VALUE!"},{"$error":"#VALUE!"},{"$error":"#VALUE!"},{"$error":"#VALUE!"},{"$error":"#VALUE!"},{"$error":"#VALUE!"},{"$error":"#VALUE!"},{"$error":"#VALUE!"}]
[125,{"$error":"#VALUE!"},{"$error":"#VALUE!"},{"$error":"#VALUE!"},{"$error":"#VALUE!"},{"$error":"#VALUE!"},{"$error":"#VALUE!"},{"$error":"#VALUE!"},{"$error":"#VALUE!"},{"$error":"#VALUE!"}]
[125.2,{"$error":"#VALUE!"},{"$error":"#VALUE!"},{"$error":"#VALUE!"},{"$error":"#VALUE!"},{"$error":"#VALUE!"},{"$error":"#VALUE!"},{"$error":"#VALUE!"},{"$error":"#VALUE!"},{"$error":"#VALUE!"}]
[125.4,{"$error":"#VALUE!"},{"$error":"#VALUE!"},{"$error":"#VALUE!"},{"$error":"#VALUE!"},{"$error":"#VALUE!"},{"$error":"#VALUE!"},{"$error":"#VALUE!"},{"$error":"#VALUE!"},{"$error":"#VALUE!"}]
[125.6,{"$error":"#VALUE!"},{"$error":"#VALUE!"},{"$error":"#VALUE!"},{"$error":"#VALUE!"},{"$error":"#VALUE!"},{"$error":"#VALUE!"},{"$error":"#VALUE!"},{"$error":"#VALUE!"},{"$error":"#VALUE!"}]
[125.8,{"$error":"#VALUE!"},{"$error":"#VALUE!"},{"$error":"#VALUE!"},{"$error":"#VALUE!"},{"$error":"#VALUE!"},{"$error":"#VALUE!"},{"$error":"#VALUE!"},{"$error":"#VALUE!"},{"$error":"#VALUE!"}]
[126,{"$error":"#VALUE!"},{"$error":"#VALUE!"},{"$error":"#VALUE!"},{"$error":"#VALUE!"},{"$error":"#VALUE!"},{"$error":"#VALUE!"},{"$error":"#VALUE!"},{"$error":"#VALUE!"},{"$error":"#VALUE!"}]
[126.2,{"$error":"#VALUE!"},{"$error":"#VALUE!"},{"$error":"#VALUE!"},{"$error":"#VALUE!"},{"$error":"#VALUE!"},{"$error":"#VALUE!"},{"$error":"#VALUE!"},{"$error":"#VALUE!"},{"$error":"#VALUE!"}]
[126.4,{"$error":"#VALUE!"},{"$error":"#VALUE!"},{"$error":"#VALUE!"},{"$error":"#VALUE!"},{"$error":"#VALUE!"},{"$error":"#VALUE!"},{"$error":"#VALUE!"},{"$error":"#VALUE!"},{"$error":"#VALUE!"}]
[126.6,{"$error":"#VALUE!"},{"$error":"#VALUE!"},{"$error":"#VALUE!"},{"$error":"#VALUE!"},{"$error":"#VALUE!"},{"$error":"#VALUE!"},{"$error":"#VALUE!"},{"$error":"#VALUE!"},{"$error":"#VALUE!"}]
[126.8,{"$error":"#VALUE!"},{"$error":"#VALUE!"},{"$error":"#VALUE!"},{"$error":"#VALUE!"},{"$error":"#VALUE!"},{"$error":"#VALUE!"},{"$error":"#VALUE!"},{"$error":"#VALUE!"},{"$error":"#VALUE!"}]
[127,{"$error":"#VALUE!"},{"$error":"#VALUE!"},{"$error":"#VALUE!"},{"$error":"#VALUE!"},{"$error":"#VALUE!"},{"$error":"#VALUE!"},{"$error":"#VALUE!"},{"$error":"#VALUE!"},{"$error":"#VALUE!"}]
[127.2,{"$error":"#VALUE!"},{"$error":"#VALUE!"},{"$error":"#VALUE!"},{"$error":"#VALUE!"},{"$error":"#VALUE!"},{"$error":"#VALUE!"},{"$error":"#VALUE!"},{"$error":"#VALUE!"},{"$error":"#VALUE!"}]
[127.4,{"$error":"#VALUE!"},{"$error":"#VALUE!"},{"$error":"#VALUE!"},{"$error":"#VALUE!"},{"$error":"#VALUE!"},{"$error":"#VALUE!"},{"$error":"#VALUE!"},{"$error":"#VALUE!"},{"$error":"#VALUE!"}]
[127.6,{"$error":"#VALUE!"},{"$error":"#VALUE!"},{"$error":"#VALUE!"},{"$error":"#VALUE!"},{"$error":"#VALUE!"},{"$error":"#VALUE!"},{"$error":"#VALUE!"},{"$error":"#VALUE!"},{"$error":"#VALUE!"}]
[127.8,{"$error":"#VALUE!"},{"$error":"#VALUE!"},{"$error":"#VALUE!"},{"$error":"#VALUE!"},{"$error":"#VALUE!"},{"$error":"#VALUE!"},{"$error":"#VALUE!"},{"$error":"#VALUE!"},{"$error":"#VALUE!"}]
[128,{"$error":"#VALUE!"},{"$f":"IF(AND($C$5>=A660,A660>=$B$5),($D$5^2-(A660-$E$5)^2)^0.5,0)","v":{"$error":"#VALUE!"}},{"$f":"IF(AND($C$6>=A660,A660>=$B$6),($D$6^2-(A660-$E$6)^2)^0.5,0)","v":{"$error":"#VALUE!"}},{"$f":"IF(AND($C$7>=A660,A660>$B$7),($D$7^2-(A660-$E$7)^2)^0.5,0)","v":{"$error":"#VALUE!"}},{"$f":"IF(AND($C$8>=A660,A660>=$B$8),($D$8^2-(A660-$E$8)^2)^0.5,0)","v":{"$error":"#VALUE!"}},{"$f":"IF(AND($C$9>=A660,A660>=$B$9),($D$9^2-(A660-$E$9)^2)^0.5,0)","v":{"$error":"#VALUE!"}},{"$f":"IF(AND($C$10>=A660,A660>=$B$10),($D$10^2-(A660-$E$10)^2)^0.5,0)","v":{"$error":"#VALUE!"}},{"$f":"IF(AND($C$11>=A660,A660>=$B$11),($D$11^2-(A660-$E$11)^2)^0.5,0)","v":{"$error":"#VALUE!"}},{"$error":"#VALUE!"}]
[128.19999999999999,{"$f":"$G$15*A661+$G$16","v":{"$error":"#VALUE!"}},{"$error":"#VALUE!"},{"$error":"#VALUE!"},{"$error":"#VALUE!"},{"$error":"#VALUE!"},{"$error":"#VALUE!"},{"$error":"#VALUE!"},{"$error":"#VALUE!"},{"$f":"IF(AND($C$12>=A661,A661>=$B$12),($D$12^2-(A661-$E$12)^2)^0.5,0)","v":{"$error":"#VALUE!"}}]
[{"$f":"A661+0.2","v":128.4},{"$error":"#VALUE!"},{"$error":"#VALUE!"},{"$error":"#VALUE!"},{"$error":"#VALUE!"},{"$error":"#VALUE!"},{"$error":"#VALUE!"},{"$error":"#VALUE!"},{"$error":"#VALUE!"},{"$error":"#VALUE!"}]
[128.6,{"$error":"#VALUE!"},{"$error":"#VALUE!"},{"$error":"#VALUE!"},{"$error":"#VALUE!"},{"$error":"#VALUE!"},{"$error":"#VALUE!"},{"$error":"#VALUE!"},{"$error":"#VALUE!"},{"$error":"#VALUE!"}]
[128.80000000000001,{"$error":"#VALUE!"},{"$error":"#VALUE!"},{"$error":"#VALUE!"},{"$error":"#VALUE!"},{"$error":"#VALUE!"},{"$error":"#VALUE!"},{"$error":"#VALUE!"},{"$error":"#VALUE!"},{"$error":"#VALUE!"}]
[129,{"$error":"#VALUE!"},{"$error":"#VALUE!"},{"$error":"#VALUE!"},{"$error":"#VALUE!"},{"$error":"#VALUE!"},{"$error":"#VALUE!"},{"$error":"#VALUE!"},{"$error":"#VALUE!"},{"$error":"#VALUE!"}]
[129.19999999999999,{"$error":"#VALUE!"},{"$error":"#VALUE!"},{"$error":"#VALUE!"},{"$error":"#VALUE!"},{"$error":"#VALUE!"},{"$error":"#VALUE!"},{"$error":"#VALUE!"},{"$error":"#VALUE!"},{"$error":"#VALUE!"}]
[129.4,{"$error":"#VALUE!"},{"$error":"#VALUE!"},{"$error":"#VALUE!"},{"$error":"#VALUE!"},{"$error":"#VALUE!"},{"$error":"#VALUE!"},{"$error":"#VALUE!"},{"$error":"#VALUE!"},{"$error":"#VALUE!"}]
[129.6,{"$error":"#VALUE!"},{"$error":"#VALUE!"},{"$error":"#VALUE!"},{"$error":"#VALUE!"},{"$error":"#VALUE!"},{"$error":"#VALUE!"},{"$error":"#VALUE!"},{"$error":"#VALUE!"},{"$error":"#VALUE!"}]
[129.80000000000001,{"$error":"#VALUE!"},{"$error":"#VALUE!"},{"$error":"#VALUE!"},{"$error":"#VALUE!"},{"$error":"#VALUE!"},{"$error":"#VALUE!"},{"$error":"#VALUE!"},{"$error":"#VALUE!"},{"$error":"#VALUE!"}]
[130,{"$error":"#VALUE!"},{"$error":"#VALUE!"},{"$error":"#VALUE!"},{"$error":"#VALUE!"},{"$error":"#VALUE!"},{"$error":"#VALUE!"},{"$error":"#VALUE!"},{"$error":"#VALUE!"},{"$error":"#VALUE!"}]
[130.19999999999999,{"$error":"#VALUE!"},{"$error":"#VALUE!"},{"$error":"#VALUE!"},{"$error":"#VALUE!"},{"$error":"#VALUE!"},{"$error":"#VALUE!"},{"$error":"#VALUE!"},{"$error":"#VALUE!"},{"$error":"#VALUE!"}]
[130.4,{"$error":"#VALUE!"},{"$error":"#VALUE!"},{"$error":"#VALUE!"},{"$error":"#VALUE!"},{"$error":"#VALUE!"},{"$error":"#VALUE!"},{"$error":"#VALUE!"},{"$error":"#VALUE!"},{"$error":"#VALUE!"}]
[130.6,{"$error":"#VALUE!"},{"$error":"#VALUE!"},{"$error":"#VALUE!"},{"$error":"#VALUE!"},{"$error":"#VALUE!"},{"$error":"#VALUE!"},{"$error":"#VALUE!"},{"$error":"#VALUE!"},{"$error":"#VALUE!"}]
[130.80000000000001,{"$error":"#VALUE!"},{"$error":"#VALUE!"},{"$error":"#VALUE!"},{"$error":"#VALUE!"},{"$error":"#VALUE!"},{"$error":"#VALUE!"},{"$error":"#VALUE!"},{"$error":"#VALUE!"},{"$error":"#VALUE!"}]
[131,{"$error":"#VALUE!"},{"$error":"#VALUE!"},{"$error":"#VALUE!"},{"$error":"#VALUE!"},{"$error":"#VALUE!"},{"$error":"#VALUE!"},{"$error":"#VALUE!"},{"$error":"#VALUE!"},{"$error":"#VALUE!"}]
[131.19999999999999,{"$error":"#VALUE!"},{"$error":"#VALUE!"},{"$error":"#VALUE!"},{"$error":"#VALUE!"},{"$error":"#VALUE!"},{"$error":"#VALUE!"},{"$error":"#VALUE!"},{"$error":"#VALUE!"},{"$error":"#VALUE!"}]
[131.4,{"$error":"#VALUE!"},{"$error":"#VALUE!"},{"$error":"#VALUE!"},{"$error":"#VALUE!"},{"$error":"#VALUE!"},{"$error":"#VALUE!"},{"$error":"#VALUE!"},{"$error":"#VALUE!"},{"$error":"#VALUE!"}]
[131.6,{"$error":"#VALUE!"},{"$error":"#VALUE!"},{"$error":"#VALUE!"},{"$error":"#VALUE!"},{"$error":"#VALUE!"},{"$error":"#VALUE!"},{"$error":"#VALUE!"},{"$error":"#VALUE!"},{"$error":"#VALUE!"}]
[131.80000000000001,{"$error":"#VALUE!"},{"$error":"#VALUE!"},{"$error":"#VALUE!"},{"$error":"#VALUE!"},{"$error":"#VALUE!"},{"$error":"#VALUE!"},{"$error":"#VALUE!"},{"$error":"#VALUE!"},{"$error":"#VALUE!"}]
[132,{"$error":"#VALUE!"},{"$error":"#VALUE!"},{"$error":"#VALUE!"},{"$error":"#VALUE!"},{"$error":"#VALUE!"},{"$error":"#VALUE!"},{"$error":"#VALUE!"},{"$error":"#VALUE!"},{"$error":"#VALUE!"}]
[132.19999999999999,{"$error":"#VALUE!"},{"$error":"#VALUE!"},{"$error":"#VALUE!"},{"$error":"#VALUE!"},{"$error":"#VALUE!"},{"$error":"#VALUE!"},{"$error":"#VALUE!"},{"$error":"#VALUE!"},{"$error":"#VALUE!"}]
[132.4,{"$error":"#VALUE!"},{"$error":"#VALUE!"},{"$error":"#VALUE!"},{"$error":"#VALUE!"},{"$error":"#VALUE!"},{"$error":"#VALUE!"},{"$error":"#VALUE!"},{"$error":"#VALUE!"},{"$error":"#VALUE!"}]
[132.6,{"$error":"#VALUE!"},{"$error":"#VALUE!"},{"$error":"#VALUE!"},{"$error":"#VALUE!"},{"$error":"#VALUE!"},{"$error":"#VALUE!"},{"$error":"#VALUE!"},{"$error":"#VALUE!"},{"$error":"#VALUE!"}]
[132.80000000000001,{"$error":"#VALUE!"},{"$error":"#VALUE!"},{"$error":"#VALUE!"},{"$error":"#VALUE!"},{"$error":"#VALUE!"},{"$error":"#VALUE!"},{"$error":"#VALUE!"},{"$error":"#VALUE!"},{"$error":"#VALUE!"}]
[133,{"$error":"#VALUE!"},{"$error":"#VALUE!"},{"$error":"#VALUE!"},{"$error":"#VALUE!"},{"$error":"#VALUE!"},{"$error":"#VALUE!"},{"$error":"#VALUE!"},{"$error":"#VALUE!"},{"$error":"#VALUE!"}]
[133.19999999999999,{"$error":"#VALUE!"},{"$error":"#VALUE!"},{"$error":"#VALUE!"},{"$error":"#VALUE!"},{"$error":"#VALUE!"},{"$error":"#VALUE!"},{"$error":"#VALUE!"},{"$error":"#VALUE!"},{"$error":"#VALUE!"}]
[133.4,{"$error":"#VALUE!"},{"$error":"#VALUE!"},{"$error":"#VALUE!"},{"$error":"#VALUE!"},{"$error":"#VALUE!"},{"$error":"#VALUE!"},{"$error":"#VALUE!"},{"$error":"#VALUE!"},{"$error":"#VALUE!"}]
[133.6,{"$error":"#VALUE!"},{"$error":"#VALUE!"},{"$error":"#VALUE!"},{"$error":"#VALUE!"},{"$error":"#VALUE!"},{"$error":"#VALUE!"},{"$error":"#VALUE!"},{"$error":"#VALUE!"},{"$error":"#VALUE!"}]
[133.80000000000001,{"$error":"#VALUE!"},{"$error":"#VALUE!"},{"$error":"#VALUE!"},{"$error":"#VALUE!"},{"$error":"#VALUE!"},{"$error":"#VALUE!"},{"$error":"#VALUE!"},{"$error":"#VALUE!"},{"$error":"#VALUE!"}]
[134,{"$error":"#VALUE!"},{"$error":"#VALUE!"},{"$error":"#VALUE!"},{"$error":"#VALUE!"},{"$error":"#VALUE!"},{"$error":"#VALUE!"},{"$error":"#VALUE!"},{"$error":"#VALUE!"},{"$error":"#VALUE!"}]
[134.19999999999999,{"$error":"#VALUE!"},{"$error":"#VALUE!"},{"$error":"#VALUE!"},{"$error":"#VALUE!"},{"$error":"#VALUE!"},{"$error":"#VALUE!"},{"$error":"#VALUE!"},{"$error":"#VALUE!"},{"$error":"#VALUE!"}]
[134.4,{"$error":"#VALUE!"},{"$error":"#VALUE!"},{"$error":"#VALUE!"},{"$error":"#VALUE!"},{"$error":"#VALUE!"},{"$error":"#VALUE!"},{"$error":"#VALUE!"},{"$error":"#VALUE!"},{"$error":"#VALUE!"}]
[134.6,{"$error":"#VALUE!"},{"$error":"#VALUE!"},{"$error":"#VALUE!"},{"$error":"#VALUE!"},{"$error":"#VALUE!"},{"$error":"#VALUE!"},{"$error":"#VALUE!"},{"$error":"#VALUE!"},{"$error":"#VALUE!"}]
[134.80000000000001,{"$error":"#VALUE!"},{"$error":"#VALUE!"},{"$error":"#VALUE!"},{"$error":"#VALUE!"},{"$error":"#VALUE!"},{"$error":"#VALUE!"},{"$error":"#VALUE!"},{"$error":"#VALUE!"},{"$error":"#VALUE!"}]
[135,{"$error":"#VALUE!"},{"$error":"#VALUE!"},{"$error":"#VALUE!"},{"$error":"#VALUE!"},{"$error":"#VALUE!"},{"$error":"#VALUE!"},{"$error":"#VALUE!"},{"$error":"#VALUE!"},{"$error":"#VALUE!"}]
[135.19999999999999,{"$error":"#VALUE!"},{"$error":"#VALUE!"},{"$error":"#VALUE!"},{"$error":"#VALUE!"},{"$error":"#VALUE!"},{"$error":"#VALUE!"},{"$error":"#VALUE!"},{"$error":"#VALUE!"},{"$error":"#VALUE!"}]
[135.4,{"$error":"#VALUE!"},{"$error":"#VALUE!"},{"$error":"#VALUE!"},{"$error":"#VALUE!"},{"$error":"#VALUE!"},{"$error":"#VALUE!"},{"$error":"#VALUE!"},{"$error":"#VALUE!"},{"$error":"#VALUE!"}]
[135.6,{"$error":"#VALUE!"},{"$error":"#VALUE!"},{"$error":"#VALUE!"},{"$error":"#VALUE!"},{"$error":"#VALUE!"},{"$error":"#VALUE!"},{"$error":"#VALUE!"},{"$error":"#VALUE!"},{"$error":"#VALUE!"}]
[135.80000000000001,{"$error":"#VALUE!"},{"$error":"#VALUE!"},{"$error":"#VALUE!"},{"$error":"#VALUE!"},{"$error":"#VALUE!"},{"$error":"#VALUE!"},{"$error":"#VALUE!"},{"$error":"#VALUE!"},{"$error":"#VALUE!"}]
[136,{"$error":"#VALUE!"},{"$error":"#VALUE!"},{"$error":"#VALUE!"},{"$error":"#VALUE!"},{"$error":"#VALUE!"},{"$error":"#VALUE!"},{"$error":"#VALUE!"},{"$error":"#VALUE!"},{"$error":"#VALUE!"}]
[136.19999999999999,{"$error":"#VALUE!"},{"$error":"#VALUE!"},{"$error":"#VALUE!"},{"$error":"#VALUE!"},{"$error":"#VALUE!"},{"$error":"#VALUE!"},{"$error":"#VALUE!"},{"$error":"#VALUE!"},{"$error":"#VALUE!"}]
[136.4,{"$error":"#VALUE!"},{"$error":"#VALUE!"},{"$error":"#VALUE!"},{"$error":"#VALUE!"},{"$error":"#VALUE!"},{"$error":"#VALUE!"},{"$error":"#VALUE!"},{"$error":"#VALUE!"},{"$error":"#VALUE!"}]
[136.6,{"$error":"#VALUE!"},{"$error":"#VALUE!"},{"$error":"#VALUE!"},{"$error":"#VALUE!"},{"$error":"#VALUE!"},{"$error":"#VALUE!"},{"$error":"#VALUE!"},{"$error":"#VALUE!"},{"$error":"#VALUE!"}]
[136.80000000000001,{"$error":"#VALUE!"},{"$error":"#VALUE!"},{"$error":"#VALUE!"},{"$error":"#VALUE!"},{"$error":"#VALUE!"},{"$error":"#VALUE!"},{"$error":"#VALUE!"},{"$error":"#VALUE!"},{"$error":"#VALUE!"}]
[137,{"$error":"#VALUE!"},{"$error":"#VALUE!"},{"$error":"#VALUE!"},{"$error":"#VALUE!"},{"$error":"#VALUE!"},{"$error":"#VALUE!"},{"$error":"#VALUE!"},{"$error":"#VALUE!"},{"$error":"#VALUE!"}]
[137.19999999999999,{"$error":"#VALUE!"},{"$error":"#VALUE!"},{"$error":"#VALUE!"},{"$error":"#VALUE!"},{"$error":"#VALUE!"},{"$error":"#VALUE!"},{"$error":"#VALUE!"},{"$error":"#VALUE!"},{"$error":"#VALUE!"}]
[137.4,{"$error":"#VALUE!"},{"$error":"#VALUE!"},{"$error":"#VALUE!"},{"$error":"#VALUE!"},{"$error":"#VALUE!"},{"$error":"#VALUE!"},{"$error":"#VALUE!"},{"$error":"#VALUE!"},{"$error":"#VALUE!"}]
[137.6,{"$error":"#VALUE!"},{"$error":"#VALUE!"},{"$error":"#VALUE!"},{"$error":"#VALUE!"},{"$error":"#VALUE!"},{"$error":"#VALUE!"},{"$error":"#VALUE!"},{"$error":"#VALUE!"},{"$error":"#VALUE!"}]
[137.80000000000001,{"$error":"#VALUE!"},{"$error":"#VALUE!"},{"$error":"#VALUE!"},{"$error":"#VALUE!"},{"$error":"#VALUE!"},{"$error":"#VALUE!"},{"$error":"#VALUE!"},{"$error":"#VALUE!"},{"$error":"#VALUE!"}]
[138,{"$error":"#VALUE!"},{"$error":"#VALUE!"},{"$error":"#VALUE!"},{"$error":"#VALUE!"},{"$error":"#VALUE!"},{"$error":"#VALUE!"},{"$error":"#VALUE!"},{"$error":"#VALUE!"},{"$error":"#VALUE!"}]
[138.19999999999999,{"$error":"#VALUE!"},{"$error":"#VALUE!"},{"$error":"#VALUE!"},{"$error":"#VALUE!"},{"$error":"#VALUE!"},{"$error":"#VALUE!"},{"$error":"#VALUE!"},{"$error":"#VALUE!"},{"$error":"#VALUE!"}]
[138.4,{"$error":"#VALUE!"},{"$error":"#VALUE!"},{"$error":"#VALUE!"},{"$error":"#VALUE!"},{"$error":"#VALUE!"},{"$error":"#VALUE!"},{"$error":"#VALUE!"},{"$error":"#VALUE!"},{"$error":"#VALUE!"}]
[138.6,{"$error":"#VALUE!"},{"$error":"#VALUE!"},{"$error":"#VALUE!"},{"$error":"#VALUE!"},{"$error":"#VALUE!"},{"$error":"#VALUE!"},{"$error":"#VALUE!"},{"$error":"#VALUE!"},{"$error":"#VALUE!"}]
[138.80000000000001,{"$error":"#VALUE!"},{"$error":"#VALUE!"},{"$error":"#VALUE!"},{"$error":"#VALUE!"},{"$error":"#VALUE!"},{"$error":"#VALUE!"},{"$error":"#VALUE!"},{"$error":"#VALUE!"},{"$error":"#VALUE!"}]
[139,{"$error":"#VALUE!"},{"$error":"#VALUE!"},{"$error":"#VALUE!"},{"$error":"#VALUE!"},{"$error":"#VALUE!"},{"$error":"#VALUE!"},{"$error":"#VALUE!"},{"$error":"#VALUE!"},{"$error":"#VALUE!"}]
[139.19999999999999,{"$error":"#VALUE!"},{"$error":"#VALUE!"},{"$error":"#VALUE!"},{"$error":"#VALUE!"},{"$error":"#VALUE!"},{"$error":"#VALUE!"},{"$error":"#VALUE!"},{"$error":"#VALUE!"},{"$error":"#VALUE!"}]
[139.4,{"$error":"#VALUE!"},{"$error":"#VALUE!"},{"$error":"#VALUE!"},{"$error":"#VALUE!"},{"$error":"#VALUE!"},{"$error":"#VALUE!"},{"$error":"#VALUE!"},{"$error":"#VALUE!"},{"$error":"#VALUE!"}]
[139.6,{"$error":"#VALUE!"},{"$error":"#VALUE!"},{"$error":"#VALUE!"},{"$error":"#VALUE!"},{"$error":"#VALUE!"},{"$error":"#VALUE!"},{"$error":"#VALUE!"},{"$error":"#VALUE!"},{"$error":"#VALUE!"}]
[139.80000000000001,{"$error":"#VALUE!"},{"$error":"#VALUE!"},{"$error":"#VALUE!"},{"$error":"#VALUE!"},{"$error":"#VALUE!"},{"$error":"#VALUE!"},{"$error":"#VALUE!"},{"$error":"#VALUE!"},{"$error":"#VALUE!"}]
[140,{"$error":"#VALUE!"},{"$error":"#VALUE!"},{"$error":"#VALUE!"},{"$error":"#VALUE!"},{"$error":"#VALUE!"},{"$error":"#VALUE!"},{"$error":"#VALUE!"},{"$error":"#VALUE!"},{"$error":"#VALUE!"}]
[140.19999999999999,{"$error":"#VALUE!"},{"$error":"#VALUE!"},{"$error":"#VALUE!"},{"$error":"#VALUE!"},{"$error":"#VALUE!"},{"$error":"#VALUE!"},{"$error":"#VALUE!"},{"$error":"#VALUE!"},{"$error":"#VALUE!"}]
[140.4,{"$error":"#VALUE!"},{"$error":"#VALUE!"},{"$error":"#VALUE!"},{"$error":"#VALUE!"},{"$error":"#VALUE!"},{"$error":"#VALUE!"},{"$error":"#VALUE!"},{"$error":"#VALUE!"},{"$error":"#VALUE!"}]
[140.6,{"$error":"#VALUE!"},{"$error":"#VALUE!"},{"$error":"#VALUE!"},{"$error":"#VALUE!"},{"$error":"#VALUE!"},{"$error":"#VALUE!"},{"$error":"#VALUE!"},{"$error":"#VALUE!"},{"$error":"#VALUE!"}]
[140.80000000000001,{"$error":"#VALUE!"},{"$f":"IF(AND($C$5>=A724,A724>=$B$5),($D$5^2-(A724-$E$5)^2)^0.5,0)","v":{"$error":"#VALUE!"}},{"$f":"IF(AND($C$6>=A724,A724>=$B$6),($D$6^2-(A724-$E$6)^2)^0.5,0)","v":{"$error":"#VALUE!"}},{"$f":"IF(AND($C$7>=A724,A724>$B$7),($D$7^2-(A724-$E$7)^2)^0.5,0)","v":{"$error":"#VALUE!"}},{"$f":"IF(AND($C$8>=A724,A724>=$B$8),($D$8^2-(A724-$E$8)^2)^0.5,0)","v":{"$error":"#VALUE!"}},{"$f":"IF(AND($C$9>=A724,A724>=$B$9),($D$9^2-(A724-$E$9)^2)^0.5,0)","v":{"$error":"#VALUE!"}},{"$f":"IF(AND($C$10>=A724,A724>=$B$10),($D$10^2-(A724-$E$10)^2)^0.5,0)","v":{"$error":"#VALUE!"}},{"$f":"IF(AND($C$11>=A724,A724>=$B$11),($D$11^2-(A724-$E$11)^2)^0.5,0)","v":{"$error":"#VALUE!"}},{"$error":"#VALUE!"}]
[141,{"$f":"$G$15*A725+$G$16","v":{"$error":"#VALUE!"}},{"$error":"#VALUE!"},{"$error":"#VALUE!"},{"$error":"#VALUE!"},{"$error":"#VALUE!"},{"$error":"#VALUE!"},{"$error":"#VALUE!"},{"$error":"#VALUE!"},{"$f":"IF(AND($C$12>=A725,A725>=$B$12),($D$12^2-(A725-$E$12)^2)^0.5,0)","v":{"$error":"#VALUE!"}}]
[{"$f":"A725+0.2","v":141.19999999999999},{"$error":"#VALUE!"},{"$error":"#VALUE!"},{"$error":"#VALUE!"},{"$error":"#VALUE!"},{"$error":"#VALUE!"},{"$error":"#VALUE!"},{"$error":"#VALUE!"},{"$error":"#VALUE!"},{"$error":"#VALUE!"}]
[141.4,{"$error":"#VALUE!"},{"$error":"#VALUE!"},{"$error":"#VALUE!"},{"$error":"#VALUE!"},{"$error":"#VALUE!"},{"$error":"#VALUE!"},{"$error":"#VALUE!"},{"$error":"#VALUE!"},{"$error":"#VALUE!"}]
[141.6,{"$error":"#VALUE!"},{"$error":"#VALUE!"},{"$error":"#VALUE!"},{"$error":"#VALUE!"},{"$error":"#VALUE!"},{"$error":"#VALUE!"},{"$error":"#VALUE!"},{"$error":"#VALUE!"},{"$error":"#VALUE!"}]
[141.80000000000001,{"$error":"#VALUE!"},{"$error":"#VALUE!"},{"$error":"#VALUE!"},{"$error":"#VALUE!"},{"$error":"#VALUE!"},{"$error":"#VALUE!"},{"$error":"#VALUE!"},{"$error":"#VALUE!"},{"$error":"#VALUE!"}]
[142,{"$error":"#VALUE!"},{"$error":"#VALUE!"},{"$error":"#VALUE!"},{"$error":"#VALUE!"},{"$error":"#VALUE!"},{"$error":"#VALUE!"},{"$error":"#VALUE!"},{"$error":"#VALUE!"},{"$error":"#VALUE!"}]
[142.19999999999999,{"$error":"#VALUE!"},{"$error":"#VALUE!"},{"$error":"#VALUE!"},{"$error":"#VALUE!"},{"$error":"#VALUE!"},{"$error":"#VALUE!"},{"$error":"#VALUE!"},{"$error":"#VALUE!"},{"$error":"#VALUE!"}]
[142.4,{"$error":"#VALUE!"},{"$error":"#VALUE!"},{"$error":"#VALUE!"},{"$error":"#VALUE!"},{"$error":"#VALUE!"},{"$error":"#VALUE!"},{"$error":"#VALUE!"},{"$error":"#VALUE!"},{"$error":"#VALUE!"}]
[142.6,{"$error":"#VALUE!"},{"$error":"#VALUE!"},{"$error":"#VALUE!"},{"$error":"#VALUE!"},{"$error":"#VALUE!"},{"$error":"#VALUE!"},{"$error":"#VALUE!"},{"$error":"#VALUE!"},{"$error":"#VALUE!"}]
[142.80000000000001,{"$error":"#VALUE!"},{"$error":"#VALUE!"},{"$error":"#VALUE!"},{"$error":"#VALUE!"},{"$error":"#VALUE!"},{"$error":"#VALUE!"},{"$error":"#VALUE!"},{"$error":"#VALUE!"},{"$error":"#VALUE!"}]
[143,{"$error":"#VALUE!"},{"$error":"#VALUE!"},{"$error":"#VALUE!"},{"$error":"#VALUE!"},{"$error":"#VALUE!"},{"$error":"#VALUE!"},{"$error":"#VALUE!"},{"$error":"#VALUE!"},{"$error":"#VALUE!"}]
[143.19999999999999,{"$error":"#VALUE!"},{"$error":"#VALUE!"},{"$error":"#VALUE!"},{"$error":"#VALUE!"},{"$error":"#VALUE!"},{"$error":"#VALUE!"},{"$error":"#VALUE!"},{"$error":"#VALUE!"},{"$error":"#VALUE!"}]
[143.4,{"$error":"#VALUE!"},{"$error":"#VALUE!"},{"$error":"#VALUE!"},{"$error":"#VALUE!"},{"$error":"#VALUE!"},{"$error":"#VALUE!"},{"$error":"#VALUE!"},{"$error":"#VALUE!"},{"$error":"#VALUE!"}]
[143.6,{"$error":"#VALUE!"},{"$error":"#VALUE!"},{"$error":"#VALUE!"},{"$error":"#VALUE!"},{"$error":"#VALUE!"},{"$error":"#VALUE!"},{"$error":"#VALUE!"},{"$error":"#VALUE!"},{"$error":"#VALUE!"}]
[143.80000000000001,{"$error":"#VALUE!"},{"$error":"#VALUE!"},{"$error":"#VALUE!"},{"$error":"#VALUE!"},{"$error":"#VALUE!"},{"$error":"#VALUE!"},{"$error":"#VALUE!"},{"$error":"#VALUE!"},{"$error":"#VALUE!"}]
[144,{"$error":"#VALUE!"},{"$error":"#VALUE!"},{"$error":"#VALUE!"},{"$error":"#VALUE!"},{"$error":"#VALUE!"},{"$error":"#VALUE!"},{"$error":"#VALUE!"},{"$error":"#VALUE!"},{"$error":"#VALUE!"}]
[144.19999999999999,{"$error":"#VALUE!"},{"$error":"#VALUE!"},{"$error":"#VALUE!"},{"$error":"#VALUE!"},{"$error":"#VALUE!"},{"$error":"#VALUE!"},{"$error":"#VALUE!"},{"$error":"#VALUE!"},{"$error":"#VALUE!"}]
[144.4,{"$error":"#VALUE!"},{"$error":"#VALUE!"},{"$error":"#VALUE!"},{"$error":"#VALUE!"},{"$error":"#VALUE!"},{"$error":"#VALUE!"},{"$error":"#VALUE!"},{"$error":"#VALUE!"},{"$error":"#VALUE!"}]
[144.6,{"$error":"#VALUE!"},{"$error":"#VALUE!"},{"$error":"#VALUE!"},{"$error":"#VALUE!"},{"$error":"#VALUE!"},{"$error":"#VALUE!"},{"$error":"#VALUE!"},{"$error":"#VALUE!"},{"$error":"#VALUE!"}]
[144.80000000000001,{"$error":"#VALUE!"},{"$error":"#VALUE!"},{"$error":"#VALUE!"},{"$error":"#VALUE!"},{"$error":"#VALUE!"},{"$error":"#VALUE!"},{"$error":"#VALUE!"},{"$error":"#VALUE!"},{"$error":"#VALUE!"}]
[145,{"$error":"#VALUE!"},{"$error":"#VALUE!"},{"$error":"#VALUE!"},{"$error":"#VALUE!"},{"$error":"#VALUE!"},{"$error":"#VALUE!"},{"$error":"#VALUE!"},{"$error":"#VALUE!"},{"$error":"#VALUE!"}]
[145.19999999999999,{"$error":"#VALUE!"},{"$error":"#VALUE!"},{"$error":"#VALUE!"},{"$error":"#VALUE!"},{"$error":"#VALUE!"},{"$error":"#VALUE!"},{"$error":"#VALUE!"},{"$error":"#VALUE!"},{"$error":"#VALUE!"}]
[145.4,{"$error":"#VALUE!"},{"$error":"#VALUE!"},{"$error":"#VALUE!"},{"$error":"#VALUE!"},{"$error":"#VALUE!"},{"$error":"#VALUE!"},{"$error":"#VALUE!"},{"$error":"#VALUE!"},{"$error":"#VALUE!"}]
[145.6,{"$error":"#VALUE!"},{"$error":"#VALUE!"},{"$error":"#VALUE!"},{"$error":"#VALUE!"},{"$error":"#VALUE!"},{"$error":"#VALUE!"},{"$error":"#VALUE!"},{"$error":"#VALUE!"},{"$error":"#VALUE!"}]
[145.80000000000001,{"$error":"#VALUE!"},{"$error":"#VALUE!"},{"$error":"#VALUE!"},{"$error":"#VALUE!"},{"$error":"#VALUE!"},{"$error":"#VALUE!"},{"$error":"#VALUE!"},{"$error":"#VALUE!"},{"$error":"#VALUE!"}]
[146,{"$error":"#VALUE!"},{"$error":"#VALUE!"},{"$error":"#VALUE!"},{"$error":"#VALUE!"},{"$error":"#VALUE!"},{"$error":"#VALUE!"},{"$error":"#VALUE!"},{"$error":"#VALUE!"},{"$error":"#VALUE!"}]
[146.19999999999999,{"$error":"#VALUE!"},{"$error":"#VALUE!"},{"$error":"#VALUE!"},{"$error":"#VALUE!"},{"$error":"#VALUE!"},{"$error":"#VALUE!"},{"$error":"#VALUE!"},{"$error":"#VALUE!"},{"$error":"#VALUE!"}]
[146.4,{"$error":"#VALUE!"},{"$error":"#VALUE!"},{"$error":"#VALUE!"},{"$error":"#VALUE!"},{"$error":"#VALUE!"},{"$error":"#VALUE!"},{"$error":"#VALUE!"},{"$error":"#VALUE!"},{"$error":"#VALUE!"}]
[146.6,{"$error":"#VALUE!"},{"$error":"#VALUE!"},{"$error":"#VALUE!"},{"$error":"#VALUE!"},{"$error":"#VALUE!"},{"$error":"#VALUE!"},{"$error":"#VALUE!"},{"$error":"#VALUE!"},{"$error":"#VALUE!"}]
[146.80000000000001,{"$error":"#VALUE!"},{"$error":"#VALUE!"},{"$error":"#VALUE!"},{"$error":"#VALUE!"},{"$error":"#VALUE!"},{"$error":"#VALUE!"},{"$error":"#VALUE!"},{"$error":"#VALUE!"},{"$error":"#VALUE!"}]
[147,{"$error":"#VALUE!"},{"$error":"#VALUE!"},{"$error":"#VALUE!"},{"$error":"#VALUE!"},{"$error":"#VALUE!"},{"$error":"#VALUE!"},{"$error":"#VALUE!"},{"$error":"#VALUE!"},{"$error":"#VALUE!"}]
[147.19999999999999,{"$error":"#VALUE!"},{"$error":"#VALUE!"},{"$error":"#VALUE!"},{"$error":"#VALUE!"},{"$error":"#VALUE!"},{"$error":"#VALUE!"},{"$error":"#VALUE!"},{"$error":"#VALUE!"},{"$error":"#VALUE!"}]
[147.4,{"$error":"#VALUE!"},{"$error":"#VALUE!"},{"$error":"#VALUE!"},{"$error":"#VALUE!"},{"$error":"#VALUE!"},{"$error":"#VALUE!"},{"$error":"#VALUE!"},{"$error":"#VALUE!"},{"$error":"#VALUE!"}]
[147.6,{"$error":"#VALUE!"},{"$error":"#VALUE!"},{"$error":"#VALUE!"},{"$error":"#VALUE!"},{"$error":"#VALUE!"},{"$error":"#VALUE!"},{"$error":"#VALUE!"},{"$error":"#VALUE!"},{"$error":"#VALUE!"}]
[147.80000000000001,{"$error":"#VALUE!"},{"$error":"#VALUE!"},{"$error":"#VALUE!"},{"$error":"#VALUE!"},{"$error":"#VALUE!"},{"$error":"#VALUE!"},{"$error":"#VALUE!"},{"$error":"#VALUE!"},{"$error":"#VALUE!"}]
[148,{"$error":"#VALUE!"},{"$error":"#VALUE!"},{"$error":"#VALUE!"},{"$error":"#VALUE!"},{"$error":"#VALUE!"},{"$error":"#VALUE!"},{"$error":"#VALUE!"},{"$error":"#VALUE!"},{"$error":"#VALUE!"}]
[148.19999999999999,{"$error":"#VALUE!"},{"$error":"#VALUE!"},{"$error":"#VALUE!"},{"$error":"#VALUE!"},{"$error":"#VALUE!"},{"$error":"#VALUE!"},{"$error":"#VALUE!"},{"$error":"#VALUE!"},{"$error":"#VALUE!"}]
[148.4,{"$error":"#VALUE!"},{"$error":"#VALUE!"},{"$error":"#VALUE!"},{"$error":"#VALUE!"},{"$error":"#VALUE!"},{"$error":"#VALUE!"},{"$error":"#VALUE!"},{"$error":"#VALUE!"},{"$error":"#VALUE!"}]
[148.6,{"$error":"#VALUE!"},{"$error":"#VALUE!"},{"$error":"#VALUE!"},{"$error":"#VALUE!"},{"$error":"#VALUE!"},{"$error":"#VALUE!"},{"$error":"#VALUE!"},{"$error":"#VALUE!"},{"$error":"#VALUE!"}]
[148.80000000000001,{"$error":"#VALUE!"},{"$error":"#VALUE!"},{"$error":"#VALUE!"},{"$error":"#VALUE!"},{"$error":"#VALUE!"},{"$error":"#VALUE!"},{"$error":"#VALUE!"},{"$error":"#VALUE!"},{"$error":"#VALUE!"}]
[149,{"$error":"#VALUE!"},{"$error":"#VALUE!"},{"$error":"#VALUE!"},{"$error":"#VALUE!"},{"$error":"#VALUE!"},{"$error":"#VALUE!"},{"$error":"#VALUE!"},{"$error":"#VALUE!"},{"$error":"#VALUE!"}]
[149.19999999999999,{"$error":"#VALUE!"},{"$error":"#VALUE!"},{"$error":"#VALUE!"},{"$error":"#VALUE!"},{"$error":"#VALUE!"},{"$error":"#VALUE!"},{"$error":"#VALUE!"},{"$error":"#VALUE!"},{"$error":"#VALUE!"}]
[149.4,{"$error":"#VALUE!"},{"$error":"#VALUE!"},{"$error":"#VALUE!"},{"$error":"#VALUE!"},{"$error":"#VALUE!"},{"$error":"#VALUE!"},{"$error":"#VALUE!"},{"$error":"#VALUE!"},{"$error":"#VALUE!"}]
[149.6,{"$error":"#VALUE!"},{"$error":"#VALUE!"},{"$error":"#VALUE!"},{"$error":"#VALUE!"},{"$error":"#VALUE!"},{"$error":"#VALUE!"},{"$error":"#VALUE!"},{"$error":"#VALUE!"},{"$error":"#VALUE!"}]
[149.80000000000001,{"$error":"#VALUE!"},{"$error":"#VALUE!"},{"$error":"#VALUE!"},{"$error":"#VALUE!"},{"$error":"#VALUE!"},{"$error":"#VALUE!"},{"$error":"#VALUE!"},{"$error":"#VALUE!"},{"$error":"#VALUE!"}]
[150,{"$error":"#VALUE!"},{"$error":"#VALUE!"},{"$error":"#VALUE!"},{"$error":"#VALUE!"},{"$error":"#VALUE!"},{"$error":"#VALUE!"},{"$error":"#VALUE!"},{"$error":"#VALUE!"},{"$error":"#VALUE!"}]
[150.19999999999999,{"$error":"#VALUE!"},{"$error":"#VALUE!"},{"$error":"#VALUE!"},{"$error":"#VALUE!"},{"$error":"#VALUE!"},{"$error":"#VALUE!"},{"$error":"#VALUE!"},{"$error":"#VALUE!"},{"$error":"#VALUE!"}]
[150.4,{"$error":"#VALUE!"},{"$error":"#VALUE!"},{"$error":"#VALUE!"},{"$error":"#VALUE!"},{"$error":"#VALUE!"},{"$error":"#VALUE!"},{"$error":"#VALUE!"},{"$error":"#VALUE!"},{"$error":"#VALUE!"}]
[150.6,{"$error":"#VALUE!"},{"$error":"#VALUE!"},{"$error":"#VALUE!"},{"$error":"#VALUE!"},{"$error":"#VALUE!"},{"$error":"#VALUE!"},{"$error":"#VALUE!"},{"$error":"#VALUE!"},{"$error":"#VALUE!"}]
[150.80000000000001,{"$error":"#VALUE!"},{"$error":"#VALUE!"},{"$error":"#VALUE!"},{"$error":"#VALUE!"},{"$error":"#VALUE!"},{"$error":"#VALUE!"},{"$error":"#VALUE!"},{"$error":"#VALUE!"},{"$error":"#VALUE!"}]
[151,{"$error":"#VALUE!"},{"$error":"#VALUE!"},{"$error":"#VALUE!"},{"$error":"#VALUE!"},{"$error":"#VALUE!"},{"$error":"#VALUE!"},{"$error":"#VALUE!"},{"$error":"#VALUE!"},{"$error":"#VALUE!"}]
[151.19999999999999,{"$error":"#VALUE!"},{"$error":"#VALUE!"},{"$error":"#VALUE!"},{"$error":"#VALUE!"},{"$error":"#VALUE!"},{"$error":"#VALUE!"},{"$error":"#VALUE!"},{"$error":"#VALUE!"},{"$error":"#VALUE!"}]
[151.4,{"$error":"#VALUE!"},{"$error":"#VALUE!"},{"$error":"#VALUE!"},{"$error":"#VALUE!"},{"$error":"#VALUE!"},{"$error":"#VALUE!"},{"$error":"#VALUE!"},{"$error":"#VALUE!"},{"$error":"#VALUE!"}]
[151.6,{"$error":"#VALUE!"},{"$error":"#VALUE!"},{"$error":"#VALUE!"},{"$error":"#VALUE!"},{"$error":"#VALUE!"},{"$error":"#VALUE!"},{"$error":"#VALUE!"},{"$error":"#VALUE!"},{"$error":"#VALUE!"}]
[151.80000000000001,{"$error":"#VALUE!"},{"$error":"#VALUE!"},{"$error":"#VALUE!"},{"$error":"#VALUE!"},{"$error":"#VALUE!"},{"$error":"#VALUE!"},{"$error":"#VALUE!"},{"$error":"#VALUE!"},{"$error":"#VALUE!"}]
[152,{"$error":"#VALUE!"},{"$error":"#VALUE!"},{"$error":"#VALUE!"},{"$error":"#VALUE!"},{"$error":"#VALUE!"},{"$error":"#VALUE!"},{"$error":"#VALUE!"},{"$error":"#VALUE!"},{"$error":"#VALUE!"}]
[152.19999999999999,{"$error":"#VALUE!"},{"$error":"#VALUE!"},{"$error":"#VALUE!"},{"$error":"#VALUE!"},{"$error":"#VALUE!"},{"$error":"#VALUE!"},{"$error":"#VALUE!"},{"$error":"#VALUE!"},{"$error":"#VALUE!"}]
[152.4,{"$error":"#VALUE!"},{"$error":"#VALUE!"},{"$error":"#VALUE!"},{"$error":"#VALUE!"},{"$error":"#VALUE!"},{"$error":"#VALUE!"},{"$error":"#VALUE!"},{"$error":"#VALUE!"},{"$error":"#VALUE!"}]
[152.6,{"$error":"#VALUE!"},{"$error":"#VALUE!"},{"$error":"#VALUE!"},{"$error":"#VALUE!"},{"$error":"#VALUE!"},{"$error":"#VALUE!"},{"$error":"#VALUE!"},{"$error":"#VALUE!"},{"$error":"#VALUE!"}]
[152.80000000000001,{"$error":"#VALUE!"},{"$error":"#VALUE!"},{"$error":"#VALUE!"},{"$error":"#VALUE!"},{"$error":"#VALUE!"},{"$error":"#VALUE!"},{"$error":"#VALUE!"},{"$error":"#VALUE!"},{"$error":"#VALUE!"}]
[153,{"$error":"#VALUE!"},{"$error":"#VALUE!"},{"$error":"#VALUE!"},{"$error":"#VALUE!"},{"$error":"#VALUE!"},{"$error":"#VALUE!"},{"$error":"#VALUE!"},{"$error":"#VALUE!"},{"$error":"#VALUE!"}]
[153.19999999999999,{"$error":"#VALUE!"},{"$error":"#VALUE!"},{"$error":"#VALUE!"},{"$error":"#VALUE!"},{"$error":"#VALUE!"},{"$error":"#VALUE!"},{"$error":"#VALUE!"},{"$error":"#VALUE!"},{"$error":"#VALUE!"}]
[153.4,{"$error":"#VALUE!"},{"$error":"#VALUE!"},{"$error":"#VALUE!"},{"$error":"#VALUE!"},{"$error":"#VALUE!"},{"$error":"#VALUE!"},{"$error":"#VALUE!"},{"$error":"#VALUE!"},{"$error":"#VALUE!"}]
[153.6,{"$error":"#VALUE!"},{"$f":"IF(AND($C$5>=A788,A788>=$B$5),($D$5^2-(A788-$E$5)^2)^0.5,0)","v":{"$error":"#VALUE!"}},{"$f":"IF(AND($C$6>=A788,A788>=$B$6),($D$6^2-(A788-$E$6)^2)^0.5,0)","v":{"$error":"#VALUE!"}},{"$f":"IF(AND($C$7>=A788,A788>$B$7),($D$7^2-(A788-$E$7)^2)^0.5,0)","v":{"$error":"#VALUE!"}},{"$f":"IF(AND($C$8>=A788,A788>=$B$8),($D$8^2-(A788-$E$8)^2)^0.5,0)","v":{"$error":"#VALUE!"}},{"$f":"IF(AND($C$9>=A788,A788>=$B$9),($D$9^2-(A788-$E$9)^2)^0.5,0)","v":{"$error":"#VALUE!"}},{"$f":"IF(AND($C$10>=A788,A788>=$B$10),($D$10^2-(A788-$E$10)^2)^0.5,0)","v":{"$error":"#VALUE!"}},{"$f":"IF(AND($C$11>=A788,A788>=$B$11),($D$11^2-(A788-$E$11)^2)^0.5,0)","v":{"$error":"#VALUE!"}},{"$error":"#VALUE!"}]
[153.80000000000001,{"$f":"$G$15*A789+$G$16","v":{"$error":"#VALUE!"}},{"$error":"#VALUE!"},{"$error":"#VALUE!"},{"$error":"#VALUE!"},{"$error":"#VALUE!"},{"$error":"#VALUE!"},{"$error":"#VALUE!"},{"$error":"#VALUE!"},{"$f":"IF(AND($C$12>=A789,A789>=$B$12),($D$12^2-(A789-$E$12)^2)^0.5,0)","v":{"$error":"#VALUE!"}}]
[{"$f":"A789+0.2","v":154},{"$error":"#VALUE!"},{"$error":"#VALUE!"},{"$error":"#VALUE!"},{"$error":"#VALUE!"},{"$error":"#VALUE!"},{"$error":"#VALUE!"},{"$error":"#VALUE!"},{"$error":"#VALUE!"},{"$error":"#VALUE!"}]
[154.19999999999999,{"$error":"#VALUE!"},{"$error":"#VALUE!"},{"$error":"#VALUE!"},{"$error":"#VALUE!"},{"$error":"#VALUE!"},{"$error":"#VALUE!"},{"$error":"#VALUE!"},{"$error":"#VALUE!"},{"$error":"#VALUE!"}]
[154.4,{"$error":"#VALUE!"},{"$error":"#VALUE!"},{"$error":"#VALUE!"},{"$error":"#VALUE!"},{"$error":"#VALUE!"},{"$error":"#VALUE!"},{"$error":"#VALUE!"},{"$error":"#VALUE!"},{"$error":"#VALUE!"}]
[154.6,{"$error":"#VALUE!"},{"$error":"#VALUE!"},{"$error":"#VALUE!"},{"$error":"#VALUE!"},{"$error":"#VALUE!"},{"$error":"#VALUE!"},{"$error":"#VALUE!"},{"$error":"#VALUE!"},{"$error":"#VALUE!"}]
[154.80000000000001,{"$error":"#VALUE!"},{"$error":"#VALUE!"},{"$error":"#VALUE!"},{"$error":"#VALUE!"},{"$error":"#VALUE!"},{"$error":"#VALUE!"},{"$error":"#VALUE!"},{"$error":"#VALUE!"},{"$error":"#VALUE!"}]
[155,{"$error":"#VALUE!"},{"$error":"#VALUE!"},{"$error":"#VALUE!"},{"$error":"#VALUE!"},{"$error":"#VALUE!"},{"$error":"#VALUE!"},{"$error":"#VALUE!"},{"$error":"#VALUE!"},{"$error":"#VALUE!"}]
[155.19999999999999,{"$error":"#VALUE!"},{"$error":"#VALUE!"},{"$error":"#VALUE!"},{"$error":"#VALUE!"},{"$error":"#VALUE!"},{"$error":"#VALUE!"},{"$error":"#VALUE!"},{"$error":"#VALUE!"},{"$error":"#VALUE!"}]
[155.4,{"$error":"#VALUE!"},{"$error":"#VALUE!"},{"$error":"#VALUE!"},{"$error":"#VALUE!"},{"$error":"#VALUE!"},{"$error":"#VALUE!"},{"$error":"#VALUE!"},{"$error":"#VALUE!"},{"$error":"#VALUE!"}]
[155.6,{"$error":"#VALUE!"},{"$error":"#VALUE!"},{"$error":"#VALUE!"},{"$error":"#VALUE!"},{"$error":"#VALUE!"},{"$error":"#VALUE!"},{"$error":"#VALUE!"},{"$error":"#VALUE!"},{"$error":"#VALUE!"}]
[155.80000000000001,{"$error":"#VALUE!"},{"$error":"#VALUE!"},{"$error":"#VALUE!"},{"$error":"#VALUE!"},{"$error":"#VALUE!"},{"$error":"#VALUE!"},{"$error":"#VALUE!"},{"$error":"#VALUE!"},{"$error":"#VALUE!"}]
[156,{"$error":"#VALUE!"},{"$error":"#VALUE!"},{"$error":"#VALUE!"},{"$error":"#VALUE!"},{"$error":"#VALUE!"},{"$error":"#VALUE!"},{"$error":"#VALUE!"},{"$error":"#VALUE!"},{"$error":"#VALUE!"}]
[156.19999999999999,{"$error":"#VALUE!"},{"$error":"#VALUE!"},{"$error":"#VALUE!"},{"$error":"#VALUE!"},{"$error":"#VALUE!"},{"$error":"#VALUE!"},{"$error":"#VALUE!"},{"$error":"#VALUE!"},{"$error":"#VALUE!"}]
[156.4,{"$error":"#VALUE!"},{"$error":"#VALUE!"},{"$error":"#VALUE!"},{"$error":"#VALUE!"},{"$error":"#VALUE!"},{"$error":"#VALUE!"},{"$error":"#VALUE!"},{"$error":"#VALUE!"},{"$error":"#VALUE!"}]
[156.6,{"$error":"#VALUE!"},{"$error":"#VALUE!"},{"$error":"#VALUE!"},{"$error":"#VALUE!"},{"$error":"#VALUE!"},{"$error":"#VALUE!"},{"$error":"#VALUE!"},{"$error":"#VALUE!"},{"$error":"#VALUE!"}]
[156.80000000000001,{"$error":"#VALUE!"},{"$error":"#VALUE!"},{"$error":"#VALUE!"},{"$error":"#VALUE!"},{"$error":"#VALUE!"},{"$error":"#VALUE!"},{"$error":"#VALUE!"},{"$error":"#VALUE!"},{"$error":"#VALUE!"}]
[157,{"$error":"#VALUE!"},{"$error":"#VALUE!"},{"$error":"#VALUE!"},{"$error":"#VALUE!"},{"$error":"#VALUE!"},{"$error":"#VALUE!"},{"$error":"#VALUE!"},{"$error":"#VALUE!"},{"$error":"#VALUE!"}]
[157.19999999999999,{"$error":"#VALUE!"},{"$error":"#VALUE!"},{"$error":"#VALUE!"},{"$error":"#VALUE!"},{"$error":"#VALUE!"},{"$error":"#VALUE!"},{"$error":"#VALUE!"},{"$error":"#VALUE!"},{"$error":"#VALUE!"}]
[157.4,{"$error":"#VALUE!"},{"$error":"#VALUE!"},{"$error":"#VALUE!"},{"$error":"#VALUE!"},{"$error":"#VALUE!"},{"$error":"#VALUE!"},{"$error":"#VALUE!"},{"$error":"#VALUE!"},{"$error":"#VALUE!"}]
[157.6,{"$error":"#VALUE!"},{"$error":"#VALUE!"},{"$error":"#VALUE!"},{"$error":"#VALUE!"},{"$error":"#VALUE!"},{"$error":"#VALUE!"},{"$error":"#VALUE!"},{"$error":"#VALUE!"},{"$error":"#VALUE!"}]
[157.80000000000001,{"$error":"#VALUE!"},{"$error":"#VALUE!"},{"$error":"#VALUE!"},{"$error":"#VALUE!"},{"$error":"#VALUE!"},{"$error":"#VALUE!"},{"$error":"#VALUE!"},{"$error":"#VALUE!"},{"$error":"#VALUE!"}]
[158,{"$error":"#VALUE!"},{"$error":"#VALUE!"},{"$error":"#VALUE!"},{"$error":"#VALUE!"},{"$error":"#VALUE!"},{"$error":"#VALUE!"},{"$error":"#VALUE!"},{"$error":"#VALUE!"},{"$error":"#VALUE!"}]
[158.19999999999999,{"$error":"#VALUE!"},{"$error":"#VALUE!"},{"$error":"#VALUE!"},{"$error":"#VALUE!"},{"$error":"#VALUE!"},{"$error":"#VALUE!"},{"$error":"#VALUE!"},{"$error":"#VALUE!"},{"$error":"#VALUE!"}]
[158.4,{"$error":"#VALUE!"},{"$error":"#VALUE!"},{"$error":"#VALUE!"},{"$error":"#VALUE!"},{"$error":"#VALUE!"},{"$error":"#VALUE!"},{"$error":"#VALUE!"},{"$error":"#VALUE!"},{"$error":"#VALUE!"}]
[158.6,{"$error":"#VALUE!"},{"$error":"#VALUE!"},{"$error":"#VALUE!"},{"$error":"#VALUE!"},{"$error":"#VALUE!"},{"$error":"#VALUE!"},{"$error":"#VALUE!"},{"$error":"#VALUE!"},{"$error":"#VALUE!"}]
[158.80000000000001,{"$error":"#VALUE!"},{"$error":"#VALUE!"},{"$error":"#VALUE!"},{"$error":"#VALUE!"},{"$error":"#VALUE!"},{"$error":"#VALUE!"},{"$error":"#VALUE!"},{"$error":"#VALUE!"},{"$error":"#VALUE!"}]
[159,{"$error":"#VALUE!"},{"$error":"#VALUE!"},{"$error":"#VALUE!"},{"$error":"#VALUE!"},{"$error":"#VALUE!"},{"$error":"#VALUE!"},{"$error":"#VALUE!"},{"$error":"#VALUE!"},{"$error":"#VALUE!"}]
[159.19999999999999,{"$error":"#VALUE!"},{"$error":"#VALUE!"},{"$error":"#VALUE!"},{"$error":"#VALUE!"},{"$error":"#VALUE!"},{"$error":"#VALUE!"},{"$error":"#VALUE!"},{"$error":"#VALUE!"},{"$error":"#VALUE!"}]
[159.4,{"$error":"#VALUE!"},{"$error":"#VALUE!"},{"$error":"#VALUE!"},{"$error":"#VALUE!"},{"$error":"#VALUE!"},{"$error":"#VALUE!"},{"$error":"#VALUE!"},{"$error":"#VALUE!"},{"$error":"#VALUE!"}]
[159.6,{"$error":"#VALUE!"},{"$error":"#VALUE!"},{"$error":"#VALUE!"},{"$error":"#VALUE!"},{"$error":"#VALUE!"},{"$error":"#VALUE!"},{"$error":"#VALUE!"},{"$error":"#VALUE!"},{"$error":"#VALUE!"}]
[159.80000000000001,{"$error":"#VALUE!"},{"$error":"#VALUE!"},{"$error":"#VALUE!"},{"$error":"#VALUE!"},{"$error":"#VALUE!"},{"$error":"#VALUE!"},{"$error":"#VALUE!"},{"$error":"#VALUE!"},{"$error":"#VALUE!"}]
[160,{"$error":"#VALUE!"},{"$error":"#VALUE!"},{"$error":"#VALUE!"},{"$error":"#VALUE!"},{"$error":"#VALUE!"},{"$error":"#VALUE!"},{"$error":"#VALUE!"},{"$error":"#VALUE!"},{"$error":"#VALUE!"}]
[160.19999999999999,{"$error":"#VALUE!"},{"$error":"#VALUE!"},{"$error":"#VALUE!"},{"$error":"#VALUE!"},{"$error":"#VALUE!"},{"$error":"#VALUE!"},{"$error":"#VALUE!"},{"$error":"#VALUE!"},{"$error":"#VALUE!"}]
[160.4,{"$error":"#VALUE!"},{"$error":"#VALUE!"},{"$error":"#VALUE!"},{"$error":"#VALUE!"},{"$error":"#VALUE!"},{"$error":"#VALUE!"},{"$error":"#VALUE!"},{"$error":"#VALUE!"},{"$error":"#VALUE!"}]
[160.6,{"$error":"#VALUE!"},{"$error":"#VALUE!"},{"$error":"#VALUE!"},{"$error":"#VALUE!"},{"$error":"#VALUE!"},{"$error":"#VALUE!"},{"$error":"#VALUE!"},{"$error":"#VALUE!"},{"$error":"#VALUE!"}]
[160.80000000000001,{"$error":"#VALUE!"},{"$error":"#VALUE!"},{"$error":"#VALUE!"},{"$error":"#VALUE!"},{"$error":"#VALUE!"},{"$error":"#VALUE!"},{"$error":"#VALUE!"},{"$error":"#VALUE!"},{"$error":"#VALUE!"}]
[161,{"$error":"#VALUE!"},{"$error":"#VALUE!"},{"$error":"#VALUE!"},{"$error":"#VALUE!"},{"$error":"#VALUE!"},{"$error":"#VALUE!"},{"$error":"#VALUE!"},{"$error":"#VALUE!"},{"$error":"#VALUE!"}]
[161.19999999999999,{"$error":"#VALUE!"},{"$error":"#VALUE!"},{"$error":"#VALUE!"},{"$error":"#VALUE!"},{"$error":"#VALUE!"},{"$error":"#VALUE!"},{"$error":"#VALUE!"},{"$error":"#VALUE!"},{"$error":"#VALUE!"}]
[161.4,{"$error":"#VALUE!"},{"$error":"#VALUE!"},{"$error":"#VALUE!"},{"$error":"#VALUE!"},{"$error":"#VALUE!"},{"$error":"#VALUE!"},{"$error":"#VALUE!"},{"$error":"#VALUE!"},{"$error":"#VALUE!"}]
[161.6,{"$error":"#VALUE!"},{"$error":"#VALUE!"},{"$error":"#VALUE!"},{"$error":"#VALUE!"},{"$error":"#VALUE!"},{"$error":"#VALUE!"},{"$error":"#VALUE!"},{"$error":"#VALUE!"},{"$error":"#VALUE!"}]
[161.80000000000001,{"$error":"#VALUE!"},{"$error":"#VALUE!"},{"$error":"#VALUE!"},{"$error":"#VALUE!"},{"$error":"#VALUE!"},{"$error":"#VALUE!"},{"$error":"#VALUE!"},{"$error":"#VALUE!"},{"$error":"#VALUE!"}]
[162,{"$error":"#VALUE!"},{"$error":"#VALUE!"},{"$error":"#VALUE!"},{"$error":"#VALUE!"},{"$error":"#VALUE!"},{"$error":"#VALUE!"},{"$error":"#VALUE!"},{"$error":"#VALUE!"},{"$error":"#VALUE!"}]
[162.19999999999999,{"$error":"#VALUE!"},{"$error":"#VALUE!"},{"$error":"#VALUE!"},{"$error":"#VALUE!"},{"$error":"#VALUE!"},{"$error":"#VALUE!"},{"$error":"#VALUE!"},{"$error":"#VALUE!"},{"$error":"#VALUE!"}]
[162.4,{"$error":"#VALUE!"},{"$error":"#VALUE!"},{"$error":"#VALUE!"},{"$error":"#VALUE!"},{"$error":"#VALUE!"},{"$error":"#VALUE!"},{"$error":"#VALUE!"},{"$error":"#VALUE!"},{"$error":"#VALUE!"}]
[162.6,{"$error":"#VALUE!"},{"$error":"#VALUE!"},{"$error":"#VALUE!"},{"$error":"#VALUE!"},{"$error":"#VALUE!"},{"$error":"#VALUE!"},{"$error":"#VALUE!"},{"$error":"#VALUE!"},{"$error":"#VALUE!"}]
[162.80000000000001,{"$error":"#VALUE!"},{"$error":"#VALUE!"},{"$error":"#VALUE!"},{"$error":"#VALUE!"},{"$error":"#VALUE!"},{"$error":"#VALUE!"},{"$error":"#VALUE!"},{"$error":"#VALUE!"},{"$error":"#VALUE!"}]
[163,{"$error":"#VALUE!"},{"$error":"#VALUE!"},{"$error":"#VALUE!"},{"$error":"#VALUE!"},{"$error":"#VALUE!"},{"$error":"#VALUE!"},{"$error":"#VALUE!"},{"$error":"#VALUE!"},{"$error":"#VALUE!"}]
[163.19999999999999,{"$error":"#VALUE!"},{"$error":"#VALUE!"},{"$error":"#VALUE!"},{"$error":"#VALUE!"},{"$error":"#VALUE!"},{"$error":"#VALUE!"},{"$error":"#VALUE!"},{"$error":"#VALUE!"},{"$error":"#VALUE!"}]
[163.4,{"$error":"#VALUE!"},{"$error":"#VALUE!"},{"$error":"#VALUE!"},{"$error":"#VALUE!"},{"$error":"#VALUE!"},{"$error":"#VALUE!"},{"$error":"#VALUE!"},{"$error":"#VALUE!"},{"$error":"#VALUE!"}]
[163.6,{"$error":"#VALUE!"},{"$error":"#VALUE!"},{"$error":"#VALUE!"},{"$error":"#VALUE!"},{"$error":"#VALUE!"},{"$error":"#VALUE!"},{"$error":"#VALUE!"},{"$error":"#VALUE!"},{"$error":"#VALUE!"}]
[163.80000000000001,{"$error":"#VALUE!"},{"$error":"#VALUE!"},{"$error":"#VALUE!"},{"$error":"#VALUE!"},{"$error":"#VALUE!"},{"$error":"#VALUE!"},{"$error":"#VALUE!"},{"$error":"#VALUE!"},{"$error":"#VALUE!"}]
[164,{"$error":"#VALUE!"},{"$error":"#VALUE!"},{"$error":"#VALUE!"},{"$error":"#VALUE!"},{"$error":"#VALUE!"},{"$error":"#VALUE!"},{"$error":"#VALUE!"},{"$error":"#VALUE!"},{"$error":"#VALUE!"}]
[164.2,{"$error":"#VALUE!"},{"$error":"#VALUE!"},{"$error":"#VALUE!"},{"$error":"#VALUE!"},{"$error":"#VALUE!"},{"$error":"#VALUE!"},{"$error":"#VALUE!"},{"$error":"#VALUE!"},{"$error":"#VALUE!"}]
[164.4,{"$error":"#VALUE!"},{"$error":"#VALUE!"},{"$error":"#VALUE!"},{"$error":"#VALUE!"},{"$error":"#VALUE!"},{"$error":"#VALUE!"},{"$error":"#VALUE!"},{"$error":"#VALUE!"},{"$error":"#VALUE!"}]
[164.6,{"$error":"#VALUE!"},{"$error":"#VALUE!"},{"$error":"#VALUE!"},{"$error":"#VALUE!"},{"$error":"#VALUE!"},{"$error":"#VALUE!"},{"$error":"#VALUE!"},{"$error":"#VALUE!"},{"$error":"#VALUE!"}]
[164.8,{"$error":"#VALUE!"},{"$error":"#VALUE!"},{"$error":"#VALUE!"},{"$error":"#VALUE!"},{"$error":"#VALUE!"},{"$error":"#VALUE!"},{"$error":"#VALUE!"},{"$error":"#VALUE!"},{"$error":"#VALUE!"}]
[165,{"$error":"#VALUE!"},{"$error":"#VALUE!"},{"$error":"#VALUE!"},{"$error":"#VALUE!"},{"$error":"#VALUE!"},{"$error":"#VALUE!"},{"$error":"#VALUE!"},{"$error":"#VALUE!"},{"$error":"#VALUE!"}]
[165.2,{"$error":"#VALUE!"},{"$error":"#VALUE!"},{"$error":"#VALUE!"},{"$error":"#VALUE!"},{"$error":"#VALUE!"},{"$error":"#VALUE!"},{"$error":"#VALUE!"},{"$error":"#VALUE!"},{"$error":"#VALUE!"}]
[165.4,{"$error":"#VALUE!"},{"$error":"#VALUE!"},{"$error":"#VALUE!"},{"$error":"#VALUE!"},{"$error":"#VALUE!"},{"$error":"#VALUE!"},{"$error":"#VALUE!"},{"$error":"#VALUE!"},{"$error":"#VALUE!"}]
[165.6,{"$error":"#VALUE!"},{"$error":"#VALUE!"},{"$error":"#VALUE!"},{"$error":"#VALUE!"},{"$error":"#VALUE!"},{"$error":"#VALUE!"},{"$error":"#VALUE!"},{"$error":"#VALUE!"},{"$error":"#VALUE!"}]
[165.8,{"$error":"#VALUE!"},{"$error":"#VALUE!"},{"$error":"#VALUE!"},{"$error":"#VALUE!"},{"$error":"#VALUE!"},{"$error":"#VALUE!"},{"$error":"#VALUE!"},{"$error":"#VALUE!"},{"$error":"#VALUE!"}]
[166,{"$error":"#VALUE!"},{"$error":"#VALUE!"},{"$error":"#VALUE!"},{"$error":"#VALUE!"},{"$error":"#VALUE!"},{"$error":"#VALUE!"},{"$error":"#VALUE!"},{"$error":"#VALUE!"},{"$error":"#VALUE!"}]
[166.2,{"$error":"#VALUE!"},{"$error":"#VALUE!"},{"$error":"#VALUE!"},{"$error":"#VALUE!"},{"$error":"#VALUE!"},{"$error":"#VALUE!"},{"$error":"#VALUE!"},{"$error":"#VALUE!"},{"$error":"#VALUE!"}]
[166.4,{"$error":"#VALUE!"},{"$f":"IF(AND($C$5>=A852,A852>=$B$5),($D$5^2-(A852-$E$5)^2)^0.5,0)","v":{"$error":"#VALUE!"}},{"$f":"IF(AND($C$6>=A852,A852>=$B$6),($D$6^2-(A852-$E$6)^2)^0.5,0)","v":{"$error":"#VALUE!"}},{"$f":"IF(AND($C$7>=A852,A852>$B$7),($D$7^2-(A852-$E$7)^2)^0.5,0)","v":{"$error":"#VALUE!"}},{"$f":"IF(AND($C$8>=A852,A852>=$B$8),($D$8^2-(A852-$E$8)^2)^0.5,0)","v":{"$error":"#VALUE!"}},{"$f":"IF(AND($C$9>=A852,A852>=$B$9),($D$9^2-(A852-$E$9)^2)^0.5,0)","v":{"$error":"#VALUE!"}},{"$f":"IF(AND($C$10>=A852,A852>=$B$10),($D$10^2-(A852-$E$10)^2)^0.5,0)","v":{"$error":"#VALUE!"}},{"$f":"IF(AND($C$11>=A852,A852>=$B$11),($D$11^2-(A852-$E$11)^2)^0.5,0)","v":{"$error":"#VALUE!"}},{"$error":"#VALUE!"}]
[166.6,{"$f":"$G$15*A853+$G$16","v":{"$error":"#VALUE!"}},{"$error":"#VALUE!"},{"$error":"#VALUE!"},{"$error":"#VALUE!"},{"$error":"#VALUE!"},{"$error":"#VALUE!"},{"$error":"#VALUE!"},{"$error":"#VALUE!"},{"$f":"IF(AND($C$12>=A853,A853>=$B$12),($D$12^2-(A853-$E$12)^2)^0.5,0)","v":{"$error":"#VALUE!"}}]
[{"$f":"A853+0.2","v":166.8},{"$error":"#VALUE!"},{"$error":"#VALUE!"},{"$error":"#VALUE!"},{"$error":"#VALUE!"},{"$error":"#VALUE!"},{"$error":"#VALUE!"},{"$error":"#VALUE!"},{"$error":"#VALUE!"},{"$error":"#VALUE!"}]
[167,{"$error":"#VALUE!"},{"$error":"#VALUE!"},{"$error":"#VALUE!"},{"$error":"#VALUE!"},{"$error":"#VALUE!"},{"$error":"#VALUE!"},{"$error":"#VALUE!"},{"$error":"#VALUE!"},{"$error":"#VALUE!"}]
[167.2,{"$error":"#VALUE!"},{"$error":"#VALUE!"},{"$error":"#VALUE!"},{"$error":"#VALUE!"},{"$error":"#VALUE!"},{"$error":"#VALUE!"},{"$error":"#VALUE!"},{"$error":"#VALUE!"},{"$error":"#VALUE!"}]
[167.4,{"$error":"#VALUE!"},{"$error":"#VALUE!"},{"$error":"#VALUE!"},{"$error":"#VALUE!"},{"$error":"#VALUE!"},{"$error":"#VALUE!"},{"$error":"#VALUE!"},{"$error":"#VALUE!"},{"$error":"#VALUE!"}]
[167.6,{"$error":"#VALUE!"},{"$error":"#VALUE!"},{"$error":"#VALUE!"},{"$error":"#VALUE!"},{"$error":"#VALUE!"},{"$error":"#VALUE!"},{"$error":"#VALUE!"},{"$error":"#VALUE!"},{"$error":"#VALUE!"}]
[167.8,{"$error":"#VALUE!"},{"$error":"#VALUE!"},{"$error":"#VALUE!"},{"$error":"#VALUE!"},{"$error":"#VALUE!"},{"$error":"#VALUE!"},{"$error":"#VALUE!"},{"$error":"#VALUE!"},{"$error":"#VALUE!"}]
[168,{"$error":"#VALUE!"},{"$error":"#VALUE!"},{"$error":"#VALUE!"},{"$error":"#VALUE!"},{"$error":"#VALUE!"},{"$error":"#VALUE!"},{"$error":"#VALUE!"},{"$error":"#VALUE!"},{"$error":"#VALUE!"}]
[168.2,{"$error":"#VALUE!"},{"$error":"#VALUE!"},{"$error":"#VALUE!"},{"$error":"#VALUE!"},{"$error":"#VALUE!"},{"$error":"#VALUE!"},{"$error":"#VALUE!"},{"$error":"#VALUE!"},{"$error":"#VALUE!"}]
[168.4,{"$error":"#VALUE!"},{"$error":"#VALUE!"},{"$error":"#VALUE!"},{"$error":"#VALUE!"},{"$error":"#VALUE!"},{"$error":"#VALUE!"},{"$error":"#VALUE!"},{"$error":"#VALUE!"},{"$error":"#VALUE!"}]
[168.6,{"$error":"#VALUE!"},{"$error":"#VALUE!"},{"$error":"#VALUE!"},{"$error":"#VALUE!"},{"$error":"#VALUE!"},{"$error":"#VALUE!"},{"$error":"#VALUE!"},{"$error":"#VALUE!"},{"$error":"#VALUE!"}]
[168.8,{"$error":"#VALUE!"},{"$error":"#VALUE!"},{"$error":"#VALUE!"},{"$error":"#VALUE!"},{"$error":"#VALUE!"},{"$error":"#VALUE!"},{"$error":"#VALUE!"},{"$error":"#VALUE!"},{"$error":"#VALUE!"}]
[169,{"$error":"#VALUE!"},{"$error":"#VALUE!"},{"$error":"#VALUE!"},{"$error":"#VALUE!"},{"$error":"#VALUE!"},{"$error":"#VALUE!"},{"$error":"#VALUE!"},{"$error":"#VALUE!"},{"$error":"#VALUE!"}]
[169.2,{"$error":"#VALUE!"},{"$error":"#VALUE!"},{"$error":"#VALUE!"},{"$error":"#VALUE!"},{"$error":"#VALUE!"},{"$error":"#VALUE!"},{"$error":"#VALUE!"},{"$error":"#VALUE!"},{"$error":"#VALUE!"}]
[169.4,{"$error":"#VALUE!"},{"$error":"#VALUE!"},{"$error":"#VALUE!"},{"$error":"#VALUE!"},{"$error":"#VALUE!"},{"$error":"#VALUE!"},{"$error":"#VALUE!"},{"$error":"#VALUE!"},{"$error":"#VALUE!"}]
[169.6,{"$error":"#VALUE!"},{"$error":"#VALUE!"},{"$error":"#VALUE!"},{"$error":"#VALUE!"},{"$error":"#VALUE!"},{"$error":"#VALUE!"},{"$error":"#VALUE!"},{"$error":"#VALUE!"},{"$error":"#VALUE!"}]
[169.8,{"$error":"#VALUE!"},{"$error":"#VALUE!"},{"$error":"#VALUE!"},{"$error":"#VALUE!"},{"$error":"#VALUE!"},{"$error":"#VALUE!"},{"$error":"#VALUE!"},{"$error":"#VALUE!"},{"$error":"#VALUE!"}]
[170,{"$error":"#VALUE!"},{"$error":"#VALUE!"},{"$error":"#VALUE!"},{"$error":"#VALUE!"},{"$error":"#VALUE!"},{"$error":"#VALUE!"},{"$error":"#VALUE!"},{"$error":"#VALUE!"},{"$error":"#VALUE!"}]
[170.2,{"$error":"#VALUE!"},{"$error":"#VALUE!"},{"$error":"#VALUE!"},{"$error":"#VALUE!"},{"$error":"#VALUE!"},{"$error":"#VALUE!"},{"$error":"#VALUE!"},{"$error":"#VALUE!"},{"$error":"#VALUE!"}]
[170.4,{"$error":"#VALUE!"},{"$error":"#VALUE!"},{"$error":"#VALUE!"},{"$error":"#VALUE!"},{"$error":"#VALUE!"},{"$error":"#VALUE!"},{"$error":"#VALUE!"},{"$error":"#VALUE!"},{"$error":"#VALUE!"}]
[170.6,{"$error":"#VALUE!"},{"$error":"#VALUE!"},{"$error":"#VALUE!"},{"$error":"#VALUE!"},{"$error":"#VALUE!"},{"$error":"#VALUE!"},{"$error":"#VALUE!"},{"$error":"#VALUE!"},{"$error":"#VALUE!"}]
[170.8,{"$error":"#VALUE!"},{"$error":"#VALUE!"},{"$error":"#VALUE!"},{"$error":"#VALUE!"},{"$error":"#VALUE!"},{"$error":"#VALUE!"},{"$error":"#VALUE!"},{"$error":"#VALUE!"},{"$error":"#VALUE!"}]
[171,{"$error":"#VALUE!"},{"$error":"#VALUE!"},{"$error":"#VALUE!"},{"$error":"#VALUE!"},{"$error":"#VALUE!"},{"$error":"#VALUE!"},{"$error":"#VALUE!"},{"$error":"#VALUE!"},{"$error":"#VALUE!"}]
[171.2,{"$error":"#VALUE!"},{"$error":"#VALUE!"},{"$error":"#VALUE!"},{"$error":"#VALUE!"},{"$error":"#VALUE!"},{"$error":"#VALUE!"},{"$error":"#VALUE!"},{"$error":"#VALUE!"},{"$error":"#VALUE!"}]
[171.4,{"$error":"#VALUE!"},{"$error":"#VALUE!"},{"$error":"#VALUE!"},{"$error":"#VALUE!"},{"$error":"#VALUE!"},{"$error":"#VALUE!"},{"$error":"#VALUE!"},{"$error":"#VALUE!"},{"$error":"#VALUE!"}]
[171.6,{"$error":"#VALUE!"},{"$error":"#VALUE!"},{"$error":"#VALUE!"},{"$error":"#VALUE!"},{"$error":"#VALUE!"},{"$error":"#VALUE!"},{"$error":"#VALUE!"},{"$error":"#VALUE!"},{"$error":"#VALUE!"}]
[171.8,{"$error":"#VALUE!"},{"$error":"#VALUE!"},{"$error":"#VALUE!"},{"$error":"#VALUE!"},{"$error":"#VALUE!"},{"$error":"#VALUE!"},{"$error":"#VALUE!"},{"$error":"#VALUE!"},{"$error":"#VALUE!"}]
[172,{"$error":"#VALUE!"},{"$error":"#VALUE!"},{"$error":"#VALUE!"},{"$error":"#VALUE!"},{"$error":"#VALUE!"},{"$error":"#VALUE!"},{"$error":"#VALUE!"},{"$error":"#VALUE!"},{"$error":"#VALUE!"}]
[172.2,{"$error":"#VALUE!"},{"$error":"#VALUE!"},{"$error":"#VALUE!"},{"$error":"#VALUE!"},{"$error":"#VALUE!"},{"$error":"#VALUE!"},{"$error":"#VALUE!"},{"$error":"#VALUE!"},{"$error":"#VALUE!"}]
[172.4,{"$error":"#VALUE!"},{"$error":"#VALUE!"},{"$error":"#VALUE!"},{"$error":"#VALUE!"},{"$error":"#VALUE!"},{"$error":"#VALUE!"},{"$error":"#VALUE!"},{"$error":"#VALUE!"},{"$error":"#VALUE!"}]
[172.6,{"$error":"#VALUE!"},{"$error":"#VALUE!"},{"$error":"#VALUE!"},{"$error":"#VALUE!"},{"$error":"#VALUE!"},{"$error":"#VALUE!"},{"$error":"#VALUE!"},{"$error":"#VALUE!"},{"$error":"#VALUE!"}]
[172.8,{"$error":"#VALUE!"},{"$error":"#VALUE!"},{"$error":"#VALUE!"},{"$error":"#VALUE!"},{"$error":"#VALUE!"},{"$error":"#VALUE!"},{"$error":"#VALUE!"},{"$error":"#VALUE!"},{"$error":"#VALUE!"}]
[173,{"$error":"#VALUE!"},{"$error":"#VALUE!"},{"$error":"#VALUE!"},{"$error":"#VALUE!"},{"$error":"#VALUE!"},{"$error":"#VALUE!"},{"$error":"#VALUE!"},{"$error":"#VALUE!"},{"$error":"#VALUE!"}]
[173.2,{"$error":"#VALUE!"},{"$error":"#VALUE!"},{"$error":"#VALUE!"},{"$error":"#VALUE!"},{"$error":"#VALUE!"},{"$error":"#VALUE!"},{"$error":"#VALUE!"},{"$error":"#VALUE!"},{"$error":"#VALUE!"}]
[173.4,{"$error":"#VALUE!"},{"$error":"#VALUE!"},{"$error":"#VALUE!"},{"$error":"#VALUE!"},{"$error":"#VALUE!"},{"$error":"#VALUE!"},{"$error":"#VALUE!"},{"$error":"#VALUE!"},{"$error":"#VALUE!"}]
[173.6,{"$error":"#VALUE!"},{"$error":"#VALUE!"},{"$error":"#VALUE!"},{"$error":"#VALUE!"},{"$error":"#VALUE!"},{"$error":"#VALUE!"},{"$error":"#VALUE!"},{"$error":"#VALUE!"},{"$error":"#VALUE!"}]
[173.8,{"$error":"#VALUE!"},{"$error":"#VALUE!"},{"$error":"#VALUE!"},{"$error":"#VALUE!"},{"$error":"#VALUE!"},{"$error":"#VALUE!"},{"$error":"#VALUE!"},{"$error":"#VALUE!"},{"$error":"#VALUE!"}]
[174,{"$error":"#VALUE!"},{"$error":"#VALUE!"},{"$error":"#VALUE!"},{"$error":"#VALUE!"},{"$error":"#VALUE!"},{"$error":"#VALUE!"},{"$error":"#VALUE!"},{"$error":"#VALUE!"},{"$error":"#VALUE!"}]
[174.2,{"$error":"#VALUE!"},{"$error":"#VALUE!"},{"$error":"#VALUE!"},{"$error":"#VALUE!"},{"$error":"#VALUE!"},{"$error":"#VALUE!"},{"$error":"#VALUE!"},{"$error":"#VALUE!"},{"$error":"#VALUE!"}]
[174.4,{"$error":"#VALUE!"},{"$error":"#VALUE!"},{"$error":"#VALUE!"},{"$error":"#VALUE!"},{"$error":"#VALUE!"},{"$error":"#VALUE!"},{"$error":"#VALUE!"},{"$error":"#VALUE!"},{"$error":"#VALUE!"}]
[174.6,{"$error":"#VALUE!"},{"$error":"#VALUE!"},{"$error":"#VALUE!"},{"$error":"#VALUE!"},{"$error":"#VALUE!"},{"$error":"#VALUE!"},{"$error":"#VALUE!"},{"$error":"#VALUE!"},{"$error":"#VALUE!"}]
[174.8,{"$error":"#VALUE!"},{"$error":"#VALUE!"},{"$error":"#VALUE!"},{"$error":"#VALUE!"},{"$error":"#VALUE!"},{"$error":"#VALUE!"},{"$error":"#VALUE!"},{"$error":"#VALUE!"},{"$error":"#VALUE!"}]
[175,{"$error":"#VALUE!"},{"$error":"#VALUE!"},{"$error":"#VALUE!"},{"$error":"#VALUE!"},{"$error":"#VALUE!"},{"$error":"#VALUE!"},{"$error":"#VALUE!"},{"$error":"#VALUE!"},{"$error":"#VALUE!"}]
[175.2,{"$error":"#VALUE!"},{"$error":"#VALUE!"},{"$error":"#VALUE!"},{"$error":"#VALUE!"},{"$error":"#VALUE!"},{"$error":"#VALUE!"},{"$error":"#VALUE!"},{"$error":"#VALUE!"},{"$error":"#VALUE!"}]
[175.4,{"$error":"#VALUE!"},{"$error":"#VALUE!"},{"$error":"#VALUE!"},{"$error":"#VALUE!"},{"$error":"#VALUE!"},{"$error":"#VALUE!"},{"$error":"#VALUE!"},{"$error":"#VALUE!"},{"$error":"#VALUE!"}]
[175.6,{"$error":"#VALUE!"},{"$error":"#VALUE!"},{"$error":"#VALUE!"},{"$error":"#VALUE!"},{"$error":"#VALUE!"},{"$error":"#VALUE!"},{"$error":"#VALUE!"},{"$error":"#VALUE!"},{"$error":"#VALUE!"}]
[175.8,{"$error":"#VALUE!"},{"$error":"#VALUE!"},{"$error":"#VALUE!"},{"$error":"#VALUE!"},{"$error":"#VALUE!"},{"$error":"#VALUE!"},{"$error":"#VALUE!"},{"$error":"#VALUE!"},{"$error":"#VALUE!"}]
[176,{"$error":"#VALUE!"},{"$error":"#VALUE!"},{"$error":"#VALUE!"},{"$error":"#VALUE!"},{"$error":"#VALUE!"},{"$error":"#VALUE!"},{"$error":"#VALUE!"},{"$error":"#VALUE!"},{"$error":"#VALUE!"}]
[176.2,{"$error":"#VALUE!"},{"$error":"#VALUE!"},{"$error":"#VALUE!"},{"$error":"#VALUE!"},{"$error":"#VALUE!"},{"$error":"#VALUE!"},{"$error":"#VALUE!"},{"$error":"#VALUE!"},{"$error":"#VALUE!"}]
[176.4,{"$error":"#VALUE!"},{"$error":"#VALUE!"},{"$error":"#VALUE!"},{"$error":"#VALUE!"},{"$error":"#VALUE!"},{"$error":"#VALUE!"},{"$error":"#VALUE!"},{"$error":"#VALUE!"},{"$error":"#VALUE!"}]
[176.6,{"$error":"#VALUE!"},{"$error":"#VALUE!"},{"$error":"#VALUE!"},{"$error":"#VALUE!"},{"$error":"#VALUE!"},{"$error":"#VALUE!"},{"$error":"#VALUE!"},{"$error":"#VALUE!"},{"$error":"#VALUE!"}]
[176.8,{"$error":"#VALUE!"},{"$error":"#VALUE!"},{"$error":"#VALUE!"},{"$error":"#VALUE!"},{"$error":"#VALUE!"},{"$error":"#VALUE!"},{"$error":"#VALUE!"},{"$error":"#VALUE!"},{"$error":"#VALUE!"}]
[177,{"$error":"#VALUE!"},{"$error":"#VALUE!"},{"$error":"#VALUE!"},{"$error":"#VALUE!"},{"$error":"#VALUE!"},{"$error":"#VALUE!"},{"$error":"#VALUE!"},{"$error":"#VALUE!"},{"$error":"#VALUE!"}]
[177.2,{"$error":"#VALUE!"},{"$error":"#VALUE!"},{"$error":"#VALUE!"},{"$error":"#VALUE!"},{"$error":"#VALUE!"},{"$error":"#VALUE!"},{"$error":"#VALUE!"},{"$error":"#VALUE!"},{"$error":"#VALUE!"}]
[177.4,{"$error":"#VALUE!"},{"$error":"#VALUE!"},{"$error":"#VALUE!"},{"$error":"#VALUE!"},{"$error":"#VALUE!"},{"$error":"#VALUE!"},{"$error":"#VALUE!"},{"$error":"#VALUE!"},{"$error":"#VALUE!"}]
[177.6,{"$error":"#VALUE!"},{"$error":"#VALUE!"},{"$error":"#VALUE!"},{"$error":"#VALUE!"},{"$error":"#VALUE!"},{"$error":"#VALUE!"},{"$error":"#VALUE!"},{"$error":"#VALUE!"},{"$error":"#VALUE!"}]
[177.8,{"$error":"#VALUE!"},{"$error":"#VALUE!"},{"$error":"#VALUE!"},{"$error":"#VALUE!"},{"$error":"#VALUE!"},{"$error":"#VALUE!"},{"$error":"#VALUE!"},{"$error":"#VALUE!"},{"$error":"#VALUE!"}]
[178,{"$error":"#VALUE!"},{"$error":"#VALUE!"},{"$error":"#VALUE!"},{"$error":"#VALUE!"},{"$error":"#VALUE!"},{"$error":"#VALUE!"},{"$error":"#VALUE!"},{"$error":"#VALUE!"},{"$error":"#VALUE!"}]
[178.2,{"$error":"#VALUE!"},{"$error":"#VALUE!"},{"$error":"#VALUE!"},{"$error":"#VALUE!"},{"$error":"#VALUE!"},{"$error":"#VALUE!"},{"$error":"#VALUE!"},{"$error":"#VALUE!"},{"$error":"#VALUE!"}]
[178.4,{"$error":"#VALUE!"},{"$error":"#VALUE!"},{"$error":"#VALUE!"},{"$error":"#VALUE!"},{"$error":"#VALUE!"},{"$error":"#VALUE!"},{"$error":"#VALUE!"},{"$error":"#VALUE!"},{"$error":"#VALUE!"}]
[178.6,{"$error":"#VALUE!"},{"$error":"#VALUE!"},{"$error":"#VALUE!"},{"$error":"#VALUE!"},{"$error":"#VALUE!"},{"$error":"#VALUE!"},{"$error":"#VALUE!"},{"$error":"#VALUE!"},{"$error":"#VALUE!"}]
[178.8,{"$error":"#VALUE!"},{"$error":"#VALUE!"},{"$error":"#VALUE!"},{"$error":"#VALUE!"},{"$error":"#VALUE!"},{"$error":"#VALUE!"},{"$error":"#VALUE!"},{"$error":"#VALUE!"},{"$error":"#VALUE!"}]
[179,{"$error":"#VALUE!"},{"$error":"#VALUE!"},{"$error":"#VALUE!"},{"$error":"#VALUE!"},{"$error":"#VALUE!"},{"$error":"#VALUE!"},{"$error":"#VALUE!"},{"$error":"#VALUE!"},{"$error":"#VALUE!"}]
[179.2,{"$error":"#VALUE!"},{"$f":"IF(AND($C$5>=A916,A916>=$B$5),($D$5^2-(A916-$E$5)^2)^0.5,0)","v":{"$error":"#VALUE!"}},{"$f":"IF(AND($C$6>=A916,A916>=$B$6),($D$6^2-(A916-$E$6)^2)^0.5,0)","v":{"$error":"#VALUE!"}},{"$f":"IF(AND($C$7>=A916,A916>$B$7),($D$7^2-(A916-$E$7)^2)^0.5,0)","v":{"$error":"#VALUE!"}},{"$f":"IF(AND($C$8>=A916,A916>=$B$8),($D$8^2-(A916-$E$8)^2)^0.5,0)","v":{"$error":"#VALUE!"}},{"$f":"IF(AND($C$9>=A916,A916>=$B$9),($D$9^2-(A916-$E$9)^2)^0.5,0)","v":{"$error":"#VALUE!"}},{"$f":"IF(AND($C$10>=A916,A916>=$B$10),($D$10^2-(A916-$E$10)^2)^0.5,0)","v":{"$error":"#VALUE!"}},{"$f":"IF(AND($C$11>=A916,A916>=$B$11),($D$11^2-(A916-$E$11)^2)^0.5,0)","v":{"$error":"#VALUE!"}},{"$error":"#VALUE!"}]
[179.4,{"$f":"$G$15*A917+$G$16","v":{"$error":"#VALUE!"}},{"$error":"#VALUE!"},{"$error":"#VALUE!"},{"$error":"#VALUE!"},{"$error":"#VALUE!"},{"$error":"#VALUE!"},{"$error":"#VALUE!"},{"$error":"#VALUE!"},{"$f":"IF(AND($C$12>=A917,A917>=$B$12),($D$12^2-(A917-$E$12)^2)^0.5,0)","v":{"$error":"#VALUE!"}}]
[{"$f":"A917+0.2","v":179.6},{"$error":"#VALUE!"},{"$error":"#VALUE!"},{"$error":"#VALUE!"},{"$error":"#VALUE!"},{"$error":"#VALUE!"},{"$error":"#VALUE!"},{"$error":"#VALUE!"},{"$error":"#VALUE!"},{"$error":"#VALUE!"}]
[179.8,{"$error":"#VALUE!"},{"$error":"#VALUE!"},{"$error":"#VALUE!"},{"$error":"#VALUE!"},{"$error":"#VALUE!"},{"$error":"#VALUE!"},{"$error":"#VALUE!"},{"$error":"#VALUE!"},{"$error":"#VALUE!"}]
[180,{"$error":"#VALUE!"},{"$error":"#VALUE!"},{"$error":"#VALUE!"},{"$error":"#VALUE!"},{"$error":"#VALUE!"},{"$error":"#VALUE!"},{"$error":"#VALUE!"},{"$error":"#VALUE!"},{"$error":"#VALUE!"}]
[180.2,{"$error":"#VALUE!"},{"$error":"#VALUE!"},{"$error":"#VALUE!"},{"$error":"#VALUE!"},{"$error":"#VALUE!"},{"$error":"#VALUE!"},{"$error":"#VALUE!"},{"$error":"#VALUE!"},{"$error":"#VALUE!"}]
[180.4,{"$error":"#VALUE!"},{"$error":"#VALUE!"},{"$error":"#VALUE!"},{"$error":"#VALUE!"},{"$error":"#VALUE!"},{"$error":"#VALUE!"},{"$error":"#VALUE!"},{"$error":"#VALUE!"},{"$error":"#VALUE!"}]
[180.6,{"$error":"#VALUE!"},{"$error":"#VALUE!"},{"$error":"#VALUE!"},{"$error":"#VALUE!"},{"$error":"#VALUE!"},{"$error":"#VALUE!"},{"$error":"#VALUE!"},{"$error":"#VALUE!"},{"$error":"#VALUE!"}]
[180.8,{"$error":"#VALUE!"},{"$error":"#VALUE!"},{"$error":"#VALUE!"},{"$error":"#VALUE!"},{"$error":"#VALUE!"},{"$error":"#VALUE!"},{"$error":"#VALUE!"},{"$error":"#VALUE!"},{"$error":"#VALUE!"}]
[181,{"$error":"#VALUE!"},{"$error":"#VALUE!"},{"$error":"#VALUE!"},{"$error":"#VALUE!"},{"$error":"#VALUE!"},{"$error":"#VALUE!"},{"$error":"#VALUE!"},{"$error":"#VALUE!"},{"$error":"#VALUE!"}]
[181.2,{"$error":"#VALUE!"},{"$error":"#VALUE!"},{"$error":"#VALUE!"},{"$error":"#VALUE!"},{"$error":"#VALUE!"},{"$error":"#VALUE!"},{"$error":"#VALUE!"},{"$error":"#VALUE!"},{"$error":"#VALUE!"}]
[181.4,{"$error":"#VALUE!"},{"$error":"#VALUE!"},{"$error":"#VALUE!"},{"$error":"#VALUE!"},{"$error":"#VALUE!"},{"$error":"#VALUE!"},{"$error":"#VALUE!"},{"$error":"#VALUE!"},{"$error":"#VALUE!"}]
[181.6,{"$error":"#VALUE!"},{"$error":"#VALUE!"},{"$error":"#VALUE!"},{"$error":"#VALUE!"},{"$error":"#VALUE!"},{"$error":"#VALUE!"},{"$error":"#VALUE!"},{"$error":"#VALUE!"},{"$error":"#VALUE!"}]
[181.8,{"$error":"#VALUE!"},{"$error":"#VALUE!"},{"$error":"#VALUE!"},{"$error":"#VALUE!"},{"$error":"#VALUE!"},{"$error":"#VALUE!"},{"$error":"#VALUE!"},{"$error":"#VALUE!"},{"$error":"#VALUE!"}]
[182,{"$error":"#VALUE!"},{"$error":"#VALUE!"},{"$error":"#VALUE!"},{"$error":"#VALUE!"},{"$error":"#VALUE!"},{"$error":"#VALUE!"},{"$error":"#VALUE!"},{"$error":"#VALUE!"},{"$error":"#VALUE!"}]
[182.2,{"$error":"#VALUE!"},{"$error":"#VALUE!"},{"$error":"#VALUE!"},{"$error":"#VALUE!"},{"$error":"#VALUE!"},{"$error":"#VALUE!"},{"$error":"#VALUE!"},{"$error":"#VALUE!"},{"$error":"#VALUE!"}]
[182.4,{"$error":"#VALUE!"},{"$error":"#VALUE!"},{"$error":"#VALUE!"},{"$error":"#VALUE!"},{"$error":"#VALUE!"},{"$error":"#VALUE!"},{"$error":"#VALUE!"},{"$error":"#VALUE!"},{"$error":"#VALUE!"}]
[182.6,{"$error":"#VALUE!"},{"$error":"#VALUE!"},{"$error":"#VALUE!"},{"$error":"#VALUE!"},{"$error":"#VALUE!"},{"$error":"#VALUE!"},{"$error":"#VALUE!"},{"$error":"#VALUE!"},{"$error":"#VALUE!"}]
[182.8,{"$error":"#VALUE!"},{"$error":"#VALUE!"},{"$error":"#VALUE!"},{"$error":"#VALUE!"},{"$error":"#VALUE!"},{"$error":"#VALUE!"},{"$error":"#VALUE!"},{"$error":"#VALUE!"},{"$error":"#VALUE!"}]
[183,{"$error":"#VALUE!"},{"$error":"#VALUE!"},{"$error":"#VALUE!"},{"$error":"#VALUE!"},{"$error":"#VALUE!"},{"$error":"#VALUE!"},{"$error":"#VALUE!"},{"$error":"#VALUE!"},{"$error":"#VALUE!"}]
[183.2,{"$error":"#VALUE!"},{"$error":"#VALUE!"},{"$error":"#VALUE!"},{"$error":"#VALUE!"},{"$error":"#VALUE!"},{"$error":"#VALUE!"},{"$error":"#VALUE!"},{"$error":"#VALUE!"},{"$error":"#VALUE!"}]
[183.4,{"$error":"#VALUE!"},{"$error":"#VALUE!"},{"$error":"#VALUE!"},{"$error":"#VALUE!"},{"$error":"#VALUE!"},{"$error":"#VALUE!"},{"$error":"#VALUE!"},{"$error":"#VALUE!"},{"$error":"#VALUE!"}]
[183.6,{"$error":"#VALUE!"},{"$error":"#VALUE!"},{"$error":"#VALUE!"},{"$error":"#VALUE!"},{"$error":"#VALUE!"},{"$error":"#VALUE!"},{"$error":"#VALUE!"},{"$error":"#VALUE!"},{"$error":"#VALUE!"}]
[183.8,{"$error":"#VALUE!"},{"$error":"#VALUE!"},{"$error":"#VALUE!"},{"$error":"#VALUE!"},{"$error":"#VALUE!"},{"$error":"#VALUE!"},{"$error":"#VALUE!"},{"$error":"#VALUE!"},{"$error":"#VALUE!"}]
[184,{"$error":"#VALUE!"},{"$error":"#VALUE!"},{"$error":"#VALUE!"},{"$error":"#VALUE!"},{"$error":"#VALUE!"},{"$error":"#VALUE!"},{"$error":"#VALUE!"},{"$error":"#VALUE!"},{"$error":"#VALUE!"}]
[184.2,{"$error":"#VALUE!"},{"$error":"#VALUE!"},{"$error":"#VALUE!"},{"$error":"#VALUE!"},{"$error":"#VALUE!"},{"$error":"#VALUE!"},{"$error":"#VALUE!"},{"$error":"#VALUE!"},{"$error":"#VALUE!"}]
[184.4,{"$error":"#VALUE!"},{"$error":"#VALUE!"},{"$error":"#VALUE!"},{"$error":"#VALUE!"},{"$error":"#VALUE!"},{"$error":"#VALUE!"},{"$error":"#VALUE!"},{"$error":"#VALUE!"},{"$error":"#VALUE!"}]
[184.6,{"$error":"#VALUE!"},{"$error":"#VALUE!"},{"$error":"#VALUE!"},{"$error":"#VALUE!"},{"$error":"#VALUE!"},{"$error":"#VALUE!"},{"$error":"#VALUE!"},{"$error":"#VALUE!"},{"$error":"#VALUE!"}]
[184.8,{"$error":"#VALUE!"},{"$error":"#VALUE!"},{"$error":"#VALUE!"},{"$error":"#VALUE!"},{"$error":"#VALUE!"},{"$error":"#VALUE!"},{"$error":"#VALUE!"},{"$error":"#VALUE!"},{"$error":"#VALUE!"}]
[185,{"$error":"#VALUE!"},{"$error":"#VALUE!"},{"$error":"#VALUE!"},{"$error":"#VALUE!"},{"$error":"#VALUE!"},{"$error":"#VALUE!"},{"$error":"#VALUE!"},{"$error":"#VALUE!"},{"$error":"#VALUE!"}]
[185.2,{"$error":"#VALUE!"},{"$error":"#VALUE!"},{"$error":"#VALUE!"},{"$error":"#VALUE!"},{"$error":"#VALUE!"},{"$error":"#VALUE!"},{"$error":"#VALUE!"},{"$error":"#VALUE!"},{"$error":"#VALUE!"}]
[185.4,{"$error":"#VALUE!"},{"$error":"#VALUE!"},{"$error":"#VALUE!"},{"$error":"#VALUE!"},{"$error":"#VALUE!"},{"$error":"#VALUE!"},{"$error":"#VALUE!"},{"$error":"#VALUE!"},{"$error":"#VALUE!"}]
[185.6,{"$error":"#VALUE!"},{"$error":"#VALUE!"},{"$error":"#VALUE!"},{"$error":"#VALUE!"},{"$error":"#VALUE!"},{"$error":"#VALUE!"},{"$error":"#VALUE!"},{"$error":"#VALUE!"},{"$error":"#VALUE!"}]
[185.8,{"$error":"#VALUE!"},{"$error":"#VALUE!"},{"$error":"#VALUE!"},{"$error":"#VALUE!"},{"$error":"#VALUE!"},{"$error":"#VALUE!"},{"$error":"#VALUE!"},{"$error":"#VALUE!"},{"$error":"#VALUE!"}]
[186,{"$error":"#VALUE!"},{"$error":"#VALUE!"},{"$error":"#VALUE!"},{"$error":"#VALUE!"},{"$error":"#VALUE!"},{"$error":"#VALUE!"},{"$error":"#VALUE!"},{"$error":"#VALUE!"},{"$error":"#VALUE!"}]
[186.2,{"$error":"#VALUE!"},{"$error":"#VALUE!"},{"$error":"#VALUE!"},{"$error":"#VALUE!"},{"$error":"#VALUE!"},{"$error":"#VALUE!"},{"$error":"#VALUE!"},{"$error":"#VALUE!"},{"$error":"#VALUE!"}]
[186.4,{"$error":"#VALUE!"},{"$error":"#VALUE!"},{"$error":"#VALUE!"},{"$error":"#VALUE!"},{"$error":"#VALUE!"},{"$error":"#VALUE!"},{"$error":"#VALUE!"},{"$error":"#VALUE!"},{"$error":"#VALUE!"}]
[186.6,{"$error":"#VALUE!"},{"$error":"#VALUE!"},{"$error":"#VALUE!"},{"$error":"#VALUE!"},{"$error":"#VALUE!"},{"$error":"#VALUE!"},{"$error":"#VALUE!"},{"$error":"#VALUE!"},{"$error":"#VALUE!"}]
[186.8,{"$error":"#VALUE!"},{"$error":"#VALUE!"},{"$error":"#VALUE!"},{"$error":"#VALUE!"},{"$error":"#VALUE!"},{"$error":"#VALUE!"},{"$error":"#VALUE!"},{"$error":"#VALUE!"},{"$error":"#VALUE!"}]
[187,{"$error":"#VALUE!"},{"$error":"#VALUE!"},{"$error":"#VALUE!"},{"$error":"#VALUE!"},{"$error":"#VALUE!"},{"$error":"#VALUE!"},{"$error":"#VALUE!"},{"$error":"#VALUE!"},{"$error":"#VALUE!"}]
[187.2,{"$error":"#VALUE!"},{"$error":"#VALUE!"},{"$error":"#VALUE!"},{"$error":"#VALUE!"},{"$error":"#VALUE!"},{"$error":"#VALUE!"},{"$error":"#VALUE!"},{"$error":"#VALUE!"},{"$error":"#VALUE!"}]
[187.4,{"$error":"#VALUE!"},{"$error":"#VALUE!"},{"$error":"#VALUE!"},{"$error":"#VALUE!"},{"$error":"#VALUE!"},{"$error":"#VALUE!"},{"$error":"#VALUE!"},{"$error":"#VALUE!"},{"$error":"#VALUE!"}]
[187.6,{"$error":"#VALUE!"},{"$error":"#VALUE!"},{"$error":"#VALUE!"},{"$error":"#VALUE!"},{"$error":"#VALUE!"},{"$error":"#VALUE!"},{"$error":"#VALUE!"},{"$error":"#VALUE!"},{"$error":"#VALUE!"}]
[187.8,{"$error":"#VALUE!"},{"$error":"#VALUE!"},{"$error":"#VALUE!"},{"$error":"#VALUE!"},{"$error":"#VALUE!"},{"$error":"#VALUE!"},{"$error":"#VALUE!"},{"$error":"#VALUE!"},{"$error":"#VALUE!"}]
[188,{"$error":"#VALUE!"},{"$error":"#VALUE!"},{"$error":"#VALUE!"},{"$error":"#VALUE!"},{"$error":"#VALUE!"},{"$error":"#VALUE!"},{"$error":"#VALUE!"},{"$error":"#VALUE!"},{"$error":"#VALUE!"}]
[188.2,{"$error":"#VALUE!"},{"$error":"#VALUE!"},{"$error":"#VALUE!"},{"$error":"#VALUE!"},{"$error":"#VALUE!"},{"$error":"#VALUE!"},{"$error":"#VALUE!"},{"$error":"#VALUE!"},{"$error":"#VALUE!"}]
[188.4,{"$error":"#VALUE!"},{"$error":"#VALUE!"},{"$error":"#VALUE!"},{"$error":"#VALUE!"},{"$error":"#VALUE!"},{"$error":"#VALUE!"},{"$error":"#VALUE!"},{"$error":"#VALUE!"},{"$error":"#VALUE!"}]
[188.6,{"$error":"#VALUE!"},{"$error":"#VALUE!"},{"$error":"#VALUE!"},{"$error":"#VALUE!"},{"$error":"#VALUE!"},{"$error":"#VALUE!"},{"$error":"#VALUE!"},{"$error":"#VALUE!"},{"$error":"#VALUE!"}]
[188.8,{"$error":"#VALUE!"},{"$error":"#VALUE!"},{"$error":"#VALUE!"},{"$error":"#VALUE!"},{"$error":"#VALUE!"},{"$error":"#VALUE!"},{"$error":"#VALUE!"},{"$error":"#VALUE!"},{"$error":"#VALUE!"}]
[189,{"$error":"#VALUE!"},{"$error":"#VALUE!"},{"$error":"#VALUE!"},{"$error":"#VALUE!"},{"$error":"#VALUE!"},{"$error":"#VALUE!"},{"$error":"#VALUE!"},{"$error":"#VALUE!"},{"$error":"#VALUE!"}]
[189.2,{"$error":"#VALUE!"},{"$error":"#VALUE!"},{"$error":"#VALUE!"},{"$error":"#VALUE!"},{"$error":"#VALUE!"},{"$error":"#VALUE!"},{"$error":"#VALUE!"},{"$error":"#VALUE!"},{"$error":"#VALUE!"}]
[189.4,{"$error":"#VALUE!"},{"$error":"#VALUE!"},{"$error":"#VALUE!"},{"$error":"#VALUE!"},{"$error":"#VALUE!"},{"$error":"#VALUE!"},{"$error":"#VALUE!"},{"$error":"#VALUE!"},{"$error":"#VALUE!"}]
[189.6,{"$error":"#VALUE!"},{"$error":"#VALUE!"},{"$error":"#VALUE!"},{"$error":"#VALUE!"},{"$error":"#VALUE!"},{"$error":"#VALUE!"},{"$error":"#VALUE!"},{"$error":"#VALUE!"},{"$error":"#VALUE!"}]
[189.8,{"$error":"#VALUE!"},{"$error":"#VALUE!"},{"$error":"#VALUE!"},{"$error":"#VALUE!"},{"$error":"#VALUE!"},{"$error":"#VALUE!"},{"$error":"#VALUE!"},{"$error":"#VALUE!"},{"$error":"#VALUE!"}]
[190,{"$error":"#VALUE!"},{"$error":"#VALUE!"},{"$error":"#VALUE!"},{"$error":"#VALUE!"},{"$error":"#VALUE!"},{"$error":"#VALUE!"},{"$error":"#VALUE!"},{"$error":"#VALUE!"},{"$error":"#VALUE!"}]
[190.2,{"$error":"#VALUE!"},{"$error":"#VALUE!"},{"$error":"#VALUE!"},{"$error":"#VALUE!"},{"$error":"#VALUE!"},{"$error":"#VALUE!"},{"$error":"#VALUE!"},{"$error":"#VALUE!"},{"$error":"#VALUE!"}]
[190.4,{"$error":"#VALUE!"},{"$error":"#VALUE!"},{"$error":"#VALUE!"},{"$error":"#VALUE!"},{"$error":"#VALUE!"},{"$error":"#VALUE!"},{"$error":"#VALUE!"},{"$error":"#VALUE!"},{"$error":"#VALUE!"}]
[190.6,{"$error":"#VALUE!"},{"$error":"#VALUE!"},{"$error":"#VALUE!"},{"$error":"#VALUE!"},{"$error":"#VALUE!"},{"$error":"#VALUE!"},{"$error":"#VALUE!"},{"$error":"#VALUE!"},{"$error":"#VALUE!"}]
[190.8,{"$error":"#VALUE!"},{"$error":"#VALUE!"},{"$error":"#VALUE!"},{"$error":"#VALUE!"},{"$error":"#VALUE!"},{"$error":"#VALUE!"},{"$error":"#VALUE!"},{"$error":"#VALUE!"},{"$error":"#VALUE!"}]
[191,{"$error":"#VALUE!"},{"$error":"#VALUE!"},{"$error":"#VALUE!"},{"$error":"#VALUE!"},{"$error":"#VALUE!"},{"$error":"#VALUE!"},{"$error":"#VALUE!"},{"$error":"#VALUE!"},{"$error":"#VALUE!"}]
[191.2,{"$error":"#VALUE!"},{"$error":"#VALUE!"},{"$error":"#VALUE!"},{"$error":"#VALUE!"},{"$error":"#VALUE!"},{"$error":"#VALUE!"},{"$error":"#VALUE!"},{"$error":"#VALUE!"},{"$error":"#VALUE!"}]
[191.4,{"$error":"#VALUE!"},{"$error":"#VALUE!"},{"$error":"#VALUE!"},{"$error":"#VALUE!"},{"$error":"#VALUE!"},{"$error":"#VALUE!"},{"$error":"#VALUE!"},{"$error":"#VALUE!"},{"$error":"#VALUE!"}]
[191.6,{"$error":"#VALUE!"},{"$error":"#VALUE!"},{"$error":"#VALUE!"},{"$error":"#VALUE!"},{"$error":"#VALUE!"},{"$error":"#VALUE!"},{"$error":"#VALUE!"},{"$error":"#VALUE!"},{"$error":"#VALUE!"}]
[191.8,{"$error":"#VALUE!"},{"$error":"#VALUE!"},{"$error":"#VALUE!"},{"$error":"#VALUE!"},{"$error":"#VALUE!"},{"$error":"#VALUE!"},{"$error":"#VALUE!"},{"$error":"#VALUE!"},{"$error":"#VALUE!"}]
[192,{"$error":"#VALUE!"},{"$f":"IF(AND($C$5>=A980,A980>=$B$5),($D$5^2-(A980-$E$5)^2)^0.5,0)","v":{"$error":"#VALUE!"}},{"$f":"IF(AND($C$6>=A980,A980>=$B$6),($D$6^2-(A980-$E$6)^2)^0.5,0)","v":{"$error":"#VALUE!"}},{"$f":"IF(AND($C$7>=A980,A980>$B$7),($D$7^2-(A980-$E$7)^2)^0.5,0)","v":{"$error":"#VALUE!"}},{"$f":"IF(AND($C$8>=A980,A980>=$B$8),($D$8^2-(A980-$E$8)^2)^0.5,0)","v":{"$error":"#VALUE!"}},{"$f":"IF(AND($C$9>=A980,A980>=$B$9),($D$9^2-(A980-$E$9)^2)^0.5,0)","v":{"$error":"#VALUE!"}},{"$f":"IF(AND($C$10>=A980,A980>=$B$10),($D$10^2-(A980-$E$10)^2)^0.5,0)","v":{"$error":"#VALUE!"}},{"$f":"IF(AND($C$11>=A980,A980>=$B$11),($D$11^2-(A980-$E$11)^2)^0.5,0)","v":{"$error":"#VALUE!"}},{"$error":"#VALUE!"}]
[192.2,{"$f":"$G$15*A981+$G$16","v":{"$error":"#VALUE!"}},{"$error":"#VALUE!"},{"$error":"#VALUE!"},{"$error":"#VALUE!"},{"$error":"#VALUE!"},{"$error":"#VALUE!"},{"$error":"#VALUE!"},{"$error":"#VALUE!"},{"$f":"IF(AND($C$12>=A981,A981>=$B$12),($D$12^2-(A981-$E$12)^2)^0.5,0)","v":{"$error":"#VALUE!"}}]
[{"$f":"A981+0.2","v":192.4},{"$error":"#VALUE!"},{"$error":"#VALUE!"},{"$error":"#VALUE!"},{"$error":"#VALUE!"},{"$error":"#VALUE!"},{"$error":"#VALUE!"},{"$error":"#VALUE!"},{"$error":"#VALUE!"},{"$error":"#VALUE!"}]
[192.6,{"$error":"#VALUE!"},{"$error":"#VALUE!"},{"$error":"#VALUE!"},{"$error":"#VALUE!"},{"$error":"#VALUE!"},{"$error":"#VALUE!"},{"$error":"#VALUE!"},{"$error":"#VALUE!"},{"$error":"#VALUE!"}]
[192.8,{"$error":"#VALUE!"},{"$error":"#VALUE!"},{"$error":"#VALUE!"},{"$error":"#VALUE!"},{"$error":"#VALUE!"},{"$error":"#VALUE!"},{"$error":"#VALUE!"},{"$error":"#VALUE!"},{"$error":"#VALUE!"}]
[193,{"$error":"#VALUE!"},{"$error":"#VALUE!"},{"$error":"#VALUE!"},{"$error":"#VALUE!"},{"$error":"#VALUE!"},{"$error":"#VALUE!"},{"$error":"#VALUE!"},{"$error":"#VALUE!"},{"$error":"#VALUE!"}]
[193.2,{"$error":"#VALUE!"},{"$error":"#VALUE!"},{"$error":"#VALUE!"},{"$error":"#VALUE!"},{"$error":"#VALUE!"},{"$error":"#VALUE!"},{"$error":"#VALUE!"},{"$error":"#VALUE!"},{"$error":"#VALUE!"}]
[193.4,{"$error":"#VALUE!"},{"$error":"#VALUE!"},{"$error":"#VALUE!"},{"$error":"#VALUE!"},{"$error":"#VALUE!"},{"$error":"#VALUE!"},{"$error":"#VALUE!"},{"$error":"#VALUE!"},{"$error":"#VALUE!"}]
[193.6,{"$error":"#VALUE!"},{"$error":"#VALUE!"},{"$error":"#VALUE!"},{"$error":"#VALUE!"},{"$error":"#VALUE!"},{"$error":"#VALUE!"},{"$error":"#VALUE!"},{"$error":"#VALUE!"},{"$error":"#VALUE!"}]
[193.8,{"$error":"#VALUE!"},{"$error":"#VALUE!"},{"$error":"#VALUE!"},{"$error":"#VALUE!"},{"$error":"#VALUE!"},{"$error":"#VALUE!"},{"$error":"#VALUE!"},{"$error":"#VALUE!"},{"$error":"#VALUE!"}]
[194,{"$error":"#VALUE!"},{"$error":"#VALUE!"},{"$error":"#VALUE!"},{"$error":"#VALUE!"},{"$error":"#VALUE!"},{"$error":"#VALUE!"},{"$error":"#VALUE!"},{"$error":"#VALUE!"},{"$error":"#VALUE!"}]
[194.2,{"$error":"#VALUE!"},{"$error":"#VALUE!"},{"$error":"#VALUE!"},{"$error":"#VALUE!"},{"$error":"#VALUE!"},{"$error":"#VALUE!"},{"$error":"#VALUE!"},{"$error":"#VALUE!"},{"$error":"#VALUE!"}]
[194.4,{"$error":"#VALUE!"},{"$error":"#VALUE!"},{"$error":"#VALUE!"},{"$error":"#VALUE!"},{"$error":"#VALUE!"},{"$error":"#VALUE!"},{"$error":"#VALUE!"},{"$error":"#VALUE!"},{"$error":"#VALUE!"}]
[194.6,{"$error":"#VALUE!"},{"$error":"#VALUE!"},{"$error":"#VALUE!"},{"$error":"#VALUE!"},{"$error":"#VALUE!"},{"$error":"#VALUE!"},{"$error":"#VALUE!"},{"$error":"#VALUE!"},{"$error":"#VALUE!"}]
[194.8,{"$error":"#VALUE!"},{"$error":"#VALUE!"},{"$error":"#VALUE!"},{"$error":"#VALUE!"},{"$error":"#VALUE!"},{"$error":"#VALUE!"},{"$error":"#VALUE!"},{"$error":"#VALUE!"},{"$error":"#VALUE!"}]
[195,{"$error":"#VALUE!"},{"$error":"#VALUE!"},{"$error":"#VALUE!"},{"$error":"#VALUE!"},{"$error":"#VALUE!"},{"$error":"#VALUE!"},{"$error":"#VALUE!"},{"$error":"#VALUE!"},{"$error":"#VALUE!"}]
[195.2,{"$error":"#VALUE!"},{"$error":"#VALUE!"},{"$error":"#VALUE!"},{"$error":"#VALUE!"},{"$error":"#VALUE!"},{"$error":"#VALUE!"},{"$error":"#VALUE!"},{"$error":"#VALUE!"},{"$error":"#VALUE!"}]
[195.4,{"$error":"#VALUE!"},{"$error":"#VALUE!"},{"$error":"#VALUE!"},{"$error":"#VALUE!"},{"$error":"#VALUE!"},{"$error":"#VALUE!"},{"$error":"#VALUE!"},{"$error":"#VALUE!"},{"$error":"#VALUE!"}]
[195.6,{"$error":"#VALUE!"},{"$error":"#VALUE!"},{"$error":"#VALUE!"},{"$error":"#VALUE!"},{"$error":"#VALUE!"},{"$error":"#VALUE!"},{"$error":"#VALUE!"},{"$error":"#VALUE!"},{"$error":"#VALUE!"}]
[195.8,{"$error":"#VALUE!"},{"$error":"#VALUE!"},{"$error":"#VALUE!"},{"$error":"#VALUE!"},{"$error":"#VALUE!"},{"$error":"#VALUE!"},{"$error":"#VALUE!"},{"$error":"#VALUE!"},{"$error":"#VALUE!"}]
[196,{"$error":"#VALUE!"},{"$error":"#VALUE!"},{"$error":"#VALUE!"},{"$error":"#VALUE!"},{"$error":"#VALUE!"},{"$error":"#VALUE!"},{"$error":"#VALUE!"},{"$error":"#VALUE!"},{"$error":"#VALUE!"}]
[196.2,{"$error":"#VALUE!"},{"$error":"#VALUE!"},{"$error":"#VALUE!"},{"$error":"#VALUE!"},{"$error":"#VALUE!"},{"$error":"#VALUE!"},{"$error":"#VALUE!"},{"$error":"#VALUE!"},{"$error":"#VALUE!"}]
[196.4,{"$error":"#VALUE!"},{"$error":"#VALUE!"},{"$error":"#VALUE!"},{"$error":"#VALUE!"},{"$error":"#VALUE!"},{"$error":"#VALUE!"},{"$error":"#VALUE!"},{"$error":"#VALUE!"},{"$error":"#VALUE!"}]
[196.6,{"$error":"#VALUE!"},{"$error":"#VALUE!"},{"$error":"#VALUE!"},{"$error":"#VALUE!"},{"$error":"#VALUE!"},{"$error":"#VALUE!"},{"$error":"#VALUE!"},{"$error":"#VALUE!"},{"$error":"#VALUE!"}]
[196.8,{"$error":"#VALUE!"},{"$error":"#VALUE!"},{"$error":"#VALUE!"},{"$error":"#VALUE!"},{"$error":"#VALUE!"},{"$error":"#VALUE!"},{"$error":"#VALUE!"},{"$error":"#VALUE!"},{"$error":"#VALUE!"}]
[197,{"$error":"#VALUE!"},{"$error":"#VALUE!"},{"$error":"#VALUE!"},{"$error":"#VALUE!"},{"$error":"#VALUE!"},{"$error":"#VALUE!"},{"$error":"#VALUE!"},{"$error":"#VALUE!"},{"$error":"#VALUE!"}]
[197.2,{"$error":"#VALUE!"},{"$error":"#VALUE!"},{"$error":"#VALUE!"},{"$error":"#VALUE!"},{"$error":"#VALUE!"},{"$error":"#VALUE!"},{"$error":"#VALUE!"},{"$error":"#VALUE!"},{"$error":"#VALUE!"}]
[197.4,{"$error":"#VALUE!"},{"$error":"#VALUE!"},{"$error":"#VALUE!"},{"$error":"#VALUE!"},{"$error":"#VALUE!"},{"$error":"#VALUE!"},{"$error":"#VALUE!"},{"$error":"#VALUE!"},{"$error":"#VALUE!"}]
[197.6,{"$error":"#VALUE!"},{"$error":"#VALUE!"},{"$error":"#VALUE!"},{"$error":"#VALUE!"},{"$error":"#VALUE!"},{"$error":"#VALUE!"},{"$error":"#VALUE!"},{"$error":"#VALUE!"},{"$error":"#VALUE!"}]
[197.8,{"$error":"#VALUE!"},{"$error":"#VALUE!"},{"$error":"#VALUE!"},{"$error":"#VALUE!"},{"$error":"#VALUE!"},{"$error":"#VALUE!"},{"$error":"#VALUE!"},{"$error":"#VALUE!"},{"$error":"#VALUE!"}]
[198,{"$error":"#VALUE!"},{"$error":"#VALUE!"},{"$error":"#VALUE!"},{"$error":"#VALUE!"},{"$error":"#VALUE!"},{"$error":"#VALUE!"},{"$error":"#VALUE!"},{"$error":"#VALUE!"},{"$error":"#VALUE!"}]
[198.2,{"$error":"#VALUE!"},{"$error":"#VALUE!"},{"$error":"#VALUE!"},{"$error":"#VALUE!"},{"$error":"#VALUE!"},{"$error":"#VALUE!"},{"$error":"#VALUE!"},{"$error":"#VALUE!"},{"$error":"#VALUE!"}]
[198.4,{"$error":"#VALUE!"},{"$error":"#VALUE!"},{"$error":"#VALUE!"},{"$error":"#VALUE!"},{"$error":"#VALUE!"},{"$error":"#VALUE!"},{"$error":"#VALUE!"},{"$error":"#VALUE!"},{"$error":"#VALUE!"}]
[198.6,{"$error":"#VALUE!"},{"$error":"#VALUE!"},{"$error":"#VALUE!"},{"$error":"#VALUE!"},{"$error":"#VALUE!"},{"$error":"#VALUE!"},{"$error":"#VALUE!"},{"$error":"#VALUE!"},{"$error":"#VALUE!"}]
[198.8,{"$error":"#VALUE!"},{"$error":"#VALUE!"},{"$error":"#VALUE!"},{"$error":"#VALUE!"},{"$error":"#VALUE!"},{"$error":"#VALUE!"},{"$error":"#VALUE!"},{"$error":"#VALUE!"},{"$error":"#VALUE!"}]
[199,{"$error":"#VALUE!"},{"$error":"#VALUE!"},{"$error":"#VALUE!"},{"$error":"#VALUE!"},{"$error":"#VALUE!"},{"$error":"#VALUE!"},{"$error":"#VALUE!"},{"$error":"#VALUE!"},{"$error":"#VALUE!"}]
[199.2,{"$error":"#VALUE!"},{"$error":"#VALUE!"},{"$error":"#VALUE!"},{"$error":"#VALUE!"},{"$error":"#VALUE!"},{"$error":"#VALUE!"},{"$error":"#VALUE!"},{"$error":"#VALUE!"},{"$error":"#VALUE!"}]
[199.4,{"$error":"#VALUE!"},{"$error":"#VALUE!"},{"$error":"#VALUE!"},{"$error":"#VALUE!"},{"$error":"#VALUE!"},{"$error":"#VALUE!"},{"$error":"#VALUE!"},{"$error":"#VALUE!"},{"$error":"#VALUE!"}]
[199.6,{"$error":"#VALUE!"},{"$error":"#VALUE!"},{"$error":"#VALUE!"},{"$error":"#VALUE!"},{"$error":"#VALUE!"},{"$error":"#VALUE!"},{"$error":"#VALUE!"},{"$error":"#VALUE!"},{"$error":"#VALUE!"}]
[199.8,{"$error":"#VALUE!"},{"$error":"#VALUE!"},{"$error":"#VALUE!"},{"$error":"#VALUE!"},{"$error":"#VALUE!"},{"$error":"#VALUE!"},{"$error":"#VALUE!"},{"$error":"#VALUE!"},{"$error":"#VALUE!"}]
[200,{"$error":"#VALUE!"},{"$error":"#VALUE!"},{"$error":"#VALUE!"},{"$error":"#VALUE!"},{"$error":"#VALUE!"},{"$error":"#VALUE!"},{"$error":"#VALUE!"},{"$error":"#VALUE!"},{"$error":"#VALUE!"}]
[200.2,{"$error":"#VALUE!"},{"$error":"#VALUE!"},{"$error":"#VALUE!"},{"$error":"#VALUE!"},{"$error":"#VALUE!"},{"$error":"#VALUE!"},{"$error":"#VALUE!"},{"$error":"#VALUE!"},{"$error":"#VALUE!"}]
[200.4,{"$error":"#VALUE!"},{"$error":"#VALUE!"},{"$error":"#VALUE!"},{"$error":"#VALUE!"},{"$error":"#VALUE!"},{"$error":"#VALUE!"},{"$error":"#VALUE!"},{"$error":"#VALUE!"},{"$error":"#VALUE!"}]
[200.6,{"$error":"#VALUE!"},{"$error":"#VALUE!"},{"$error":"#VALUE!"},{"$error":"#VALUE!"},{"$error":"#VALUE!"},{"$error":"#VALUE!"},{"$error":"#VALUE!"},{"$error":"#VALUE!"},{"$error":"#VALUE!"}]
[200.8,{"$error":"#VALUE!"},{"$error":"#VALUE!"},{"$error":"#VALUE!"},{"$error":"#VALUE!"},{"$error":"#VALUE!"},{"$error":"#VALUE!"},{"$error":"#VALUE!"},{"$error":"#VALUE!"},{"$error":"#VALUE!"}]
[201,{"$error":"#VALUE!"},{"$error":"#VALUE!"},{"$error":"#VALUE!"},{"$error":"#VALUE!"},{"$error":"#VALUE!"},{"$error":"#VALUE!"},{"$error":"#VALUE!"},{"$error":"#VALUE!"},{"$error":"#VALUE!"}]
[201.2,{"$error":"#VALUE!"},{"$error":"#VALUE!"},{"$error":"#VALUE!"},{"$error":"#VALUE!"},{"$error":"#VALUE!"},{"$error":"#VALUE!"},{"$error":"#VALUE!"},{"$error":"#VALUE!"},{"$error":"#VALUE!"}]
[201.4,{"$error":"#VALUE!"},{"$error":"#VALUE!"},{"$error":"#VALUE!"},{"$error":"#VALUE!"},{"$error":"#VALUE!"},{"$error":"#VALUE!"},{"$error":"#VALUE!"},{"$error":"#VALUE!"},{"$error":"#VALUE!"}]
[201.6,{"$error":"#VALUE!"},{"$error":"#VALUE!"},{"$error":"#VALUE!"},{"$error":"#VALUE!"},{"$error":"#VALUE!"},{"$error":"#VALUE!"},{"$error":"#VALUE!"},{"$error":"#VALUE!"},{"$error":"#VALUE!"}]
[201.8,{"$error":"#VALUE!"},{"$error":"#VALUE!"},{"$error":"#VALUE!"},{"$error":"#VALUE!"},{"$error":"#VALUE!"},{"$error":"#VALUE!"},{"$error":"#VALUE!"},{"$error":"#VALUE!"},{"$error":"#VALUE!"}]
[202,{"$error":"#VALUE!"},{"$error":"#VALUE!"},{"$error":"#VALUE!"},{"$error":"#VALUE!"},{"$error":"#VALUE!"},{"$error":"#VALUE!"},{"$error":"#VALUE!"},{"$error":"#VALUE!"},{"$error":"#VALUE!"}]
[202.2,{"$error":"#VALUE!"},{"$error":"#VALUE!"},{"$error":"#VALUE!"},{"$error":"#VALUE!"},{"$error":"#VALUE!"},{"$error":"#VALUE!"},{"$error":"#VALUE!"},{"$error":"#VALUE!"},{"$error":"#VALUE!"}]
[202.4,{"$error":"#VALUE!"},{"$error":"#VALUE!"},{"$error":"#VALUE!"},{"$error":"#VALUE!"},{"$error":"#VALUE!"},{"$error":"#VALUE!"},{"$error":"#VALUE!"},{"$error":"#VALUE!"},{"$error":"#VALUE!"}]
[202.6,{"$error":"#VALUE!"},{"$error":"#VALUE!"},{"$error":"#VALUE!"},{"$error":"#VALUE!"},{"$error":"#VALUE!"},{"$error":"#VALUE!"},{"$error":"#VALUE!"},{"$error":"#VALUE!"},{"$error":"#VALUE!"}]
[202.8,{"$error":"#VALUE!"},{"$error":"#VALUE!"},{"$error":"#VALUE!"},{"$error":"#VALUE!"},{"$error":"#VALUE!"},{"$error":"#VALUE!"},{"$error":"#VALUE!"},{"$error":"#VALUE!"},{"$error":"#VALUE!"}]
[203,{"$error":"#VALUE!"},{"$error":"#VALUE!"},{"$error":"#VALUE!"},{"$error":"#VALUE!"},{"$error":"#VALUE!"},{"$error":"#VALUE!"},{"$error":"#VALUE!"},{"$error":"#VALUE!"},{"$error":"#VALUE!"}]
[203.2,{"$error":"#VALUE!"},{"$error":"#VALUE!"},{"$error":"#VALUE!"},{"$error":"#VALUE!"},{"$error":"#VALUE!"},{"$error":"#VALUE!"},{"$error":"#VALUE!"},{"$error":"#VALUE!"},{"$error":"#VALUE!"}]
[203.4,{"$error":"#VALUE!"},{"$error":"#VALUE!"},{"$error":"#VALUE!"},{"$error":"#VALUE!"},{"$error":"#VALUE!"},{"$error":"#VALUE!"},{"$error":"#VALUE!"},{"$error":"#VALUE!"},{"$error":"#VALUE!"}]
[203.6,{"$error":"#VALUE!"},{"$error":"#VALUE!"},{"$error":"#VALUE!"},{"$error":"#VALUE!"},{"$error":"#VALUE!"},{"$error":"#VALUE!"},{"$error":"#VALUE!"},{"$error":"#VALUE!"},{"$error":"#VALUE!"}]
[203.8,{"$error":"#VALUE!"},{"$error":"#VALUE!"},{"$error":"#VALUE!"},{"$error":"#VALUE!"},{"$error":"#VALUE!"},{"$error":"#VALUE!"},{"$error":"#VALUE!"},{"$error":"#VALUE!"},{"$error":"#VALUE!"}]
[204,{"$error":"#VALUE!"},{"$error":"#VALUE!"},{"$error":"#VALUE!"},{"$error":"#VALUE!"},{"$error":"#VALUE!"},{"$error":"#VALUE!"},{"$error":"#VALUE!"},{"$error":"#VALUE!"},{"$error":"#VALUE!"}]
[204.2,{"$error":"#VALUE!"},{"$error":"#VALUE!"},{"$error":"#VALUE!"},{"$error":"#VALUE!"},{"$error":"#VALUE!"},{"$error":"#VALUE!"},{"$error":"#VALUE!"},{"$error":"#VALUE!"},{"$error":"#VALUE!"}]
[204.4,{"$error":"#VALUE!"},{"$error":"#VALUE!"},{"$error":"#VALUE!"},{"$error":"#VALUE!"},{"$error":"#VALUE!"},{"$error":"#VALUE!"},{"$error":"#VALUE!"},{"$error":"#VALUE!"},{"$error":"#VALUE!"}]
[204.6,{"$error":"#VALUE!"},{"$error":"#VALUE!"},{"$error":"#VALUE!"},{"$error":"#VALUE!"},{"$error":"#VALUE!"},{"$error":"#VALUE!"},{"$error":"#VALUE!"},{"$error":"#VALUE!"},{"$error":"#VALUE!"}]
[204.8,{"$error":"#VALUE!"},{"$f":"IF(AND($C$5>=A1044,A1044>=$B$5),($D$5^2-(A1044-$E$5)^2)^0.5,0)","v":{"$error":"#VALUE!"}},{"$f":"IF(AND($C$6>=A1044,A1044>=$B$6),($D$6^2-(A1044-$E$6)^2)^0.5,0)","v":{"$error":"#VALUE!"}},{"$f":"IF(AND($C$7>=A1044,A1044>$B$7),($D$7^2-(A1044-$E$7)^2)^0.5,0)","v":{"$error":"#VALUE!"}},{"$f":"IF(AND($C$8>=A1044,A1044>=$B$8),($D$8^2-(A1044-$E$8)^2)^0.5,0)","v":{"$error":"#VALUE!"}},{"$f":"IF(AND($C$9>=A1044,A1044>=$B$9),($D$9^2-(A1044-$E$9)^2)^0.5,0)","v":{"$error":"#VALUE!"}},{"$f":"IF(AND($C$10>=A1044,A1044>=$B$10),($D$10^2-(A1044-$E$10)^2)^0.5,0)","v":{"$error":"#VALUE!"}},{"$f":"IF(AND($C$11>=A1044,A1044>=$B$11),($D$11^2-(A1044-$E$11)^2)^0.5,0)","v":{"$error":"#VALUE!"}},{"$error":"#VALUE!"}]
[205,{"$f":"$G$15*A1045+$G$16","v":{"$error":"#VALUE!"}},{"$error":"#VALUE!"},{"$error":"#VALUE!"},{"$error":"#VALUE!"},{"$error":"#VALUE!"},{"$error":"#VALUE!"},{"$error":"#VALUE!"},{"$error":"#VALUE!"},{"$f":"IF(AND($C$12>=A1045,A1045>=$B$12),($D$12^2-(A1045-$E$12)^2)^0.5,0)","v":{"$error":"#VALUE!"}}]
[{"$f":"A1045+0.2","v":205.2},{"$error":"#VALUE!"},{"$error":"#VALUE!"},{"$error":"#VALUE!"},{"$error":"#VALUE!"},{"$error":"#VALUE!"},{"$error":"#VALUE!"},{"$error":"#VALUE!"},{"$error":"#VALUE!"},{"$error":"#VALUE!"}]
[205.4,{"$error":"#VALUE!"},{"$error":"#VALUE!"},{"$error":"#VALUE!"},{"$error":"#VALUE!"},{"$error":"#VALUE!"},{"$error":"#VALUE!"},{"$error":"#VALUE!"},{"$error":"#VALUE!"},{"$error":"#VALUE!"}]
[205.6,{"$error":"#VALUE!"},{"$error":"#VALUE!"},{"$error":"#VALUE!"},{"$error":"#VALUE!"},{"$error":"#VALUE!"},{"$error":"#VALUE!"},{"$error":"#VALUE!"},{"$error":"#VALUE!"},{"$error":"#VALUE!"}]
[205.8,{"$error":"#VALUE!"},{"$error":"#VALUE!"},{"$error":"#VALUE!"},{"$error":"#VALUE!"},{"$error":"#VALUE!"},{"$error":"#VALUE!"},{"$error":"#VALUE!"},{"$error":"#VALUE!"},{"$error":"#VALUE!"}]
[206,{"$error":"#VALUE!"},{"$error":"#VALUE!"},{"$error":"#VALUE!"},{"$error":"#VALUE!"},{"$error":"#VALUE!"},{"$error":"#VALUE!"},{"$error":"#VALUE!"},{"$error":"#VALUE!"},{"$error":"#VALUE!"}]
[206.2,{"$error":"#VALUE!"},{"$error":"#VALUE!"},{"$error":"#VALUE!"},{"$error":"#VALUE!"},{"$error":"#VALUE!"},{"$error":"#VALUE!"},{"$error":"#VALUE!"},{"$error":"#VALUE!"},{"$error":"#VALUE!"}]
[206.4,{"$error":"#VALUE!"},{"$error":"#VALUE!"},{"$error":"#VALUE!"},{"$error":"#VALUE!"},{"$error":"#VALUE!"},{"$error":"#VALUE!"},{"$error":"#VALUE!"},{"$error":"#VALUE!"},{"$error":"#VALUE!"}]
[206.6,{"$error":"#VALUE!"},{"$error":"#VALUE!"},{"$error":"#VALUE!"},{"$error":"#VALUE!"},{"$error":"#VALUE!"},{"$error":"#VALUE!"},{"$error":"#VALUE!"},{"$error":"#VALUE!"},{"$error":"#VALUE!"}]
[206.8,{"$error":"#VALUE!"},{"$error":"#VALUE!"},{"$error":"#VALUE!"},{"$error":"#VALUE!"},{"$error":"#VALUE!"},{"$error":"#VALUE!"},{"$error":"#VALUE!"},{"$error":"#VALUE!"},{"$error":"#VALUE!"}]
[207,{"$error":"#VALUE!"},{"$error":"#VALUE!"},{"$error":"#VALUE!"},{"$error":"#VALUE!"},{"$error":"#VALUE!"},{"$error":"#VALUE!"},{"$error":"#VALUE!"},{"$error":"#VALUE!"},{"$error":"#VALUE!"}]
[207.2,{"$error":"#VALUE!"},{"$error":"#VALUE!"},{"$error":"#VALUE!"},{"$error":"#VALUE!"},{"$error":"#VALUE!"},{"$error":"#VALUE!"},{"$error":"#VALUE!"},{"$error":"#VALUE!"},{"$error":"#VALUE!"}]
[207.4,{"$error":"#VALUE!"},{"$error":"#VALUE!"},{"$error":"#VALUE!"},{"$error":"#VALUE!"},{"$error":"#VALUE!"},{"$error":"#VALUE!"},{"$error":"#VALUE!"},{"$error":"#VALUE!"},{"$error":"#VALUE!"}]
[207.6,{"$error":"#VALUE!"},{"$error":"#VALUE!"},{"$error":"#VALUE!"},{"$error":"#VALUE!"},{"$error":"#VALUE!"},{"$error":"#VALUE!"},{"$error":"#VALUE!"},{"$error":"#VALUE!"},{"$error":"#VALUE!"}]
[207.8,{"$error":"#VALUE!"},{"$error":"#VALUE!"},{"$error":"#VALUE!"},{"$error":"#VALUE!"},{"$error":"#VALUE!"},{"$error":"#VALUE!"},{"$error":"#VALUE!"},{"$error":"#VALUE!"},{"$error":"#VALUE!"}]
[208,{"$error":"#VALUE!"},{"$error":"#VALUE!"},{"$error":"#VALUE!"},{"$error":"#VALUE!"},{"$error":"#VALUE!"},{"$error":"#VALUE!"},{"$error":"#VALUE!"},{"$error":"#VALUE!"},{"$error":"#VALUE!"}]
[208.2,{"$error":"#VALUE!"},{"$error":"#VALUE!"},{"$error":"#VALUE!"},{"$error":"#VALUE!"},{"$error":"#VALUE!"},{"$error":"#VALUE!"},{"$error":"#VALUE!"},{"$error":"#VALUE!"},{"$error":"#VALUE!"}]
[208.4,{"$error":"#VALUE!"},{"$error":"#VALUE!"},{"$error":"#VALUE!"},{"$error":"#VALUE!"},{"$error":"#VALUE!"},{"$error":"#VALUE!"},{"$error":"#VALUE!"},{"$error":"#VALUE!"},{"$error":"#VALUE!"}]
[208.6,{"$error":"#VALUE!"},{"$error":"#VALUE!"},{"$error":"#VALUE!"},{"$error":"#VALUE!"},{"$error":"#VALUE!"},{"$error":"#VALUE!"},{"$error":"#VALUE!"},{"$error":"#VALUE!"},{"$error":"#VALUE!"}]
[208.8,{"$error":"#VALUE!"},{"$error":"#VALUE!"},{"$error":"#VALUE!"},{"$error":"#VALUE!"},{"$error":"#VALUE!"},{"$error":"#VALUE!"},{"$error":"#VALUE!"},{"$error":"#VALUE!"},{"$error":"#VALUE!"}]
[209,{"$error":"#VALUE!"},{"$error":"#VALUE!"},{"$error":"#VALUE!"},{"$error":"#VALUE!"},{"$error":"#VALUE!"},{"$error":"#VALUE!"},{"$error":"#VALUE!"},{"$error":"#VALUE!"},{"$error":"#VALUE!"}]
[209.2,{"$error":"#VALUE!"},{"$error":"#VALUE!"},{"$error":"#VALUE!"},{"$error":"#VALUE!"},{"$error":"#VALUE!"},{"$error":"#VALUE!"},{"$error":"#VALUE!"},{"$error":"#VALUE!"},{"$error":"#VALUE!"}]
[209.4,{"$error":"#VALUE!"},{"$error":"#VALUE!"},{"$error":"#VALUE!"},{"$error":"#VALUE!"},{"$error":"#VALUE!"},{"$error":"#VALUE!"},{"$error":"#VALUE!"},{"$error":"#VALUE!"},{"$error":"#VALUE!"}]
[209.6,{"$error":"#VALUE!"},{"$error":"#VALUE!"},{"$error":"#VALUE!"},{"$error":"#VALUE!"},{"$error":"#VALUE!"},{"$error":"#VALUE!"},{"$error":"#VALUE!"},{"$error":"#VALUE!"},{"$error":"#VALUE!"}]
[209.8,{"$error":"#VALUE!"},{"$error":"#VALUE!"},{"$error":"#VALUE!"},{"$error":"#VALUE!"},{"$error":"#VALUE!"},{"$error":"#VALUE!"},{"$error":"#VALUE!"},{"$error":"#VALUE!"},{"$error":"#VALUE!"}]
[210,{"$error":"#VALUE!"},{"$error":"#VALUE!"},{"$error":"#VALUE!"},{"$error":"#VALUE!"},{"$error":"#VALUE!"},{"$error":"#VALUE!"},{"$error":"#VALUE!"},{"$error":"#VALUE!"},{"$error":"#VALUE!"}]
[210.2,{"$error":"#VALUE!"},{"$error":"#VALUE!"},{"$error":"#VALUE!"},{"$error":"#VALUE!"},{"$error":"#VALUE!"},{"$error":"#VALUE!"},{"$error":"#VALUE!"},{"$error":"#VALUE!"},{"$error":"#VALUE!"}]
[210.4,{"$error":"#VALUE!"},{"$error":"#VALUE!"},{"$error":"#VALUE!"},{"$error":"#VALUE!"},{"$error":"#VALUE!"},{"$error":"#VALUE!"},{"$error":"#VALUE!"},{"$error":"#VALUE!"},{"$error":"#VALUE!"}]
[210.6,{"$error":"#VALUE!"},{"$error":"#VALUE!"},{"$error":"#VALUE!"},{"$error":"#VALUE!"},{"$error":"#VALUE!"},{"$error":"#VALUE!"},{"$error":"#VALUE!"},{"$error":"#VALUE!"},{"$error":"#VALUE!"}]
[210.8,{"$error":"#VALUE!"},{"$error":"#VALUE!"},{"$error":"#VALUE!"},{"$error":"#VALUE!"},{"$error":"#VALUE!"},{"$error":"#VALUE!"},{"$error":"#VALUE!"},{"$error":"#VALUE!"},{"$error":"#VALUE!"}]
[211,{"$error":"#VALUE!"},{"$error":"#VALUE!"},{"$error":"#VALUE!"},{"$error":"#VALUE!"},{"$error":"#VALUE!"},{"$error":"#VALUE!"},{"$error":"#VALUE!"},{"$error":"#VALUE!"},{"$error":"#VALUE!"}]
[211.2,{"$error":"#VALUE!"},{"$error":"#VALUE!"},{"$error":"#VALUE!"},{"$error":"#VALUE!"},{"$error":"#VALUE!"},{"$error":"#VALUE!"},{"$error":"#VALUE!"},{"$error":"#VALUE!"},{"$error":"#VALUE!"}]
[211.4,{"$error":"#VALUE!"},{"$error":"#VALUE!"},{"$error":"#VALUE!"},{"$error":"#VALUE!"},{"$error":"#VALUE!"},{"$error":"#VALUE!"},{"$error":"#VALUE!"},{"$error":"#VALUE!"},{"$error":"#VALUE!"}]
[211.6,{"$error":"#VALUE!"},{"$error":"#VALUE!"},{"$error":"#VALUE!"},{"$error":"#VALUE!"},{"$error":"#VALUE!"},{"$error":"#VALUE!"},{"$error":"#VALUE!"},{"$error":"#VALUE!"},{"$error":"#VALUE!"}]
[211.8,{"$error":"#VALUE!"},{"$error":"#VALUE!"},{"$error":"#VALUE!"},{"$error":"#VALUE!"},{"$error":"#VALUE!"},{"$error":"#VALUE!"},{"$error":"#VALUE!"},{"$error":"#VALUE!"},{"$error":"#VALUE!"}]
[212,{"$error":"#VALUE!"},{"$error":"#VALUE!"},{"$error":"#VALUE!"},{"$error":"#VALUE!"},{"$error":"#VALUE!"},{"$error":"#VALUE!"},{"$error":"#VALUE!"},{"$error":"#VALUE!"},{"$error":"#VALUE!"}]
[212.2,{"$error":"#VALUE!"},{"$error":"#VALUE!"},{"$error":"#VALUE!"},{"$error":"#VALUE!"},{"$error":"#VALUE!"},{"$error":"#VALUE!"},{"$error":"#VALUE!"},{"$error":"#VALUE!"},{"$error":"#VALUE!"}]
[212.4,{"$error":"#VALUE!"},{"$error":"#VALUE!"},{"$error":"#VALUE!"},{"$error":"#VALUE!"},{"$error":"#VALUE!"},{"$error":"#VALUE!"},{"$error":"#VALUE!"},{"$error":"#VALUE!"},{"$error":"#VALUE!"}]
[212.6,{"$error":"#VALUE!"},{"$error":"#VALUE!"},{"$error":"#VALUE!"},{"$error":"#VALUE!"},{"$error":"#VALUE!"},{"$error":"#VALUE!"},{"$error":"#VALUE!"},{"$error":"#VALUE!"},{"$error":"#VALUE!"}]
[212.8,{"$error":"#VALUE!"},{"$error":"#VALUE!"},{"$error":"#VALUE!"},{"$error":"#VALUE!"},{"$error":"#VALUE!"},{"$error":"#VALUE!"},{"$error":"#VALUE!"},{"$error":"#VALUE!"},{"$error":"#VALUE!"}]
[213,{"$error":"#VALUE!"},{"$error":"#VALUE!"},{"$error":"#VALUE!"},{"$error":"#VALUE!"},{"$error":"#VALUE!"},{"$error":"#VALUE!"},{"$error":"#VALUE!"},{"$error":"#VALUE!"},{"$error":"#VALUE!"}]
[213.2,{"$error":"#VALUE!"},{"$error":"#VALUE!"},{"$error":"#VALUE!"},{"$error":"#VALUE!"},{"$error":"#VALUE!"},{"$error":"#VALUE!"},{"$error":"#VALUE!"},{"$error":"#VALUE!"},{"$error":"#VALUE!"}]
[213.4,{"$error":"#VALUE!"},{"$error":"#VALUE!"},{"$error":"#VALUE!"},{"$error":"#VALUE!"},{"$error":"#VALUE!"},{"$error":"#VALUE!"},{"$error":"#VALUE!"},{"$error":"#VALUE!"},{"$error":"#VALUE!"}]
[213.6,{"$error":"#VALUE!"},{"$error":"#VALUE!"},{"$error":"#VALUE!"},{"$error":"#VALUE!"},{"$error":"#VALUE!"},{"$error":"#VALUE!"},{"$error":"#VALUE!"},{"$error":"#VALUE!"},{"$error":"#VALUE!"}]
[213.8,{"$error":"#VALUE!"},{"$error":"#VALUE!"},{"$error":"#VALUE!"},{"$error":"#VALUE!"},{"$error":"#VALUE!"},{"$error":"#VALUE!"},{"$error":"#VALUE!"},{"$error":"#VALUE!"},{"$error":"#VALUE!"}]
[214,{"$error":"#VALUE!"},{"$error":"#VALUE!"},{"$error":"#VALUE!"},{"$error":"#VALUE!"},{"$error":"#VALUE!"},{"$error":"#VALUE!"},{"$error":"#VALUE!"},{"$error":"#VALUE!"},{"$error":"#VALUE!"}]
[214.2,{"$error":"#VALUE!"},{"$error":"#VALUE!"},{"$error":"#VALUE!"},{"$error":"#VALUE!"},{"$error":"#VALUE!"},{"$error":"#VALUE!"},{"$error":"#VALUE!"},{"$error":"#VALUE!"},{"$error":"#VALUE!"}]
[214.4,{"$error":"#VALUE!"},{"$error":"#VALUE!"},{"$error":"#VALUE!"},{"$error":"#VALUE!"},{"$error":"#VALUE!"},{"$error":"#VALUE!"},{"$error":"#VALUE!"},{"$error":"#VALUE!"},{"$error":"#VALUE!"}]
[214.6,{"$error":"#VALUE!"},{"$error":"#VALUE!"},{"$error":"#VALUE!"},{"$error":"#VALUE!"},{"$error":"#VALUE!"},{"$error":"#VALUE!"},{"$error":"#VALUE!"},{"$error":"#VALUE!"},{"$error":"#VALUE!"}]
[214.8,{"$error":"#VALUE!"},{"$error":"#VALUE!"},{"$error":"#VALUE!"},{"$error":"#VALUE!"},{"$error":"#VALUE!"},{"$error":"#VALUE!"},{"$error":"#VALUE!"},{"$error":"#VALUE!"},{"$error":"#VALUE!"}]
[215,{"$error":"#VALUE!"},{"$error":"#VALUE!"},{"$error":"#VALUE!"},{"$error":"#VALUE!"},{"$error":"#VALUE!"},{"$error":"#VALUE!"},{"$error":"#VALUE!"},{"$error":"#VALUE!"},{"$error":"#VALUE!"}]
[215.2,{"$error":"#VALUE!"},{"$error":"#VALUE!"},{"$error":"#VALUE!"},{"$error":"#VALUE!"},{"$error":"#VALUE!"},{"$error":"#VALUE!"},{"$error":"#VALUE!"},{"$error":"#VALUE!"},{"$error":"#VALUE!"}]
[215.4,{"$error":"#VALUE!"},{"$error":"#VALUE!"},{"$error":"#VALUE!"},{"$error":"#VALUE!"},{"$error":"#VALUE!"},{"$error":"#VALUE!"},{"$error":"#VALUE!"},{"$error":"#VALUE!"},{"$error":"#VALUE!"}]
[215.6,{"$error":"#VALUE!"},{"$error":"#VALUE!"},{"$error":"#VALUE!"},{"$error":"#VALUE!"},{"$error":"#VALUE!"},{"$error":"#VALUE!"},{"$error":"#VALUE!"},{"$error":"#VALUE!"},{"$error":"#VALUE!"}]
[215.8,{"$error":"#VALUE!"},{"$error":"#VALUE!"},{"$error":"#VALUE!"},{"$error":"#VALUE!"},{"$error":"#VALUE!"},{"$error":"#VALUE!"},{"$error":"#VALUE!"},{"$error":"#VALUE!"},{"$error":"#VALUE!"}]
[216,{"$error":"#VALUE!"},{"$error":"#VALUE!"},{"$error":"#VALUE!"},{"$error":"#VALUE!"},{"$error":"#VALUE!"},{"$error":"#VALUE!"},{"$error":"#VALUE!"},{"$error":"#VALUE!"},{"$error":"#VALUE!"}]
[216.2,{"$error":"#VALUE!"},{"$error":"#VALUE!"},{"$error":"#VALUE!"},{"$error":"#VALUE!"},{"$error":"#VALUE!"},{"$error":"#VALUE!"},{"$error":"#VALUE!"},{"$error":"#VALUE!"},{"$error":"#VALUE!"}]
[216.4,{"$error":"#VALUE!"},{"$error":"#VALUE!"},{"$error":"#VALUE!"},{"$error":"#VALUE!"},{"$error":"#VALUE!"},{"$error":"#VALUE!"},{"$error":"#VALUE!"},{"$error":"#VALUE!"},{"$error":"#VALUE!"}]
[216.6,{"$error":"#VALUE!"},{"$error":"#VALUE!"},{"$error":"#VALUE!"},{"$error":"#VALUE!"},{"$error":"#VALUE!"},{"$error":"#VALUE!"},{"$error":"#VALUE!"},{"$error":"#VALUE!"},{"$error":"#VALUE!"}]
[216.8,{"$error":"#VALUE!"},{"$error":"#VALUE!"},{"$error":"#VALUE!"},{"$error":"#VALUE!"},{"$error":"#VALUE!"},{"$error":"#VALUE!"},{"$error":"#VALUE!"},{"$error":"#VALUE!"},{"$error":"#VALUE!"}]
[217,{"$error":"#VALUE!"},{"$error":"#VALUE!"},{"$error":"#VALUE!"},{"$error":"#VALUE!"},{"$error":"#VALUE!"},{"$error":"#VALUE!"},{"$error":"#VALUE!"},{"$error":"#VALUE!"},{"$error":"#VALUE!"}]
[217.2,{"$error":"#VALUE!"},{"$error":"#VALUE!"},{"$error":"#VALUE!"},{"$error":"#VALUE!"},{"$error":"#VALUE!"},{"$error":"#VALUE!"},{"$error":"#VALUE!"},{"$error":"#VALUE!"},{"$error":"#VALUE!"}]
[217.4,{"$error":"#VALUE!"},{"$error":"#VALUE!"},{"$error":"#VALUE!"},{"$error":"#VALUE!"},{"$error":"#VALUE!"},{"$error":"#VALUE!"},{"$error":"#VALUE!"},{"$error":"#VALUE!"},{"$error":"#VALUE!"}]
[217.6,{"$error":"#VALUE!"},{"$f":"IF(AND($C$5>=A1108,A1108>=$B$5),($D$5^2-(A1108-$E$5)^2)^0.5,0)","v":{"$error":"#VALUE!"}},{"$f":"IF(AND($C$6>=A1108,A1108>=$B$6),($D$6^2-(A1108-$E$6)^2)^0.5,0)","v":{"$error":"#VALUE!"}},{"$f":"IF(AND($C$7>=A1108,A1108>$B$7),($D$7^2-(A1108-$E$7)^2)^0.5,0)","v":{"$error":"#VALUE!"}},{"$f":"IF(AND($C$8>=A1108,A1108>=$B$8),($D$8^2-(A1108-$E$8)^2)^0.5,0)","v":{"$error":"#VALUE!"}},{"$f":"IF(AND($C$9>=A1108,A1108>=$B$9),($D$9^2-(A1108-$E$9)^2)^0.5,0)","v":{"$error":"#VALUE!"}},{"$f":"IF(AND($C$10>=A1108,A1108>=$B$10),($D$10^2-(A1108-$E$10)^2)^0.5,0)","v":{"$error":"#VALUE!"}},{"$f":"IF(AND($C$11>=A1108,A1108>=$B$11),($D$11^2-(A1108-$E$11)^2)^0.5,0)","v":{"$error":"#VALUE!"}},{"$error":"#VALUE!"}]
[217.8,{"$f":"$G$15*A1109+$G$16","v":{"$error":"#VALUE!"}},{"$error":"#VALUE!"},{"$error":"#VALUE!"},{"$error":"#VALUE!"},{"$error":"#VALUE!"},{"$error":"#VALUE!"},{"$error":"#VALUE!"},{"$error":"#VALUE!"},{"$f":"IF(AND($C$12>=A1109,A1109>=$B$12),($D$12^2-(A1109-$E$12)^2)^0.5,0)","v":{"$error":"#VALUE!"}}]
[{"$f":"A1109+0.2","v":218},{"$error":"#VALUE!"},{"$error":"#VALUE!"},{"$error":"#VALUE!"},{"$error":"#VALUE!"},{"$error":"#VALUE!"},{"$error":"#VALUE!"},{"$error":"#VALUE!"},{"$error":"#VALUE!"},{"$error":"#VALUE!"}]
[218.2,{"$error":"#VALUE!"},{"$error":"#VALUE!"},{"$error":"#VALUE!"},{"$error":"#VALUE!"},{"$error":"#VALUE!"},{"$error":"#VALUE!"},{"$error":"#VALUE!"},{"$error":"#VALUE!"},{"$error":"#VALUE!"}]
[218.4,{"$error":"#VALUE!"},{"$error":"#VALUE!"},{"$error":"#VALUE!"},{"$error":"#VALUE!"},{"$error":"#VALUE!"},{"$error":"#VALUE!"},{"$error":"#VALUE!"},{"$error":"#VALUE!"},{"$error":"#VALUE!"}]
[218.6,{"$error":"#VALUE!"},{"$error":"#VALUE!"},{"$error":"#VALUE!"},{"$error":"#VALUE!"},{"$error":"#VALUE!"},{"$error":"#VALUE!"},{"$error":"#VALUE!"},{"$error":"#VALUE!"},{"$error":"#VALUE!"}]
[218.8,{"$error":"#VALUE!"},{"$error":"#VALUE!"},{"$error":"#VALUE!"},{"$error":"#VALUE!"},{"$error":"#VALUE!"},{"$error":"#VALUE!"},{"$error":"#VALUE!"},{"$error":"#VALUE!"},{"$error":"#VALUE!"}]
[219,{"$error":"#VALUE!"},{"$error":"#VALUE!"},{"$error":"#VALUE!"},{"$error":"#VALUE!"},{"$error":"#VALUE!"},{"$error":"#VALUE!"},{"$error":"#VALUE!"},{"$error":"#VALUE!"},{"$error":"#VALUE!"}]
[219.2,{"$error":"#VALUE!"},{"$error":"#VALUE!"},{"$error":"#VALUE!"},{"$error":"#VALUE!"},{"$error":"#VALUE!"},{"$error":"#VALUE!"},{"$error":"#VALUE!"},{"$error":"#VALUE!"},{"$error":"#VALUE!"}]
[219.4,{"$error":"#VALUE!"},{"$error":"#VALUE!"},{"$error":"#VALUE!"},{"$error":"#VALUE!"},{"$error":"#VALUE!"},{"$error":"#VALUE!"},{"$error":"#VALUE!"},{"$error":"#VALUE!"},{"$error":"#VALUE!"}]
[219.6,{"$error":"#VALUE!"},{"$error":"#VALUE!"},{"$error":"#VALUE!"},{"$error":"#VALUE!"},{"$error":"#VALUE!"},{"$error":"#VALUE!"},{"$error":"#VALUE!"},{"$error":"#VALUE!"},{"$error":"#VALUE!"}]
[219.8,{"$error":"#VALUE!"},{"$error":"#VALUE!"},{"$error":"#VALUE!"},{"$error":"#VALUE!"},{"$error":"#VALUE!"},{"$error":"#VALUE!"},{"$error":"#VALUE!"},{"$error":"#VALUE!"},{"$error":"#VALUE!"}]
[220,{"$error":"#VALUE!"},{"$error":"#VALUE!"},{"$error":"#VALUE!"},{"$error":"#VALUE!"},{"$error":"#VALUE!"},{"$error":"#VALUE!"},{"$error":"#VALUE!"},{"$error":"#VALUE!"},{"$error":"#VALUE!"}]
[220.2,{"$error":"#VALUE!"},{"$error":"#VALUE!"},{"$error":"#VALUE!"},{"$error":"#VALUE!"},{"$error":"#VALUE!"},{"$error":"#VALUE!"},{"$error":"#VALUE!"},{"$error":"#VALUE!"},{"$error":"#VALUE!"}]
[220.4,{"$error":"#VALUE!"},{"$error":"#VALUE!"},{"$error":"#VALUE!"},{"$error":"#VALUE!"},{"$error":"#VALUE!"},{"$error":"#VALUE!"},{"$error":"#VALUE!"},{"$error":"#VALUE!"},{"$error":"#VALUE!"}]
[220.6,{"$error":"#VALUE!"},{"$error":"#VALUE!"},{"$error":"#VALUE!"},{"$error":"#VALUE!"},{"$error":"#VALUE!"},{"$error":"#VALUE!"},{"$error":"#VALUE!"},{"$error":"#VALUE!"},{"$error":"#VALUE!"}]
[220.8,{"$error":"#VALUE!"},{"$error":"#VALUE!"},{"$error":"#VALUE!"},{"$error":"#VALUE!"},{"$error":"#VALUE!"},{"$error":"#VALUE!"},{"$error":"#VALUE!"},{"$error":"#VALUE!"},{"$error":"#VALUE!"}]
[221,{"$error":"#VALUE!"},{"$error":"#VALUE!"},{"$error":"#VALUE!"},{"$error":"#VALUE!"},{"$error":"#VALUE!"},{"$error":"#VALUE!"},{"$error":"#VALUE!"},{"$error":"#VALUE!"},{"$error":"#VALUE!"}]
[221.2,{"$error":"#VALUE!"},{"$error":"#VALUE!"},{"$error":"#VALUE!"},{"$error":"#VALUE!"},{"$error":"#VALUE!"},{"$error":"#VALUE!"},{"$error":"#VALUE!"},{"$error":"#VALUE!"},{"$error":"#VALUE!"}]
[221.4,{"$error":"#VALUE!"},{"$error":"#VALUE!"},{"$error":"#VALUE!"},{"$error":"#VALUE!"},{"$error":"#VALUE!"},{"$error":"#VALUE!"},{"$error":"#VALUE!"},{"$error":"#VALUE!"},{"$error":"#VALUE!"}]
[221.6,{"$error":"#VALUE!"},{"$error":"#VALUE!"},{"$error":"#VALUE!"},{"$error":"#VALUE!"},{"$error":"#VALUE!"},{"$error":"#VALUE!"},{"$error":"#VALUE!"},{"$error":"#VALUE!"},{"$error":"#VALUE!"}]
[221.8,{"$error":"#VALUE!"},{"$error":"#VALUE!"},{"$error":"#VALUE!"},{"$error":"#VALUE!"},{"$error":"#VALUE!"},{"$error":"#VALUE!"},{"$error":"#VALUE!"},{"$error":"#VALUE!"},{"$error":"#VALUE!"}]
[222,{"$error":"#VALUE!"},{"$error":"#VALUE!"},{"$error":"#VALUE!"},{"$error":"#VALUE!"},{"$error":"#VALUE!"},{"$error":"#VALUE!"},{"$error":"#VALUE!"},{"$error":"#VALUE!"},{"$error":"#VALUE!"}]
[222.2,{"$error":"#VALUE!"},{"$error":"#VALUE!"},{"$error":"#VALUE!"},{"$error":"#VALUE!"},{"$error":"#VALUE!"},{"$error":"#VALUE!"},{"$error":"#VALUE!"},{"$error":"#VALUE!"},{"$error":"#VALUE!"}]
[222.4,{"$error":"#VALUE!"},{"$error":"#VALUE!"},{"$error":"#VALUE!"},{"$error":"#VALUE!"},{"$error":"#VALUE!"},{"$error":"#VALUE!"},{"$error":"#VALUE!"},{"$error":"#VALUE!"},{"$error":"#VALUE!"}]
[222.6,{"$error":"#VALUE!"},{"$error":"#VALUE!"},{"$error":"#VALUE!"},{"$error":"#VALUE!"},{"$error":"#VALUE!"},{"$error":"#VALUE!"},{"$error":"#VALUE!"},{"$error":"#VALUE!"},{"$error":"#VALUE!"}]
[222.8,{"$error":"#VALUE!"},{"$error":"#VALUE!"},{"$error":"#VALUE!"},{"$error":"#VALUE!"},{"$error":"#VALUE!"},{"$error":"#VALUE!"},{"$error":"#VALUE!"},{"$error":"#VALUE!"},{"$error":"#VALUE!"}]
[223,{"$error":"#VALUE!"},{"$error":"#VALUE!"},{"$error":"#VALUE!"},{"$error":"#VALUE!"},{"$error":"#VALUE!"},{"$error":"#VALUE!"},{"$error":"#VALUE!"},{"$error":"#VALUE!"},{"$error":"#VALUE!"}]
[223.2,{"$error":"#VALUE!"},{"$error":"#VALUE!"},{"$error":"#VALUE!"},{"$error":"#VALUE!"},{"$error":"#VALUE!"},{"$error":"#VALUE!"},{"$error":"#VALUE!"},{"$error":"#VALUE!"},{"$error":"#VALUE!"}]
[223.4,{"$error":"#VALUE!"},{"$error":"#VALUE!"},{"$error":"#VALUE!"},{"$error":"#VALUE!"},{"$error":"#VALUE!"},{"$error":"#VALUE!"},{"$error":"#VALUE!"},{"$error":"#VALUE!"},{"$error":"#VALUE!"}]
[223.6,{"$error":"#VALUE!"},{"$error":"#VALUE!"},{"$error":"#VALUE!"},{"$error":"#VALUE!"},{"$error":"#VALUE!"},{"$error":"#VALUE!"},{"$error":"#VALUE!"},{"$error":"#VALUE!"},{"$error":"#VALUE!"}]
[223.8,{"$error":"#VALUE!"},{"$error":"#VALUE!"},{"$error":"#VALUE!"},{"$error":"#VALUE!"},{"$error":"#VALUE!"},{"$error":"#VALUE!"},{"$error":"#VALUE!"},{"$error":"#VALUE!"},{"$error":"#VALUE!"}]
[224,{"$error":"#VALUE!"},{"$error":"#VALUE!"},{"$error":"#VALUE!"},{"$error":"#VALUE!"},{"$error":"#VALUE!"},{"$error":"#VALUE!"},{"$error":"#VALUE!"},{"$error":"#VALUE!"},{"$error":"#VALUE!"}]
[224.2,{"$error":"#VALUE!"},{"$error":"#VALUE!"},{"$error":"#VALUE!"},{"$error":"#VALUE!"},{"$error":"#VALUE!"},{"$error":"#VALUE!"},{"$error":"#VALUE!"},{"$error":"#VALUE!"},{"$error":"#VALUE!"}]
[224.4,{"$error":"#VALUE!"},{"$error":"#VALUE!"},{"$error":"#VALUE!"},{"$error":"#VALUE!"},{"$error":"#VALUE!"},{"$error":"#VALUE!"},{"$error":"#VALUE!"},{"$error":"#VALUE!"},{"$error":"#VALUE!"}]
[224.6,{"$error":"#VALUE!"},{"$error":"#VALUE!"},{"$error":"#VALUE!"},{"$error":"#VALUE!"},{"$error":"#VALUE!"},{"$error":"#VALUE!"},{"$error":"#VALUE!"},{"$error":"#VALUE!"},{"$error":"#VALUE!"}]
[224.8,{"$error":"#VALUE!"},{"$error":"#VALUE!"},{"$error":"#VALUE!"},{"$error":"#VALUE!"},{"$error":"#VALUE!"},{"$error":"#VALUE!"},{"$error":"#VALUE!"},{"$error":"#VALUE!"},{"$error":"#VALUE!"}]
[225,{"$error":"#VALUE!"},{"$error":"#VALUE!"},{"$error":"#VALUE!"},{"$error":"#VALUE!"},{"$error":"#VALUE!"},{"$error":"#VALUE!"},{"$error":"#VALUE!"},{"$error":"#VALUE!"},{"$error":"#VALUE!"}]
[225.2,{"$error":"#VALUE!"},{"$error":"#VALUE!"},{"$error":"#VALUE!"},{"$error":"#VALUE!"},{"$error":"#VALUE!"},{"$error":"#VALUE!"},{"$error":"#VALUE!"},{"$error":"#VALUE!"},{"$error":"#VALUE!"}]
[225.4,{"$error":"#VALUE!"},{"$error":"#VALUE!"},{"$error":"#VALUE!"},{"$error":"#VALUE!"},{"$error":"#VALUE!"},{"$error":"#VALUE!"},{"$error":"#VALUE!"},{"$error":"#VALUE!"},{"$error":"#VALUE!"}]
[225.6,{"$error":"#VALUE!"},{"$error":"#VALUE!"},{"$error":"#VALUE!"},{"$error":"#VALUE!"},{"$error":"#VALUE!"},{"$error":"#VALUE!"},{"$error":"#VALUE!"},{"$error":"#VALUE!"},{"$error":"#VALUE!"}]
[225.8,{"$error":"#VALUE!"},{"$error":"#VALUE!"},{"$error":"#VALUE!"},{"$error":"#VALUE!"},{"$error":"#VALUE!"},{"$error":"#VALUE!"},{"$error":"#VALUE!"},{"$error":"#VALUE!"},{"$error":"#VALUE!"}]
[226,{"$error":"#VALUE!"},{"$error":"#VALUE!"},{"$error":"#VALUE!"},{"$error":"#VALUE!"},{"$error":"#VALUE!"},{"$error":"#VALUE!"},{"$error":"#VALUE!"},{"$error":"#VALUE!"},{"$error":"#VALUE!"}]
[226.2,{"$error":"#VALUE!"},{"$error":"#VALUE!"},{"$error":"#VALUE!"},{"$error":"#VALUE!"},{"$error":"#VALUE!"},{"$error":"#VALUE!"},{"$error":"#VALUE!"},{"$error":"#VALUE!"},{"$error":"#VALUE!"}]
[226.4,{"$error":"#VALUE!"},{"$error":"#VALUE!"},{"$error":"#VALUE!"},{"$error":"#VALUE!"},{"$error":"#VALUE!"},{"$error":"#VALUE!"},{"$error":"#VALUE!"},{"$error":"#VALUE!"},{"$error":"#VALUE!"}]
[226.6,{"$error":"#VALUE!"},{"$error":"#VALUE!"},{"$error":"#VALUE!"},{"$error":"#VALUE!"},{"$error":"#VALUE!"},{"$error":"#VALUE!"},{"$error":"#VALUE!"},{"$error":"#VALUE!"},{"$error":"#VALUE!"}]
[226.8,{"$error":"#VALUE!"},{"$error":"#VALUE!"},{"$error":"#VALUE!"},{"$error":"#VALUE!"},{"$error":"#VALUE!"},{"$error":"#VALUE!"},{"$error":"#VALUE!"},{"$error":"#VALUE!"},{"$error":"#VALUE!"}]
[227,{"$error":"#VALUE!"},{"$error":"#VALUE!"},{"$error":"#VALUE!"},{"$error":"#VALUE!"},{"$error":"#VALUE!"},{"$error":"#VALUE!"},{"$error":"#VALUE!"},{"$error":"#VALUE!"},{"$error":"#VALUE!"}]
[227.2,{"$error":"#VALUE!"},{"$error":"#VALUE!"},{"$error":"#VALUE!"},{"$error":"#VALUE!"},{"$error":"#VALUE!"},{"$error":"#VALUE!"},{"$error":"#VALUE!"},{"$error":"#VALUE!"},{"$error":"#VALUE!"}]
[227.4,{"$error":"#VALUE!"},{"$error":"#VALUE!"},{"$error":"#VALUE!"},{"$error":"#VALUE!"},{"$error":"#VALUE!"},{"$error":"#VALUE!"},{"$error":"#VALUE!"},{"$error":"#VALUE!"},{"$error":"#VALUE!"}]
[227.6,{"$error":"#VALUE!"},{"$error":"#VALUE!"},{"$error":"#VALUE!"},{"$error":"#VALUE!"},{"$error":"#VALUE!"},{"$error":"#VALUE!"},{"$error":"#VALUE!"},{"$error":"#VALUE!"},{"$error":"#VALUE!"}]
[227.8,{"$error":"#VALUE!"},{"$error":"#VALUE!"},{"$error":"#VALUE!"},{"$error":"#VALUE!"},{"$error":"#VALUE!"},{"$error":"#VALUE!"},{"$error":"#VALUE!"},{"$error":"#VALUE!"},{"$error":"#VALUE!"}]
[228,{"$error":"#VALUE!"},{"$error":"#VALUE!"},{"$error":"#VALUE!"},{"$error":"#VALUE!"},{"$error":"#VALUE!"},{"$error":"#VALUE!"},{"$error":"#VALUE!"},{"$error":"#VALUE!"},{"$error":"#VALUE!"}]
[228.2,{"$error":"#VALUE!"},{"$error":"#VALUE!"},{"$error":"#VALUE!"},{"$error":"#VALUE!"},{"$error":"#VALUE!"},{"$error":"#VALUE!"},{"$error":"#VALUE!"},{"$error":"#VALUE!"},{"$error":"#VALUE!"}]
[228.4,{"$error":"#VALUE!"},{"$error":"#VALUE!"},{"$error":"#VALUE!"},{"$error":"#VALUE!"},{"$error":"#VALUE!"},{"$error":"#VALUE!"},{"$error":"#VALUE!"},{"$error":"#VALUE!"},{"$error":"#VALUE!"}]
[228.6,{"$error":"#VALUE!"},{"$error":"#VALUE!"},{"$error":"#VALUE!"},{"$error":"#VALUE!"},{"$error":"#VALUE!"},{"$error":"#VALUE!"},{"$error":"#VALUE!"},{"$error":"#VALUE!"},{"$error":"#VALUE!"}]
[228.8,{"$error":"#VALUE!"},{"$error":"#VALUE!"},{"$error":"#VALUE!"},{"$error":"#VALUE!"},{"$error":"#VALUE!"},{"$error":"#VALUE!"},{"$error":"#VALUE!"},{"$error":"#VALUE!"},{"$error":"#VALUE!"}]
[229,{"$error":"#VALUE!"},{"$error":"#VALUE!"},{"$error":"#VALUE!"},{"$error":"#VALUE!"},{"$error":"#VALUE!"},{"$error":"#VALUE!"},{"$error":"#VALUE!"},{"$error":"#VALUE!"},{"$error":"#VALUE!"}]
[229.2,{"$error":"#VALUE!"},{"$error":"#VALUE!"},{"$error":"#VALUE!"},{"$error":"#VALUE!"},{"$error":"#VALUE!"},{"$error":"#VALUE!"},{"$error":"#VALUE!"},{"$error":"#VALUE!"},{"$error":"#VALUE!"}]
[229.4,{"$error":"#VALUE!"},{"$error":"#VALUE!"},{"$error":"#VALUE!"},{"$error":"#VALUE!"},{"$error":"#VALUE!"},{"$error":"#VALUE!"},{"$error":"#VALUE!"},{"$error":"#VALUE!"},{"$error":"#VALUE!"}]
[229.6,{"$error":"#VALUE!"},{"$error":"#VALUE!"},{"$error":"#VALUE!"},{"$error":"#VALUE!"},{"$error":"#VALUE!"},{"$error":"#VALUE!"},{"$error":"#VALUE!"},{"$error":"#VALUE!"},{"$error":"#VALUE!"}]
[229.8,{"$error":"#VALUE!"},{"$error":"#VALUE!"},{"$error":"#VALUE!"},{"$error":"#VALUE!"},{"$error":"#VALUE!"},{"$error":"#VALUE!"},{"$error":"#VALUE!"},{"$error":"#VALUE!"},{"$error":"#VALUE!"}]
[230,{"$error":"#VALUE!"},{"$error":"#VALUE!"},{"$error":"#VALUE!"},{"$error":"#VALUE!"},{"$error":"#VALUE!"},{"$error":"#VALUE!"},{"$error":"#VALUE!"},{"$error":"#VALUE!"},{"$error":"#VALUE!"}]
[230.2,{"$error":"#VALUE!"},{"$error":"#VALUE!"},{"$error":"#VALUE!"},{"$error":"#VALUE!"},{"$error":"#VALUE!"},{"$error":"#VALUE!"},{"$error":"#VALUE!"},{"$error":"#VALUE!"},{"$error":"#VALUE!"}]
[230.4,{"$error":"#VALUE!"},{"$f":"IF(AND($C$5>=A1172,A1172>=$B$5),($D$5^2-(A1172-$E$5)^2)^0.5,0)","v":{"$error":"#VALUE!"}},{"$f":"IF(AND($C$6>=A1172,A1172>=$B$6),($D$6^2-(A1172-$E$6)^2)^0.5,0)","v":{"$error":"#VALUE!"}},{"$f":"IF(AND($C$7>=A1172,A1172>$B$7),($D$7^2-(A1172-$E$7)^2)^0.5,0)","v":{"$error":"#VALUE!"}},{"$f":"IF(AND($C$8>=A1172,A1172>=$B$8),($D$8^2-(A1172-$E$8)^2)^0.5,0)","v":{"$error":"#VALUE!"}},{"$f":"IF(AND($C$9>=A1172,A1172>=$B$9),($D$9^2-(A1172-$E$9)^2)^0.5,0)","v":{"$error":"#VALUE!"}},{"$f":"IF(AND($C$10>=A1172,A1172>=$B$10),($D$10^2-(A1172-$E$10)^2)^0.5,0)","v":{"$error":"#VALUE!"}},{"$f":"IF(AND($C$11>=A1172,A1172>=$B$11),($D$11^2-(A1172-$E$11)^2)^0.5,0)","v":{"$error":"#VALUE!"}},{"$error":"#VALUE!"}]
[230.6,{"$f":"$G$15*A1173+$G$16","v":{"$error":"#VALUE!"}},{"$error":"#VALUE!"},{"$error":"#VALUE!"},{"$error":"#VALUE!"},{"$error":"#VALUE!"},{"$error":"#VALUE!"},{"$error":"#VALUE!"},{"$error":"#VALUE!"},{"$f":"IF(AND($C$12>=A1173,A1173>=$B$12),($D$12^2-(A1173-$E$12)^2)^0.5,0)","v":{"$error":"#VALUE!"}}]
[{"$f":"A1173+0.2","v":230.8},{"$error":"#VALUE!"},{"$error":"#VALUE!"},{"$error":"#VALUE!"},{"$error":"#VALUE!"},{"$error":"#VALUE!"},{"$error":"#VALUE!"},{"$error":"#VALUE!"},{"$error":"#VALUE!"},{"$error":"#VALUE!"}]
[231,{"$error":"#VALUE!"},{"$error":"#VALUE!"},{"$error":"#VALUE!"},{"$error":"#VALUE!"},{"$error":"#VALUE!"},{"$error":"#VALUE!"},{"$error":"#VALUE!"},{"$error":"#VALUE!"},{"$error":"#VALUE!"}]
[231.2,{"$error":"#VALUE!"},{"$error":"#VALUE!"},{"$error":"#VALUE!"},{"$error":"#VALUE!"},{"$error":"#VALUE!"},{"$error":"#VALUE!"},{"$error":"#VALUE!"},{"$error":"#VALUE!"},{"$error":"#VALUE!"}]
[231.4,{"$error":"#VALUE!"},{"$error":"#VALUE!"},{"$error":"#VALUE!"},{"$error":"#VALUE!"},{"$error":"#VALUE!"},{"$error":"#VALUE!"},{"$error":"#VALUE!"},{"$error":"#VALUE!"},{"$error":"#VALUE!"}]
[231.6,{"$error":"#VALUE!"},{"$error":"#VALUE!"},{"$error":"#VALUE!"},{"$error":"#VALUE!"},{"$error":"#VALUE!"},{"$error":"#VALUE!"},{"$error":"#VALUE!"},{"$error":"#VALUE!"},{"$error":"#VALUE!"}]
[231.8,{"$error":"#VALUE!"},{"$error":"#VALUE!"},{"$error":"#VALUE!"},{"$error":"#VALUE!"},{"$error":"#VALUE!"},{"$error":"#VALUE!"},{"$error":"#VALUE!"},{"$error":"#VALUE!"},{"$error":"#VALUE!"}]
[232,{"$error":"#VALUE!"},{"$error":"#VALUE!"},{"$error":"#VALUE!"},{"$error":"#VALUE!"},{"$error":"#VALUE!"},{"$error":"#VALUE!"},{"$error":"#VALUE!"},{"$error":"#VALUE!"},{"$error":"#VALUE!"}]
[232.2,{"$error":"#VALUE!"},{"$error":"#VALUE!"},{"$error":"#VALUE!"},{"$error":"#VALUE!"},{"$error":"#VALUE!"},{"$error":"#VALUE!"},{"$error":"#VALUE!"},{"$error":"#VALUE!"},{"$error":"#VALUE!"}]
[232.4,{"$error":"#VALUE!"},{"$error":"#VALUE!"},{"$error":"#VALUE!"},{"$error":"#VALUE!"},{"$error":"#VALUE!"},{"$error":"#VALUE!"},{"$error":"#VALUE!"},{"$error":"#VALUE!"},{"$error":"#VALUE!"}]
[232.6,{"$error":"#VALUE!"},{"$error":"#VALUE!"},{"$error":"#VALUE!"},{"$error":"#VALUE!"},{"$error":"#VALUE!"},{"$error":"#VALUE!"},{"$error":"#VALUE!"},{"$error":"#VALUE!"},{"$error":"#VALUE!"}]
[232.8,{"$error":"#VALUE!"},{"$error":"#VALUE!"},{"$error":"#VALUE!"},{"$error":"#VALUE!"},{"$error":"#VALUE!"},{"$error":"#VALUE!"},{"$error":"#VALUE!"},{"$error":"#VALUE!"},{"$error":"#VALUE!"}]
[233,{"$error":"#VALUE!"},{"$error":"#VALUE!"},{"$error":"#VALUE!"},{"$error":"#VALUE!"},{"$error":"#VALUE!"},{"$error":"#VALUE!"},{"$error":"#VALUE!"},{"$error":"#VALUE!"},{"$error":"#VALUE!"}]
[233.2,{"$error":"#VALUE!"},{"$error":"#VALUE!"},{"$error":"#VALUE!"},{"$error":"#VALUE!"},{"$error":"#VALUE!"},{"$error":"#VALUE!"},{"$error":"#VALUE!"},{"$error":"#VALUE!"},{"$error":"#VALUE!"}]
[233.4,{"$error":"#VALUE!"},{"$error":"#VALUE!"},{"$error":"#VALUE!"},{"$error":"#VALUE!"},{"$error":"#VALUE!"},{"$error":"#VALUE!"},{"$error":"#VALUE!"},{"$error":"#VALUE!"},{"$error":"#VALUE!"}]
[233.6,{"$error":"#VALUE!"},{"$error":"#VALUE!"},{"$error":"#VALUE!"},{"$error":"#VALUE!"},{"$error":"#VALUE!"},{"$error":"#VALUE!"},{"$error":"#VALUE!"},{"$error":"#VALUE!"},{"$error":"#VALUE!"}]
[233.8,{"$error":"#VALUE!"},{"$error":"#VALUE!"},{"$error":"#VALUE!"},{"$error":"#VALUE!"},{"$error":"#VALUE!"},{"$error":"#VALUE!"},{"$error":"#VALUE!"},{"$error":"#VALUE!"},{"$error":"#VALUE!"}]
[234,{"$error":"#VALUE!"},{"$error":"#VALUE!"},{"$error":"#VALUE!"},{"$error":"#VALUE!"},{"$error":"#VALUE!"},{"$error":"#VALUE!"},{"$error":"#VALUE!"},{"$error":"#VALUE!"},{"$error":"#VALUE!"}]
[234.2,{"$error":"#VALUE!"},{"$error":"#VALUE!"},{"$error":"#VALUE!"},{"$error":"#VALUE!"},{"$error":"#VALUE!"},{"$error":"#VALUE!"},{"$error":"#VALUE!"},{"$error":"#VALUE!"},{"$error":"#VALUE!"}]
[234.4,{"$error":"#VALUE!"},{"$error":"#VALUE!"},{"$error":"#VALUE!"},{"$error":"#VALUE!"},{"$error":"#VALUE!"},{"$error":"#VALUE!"},{"$error":"#VALUE!"},{"$error":"#VALUE!"},{"$error":"#VALUE!"}]
[234.6,{"$error":"#VALUE!"},{"$error":"#VALUE!"},{"$error":"#VALUE!"},{"$error":"#VALUE!"},{"$error":"#VALUE!"},{"$error":"#VALUE!"},{"$error":"#VALUE!"},{"$error":"#VALUE!"},{"$error":"#VALUE!"}]
[234.8,{"$error":"#VALUE!"},{"$error":"#VALUE!"},{"$error":"#VALUE!"},{"$error":"#VALUE!"},{"$error":"#VALUE!"},{"$error":"#VALUE!"},{"$error":"#VALUE!"},{"$error":"#VALUE!"},{"$error":"#VALUE!"}]
[235,{"$error":"#VALUE!"},{"$error":"#VALUE!"},{"$error":"#VALUE!"},{"$error":"#VALUE!"},{"$error":"#VALUE!"},{"$error":"#VALUE!"},{"$error":"#VALUE!"},{"$error":"#VALUE!"},{"$error":"#VALUE!"}]
[235.2,{"$error":"#VALUE!"},{"$error":"#VALUE!"},{"$error":"#VALUE!"},{"$error":"#VALUE!"},{"$error":"#VALUE!"},{"$error":"#VALUE!"},{"$error":"#VALUE!"},{"$error":"#VALUE!"},{"$error":"#VALUE!"}]
[235.4,{"$error":"#VALUE!"},{"$error":"#VALUE!"},{"$error":"#VALUE!"},{"$error":"#VALUE!"},{"$error":"#VALUE!"},{"$error":"#VALUE!"},{"$error":"#VALUE!"},{"$error":"#VALUE!"},{"$error":"#VALUE!"}]
[235.6,{"$error":"#VALUE!"},{"$error":"#VALUE!"},{"$error":"#VALUE!"},{"$error":"#VALUE!"},{"$error":"#VALUE!"},{"$error":"#VALUE!"},{"$error":"#VALUE!"},{"$error":"#VALUE!"},{"$error":"#VALUE!"}]
[235.8,{"$error":"#VALUE!"},{"$error":"#VALUE!"},{"$error":"#VALUE!"},{"$error":"#VALUE!"},{"$error":"#VALUE!"},{"$error":"#VALUE!"},{"$error":"#VALUE!"},{"$error":"#VALUE!"},{"$error":"#VALUE!"}]
[236,{"$error":"#VALUE!"},{"$error":"#VALUE!"},{"$error":"#VALUE!"},{"$error":"#VALUE!"},{"$error":"#VALUE!"},{"$error":"#VALUE!"},{"$error":"#VALUE!"},{"$error":"#VALUE!"},{"$error":"#VALUE!"}]
[236.2,{"$error":"#VALUE!"},{"$error":"#VALUE!"},{"$error":"#VALUE!"},{"$error":"#VALUE!"},{"$error":"#VALUE!"},{"$error":"#VALUE!"},{"$error":"#VALUE!"},{"$error":"#VALUE!"},{"$error":"#VALUE!"}]
[236.4,{"$error":"#VALUE!"},{"$error":"#VALUE!"},{"$error":"#VALUE!"},{"$error":"#VALUE!"},{"$error":"#VALUE!"},{"$error":"#VALUE!"},{"$error":"#VALUE!"},{"$error":"#VALUE!"},{"$error":"#VALUE!"}]
[236.6,{"$error":"#VALUE!"},{"$error":"#VALUE!"},{"$error":"#VALUE!"},{"$error":"#VALUE!"},{"$error":"#VALUE!"},{"$error":"#VALUE!"},{"$error":"#VALUE!"},{"$error":"#VALUE!"},{"$error":"#VALUE!"}]
[236.8,{"$error":"#VALUE!"},{"$error":"#VALUE!"},{"$error":"#VALUE!"},{"$error":"#VALUE!"},{"$error":"#VALUE!"},{"$error":"#VALUE!"},{"$error":"#VALUE!"},{"$error":"#VALUE!"},{"$error":"#VALUE!"}]
[237,{"$error":"#VALUE!"},{"$error":"#VALUE!"},{"$error":"#VALUE!"},{"$error":"#VALUE!"},{"$error":"#VALUE!"},{"$error":"#VALUE!"},{"$error":"#VALUE!"},{"$error":"#VALUE!"},{"$error":"#VALUE!"}]
[237.2,{"$error":"#VALUE!"},{"$error":"#VALUE!"},{"$error":"#VALUE!"},{"$error":"#VALUE!"},{"$error":"#VALUE!"},{"$error":"#VALUE!"},{"$error":"#VALUE!"},{"$error":"#VALUE!"},{"$error":"#VALUE!"}]
[237.4,{"$error":"#VALUE!"},{"$error":"#VALUE!"},{"$error":"#VALUE!"},{"$error":"#VALUE!"},{"$error":"#VALUE!"},{"$error":"#VALUE!"},{"$error":"#VALUE!"},{"$error":"#VALUE!"},{"$error":"#VALUE!"}]
[237.6,{"$error":"#VALUE!"},{"$error":"#VALUE!"},{"$error":"#VALUE!"},{"$error":"#VALUE!"},{"$error":"#VALUE!"},{"$error":"#VALUE!"},{"$error":"#VALUE!"},{"$error":"#VALUE!"},{"$error":"#VALUE!"}]
[237.8,{"$error":"#VALUE!"},{"$error":"#VALUE!"},{"$error":"#VALUE!"},{"$error":"#VALUE!"},{"$error":"#VALUE!"},{"$error":"#VALUE!"},{"$error":"#VALUE!"},{"$error":"#VALUE!"},{"$error":"#VALUE!"}]
[238,{"$error":"#VALUE!"},{"$error":"#VALUE!"},{"$error":"#VALUE!"},{"$error":"#VALUE!"},{"$error":"#VALUE!"},{"$error":"#VALUE!"},{"$error":"#VALUE!"},{"$error":"#VALUE!"},{"$error":"#VALUE!"}]
[238.2,{"$error":"#VALUE!"},{"$error":"#VALUE!"},{"$error":"#VALUE!"},{"$error":"#VALUE!"},{"$error":"#VALUE!"},{"$error":"#VALUE!"},{"$error":"#VALUE!"},{"$error":"#VALUE!"},{"$error":"#VALUE!"}]
[238.4,{"$error":"#VALUE!"},{"$error":"#VALUE!"},{"$error":"#VALUE!"},{"$error":"#VALUE!"},{"$error":"#VALUE!"},{"$error":"#VALUE!"},{"$error":"#VALUE!"},{"$error":"#VALUE!"},{"$error":"#VALUE!"}]
[238.6,{"$error":"#VALUE!"},{"$error":"#VALUE!"},{"$error":"#VALUE!"},{"$error":"#VALUE!"},{"$error":"#VALUE!"},{"$error":"#VALUE!"},{"$error":"#VALUE!"},{"$error":"#VALUE!"},{"$error":"#VALUE!"}]
[238.8,{"$error":"#VALUE!"},{"$error":"#VALUE!"},{"$error":"#VALUE!"},{"$error":"#VALUE!"},{"$error":"#VALUE!"},{"$error":"#VALUE!"},{"$error":"#VALUE!"},{"$error":"#VALUE!"},{"$error":"#VALUE!"}]
[239,{"$error":"#VALUE!"},{"$error":"#VALUE!"},{"$error":"#VALUE!"},{"$error":"#VALUE!"},{"$error":"#VALUE!"},{"$error":"#VALUE!"},{"$error":"#VALUE!"},{"$error":"#VALUE!"},{"$error":"#VALUE!"}]
[239.2,{"$error":"#VALUE!"},{"$error":"#VALUE!"},{"$error":"#VALUE!"},{"$error":"#VALUE!"},{"$error":"#VALUE!"},{"$error":"#VALUE!"},{"$error":"#VALUE!"},{"$error":"#VALUE!"},{"$error":"#VALUE!"}]
[239.4,{"$error":"#VALUE!"},{"$error":"#VALUE!"},{"$error":"#VALUE!"},{"$error":"#VALUE!"},{"$error":"#VALUE!"},{"$error":"#VALUE!"},{"$error":"#VALUE!"},{"$error":"#VALUE!"},{"$error":"#VALUE!"}]
[239.6,{"$error":"#VALUE!"},{"$error":"#VALUE!"},{"$error":"#VALUE!"},{"$error":"#VALUE!"},{"$error":"#VALUE!"},{"$error":"#VALUE!"},{"$error":"#VALUE!"},{"$error":"#VALUE!"},{"$error":"#VALUE!"}]
[239.8,{"$error":"#VALUE!"},{"$error":"#VALUE!"},{"$error":"#VALUE!"},{"$error":"#VALUE!"},{"$error":"#VALUE!"},{"$error":"#VALUE!"},{"$error":"#VALUE!"},{"$error":"#VALUE!"},{"$error":"#VALUE!"}]
[240,{"$error":"#VALUE!"},{"$error":"#VALUE!"},{"$error":"#VALUE!"},{"$error":"#VALUE!"},{"$error":"#VALUE!"},{"$error":"#VALUE!"},{"$error":"#VALUE!"},{"$error":"#VALUE!"},{"$error":"#VALUE!"}]
[240.2,{"$error":"#VALUE!"},{"$error":"#VALUE!"},{"$error":"#VALUE!"},{"$error":"#VALUE!"},{"$error":"#VALUE!"},{"$error":"#VALUE!"},{"$error":"#VALUE!"},{"$error":"#VALUE!"},{"$error":"#VALUE!"}]
[240.4,{"$error":"#VALUE!"},{"$error":"#VALUE!"},{"$error":"#VALUE!"},{"$error":"#VALUE!"},{"$error":"#VALUE!"},{"$error":"#VALUE!"},{"$error":"#VALUE!"},{"$error":"#VALUE!"},{"$error":"#VALUE!"}]
[240.6,{"$error":"#VALUE!"},{"$error":"#VALUE!"},{"$error":"#VALUE!"},{"$error":"#VALUE!"},{"$error":"#VALUE!"},{"$error":"#VALUE!"},{"$error":"#VALUE!"},{"$error":"#VALUE!"},{"$error":"#VALUE!"}]
[240.8,{"$error":"#VALUE!"},{"$error":"#VALUE!"},{"$error":"#VALUE!"},{"$error":"#VALUE!"},{"$error":"#VALUE!"},{"$error":"#VALUE!"},{"$error":"#VALUE!"},{"$error":"#VALUE!"},{"$error":"#VALUE!"}]
[241,{"$error":"#VALUE!"},{"$error":"#VALUE!"},{"$error":"#VALUE!"},{"$error":"#VALUE!"},{"$error":"#VALUE!"},{"$error":"#VALUE!"},{"$error":"#VALUE!"},{"$error":"#VALUE!"},{"$error":"#VALUE!"}]
[241.2,{"$error":"#VALUE!"},{"$error":"#VALUE!"},{"$error":"#VALUE!"},{"$error":"#VALUE!"},{"$error":"#VALUE!"},{"$error":"#VALUE!"},{"$error":"#VALUE!"},{"$error":"#VALUE!"},{"$error":"#VALUE!"}]
[241.4,{"$error":"#VALUE!"},{"$error":"#VALUE!"},{"$error":"#VALUE!"},{"$error":"#VALUE!"},{"$error":"#VALUE!"},{"$error":"#VALUE!"},{"$error":"#VALUE!"},{"$error":"#VALUE!"},{"$error":"#VALUE!"}]
[241.6,{"$error":"#VALUE!"},{"$error":"#VALUE!"},{"$error":"#VALUE!"},{"$error":"#VALUE!"},{"$error":"#VALUE!"},{"$error":"#VALUE!"},{"$error":"#VALUE!"},{"$error":"#VALUE!"},{"$error":"#VALUE!"}]
[241.8,{"$error":"#VALUE!"},{"$error":"#VALUE!"},{"$error":"#VALUE!"},{"$error":"#VALUE!"},{"$error":"#VALUE!"},{"$error":"#VALUE!"},{"$error":"#VALUE!"},{"$error":"#VALUE!"},{"$error":"#VALUE!"}]
[242,{"$error":"#VALUE!"},{"$error":"#VALUE!"},{"$error":"#VALUE!"},{"$error":"#VALUE!"},{"$error":"#VALUE!"},{"$error":"#VALUE!"},{"$error":"#VALUE!"},{"$error":"#VALUE!"},{"$error":"#VALUE!"}]
[242.2,{"$error":"#VALUE!"},{"$error":"#VALUE!"},{"$error":"#VALUE!"},{"$error":"#VALUE!"},{"$error":"#VALUE!"},{"$error":"#VALUE!"},{"$error":"#VALUE!"},{"$error":"#VALUE!"},{"$error":"#VALUE!"}]
[242.4,{"$error":"#VALUE!"},{"$error":"#VALUE!"},{"$error":"#VALUE!"},{"$error":"#VALUE!"},{"$error":"#VALUE!"},{"$error":"#VALUE!"},{"$error":"#VALUE!"},{"$error":"#VALUE!"},{"$error":"#VALUE!"}]
[242.6,{"$error":"#VALUE!"},{"$error":"#VALUE!"},{"$error":"#VALUE!"},{"$error":"#VALUE!"},{"$error":"#VALUE!"},{"$error":"#VALUE!"},{"$error":"#VALUE!"},{"$error":"#VALUE!"},{"$error":"#VALUE!"}]
[242.8,{"$error":"#VALUE!"},{"$error":"#VALUE!"},{"$error":"#VALUE!"},{"$error":"#VALUE!"},{"$error":"#VALUE!"},{"$error":"#VALUE!"},{"$error":"#VALUE!"},{"$error":"#VALUE!"},{"$error":"#VALUE!"}]
[243,{"$error":"#VALUE!"},{"$error":"#VALUE!"},{"$error":"#VALUE!"},{"$error":"#VALUE!"},{"$error":"#VALUE!"},{"$error":"#VALUE!"},{"$error":"#VALUE!"},{"$error":"#VALUE!"},{"$error":"#VALUE!"}]
[243.2,{"$error":"#VALUE!"},{"$f":"IF(AND($C$5>=A1236,A1236>=$B$5),($D$5^2-(A1236-$E$5)^2)^0.5,0)","v":{"$error":"#VALUE!"}},{"$f":"IF(AND($C$6>=A1236,A1236>=$B$6),($D$6^2-(A1236-$E$6)^2)^0.5,0)","v":{"$error":"#VALUE!"}},{"$f":"IF(AND($C$7>=A1236,A1236>$B$7),($D$7^2-(A1236-$E$7)^2)^0.5,0)","v":{"$error":"#VALUE!"}},{"$f":"IF(AND($C$8>=A1236,A1236>=$B$8),($D$8^2-(A1236-$E$8)^2)^0.5,0)","v":{"$error":"#VALUE!"}},{"$f":"IF(AND($C$9>=A1236,A1236>=$B$9),($D$9^2-(A1236-$E$9)^2)^0.5,0)","v":{"$error":"#VALUE!"}},{"$f":"IF(AND($C$10>=A1236,A1236>=$B$10),($D$10^2-(A1236-$E$10)^2)^0.5,0)","v":{"$error":"#VALUE!"}},{"$f":"IF(AND($C$11>=A1236,A1236>=$B$11),($D$11^2-(A1236-$E$11)^2)^0.5,0)","v":{"$error":"#VALUE!"}},{"$error":"#VALUE!"}]
[243.4,{"$f":"$G$15*A1237+$G$16","v":{"$error":"#VALUE!"}},{"$error":"#VALUE!"},{"$error":"#VALUE!"},{"$error":"#VALUE!"},{"$error":"#VALUE!"},{"$error":"#VALUE!"},{"$error":"#VALUE!"},{"$error":"#VALUE!"},{"$f":"IF(AND($C$12>=A1237,A1237>=$B$12),($D$12^2-(A1237-$E$12)^2)^0.5,0)","v":{"$error":"#VALUE!"}}]
[{"$f":"A1237+0.2","v":243.6},{"$error":"#VALUE!"},{"$error":"#VALUE!"},{"$error":"#VALUE!"},{"$error":"#VALUE!"},{"$error":"#VALUE!"},{"$error":"#VALUE!"},{"$error":"#VALUE!"},{"$error":"#VALUE!"},{"$error":"#VALUE!"}]
[243.8,{"$error":"#VALUE!"},{"$error":"#VALUE!"},{"$error":"#VALUE!"},{"$error":"#VALUE!"},{"$error":"#VALUE!"},{"$error":"#VALUE!"},{"$error":"#VALUE!"},{"$error":"#VALUE!"},{"$error":"#VALUE!"}]
[244,{"$error":"#VALUE!"},{"$error":"#VALUE!"},{"$error":"#VALUE!"},{"$error":"#VALUE!"},{"$error":"#VALUE!"},{"$error":"#VALUE!"},{"$error":"#VALUE!"},{"$error":"#VALUE!"},{"$error":"#VALUE!"}]
[244.2,{"$error":"#VALUE!"},{"$error":"#VALUE!"},{"$error":"#VALUE!"},{"$error":"#VALUE!"},{"$error":"#VALUE!"},{"$error":"#VALUE!"},{"$error":"#VALUE!"},{"$error":"#VALUE!"},{"$error":"#VALUE!"}]
[244.4,{"$error":"#VALUE!"},{"$error":"#VALUE!"},{"$error":"#VALUE!"},{"$error":"#VALUE!"},{"$error":"#VALUE!"},{"$error":"#VALUE!"},{"$error":"#VALUE!"},{"$error":"#VALUE!"},{"$error":"#VALUE!"}]
[244.6,{"$error":"#VALUE!"},{"$error":"#VALUE!"},{"$error":"#VALUE!"},{"$error":"#VALUE!"},{"$error":"#VALUE!"},{"$error":"#VALUE!"},{"$error":"#VALUE!"},{"$error":"#VALUE!"},{"$error":"#VALUE!"}]
[244.8,{"$error":"#VALUE!"},{"$error":"#VALUE!"},{"$error":"#VALUE!"},{"$error":"#VALUE!"},{"$error":"#VALUE!"},{"$error":"#VALUE!"},{"$error":"#VALUE!"},{"$error":"#VALUE!"},{"$error":"#VALUE!"}]
[245,{"$error":"#VALUE!"},{"$error":"#VALUE!"},{"$error":"#VALUE!"},{"$error":"#VALUE!"},{"$error":"#VALUE!"},{"$error":"#VALUE!"},{"$error":"#VALUE!"},{"$error":"#VALUE!"},{"$error":"#VALUE!"}]
[245.2,{"$error":"#VALUE!"},{"$error":"#VALUE!"},{"$error":"#VALUE!"},{"$error":"#VALUE!"},{"$error":"#VALUE!"},{"$error":"#VALUE!"},{"$error":"#VALUE!"},{"$error":"#VALUE!"},{"$error":"#VALUE!"}]
[245.4,{"$error":"#VALUE!"},{"$error":"#VALUE!"},{"$error":"#VALUE!"},{"$error":"#VALUE!"},{"$error":"#VALUE!"},{"$error":"#VALUE!"},{"$error":"#VALUE!"},{"$error":"#VALUE!"},{"$error":"#VALUE!"}]
[245.6,{"$error":"#VALUE!"},{"$error":"#VALUE!"},{"$error":"#VALUE!"},{"$error":"#VALUE!"},{"$error":"#VALUE!"},{"$error":"#VALUE!"},{"$error":"#VALUE!"},{"$error":"#VALUE!"},{"$error":"#VALUE!"}]
[245.8,{"$error":"#VALUE!"},{"$error":"#VALUE!"},{"$error":"#VALUE!"},{"$error":"#VALUE!"},{"$error":"#VALUE!"},{"$error":"#VALUE!"},{"$error":"#VALUE!"},{"$error":"#VALUE!"},{"$error":"#VALUE!"}]
[246,{"$error":"#VALUE!"},{"$error":"#VALUE!"},{"$error":"#VALUE!"},{"$error":"#VALUE!"},{"$error":"#VALUE!"},{"$error":"#VALUE!"},{"$error":"#VALUE!"},{"$error":"#VALUE!"},{"$error":"#VALUE!"}]
[246.2,{"$error":"#VALUE!"},{"$error":"#VALUE!"},{"$error":"#VALUE!"},{"$error":"#VALUE!"},{"$error":"#VALUE!"},{"$error":"#VALUE!"},{"$error":"#VALUE!"},{"$error":"#VALUE!"},{"$error":"#VALUE!"}]
[246.4,{"$error":"#VALUE!"},{"$error":"#VALUE!"},{"$error":"#VALUE!"},{"$error":"#VALUE!"},{"$error":"#VALUE!"},{"$error":"#VALUE!"},{"$error":"#VALUE!"},{"$error":"#VALUE!"},{"$error":"#VALUE!"}]
[246.6,{"$error":"#VALUE!"},{"$error":"#VALUE!"},{"$error":"#VALUE!"},{"$error":"#VALUE!"},{"$error":"#VALUE!"},{"$error":"#VALUE!"},{"$error":"#VALUE!"},{"$error":"#VALUE!"},{"$error":"#VALUE!"}]
[246.8,{"$error":"#VALUE!"},{"$error":"#VALUE!"},{"$error":"#VALUE!"},{"$error":"#VALUE!"},{"$error":"#VALUE!"},{"$error":"#VALUE!"},{"$error":"#VALUE!"},{"$error":"#VALUE!"},{"$error":"#VALUE!"}]
[247,{"$error":"#VALUE!"},{"$error":"#VALUE!"},{"$error":"#VALUE!"},{"$error":"#VALUE!"},{"$error":"#VALUE!"},{"$error":"#VALUE!"},{"$error":"#VALUE!"},{"$error":"#VALUE!"},{"$error":"#VALUE!"}]
[247.2,{"$error":"#VALUE!"},{"$error":"#VALUE!"},{"$error":"#VALUE!"},{"$error":"#VALUE!"},{"$error":"#VALUE!"},{"$error":"#VALUE!"},{"$error":"#VALUE!"},{"$error":"#VALUE!"},{"$error":"#VALUE!"}]
[247.4,{"$error":"#VALUE!"},{"$error":"#VALUE!"},{"$error":"#VALUE!"},{"$error":"#VALUE!"},{"$error":"#VALUE!"},{"$error":"#VALUE!"},{"$error":"#VALUE!"},{"$error":"#VALUE!"},{"$error":"#VALUE!"}]
[247.6,{"$error":"#VALUE!"},{"$error":"#VALUE!"},{"$error":"#VALUE!"},{"$error":"#VALUE!"},{"$error":"#VALUE!"},{"$error":"#VALUE!"},{"$error":"#VALUE!"},{"$error":"#VALUE!"},{"$error":"#VALUE!"}]
[247.8,{"$error":"#VALUE!"},{"$error":"#VALUE!"},{"$error":"#VALUE!"},{"$error":"#VALUE!"},{"$error":"#VALUE!"},{"$error":"#VALUE!"},{"$error":"#VALUE!"},{"$error":"#VALUE!"},{"$error":"#VALUE!"}]
[248,{"$error":"#VALUE!"},{"$error":"#VALUE!"},{"$error":"#VALUE!"},{"$error":"#VALUE!"},{"$error":"#VALUE!"},{"$error":"#VALUE!"},{"$error":"#VALUE!"},{"$error":"#VALUE!"},{"$error":"#VALUE!"}]
[248.2,{"$error":"#VALUE!"},{"$error":"#VALUE!"},{"$error":"#VALUE!"},{"$error":"#VALUE!"},{"$error":"#VALUE!"},{"$error":"#VALUE!"},{"$error":"#VALUE!"},{"$error":"#VALUE!"},{"$error":"#VALUE!"}]
[248.4,{"$error":"#VALUE!"},{"$error":"#VALUE!"},{"$error":"#VALUE!"},{"$error":"#VALUE!"},{"$error":"#VALUE!"},{"$error":"#VALUE!"},{"$error":"#VALUE!"},{"$error":"#VALUE!"},{"$error":"#VALUE!"}]
[248.6,{"$error":"#VALUE!"},{"$error":"#VALUE!"},{"$error":"#VALUE!"},{"$error":"#VALUE!"},{"$error":"#VALUE!"},{"$error":"#VALUE!"},{"$error":"#VALUE!"},{"$error":"#VALUE!"},{"$error":"#VALUE!"}]
[248.8,{"$error":"#VALUE!"},{"$error":"#VALUE!"},{"$error":"#VALUE!"},{"$error":"#VALUE!"},{"$error":"#VALUE!"},{"$error":"#VALUE!"},{"$error":"#VALUE!"},{"$error":"#VALUE!"},{"$error":"#VALUE!"}]
[249,{"$error":"#VALUE!"},{"$error":"#VALUE!"},{"$error":"#VALUE!"},{"$error":"#VALUE!"},{"$error":"#VALUE!"},{"$error":"#VALUE!"},{"$error":"#VALUE!"},{"$error":"#VALUE!"},{"$error":"#VALUE!"}]
[249.2,{"$error":"#VALUE!"},{"$error":"#VALUE!"},{"$error":"#VALUE!"},{"$error":"#VALUE!"},{"$error":"#VALUE!"},{"$error":"#VALUE!"},{"$error":"#VALUE!"},{"$error":"#VALUE!"},{"$error":"#VALUE!"}]
[249.4,{"$error":"#VALUE!"},{"$error":"#VALUE!"},{"$error":"#VALUE!"},{"$error":"#VALUE!"},{"$error":"#VALUE!"},{"$error":"#VALUE!"},{"$error":"#VALUE!"},{"$error":"#VALUE!"},{"$error":"#VALUE!"}]
[249.6,{"$error":"#VALUE!"},{"$f":"IF(AND($C$5>=A1268,A1268>=$B$5),($D$5^2-(A1268-$E$5)^2)^0.5,0)","v":{"$error":"#VALUE!"}},{"$f":"IF(AND($C$6>=A1268,A1268>=$B$6),($D$6^2-(A1268-$E$6)^2)^0.5,0)","v":{"$error":"#VALUE!"}},{"$f":"IF(AND($C$7>=A1268,A1268>$B$7),($D$7^2-(A1268-$E$7)^2)^0.5,0)","v":{"$error":"#VALUE!"}},{"$f":"IF(AND($C$8>=A1268,A1268>=$B$8),($D$8^2-(A1268-$E$8)^2)^0.5,0)","v":{"$error":"#VALUE!"}},{"$f":"IF(AND($C$9>=A1268,A1268>=$B$9),($D$9^2-(A1268-$E$9)^2)^0.5,0)","v":{"$error":"#VALUE!"}},{"$f":"IF(AND($C$10>=A1268,A1268>=$B$10),($D$10^2-(A1268-$E$10)^2)^0.5,0)","v":{"$error":"#VALUE!"}},{"$f":"IF(AND($C$11>=A1268,A1268>=$B$11),($D$11^2-(A1268-$E$11)^2)^0.5,0)","v":{"$error":"#VALUE!"}},{"$error":"#VALUE!"}]
[249.8,{"$f":"$G$15*A1269+$G$16","v":{"$error":"#VALUE!"}},{"$f":"IF(AND($C$5>=A1269,A1269>=$B$5),($D$5^2-(A1269-$E$5)^2)^0.5,0)","v":{"$error":"#VALUE!"}},{"$f":"IF(AND($C$6>=A1269,A1269>=$B$6),($D$6^2-(A1269-$E$6)^2)^0.5,0)","v":{"$error":"#VALUE!"}},{"$f":"IF(AND($C$7>=A1269,A1269>$B$7),($D$7^2-(A1269-$E$7)^2)^0.5,0)","v":{"$error":"#VALUE!"}},{"$f":"IF(AND($C$8>=A1269,A1269>=$B$8),($D$8^2-(A1269-$E$8)^2)^0.5,0)","v":{"$error":"#VALUE!"}},{"$f":"IF(AND($C$9>=A1269,A1269>=$B$9),($D$9^2-(A1269-$E$9)^2)^0.5,0)","v":{"$error":"#VALUE!"}},{"$f":"IF(AND($C$10>=A1269,A1269>=$B$10),($D$10^2-(A1269-$E$10)^2)^0.5,0)","v":{"$error":"#VALUE!"}},{"$f":"IF(AND($C$11>=A1269,A1269>=$B$11),($D$11^2-(A1269-$E$11)^2)^0.5,0)","v":{"$error":"#VALUE!"}},{"$error":"#VALUE!"}]
[{"$f":"A1269+0.2","v":250},{"$f":"$G$15*A1270+$G$16","v":{"$error":"#VALUE!"}},{"$f":"IF(AND($C$5>=A1270,A1270>=$B$5),($D$5^2-(A1270-$E$5)^2)^0.5,0)","v":{"$error":"#VALUE!"}},{"$f":"IF(AND($C$6>=A1270,A1270>=$B$6),($D$6^2-(A1270-$E$6)^2)^0.5,0)","v":{"$error":"#VALUE!"}},{"$f":"IF(AND($C$7>=A1270,A1270>$B$7),($D$7^2-(A1270-$E$7)^2)^0.5,0)","v":{"$error":"#VALUE!"}},{"$f":"IF(AND($C$8>=A1270,A1270>=$B$8),($D$8^2-(A1270-$E$8)^2)^0.5,0)","v":{"$error":"#VALUE!"}},{"$f":"IF(AND($C$9>=A1270,A1270>=$B$9),($D$9^2-(A1270-$E$9)^2)^0.5,0)","v":{"$error":"#VALUE!"}},{"$f":"IF(AND($C$10>=A1270,A1270>=$B$10),($D$10^2-(A1270-$E$10)^2)^0.5,0)","v":{"$error":"#VALUE!"}},{"$f":"IF(AND($C$11>=A1270,A1270>=$B$11),($D$11^2-(A1270-$E$11)^2)^0.5,0)","v":{"$error":"#VALUE!"}},{"$error":"#VALUE!"}]

{"sheet":"Classification","index":14,"n_rows":147,"n_cols":9,"rows_kept":147,"cut":false,"hidden":false,"merged":[]}
[null,"        Classification Analysis"]
[]
["Regression for Triaxial Classification Curve"]
[]
[null,"Y","X","X^2",null,6,7,8]
[1,{"$f":"'Mohr Analysis'!G5","v":{"$error":"#VALUE!"}},{"$f":"'Mohr Analysis'!F5","v":{"$error":"#VALUE!"}},{"$f":"C6^2","v":{"$error":"#VALUE!"}},"A0",{"$f":"IF(AND(B11>0,B12=0),INDEX(LINEST(B6:B11,C6:D11),3),0)","v":{"$error":"#VALUE!"}},{"$f":"IF(AND(B12>0,B13=0),INDEX(LINEST(B6:B12,C6:D12),3),0)","v":{"$error":"#VALUE!"}},{"$f":"IF(B13>0,INDEX(LINEST(B6:B13,C6:D13),3),0)","v":{"$error":"#VALUE!"}},{"$f":"SUM(F6:H6)","v":{"$error":"#VALUE!"}}]
[2,{"$f":"'Mohr Analysis'!G6","v":{"$error":"#VALUE!"}},{"$f":"'Mohr Analysis'!F6","v":{"$error":"#VALUE!"}},{"$f":"C7^2","v":{"$error":"#VALUE!"}}]
[3,{"$f":"'Mohr Analysis'!G7","v":{"$error":"#VALUE!"}},{"$f":"'Mohr Analysis'!F7","v":{"$error":"#VALUE!"}},{"$error":"#VALUE!"},"A1",{"$f":"IF(AND(B11>0,B12=0),INDEX(LINEST(B6:B11,C6:D11),2),0)","v":{"$error":"#VALUE!"}},{"$f":"IF(AND(B12>0,B13=0),INDEX(LINEST(B6:B12,C6:D12),2),0)","v":{"$error":"#VALUE!"}},{"$f":"IF(B13>0,INDEX(LINEST(B6:B13,C6:D13),2),0)","v":{"$error":"#VALUE!"}},{"$f":"SUM(F8:H8)","v":{"$error":"#VALUE!"}}]
[4,{"$f":"'Mohr Analysis'!G8","v":{"$error":"#VALUE!"}},{"$f":"'Mohr Analysis'!F8","v":{"$error":"#VALUE!"}},{"$error":"#VALUE!"}]
[5,{"$f":"'Mohr Analysis'!G9","v":{"$error":"#VALUE!"}},{"$f":"'Mohr Analysis'!F9","v":{"$error":"#VALUE!"}},{"$error":"#VALUE!"},"A2",{"$f":"IF(AND(B11>0,B12=0),INDEX(LINEST(B6:B11,C6:D11),1),0)","v":{"$error":"#VALUE!"}},{"$f":"IF(AND(B12>0,B13=0),INDEX(LINEST(B6:B12,C6:D12),1),0)","v":{"$error":"#VALUE!"}},{"$f":"IF(B13>0,INDEX(LINEST(B6:B13,C6:D13),1),0)","v":{"$error":"#VALUE!"}},{"$f":"SUM(F10:H10)","v":{"$error":"#VALUE!"}}]
[6,{"$f":"'Mohr Analysis'!G10","v":{"$error":"#VALUE!"}},{"$f":"'Mohr Analysis'!F10","v":{"$error":"#VALUE!"}},{"$error":"#VALUE!"}]
[7,{"$f":"'Mohr Analysis'!G11","v":{"$error":"#VALUE!"}},{"$f":"'Mohr Analysis'!F11","v":{"$error":"#VALUE!"}},{"$error":"#VALUE!"}]
[8,{"$f":"'Mohr Analysis'!G12","v":{"$error":"#VALUE!"}},{"$f":"'Mohr Analysis'!F12","v":{"$error":"#VALUE!"}},{"$error":"#VALUE!"}]
[]
["Lat. Pressure",3,5,10,15,20,25]
["<2",{"$f":"IF(AND($B$27>$C$27,$B$37>$C$37,$B$62>$C$62,$B$87>$C$87),1,0)","v":{"$error":"#VALUE!"}},{"$f":"IF($B$22=1,1,0)","v":{"$error":"#VALUE!"}},{"$f":"IF($B$22=1,1,0)","v":{"$error":"#VALUE!"}},{"$f":"IF($B$22=1,1,0)","v":{"$error":"#VALUE!"}},{"$f":"IF($B$22=1,1,0)","v":{"$error":"#VALUE!"}},{"$f":"IF($B$22=1,1,0)","v":{"$error":"#VALUE!"}}]
["2-3",{"$f":"IF(OR(AND($C$27>=$B$27,$B$27>=$D$27),AND($C$62>=$B$62,$B$62>=$D$62),AND($C$87>=$B$87,$B$87>=$D$87)),2,0)","v":{"$error":"#VALUE!"}},{"$f":"IF($B$22=2,((($B37-$C37)/($D37-$C37))*(($B$17+1)-$B$17)+$B$17),0)","v":{"$error":"#VALUE!"}},{"$f":"IF($B$22=2,((($B62-$C62)/($D62-$C62))*(($B$17+1)-$B$17)+$B$17),0)","v":{"$error":"#VALUE!"}},{"$f":"IF($B$22=2,((($B87-$C87)/($D87-$C87))*(($B$17+1)-$B$17)+$B$17),0)","v":{"$error":"#VALUE!"}},{"$f":"IF($B$22=2,((($B112-$C112)/($D112-$C112))*(($B$17+1)-$B$17)+$B$17),0)","v":{"$error":"#VALUE!"}},{"$f":"IF($B$22=2,((($B137-$C137)/($D137-$C137))*(($B$17+1)-$B$17)+$B$17),0)","v":{"$error":"#VALUE!"}}]
["3-4",{"$f":"IF(OR(AND($D$62>=$B$62,$B$62>$E$62),AND($D$27>=$B$27,$B$27>=$E$27),AND($D$87>=$B$87,$B$87>=$E$87)),3,0)","v":{"$error":"#VALUE!"}},{"$f":"IF($B$22=3,((($B37-$D37)/($E37-$D37))*(($B$18+1)-$B$18)+$B$18),0)","v":{"$error":"#VALUE!"}},{"$f":"IF($B$22=3,((($B62-$D62)/($E62-$D62))*(($B$18+1)-$B$18)+$B$18),0)","v":{"$error":"#VALUE!"}},{"$f":"IF($B$22=3,((($B87-$D87)/($E87-$D87))*(($B$18+1)-$B$18)+$B$18),0)","v":{"$error":"#VALUE!"}},{"$f":"IF($B$22=3,((($B112-$D112)/($E112-$D112))*(($B$18+1)-$B$18)+$B$18),0)","v":{"$error":"#VALUE!"}},{"$f":"IF($B$22=3,((($B137-$D137)/($E137-$D137))*(($B$18+1)-$B$18)+$B$18),0)","v":{"$error":"#VALUE!"}}]
["4-5",{"$f":"IF(OR(AND($E$62>=$B$62,$B$62>$F$62),AND($E$87>=$B$87,$B$87>=$F$87),AND($E$27>=$B$27,$B$27>=$F$27)),4,0)","v":{"$error":"#VALUE!"}},{"$f":"IF($B$22=4,((($B37-$E37)/($F37-$E37))*(($B19+1)-$B19)+$B19),0)","v":{"$error":"#VALUE!"}},{"$f":"IF($B$22=4,((($B62-$E62)/($F62-$E62))*(($B19+1)-$B19)+$B19),0)","v":{"$error":"#VALUE!"}},{"$f":"IF($B$22=4,((($B87-$E87)/($F87-$E87))*(($B19+1)-$B19)+$B19),0)","v":{"$error":"#VALUE!"}},{"$f":"IF($B$22=4,((($B112-$E112)/($F112-$E112))*(($B19+1)-$B19)+$B19),0)","v":{"$error":"#VALUE!"}},{"$f":"IF($B$22=4,((($B137-$E137)/($F137-$E137))*(($B19+1)-$B19)+$B19),0)","v":{"$error":"#VALUE!"}}]
["5-6",{"$f":"IF(OR(AND($F$62>=$B$62,$B$62>$G$62),AND($F$37>=$B$37,$B$37>=$G$37),AND($F$87>=$B$87,$B$87>$G$87)),5,0)","v":{"$error":"#VALUE!"}},{"$f":"IF($B22=5,((($B37-$F37)/($G37-$F37))*(($B20+1)-$B20)+$B20),0)","v":{"$error":"#VALUE!"}},{"$f":"IF($B22=5,((($B62-$F62)/($G62-$F62))*(($B20+1)-$B20)+$B20),0)","v":{"$error":"#VALUE!"}},{"$f":"IF($B$22=5,((($B87-$F87)/($G87-$F87))*(($B20+1)-$B20)+$B20),0)","v":{"$error":"#VALUE!"}},{"$f":"IF($B$22=5,((($B112-$F112)/($G112-$F112))*(($B20+1)-$B20)+$B20),0)","v":{"$error":"#VALUE!"}},{"$f":"IF($B$22=5,((($B137-$F137)/($G137-$F137))*(($B20+1)-$B20)+$B20),0)","v":{"$error":"#VALUE!"}}]
[">6",{"$f":"IF(AND($G$87>=$B$87,$G$112>=$B$112,$G$62>=$B$62),6,0)","v":{"$error":"#VALUE!"}},{"$f":"IF($B$22=6,6,0)","v":{"$error":"#VALUE!"}},{"$f":"IF($B$22=6,6,0)","v":{"$error":"#VALUE!"}},{"$f":"IF($B$22=6,6,0)","v":{"$error":"#VALUE!"}},{"$f":"IF($B$22=6,6,0)","v":{"$error":"#VALUE!"}},{"$f":"IF($B$22=6,6,0)","v":{"$error":"#VALUE!"}}]
[null,{"$f":"MAX(B16:B21)","v":{"$error":"#VALUE!"}},{"$f":"SUM(C16:C21)","v":{"$error":"#VALUE!"}},{"$f":"SUM(D16:D21)","v":{"$error":"#VALUE!"}},{"$f":"SUM(E16:E21)","v":{"$error":"#VALUE!"}},{"$f":"SUM(F16:F21)","v":{"$error":"#VALUE!"}},{"$f":"SUM(G16:G21)","v":{"$error":"#VALUE!"}}]
[]
["Classification",{"$f":"IF(MAX(C22:G22)<2,1,MAX(C22:G22))","v":{"$error":"#VALUE!"}}]
[]
["Normal Stress","Sample","Class 1","Class 2","Class 3","Class 4","Class 5"]
[3,{"$f":"$I$6+A27*$I$8+A27^2*$I$10","v":{"$error":"#VALUE!"}},{"$f":"0.001022*A27^3-0.06666*A27^2+2.497027*A27+4.076607","v":11},{"$f":"0.001247*A27^3-0.07441*A27^2+2.164692*A27+2.330839","v":8.1999999999999993},{"$f":"-0.000024*A27^3-0.01974*A27^2+1.317306*A27+0.119072","v":3.9},{"$f":"0.001212*A27^3-0.06968*A27^2+1.485888*A27-2.817","v":1}]
[{"$f":"A27+0.2","v":3.2},{"$f":"$I$6+A28*$I$8+A28^2*$I$10","v":{"$error":"#VALUE!"}},{"$f":"0.001022*A28^3-0.06666*A28^2+2.497027*A28+4.076607","v":11.4},{"$f":"0.001247*A28^3-0.07441*A28^2+2.164692*A28+2.330839","v":8.5},{"$f":"-0.000024*A28^3-0.01974*A28^2+1.317306*A28+0.119072","v":4.0999999999999996},{"$f":"0.001212*A28^3-0.06968*A28^2+1.485888*A28-2.817","v":1.3}]
[{"$f":"A28+0.2","v":3.4},{"$error":"#VALUE!"},11.8,8.9,4.4000000000000004,1.5]
[3.6,{"$error":"#VALUE!"},12.2,9.1999999999999993,4.5999999999999996,1.7]
[3.8,{"$error":"#VALUE!"},12.7,9.6,4.8,1.9]
[4,{"$error":"#VALUE!"},13.1,9.9,5.0999999999999996,2.1]
[4.2,{"$error":"#VALUE!"},13.5,10.199999999999999,5.3,2.2999999999999998]
[4.4000000000000004,{"$error":"#VALUE!"},13.9,10.5,5.5,2.5]
[4.5999999999999996,{"$error":"#VALUE!"},14.3,10.8,5.8,2.7]
[4.8,{"$error":"#VALUE!"},14.6,11.1,6,2.8]
[5,{"$error":"#VALUE!"},15,11.4,6.2,3]
[5.2,{"$error":"#VALUE!"},15.4,11.8,6.4,3.2]
[5.4,{"$error":"#VALUE!"},15.8,12,6.7,3.4]
[5.6,{"$error":"#VALUE!"},16.100000000000001,12.3,6.9,3.5]
[5.8,{"$error":"#VALUE!"},16.5,12.6,7.1,3.7]
[6,{"$error":"#VALUE!"},16.899999999999999,12.9,7.3,3.9]
[6.2,{"$error":"#VALUE!"},17.2,13.2,7.5,4,{"$f":"0.000933*A43^3-0.05443*A43^2+1.1017456*A43-2.71421","v":2.2000000000000002}]
[6.4,{"$error":"#VALUE!"},17.600000000000001,13.5,7.7,4.2,{"$f":"0.000933*A44^3-0.05443*A44^2+1.1017456*A44-2.71421","v":2.4}]
[6.6,{"$error":"#VALUE!"},17.899999999999999,13.7,7.9,4.3,2.5]
[6.8,{"$error":"#VALUE!"},18.3,14,8.1999999999999993,4.4000000000000004,2.6]
[7,{"$error":"#VALUE!"},18.600000000000001,14.3,8.4,4.5999999999999996,2.7]
[7.2,{"$error":"#VALUE!"},19,14.5,8.6,4.7,2.7]
[7.4,{"$error":"#VALUE!"},19.3,14.8,8.8000000000000007,4.9000000000000004,2.8]
[7.6,{"$error":"#VALUE!"},19.7,15,9,5,2.9]
[7.8,{"$error":"#VALUE!"},20,15.3,9.1999999999999993,5.0999999999999996,3]
[8,{"$error":"#VALUE!"},20.3,15.5,9.4,5.2,3.1]
[8.1999999999999993,{"$error":"#VALUE!"},20.6,15.8,9.6,5.4,3.2]
[8.4,{"$error":"#VALUE!"},21,16,9.8000000000000007,5.5,3.3]
[8.6,{"$error":"#VALUE!"},21.3,16.2,10,5.6,3.3]
[8.8000000000000007,{"$error":"#VALUE!"},21.6,16.5,10.199999999999999,5.7,3.4]
[9,{"$error":"#VALUE!"},21.9,16.7,10.4,5.8,3.5]
[9.1999999999999993,{"$error":"#VALUE!"},22.2,16.899999999999999,10.5,5.9,3.5]
[9.4,{"$error":"#VALUE!"},22.5,17.100000000000001,10.7,6,3.6]
[9.6,{"$error":"#VALUE!"},22.8,17.399999999999999,10.9,6.1,3.7]
[9.8000000000000007,{"$error":"#VALUE!"},23.1,17.600000000000001,11.1,6.2,3.7]
[10,{"$error":"#VALUE!"},23.4,17.8,11.3,6.3,3.8]
[10.199999999999999,{"$error":"#VALUE!"},23.7,18,11.5,6.4,3.9]
[10.4,{"$error":"#VALUE!"},24,18.2,11.7,6.5,3.9]
[10.6,{"$error":"#VALUE!"},24.3,18.399999999999999,11.8,6.5,4]
[10.8,{"$error":"#VALUE!"},24.6,18.600000000000001,12,6.6,4]
[11,{"$error":"#VALUE!"},24.8,18.8,12.2,6.7,4.0999999999999996]
[11.2,{"$error":"#VALUE!"},25.1,19,12.4,6.8,4.0999999999999996]
[11.4,{"$error":"#VALUE!"},25.4,19.2,12.5,6.9,4.2]
[11.6,{"$error":"#VALUE!"},25.7,19.399999999999999,12.7,6.9,4.2]
[11.8,{"$error":"#VALUE!"},25.9,19.600000000000001,12.9,7,4.2]
[12,{"$error":"#VALUE!"},26.2,19.7,13,7.1,4.3]
[12.2,{"$error":"#VALUE!"},26.5,19.899999999999999,13.2,7.1,4.3]
[12.4,{"$error":"#VALUE!"},26.7,20.100000000000001,13.4,7.2,4.4000000000000004]
[12.6,{"$error":"#VALUE!"},27,20.3,13.5,7.3,4.4000000000000004]
[12.8,{"$error":"#VALUE!"},27.3,20.5,13.7,7.3,4.4000000000000004]
[13,{"$error":"#VALUE!"},27.5,20.6,13.9,7.4,4.5]
[13.2,{"$error":"#VALUE!"},27.8,20.8,14,7.4,4.5]
[13.4,{"$error":"#VALUE!"},28,21,14.2,7.5,4.5]
[13.6,{"$error":"#VALUE!"},28.3,21.1,14.3,7.6,4.5]
[13.8,{"$error":"#VALUE!"},28.5,21.3,14.5,7.6,4.5999999999999996]
[14,{"$error":"#VALUE!"},28.8,21.5,14.6,7.7,4.5999999999999996]
[14.2,{"$error":"#VALUE!"},29,21.6,14.8,7.7,4.5999999999999996]
[14.4,{"$error":"#VALUE!"},29.3,21.8,14.9,7.7,4.7]
[14.6,{"$error":"#VALUE!"},29.5,22,15.1,7.8,4.7]
[14.8,{"$error":"#VALUE!"},29.7,22.1,15.2,7.8,4.7]
[15,{"$error":"#VALUE!"},30,22.3,15.4,7.9,4.7]
[15.2,{"$error":"#VALUE!"},30.2,22.4,15.5,7.9,4.7]
[15.4,{"$error":"#VALUE!"},30.5,22.6,15.6,8,4.8]
[15.6,{"$error":"#VALUE!"},30.7,22.7,15.8,8,4.8]
[15.8,{"$error":"#VALUE!"},30.9,22.9,15.9,8,4.8]
[16,{"$f":"$I$6+A92*$I$8+A92^2*$I$10","v":{"$error":"#VALUE!"}},{"$f":"0.001022*A92^3-0.06666*A92^2+2.497027*A92+4.076607","v":31.2},{"$f":"0.001247*A92^3-0.07441*A92^2+2.164692*A92+2.330839","v":23},{"$f":"-0.000024*A92^3-0.01974*A92^2+1.317306*A92+0.119072","v":16},{"$f":"0.001212*A92^3-0.06968*A92^2+1.485888*A92-2.817","v":8.1},4.8]
[{"$f":"A92+0.2","v":16.2},{"$error":"#VALUE!"},31.4,23.2,16.2,8.1,4.8]
[16.399999999999999,{"$error":"#VALUE!"},31.6,23.3,16.3,8.1999999999999993,4.8]
[16.600000000000001,{"$error":"#VALUE!"},31.8,23.5,16.399999999999999,8.1999999999999993,4.8]
[16.8,{"$error":"#VALUE!"},32.1,23.6,16.600000000000001,8.1999999999999993,4.9000000000000004]
[17,{"$error":"#VALUE!"},32.299999999999997,23.8,16.7,8.3000000000000007,4.9000000000000004]
[17.2,{"$error":"#VALUE!"},32.5,23.9,16.8,8.3000000000000007,4.9000000000000004]
[17.399999999999999,{"$error":"#VALUE!"},32.700000000000003,24,16.899999999999999,8.3000000000000007,4.9000000000000004]
[17.600000000000001,{"$error":"#VALUE!"},32.9,24.2,17.100000000000001,8.4,4.9000000000000004]
[17.8,{"$error":"#VALUE!"},33.200000000000003,24.3,17.2,8.4,4.9000000000000004]
[18,{"$error":"#VALUE!"},33.4,24.5,17.3,8.4,4.9000000000000004]
[18.2,{"$error":"#VALUE!"},33.6,24.6,17.399999999999999,8.5,4.9000000000000004]
[18.399999999999999,{"$error":"#VALUE!"},33.799999999999997,24.7,17.5,8.5,4.9000000000000004]
[18.600000000000001,{"$error":"#VALUE!"},34,24.9,17.600000000000001,8.5,5]
[18.8,{"$error":"#VALUE!"},34.299999999999997,25,17.7,8.5,5]
[19,{"$error":"#VALUE!"},34.5,25.2,17.899999999999999,8.6,5]
[19.2,{"$error":"#VALUE!"},34.700000000000003,25.3,18,8.6,{"$f":"0.000933*A108^3-0.05443*A108^2+1.1017456*A108-2.71421","v":5}]
[19.399999999999999,{"$error":"#VALUE!"},34.9,25.4,18.100000000000001,8.6,5]
[19.600000000000001,{"$error":"#VALUE!"},35.1,25.6,18.2,8.6999999999999993,5]
[19.8,{"$error":"#VALUE!"},35.299999999999997,25.7,18.3,8.6999999999999993,5]
[20,{"$error":"#VALUE!"},35.5,25.8,18.399999999999999,8.6999999999999993,5]
[20.2,{"$error":"#VALUE!"},35.700000000000003,26,18.5,8.8000000000000007,5]
[20.399999999999999,{"$error":"#VALUE!"},36,26.1,18.600000000000001,8.8000000000000007,5]
[20.6,{"$error":"#VALUE!"},36.200000000000003,26.2,18.7,8.8000000000000007,5]
[20.8,{"$error":"#VALUE!"},36.4,26.4,18.8,8.8000000000000007,5]
[21,{"$error":"#VALUE!"},36.6,26.5,18.899999999999999,8.9,5.0999999999999996]
[21.2,{"$error":"#VALUE!"},36.799999999999997,26.7,18.899999999999999,8.9,5.0999999999999996]
[21.4,{"$error":"#VALUE!"},37,26.8,19,8.9,5.0999999999999996]
[21.6,{"$error":"#VALUE!"},37.200000000000003,26.9,19.100000000000001,9,5.0999999999999996]
[21.8,{"$error":"#VALUE!"},37.4,27.1,19.2,9,5.0999999999999996]
[22,{"$error":"#VALUE!"},37.6,27.2,19.3,9.1,5.0999999999999996]
[22.2,{"$error":"#VALUE!"},37.799999999999997,27.4,19.399999999999999,9.1,5.0999999999999996]
[22.4,{"$error":"#VALUE!"},38,27.5,19.5,9.1,5.0999999999999996]
[22.6,{"$error":"#VALUE!"},38.299999999999997,27.6,19.5,9.1999999999999993,5.2]
[22.8,{"$error":"#VALUE!"},38.5,27.8,19.600000000000001,9.1999999999999993,5.2]
[23,{"$error":"#VALUE!"},38.700000000000003,27.9,19.7,9.1999999999999993,5.2]
[23.2,{"$error":"#VALUE!"},38.9,28.1,19.8,9.3000000000000007,5.2]
[23.4,{"$error":"#VALUE!"},39.1,28.2,19.8,9.3000000000000007,5.2]
[23.6,{"$error":"#VALUE!"},39.299999999999997,28.4,19.899999999999999,9.4,5.2]
[23.8,{"$error":"#VALUE!"},39.5,28.5,20,9.4,5.3]
[24,{"$error":"#VALUE!"},39.700000000000003,28.7,20,9.5,5.3]
[24.2,{"$error":"#VALUE!"},40,28.8,20.100000000000001,9.5,5.3]
[24.4,{"$error":"#VALUE!"},40.200000000000003,29,20.2,9.6,5.3]
[24.6,{"$error":"#VALUE!"},40.4,29.1,20.2,9.6,5.3]
[24.8,{"$error":"#VALUE!"},40.6,29.3,20.3,9.6999999999999993,5.4]
[25,{"$error":"#VALUE!"},40.799999999999997,29.4,20.3,9.6999999999999993,5.4]
[25.2,{"$error":"#VALUE!"},41,29.6,20.399999999999999,9.8000000000000007,5.4]
[25.4,{"$error":"#VALUE!"},41.2,29.7,20.399999999999999,9.8000000000000007,5.4]
[25.6,{"$error":"#VALUE!"},41.5,29.9,20.5,9.9,5.5]
[25.8,{"$error":"#VALUE!"},41.7,30.1,20.6,10,5.5]
[26,{"$error":"#VALUE!"},41.9,30.2,20.6,10,5.5]
[26.2,{"$error":"#VALUE!"},42.1,30.4,20.7,10.1,5.6]
[26.4,{"$error":"#VALUE!"},42.3,30.6,20.7,10.1,5.6]
[26.6,{"$error":"#VALUE!"},42.6,30.7,20.7,10.199999999999999,5.6]
[26.8,{"$error":"#VALUE!"},42.8,30.9,20.8,10.3,5.7]
[27,{"$error":"#VALUE!"},43,31.1,20.8,10.4,5.7]

{"sheet":"RX","index":16,"n_rows":304,"n_cols":9,"rows_kept":304,"cut":false,"hidden":true,"merged":[]}
[302,null,{"$f":"+SampleId","v":0},{"$f":"+TestNumber","v":0}]
["Fld_nbr","Value","Desc_1","Desc_2","Desc_3","Desc_4","Desc_5","Desc_6","Desc_7"]
[1,{"$f":"IF(Worksheet!$B$57=\"\",\"\",Worksheet!$B$57)","v":""},{"$f":"Worksheet!$B$56","v":"Remarks:"}]
[2,{"$f":"IF(Worksheet!$D$19=\"\",\"\",Worksheet!$D$19)","v":""},{"$f":"IF(Worksheet!$C$19=\"\",\"\",Worksheet!$C$19)","v":"COURSE\\LIFT:"}]
[3,{"$f":"IF(Worksheet!$C$66=\"\",\"\",Worksheet!$C$66)","v":""},"Tested By ",{"$f":"IF(Worksheet!$B$66=\"\",\"\",Worksheet!$B$66)","v":"TX117"}]
[4,{"$f":"IF(Worksheet!$F$66=\"\",\"\",Worksheet!$F$66)","v":""},"Tested Date ",{"$f":"IF(Worksheet!$B$66=\"\",\"\",Worksheet!$B$66)","v":"TX117"}]
[5,{"$f":"IF('Tex-113,4-E'!$C$59=\"\",\"\",'Tex-113,4-E'!$C$59)","v":""},"Tested By ",{"$f":"IF('Tex-113,4-E'!$B$59=\"\",\"\",'Tex-113,4-E'!$B$59)","v":"TX113"}]
[6,{"$f":"IF('Tex-113,4-E'!$F$59=\"\",\"\",'Tex-113,4-E'!$F$59)","v":""},"Tested Date ",{"$f":"IF('Tex-113,4-E'!$B$59=\"\",\"\",'Tex-113,4-E'!$B$59)","v":"TX113"}]
[7,{"$f":"IF('Tex-113,4-E'!$C$61=\"\",\"\",'Tex-113,4-E'!$C$61)","v":""},"Tested By ",{"$f":"IF('Tex-113,4-E'!$B$61=\"\",\"\",'Tex-113,4-E'!$B$61)","v":"TX114"}]
[8,{"$f":"IF('Tex-113,4-E'!$F$61=\"\",\"\",'Tex-113,4-E'!$F$61)","v":""},"Tested Date ",{"$f":"IF('Tex-113,4-E'!$B$61=\"\",\"\",'Tex-113,4-E'!$B$61)","v":"TX114"}]
[9,{"$f":"IF(Worksheet!$D$25=\"\",\"\",Worksheet!$D$25)","v":""},{"$f":"IF(Worksheet!$B$21=\"\",\"\",Worksheet!$B$21)","v":"Performed By Tex-117-E:"},{"$f":"IF(Worksheet!$B$25=\"\",\"\",Worksheet!$B$25)","v":"Initial Height of Specimen, in.:"},{"$f":"IF(Worksheet!$D$24=\"\",\"\",Worksheet!$D$24)","v":1}]
[10,{"$f":"IF(Worksheet!$E$25=\"\",\"\",Worksheet!$E$25)","v":""},{"$f":"IF(Worksheet!$B$21=\"\",\"\",Worksheet!$B$21)","v":"Performed By Tex-117-E:"},{"$f":"IF(Worksheet!$B$25=\"\",\"\",Worksheet!$B$25)","v":"Initial Height of Specimen, in.:"},{"$f":"IF(Worksheet!$E$24=\"\",\"\",Worksheet!$E$24)","v":2}]
[11,{"$f":"IF(Worksheet!$F$25=\"\",\"\",Worksheet!$F$25)","v":""},{"$f":"IF(Worksheet!$B$21=\"\",\"\",Worksheet!$B$21)","v":"Performed By Tex-117-E:"},{"$f":"IF(Worksheet!$B$25=\"\",\"\",Worksheet!$B$25)","v":"Initial Height of Specimen, in.:"},{"$f":"IF(Worksheet!$F$24=\"\",\"\",Worksheet!$F$24)","v":3}]
[12,{"$f":"IF(Worksheet!$G$25=\"\",\"\",Worksheet!$G$25)","v":""},{"$f":"IF(Worksheet!$B$21=\"\",\"\",Worksheet!$B$21)","v":"Performed By Tex-117-E:"},{"$f":"IF(Worksheet!$B$25=\"\",\"\",Worksheet!$B$25)","v":"Initial Height of Specimen, in.:"},{"$f":"IF(Worksheet!$G$24=\"\",\"\",Worksheet!$G$24)","v":4}]
[13,{"$f":"IF(Worksheet!$H$25=\"\",\"\",Worksheet!$H$25)","v":""},{"$f":"IF(Worksheet!$B$21=\"\",\"\",Worksheet!$B$21)","v":"Performed By Tex-117-E:"},{"$f":"IF(Worksheet!$B$25=\"\",\"\",Worksheet!$B$25)","v":"Initial Height of Specimen, in.:"},{"$f":"IF(Worksheet!$H$24=\"\",\"\",Worksheet!$H$24)","v":5}]
[14,{"$f":"IF(Worksheet!$I$25=\"\",\"\",Worksheet!$I$25)","v":""},{"$f":"IF(Worksheet!$B$21=\"\",\"\",Worksheet!$B$21)","v":"Performed By Tex-117-E:"},{"$f":"IF(Worksheet!$B$25=\"\",\"\",Worksheet!$B$25)","v":"Initial Height of Specimen, in.:"},{"$f":"IF(Worksheet!$I$24=\"\",\"\",Worksheet!$I$24)","v":6}]
[15,{"$f":"IF(Worksheet!$J$25=\"\",\"\",Worksheet!$J$25)","v":""},{"$f":"IF(Worksheet!$B$21=\"\",\"\",Worksheet!$B$21)","v":"Performed By Tex-117-E:"},{"$f":"IF(Worksheet!$B$25=\"\",\"\",Worksheet!$B$25)","v":"Initial Height of Specimen, in.:"},{"$f":"IF(Worksheet!$J$24=\"\",\"\",Worksheet!$J$24)","v":7}]
[16,{"$f":"IF(Worksheet!$K$25=\"\",\"\",Worksheet!$K$25)","v":""},{"$f":"IF(Worksheet!$B$21=\"\",\"\",Worksheet!$B$21)","v":"Performed By Tex-117-E:"},{"$f":"IF(Worksheet!$B$25=\"\",\"\",Worksheet!$B$25)","v":"Initial Height of Specimen, in.:"},{"$f":"IF(Worksheet!$K$24=\"\",\"\",Worksheet!$K$24)","v":8}]
[17,{"$f":"IF(Worksheet!$D$26=\"\",\"\",Worksheet!$D$26)","v":""},{"$f":"IF(Worksheet!$B$21=\"\",\"\",Worksheet!$B$21)","v":"Performed By Tex-117-E:"},{"$f":"IF(Worksheet!$B$26=\"\",\"\",Worksheet!$B$26)","v":"Height of Stone 1, in."},{"$f":"IF(Worksheet!$D$24=\"\",\"\",Worksheet!$D$24)","v":1}]
[18,{"$f":"IF(Worksheet!$E$26=\"\",\"\",Worksheet!$E$26)","v":""},{"$f":"IF(Worksheet!$B$21=\"\",\"\",Worksheet!$B$21)","v":"Performed By Tex-117-E:"},{"$f":"IF(Worksheet!$B$26=\"\",\"\",Worksheet!$B$26)","v":"Height of Stone 1, in."},{"$f":"IF(Worksheet!$E$24=\"\",\"\",Worksheet!$E$24)","v":2}]
[19,{"$f":"IF(Worksheet!$F$26=\"\",\"\",Worksheet!$F$26)","v":""},{"$f":"IF(Worksheet!$B$21=\"\",\"\",Worksheet!$B$21)","v":"Performed By Tex-117-E:"},{"$f":"IF(Worksheet!$B$26=\"\",\"\",Worksheet!$B$26)","v":"Height of Stone 1, in."},{"$f":"IF(Worksheet!$F$24=\"\",\"\",Worksheet!$F$24)","v":3}]
[20,{"$f":"IF(Worksheet!$G$26=\"\",\"\",Worksheet!$G$26)","v":""},{"$f":"IF(Worksheet!$B$21=\"\",\"\",Worksheet!$B$21)","v":"Performed By Tex-117-E:"},{"$f":"IF(Worksheet!$B$26=\"\",\"\",Worksheet!$B$26)","v":"Height of Stone 1, in."},{"$f":"IF(Worksheet!$G$24=\"\",\"\",Worksheet!$G$24)","v":4}]
[21,{"$f":"IF(Worksheet!$H$26=\"\",\"\",Worksheet!$H$26)","v":""},{"$f":"IF(Worksheet!$B$21=\"\",\"\",Worksheet!$B$21)","v":"Performed By Tex-117-E:"},{"$f":"IF(Worksheet!$B$26=\"\",\"\",Worksheet!$B$26)","v":"Height of Stone 1, in."},{"$f":"IF(Worksheet!$H$24=\"\",\"\",Worksheet!$H$24)","v":5}]
[22,{"$f":"IF(Worksheet!$I$26=\"\",\"\",Worksheet!$I$26)","v":""},{"$f":"IF(Worksheet!$B$21=\"\",\"\",Worksheet!$B$21)","v":"Performed By Tex-117-E:"},{"$f":"IF(Worksheet!$B$26=\"\",\"\",Worksheet!$B$26)","v":"Height of Stone 1, in."},{"$f":"IF(Worksheet!$I$24=\"\",\"\",Worksheet!$I$24)","v":6}]
[23,{"$f":"IF(Worksheet!$J$26=\"\",\"\",Worksheet!$J$26)","v":""},{"$f":"IF(Worksheet!$B$21=\"\",\"\",Worksheet!$B$21)","v":"Performed By Tex-117-E:"},{"$f":"IF(Worksheet!$B$26=\"\",\"\",Worksheet!$B$26)","v":"Height of Stone 1, in."},{"$f":"IF(Worksheet!$J$24=\"\",\"\",Worksheet!$J$24)","v":7}]
[24,{"$f":"IF(Worksheet!$K$26=\"\",\"\",Worksheet!$K$26)","v":""},{"$f":"IF(Worksheet!$B$21=\"\",\"\",Worksheet!$B$21)","v":"Performed By Tex-117-E:"},{"$f":"IF(Worksheet!$B$26=\"\",\"\",Worksheet!$B$26)","v":"Height of Stone 1, in."},{"$f":"IF(Worksheet!$K$24=\"\",\"\",Worksheet!$K$24)","v":8}]
[25,{"$f":"IF(Worksheet!$D$27=\"\",\"\",Worksheet!$D$27)","v":""},{"$f":"IF(Worksheet!$B$21=\"\",\"\",Worksheet!$B$21)","v":"Performed By Tex-117-E:"},{"$f":"IF(Worksheet!$B$27=\"\",\"\",Worksheet!$B$27)","v":"Height of Stone 2, in."},{"$f":"IF(Worksheet!$D$24=\"\",\"\",Worksheet!$D$24)","v":1}]
[26,{"$f":"IF(Worksheet!$E$27=\"\",\"\",Worksheet!$E$27)","v":""},{"$f":"IF(Worksheet!$B$21=\"\",\"\",Worksheet!$B$21)","v":"Performed By Tex-117-E:"},{"$f":"IF(Worksheet!$B$27=\"\",\"\",Worksheet!$B$27)","v":"Height of Stone 2, in."},{"$f":"IF(Worksheet!$E$24=\"\",\"\",Worksheet!$E$24)","v":2}]
[27,{"$f":"IF(Worksheet!$F$27=\"\",\"\",Worksheet!$F$27)","v":""},{"$f":"IF(Worksheet!$B$21=\"\",\"\",Worksheet!$B$21)","v":"Performed By Tex-117-E:"},{"$f":"IF(Worksheet!$B$27=\"\",\"\",Worksheet!$B$27)","v":"Height of Stone 2, in."},{"$f":"IF(Worksheet!$F$24=\"\",\"\",Worksheet!$F$24)","v":3}]
[28,{"$f":"IF(Worksheet!$G$27=\"\",\"\",Worksheet!$G$27)","v":""},{"$f":"IF(Worksheet!$B$21=\"\",\"\",Worksheet!$B$21)","v":"Performed By Tex-117-E:"},{"$f":"IF(Worksheet!$B$27=\"\",\"\",Worksheet!$B$27)","v":"Height of Stone 2, in."},{"$f":"IF(Worksheet!$G$24=\"\",\"\",Worksheet!$G$24)","v":4}]
[29,{"$f":"IF(Worksheet!$H$27=\"\",\"\",Worksheet!$H$27)","v":""},{"$f":"IF(Worksheet!$B$21=\"\",\"\",Worksheet!$B$21)","v":"Performed By Tex-117-E:"},{"$f":"IF(Worksheet!$B$27=\"\",\"\",Worksheet!$B$27)","v":"Height of Stone 2, in."},{"$f":"IF(Worksheet!$H$24=\"\",\"\",Worksheet!$H$24)","v":5}]
[30,{"$f":"IF(Worksheet!$I$27=\"\",\"\",Worksheet!$I$27)","v":""},{"$f":"IF(Worksheet!$B$21=\"\",\"\",Worksheet!$B$21)","v":"Performed By Tex-117-E:"},{"$f":"IF(Worksheet!$B$27=\"\",\"\",Worksheet!$B$27)","v":"Height of Stone 2, in."},{"$f":"IF(Worksheet!$I$24=\"\",\"\",Worksheet!$I$24)","v":6}]
[31,{"$f":"IF(Worksheet!$J$27=\"\",\"\",Worksheet!$J$27)","v":""},{"$f":"IF(Worksheet!$B$21=\"\",\"\",Worksheet!$B$21)","v":"Performed By Tex-117-E:"},{"$f":"IF(Worksheet!$B$27=\"\",\"\",Worksheet!$B$27)","v":"Height of Stone 2, in."},{"$f":"IF(Worksheet!$J$24=\"\",\"\",Worksheet!$J$24)","v":7}]
[32,{"$f":"IF(Worksheet!$K$27=\"\",\"\",Worksheet!$K$27)","v":""},{"$f":"IF(Worksheet!$B$21=\"\",\"\",Worksheet!$B$21)","v":"Performed By Tex-117-E:"},{"$f":"IF(Worksheet!$B$27=\"\",\"\",Worksheet!$B$27)","v":"Height of Stone 2, in."},{"$f":"IF(Worksheet!$K$24=\"\",\"\",Worksheet!$K$24)","v":8}]
[33,{"$f":"IF(Worksheet!$D$28=\"\",\"\",Worksheet!$D$28)","v":""},{"$f":"IF(Worksheet!$B$21=\"\",\"\",Worksheet!$B$21)","v":"Performed By Tex-117-E:"},{"$f":"IF(Worksheet!$B$28=\"\",\"\",Worksheet!$B$28)","v":"New Height of Specimen, in.:"},{"$f":"IF(Worksheet!$D$24=\"\",\"\",Worksheet!$D$24)","v":1}]
[34,{"$f":"IF(Worksheet!$E$28=\"\",\"\",Worksheet!$E$28)","v":""},{"$f":"IF(Worksheet!$B$21=\"\",\"\",Worksheet!$B$21)","v":"Performed By Tex-117-E:"},{"$f":"IF(Worksheet!$B$28=\"\",\"\",Worksheet!$B$28)","v":"New Height of Specimen, in.:"},{"$f":"IF(Worksheet!$E$24=\"\",\"\",Worksheet!$E$24)","v":2}]
[35,{"$f":"IF(Worksheet!$F$28=\"\",\"\",Worksheet!$F$28)","v":""},{"$f":"IF(Worksheet!$B$21=\"\",\"\",Worksheet!$B$21)","v":"Performed By Tex-117-E:"},{"$f":"IF(Worksheet!$B$28=\"\",\"\",Worksheet!$B$28)","v":"New Height of Specimen, in.:"},{"$f":"IF(Worksheet!$F$24=\"\",\"\",Worksheet!$F$24)","v":3}]
[36,{"$f":"IF(Worksheet!$G$28=\"\",\"\",Worksheet!$G$28)","v":""},{"$f":"IF(Worksheet!$B$21=\"\",\"\",Worksheet!$B$21)","v":"Performed By Tex-117-E:"},{"$f":"IF(Worksheet!$B$28=\"\",\"\",Worksheet!$B$28)","v":"New Height of Specimen, in.:"},{"$f":"IF(Worksheet!$G$24=\"\",\"\",Worksheet!$G$24)","v":4}]
[37,{"$f":"IF(Worksheet!$H$28=\"\",\"\",Worksheet!$H$28)","v":""},{"$f":"IF(Worksheet!$B$21=\"\",\"\",Worksheet!$B$21)","v":"Performed By Tex-117-E:"},{"$f":"IF(Worksheet!$B$28=\"\",\"\",Worksheet!$B$28)","v":"New Height of Specimen, in.:"},{"$f":"IF(Worksheet!$H$24=\"\",\"\",Worksheet!$H$24)","v":5}]
[38,{"$f":"IF(Worksheet!$I$28=\"\",\"\",Worksheet!$I$28)","v":""},{"$f":"IF(Worksheet!$B$21=\"\",\"\",Worksheet!$B$21)","v":"Performed By Tex-117-E:"},{"$f":"IF(Worksheet!$B$28=\"\",\"\",Worksheet!$B$28)","v":"New Height of Specimen, in.:"},{"$f":"IF(Worksheet!$I$24=\"\",\"\",Worksheet!$I$24)","v":6}]
[39,{"$f":"IF(Worksheet!$J$28=\"\",\"\",Worksheet!$J$28)","v":""},{"$f":"IF(Worksheet!$B$21=\"\",\"\",Worksheet!$B$21)","v":"Performed By Tex-117-E:"},{"$f":"IF(Worksheet!$B$28=\"\",\"\",Worksheet!$B$28)","v":"New Height of Specimen, in.:"},{"$f":"IF(Worksheet!$J$24=\"\",\"\",Worksheet!$J$24)","v":7}]
[40,{"$f":"IF(Worksheet!$K$28=\"\",\"\",Worksheet!$K$28)","v":""},{"$f":"IF(Worksheet!$B$21=\"\",\"\",Worksheet!$B$21)","v":"Performed By Tex-117-E:"},{"$f":"IF(Worksheet!$B$28=\"\",\"\",Worksheet!$B$28)","v":"New Height of Specimen, in.:"},{"$f":"IF(Worksheet!$K$24=\"\",\"\",Worksheet!$K$24)","v":8}]
[41,{"$f":"IF(Worksheet!$D$29=\"\",\"\",Worksheet!$D$29)","v":""},{"$f":"IF(Worksheet!$B$21=\"\",\"\",Worksheet!$B$21)","v":"Performed By Tex-117-E:"},{"$f":"IF(Worksheet!$B$29=\"\",\"\",Worksheet!$B$29)","v":"Average Diameter, in.:"},{"$f":"IF(Worksheet!$D$24=\"\",\"\",Worksheet!$D$24)","v":1}]
[42,{"$f":"IF(Worksheet!$E$29=\"\",\"\",Worksheet!$E$29)","v":""},{"$f":"IF(Worksheet!$B$21=\"\",\"\",Worksheet!$B$21)","v":"Performed By Tex-117-E:"},{"$f":"IF(Worksheet!$B$29=\"\",\"\",Worksheet!$B$29)","v":"Average Diameter, in.:"},{"$f":"IF(Worksheet!$E$24=\"\",\"\",Worksheet!$E$24)","v":2}]
[43,{"$f":"IF(Worksheet!$F$29=\"\",\"\",Worksheet!$F$29)","v":""},{"$f":"IF(Worksheet!$B$21=\"\",\"\",Worksheet!$B$21)","v":"Performed By Tex-117-E:"},{"$f":"IF(Worksheet!$B$29=\"\",\"\",Worksheet!$B$29)","v":"Average Diameter, in.:"},{"$f":"IF(Worksheet!$F$24=\"\",\"\",Worksheet!$F$24)","v":3}]
[44,{"$f":"IF(Worksheet!$G$29=\"\",\"\",Worksheet!$G$29)","v":""},{"$f":"IF(Worksheet!$B$21=\"\",\"\",Worksheet!$B$21)","v":"Performed By Tex-117-E:"},{"$f":"IF(Worksheet!$B$29=\"\",\"\",Worksheet!$B$29)","v":"Average Diameter, in.:"},{"$f":"IF(Worksheet!$G$24=\"\",\"\",Worksheet!$G$24)","v":4}]
[45,{"$f":"IF(Worksheet!$H$29=\"\",\"\",Worksheet!$H$29)","v":""},{"$f":"IF(Worksheet!$B$21=\"\",\"\",Worksheet!$B$21)","v":"Performed By Tex-117-E:"},{"$f":"IF(Worksheet!$B$29=\"\",\"\",Worksheet!$B$29)","v":"Average Diameter, in.:"},{"$f":"IF(Worksheet!$H$24=\"\",\"\",Worksheet!$H$24)","v":5}]
[46,{"$f":"IF(Worksheet!$I$29=\"\",\"\",Worksheet!$I$29)","v":""},{"$f":"IF(Worksheet!$B$21=\"\",\"\",Worksheet!$B$21)","v":"Performed By Tex-117-E:"},{"$f":"IF(Worksheet!$B$29=\"\",\"\",Worksheet!$B$29)","v":"Average Diameter, in.:"},{"$f":"IF(Worksheet!$I$24=\"\",\"\",Worksheet!$I$24)","v":6}]
[47,{"$f":"IF(Worksheet!$J$29=\"\",\"\",Worksheet!$J$29)","v":""},{"$f":"IF(Worksheet!$B$21=\"\",\"\",Worksheet!$B$21)","v":"Performed By Tex-117-E:"},{"$f":"IF(Worksheet!$B$29=\"\",\"\",Worksheet!$B$29)","v":"Average Diameter, in.:"},{"$f":"IF(Worksheet!$J$24=\"\",\"\",Worksheet!$J$24)","v":7}]
[48,{"$f":"IF(Worksheet!$K$29=\"\",\"\",Worksheet!$K$29)","v":""},{"$f":"IF(Worksheet!$B$21=\"\",\"\",Worksheet!$B$21)","v":"Performed By Tex-117-E:"},{"$f":"IF(Worksheet!$B$29=\"\",\"\",Worksheet!$B$29)","v":"Average Diameter, in.:"},{"$f":"IF(Worksheet!$K$24=\"\",\"\",Worksheet!$K$24)","v":8}]
[49,{"$f":"IF(Worksheet!$D$30=\"\",\"\",Worksheet!$D$30)","v":""},{"$f":"IF(Worksheet!$B$21=\"\",\"\",Worksheet!$B$21)","v":"Performed By Tex-117-E:"},{"$f":"IF(Worksheet!$B$30=\"\",\"\",Worksheet!$B$30)","v":"Circumference, in.:"},{"$f":"IF(Worksheet!$D$24=\"\",\"\",Worksheet!$D$24)","v":1}]
[50,{"$f":"IF(Worksheet!$E$30=\"\",\"\",Worksheet!$E$30)","v":""},{"$f":"IF(Worksheet!$B$21=\"\",\"\",Worksheet!$B$21)","v":"Performed By Tex-117-E:"},{"$f":"IF(Worksheet!$B$30=\"\",\"\",Worksheet!$B$30)","v":"Circumference, in.:"},{"$f":"IF(Worksheet!$E$24=\"\",\"\",Worksheet!$E$24)","v":2}]
[51,{"$f":"IF(Worksheet!$F$30=\"\",\"\",Worksheet!$F$30)","v":""},{"$f":"IF(Worksheet!$B$21=\"\",\"\",Worksheet!$B$21)","v":"Performed By Tex-117-E:"},{"$f":"IF(Worksheet!$B$30=\"\",\"\",Worksheet!$B$30)","v":"Circumference, in.:"},{"$f":"IF(Worksheet!$F$24=\"\",\"\",Worksheet!$F$24)","v":3}]
[52,{"$f":"IF(Worksheet!$G$30=\"\",\"\",Worksheet!$G$30)","v":""},{"$f":"IF(Worksheet!$B$21=\"\",\"\",Worksheet!$B$21)","v":"Performed By Tex-117-E:"},{"$f":"IF(Worksheet!$B$30=\"\",\"\",Worksheet!$B$30)","v":"Circumference, in.:"},{"$f":"IF(Worksheet!$G$24=\"\",\"\",Worksheet!$G$24)","v":4}]
[53,{"$f":"IF(Worksheet!$H$30=\"\",\"\",Worksheet!$H$30)","v":""},{"$f":"IF(Worksheet!$B$21=\"\",\"\",Worksheet!$B$21)","v":"Performed By Tex-117-E:"},{"$f":"IF(Worksheet!$B$30=\"\",\"\",Worksheet!$B$30)","v":"Circumference, in.:"},{"$f":"IF(Worksheet!$H$24=\"\",\"\",Worksheet!$H$24)","v":5}]
[54,{"$f":"IF(Worksheet!$I$30=\"\",\"\",Worksheet!$I$30)","v":""},{"$f":"IF(Worksheet!$B$21=\"\",\"\",Worksheet!$B$21)","v":"Performed By Tex-117-E:"},{"$f":"IF(Worksheet!$B$30=\"\",\"\",Worksheet!$B$30)","v":"Circumference, in.:"},{"$f":"IF(Worksheet!$I$24=\"\",\"\",Worksheet!$I$24)","v":6}]
[55,{"$f":"IF(Worksheet!$J$30=\"\",\"\",Worksheet!$J$30)","v":""},{"$f":"IF(Worksheet!$B$21=\"\",\"\",Worksheet!$B$21)","v":"Performed By Tex-117-E:"},{"$f":"IF(Worksheet!$B$30=\"\",\"\",Worksheet!$B$30)","v":"Circumference, in.:"},{"$f":"IF(Worksheet!$J$24=\"\",\"\",Worksheet!$J$24)","v":7}]
[56,{"$f":"IF(Worksheet!$K$30=\"\",\"\",Worksheet!$K$30)","v":""},{"$f":"IF(Worksheet!$B$21=\"\",\"\",Worksheet!$B$21)","v":"Performed By Tex-117-E:"},{"$f":"IF(Worksheet!$B$30=\"\",\"\",Worksheet!$B$30)","v":"Circumference, in.:"},{"$f":"IF(Worksheet!$K$24=\"\",\"\",Worksheet!$K$24)","v":8}]
[57,{"$f":"IF(Worksheet!$D$31=\"\",\"\",Worksheet!$D$31)","v":""},{"$f":"IF(Worksheet!$B$21=\"\",\"\",Worksheet!$B$21)","v":"Performed By Tex-117-E:"},{"$f":"IF(Worksheet!$B$31=\"\",\"\",Worksheet!$B$31)","v":"Area, in.^2:"},{"$f":"IF(Worksheet!$D$24=\"\",\"\",Worksheet!$D$24)","v":1}]
[58,{"$f":"IF(Worksheet!$E$31=\"\",\"\",Worksheet!$E$31)","v":""},{"$f":"IF(Worksheet!$B$21=\"\",\"\",Worksheet!$B$21)","v":"Performed By Tex-117-E:"},{"$f":"IF(Worksheet!$B$31=\"\",\"\",Worksheet!$B$31)","v":"Area, in.^2:"},{"$f":"IF(Worksheet!$E$24=\"\",\"\",Worksheet!$E$24)","v":2}]
[59,{"$f":"IF(Worksheet!$F$31=\"\",\"\",Worksheet!$F$31)","v":""},{"$f":"IF(Worksheet!$B$21=\"\",\"\",Worksheet!$B$21)","v":"Performed By Tex-117-E:"},{"$f":"IF(Worksheet!$B$31=\"\",\"\",Worksheet!$B$31)","v":"Area, in.^2:"},{"$f":"IF(Worksheet!$F$24=\"\",\"\",Worksheet!$F$24)","v":3}]
[60,{"$f":"IF(Worksheet!$G$31=\"\",\"\",Worksheet!$G$31)","v":""},{"$f":"IF(Worksheet!$B$21=\"\",\"\",Worksheet!$B$21)","v":"Performed By Tex-117-E:"},{"$f":"IF(Worksheet!$B$31=\"\",\"\",Worksheet!$B$31)","v":"Area, in.^2:"},{"$f":"IF(Worksheet!$G$24=\"\",\"\",Worksheet!$G$24)","v":4}]
[61,{"$f":"IF(Worksheet!$H$31=\"\",\"\",Worksheet!$H$31)","v":""},{"$f":"IF(Worksheet!$B$21=\"\",\"\",Worksheet!$B$21)","v":"Performed By Tex-117-E:"},{"$f":"IF(Worksheet!$B$31=\"\",\"\",Worksheet!$B$31)","v":"Area, in.^2:"},{"$f":"IF(Worksheet!$H$24=\"\",\"\",Worksheet!$H$24)","v":5}]
[62,{"$f":"IF(Worksheet!$I$31=\"\",\"\",Worksheet!$I$31)","v":""},{"$f":"IF(Worksheet!$B$21=\"\",\"\",Worksheet!$B$21)","v":"Performed By Tex-117-E:"},{"$f":"IF(Worksheet!$B$31=\"\",\"\",Worksheet!$B$31)","v":"Area, in.^2:"},{"$f":"IF(Worksheet!$I$24=\"\",\"\",Worksheet!$I$24)","v":6}]
[63,{"$f":"IF(Worksheet!$J$31=\"\",\"\",Worksheet!$J$31)","v":""},{"$f":"IF(Worksheet!$B$21=\"\",\"\",Worksheet!$B$21)","v":"Performed By Tex-117-E:"},{"$f":"IF(Worksheet!$B$31=\"\",\"\",Worksheet!$B$31)","v":"Area, in.^2:"},{"$f":"IF(Worksheet!$J$24=\"\",\"\",Worksheet!$J$24)","v":7}]
[64,{"$f":"IF(Worksheet!$K$31=\"\",\"\",Worksheet!$K$31)","v":""},{"$f":"IF(Worksheet!$B$21=\"\",\"\",Worksheet!$B$21)","v":"Performed By Tex-117-E:"},{"$f":"IF(Worksheet!$B$31=\"\",\"\",Worksheet!$B$31)","v":"Area, in.^2:"},{"$f":"IF(Worksheet!$K$24=\"\",\"\",Worksheet!$K$24)","v":8}]
[65,{"$f":"IF(Worksheet!$D$32=\"\",\"\",Worksheet!$D$32)","v":""},{"$f":"IF(Worksheet!$B$21=\"\",\"\",Worksheet!$B$21)","v":"Performed By Tex-117-E:"},{"$f":"IF(Worksheet!$B$32=\"\",\"\",Worksheet!$B$32)","v":"Avg. Cross Sectional Area, in^2:"},{"$f":"IF(Worksheet!$D$24=\"\",\"\",Worksheet!$D$24)","v":1}]
[66,{"$f":"IF(Worksheet!$E$32=\"\",\"\",Worksheet!$E$32)","v":""},{"$f":"IF(Worksheet!$B$21=\"\",\"\",Worksheet!$B$21)","v":"Performed By Tex-117-E:"},{"$f":"IF(Worksheet!$B$32=\"\",\"\",Worksheet!$B$32)","v":"Avg. Cross Sectional Area, in^2:"},{"$f":"IF(Worksheet!$E$24=\"\",\"\",Worksheet!$E$24)","v":2}]
[67,{"$f":"IF(Worksheet!$F$32=\"\",\"\",Worksheet!$F$32)","v":""},{"$f":"IF(Worksheet!$B$21=\"\",\"\",Worksheet!$B$21)","v":"Performed By Tex-117-E:"},{"$f":"IF(Worksheet!$B$32=\"\",\"\",Worksheet!$B$32)","v":"Avg. Cross Sectional Area, in^2:"},{"$f":"IF(Worksheet!$F$24=\"\",\"\",Worksheet!$F$24)","v":3}]
[68,{"$f":"IF(Worksheet!$G$32=\"\",\"\",Worksheet!$G$32)","v":""},{"$f":"IF(Worksheet!$B$21=\"\",\"\",Worksheet!$B$21)","v":"Performed By Tex-117-E:"},{"$f":"IF(Worksheet!$B$32=\"\",\"\",Worksheet!$B$32)","v":"Avg. Cross Sectional Area, in^2:"},{"$f":"IF(Worksheet!$G$24=\"\",\"\",Worksheet!$G$24)","v":4}]
[69,{"$f":"IF(Worksheet!$H$32=\"\",\"\",Worksheet!$H$32)","v":""},{"$f":"IF(Worksheet!$B$21=\"\",\"\",Worksheet!$B$21)","v":"Performed By Tex-117-E:"},{"$f":"IF(Worksheet!$B$32=\"\",\"\",Worksheet!$B$32)","v":"Avg. Cross Sectional Area, in^2:"},{"$f":"IF(Worksheet!$H$24=\"\",\"\",Worksheet!$H$24)","v":5}]
[70,{"$f":"IF(Worksheet!$I$32=\"\",\"\",Worksheet!$I$32)","v":""},{"$f":"IF(Worksheet!$B$21=\"\",\"\",Worksheet!$B$21)","v":"Performed By Tex-117-E:"},{"$f":"IF(Worksheet!$B$32=\"\",\"\",Worksheet!$B$32)","v":"Avg. Cross Sectional Area, in^2:"},{"$f":"IF(Worksheet!$I$24=\"\",\"\",Worksheet!$I$24)","v":6}]
[71,{"$f":"IF(Worksheet!$J$32=\"\",\"\",Worksheet!$J$32)","v":""},{"$f":"IF(Worksheet!$B$21=\"\",\"\",Worksheet!$B$21)","v":"Performed By Tex-117-E:"},{"$f":"IF(Worksheet!$B$32=\"\",\"\",Worksheet!$B$32)","v":"Avg. Cross Sectional Area, in^2:"},{"$f":"IF(Worksheet!$J$24=\"\",\"\",Worksheet!$J$24)","v":7}]
[72,{"$f":"IF(Worksheet!$K$32=\"\",\"\",Worksheet!$K$32)","v":""},{"$f":"IF(Worksheet!$B$21=\"\",\"\",Worksheet!$B$21)","v":"Performed By Tex-117-E:"},{"$f":"IF(Worksheet!$B$32=\"\",\"\",Worksheet!$B$32)","v":"Avg. Cross Sectional Area, in^2:"},{"$f":"IF(Worksheet!$K$24=\"\",\"\",Worksheet!$K$24)","v":8}]
[73,{"$f":"IF(Worksheet!$D$33=\"\",\"\",Worksheet!$D$33)","v":""},{"$f":"IF(Worksheet!$B$21=\"\",\"\",Worksheet!$B$21)","v":"Performed By Tex-117-E:"},{"$f":"IF(Worksheet!$B$33=\"\",\"\",Worksheet!$B$33)","v":"Lateral Pressure, psi.:"},{"$f":"IF(Worksheet!$D$24=\"\",\"\",Worksheet!$D$24)","v":1}]
[74,{"$f":"IF(Worksheet!$E$33=\"\",\"\",Worksheet!$E$33)","v":""},{"$f":"IF(Worksheet!$B$21=\"\",\"\",Worksheet!$B$21)","v":"Performed By Tex-117-E:"},{"$f":"IF(Worksheet!$B$33=\"\",\"\",Worksheet!$B$33)","v":"Lateral Pressure, psi.:"},{"$f":"IF(Worksheet!$E$24=\"\",\"\",Worksheet!$E$24)","v":2}]
[75,{"$f":"IF(Worksheet!$F$33=\"\",\"\",Worksheet!$F$33)","v":""},{"$f":"IF(Worksheet!$B$21=\"\",\"\",Worksheet!$B$21)","v":"Performed By Tex-117-E:"},{"$f":"IF(Worksheet!$B$33=\"\",\"\",Worksheet!$B$33)","v":"Lateral Pressure, psi.:"},{"$f":"IF(Worksheet!$F$24=\"\",\"\",Worksheet!$F$24)","v":3}]
[76,{"$f":"IF(Worksheet!$G$33=\"\",\"\",Worksheet!$G$33)","v":""},{"$f":"IF(Worksheet!$B$21=\"\",\"\",Worksheet!$B$21)","v":"Performed By Tex-117-E:"},{"$f":"IF(Worksheet!$B$33=\"\",\"\",Worksheet!$B$33)","v":"Lateral Pressure, psi.:"},{"$f":"IF(Worksheet!$G$24=\"\",\"\",Worksheet!$G$24)","v":4}]
[77,{"$f":"IF(Worksheet!$H$33=\"\",\"\",Worksheet!$H$33)","v":""},{"$f":"IF(Worksheet!$B$21=\"\",\"\",Worksheet!$B$21)","v":"Performed By Tex-117-E:"},{"$f":"IF(Worksheet!$B$33=\"\",\"\",Worksheet!$B$33)","v":"Lateral Pressure, psi.:"},{"$f":"IF(Worksheet!$H$24=\"\",\"\",Worksheet!$H$24)","v":5}]
[78,{"$f":"IF(Worksheet!$I$33=\"\",\"\",Worksheet!$I$33)","v":""},{"$f":"IF(Worksheet!$B$21=\"\",\"\",Worksheet!$B$21)","v":"Performed By Tex-117-E:"},{"$f":"IF(Worksheet!$B$33=\"\",\"\",Worksheet!$B$33)","v":"Lateral Pressure, psi.:"},{"$f":"IF(Worksheet!$I$24=\"\",\"\",Worksheet!$I$24)","v":6}]
[79,{"$f":"IF(Worksheet!$J$33=\"\",\"\",Worksheet!$J$33)","v":""},{"$f":"IF(Worksheet!$B$21=\"\",\"\",Worksheet!$B$21)","v":"Performed By Tex-117-E:"},{"$f":"IF(Worksheet!$B$33=\"\",\"\",Worksheet!$B$33)","v":"Lateral Pressure, psi.:"},{"$f":"IF(Worksheet!$J$24=\"\",\"\",Worksheet!$J$24)","v":7}]
[80,{"$f":"IF(Worksheet!$K$33=\"\",\"\",Worksheet!$K$33)","v":""},{"$f":"IF(Worksheet!$B$21=\"\",\"\",Worksheet!$B$21)","v":"Performed By Tex-117-E:"},{"$f":"IF(Worksheet!$B$33=\"\",\"\",Worksheet!$B$33)","v":"Lateral Pressure, psi.:"},{"$f":"IF(Worksheet!$K$24=\"\",\"\",Worksheet!$K$24)","v":8}]
[81,{"$f":"IF(Worksheet!$D$34=\"\",\"\",Worksheet!$D$34)","v":""},{"$f":"IF(Worksheet!$B$21=\"\",\"\",Worksheet!$B$21)","v":"Performed By Tex-117-E:"},{"$f":"IF(Worksheet!$B$34=\"\",\"\",Worksheet!$B$34)","v":"Calibration Factor:"},{"$f":"IF(Worksheet!$D$24=\"\",\"\",Worksheet!$D$24)","v":1}]
[82,{"$f":"IF(Worksheet!$E$34=\"\",\"\",Worksheet!$E$34)","v":""},{"$f":"IF(Worksheet!$B$21=\"\",\"\",Worksheet!$B$21)","v":"Performed By Tex-117-E:"},{"$f":"IF(Worksheet!$B$34=\"\",\"\",Worksheet!$B$34)","v":"Calibration Factor:"},{"$f":"IF(Worksheet!$E$24=\"\",\"\",Worksheet!$E$24)","v":2}]
[83,{"$f":"IF(Worksheet!$F$34=\"\",\"\",Worksheet!$F$34)","v":""},{"$f":"IF(Worksheet!$B$21=\"\",\"\",Worksheet!$B$21)","v":"Performed By Tex-117-E:"},{"$f":"IF(Worksheet!$B$34=\"\",\"\",Worksheet!$B$34)","v":"Calibration Factor:"},{"$f":"IF(Worksheet!$F$24=\"\",\"\",Worksheet!$F$24)","v":3}]
[84,{"$f":"IF(Worksheet!$G$34=\"\",\"\",Worksheet!$G$34)","v":""},{"$f":"IF(Worksheet!$B$21=\"\",\"\",Worksheet!$B$21)","v":"Performed By Tex-117-E:"},{"$f":"IF(Worksheet!$B$34=\"\",\"\",Worksheet!$B$34)","v":"Calibration Factor:"},{"$f":"IF(Worksheet!$G$24=\"\",\"\",Worksheet!$G$24)","v":4}]
[85,{"$f":"IF(Worksheet!$H$34=\"\",\"\",Worksheet!$H$34)","v":""},{"$f":"IF(Worksheet!$B$21=\"\",\"\",Worksheet!$B$21)","v":"Performed By Tex-117-E:"},{"$f":"IF(Worksheet!$B$34=\"\",\"\",Worksheet!$B$34)","v":"Calibration Factor:"},{"$f":"IF(Worksheet!$H$24=\"\",\"\",Worksheet!$H$24)","v":5}]
[86,{"$f":"IF(Worksheet!$I$34=\"\",\"\",Worksheet!$I$34)","v":""},{"$f":"IF(Worksheet!$B$21=\"\",\"\",Worksheet!$B$21)","v":"Performed By Tex-117-E:"},{"$f":"IF(Worksheet!$B$34=\"\",\"\",Worksheet!$B$34)","v":"Calibration Factor:"},{"$f":"IF(Worksheet!$I$24=\"\",\"\",Worksheet!$I$24)","v":6}]
[87,{"$f":"IF(Worksheet!$J$34=\"\",\"\",Worksheet!$J$34)","v":""},{"$f":"IF(Worksheet!$B$21=\"\",\"\",Worksheet!$B$21)","v":"Performed By Tex-117-E:"},{"$f":"IF(Worksheet!$B$34=\"\",\"\",Worksheet!$B$34)","v":"Calibration Factor:"},{"$f":"IF(Worksheet!$J$24=\"\",\"\",Worksheet!$J$24)","v":7}]
[88,{"$f":"IF(Worksheet!$K$34=\"\",\"\",Worksheet!$K$34)","v":""},{"$f":"IF(Worksheet!$B$21=\"\",\"\",Worksheet!$B$21)","v":"Performed By Tex-117-E:"},{"$f":"IF(Worksheet!$B$34=\"\",\"\",Worksheet!$B$34)","v":"Calibration Factor:"},{"$f":"IF(Worksheet!$K$24=\"\",\"\",Worksheet!$K$24)","v":8}]
[89,{"$f":"IF(Worksheet!$D$35=\"\",\"\",Worksheet!$D$35)","v":""},{"$f":"IF(Worksheet!$B$21=\"\",\"\",Worksheet!$B$21)","v":"Performed By Tex-117-E:"},{"$f":"IF(Worksheet!$B$35=\"\",\"\",Worksheet!$B$35)","v":"Excitation:"},{"$f":"IF(Worksheet!$D$24=\"\",\"\",Worksheet!$D$24)","v":1}]
[90,{"$f":"IF(Worksheet!$E$35=\"\",\"\",Worksheet!$E$35)","v":""},{"$f":"IF(Worksheet!$B$21=\"\",\"\",Worksheet!$B$21)","v":"Performed By Tex-117-E:"},{"$f":"IF(Worksheet!$B$35=\"\",\"\",Worksheet!$B$35)","v":"Excitation:"},{"$f":"IF(Worksheet!$E$24=\"\",\"\",Worksheet!$E$24)","v":2}]
[91,{"$f":"IF(Worksheet!$F$35=\"\",\"\",Worksheet!$F$35)","v":""},{"$f":"IF(Worksheet!$B$21=\"\",\"\",Worksheet!$B$21)","v":"Performed By Tex-117-E:"},{"$f":"IF(Worksheet!$B$35=\"\",\"\",Worksheet!$B$35)","v":"Excitation:"},{"$f":"IF(Worksheet!$F$24=\"\",\"\",Worksheet!$F$24)","v":3}]
[92,{"$f":"IF(Worksheet!$G$35=\"\",\"\",Worksheet!$G$35)","v":""},{"$f":"IF(Worksheet!$B$21=\"\",\"\",Worksheet!$B$21)","v":"Performed By Tex-117-E:"},{"$f":"IF(Worksheet!$B$35=\"\",\"\",Worksheet!$B$35)","v":"Excitation:"},{"$f":"IF(Worksheet!$G$24=\"\",\"\",Worksheet!$G$24)","v":4}]
[93,{"$f":"IF(Worksheet!$H$35=\"\",\"\",Worksheet!$H$35)","v":""},{"$f":"IF(Worksheet!$B$21=\"\",\"\",Worksheet!$B$21)","v":"Performed By Tex-117-E:"},{"$f":"IF(Worksheet!$B$35=\"\",\"\",Worksheet!$B$35)","v":"Excitation:"},{"$f":"IF(Worksheet!$H$24=\"\",\"\",Worksheet!$H$24)","v":5}]
[94,{"$f":"IF(Worksheet!$I$35=\"\",\"\",Worksheet!$I$35)","v":""},{"$f":"IF(Worksheet!$B$21=\"\",\"\",Worksheet!$B$21)","v":"Performed By Tex-117-E:"},{"$f":"IF(Worksheet!$B$35=\"\",\"\",Worksheet!$B$35)","v":"Excitation:"},{"$f":"IF(Worksheet!$I$24=\"\",\"\",Worksheet!$I$24)","v":6}]
[95,{"$f":"IF(Worksheet!$J$35=\"\",\"\",Worksheet!$J$35)","v":""},{"$f":"IF(Worksheet!$B$21=\"\",\"\",Worksheet!$B$21)","v":"Performed By Tex-117-E:"},{"$f":"IF(Worksheet!$B$35=\"\",\"\",Worksheet!$B$35)","v":"Excitation:"},{"$f":"IF(Worksheet!$J$24=\"\",\"\",Worksheet!$J$24)","v":7}]
[96,{"$f":"IF(Worksheet!$K$35=\"\",\"\",Worksheet!$K$35)","v":""},{"$f":"IF(Worksheet!$B$21=\"\",\"\",Worksheet!$B$21)","v":"Performed By Tex-117-E:"},{"$f":"IF(Worksheet!$B$35=\"\",\"\",Worksheet!$B$35)","v":"Excitation:"},{"$f":"IF(Worksheet!$K$24=\"\",\"\",Worksheet!$K$24)","v":8}]
[97,{"$f":"IF(Worksheet!$D$36=\"\",\"\",Worksheet!$D$36)","v":""},{"$f":"IF(Worksheet!$B$21=\"\",\"\",Worksheet!$B$21)","v":"Performed By Tex-117-E:"},{"$f":"IF(Worksheet!$B$36=\"\",\"\",Worksheet!$B$36)","v":"Zero:"},{"$f":"IF(Worksheet!$D$24=\"\",\"\",Worksheet!$D$24)","v":1}]
[98,{"$f":"IF(Worksheet!$E$36=\"\",\"\",Worksheet!$E$36)","v":""},{"$f":"IF(Worksheet!$B$21=\"\",\"\",Worksheet!$B$21)","v":"Performed By Tex-117-E:"},{"$f":"IF(Worksheet!$B$36=\"\",\"\",Worksheet!$B$36)","v":"Zero:"},{"$f":"IF(Worksheet!$E$24=\"\",\"\",Worksheet!$E$24)","v":2}]
[99,{"$f":"IF(Worksheet!$F$36=\"\",\"\",Worksheet!$F$36)","v":""},{"$f":"IF(Worksheet!$B$21=\"\",\"\",Worksheet!$B$21)","v":"Performed By Tex-117-E:"},{"$f":"IF(Worksheet!$B$36=\"\",\"\",Worksheet!$B$36)","v":"Zero:"},{"$f":"IF(Worksheet!$F$24=\"\",\"\",Worksheet!$F$24)","v":3}]
[100,{"$f":"IF(Worksheet!$G$36=\"\",\"\",Worksheet!$G$36)","v":""},{"$f":"IF(Worksheet!$B$21=\"\",\"\",Worksheet!$B$21)","v":"Performed By Tex-117-E:"},{"$f":"IF(Worksheet!$B$36=\"\",\"\",Worksheet!$B$36)","v":"Zero:"},{"$f":"IF(Worksheet!$G$24=\"\",\"\",Worksheet!$G$24)","v":4}]
[101,{"$f":"IF(Worksheet!$H$36=\"\",\"\",Worksheet!$H$36)","v":""},{"$f":"IF(Worksheet!$B$21=\"\",\"\",Worksheet!$B$21)","v":"Performed By Tex-117-E:"},{"$f":"IF(Worksheet!$B$36=\"\",\"\",Worksheet!$B$36)","v":"Zero:"},{"$f":"IF(Worksheet!$H$24=\"\",\"\",Worksheet!$H$24)","v":5}]
[102,{"$f":"IF(Worksheet!$I$36=\"\",\"\",Worksheet!$I$36)","v":""},{"$f":"IF(Worksheet!$B$21=\"\",\"\",Worksheet!$B$21)","v":"Performed By Tex-117-E:"},{"$f":"IF(Worksheet!$B$36=\"\",\"\",Worksheet!$B$36)","v":"Zero:"},{"$f":"IF(Worksheet!$I$24=\"\",\"\",Worksheet!$I$24)","v":6}]
[103,{"$f":"IF(Worksheet!$J$36=\"\",\"\",Worksheet!$J$36)","v":""},{"$f":"IF(Worksheet!$B$21=\"\",\"\",Worksheet!$B$21)","v":"Performed By Tex-117-E:"},{"$f":"IF(Worksheet!$B$36=\"\",\"\",Worksheet!$B$36)","v":"Zero:"},{"$f":"IF(Worksheet!$J$24=\"\",\"\",Worksheet!$J$24)","v":7}]
[104,{"$f":"IF(Worksheet!$K$36=\"\",\"\",Worksheet!$K$36)","v":""},{"$f":"IF(Worksheet!$B$21=\"\",\"\",Worksheet!$B$21)","v":"Performed By Tex-117-E:"},{"$f":"IF(Worksheet!$B$36=\"\",\"\",Worksheet!$B$36)","v":"Zero:"},{"$f":"IF(Worksheet!$K$24=\"\",\"\",Worksheet!$K$24)","v":8}]
[105,{"$f":"IF(Worksheet!$D$37=\"\",\"\",Worksheet!$D$37)","v":""},{"$f":"IF(Worksheet!$B$21=\"\",\"\",Worksheet!$B$21)","v":"Performed By Tex-117-E:"},{"$f":"IF(Worksheet!$B$37=\"\",\"\",Worksheet!$B$37)","v":"Ring Factor, lbs./div"},{"$f":"IF(Worksheet!$D$24=\"\",\"\",Worksheet!$D$24)","v":1}]
[106,{"$f":"IF(Worksheet!$E$37=\"\",\"\",Worksheet!$E$37)","v":""},{"$f":"IF(Worksheet!$B$21=\"\",\"\",Worksheet!$B$21)","v":"Performed By Tex-117-E:"},{"$f":"IF(Worksheet!$B$37=\"\",\"\",Worksheet!$B$37)","v":"Ring Factor, lbs./div"},{"$f":"IF(Worksheet!$E$24=\"\",\"\",Worksheet!$E$24)","v":2}]
[107,{"$f":"IF(Worksheet!$F$37=\"\",\"\",Worksheet!$F$37)","v":""},{"$f":"IF(Worksheet!$B$21=\"\",\"\",Worksheet!$B$21)","v":"Performed By Tex-117-E:"},{"$f":"IF(Worksheet!$B$37=\"\",\"\",Worksheet!$B$37)","v":"Ring Factor, lbs./div"},{"$f":"IF(Worksheet!$F$24=\"\",\"\",Worksheet!$F$24)","v":3}]
[108,{"$f":"IF(Worksheet!$G$37=\"\",\"\",Worksheet!$G$37)","v":""},{"$f":"IF(Worksheet!$B$21=\"\",\"\",Worksheet!$B$21)","v":"Performed By Tex-117-E:"},{"$f":"IF(Worksheet!$B$37=\"\",\"\",Worksheet!$B$37)","v":"Ring Factor, lbs./div"},{"$f":"IF(Worksheet!$G$24=\"\",\"\",Worksheet!$G$24)","v":4}]
[109,{"$f":"IF(Worksheet!$H$37=\"\",\"\",Worksheet!$H$37)","v":""},{"$f":"IF(Worksheet!$B$21=\"\",\"\",Worksheet!$B$21)","v":"Performed By Tex-117-E:"},{"$f":"IF(Worksheet!$B$37=\"\",\"\",Worksheet!$B$37)","v":"Ring Factor, lbs./div"},{"$f":"IF(Worksheet!$H$24=\"\",\"\",Worksheet!$H$24)","v":5}]
[110,{"$f":"IF(Worksheet!$I$37=\"\",\"\",Worksheet!$I$37)","v":""},{"$f":"IF(Worksheet!$B$21=\"\",\"\",Worksheet!$B$21)","v":"Performed By Tex-117-E:"},{"$f":"IF(Worksheet!$B$37=\"\",\"\",Worksheet!$B$37)","v":"Ring Factor, lbs./div"},{"$f":"IF(Worksheet!$I$24=\"\",\"\",Worksheet!$I$24)","v":6}]
[111,{"$f":"IF(Worksheet!$J$37=\"\",\"\",Worksheet!$J$37)","v":""},{"$f":"IF(Worksheet!$B$21=\"\",\"\",Worksheet!$B$21)","v":"Performed By Tex-117-E:"},{"$f":"IF(Worksheet!$B$37=\"\",\"\",Worksheet!$B$37)","v":"Ring Factor, lbs./div"},{"$f":"IF(Worksheet!$J$24=\"\",\"\",Worksheet!$J$24)","v":7}]
[112,{"$f":"IF(Worksheet!$K$37=\"\",\"\",Worksheet!$K$37)","v":""},{"$f":"IF(Worksheet!$B$21=\"\",\"\",Worksheet!$B$21)","v":"Performed By Tex-117-E:"},{"$f":"IF(Worksheet!$B$37=\"\",\"\",Worksheet!$B$37)","v":"Ring Factor, lbs./div"},{"$f":"IF(Worksheet!$K$24=\"\",\"\",Worksheet!$K$24)","v":8}]
[113,{"$f":"IF(Worksheet!$D$38=\"\",\"\",Worksheet!$D$38)","v":""},{"$f":"IF(Worksheet!$B$21=\"\",\"\",Worksheet!$B$21)","v":"Performed By Tex-117-E:"},{"$f":"IF(Worksheet!$B$38=\"\",\"\",Worksheet!$B$38)","v":"Dead Load, lbs.:"},{"$f":"IF(Worksheet!$D$24=\"\",\"\",Worksheet!$D$24)","v":1}]
[114,{"$f":"IF(Worksheet!$E$38=\"\",\"\",Worksheet!$E$38)","v":""},{"$f":"IF(Worksheet!$B$21=\"\",\"\",Worksheet!$B$21)","v":"Performed By Tex-117-E:"},{"$f":"IF(Worksheet!$B$38=\"\",\"\",Worksheet!$B$38)","v":"Dead Load, lbs.:"},{"$f":"IF(Worksheet!$E$24=\"\",\"\",Worksheet!$E$24)","v":2}]
[115,{"$f":"IF(Worksheet!$F$38=\"\",\"\",Worksheet!$F$38)","v":""},{"$f":"IF(Worksheet!$B$21=\"\",\"\",Worksheet!$B$21)","v":"Performed By Tex-117-E:"},{"$f":"IF(Worksheet!$B$38=\"\",\"\",Worksheet!$B$38)","v":"Dead Load, lbs.:"},{"$f":"IF(Worksheet!$F$24=\"\",\"\",Worksheet!$F$24)","v":3}]
[116,{"$f":"IF(Worksheet!$G$38=\"\",\"\",Worksheet!$G$38)","v":""},{"$f":"IF(Worksheet!$B$21=\"\",\"\",Worksheet!$B$21)","v":"Performed By Tex-117-E:"},{"$f":"IF(Worksheet!$B$38=\"\",\"\",Worksheet!$B$38)","v":"Dead Load, lbs.:"},{"$f":"IF(Worksheet!$G$24=\"\",\"\",Worksheet!$G$24)","v":4}]
[117,{"$f":"IF(Worksheet!$H$38=\"\",\"\",Worksheet!$H$38)","v":""},{"$f":"IF(Worksheet!$B$21=\"\",\"\",Worksheet!$B$21)","v":"Performed By Tex-117-E:"},{"$f":"IF(Worksheet!$B$38=\"\",\"\",Worksheet!$B$38)","v":"Dead Load, lbs.:"},{"$f":"IF(Worksheet!$H$24=\"\",\"\",Worksheet!$H$24)","v":5}]
[118,{"$f":"IF(Worksheet!$I$38=\"\",\"\",Worksheet!$I$38)","v":""},{"$f":"IF(Worksheet!$B$21=\"\",\"\",Worksheet!$B$21)","v":"Performed By Tex-117-E:"},{"$f":"IF(Worksheet!$B$38=\"\",\"\",Worksheet!$B$38)","v":"Dead Load, lbs.:"},{"$f":"IF(Worksheet!$I$24=\"\",\"\",Worksheet!$I$24)","v":6}]
[119,{"$f":"IF(Worksheet!$J$38=\"\",\"\",Worksheet!$J$38)","v":""},{"$f":"IF(Worksheet!$B$21=\"\",\"\",Worksheet!$B$21)","v":"Performed By Tex-117-E:"},{"$f":"IF(Worksheet!$B$38=\"\",\"\",Worksheet!$B$38)","v":"Dead Load, lbs.:"},{"$f":"IF(Worksheet!$J$24=\"\",\"\",Worksheet!$J$24)","v":7}]
[120,{"$f":"IF(Worksheet!$K$38=\"\",\"\",Worksheet!$K$38)","v":""},{"$f":"IF(Worksheet!$B$21=\"\",\"\",Worksheet!$B$21)","v":"Performed By Tex-117-E:"},{"$f":"IF(Worksheet!$B$38=\"\",\"\",Worksheet!$B$38)","v":"Dead Load, lbs.:"},{"$f":"IF(Worksheet!$K$24=\"\",\"\",Worksheet!$K$24)","v":8}]
[121,{"$f":"IF(Worksheet!$D$39=\"\",\"\",Worksheet!$D$39)","v":""},{"$f":"IF(Worksheet!$B$21=\"\",\"\",Worksheet!$B$21)","v":"Performed By Tex-117-E:"},{"$f":"IF(Worksheet!$B$39=\"\",\"\",Worksheet!$B$39)","v":"Piston Correction, lbs.:"},{"$f":"IF(Worksheet!$D$24=\"\",\"\",Worksheet!$D$24)","v":1}]
[122,{"$f":"IF(Worksheet!$E$39=\"\",\"\",Worksheet!$E$39)","v":""},{"$f":"IF(Worksheet!$B$21=\"\",\"\",Worksheet!$B$21)","v":"Performed By Tex-117-E:"},{"$f":"IF(Worksheet!$B$39=\"\",\"\",Worksheet!$B$39)","v":"Piston Correction, lbs.:"},{"$f":"IF(Worksheet!$E$24=\"\",\"\",Worksheet!$E$24)","v":2}]
[123,{"$f":"IF(Worksheet!$F$39=\"\",\"\",Worksheet!$F$39)","v":""},{"$f":"IF(Worksheet!$B$21=\"\",\"\",Worksheet!$B$21)","v":"Performed By Tex-117-E:"},{"$f":"IF(Worksheet!$B$39=\"\",\"\",Worksheet!$B$39)","v":"Piston Correction, lbs.:"},{"$f":"IF(Worksheet!$F$24=\"\",\"\",Worksheet!$F$24)","v":3}]
[124,{"$f":"IF(Worksheet!$G$39=\"\",\"\",Worksheet!$G$39)","v":""},{"$f":"IF(Worksheet!$B$21=\"\",\"\",Worksheet!$B$21)","v":"Performed By Tex-117-E:"},{"$f":"IF(Worksheet!$B$39=\"\",\"\",Worksheet!$B$39)","v":"Piston Correction, lbs.:"},{"$f":"IF(Worksheet!$G$24=\"\",\"\",Worksheet!$G$24)","v":4}]
[125,{"$f":"IF(Worksheet!$H$39=\"\",\"\",Worksheet!$H$39)","v":""},{"$f":"IF(Worksheet!$B$21=\"\",\"\",Worksheet!$B$21)","v":"Performed By Tex-117-E:"},{"$f":"IF(Worksheet!$B$39=\"\",\"\",Worksheet!$B$39)","v":"Piston Correction, lbs.:"},{"$f":"IF(Worksheet!$H$24=\"\",\"\",Worksheet!$H$24)","v":5}]
[126,{"$f":"IF(Worksheet!$I$39=\"\",\"\",Worksheet!$I$39)","v":""},{"$f":"IF(Worksheet!$B$21=\"\",\"\",Worksheet!$B$21)","v":"Performed By Tex-117-E:"},{"$f":"IF(Worksheet!$B$39=\"\",\"\",Worksheet!$B$39)","v":"Piston Correction, lbs.:"},{"$f":"IF(Worksheet!$I$24=\"\",\"\",Worksheet!$I$24)","v":6}]
[127,{"$f":"IF(Worksheet!$J$39=\"\",\"\",Worksheet!$J$39)","v":""},{"$f":"IF(Worksheet!$B$21=\"\",\"\",Worksheet!$B$21)","v":"Performed By Tex-117-E:"},{"$f":"IF(Worksheet!$B$39=\"\",\"\",Worksheet!$B$39)","v":"Piston Correction, lbs.:"},{"$f":"IF(Worksheet!$J$24=\"\",\"\",Worksheet!$J$24)","v":7}]
[128,{"$f":"IF(Worksheet!$K$39=\"\",\"\",Worksheet!$K$39)","v":""},{"$f":"IF(Worksheet!$B$21=\"\",\"\",Worksheet!$B$21)","v":"Performed By Tex-117-E:"},{"$f":"IF(Worksheet!$B$39=\"\",\"\",Worksheet!$B$39)","v":"Piston Correction, lbs.:"},{"$f":"IF(Worksheet!$K$24=\"\",\"\",Worksheet!$K$24)","v":8}]
[129,{"$f":"IF(Worksheet!$D$40=\"\",\"\",Worksheet!$D$40)","v":""},{"$f":"IF(Worksheet!$B$21=\"\",\"\",Worksheet!$B$21)","v":"Performed By Tex-117-E:"},{"$f":"IF(Worksheet!$B$40=\"\",\"\",Worksheet!$B$40)","v":"Max. Load Reading, div.:"},{"$f":"IF(Worksheet!$D$24=\"\",\"\",Worksheet!$D$24)","v":1}]
[130,{"$f":"IF(Worksheet!$E$40=\"\",\"\",Worksheet!$E$40)","v":""},{"$f":"IF(Worksheet!$B$21=\"\",\"\",Worksheet!$B$21)","v":"Performed By Tex-117-E:"},{"$f":"IF(Worksheet!$B$40=\"\",\"\",Worksheet!$B$40)","v":"Max. Load Reading, div.:"},{"$f":"IF(Worksheet!$E$24=\"\",\"\",Worksheet!$E$24)","v":2}]
[131,{"$f":"IF(Worksheet!$F$40=\"\",\"\",Worksheet!$F$40)","v":""},{"$f":"IF(Worksheet!$B$21=\"\",\"\",Worksheet!$B$21)","v":"Performed By Tex-117-E:"},{"$f":"IF(Worksheet!$B$40=\"\",\"\",Worksheet!$B$40)","v":"Max. Load Reading, div.:"},{"$f":"IF(Worksheet!$F$24=\"\",\"\",Worksheet!$F$24)","v":3}]
[132,{"$f":"IF(Worksheet!$G$40=\"\",\"\",Worksheet!$G$40)","v":""},{"$f":"IF(Worksheet!$B$21=\"\",\"\",Worksheet!$B$21)","v":"Performed By Tex-117-E:"},{"$f":"IF(Worksheet!$B$40=\"\",\"\",Worksheet!$B$40)","v":"Max. Load Reading, div.:"},{"$f":"IF(Worksheet!$G$24=\"\",\"\",Worksheet!$G$24)","v":4}]
[133,{"$f":"IF(Worksheet!$H$40=\"\",\"\",Worksheet!$H$40)","v":""},{"$f":"IF(Worksheet!$B$21=\"\",\"\",Worksheet!$B$21)","v":"Performed By Tex-117-E:"},{"$f":"IF(Worksheet!$B$40=\"\",\"\",Worksheet!$B$40)","v":"Max. Load Reading, div.:"},{"$f":"IF(Worksheet!$H$24=\"\",\"\",Worksheet!$H$24)","v":5}]
[134,{"$f":"IF(Worksheet!$I$40=\"\",\"\",Worksheet!$I$40)","v":""},{"$f":"IF(Worksheet!$B$21=\"\",\"\",Worksheet!$B$21)","v":"Performed By Tex-117-E:"},{"$f":"IF(Worksheet!$B$40=\"\",\"\",Worksheet!$B$40)","v":"Max. Load Reading, div.:"},{"$f":"IF(Worksheet!$I$24=\"\",\"\",Worksheet!$I$24)","v":6}]
[135,{"$f":"IF(Worksheet!$J$40=\"\",\"\",Worksheet!$J$40)","v":""},{"$f":"IF(Worksheet!$B$21=\"\",\"\",Worksheet!$B$21)","v":"Performed By Tex-117-E:"},{"$f":"IF(Worksheet!$B$40=\"\",\"\",Worksheet!$B$40)","v":"Max. Load Reading, div.:"},{"$f":"IF(Worksheet!$J$24=\"\",\"\",Worksheet!$J$24)","v":7}]
[136,{"$f":"IF(Worksheet!$K$40=\"\",\"\",Worksheet!$K$40)","v":""},{"$f":"IF(Worksheet!$B$21=\"\",\"\",Worksheet!$B$21)","v":"Performed By Tex-117-E:"},{"$f":"IF(Worksheet!$B$40=\"\",\"\",Worksheet!$B$40)","v":"Max. Load Reading, div.:"},{"$f":"IF(Worksheet!$K$24=\"\",\"\",Worksheet!$K$24)","v":8}]
[137,{"$f":"IF(Worksheet!$D$41=\"\",\"\",Worksheet!$D$41)","v":""},{"$f":"IF(Worksheet!$B$21=\"\",\"\",Worksheet!$B$21)","v":"Performed By Tex-117-E:"},{"$f":"IF(Worksheet!$B$41=\"\",\"\",Worksheet!$B$41)","v":"Max Load, lbs.:"},{"$f":"IF(Worksheet!$D$24=\"\",\"\",Worksheet!$D$24)","v":1}]
[138,{"$f":"IF(Worksheet!$E$41=\"\",\"\",Worksheet!$E$41)","v":""},{"$f":"IF(Worksheet!$B$21=\"\",\"\",Worksheet!$B$21)","v":"Performed By Tex-117-E:"},{"$f":"IF(Worksheet!$B$41=\"\",\"\",Worksheet!$B$41)","v":"Max Load, lbs.:"},{"$f":"IF(Worksheet!$E$24=\"\",\"\",Worksheet!$E$24)","v":2}]
[139,{"$f":"IF(Worksheet!$F$41=\"\",\"\",Worksheet!$F$41)","v":""},{"$f":"IF(Worksheet!$B$21=\"\",\"\",Worksheet!$B$21)","v":"Performed By Tex-117-E:"},{"$f":"IF(Worksheet!$B$41=\"\",\"\",Worksheet!$B$41)","v":"Max Load, lbs.:"},{"$f":"IF(Worksheet!$F$24=\"\",\"\",Worksheet!$F$24)","v":3}]
[140,{"$f":"IF(Worksheet!$G$41=\"\",\"\",Worksheet!$G$41)","v":""},{"$f":"IF(Worksheet!$B$21=\"\",\"\",Worksheet!$B$21)","v":"Performed By Tex-117-E:"},{"$f":"IF(Worksheet!$B$41=\"\",\"\",Worksheet!$B$41)","v":"Max Load, lbs.:"},{"$f":"IF(Worksheet!$G$24=\"\",\"\",Worksheet!$G$24)","v":4}]
[141,{"$f":"IF(Worksheet!$H$41=\"\",\"\",Worksheet!$H$41)","v":""},{"$f":"IF(Worksheet!$B$21=\"\",\"\",Worksheet!$B$21)","v":"Performed By Tex-117-E:"},{"$f":"IF(Worksheet!$B$41=\"\",\"\",Worksheet!$B$41)","v":"Max Load, lbs.:"},{"$f":"IF(Worksheet!$H$24=\"\",\"\",Worksheet!$H$24)","v":5}]
[142,{"$f":"IF(Worksheet!$I$41=\"\",\"\",Worksheet!$I$41)","v":""},{"$f":"IF(Worksheet!$B$21=\"\",\"\",Worksheet!$B$21)","v":"Performed By Tex-117-E:"},{"$f":"IF(Worksheet!$B$41=\"\",\"\",Worksheet!$B$41)","v":"Max Load, lbs.:"},{"$f":"IF(Worksheet!$I$24=\"\",\"\",Worksheet!$I$24)","v":6}]
[143,{"$f":"IF(Worksheet!$J$41=\"\",\"\",Worksheet!$J$41)","v":""},{"$f":"IF(Worksheet!$B$21=\"\",\"\",Worksheet!$B$21)","v":"Performed By Tex-117-E:"},{"$f":"IF(Worksheet!$B$41=\"\",\"\",Worksheet!$B$41)","v":"Max Load, lbs.:"},{"$f":"IF(Worksheet!$J$24=\"\",\"\",Worksheet!$J$24)","v":7}]
[144,{"$f":"IF(Worksheet!$K$41=\"\",\"\",Worksheet!$K$41)","v":""},{"$f":"IF(Worksheet!$B$21=\"\",\"\",Worksheet!$B$21)","v":"Performed By Tex-117-E:"},{"$f":"IF(Worksheet!$B$41=\"\",\"\",Worksheet!$B$41)","v":"Max Load, lbs.:"},{"$f":"IF(Worksheet!$K$24=\"\",\"\",Worksheet!$K$24)","v":8}]
[145,{"$f":"IF(Worksheet!$D$42=\"\",\"\",Worksheet!$D$42)","v":""},{"$f":"IF(Worksheet!$B$21=\"\",\"\",Worksheet!$B$21)","v":"Performed By Tex-117-E:"},{"$f":"IF(Worksheet!$B$42=\"\",\"\",Worksheet!$B$42)","v":"Deformation at Max Load, in.:"},{"$f":"IF(Worksheet!$D$24=\"\",\"\",Worksheet!$D$24)","v":1}]
[146,{"$f":"IF(Worksheet!$E$42=\"\",\"\",Worksheet!$E$42)","v":""},{"$f":"IF(Worksheet!$B$21=\"\",\"\",Worksheet!$B$21)","v":"Performed By Tex-117-E:"},{"$f":"IF(Worksheet!$B$42=\"\",\"\",Worksheet!$B$42)","v":"Deformation at Max Load, in.:"},{"$f":"IF(Worksheet!$E$24=\"\",\"\",Worksheet!$E$24)","v":2}]
[147,{"$f":"IF(Worksheet!$F$42=\"\",\"\",Worksheet!$F$42)","v":""},{"$f":"IF(Worksheet!$B$21=\"\",\"\",Worksheet!$B$21)","v":"Performed By Tex-117-E:"},{"$f":"IF(Worksheet!$B$42=\"\",\"\",Worksheet!$B$42)","v":"Deformation at Max Load, in.:"},{"$f":"IF(Worksheet!$F$24=\"\",\"\",Worksheet!$F$24)","v":3}]
[148,{"$f":"IF(Worksheet!$G$42=\"\",\"\",Worksheet!$G$42)","v":""},{"$f":"IF(Worksheet!$B$21=\"\",\"\",Worksheet!$B$21)","v":"Performed By Tex-117-E:"},{"$f":"IF(Worksheet!$B$42=\"\",\"\",Worksheet!$B$42)","v":"Deformation at Max Load, in.:"},{"$f":"IF(Worksheet!$G$24=\"\",\"\",Worksheet!$G$24)","v":4}]
[149,{"$f":"IF(Worksheet!$H$42=\"\",\"\",Worksheet!$H$42)","v":""},{"$f":"IF(Worksheet!$B$21=\"\",\"\",Worksheet!$B$21)","v":"Performed By Tex-117-E:"},{"$f":"IF(Worksheet!$B$42=\"\",\"\",Worksheet!$B$42)","v":"Deformation at Max Load, in.:"},{"$f":"IF(Worksheet!$H$24=\"\",\"\",Worksheet!$H$24)","v":5}]
[150,{"$f":"IF(Worksheet!$I$42=\"\",\"\",Worksheet!$I$42)","v":""},{"$f":"IF(Worksheet!$B$21=\"\",\"\",Worksheet!$B$21)","v":"Performed By Tex-117-E:"},{"$f":"IF(Worksheet!$B$42=\"\",\"\",Worksheet!$B$42)","v":"Deformation at Max Load, in.:"},{"$f":"IF(Worksheet!$I$24=\"\",\"\",Worksheet!$I$24)","v":6}]
[151,{"$f":"IF(Worksheet!$J$42=\"\",\"\",Worksheet!$J$42)","v":""},{"$f":"IF(Worksheet!$B$21=\"\",\"\",Worksheet!$B$21)","v":"Performed By Tex-117-E:"},{"$f":"IF(Worksheet!$B$42=\"\",\"\",Worksheet!$B$42)","v":"Deformation at Max Load, in.:"},{"$f":"IF(Worksheet!$J$24=\"\",\"\",Worksheet!$J$24)","v":7}]
[152,{"$f":"IF(Worksheet!$K$42=\"\",\"\",Worksheet!$K$42)","v":""},{"$f":"IF(Worksheet!$B$21=\"\",\"\",Worksheet!$B$21)","v":"Performed By Tex-117-E:"},{"$f":"IF(Worksheet!$B$42=\"\",\"\",Worksheet!$B$42)","v":"Deformation at Max Load, in.:"},{"$f":"IF(Worksheet!$K$24=\"\",\"\",Worksheet!$K$24)","v":8}]
[153,{"$f":"IF(Worksheet!$D$43=\"\",\"\",Worksheet!$D$43)","v":""},{"$f":"IF(Worksheet!$B$21=\"\",\"\",Worksheet!$B$21)","v":"Performed By Tex-117-E:"},{"$f":"IF(Worksheet!$B$43=\"\",\"\",Worksheet!$B$43)","v":"Max. Load Reading, div."},{"$f":"IF(Worksheet!$D$24=\"\",\"\",Worksheet!$D$24)","v":1}]
[154,{"$f":"IF(Worksheet!$E$43=\"\",\"\",Worksheet!$E$43)","v":""},{"$f":"IF(Worksheet!$B$21=\"\",\"\",Worksheet!$B$21)","v":"Performed By Tex-117-E:"},{"$f":"IF(Worksheet!$B$43=\"\",\"\",Worksheet!$B$43)","v":"Max. Load Reading, div."},{"$f":"IF(Worksheet!$E$24=\"\",\"\",Worksheet!$E$24)","v":2}]
[155,{"$f":"IF(Worksheet!$F$43=\"\",\"\",Worksheet!$F$43)","v":""},{"$f":"IF(Worksheet!$B$21=\"\",\"\",Worksheet!$B$21)","v":"Performed By Tex-117-E:"},{"$f":"IF(Worksheet!$B$43=\"\",\"\",Worksheet!$B$43)","v":"Max. Load Reading, div."},{"$f":"IF(Worksheet!$F$24=\"\",\"\",Worksheet!$F$24)","v":3}]
[156,{"$f":"IF(Worksheet!$G$43=\"\",\"\",Worksheet!$G$43)","v":""},{"$f":"IF(Worksheet!$B$21=\"\",\"\",Worksheet!$B$21)","v":"Performed By Tex-117-E:"},{"$f":"IF(Worksheet!$B$43=\"\",\"\",Worksheet!$B$43)","v":"Max. Load Reading, div."},{"$f":"IF(Worksheet!$G$24=\"\",\"\",Worksheet!$G$24)","v":4}]
[157,{"$f":"IF(Worksheet!$H$43=\"\",\"\",Worksheet!$H$43)","v":""},{"$f":"IF(Worksheet!$B$21=\"\",\"\",Worksheet!$B$21)","v":"Performed By Tex-117-E:"},{"$f":"IF(Worksheet!$B$43=\"\",\"\",Worksheet!$B$43)","v":"Max. Load Reading, div."},{"$f":"IF(Worksheet!$H$24=\"\",\"\",Worksheet!$H$24)","v":5}]
[158,{"$f":"IF(Worksheet!$I$43=\"\",\"\",Worksheet!$I$43)","v":""},{"$f":"IF(Worksheet!$B$21=\"\",\"\",Worksheet!$B$21)","v":"Performed By Tex-117-E:"},{"$f":"IF(Worksheet!$B$43=\"\",\"\",Worksheet!$B$43)","v":"Max. Load Reading, div."},{"$f":"IF(Worksheet!$I$24=\"\",\"\",Worksheet!$I$24)","v":6}]
[159,{"$f":"IF(Worksheet!$J$43=\"\",\"\",Worksheet!$J$43)","v":""},{"$f":"IF(Worksheet!$B$21=\"\",\"\",Worksheet!$B$21)","v":"Performed By Tex-117-E:"},{"$f":"IF(Worksheet!$B$43=\"\",\"\",Worksheet!$B$43)","v":"Max. Load Reading, div."},{"$f":"IF(Worksheet!$J$24=\"\",\"\",Worksheet!$J$24)","v":7}]
[160,{"$f":"IF(Worksheet!$K$43=\"\",\"\",Worksheet!$K$43)","v":""},{"$f":"IF(Worksheet!$B$21=\"\",\"\",Worksheet!$B$21)","v":"Performed By Tex-117-E:"},{"$f":"IF(Worksheet!$B$43=\"\",\"\",Worksheet!$B$43)","v":"Max. Load Reading, div."},{"$f":"IF(Worksheet!$K$24=\"\",\"\",Worksheet!$K$24)","v":8}]
[161,{"$f":"IF(Worksheet!$D$44=\"\",\"\",Worksheet!$D$44)","v":""},{"$f":"IF(Worksheet!$B$21=\"\",\"\",Worksheet!$B$21)","v":"Performed By Tex-117-E:"},{"$f":"IF(Worksheet!$B$44=\"\",\"\",Worksheet!$B$44)","v":"Deformation at Max Load, in."},{"$f":"IF(Worksheet!$D$24=\"\",\"\",Worksheet!$D$24)","v":1}]
[162,{"$f":"IF(Worksheet!$E$44=\"\",\"\",Worksheet!$E$44)","v":""},{"$f":"IF(Worksheet!$B$21=\"\",\"\",Worksheet!$B$21)","v":"Performed By Tex-117-E:"},{"$f":"IF(Worksheet!$B$44=\"\",\"\",Worksheet!$B$44)","v":"Deformation at Max Load, in."},{"$f":"IF(Worksheet!$E$24=\"\",\"\",Worksheet!$E$24)","v":2}]
[163,{"$f":"IF(Worksheet!$F$44=\"\",\"\",Worksheet!$F$44)","v":""},{"$f":"IF(Worksheet!$B$21=\"\",\"\",Worksheet!$B$21)","v":"Performed By Tex-117-E:"},{"$f":"IF(Worksheet!$B$44=\"\",\"\",Worksheet!$B$44)","v":"Deformation at Max Load, in."},{"$f":"IF(Worksheet!$F$24=\"\",\"\",Worksheet!$F$24)","v":3}]
[164,{"$f":"IF(Worksheet!$G$44=\"\",\"\",Worksheet!$G$44)","v":""},{"$f":"IF(Worksheet!$B$21=\"\",\"\",Worksheet!$B$21)","v":"Performed By Tex-117-E:"},{"$f":"IF(Worksheet!$B$44=\"\",\"\",Worksheet!$B$44)","v":"Deformation at Max Load, in."},{"$f":"IF(Worksheet!$G$24=\"\",\"\",Worksheet!$G$24)","v":4}]
[165,{"$f":"IF(Worksheet!$H$44=\"\",\"\",Worksheet!$H$44)","v":""},{"$f":"IF(Worksheet!$B$21=\"\",\"\",Worksheet!$B$21)","v":"Performed By Tex-117-E:"},{"$f":"IF(Worksheet!$B$44=\"\",\"\",Worksheet!$B$44)","v":"Deformation at Max Load, in."},{"$f":"IF(Worksheet!$H$24=\"\",\"\",Worksheet!$H$24)","v":5}]
[166,{"$f":"IF(Worksheet!$I$44=\"\",\"\",Worksheet!$I$44)","v":""},{"$f":"IF(Worksheet!$B$21=\"\",\"\",Worksheet!$B$21)","v":"Performed By Tex-117-E:"},{"$f":"IF(Worksheet!$B$44=\"\",\"\",Worksheet!$B$44)","v":"Deformation at Max Load, in."},{"$f":"IF(Worksheet!$I$24=\"\",\"\",Worksheet!$I$24)","v":6}]
[167,{"$f":"IF(Worksheet!$J$44=\"\",\"\",Worksheet!$J$44)","v":""},{"$f":"IF(Worksheet!$B$21=\"\",\"\",Worksheet!$B$21)","v":"Performed By Tex-117-E:"},{"$f":"IF(Worksheet!$B$44=\"\",\"\",Worksheet!$B$44)","v":"Deformation at Max Load, in."},{"$f":"IF(Worksheet!$J$24=\"\",\"\",Worksheet!$J$24)","v":7}]
[168,{"$f":"IF(Worksheet!$K$44=\"\",\"\",Worksheet!$K$44)","v":""},{"$f":"IF(Worksheet!$B$21=\"\",\"\",Worksheet!$B$21)","v":"Performed By Tex-117-E:"},{"$f":"IF(Worksheet!$B$44=\"\",\"\",Worksheet!$B$44)","v":"Deformation at Max Load, in."},{"$f":"IF(Worksheet!$K$24=\"\",\"\",Worksheet!$K$24)","v":8}]
[169,{"$f":"IF(Worksheet!$D$45=\"\",\"\",Worksheet!$D$45)","v":""},{"$f":"IF(Worksheet!$B$21=\"\",\"\",Worksheet!$B$21)","v":"Performed By Tex-117-E:"},{"$f":"IF(Worksheet!$B$45=\"\",\"\",Worksheet!$B$45)","v":"Uncorrected Stress, psi.:"},{"$f":"IF(Worksheet!$D$24=\"\",\"\",Worksheet!$D$24)","v":1}]
[170,{"$f":"IF(Worksheet!$E$45=\"\",\"\",Worksheet!$E$45)","v":""},{"$f":"IF(Worksheet!$B$21=\"\",\"\",Worksheet!$B$21)","v":"Performed By Tex-117-E:"},{"$f":"IF(Worksheet!$B$45=\"\",\"\",Worksheet!$B$45)","v":"Uncorrected Stress, psi.:"},{"$f":"IF(Worksheet!$E$24=\"\",\"\",Worksheet!$E$24)","v":2}]
[171,{"$f":"IF(Worksheet!$F$45=\"\",\"\",Worksheet!$F$45)","v":""},{"$f":"IF(Worksheet!$B$21=\"\",\"\",Worksheet!$B$21)","v":"Performed By Tex-117-E:"},{"$f":"IF(Worksheet!$B$45=\"\",\"\",Worksheet!$B$45)","v":"Uncorrected Stress, psi.:"},{"$f":"IF(Worksheet!$F$24=\"\",\"\",Worksheet!$F$24)","v":3}]
[172,{"$f":"IF(Worksheet!$G$45=\"\",\"\",Worksheet!$G$45)","v":""},{"$f":"IF(Worksheet!$B$21=\"\",\"\",Worksheet!$B$21)","v":"Performed By Tex-117-E:"},{"$f":"IF(Worksheet!$B$45=\"\",\"\",Worksheet!$B$45)","v":"Uncorrected Stress, psi.:"},{"$f":"IF(Worksheet!$G$24=\"\",\"\",Worksheet!$G$24)","v":4}]
[173,{"$f":"IF(Worksheet!$H$45=\"\",\"\",Worksheet!$H$45)","v":""},{"$f":"IF(Worksheet!$B$21=\"\",\"\",Worksheet!$B$21)","v":"Performed By Tex-117-E:"},{"$f":"IF(Worksheet!$B$45=\"\",\"\",Worksheet!$B$45)","v":"Uncorrected Stress, psi.:"},{"$f":"IF(Worksheet!$H$24=\"\",\"\",Worksheet!$H$24)","v":5}]
[174,{"$f":"IF(Worksheet!$I$45=\"\",\"\",Worksheet!$I$45)","v":""},{"$f":"IF(Worksheet!$B$21=\"\",\"\",Worksheet!$B$21)","v":"Performed By Tex-117-E:"},{"$f":"IF(Worksheet!$B$45=\"\",\"\",Worksheet!$B$45)","v":"Uncorrected Stress, psi.:"},{"$f":"IF(Worksheet!$I$24=\"\",\"\",Worksheet!$I$24)","v":6}]
[175,{"$f":"IF(Worksheet!$J$45=\"\",\"\",Worksheet!$J$45)","v":""},{"$f":"IF(Worksheet!$B$21=\"\",\"\",Worksheet!$B$21)","v":"Performed By Tex-117-E:"},{"$f":"IF(Worksheet!$B$45=\"\",\"\",Worksheet!$B$45)","v":"Uncorrected Stress, psi.:"},{"$f":"IF(Worksheet!$J$24=\"\",\"\",Worksheet!$J$24)","v":7}]
[176,{"$f":"IF(Worksheet!$K$45=\"\",\"\",Worksheet!$K$45)","v":""},{"$f":"IF(Worksheet!$B$21=\"\",\"\",Worksheet!$B$21)","v":"Performed By Tex-117-E:"},{"$f":"IF(Worksheet!$B$45=\"\",\"\",Worksheet!$B$45)","v":"Uncorrected Stress, psi.:"},{"$f":"IF(Worksheet!$K$24=\"\",\"\",Worksheet!$K$24)","v":8}]
[177,{"$f":"IF(Worksheet!$D$46=\"\",\"\",Worksheet!$D$46)","v":""},{"$f":"IF(Worksheet!$B$21=\"\",\"\",Worksheet!$B$21)","v":"Performed By Tex-117-E:"},{"$f":"IF(Worksheet!$B$46=\"\",\"\",Worksheet!$B$46)","v":"% Strain , in./in.:"},{"$f":"IF(Worksheet!$D$24=\"\",\"\",Worksheet!$D$24)","v":1}]
[178,{"$f":"IF(Worksheet!$E$46=\"\",\"\",Worksheet!$E$46)","v":""},{"$f":"IF(Worksheet!$B$21=\"\",\"\",Worksheet!$B$21)","v":"Performed By Tex-117-E:"},{"$f":"IF(Worksheet!$B$46=\"\",\"\",Worksheet!$B$46)","v":"% Strain , in./in.:"},{"$f":"IF(Worksheet!$E$24=\"\",\"\",Worksheet!$E$24)","v":2}]
[179,{"$f":"IF(Worksheet!$F$46=\"\",\"\",Worksheet!$F$46)","v":""},{"$f":"IF(Worksheet!$B$21=\"\",\"\",Worksheet!$B$21)","v":"Performed By Tex-117-E:"},{"$f":"IF(Worksheet!$B$46=\"\",\"\",Worksheet!$B$46)","v":"% Strain , in./in.:"},{"$f":"IF(Worksheet!$F$24=\"\",\"\",Worksheet!$F$24)","v":3}]
[180,{"$f":"IF(Worksheet!$G$46=\"\",\"\",Worksheet!$G$46)","v":""},{"$f":"IF(Worksheet!$B$21=\"\",\"\",Worksheet!$B$21)","v":"Performed By Tex-117-E:"},{"$f":"IF(Worksheet!$B$46=\"\",\"\",Worksheet!$B$46)","v":"% Strain , in./in.:"},{"$f":"IF(Worksheet!$G$24=\"\",\"\",Worksheet!$G$24)","v":4}]
[181,{"$f":"IF(Worksheet!$H$46=\"\",\"\",Worksheet!$H$46)","v":""},{"$f":"IF(Worksheet!$B$21=\"\",\"\",Worksheet!$B$21)","v":"Performed By Tex-117-E:"},{"$f":"IF(Worksheet!$B$46=\"\",\"\",Worksheet!$B$46)","v":"% Strain , in./in.:"},{"$f":"IF(Worksheet!$H$24=\"\",\"\",Worksheet!$H$24)","v":5}]
[182,{"$f":"IF(Worksheet!$I$46=\"\",\"\",Worksheet!$I$46)","v":""},{"$f":"IF(Worksheet!$B$21=\"\",\"\",Worksheet!$B$21)","v":"Performed By Tex-117-E:"},{"$f":"IF(Worksheet!$B$46=\"\",\"\",Worksheet!$B$46)","v":"% Strain , in./in.:"},{"$f":"IF(Worksheet!$I$24=\"\",\"\",Worksheet!$I$24)","v":6}]
[183,{"$f":"IF(Worksheet!$J$46=\"\",\"\",Worksheet!$J$46)","v":""},{"$f":"IF(Worksheet!$B$21=\"\",\"\",Worksheet!$B$21)","v":"Performed By Tex-117-E:"},{"$f":"IF(Worksheet!$B$46=\"\",\"\",Worksheet!$B$46)","v":"% Strain , in./in.:"},{"$f":"IF(Worksheet!$J$24=\"\",\"\",Worksheet!$J$24)","v":7}]
[184,{"$f":"IF(Worksheet!$K$46=\"\",\"\",Worksheet!$K$46)","v":""},{"$f":"IF(Worksheet!$B$21=\"\",\"\",Worksheet!$B$21)","v":"Performed By Tex-117-E:"},{"$f":"IF(Worksheet!$B$46=\"\",\"\",Worksheet!$B$46)","v":"% Strain , in./in.:"},{"$f":"IF(Worksheet!$K$24=\"\",\"\",Worksheet!$K$24)","v":8}]
[185,{"$f":"IF(Worksheet!$D$47=\"\",\"\",Worksheet!$D$47)","v":""},{"$f":"IF(Worksheet!$B$21=\"\",\"\",Worksheet!$B$21)","v":"Performed By Tex-117-E:"},{"$f":"IF(Worksheet!$B$47=\"\",\"\",Worksheet!$B$47)","v":"I-Strain, in./in.:"},{"$f":"IF(Worksheet!$D$24=\"\",\"\",Worksheet!$D$24)","v":1}]
[186,{"$f":"IF(Worksheet!$E$47=\"\",\"\",Worksheet!$E$47)","v":""},{"$f":"IF(Worksheet!$B$21=\"\",\"\",Worksheet!$B$21)","v":"Performed By Tex-117-E:"},{"$f":"IF(Worksheet!$B$47=\"\",\"\",Worksheet!$B$47)","v":"I-Strain, in./in.:"},{"$f":"IF(Worksheet!$E$24=\"\",\"\",Worksheet!$E$24)","v":2}]
[187,{"$f":"IF(Worksheet!$F$47=\"\",\"\",Worksheet!$F$47)","v":""},{"$f":"IF(Worksheet!$B$21=\"\",\"\",Worksheet!$B$21)","v":"Performed By Tex-117-E:"},{"$f":"IF(Worksheet!$B$47=\"\",\"\",Worksheet!$B$47)","v":"I-Strain, in./in.:"},{"$f":"IF(Worksheet!$F$24=\"\",\"\",Worksheet!$F$24)","v":3}]
[188,{"$f":"IF(Worksheet!$G$47=\"\",\"\",Worksheet!$G$47)","v":""},{"$f":"IF(Worksheet!$B$21=\"\",\"\",Worksheet!$B$21)","v":"Performed By Tex-117-E:"},{"$f":"IF(Worksheet!$B$47=\"\",\"\",Worksheet!$B$47)","v":"I-Strain, in./in.:"},{"$f":"IF(Worksheet!$G$24=\"\",\"\",Worksheet!$G$24)","v":4}]
[189,{"$f":"IF(Worksheet!$H$47=\"\",\"\",Worksheet!$H$47)","v":""},{"$f":"IF(Worksheet!$B$21=\"\",\"\",Worksheet!$B$21)","v":"Performed By Tex-117-E:"},{"$f":"IF(Worksheet!$B$47=\"\",\"\",Worksheet!$B$47)","v":"I-Strain, in./in.:"},{"$f":"IF(Worksheet!$H$24=\"\",\"\",Worksheet!$H$24)","v":5}]
[190,{"$f":"IF(Worksheet!$I$47=\"\",\"\",Worksheet!$I$47)","v":""},{"$f":"IF(Worksheet!$B$21=\"\",\"\",Worksheet!$B$21)","v":"Performed By Tex-117-E:"},{"$f":"IF(Worksheet!$B$47=\"\",\"\",Worksheet!$B$47)","v":"I-Strain, in./in.:"},{"$f":"IF(Worksheet!$I$24=\"\",\"\",Worksheet!$I$24)","v":6}]
[191,{"$f":"IF(Worksheet!$J$47=\"\",\"\",Worksheet!$J$47)","v":""},{"$f":"IF(Worksheet!$B$21=\"\",\"\",Worksheet!$B$21)","v":"Performed By Tex-117-E:"},{"$f":"IF(Worksheet!$B$47=\"\",\"\",Worksheet!$B$47)","v":"I-Strain, in./in.:"},{"$f":"IF(Worksheet!$J$24=\"\",\"\",Worksheet!$J$24)","v":7}]
[192,{"$f":"IF(Worksheet!$K$47=\"\",\"\",Worksheet!$K$47)","v":""},{"$f":"IF(Worksheet!$B$21=\"\",\"\",Worksheet!$B$21)","v":"Performed By Tex-117-E:"},{"$f":"IF(Worksheet!$B$47=\"\",\"\",Worksheet!$B$47)","v":"I-Strain, in./in.:"},{"$f":"IF(Worksheet!$K$24=\"\",\"\",Worksheet!$K$24)","v":8}]
[193,{"$f":"IF(Worksheet!$D$48=\"\",\"\",Worksheet!$D$48)","v":""},{"$f":"IF(Worksheet!$B$21=\"\",\"\",Worksheet!$B$21)","v":"Performed By Tex-117-E:"},{"$f":"IF(Worksheet!$B$48=\"\",\"\",Worksheet!$B$48)","v":"Corrected Stress, psi.:"},{"$f":"IF(Worksheet!$D$24=\"\",\"\",Worksheet!$D$24)","v":1}]
[194,{"$f":"IF(Worksheet!$E$48=\"\",\"\",Worksheet!$E$48)","v":""},{"$f":"IF(Worksheet!$B$21=\"\",\"\",Worksheet!$B$21)","v":"Performed By Tex-117-E:"},{"$f":"IF(Worksheet!$B$48=\"\",\"\",Worksheet!$B$48)","v":"Corrected Stress, psi.:"},{"$f":"IF(Worksheet!$E$24=\"\",\"\",Worksheet!$E$24)","v":2}]
[195,{"$f":"IF(Worksheet!$F$48=\"\",\"\",Worksheet!$F$48)","v":""},{"$f":"IF(Worksheet!$B$21=\"\",\"\",Worksheet!$B$21)","v":"Performed By Tex-117-E:"},{"$f":"IF(Worksheet!$B$48=\"\",\"\",Worksheet!$B$48)","v":"Corrected Stress, psi.:"},{"$f":"IF(Worksheet!$F$24=\"\",\"\",Worksheet!$F$24)","v":3}]
[196,{"$f":"IF(Worksheet!$G$48=\"\",\"\",Worksheet!$G$48)","v":""},{"$f":"IF(Worksheet!$B$21=\"\",\"\",Worksheet!$B$21)","v":"Performed By Tex-117-E:"},{"$f":"IF(Worksheet!$B$48=\"\",\"\",Worksheet!$B$48)","v":"Corrected Stress, psi.:"},{"$f":"IF(Worksheet!$G$24=\"\",\"\",Worksheet!$G$24)","v":4}]
[197,{"$f":"IF(Worksheet!$H$48=\"\",\"\",Worksheet!$H$48)","v":""},{"$f":"IF(Worksheet!$B$21=\"\",\"\",Worksheet!$B$21)","v":"Performed By Tex-117-E:"},{"$f":"IF(Worksheet!$B$48=\"\",\"\",Worksheet!$B$48)","v":"Corrected Stress, psi.:"},{"$f":"IF(Worksheet!$H$24=\"\",\"\",Worksheet!$H$24)","v":5}]
[198,{"$f":"IF(Worksheet!$I$48=\"\",\"\",Worksheet!$I$48)","v":""},{"$f":"IF(Worksheet!$B$21=\"\",\"\",Worksheet!$B$21)","v":"Performed By Tex-117-E:"},{"$f":"IF(Worksheet!$B$48=\"\",\"\",Worksheet!$B$48)","v":"Corrected Stress, psi.:"},{"$f":"IF(Worksheet!$I$24=\"\",\"\",Worksheet!$I$24)","v":6}]
[199,{"$f":"IF(Worksheet!$J$48=\"\",\"\",Worksheet!$J$48)","v":""},{"$f":"IF(Worksheet!$B$21=\"\",\"\",Worksheet!$B$21)","v":"Performed By Tex-117-E:"},{"$f":"IF(Worksheet!$B$48=\"\",\"\",Worksheet!$B$48)","v":"Corrected Stress, psi.:"},{"$f":"IF(Worksheet!$J$24=\"\",\"\",Worksheet!$J$24)","v":7}]
[200,{"$f":"IF(Worksheet!$K$48=\"\",\"\",Worksheet!$K$48)","v":""},{"$f":"IF(Worksheet!$B$21=\"\",\"\",Worksheet!$B$21)","v":"Performed By Tex-117-E:"},{"$f":"IF(Worksheet!$B$48=\"\",\"\",Worksheet!$B$48)","v":"Corrected Stress, psi.:"},{"$f":"IF(Worksheet!$K$24=\"\",\"\",Worksheet!$K$24)","v":8}]
[201,{"$f":"IF(Worksheet!$D$50=\"\",\"\",Worksheet!$D$50)","v":""},{"$f":"IF(Worksheet!$B$21=\"\",\"\",Worksheet!$B$21)","v":"Performed By Tex-117-E:"},{"$f":"IF(Worksheet!$B$50=\"\",\"\",Worksheet!$B$50)","v":"Classification:"}]
[202,{"$f":"IF(Worksheet!$D$51=\"\",\"\",Worksheet!$D$51)","v":""},{"$f":"IF(Worksheet!$B$21=\"\",\"\",Worksheet!$B$21)","v":"Performed By Tex-117-E:"},{"$f":"IF(Worksheet!$B$51=\"\",\"\",Worksheet!$B$51)","v":"Internal Angle of Friction:"}]
[203,{"$f":"IF(Worksheet!$D$52=\"\",\"\",Worksheet!$D$52)","v":""},{"$f":"IF(Worksheet!$B$21=\"\",\"\",Worksheet!$B$21)","v":"Performed By Tex-117-E:"},{"$f":"IF(Worksheet!$B$52=\"\",\"\",Worksheet!$B$52)","v":"Cohesion, psi:"}]
[204,{"$f":"IF(Worksheet!$D$53=\"\",\"\",Worksheet!$D$53)","v":""},{"$f":"IF(Worksheet!$B$21=\"\",\"\",Worksheet!$B$21)","v":"Performed By Tex-117-E:"},{"$f":"IF(Worksheet!$B$53=\"\",\"\",Worksheet!$B$53)","v":"Correlation Factor:"}]
[205,{"$f":"IF(Worksheet!$J$51=\"\",\"\",Worksheet!$J$51)","v":""},{"$f":"IF(Worksheet!$B$21=\"\",\"\",Worksheet!$B$21)","v":"Performed By Tex-117-E:"},{"$f":"IF(Worksheet!$H$51=\"\",\"\",Worksheet!$H$51)","v":"Average Corrected Strength:"},{"$f":"IF(Worksheet!$J$50=\"\",\"\",Worksheet!$J$50)","v":"00 psi"}]
[206,{"$f":"IF(Worksheet!$K$51=\"\",\"\",Worksheet!$K$51)","v":""},{"$f":"IF(Worksheet!$B$21=\"\",\"\",Worksheet!$B$21)","v":"Performed By Tex-117-E:"},{"$f":"IF(Worksheet!$H$51=\"\",\"\",Worksheet!$H$51)","v":"Average Corrected Strength:"},{"$f":"IF(Worksheet!$K$50=\"\",\"\",Worksheet!$K$50)","v":"15 psi"}]
[207,{"$f":"IF(Worksheet!$J$52=\"\",\"\",Worksheet!$J$52)","v":""},{"$f":"IF(Worksheet!$B$21=\"\",\"\",Worksheet!$B$21)","v":"Performed By Tex-117-E:"},{"$f":"IF(Worksheet!$H$52=\"\",\"\",Worksheet!$H$52)","v":"Grade:"},{"$f":"IF(Worksheet!$J$50=\"\",\"\",Worksheet!$J$50)","v":"00 psi"}]
[208,{"$f":"IF(Worksheet!$K$52=\"\",\"\",Worksheet!$K$52)","v":""},{"$f":"IF(Worksheet!$B$21=\"\",\"\",Worksheet!$B$21)","v":"Performed By Tex-117-E:"},{"$f":"IF(Worksheet!$H$52=\"\",\"\",Worksheet!$H$52)","v":"Grade:"},{"$f":"IF(Worksheet!$K$50=\"\",\"\",Worksheet!$K$50)","v":"15 psi"}]
[209,{"$f":"IF('Tex-113,4-E'!$E$22=\"\",\"\",'Tex-113,4-E'!$E$22)","v":""},{"$f":"IF('Tex-113,4-E'!$B$7=\"\",\"\",'Tex-113,4-E'!$B$7)","v":"TEX-113-E or Tex-114-E"},{"$f":"IF('Tex-113,4-E'!$B$22=\"\",\"\",'Tex-113,4-E'!$B$22)","v":"Percent of Lime, (%)"}]
[210,{"$f":"IF('Tex-113,4-E'!$E$23=\"\",\"\",'Tex-113,4-E'!$E$23)","v":""},{"$f":"IF('Tex-113,4-E'!$B$7=\"\",\"\",'Tex-113,4-E'!$B$7)","v":"TEX-113-E or Tex-114-E"},{"$f":"IF('Tex-113,4-E'!$B$23=\"\",\"\",'Tex-113,4-E'!$B$23)","v":"Oven Dry Weight, (g):"}]
[211,{"$f":"IF('Tex-113,4-E'!$E$24=\"\",\"\",'Tex-113,4-E'!$E$24)","v":""},{"$f":"IF('Tex-113,4-E'!$B$7=\"\",\"\",'Tex-113,4-E'!$B$7)","v":"TEX-113-E or Tex-114-E"},{"$f":"IF('Tex-113,4-E'!$B$24=\"\",\"\",'Tex-113,4-E'!$B$24)","v":"Weight of Pycnometer & Water, (g):"}]
[212,{"$f":"IF('Tex-113,4-E'!$E$25=\"\",\"\",'Tex-113,4-E'!$E$25)","v":""},{"$f":"IF('Tex-113,4-E'!$B$7=\"\",\"\",'Tex-113,4-E'!$B$7)","v":"TEX-113-E or Tex-114-E"},{"$f":"IF('Tex-113,4-E'!$B$25=\"\",\"\",'Tex-113,4-E'!$B$25)","v":"Weight of Aggr., Pycn.& Water, (g):"}]
[213,{"$f":"IF('Tex-113,4-E'!$E$26=\"\",\"\",'Tex-113,4-E'!$E$26)","v":""},{"$f":"IF('Tex-113,4-E'!$B$7=\"\",\"\",'Tex-113,4-E'!$B$7)","v":"TEX-113-E or Tex-114-E"},{"$f":"IF('Tex-113,4-E'!$B$26=\"\",\"\",'Tex-113,4-E'!$B$26)","v":"Specific Gravity (Apparent):"}]
[214,{"$f":"IF('Tex-113,4-E'!$E$28=\"\",\"\",'Tex-113,4-E'!$E$28)","v":""},{"$f":"IF('Tex-113,4-E'!$B$7=\"\",\"\",'Tex-113,4-E'!$B$7)","v":"TEX-113-E or Tex-114-E"},{"$f":"IF('Tex-113,4-E'!$B$28=\"\",\"\",'Tex-113,4-E'!$B$28)","v":"Hygroscopic Moisture, (%):"}]
[215,{"$f":"IF('Tex-113,4-E'!$E$31=\"\",\"\",'Tex-113,4-E'!$E$31)","v":""},{"$f":"IF('Tex-113,4-E'!$B$7=\"\",\"\",'Tex-113,4-E'!$B$7)","v":"TEX-113-E or Tex-114-E"},{"$f":"IF('Tex-113,4-E'!$B$31=\"\",\"\",'Tex-113,4-E'!$B$31)","v":"Percent Water Content, (%):"},{"$f":"IF('Tex-113,4-E'!$E$30=\"\",\"\",'Tex-113,4-E'!$E$30)","v":1}]
[216,{"$f":"IF('Tex-113,4-E'!$F$31=\"\",\"\",'Tex-113,4-E'!$F$31)","v":""},{"$f":"IF('Tex-113,4-E'!$B$7=\"\",\"\",'Tex-113,4-E'!$B$7)","v":"TEX-113-E or Tex-114-E"},{"$f":"IF('Tex-113,4-E'!$B$31=\"\",\"\",'Tex-113,4-E'!$B$31)","v":"Percent Water Content, (%):"},{"$f":"IF('Tex-113,4-E'!$F$30=\"\",\"\",'Tex-113,4-E'!$F$30)","v":2}]
[217,{"$f":"IF('Tex-113,4-E'!$G$31=\"\",\"\",'Tex-113,4-E'!$G$31)","v":""},{"$f":"IF('Tex-113,4-E'!$B$7=\"\",\"\",'Tex-113,4-E'!$B$7)","v":"TEX-113-E or Tex-114-E"},{"$f":"IF('Tex-113,4-E'!$B$31=\"\",\"\",'Tex-113,4-E'!$B$31)","v":"Percent Water Content, (%):"},{"$f":"IF('Tex-113,4-E'!$G$30=\"\",\"\",'Tex-113,4-E'!$G$30)","v":3}]
[218,{"$f":"IF('Tex-113,4-E'!$H$31=\"\",\"\",'Tex-113,4-E'!$H$31)","v":""},{"$f":"IF('Tex-113,4-E'!$B$7=\"\",\"\",'Tex-113,4-E'!$B$7)","v":"TEX-113-E or Tex-114-E"},{"$f":"IF('Tex-113,4-E'!$B$31=\"\",\"\",'Tex-113,4-E'!$B$31)","v":"Percent Water Content, (%):"},{"$f":"IF('Tex-113,4-E'!$H$30=\"\",\"\",'Tex-113,4-E'!$H$30)","v":4}]
[219,{"$f":"IF('Tex-113,4-E'!$E$32=\"\",\"\",'Tex-113,4-E'!$E$32)","v":""},{"$f":"IF('Tex-113,4-E'!$B$7=\"\",\"\",'Tex-113,4-E'!$B$7)","v":"TEX-113-E or Tex-114-E"},{"$f":"IF('Tex-113,4-E'!$B$32=\"\",\"\",'Tex-113,4-E'!$B$32)","v":"Percent Lime, (%):"},{"$f":"IF('Tex-113,4-E'!$E$30=\"\",\"\",'Tex-113,4-E'!$E$30)","v":1}]
[220,{"$f":"IF('Tex-113,4-E'!$F$32=\"\",\"\",'Tex-113,4-E'!$F$32)","v":""},{"$f":"IF('Tex-113,4-E'!$B$7=\"\",\"\",'Tex-113,4-E'!$B$7)","v":"TEX-113-E or Tex-114-E"},{"$f":"IF('Tex-113,4-E'!$B$32=\"\",\"\",'Tex-113,4-E'!$B$32)","v":"Percent Lime, (%):"},{"$f":"IF('Tex-113,4-E'!$F$30=\"\",\"\",'Tex-113,4-E'!$F$30)","v":2}]
[221,{"$f":"IF('Tex-113,4-E'!$G$32=\"\",\"\",'Tex-113,4-E'!$G$32)","v":""},{"$f":"IF('Tex-113,4-E'!$B$7=\"\",\"\",'Tex-113,4-E'!$B$7)","v":"TEX-113-E or Tex-114-E"},{"$f":"IF('Tex-113,4-E'!$B$32=\"\",\"\",'Tex-113,4-E'!$B$32)","v":"Percent Lime, (%):"},{"$f":"IF('Tex-113,4-E'!$G$30=\"\",\"\",'Tex-113,4-E'!$G$30)","v":3}]
[222,{"$f":"IF('Tex-113,4-E'!$H$32=\"\",\"\",'Tex-113,4-E'!$H$32)","v":""},{"$f":"IF('Tex-113,4-E'!$B$7=\"\",\"\",'Tex-113,4-E'!$B$7)","v":"TEX-113-E or Tex-114-E"},{"$f":"IF('Tex-113,4-E'!$B$32=\"\",\"\",'Tex-113,4-E'!$B$32)","v":"Percent Lime, (%):"},{"$f":"IF('Tex-113,4-E'!$H$30=\"\",\"\",'Tex-113,4-E'!$H$30)","v":4}]
[223,{"$f":"IF('Tex-113,4-E'!$E$33=\"\",\"\",'Tex-113,4-E'!$E$33)","v":""},{"$f":"IF('Tex-113,4-E'!$B$7=\"\",\"\",'Tex-113,4-E'!$B$7)","v":"TEX-113-E or Tex-114-E"},{"$f":"IF('Tex-113,4-E'!$B$33=\"\",\"\",'Tex-113,4-E'!$B$33)","v":"Mass Material, (lb):"},{"$f":"IF('Tex-113,4-E'!$E$30=\"\",\"\",'Tex-113,4-E'!$E$30)","v":1}]
[224,{"$f":"IF('Tex-113,4-E'!$F$33=\"\",\"\",'Tex-113,4-E'!$F$33)","v":""},{"$f":"IF('Tex-113,4-E'!$B$7=\"\",\"\",'Tex-113,4-E'!$B$7)","v":"TEX-113-E or Tex-114-E"},{"$f":"IF('Tex-113,4-E'!$B$33=\"\",\"\",'Tex-113,4-E'!$B$33)","v":"Mass Material, (lb):"},{"$f":"IF('Tex-113,4-E'!$F$30=\"\",\"\",'Tex-113,4-E'!$F$30)","v":2}]
[225,{"$f":"IF('Tex-113,4-E'!$G$33=\"\",\"\",'Tex-113,4-E'!$G$33)","v":""},{"$f":"IF('Tex-113,4-E'!$B$7=\"\",\"\",'Tex-113,4-E'!$B$7)","v":"TEX-113-E or Tex-114-E"},{"$f":"IF('Tex-113,4-E'!$B$33=\"\",\"\",'Tex-113,4-E'!$B$33)","v":"Mass Material, (lb):"},{"$f":"IF('Tex-113,4-E'!$G$30=\"\",\"\",'Tex-113,4-E'!$G$30)","v":3}]
[226,{"$f":"IF('Tex-113,4-E'!$H$33=\"\",\"\",'Tex-113,4-E'!$H$33)","v":""},{"$f":"IF('Tex-113,4-E'!$B$7=\"\",\"\",'Tex-113,4-E'!$B$7)","v":"TEX-113-E or Tex-114-E"},{"$f":"IF('Tex-113,4-E'!$B$33=\"\",\"\",'Tex-113,4-E'!$B$33)","v":"Mass Material, (lb):"},{"$f":"IF('Tex-113,4-E'!$H$30=\"\",\"\",'Tex-113,4-E'!$H$30)","v":4}]
[227,{"$f":"IF('Tex-113,4-E'!$E$34=\"\",\"\",'Tex-113,4-E'!$E$34)","v":""},{"$f":"IF('Tex-113,4-E'!$B$7=\"\",\"\",'Tex-113,4-E'!$B$7)","v":"TEX-113-E or Tex-114-E"},{"$f":"IF('Tex-113,4-E'!$B$34=\"\",\"\",'Tex-113,4-E'!$B$34)","v":"Mass Water Added, (lb):"},{"$f":"IF('Tex-113,4-E'!$E$30=\"\",\"\",'Tex-113,4-E'!$E$30)","v":1}]
[228,{"$f":"IF('Tex-113,4-E'!$F$34=\"\",\"\",'Tex-113,4-E'!$F$34)","v":""},{"$f":"IF('Tex-113,4-E'!$B$7=\"\",\"\",'Tex-113,4-E'!$B$7)","v":"TEX-113-E or Tex-114-E"},{"$f":"IF('Tex-113,4-E'!$B$34=\"\",\"\",'Tex-113,4-E'!$B$34)","v":"Mass Water Added, (lb):"},{"$f":"IF('Tex-113,4-E'!$F$30=\"\",\"\",'Tex-113,4-E'!$F$30)","v":2}]
[229,{"$f":"IF('Tex-113,4-E'!$G$34=\"\",\"\",'Tex-113,4-E'!$G$34)","v":""},{"$f":"IF('Tex-113,4-E'!$B$7=\"\",\"\",'Tex-113,4-E'!$B$7)","v":"TEX-113-E or Tex-114-E"},{"$f":"IF('Tex-113,4-E'!$B$34=\"\",\"\",'Tex-113,4-E'!$B$34)","v":"Mass Water Added, (lb):"},{"$f":"IF('Tex-113,4-E'!$G$30=\"\",\"\",'Tex-113,4-E'!$G$30)","v":3}]
[230,{"$f":"IF('Tex-113,4-E'!$H$34=\"\",\"\",'Tex-113,4-E'!$H$34)","v":""},{"$f":"IF('Tex-113,4-E'!$B$7=\"\",\"\",'Tex-113,4-E'!$B$7)","v":"TEX-113-E or Tex-114-E"},{"$f":"IF('Tex-113,4-E'!$B$34=\"\",\"\",'Tex-113,4-E'!$B$34)","v":"Mass Water Added, (lb):"},{"$f":"IF('Tex-113,4-E'!$H$30=\"\",\"\",'Tex-113,4-E'!$H$30)","v":4}]
[231,{"$f":"IF('Tex-113,4-E'!$E$35=\"\",\"\",'Tex-113,4-E'!$E$35)","v":""},{"$f":"IF('Tex-113,4-E'!$B$7=\"\",\"\",'Tex-113,4-E'!$B$7)","v":"TEX-113-E or Tex-114-E"},{"$f":"IF('Tex-113,4-E'!$B$35=\"\",\"\",'Tex-113,4-E'!$B$35)","v":"Mass Lime Added, (lb):"},{"$f":"IF('Tex-113,4-E'!$E$30=\"\",\"\",'Tex-113,4-E'!$E$30)","v":1}]
[232,{"$f":"IF('Tex-113,4-E'!$F$35=\"\",\"\",'Tex-113,4-E'!$F$35)","v":""},{"$f":"IF('Tex-113,4-E'!$B$7=\"\",\"\",'Tex-113,4-E'!$B$7)","v":"TEX-113-E or Tex-114-E"},{"$f":"IF('Tex-113,4-E'!$B$35=\"\",\"\",'Tex-113,4-E'!$B$35)","v":"Mass Lime Added, (lb):"},{"$f":"IF('Tex-113,4-E'!$F$30=\"\",\"\",'Tex-113,4-E'!$F$30)","v":2}]
[233,{"$f":"IF('Tex-113,4-E'!$G$35=\"\",\"\",'Tex-113,4-E'!$G$35)","v":""},{"$f":"IF('Tex-113,4-E'!$B$7=\"\",\"\",'Tex-113,4-E'!$B$7)","v":"TEX-113-E or Tex-114-E"},{"$f":"IF('Tex-113,4-E'!$B$35=\"\",\"\",'Tex-113,4-E'!$B$35)","v":"Mass Lime Added, (lb):"},{"$f":"IF('Tex-113,4-E'!$G$30=\"\",\"\",'Tex-113,4-E'!$G$30)","v":3}]
[234,{"$f":"IF('Tex-113,4-E'!$H$35=\"\",\"\",'Tex-113,4-E'!$H$35)","v":""},{"$f":"IF('Tex-113,4-E'!$B$7=\"\",\"\",'Tex-113,4-E'!$B$7)","v":"TEX-113-E or Tex-114-E"},{"$f":"IF('Tex-113,4-E'!$B$35=\"\",\"\",'Tex-113,4-E'!$B$35)","v":"Mass Lime Added, (lb):"},{"$f":"IF('Tex-113,4-E'!$H$30=\"\",\"\",'Tex-113,4-E'!$H$30)","v":4}]
[235,{"$f":"IF('Tex-113,4-E'!$E$36=\"\",\"\",'Tex-113,4-E'!$E$36)","v":""},{"$f":"IF('Tex-113,4-E'!$B$7=\"\",\"\",'Tex-113,4-E'!$B$7)","v":"TEX-113-E or Tex-114-E"},{"$f":"IF('Tex-113,4-E'!$B$36=\"\",\"\",'Tex-113,4-E'!$B$36)","v":"Wet Mass Specimen & Mold, (lb):"},{"$f":"IF('Tex-113,4-E'!$E$30=\"\",\"\",'Tex-113,4-E'!$E$30)","v":1}]
[236,{"$f":"IF('Tex-113,4-E'!$F$36=\"\",\"\",'Tex-113,4-E'!$F$36)","v":""},{"$f":"IF('Tex-113,4-E'!$B$7=\"\",\"\",'Tex-113,4-E'!$B$7)","v":"TEX-113-E or Tex-114-E"},{"$f":"IF('Tex-113,4-E'!$B$36=\"\",\"\",'Tex-113,4-E'!$B$36)","v":"Wet Mass Specimen & Mold, (lb):"},{"$f":"IF('Tex-113,4-E'!$F$30=\"\",\"\",'Tex-113,4-E'!$F$30)","v":2}]
[237,{"$f":"IF('Tex-113,4-E'!$G$36=\"\",\"\",'Tex-113,4-E'!$G$36)","v":""},{"$f":"IF('Tex-113,4-E'!$B$7=\"\",\"\",'Tex-113,4-E'!$B$7)","v":"TEX-113-E or Tex-114-E"},{"$f":"IF('Tex-113,4-E'!$B$36=\"\",\"\",'Tex-113,4-E'!$B$36)","v":"Wet Mass Specimen & Mold, (lb):"},{"$f":"IF('Tex-113,4-E'!$G$30=\"\",\"\",'Tex-113,4-E'!$G$30)","v":3}]
[238,{"$f":"IF('Tex-113,4-E'!$H$36=\"\",\"\",'Tex-113,4-E'!$H$36)","v":""},{"$f":"IF('Tex-113,4-E'!$B$7=\"\",\"\",'Tex-113,4-E'!$B$7)","v":"TEX-113-E or Tex-114-E"},{"$f":"IF('Tex-113,4-E'!$B$36=\"\",\"\",'Tex-113,4-E'!$B$36)","v":"Wet Mass Specimen & Mold, (lb):"},{"$f":"IF('Tex-113,4-E'!$H$30=\"\",\"\",'Tex-113,4-E'!$H$30)","v":4}]
[239,{"$f":"IF('Tex-113,4-E'!$E$37=\"\",\"\",'Tex-113,4-E'!$E$37)","v":""},{"$f":"IF('Tex-113,4-E'!$B$7=\"\",\"\",'Tex-113,4-E'!$B$7)","v":"TEX-113-E or Tex-114-E"},{"$f":"IF('Tex-113,4-E'!$B$37=\"\",\"\",'Tex-113,4-E'!$B$37)","v":"Tare Mass Mold, (lb):"},{"$f":"IF('Tex-113,4-E'!$E$30=\"\",\"\",'Tex-113,4-E'!$E$30)","v":1}]
[240,{"$f":"IF('Tex-113,4-E'!$F$37=\"\",\"\",'Tex-113,4-E'!$F$37)","v":""},{"$f":"IF('Tex-113,4-E'!$B$7=\"\",\"\",'Tex-113,4-E'!$B$7)","v":"TEX-113-E or Tex-114-E"},{"$f":"IF('Tex-113,4-E'!$B$37=\"\",\"\",'Tex-113,4-E'!$B$37)","v":"Tare Mass Mold, (lb):"},{"$f":"IF('Tex-113,4-E'!$F$30=\"\",\"\",'Tex-113,4-E'!$F$30)","v":2}]
[241,{"$f":"IF('Tex-113,4-E'!$G$37=\"\",\"\",'Tex-113,4-E'!$G$37)","v":""},{"$f":"IF('Tex-113,4-E'!$B$7=\"\",\"\",'Tex-113,4-E'!$B$7)","v":"TEX-113-E or Tex-114-E"},{"$f":"IF('Tex-113,4-E'!$B$37=\"\",\"\",'Tex-113,4-E'!$B$37)","v":"Tare Mass Mold, (lb):"},{"$f":"IF('Tex-113,4-E'!$G$30=\"\",\"\",'Tex-113,4-E'!$G$30)","v":3}]
[242,{"$f":"IF('Tex-113,4-E'!$H$37=\"\",\"\",'Tex-113,4-E'!$H$37)","v":""},{"$f":"IF('Tex-113,4-E'!$B$7=\"\",\"\",'Tex-113,4-E'!$B$7)","v":"TEX-113-E or Tex-114-E"},{"$f":"IF('Tex-113,4-E'!$B$37=\"\",\"\",'Tex-113,4-E'!$B$37)","v":"Tare Mass Mold, (lb):"},{"$f":"IF('Tex-113,4-E'!$H$30=\"\",\"\",'Tex-113,4-E'!$H$30)","v":4}]
[243,{"$f":"IF('Tex-113,4-E'!$E$38=\"\",\"\",'Tex-113,4-E'!$E$38)","v":""},{"$f":"IF('Tex-113,4-E'!$B$7=\"\",\"\",'Tex-113,4-E'!$B$7)","v":"TEX-113-E or Tex-114-E"},{"$f":"IF('Tex-113,4-E'!$B$38=\"\",\"\",'Tex-113,4-E'!$B$38)","v":"Wet Mass Specimen, (lb):"},{"$f":"IF('Tex-113,4-E'!$E$30=\"\",\"\",'Tex-113,4-E'!$E$30)","v":1}]
[244,{"$f":"IF('Tex-113,4-E'!$F$38=\"\",\"\",'Tex-113,4-E'!$F$38)","v":""},{"$f":"IF('Tex-113,4-E'!$B$7=\"\",\"\",'Tex-113,4-E'!$B$7)","v":"TEX-113-E or Tex-114-E"},{"$f":"IF('Tex-113,4-E'!$B$38=\"\",\"\",'Tex-113,4-E'!$B$38)","v":"Wet Mass Specimen, (lb):"},{"$f":"IF('Tex-113,4-E'!$F$30=\"\",\"\",'Tex-113,4-E'!$F$30)","v":2}]
[245,{"$f":"IF('Tex-113,4-E'!$G$38=\"\",\"\",'Tex-113,4-E'!$G$38)","v":""},{"$f":"IF('Tex-113,4-E'!$B$7=\"\",\"\",'Tex-113,4-E'!$B$7)","v":"TEX-113-E or Tex-114-E"},{"$f":"IF('Tex-113,4-E'!$B$38=\"\",\"\",'Tex-113,4-E'!$B$38)","v":"Wet Mass Specimen, (lb):"},{"$f":"IF('Tex-113,4-E'!$G$30=\"\",\"\",'Tex-113,4-E'!$G$30)","v":3}]
[246,{"$f":"IF('Tex-113,4-E'!$H$38=\"\",\"\",'Tex-113,4-E'!$H$38)","v":""},{"$f":"IF('Tex-113,4-E'!$B$7=\"\",\"\",'Tex-113,4-E'!$B$7)","v":"TEX-113-E or Tex-114-E"},{"$f":"IF('Tex-113,4-E'!$B$38=\"\",\"\",'Tex-113,4-E'!$B$38)","v":"Wet Mass Specimen, (lb):"},{"$f":"IF('Tex-113,4-E'!$H$30=\"\",\"\",'Tex-113,4-E'!$H$30)","v":4}]
[247,{"$f":"IF('Tex-113,4-E'!$E$39=\"\",\"\",'Tex-113,4-E'!$E$39)","v":""},{"$f":"IF('Tex-113,4-E'!$B$7=\"\",\"\",'Tex-113,4-E'!$B$7)","v":"TEX-113-E or Tex-114-E"},{"$f":"IF('Tex-113,4-E'!$B$39=\"\",\"\",'Tex-113,4-E'!$B$39)","v":"Height of Specimen, (in.):"},{"$f":"IF('Tex-113,4-E'!$E$30=\"\",\"\",'Tex-113,4-E'!$E$30)","v":1}]
[248,{"$f":"IF('Tex-113,4-E'!$F$39=\"\",\"\",'Tex-113,4-E'!$F$39)","v":""},{"$f":"IF('Tex-113,4-E'!$B$7=\"\",\"\",'Tex-113,4-E'!$B$7)","v":"TEX-113-E or Tex-114-E"},{"$f":"IF('Tex-113,4-E'!$B$39=\"\",\"\",'Tex-113,4-E'!$B$39)","v":"Height of Specimen, (in.):"},{"$f":"IF('Tex-113,4-E'!$F$30=\"\",\"\",'Tex-113,4-E'!$F$30)","v":2}]
[249,{"$f":"IF('Tex-113,4-E'!$G$39=\"\",\"\",'Tex-113,4-E'!$G$39)","v":""},{"$f":"IF('Tex-113,4-E'!$B$7=\"\",\"\",'Tex-113,4-E'!$B$7)","v":"TEX-113-E or Tex-114-E"},{"$f":"IF('Tex-113,4-E'!$B$39=\"\",\"\",'Tex-113,4-E'!$B$39)","v":"Height of Specimen, (in.):"},{"$f":"IF('Tex-113,4-E'!$G$30=\"\",\"\",'Tex-113,4-E'!$G$30)","v":3}]
[250,{"$f":"IF('Tex-113,4-E'!$H$39=\"\",\"\",'Tex-113,4-E'!$H$39)","v":""},{"$f":"IF('Tex-113,4-E'!$B$7=\"\",\"\",'Tex-113,4-E'!$B$7)","v":"TEX-113-E or Tex-114-E"},{"$f":"IF('Tex-113,4-E'!$B$39=\"\",\"\",'Tex-113,4-E'!$B$39)","v":"Height of Specimen, (in.):"},{"$f":"IF('Tex-113,4-E'!$H$30=\"\",\"\",'Tex-113,4-E'!$H$30)","v":4}]
[251,{"$f":"IF('Tex-113,4-E'!$E$40=\"\",\"\",'Tex-113,4-E'!$E$40)","v":""},{"$f":"IF('Tex-113,4-E'!$B$7=\"\",\"\",'Tex-113,4-E'!$B$7)","v":"TEX-113-E or Tex-114-E"},{"$f":"IF('Tex-113,4-E'!$B$40=\"\",\"\",'Tex-113,4-E'!$B$40)","v":"Volume per Linear mm., (in.):"},{"$f":"IF('Tex-113,4-E'!$E$30=\"\",\"\",'Tex-113,4-E'!$E$30)","v":1}]
[252,{"$f":"IF('Tex-113,4-E'!$F$40=\"\",\"\",'Tex-113,4-E'!$F$40)","v":""},{"$f":"IF('Tex-113,4-E'!$B$7=\"\",\"\",'Tex-113,4-E'!$B$7)","v":"TEX-113-E or Tex-114-E"},{"$f":"IF('Tex-113,4-E'!$B$40=\"\",\"\",'Tex-113,4-E'!$B$40)","v":"Volume per Linear mm., (in.):"},{"$f":"IF('Tex-113,4-E'!$F$30=\"\",\"\",'Tex-113,4-E'!$F$30)","v":2}]
[253,{"$f":"IF('Tex-113,4-E'!$G$40=\"\",\"\",'Tex-113,4-E'!$G$40)","v":""},{"$f":"IF('Tex-113,4-E'!$B$7=\"\",\"\",'Tex-113,4-E'!$B$7)","v":"TEX-113-E or Tex-114-E"},{"$f":"IF('Tex-113,4-E'!$B$40=\"\",\"\",'Tex-113,4-E'!$B$40)","v":"Volume per Linear mm., (in.):"},{"$f":"IF('Tex-113,4-E'!$G$30=\"\",\"\",'Tex-113,4-E'!$G$30)","v":3}]
[254,{"$f":"IF('Tex-113,4-E'!$H$40=\"\",\"\",'Tex-113,4-E'!$H$40)","v":""},{"$f":"IF('Tex-113,4-E'!$B$7=\"\",\"\",'Tex-113,4-E'!$B$7)","v":"TEX-113-E or Tex-114-E"},{"$f":"IF('Tex-113,4-E'!$B$40=\"\",\"\",'Tex-113,4-E'!$B$40)","v":"Volume per Linear mm., (in.):"},{"$f":"IF('Tex-113,4-E'!$H$30=\"\",\"\",'Tex-113,4-E'!$H$30)","v":4}]
[255,{"$f":"IF('Tex-113,4-E'!$E$41=\"\",\"\",'Tex-113,4-E'!$E$41)","v":""},{"$f":"IF('Tex-113,4-E'!$B$7=\"\",\"\",'Tex-113,4-E'!$B$7)","v":"TEX-113-E or Tex-114-E"},{"$f":"IF('Tex-113,4-E'!$B$41=\"\",\"\",'Tex-113,4-E'!$B$41)","v":"Volume of Specimen, (ft^3):"},{"$f":"IF('Tex-113,4-E'!$E$30=\"\",\"\",'Tex-113,4-E'!$E$30)","v":1}]
[256,{"$f":"IF('Tex-113,4-E'!$F$41=\"\",\"\",'Tex-113,4-E'!$F$41)","v":""},{"$f":"IF('Tex-113,4-E'!$B$7=\"\",\"\",'Tex-113,4-E'!$B$7)","v":"TEX-113-E or Tex-114-E"},{"$f":"IF('Tex-113,4-E'!$B$41=\"\",\"\",'Tex-113,4-E'!$B$41)","v":"Volume of Specimen, (ft^3):"},{"$f":"IF('Tex-113,4-E'!$F$30=\"\",\"\",'Tex-113,4-E'!$F$30)","v":2}]
[257,{"$f":"IF('Tex-113,4-E'!$G$41=\"\",\"\",'Tex-113,4-E'!$G$41)","v":""},{"$f":"IF('Tex-113,4-E'!$B$7=\"\",\"\",'Tex-113,4-E'!$B$7)","v":"TEX-113-E or Tex-114-E"},{"$f":"IF('Tex-113,4-E'!$B$41=\"\",\"\",'Tex-113,4-E'!$B$41)","v":"Volume of Specimen, (ft^3):"},{"$f":"IF('Tex-113,4-E'!$G$30=\"\",\"\",'Tex-113,4-E'!$G$30)","v":3}]
[258,{"$f":"IF('Tex-113,4-E'!$H$41=\"\",\"\",'Tex-113,4-E'!$H$41)","v":""},{"$f":"IF('Tex-113,4-E'!$B$7=\"\",\"\",'Tex-113,4-E'!$B$7)","v":"TEX-113-E or Tex-114-E"},{"$f":"IF('Tex-113,4-E'!$B$41=\"\",\"\",'Tex-113,4-E'!$B$41)","v":"Volume of Specimen, (ft^3):"},{"$f":"IF('Tex-113,4-E'!$H$30=\"\",\"\",'Tex-113,4-E'!$H$30)","v":4}]
[259,{"$f":"IF('Tex-113,4-E'!$E$42=\"\",\"\",'Tex-113,4-E'!$E$42)","v":""},{"$f":"IF('Tex-113,4-E'!$B$7=\"\",\"\",'Tex-113,4-E'!$B$7)","v":"TEX-113-E or Tex-114-E"},{"$f":"IF('Tex-113,4-E'!$B$42=\"\",\"\",'Tex-113,4-E'!$B$42)","v":"Wet Density of Specimen, (lb):"},{"$f":"IF('Tex-113,4-E'!$E$30=\"\",\"\",'Tex-113,4-E'!$E$30)","v":1}]
[260,{"$f":"IF('Tex-113,4-E'!$F$42=\"\",\"\",'Tex-113,4-E'!$F$42)","v":""},{"$f":"IF('Tex-113,4-E'!$B$7=\"\",\"\",'Tex-113,4-E'!$B$7)","v":"TEX-113-E or Tex-114-E"},{"$f":"IF('Tex-113,4-E'!$B$42=\"\",\"\",'Tex-113,4-E'!$B$42)","v":"Wet Density of Specimen, (lb):"},{"$f":"IF('Tex-113,4-E'!$F$30=\"\",\"\",'Tex-113,4-E'!$F$30)","v":2}]
[261,{"$f":"IF('Tex-113,4-E'!$G$42=\"\",\"\",'Tex-113,4-E'!$G$42)","v":""},{"$f":"IF('Tex-113,4-E'!$B$7=\"\",\"\",'Tex-113,4-E'!$B$7)","v":"TEX-113-E or Tex-114-E"},{"$f":"IF('Tex-113,4-E'!$B$42=\"\",\"\",'Tex-113,4-E'!$B$42)","v":"Wet Density of Specimen, (lb):"},{"$f":"IF('Tex-113,4-E'!$G$30=\"\",\"\",'Tex-113,4-E'!$G$30)","v":3}]
[262,{"$f":"IF('Tex-113,4-E'!$H$42=\"\",\"\",'Tex-113,4-E'!$H$42)","v":""},{"$f":"IF('Tex-113,4-E'!$B$7=\"\",\"\",'Tex-113,4-E'!$B$7)","v":"TEX-113-E or Tex-114-E"},{"$f":"IF('Tex-113,4-E'!$B$42=\"\",\"\",'Tex-113,4-E'!$B$42)","v":"Wet Density of Specimen, (lb):"},{"$f":"IF('Tex-113,4-E'!$H$30=\"\",\"\",'Tex-113,4-E'!$H$30)","v":4}]
[263,{"$f":"IF('Tex-113,4-E'!$E$43=\"\",\"\",'Tex-113,4-E'!$E$43)","v":""},{"$f":"IF('Tex-113,4-E'!$B$7=\"\",\"\",'Tex-113,4-E'!$B$7)","v":"TEX-113-E or Tex-114-E"},{"$f":"IF('Tex-113,4-E'!$B$43=\"\",\"\",'Tex-113,4-E'!$B$43)","v":"Wet Mass of Pan & Specimen, (lb):"},{"$f":"IF('Tex-113,4-E'!$E$30=\"\",\"\",'Tex-113,4-E'!$E$30)","v":1}]
[264,{"$f":"IF('Tex-113,4-E'!$F$43=\"\",\"\",'Tex-113,4-E'!$F$43)","v":""},{"$f":"IF('Tex-113,4-E'!$B$7=\"\",\"\",'Tex-113,4-E'!$B$7)","v":"TEX-113-E or Tex-114-E"},{"$f":"IF('Tex-113,4-E'!$B$43=\"\",\"\",'Tex-113,4-E'!$B$43)","v":"Wet Mass of Pan & Specimen, (lb):"},{"$f":"IF('Tex-113,4-E'!$F$30=\"\",\"\",'Tex-113,4-E'!$F$30)","v":2}]
[265,{"$f":"IF('Tex-113,4-E'!$G$43=\"\",\"\",'Tex-113,4-E'!$G$43)","v":""},{"$f":"IF('Tex-113,4-E'!$B$7=\"\",\"\",'Tex-113,4-E'!$B$7)","v":"TEX-113-E or Tex-114-E"},{"$f":"IF('Tex-113,4-E'!$B$43=\"\",\"\",'Tex-113,4-E'!$B$43)","v":"Wet Mass of Pan & Specimen, (lb):"},{"$f":"IF('Tex-113,4-E'!$G$30=\"\",\"\",'Tex-113,4-E'!$G$30)","v":3}]
[266,{"$f":"IF('Tex-113,4-E'!$H$43=\"\",\"\",'Tex-113,4-E'!$H$43)","v":""},{"$f":"IF('Tex-113,4-E'!$B$7=\"\",\"\",'Tex-113,4-E'!$B$7)","v":"TEX-113-E or Tex-114-E"},{"$f":"IF('Tex-113,4-E'!$B$43=\"\",\"\",'Tex-113,4-E'!$B$43)","v":"Wet Mass of Pan & Specimen, (lb):"},{"$f":"IF('Tex-113,4-E'!$H$30=\"\",\"\",'Tex-113,4-E'!$H$30)","v":4}]
[267,{"$f":"IF('Tex-113,4-E'!$E$44=\"\",\"\",'Tex-113,4-E'!$E$44)","v":""},{"$f":"IF('Tex-113,4-E'!$B$7=\"\",\"\",'Tex-113,4-E'!$B$7)","v":"TEX-113-E or Tex-114-E"},{"$f":"IF('Tex-113,4-E'!$B$44=\"\",\"\",'Tex-113,4-E'!$B$44)","v":"Dry Mass Pan & Specimen, (lb):"},{"$f":"IF('Tex-113,4-E'!$E$30=\"\",\"\",'Tex-113,4-E'!$E$30)","v":1}]
[268,{"$f":"IF('Tex-113,4-E'!$F$44=\"\",\"\",'Tex-113,4-E'!$F$44)","v":""},{"$f":"IF('Tex-113,4-E'!$B$7=\"\",\"\",'Tex-113,4-E'!$B$7)","v":"TEX-113-E or Tex-114-E"},{"$f":"IF('Tex-113,4-E'!$B$44=\"\",\"\",'Tex-113,4-E'!$B$44)","v":"Dry Mass Pan & Specimen, (lb):"},{"$f":"IF('Tex-113,4-E'!$F$30=\"\",\"\",'Tex-113,4-E'!$F$30)","v":2}]
[269,{"$f":"IF('Tex-113,4-E'!$G$44=\"\",\"\",'Tex-113,4-E'!$G$44)","v":""},{"$f":"IF('Tex-113,4-E'!$B$7=\"\",\"\",'Tex-113,4-E'!$B$7)","v":"TEX-113-E or Tex-114-E"},{"$f":"IF('Tex-113,4-E'!$B$44=\"\",\"\",'Tex-113,4-E'!$B$44)","v":"Dry Mass Pan & Specimen, (lb):"},{"$f":"IF('Tex-113,4-E'!$G$30=\"\",\"\",'Tex-113,4-E'!$G$30)","v":3}]
[270,{"$f":"IF('Tex-113,4-E'!$H$44=\"\",\"\",'Tex-113,4-E'!$H$44)","v":""},{"$f":"IF('Tex-113,4-E'!$B$7=\"\",\"\",'Tex-113,4-E'!$B$7)","v":"TEX-113-E or Tex-114-E"},{"$f":"IF('Tex-113,4-E'!$B$44=\"\",\"\",'Tex-113,4-E'!$B$44)","v":"Dry Mass Pan & Specimen, (lb):"},{"$f":"IF('Tex-113,4-E'!$H$30=\"\",\"\",'Tex-113,4-E'!$H$30)","v":4}]
[271,{"$f":"IF('Tex-113,4-E'!$E$45=\"\",\"\",'Tex-113,4-E'!$E$45)","v":""},{"$f":"IF('Tex-113,4-E'!$B$7=\"\",\"\",'Tex-113,4-E'!$B$7)","v":"TEX-113-E or Tex-114-E"},{"$f":"IF('Tex-113,4-E'!$B$45=\"\",\"\",'Tex-113,4-E'!$B$45)","v":"Tare Mass Pan, (lb):"},{"$f":"IF('Tex-113,4-E'!$E$30=\"\",\"\",'Tex-113,4-E'!$E$30)","v":1}]
[272,{"$f":"IF('Tex-113,4-E'!$F$45=\"\",\"\",'Tex-113,4-E'!$F$45)","v":""},{"$f":"IF('Tex-113,4-E'!$B$7=\"\",\"\",'Tex-113,4-E'!$B$7)","v":"TEX-113-E or Tex-114-E"},{"$f":"IF('Tex-113,4-E'!$B$45=\"\",\"\",'Tex-113,4-E'!$B$45)","v":"Tare Mass Pan, (lb):"},{"$f":"IF('Tex-113,4-E'!$F$30=\"\",\"\",'Tex-113,4-E'!$F$30)","v":2}]
[273,{"$f":"IF('Tex-113,4-E'!$G$45=\"\",\"\",'Tex-113,4-E'!$G$45)","v":""},{"$f":"IF('Tex-113,4-E'!$B$7=\"\",\"\",'Tex-113,4-E'!$B$7)","v":"TEX-113-E or Tex-114-E"},{"$f":"IF('Tex-113,4-E'!$B$45=\"\",\"\",'Tex-113,4-E'!$B$45)","v":"Tare Mass Pan, (lb):"},{"$f":"IF('Tex-113,4-E'!$G$30=\"\",\"\",'Tex-113,4-E'!$G$30)","v":3}]
[274,{"$f":"IF('Tex-113,4-E'!$H$45=\"\",\"\",'Tex-113,4-E'!$H$45)","v":""},{"$f":"IF('Tex-113,4-E'!$B$7=\"\",\"\",'Tex-113,4-E'!$B$7)","v":"TEX-113-E or Tex-114-E"},{"$f":"IF('Tex-113,4-E'!$B$45=\"\",\"\",'Tex-113,4-E'!$B$45)","v":"Tare Mass Pan, (lb):"},{"$f":"IF('Tex-113,4-E'!$H$30=\"\",\"\",'Tex-113,4-E'!$H$30)","v":4}]
[275,{"$f":"IF('Tex-113,4-E'!$E$46=\"\",\"\",'Tex-113,4-E'!$E$46)","v":""},{"$f":"IF('Tex-113,4-E'!$B$7=\"\",\"\",'Tex-113,4-E'!$B$7)","v":"TEX-113-E or Tex-114-E"},{"$f":"IF('Tex-113,4-E'!$B$46=\"\",\"\",'Tex-113,4-E'!$B$46)","v":"Dry Mass Material , (lb):"},{"$f":"IF('Tex-113,4-E'!$E$30=\"\",\"\",'Tex-113,4-E'!$E$30)","v":1}]
[276,{"$f":"IF('Tex-113,4-E'!$F$46=\"\",\"\",'Tex-113,4-E'!$F$46)","v":""},{"$f":"IF('Tex-113,4-E'!$B$7=\"\",\"\",'Tex-113,4-E'!$B$7)","v":"TEX-113-E or Tex-114-E"},{"$f":"IF('Tex-113,4-E'!$B$46=\"\",\"\",'Tex-113,4-E'!$B$46)","v":"Dry Mass Material , (lb):"},{"$f":"IF('Tex-113,4-E'!$F$30=\"\",\"\",'Tex-113,4-E'!$F$30)","v":2}]
[277,{"$f":"IF('Tex-113,4-E'!$G$46=\"\",\"\",'Tex-113,4-E'!$G$46)","v":""},{"$f":"IF('Tex-113,4-E'!$B$7=\"\",\"\",'Tex-113,4-E'!$B$7)","v":"TEX-113-E or Tex-114-E"},{"$f":"IF('Tex-113,4-E'!$B$46=\"\",\"\",'Tex-113,4-E'!$B$46)","v":"Dry Mass Material , (lb):"},{"$f":"IF('Tex-113,4-E'!$G$30=\"\",\"\",'Tex-113,4-E'!$G$30)","v":3}]
[278,{"$f":"IF('Tex-113,4-E'!$H$46=\"\",\"\",'Tex-113,4-E'!$H$46)","v":""},{"$f":"IF('Tex-113,4-E'!$B$7=\"\",\"\",'Tex-113,4-E'!$B$7)","v":"TEX-113-E or Tex-114-E"},{"$f":"IF('Tex-113,4-E'!$B$46=\"\",\"\",'Tex-113,4-E'!$B$46)","v":"Dry Mass Material , (lb):"},{"$f":"IF('Tex-113,4-E'!$H$30=\"\",\"\",'Tex-113,4-E'!$H$30)","v":4}]
[279,{"$f":"IF('Tex-113,4-E'!$E$47=\"\",\"\",'Tex-113,4-E'!$E$47)","v":""},{"$f":"IF('Tex-113,4-E'!$B$7=\"\",\"\",'Tex-113,4-E'!$B$7)","v":"TEX-113-E or Tex-114-E"},{"$f":"IF('Tex-113,4-E'!$B$47=\"\",\"\",'Tex-113,4-E'!$B$47)","v":"Mass Water, (lb):"},{"$f":"IF('Tex-113,4-E'!$E$30=\"\",\"\",'Tex-113,4-E'!$E$30)","v":1}]
[280,{"$f":"IF('Tex-113,4-E'!$F$47=\"\",\"\",'Tex-113,4-E'!$F$47)","v":""},{"$f":"IF('Tex-113,4-E'!$B$7=\"\",\"\",'Tex-113,4-E'!$B$7)","v":"TEX-113-E or Tex-114-E"},{"$f":"IF('Tex-113,4-E'!$B$47=\"\",\"\",'Tex-113,4-E'!$B$47)","v":"Mass Water, (lb):"},{"$f":"IF('Tex-113,4-E'!$F$30=\"\",\"\",'Tex-113,4-E'!$F$30)","v":2}]
[281,{"$f":"IF('Tex-113,4-E'!$G$47=\"\",\"\",'Tex-113,4-E'!$G$47)","v":""},{"$f":"IF('Tex-113,4-E'!$B$7=\"\",\"\",'Tex-113,4-E'!$B$7)","v":"TEX-113-E or Tex-114-E"},{"$f":"IF('Tex-113,4-E'!$B$47=\"\",\"\",'Tex-113,4-E'!$B$47)","v":"Mass Water, (lb):"},{"$f":"IF('Tex-113,4-E'!$G$30=\"\",\"\",'Tex-113,4-E'!$G$30)","v":3}]
[282,{"$f":"IF('Tex-113,4-E'!$H$47=\"\",\"\",'Tex-113,4-E'!$H$47)","v":""},{"$f":"IF('Tex-113,4-E'!$B$7=\"\",\"\",'Tex-113,4-E'!$B$7)","v":"TEX-113-E or Tex-114-E"},{"$f":"IF('Tex-113,4-E'!$B$47=\"\",\"\",'Tex-113,4-E'!$B$47)","v":"Mass Water, (lb):"},{"$f":"IF('Tex-113,4-E'!$H$30=\"\",\"\",'Tex-113,4-E'!$H$30)","v":4}]
[283,{"$f":"IF('Tex-113,4-E'!$E$48=\"\",\"\",'Tex-113,4-E'!$E$48)","v":""},{"$f":"IF('Tex-113,4-E'!$B$7=\"\",\"\",'Tex-113,4-E'!$B$7)","v":"TEX-113-E or Tex-114-E"},{"$f":"IF('Tex-113,4-E'!$B$48=\"\",\"\",'Tex-113,4-E'!$B$48)","v":"Percent Water on Total , (%):"},{"$f":"IF('Tex-113,4-E'!$E$30=\"\",\"\",'Tex-113,4-E'!$E$30)","v":1}]
[284,{"$f":"IF('Tex-113,4-E'!$F$48=\"\",\"\",'Tex-113,4-E'!$F$48)","v":""},{"$f":"IF('Tex-113,4-E'!$B$7=\"\",\"\",'Tex-113,4-E'!$B$7)","v":"TEX-113-E or Tex-114-E"},{"$f":"IF('Tex-113,4-E'!$B$48=\"\",\"\",'Tex-113,4-E'!$B$48)","v":"Percent Water on Total , (%):"},{"$f":"IF('Tex-113,4-E'!$F$30=\"\",\"\",'Tex-113,4-E'!$F$30)","v":2}]
[285,{"$f":"IF('Tex-113,4-E'!$G$48=\"\",\"\",'Tex-113,4-E'!$G$48)","v":""},{"$f":"IF('Tex-113,4-E'!$B$7=\"\",\"\",'Tex-113,4-E'!$B$7)","v":"TEX-113-E or Tex-114-E"},{"$f":"IF('Tex-113,4-E'!$B$48=\"\",\"\",'Tex-113,4-E'!$B$48)","v":"Percent Water on Total , (%):"},{"$f":"IF('Tex-113,4-E'!$G$30=\"\",\"\",'Tex-113,4-E'!$G$30)","v":3}]
[286,{"$f":"IF('Tex-113,4-E'!$H$48=\"\",\"\",'Tex-113,4-E'!$H$48)","v":""},{"$f":"IF('Tex-113,4-E'!$B$7=\"\",\"\",'Tex-113,4-E'!$B$7)","v":"TEX-113-E or Tex-114-E"},{"$f":"IF('Tex-113,4-E'!$B$48=\"\",\"\",'Tex-113,4-E'!$B$48)","v":"Percent Water on Total , (%):"},{"$f":"IF('Tex-113,4-E'!$H$30=\"\",\"\",'Tex-113,4-E'!$H$30)","v":4}]
[287,{"$f":"IF('Tex-113,4-E'!$E$49=\"\",\"\",'Tex-113,4-E'!$E$49)","v":""},{"$f":"IF('Tex-113,4-E'!$B$7=\"\",\"\",'Tex-113,4-E'!$B$7)","v":"TEX-113-E or Tex-114-E"},{"$f":"IF('Tex-113,4-E'!$B$49=\"\",\"\",'Tex-113,4-E'!$B$49)","v":"Dry Density, (pcf):"},{"$f":"IF('Tex-113,4-E'!$E$30=\"\",\"\",'Tex-113,4-E'!$E$30)","v":1}]
[288,{"$f":"IF('Tex-113,4-E'!$F$49=\"\",\"\",'Tex-113,4-E'!$F$49)","v":""},{"$f":"IF('Tex-113,4-E'!$B$7=\"\",\"\",'Tex-113,4-E'!$B$7)","v":"TEX-113-E or Tex-114-E"},{"$f":"IF('Tex-113,4-E'!$B$49=\"\",\"\",'Tex-113,4-E'!$B$49)","v":"Dry Density, (pcf):"},{"$f":"IF('Tex-113,4-E'!$F$30=\"\",\"\",'Tex-113,4-E'!$F$30)","v":2}]
[289,{"$f":"IF('Tex-113,4-E'!$G$49=\"\",\"\",'Tex-113,4-E'!$G$49)","v":""},{"$f":"IF('Tex-113,4-E'!$B$7=\"\",\"\",'Tex-113,4-E'!$B$7)","v":"TEX-113-E or Tex-114-E"},{"$f":"IF('Tex-113,4-E'!$B$49=\"\",\"\",'Tex-113,4-E'!$B$49)","v":"Dry Density, (pcf):"},{"$f":"IF('Tex-113,4-E'!$G$30=\"\",\"\",'Tex-113,4-E'!$G$30)","v":3}]
[290,{"$f":"IF('Tex-113,4-E'!$H$49=\"\",\"\",'Tex-113,4-E'!$H$49)","v":""},{"$f":"IF('Tex-113,4-E'!$B$7=\"\",\"\",'Tex-113,4-E'!$B$7)","v":"TEX-113-E or Tex-114-E"},{"$f":"IF('Tex-113,4-E'!$B$49=\"\",\"\",'Tex-113,4-E'!$B$49)","v":"Dry Density, (pcf):"},{"$f":"IF('Tex-113,4-E'!$H$30=\"\",\"\",'Tex-113,4-E'!$H$30)","v":4}]
[291,{"$f":"IF('Tex-113,4-E'!$E$50=\"\",\"\",'Tex-113,4-E'!$E$50)","v":""},{"$f":"IF('Tex-113,4-E'!$B$7=\"\",\"\",'Tex-113,4-E'!$B$7)","v":"TEX-113-E or Tex-114-E"},{"$f":"IF('Tex-113,4-E'!$B$50=\"\",\"\",'Tex-113,4-E'!$B$50)","v":"Estimated Dry Density, (pcf):"},{"$f":"IF('Tex-113,4-E'!$E$30=\"\",\"\",'Tex-113,4-E'!$E$30)","v":1}]
[292,{"$f":"IF('Tex-113,4-E'!$F$50=\"\",\"\",'Tex-113,4-E'!$F$50)","v":""},{"$f":"IF('Tex-113,4-E'!$B$7=\"\",\"\",'Tex-113,4-E'!$B$7)","v":"TEX-113-E or Tex-114-E"},{"$f":"IF('Tex-113,4-E'!$B$50=\"\",\"\",'Tex-113,4-E'!$B$50)","v":"Estimated Dry Density, (pcf):"},{"$f":"IF('Tex-113,4-E'!$F$30=\"\",\"\",'Tex-113,4-E'!$F$30)","v":2}]
[293,{"$f":"IF('Tex-113,4-E'!$G$50=\"\",\"\",'Tex-113,4-E'!$G$50)","v":""},{"$f":"IF('Tex-113,4-E'!$B$7=\"\",\"\",'Tex-113,4-E'!$B$7)","v":"TEX-113-E or Tex-114-E"},{"$f":"IF('Tex-113,4-E'!$B$50=\"\",\"\",'Tex-113,4-E'!$B$50)","v":"Estimated Dry Density, (pcf):"},{"$f":"IF('Tex-113,4-E'!$G$30=\"\",\"\",'Tex-113,4-E'!$G$30)","v":3}]
[294,{"$f":"IF('Tex-113,4-E'!$H$50=\"\",\"\",'Tex-113,4-E'!$H$50)","v":""},{"$f":"IF('Tex-113,4-E'!$B$7=\"\",\"\",'Tex-113,4-E'!$B$7)","v":"TEX-113-E or Tex-114-E"},{"$f":"IF('Tex-113,4-E'!$B$50=\"\",\"\",'Tex-113,4-E'!$B$50)","v":"Estimated Dry Density, (pcf):"},{"$f":"IF('Tex-113,4-E'!$H$30=\"\",\"\",'Tex-113,4-E'!$H$30)","v":4}]
[295,{"$f":"IF('Tex-113,4-E'!$E$51=\"\",\"\",'Tex-113,4-E'!$E$51)","v":""},{"$f":"IF('Tex-113,4-E'!$B$7=\"\",\"\",'Tex-113,4-E'!$B$7)","v":"TEX-113-E or Tex-114-E"},{"$f":"IF('Tex-113,4-E'!$B$51=\"\",\"\",'Tex-113,4-E'!$B$51)","v":"Max Density, (pcf):"}]
[296,{"$f":"IF('Tex-113,4-E'!$E$52=\"\",\"\",'Tex-113,4-E'!$E$52)","v":""},{"$f":"IF('Tex-113,4-E'!$B$7=\"\",\"\",'Tex-113,4-E'!$B$7)","v":"TEX-113-E or Tex-114-E"},{"$f":"IF('Tex-113,4-E'!$B$52=\"\",\"\",'Tex-113,4-E'!$B$52)","v":"Max Density, (kg/m3):"}]
[297,{"$f":"IF('Tex-113,4-E'!$E$53=\"\",\"\",'Tex-113,4-E'!$E$53)","v":""},{"$f":"IF('Tex-113,4-E'!$B$7=\"\",\"\",'Tex-113,4-E'!$B$7)","v":"TEX-113-E or Tex-114-E"},{"$f":"IF('Tex-113,4-E'!$B$53=\"\",\"\",'Tex-113,4-E'!$B$53)","v":"Optimum Moisture, (%):"}]
[298,{"$f":"IF('Tex-113,4-E'!$B$56=\"\",\"\",'Tex-113,4-E'!$B$56)","v":""},{"$f":"IF('Tex-113,4-E'!$B$7=\"\",\"\",'Tex-113,4-E'!$B$7)","v":"TEX-113-E or Tex-114-E"},{"$f":"'Tex-113,4-E'!$B$55","v":"Remarks:"}]
[299,{"$f":"IF(Worksheet!$C$62=\"\",\"\",Worksheet!$C$62)","v":""},"Sampled By",{"$f":"IF(Worksheet!$B$62=\"\",\"\",Worksheet!$B$62)","v":"TX100"}]
[300,{"$f":"IF(Worksheet!$F$62=\"\",\"\",Worksheet!$F$62)","v":""},"Sampled Date",{"$f":"IF(Worksheet!$B$62=\"\",\"\",Worksheet!$B$62)","v":"TX100"}]
[301,{"$f":"IF(Worksheet!$C$64=\"\",\"\",Worksheet!$C$64)","v":""},"Sampled By",{"$f":"IF(Worksheet!$B$64=\"\",\"\",Worksheet!$B$64)","v":"TX400"}]
[302,{"$f":"IF(Worksheet!$F$64=\"\",\"\",Worksheet!$F$64)","v":""},"Sampled Date",{"$f":"IF(Worksheet!$B$64=\"\",\"\",Worksheet!$B$64)","v":"TX400"}]

{"sheet":"Revisions","index":17,"n_rows":2,"n_cols":4,"rows_kept":2,"cut":false,"hidden":true,"merged":[]}
["Date","Changes","By","Comments"]
["2005-08-05","AuthorizePersion from B61 to B63, Authorized date from E61 to E63","Joe Liu"]