{"text_format":"1","workbook":"xlsx","n_sheets":18,"sheets":["Worksheet","Tex-113,4-E","Reference","00 psi","03 psi","05 psi","07 psi","10 psi","15 psi","00 psi (2)","20 psi","Summary","Mohr Analysis","Mohr Circles","Classification","Classification Chart","RX","Revisions"],"not_rendered":{"charts":6,"images":1,"macros":1,"external_links":0,"defined_names":416,"comments":1,"pivot_tables":0},"unopened":[{"sheet":"Mohr Circles","index":13,"reason":"not_a_worksheet"},{"sheet":"Classification Chart","index":15,"reason":"not_a_worksheet"}],"bounds":{"document_bytes":16777216,"sheet_cells":100000,"rows_first":2000,"rows_last":500,"rows_between":2000,"halvings":0,"cell_chars":16384,"cell_head_chars":4096},"cells_cut":0,"cells_raw":0,"read":"whole","date_system":"1900"}

{"sheet":"Worksheet","index":0,"n_rows":71,"n_cols":11,"rows_kept":71,"cut":false,"hidden":false,"merged":[[7,3,7,4],[7,7,7,8],[0,0,0,1],[45,1,45,2],[46,1,46,2],[37,1,37,2],[28,1,28,2],[43,1,43,2],[44,1,44,2],[38,1,38,2],[36,1,36,2],[25,1,25,2],[9,7,9,8],[8,3,8,4],[8,7,8,8],[10,3,10,4],[30,1,30,2],[31,1,31,2],[32,1,32,2],[29,1,29,2],[35,1,35,2],[33,1,33,2],[20,5,20,6],[23,1,23,2],[26,1,26,2],[24,1,24,2],[27,1,27,2],[20,1,20,4],[22,1,22,10],[9,3,9,4],[16,7,16,8],[10,7,10,8],[11,7,11,8],[11,3,11,4],[12,3,12,4],[12,7,12,8],[15,3,15,8],[13,7,13,8],[13,3,13,4],[16,3,16,4],[14,3,14,8],[39,1,39,2],[34,1,34,2],[40,1,40,2],[67,1,67,3],[63,2,63,4],[62,2,62,4],[42,1,42,2],[59,1,59,8],[56,1,57,8],[58,1,58,8],[52,7,52,10],[52,1,52,2],[51,7,51,8],[50,1,50,2],[47,1,47,2],[49,1,49,2],[67,6,67,8],[71,1,71,3],[65,2,65,4],[64,2,64,4],[41,1,41,2],[50,7,50,8],[51,1,51,2],[60,2,60,4],[61,2,61,4]]}
["TxDOT Manuals >",null,null,"Tex-121-E","Tex-117-E"]
[null,"TEXAS DEPARTMENT OF TRANSPORTATION",null,null,null,null,null,null,null,null,288]
[null,null,null,null,null,null,null,null,null,null,3]
[null,null,null,null,null,null,null,null,null,null,"tx121.xlsm::45505.684178"]
[null,"SOIL-LIME TESTING: TEX-121-E"]
[null,"TRIAXIAL COMPRESSION TEST Tex-117-E"]
[null,null,null,null,null,null,null,null,{"$f":"\"File Version: \" & TEXT(MID(sn,SEARCH(\"::\",sn,1)+2,20),\"mm/dd/yy hh:mm:ss\")","v":"File Version: 08/01/24 16:25:13"}]
[null,null,"SAMPLE ID:",null,null,null,"SAMPLED DATE:"]
[null,null,"TEST NUMBER:",null,null,null,"LETTING DATE:"]
[null,null,"SAMPLE STATUS:",null,null,null,"CONTROLLING CSJ:"]
[null,null,"COUNTY:",null,null,null,"SPEC YEAR:"]
[null,null,"SAMPLED BY:",null,null,null,"SPEC ITEM:"]
[null,null,"SAMPLE LOCATION:",null,null,null,"SPECIAL PROVISION:"]
[null,null,"MATERIAL CODE:",null,null,null,"GRADE:"]
[null,null,"MATERIAL NAME:"]
{"$rows_left_out":57}
{"sheet":"Tex-113,4-E","index":1,"n_rows":61,"n_cols":10,"rows_kept":61,"cut":false,"hidden":false,"merged":[[60,2,60,4],[57,2,57,4],[58,2,58,4],[50,1,50,3],[51,1,51,3],[52,1,52,3],[55,1,56,8],[0,0,0,1],[46,1,46,3],[47,1,47,3],[48,1,48,3],[27,1,27,3],[30,1,30,3],[32,1,32,3],[33,1,33,3],[35,1,35,3],[36,1,36,3],[16,3,16,8],[17,3,17,4],[17,7,17,8],[37,1,37,3],[21,1,21,3],[31,1,31,3],[49,1,49,3],[42,1,42,3],[43,1,43,3],[38,1,38,3],[39,1,39,3],[40,1,40,3],[41,1,41,3],[45,1,45,3],[44,1,44,3],[34,1,34,3],[22,1,22,3],[23,1,23,3],[24,1,24,3],[25,1,25,3],[8,3,8,4],[11,3,11,4],[14,3,14,4],[15,3,15,8],[8,7,8,8],[9,3,9,4],[9,7,9,8],[10,3,10,4],[10,7,10,8],[11,7,11,8],[12,3,12,4],[12,7,12,8],[13,3,13,4],[13,7,13,8],[14,7,14,8]]}
["TxDOT Manuals >",null,null,"Tex-113-E"]
[null,"TEXAS DEPARTMENT OF TRANSPORTATION"]
[null,{"$f":"IF(Location=\"\",\"\",Location)","v":""}]
[null,null,null,null,null,null,null,null,null,"Tx113,4.xls::37445.433542"]
[null,"SOIL-LIME TESTING: TEX-121-E",null,null,null,null,null,null,null,45]
[null,"Moisture-Density Relations of Base Material & Sand or Subgrade & Embankment Soils"]
[null,"TEX-113-E or Tex-114-E"]
[null,null,null,null,null,null,null,null,{"$f":"\"Tx113,4 File Version: \" & TEXT(MID(_sn113,SEARCH(\"::\",_sn113,1)+2,20),\"mm/dd/yy hh:mm:ss\")","v":"Tx113,4 File Version: 07/08/02 10:24:18"}]
[null,null,"SAMPLE ID:",{"$f":"IF(SampleId=\"\",\"\",SampleId)","v":""},{"$f":"IF(Location=\"\",\"\",Location)","v":""},null,"SAMPLED DATE:",{"$f":"IF(SampledDate=\"\",\"\",SampledDate)","v":""},{"$f":"IF(Location=\"\",\"\",Location)","v":""}]
[null,null,"TEST NUMBER:",{"$f":"IF(TestNumber=\"\",\"\",TestNumber)","v":""},"",null,"LETTING DATE:",{"$f":"IF(LettingDate=\"\",\"\",LettingDate)","v":""},""]
[null,null,"SAMPLE STATUS:",{"$f":"IF(Status=\"\",\"\",Status)","v":""},"",null,"CONTROLLING CSJ:",{"$f":"IF(CCSJ=\"\",\"\",CCSJ)","v":""},""]
[null,null,"COUNTY:",{"$f":"IF(County=\"\",\"\",County)","v":""},"",null,"SPEC YEAR:",{"$f":"IF(SpecYear=\"\",\"\",SpecYear)","v":""},""]
[null,null,"SAMPLED BY:",{"$f":"IF(SampledBy=\"\",\"\",SampledBy)","v":""},"",null,"SPEC ITEM:",{"$f":"IF(SpecItem=\"\",\"\",SpecItem)","v":""},""]
[null,null,"SAMPLE LOCATION:",{"$f":"IF(SampleLocation=\"\",\"\",SampleLocation)","v":""},"",null,"SPECIAL PROVISION:",{"$f":"IF(SpecialProvision=\"\",\"\",SpecialProvision)","v":""},""]
[null,null,"MATERIAL CODE:",{"$f":"IF(Material=\"\",\"\",Material)","v":""},"",null,"GRADE:",{"$f":"IF(Grade=\"\",\"\",Grade)","v":""},""]
{"$rows_left_out":47}
{"sheet":"Reference","index":2,"n_rows":201,"n_cols":5,"rows_kept":201,"cut":false,"hidden":true,"merged":[]}
["m1",{"$f":"(B12-B11)/(C12-C11)","v":{"$error":"#VALUE!"}}]
["b1",{"$f":"B11-B1*C11","v":{"$error":"#VALUE!"}},"X-Peak",{"$f":"(B4-B2)/(B1-B3)","v":{"$error":"#VALUE!"}}]
["m2",{"$f":"IF(AND(B13>0,'Tex-113,4-E'!H47=0),B1*-1,(B14-B13)/(C14-C13))","v":{"$error":"#VALUE!"}},"Y-Peak",{"$f":"B1*D2+B2","v":{"$error":"#VALUE!"}}]
["b2",{"$f":"B13-C13*B3","v":{"$error":"#VALUE!"}}]
[]
[]
[]
[]
[]
["N","Y","X","X^2"]
[1,{"$f":"'Tex-113,4-E'!E49","v":""},{"$f":"'Tex-113,4-E'!E48","v":""},{"$f":"C11^2","v":{"$error":"#VALUE!"}}]
[2,{"$f":"'Tex-113,4-E'!F49","v":""},{"$f":"'Tex-113,4-E'!F48","v":""},{"$error":"#VALUE!"}]
[3,{"$f":"'Tex-113,4-E'!G49","v":""},{"$f":"'Tex-113,4-E'!G48","v":""},{"$error":"#VALUE!"}]
[4,{"$f":"IF(AND(B13>0,'Tex-113,4-E'!H47=0),D3,'Tex-113,4-E'!H49)","v":""},{"$f":"IF(AND(C13>0,'Tex-113,4-E'!H47=0),D2,'Tex-113,4-E'!H48)","v":""},{"$error":"#VALUE!"}]
[5,{"$f":"D3","v":{"$error":"#VALUE!"}},{"$f":"$D$2","v":{"$error":"#VALUE!"}},{"$error":"#VALUE!"}]
{"$rows_left_out":187}
{"sheet":"00 psi","index":3,"n_rows":26,"n_cols":5,"rows_kept":26,"cut":false,"hidden":true,"merged":[[0,4,0,9]]}
["[HEADER]",null,null,"File Name:"]
["Project:","Project1"]
["Date:",37036,"Time:",0.40276620370370397]
["Boring:","Boring1","Sample:",6]
["Specimen:",6,"Depth (ft):",10]
["Diameter (inch):",null,"Height (inch):"]
["Piston Correction (lbs):"]
["Comments:"]
[]
["[SENSORS]"]
["Name","External Load Cell","Cell Pressure","Load Frame Encoder"]
["ID","LC54032","PS9170013","N/A"]
["Module","Load Frame Adc","Load Frame Adc","N/A"]
["Channel",1,3,"N/A"]
["Unit","lbs","psi","inch"]
{"$rows_left_out":12}
{"sheet":"03 psi","index":4,"n_rows":26,"n_cols":5,"rows_kept":26,"cut":false,"hidden":true,"merged":[[0,4,0,9]]}
["[HEADER]",null,null,"File Name:"]
["Project:","Project1"]
["Date:",37036,"Time:",0.42031249999999998]
["Boring:","Boring1","Sample:",3]
["Specimen:",3,"Depth (ft):",10]
["Diameter (inch):",null,"Height (inch):"]
["Piston Correction (lbs):"]
["Comments:"]
[]
["[SENSORS]"]
["Name","External Load Cell","Cell Pressure","Load Frame Encoder"]
["ID","LC54032","PS9170013","N/A"]
["Module","Load Frame Adc","Load Frame Adc","N/A"]
["Channel",1,3,"N/A"]
["Unit","lbs","psi","inch"]
{"$rows_left_out":12}
{"sheet":"05 psi","index":5,"n_rows":26,"n_cols":5,"rows_kept":26,"cut":false,"hidden":true,"merged":[[0,4,0,9]]}
["[HEADER]",null,null,"File Name:"]
["Project:","Project1"]
["Date:",37036,"Time:",0.42736111111111103]
["Boring:","Boring1","Sample:",1]
["Specimen:",1,"Depth (ft):",10]
["Diameter (inch):",null,"Height (inch):"]
["Piston Correction (lbs):"]
["Comments:"]
[]
["[SENSORS]"]
["Name","External Load Cell","Cell Pressure","Load Frame Encoder"]
["ID","LC54032","PS9170013","N/A"]
["Module","Load Frame Adc","Load Frame Adc","N/A"]
["Channel",1,3,"N/A"]
["Unit","lbs","psi","inch"]
{"$rows_left_out":12}
{"sheet":"07 psi","index":6,"n_rows":26,"n_cols":5,"rows_kept":26,"cut":false,"hidden":true,"merged":[[0,4,0,9]]}
["[HEADER]",null,null,"File Name:"]
["Project:","Project1"]
["Date:",37440,"Time:",0.47509259259259301]
["Boring:","Boring1","Sample:",4]
["Specimen:",4,"Depth (ft):",10]
["Diameter (inch):",null,"Height (inch):"]
["Piston Correction (lbs):"]
["Comments:"]
[]
["[SENSORS]"]
["Name","External Load Cell","Cell Pressure","Load Frame Encoder"]
["ID","lc54032","PS9170013","N/A"]
["Module","Load Frame Adc","Load Frame Adc","N/A"]
["Channel",1,3,"N/A"]
["Unit","lbs","psi","inch"]
{"$rows_left_out":12}
{"sheet":"10 psi","index":7,"n_rows":26,"n_cols":5,"rows_kept":26,"cut":false,"hidden":true,"merged":[[0,4,0,9]]}
["[HEADER]",null,null,"File Name:"]
["Project:","Project1"]
["Date:",37036,"Time:",0.44061342592592601]
["Boring:","Boring1","Sample:",5]
["Specimen:",5,"Depth (ft):",10]
["Diameter (inch):",null,"Height (inch):"]
["Piston Correction (lbs):"]
["Comments:"]
[]
["[SENSORS]"]
["Name","External Load Cell","Cell Pressure","Load Frame Encoder"]
["ID","LC54032","PS9170013","N/A"]
["Module","Load Frame Adc","Load Frame Adc","N/A"]
["Channel",1,3,"N/A"]
["Unit","lbs","psi","inch"]
{"$rows_left_out":12}
{"sheet":"15 psi","index":8,"n_rows":26,"n_cols":5,"rows_kept":26,"cut":false,"hidden":true,"merged":[[0,4,0,9]]}
["[HEADER]",null,null,"File Name:"]
["Project:","Project1"]
["Date:",37036,"Time:",0.41158564814814802]
["Boring:","Boring1","Sample:",2]
["Specimen:",2,"Depth (ft):",10]
["Diameter (inch):",null,"Height (inch):"]
["Piston Correction (lbs):"]
["Comments:"]
[]
["[SENSORS]"]
["Name","External Load Cell","Cell Pressure","Load Frame Encoder"]
["ID","LC54032","PS9170013","N/A"]
["Module","Load Frame Adc","Load Frame Adc","N/A"]
["Channel",1,3,"N/A"]
["Unit","lbs","psi","inch"]
{"$rows_left_out":12}
{"sheet":"00 psi (2)","index":9,"n_rows":26,"n_cols":5,"rows_kept":26,"cut":false,"hidden":true,"merged":[[0,4,0,9]]}
["[HEADER]",null,null,"File Name:"]
["Project:","Project1"]
["Date:",37036,"Time:",0.40013888888888899]
["Boring:","Boring1","Sample:",6]
["Specimen:",6,"Depth (ft):",10]
["Diameter (inch):",null,"Height (inch):"]
["Piston Correction (lbs):"]
["Comments:"]
[]
["[SENSORS]"]
["Name","External Load Cell","Cell Pressure","Load Frame Encoder"]
["ID","LC54032","PS9170013","N/A"]
["Module","Load Frame Adc","Load Frame Adc","N/A"]
["Channel",1,3,"N/A"]
["Unit","lbs","psi","inch"]
{"$rows_left_out":12}
{"sheet":"20 psi","index":10,"n_rows":26,"n_cols":5,"rows_kept":26,"cut":false,"hidden":true,"merged":[[0,4,0,9]]}
["[HEADER]",null,null,"File Name:"]
["Project:"]
["Date:",null,"Time:"]
["Boring:",null,"Sample:"]
["Specimen:",null,"Depth (ft):"]
["Diameter (inch):",null,"Height (inch):"]
["Piston Correction (lbs):"]
["Comments:"]
[]
["[SENSORS]"]
["Name","External Load Cell","Cell Pressure","Load Frame Encoder"]
["ID"]
["Module"]
["Channel"]
["Unit"]
{"$rows_left_out":12}
{"sheet":"Summary","index":11,"n_rows":42,"n_cols":11,"rows_kept":42,"cut":false,"hidden":false,"merged":[[33,6,33,7],[34,6,34,7],[41,6,41,7],[32,1,32,3],[33,1,33,3],[34,1,34,3],[37,6,37,7],[35,6,35,7],[36,6,36,7],[38,6,38,7],[39,8,39,9],[33,8,33,9],[34,8,34,9],[35,8,35,9],[36,8,36,9],[41,10,41,11],[32,6,32,11],[40,8,40,9],[41,8,41,9],[33,10,33,11],[34,10,34,11],[35,10,35,11],[36,10,36,11],[37,10,37,11],[38,10,38,11],[39,10,39,11],[40,10,40,11],[39,6,39,7],[40,6,40,7],[37,8,37,9],[38,8,38,9]]}
[]
[]
[]
[]
[]
[]
[]
[]
[]
[]
[]
[]
[]
[]
[]
{"$rows_left_out":28}
{"sheet":"Mohr Analysis","index":12,"n_rows":1270,"n_cols":21,"rows_kept":1270,"cut":false,"hidden":false,"merged":[]}
[null,null,"        Mohr's Circle Analysis",null,null,null,null,null,"Standard:"]
[null,null,null,null,null,null,null,null,null,null,null,"          s3=5",null,"          s3=10",null,"          s3=15"]
[null,null,null,null,null,"            Failure Strengths",null,null,null,"2ai","2ai","tf","t max","tf","t max","tf ","t max",null,null,"s","t"]
[null,"s3","s1","Max Shear Stress","Center Stress","Normal Stress","Shear Strength",null,"Class 1 ",145,{"$f":"J4*(PI()/180)","v":2.5306999999999999},null,null,null,null,null,null,{"$f":"IF(OR(AND(J13>M5,J14>O5,J15>Q5)),1,0)","v":{"$error":"#N/A"}},{"$f":"IF(R4=1,145,1000)","v":{"$error":"#N/A"}},{"$f":"D5*COS($S$11)+E5","v":{"$error":"#VALUE!"}},{"$f":"D5*SIN($S$11)","v":{"$error":"#VALUE!"}}]
[1,{"$f":"Worksheet!D33","v":0},{"$f":"Worksheet!D48","v":""},{"$f":"(C5-B5)/2","v":{"$error":"#VALUE!"}},{"$f":"(C5+B5)/2","v":{"$error":"#VALUE!"}},{"$f":"D5*COS($B$16)+E5","v":{"$error":"#VALUE!"}},{"$f":"D5*SIN($B$16)","v":{"$error":"#VALUE!"}},null,"Class 2",140,2.4434999999999998,15,{"$f":"L5/SIN(PI()-K5)","v":23.3369433971977},23.4,{"$f":"N5/SIN(PI()-K5)","v":36.405631699628401},30,{"$f":"P5/SIN(PI()-K5)","v":46.673886794395301},{"$f":"IF(OR(AND(M5>=J13,J13>M6),AND(O5>=J14,J14>O6),AND(Q5>=J15,J15>Q6)),1,0)","v":{"$error":"#N/A"}},{"$f":"IF(R5=1,140,1000)","v":{"$error":"#N/A"}},{"$error":"#VALUE!"},{"$error":"#VALUE!"}]
[2,{"$f":"Worksheet!E33","v":0},{"$f":"Worksheet!E48","v":""},{"$error":"#VALUE!"},{"$error":"#VALUE!"},{"$f":"D6*COS($B$16)+E6","v":{"$error":"#VALUE!"}},{"$error":"#VALUE!"},null,"Class 3",135,2.3561999999999999,11.4,{"$f":"L6/SIN(PI()-K6)","v":16.122123441097202},17.8,{"$f":"N6/SIN(PI()-K6)","v":25.173140109783301},22.3,{"$f":"P6/SIN(PI()-K6)","v":31.5371362049532},{"$f":"IF(OR(AND(M6>=J13,J13>M7),AND(O6>=J14,J14>O7),AND(Q6>=J15,J15>Q7)),1,0)","v":{"$error":"#N/A"}},{"$f":"IF(R6=1,135,1000)","v":{"$error":"#N/A"}},{"$error":"#VALUE!"},{"$error":"#VALUE!"}]
[3,{"$f":"Worksheet!F33","v":0},{"$f":"Worksheet!F48","v":""},{"$error":"#VALUE!"},{"$error":"#VALUE!"},{"$error":"#VALUE!"},{"$error":"#VALUE!"},null,"Class 4",125,2.1817000000000002,6.2,{"$f":"L7/SIN(PI()-K7)","v":7.5690061566512696},11.3,{"$f":"N7/SIN(PI()-K7)","v":13.795124124219299},15.4,{"$f":"P7/SIN(PI()-K7)","v":18.800434647166099},{"$f":"IF(OR(AND(M7>=J13),AND(O7>=J14,J14>O8),AND(Q7>=J15,J15>Q8)),1,0)","v":{"$error":"#N/A"}},{"$f":"IF(R7=1,125,1000)","v":{"$error":"#N/A"}},{"$error":"#VALUE!"},{"$error":"#VALUE!"}]
[4,{"$f":"Worksheet!G33","v":0},{"$f":"Worksheet!G48","v":""},{"$error":"#VALUE!"},{"$error":"#VALUE!"},{"$error":"#VALUE!"},{"$error":"#VALUE!"},null,"Class 5",120,2.0943999999999998,null,null,6.3,{"$f":"N8/SIN(PI()-K8)","v":7.2746339618832696},7.9,{"$f":"P8/SIN(PI()-K8)","v":9.1221600474409303},{"$f":"IF(OR(AND(O8>=J14,J14>O9),AND(Q8>=J15,J15>Q9)),1,0)","v":{"$error":"#N/A"}},{"$f":"IF(R8=1,120,1000)","v":{"$error":"#N/A"}},{"$error":"#VALUE!"},{"$error":"#VALUE!"}]
[5,{"$f":"Worksheet!H33","v":0},{"$f":"Worksheet!H48","v":""},{"$error":"#VALUE!"},{"$error":"#VALUE!"},{"$error":"#VALUE!"},{"$error":"#VALUE!"},null,"Class 6",110,1.9198999999999999,null,null,3.8,{"$f":"N9/SIN(PI()-K9)","v":4.04393120857711},4.7,{"$f":"P9/SIN(PI()-K9)","v":5.0017043895558997},{"$f":"IF(AND(J14<O9,J15<Q9),1,0)","v":{"$error":"#N/A"}},{"$f":"IF(R9=1,110,1000)","v":{"$error":"#N/A"}},{"$error":"#VALUE!"},{"$error":"#VALUE!"}]
[6,{"$f":"Worksheet!I33","v":0},{"$f":"Worksheet!I48","v":""},{"$error":"#VALUE!"},{"$error":"#VALUE!"},{"$error":"#VALUE!"},{"$error":"#VALUE!"},null,null,null,null,null,null,null,null,null,null,"2ai=",{"$f":"MIN(S4:S9)","v":{"$error":"#N/A"}},{"$error":"#VALUE!"},{"$error":"#VALUE!"}]
[7,{"$f":"Worksheet!J33","v":0},{"$f":"Worksheet!J48","v":""},{"$error":"#VALUE!"},{"$error":"#VALUE!"},{"$error":"#VALUE!"},{"$error":"#VALUE!"},null,"Calculation of","2a:",null,null,null,null,null,null,null,null,{"$f":"S10*(PI()/180)","v":{"$error":"#N/A"}}]
[8,{"$f":"Worksheet!K33","v":0},{"$f":"Worksheet!K48","v":""},{"$error":"#VALUE!"},{"$error":"#VALUE!"},{"$error":"#VALUE!"},{"$error":"#VALUE!"},null,null,null,null,null,null,5,6,7]
[null,null,null,null,null,null,null,null,"t max @ 5",{"$f":"VLOOKUP(K13,B5:D12,3,0)","v":{"$error":"#N/A"}},5,null,"m=",{"$f":"IF(AND(U8>0,U9=0),INDEX(LINEST(U4:U8,T4:T8),1),0)","v":{"$error":"#VALUE!"}},{"$f":"IF(AND(U9>0,U10=0),INDEX(LINEST(U4:U9,T4:T9),1),0)","v":{"$error":"#VALUE!"}},{"$f":"IF(U10>0,INDEX(LINEST(U4:U10,T4:T10),1),0)","v":{"$error":"#VALUE!"}},{"$f":"MAX(N13:P13)","v":{"$error":"#VALUE!"}}]
[null,null,null,5,6,7,"Linear Regression",null,"t max @10",{"$f":"VLOOKUP(K14,B5:D12,3,0)","v":{"$error":"#N/A"}},10,null,"b=",{"$f":"IF(AND(T8>0,T9=0),INDEX(LINEST(U4:U8,T4:T8),2),0)","v":{"$error":"#VALUE!"}},{"$f":"IF(AND(T9>0,T10=0),INDEX(LINEST(U4:U9,T4:T9),2),0)","v":{"$error":"#VALUE!"}},{"$f":"IF(T10>0,INDEX(LINEST(U4:U10,T4:T10),2),0)","v":{"$error":"#VALUE!"}},{"$f":"MAX(N14:P14)","v":{"$error":"#VALUE!"}}]
["2a=",{"$f":"Q16","v":{"$error":"#VALUE!"}},"m=",{"$f":"IF(AND(C9>0,C10=0),INDEX(LINEST(G5:G9,F5:F9),1),0)","v":0},{"$f":"IF(AND(C10>0,C11=0),INDEX(LINEST(G5:G10,F5:F10),1),0)","v":0},{"$f":"IF(C11>0,INDEX(LINEST(G5:G11,F5:F11),1),0)","v":{"$error":"#VALUE!"}},{"$f":"MAX(D15:F15)","v":{"$error":"#VALUE!"}},{"$f":"ATAN(G15)*(180/PI())","v":{"$error":"#VALUE!"}},"t max @15",{"$f":"VLOOKUP(K15,B5:D12,3,0)","v":{"$error":"#N/A"}},15,null,"F=",{"$f":"ATAN(N13)*(180/PI())","v":{"$error":"#VALUE!"}},{"$f":"ATAN(O13)*(180/PI())","v":{"$error":"#VALUE!"}},{"$f":"ATAN(P13)*(180/PI())","v":{"$error":"#VALUE!"}},{"$f":"MAX(N15:P15)","v":{"$error":"#VALUE!"}}]
{"$rows_left_out":1256}
{"sheet":"Classification","index":14,"n_rows":147,"n_cols":9,"rows_kept":147,"cut":false,"hidden":false,"merged":[]}
[null,"        Classification Analysis"]
[]
["Regression for Triaxial Classification Curve"]
[]
[null,"Y","X","X^2",null,6,7,8]
[1,{"$f":"'Mohr Analysis'!G5","v":{"$error":"#VALUE!"}},{"$f":"'Mohr Analysis'!F5","v":{"$error":"#VALUE!"}},{"$f":"C6^2","v":{"$error":"#VALUE!"}},"A0",{"$f":"IF(AND(B11>0,B12=0),INDEX(LINEST(B6:B11,C6:D11),3),0)","v":{"$error":"#VALUE!"}},{"$f":"IF(AND(B12>0,B13=0),INDEX(LINEST(B6:B12,C6:D12),3),0)","v":{"$error":"#VALUE!"}},{"$f":"IF(B13>0,INDEX(LINEST(B6:B13,C6:D13),3),0)","v":{"$error":"#VALUE!"}},{"$f":"SUM(F6:H6)","v":{"$error":"#VALUE!"}}]
[2,{"$f":"'Mohr Analysis'!G6","v":{"$error":"#VALUE!"}},{"$f":"'Mohr Analysis'!F6","v":{"$error":"#VALUE!"}},{"$f":"C7^2","v":{"$error":"#VALUE!"}}]
[3,{"$f":"'Mohr Analysis'!G7","v":{"$error":"#VALUE!"}},{"$f":"'Mohr Analysis'!F7","v":{"$error":"#VALUE!"}},{"$error":"#VALUE!"},"A1",{"$f":"IF(AND(B11>0,B12=0),INDEX(LINEST(B6:B11,C6:D11),2),0)","v":{"$error":"#VALUE!"}},{"$f":"IF(AND(B12>0,B13=0),INDEX(LINEST(B6:B12,C6:D12),2),0)","v":{"$error":"#VALUE!"}},{"$f":"IF(B13>0,INDEX(LINEST(B6:B13,C6:D13),2),0)","v":{"$error":"#VALUE!"}},{"$f":"SUM(F8:H8)","v":{"$error":"#VALUE!"}}]
[4,{"$f":"'Mohr Analysis'!G8","v":{"$error":"#VALUE!"}},{"$f":"'Mohr Analysis'!F8","v":{"$error":"#VALUE!"}},{"$error":"#VALUE!"}]
[5,{"$f":"'Mohr Analysis'!G9","v":{"$error":"#VALUE!"}},{"$f":"'Mohr Analysis'!F9","v":{"$error":"#VALUE!"}},{"$error":"#VALUE!"},"A2",{"$f":"IF(AND(B11>0,B12=0),INDEX(LINEST(B6:B11,C6:D11),1),0)","v":{"$error":"#VALUE!"}},{"$f":"IF(AND(B12>0,B13=0),INDEX(LINEST(B6:B12,C6:D12),1),0)","v":{"$error":"#VALUE!"}},{"$f":"IF(B13>0,INDEX(LINEST(B6:B13,C6:D13),1),0)","v":{"$error":"#VALUE!"}},{"$f":"SUM(F10:H10)","v":{"$error":"#VALUE!"}}]
[6,{"$f":"'Mohr Analysis'!G10","v":{"$error":"#VALUE!"}},{"$f":"'Mohr Analysis'!F10","v":{"$error":"#VALUE!"}},{"$error":"#VALUE!"}]
[7,{"$f":"'Mohr Analysis'!G11","v":{"$error":"#VALUE!"}},{"$f":"'Mohr Analysis'!F11","v":{"$error":"#VALUE!"}},{"$error":"#VALUE!"}]
[8,{"$f":"'Mohr Analysis'!G12","v":{"$error":"#VALUE!"}},{"$f":"'Mohr Analysis'!F12","v":{"$error":"#VALUE!"}},{"$error":"#VALUE!"}]
[]
["Lat. Pressure",3,5,10,15,20,25]
{"$rows_left_out":133}
{"sheet":"RX","index":16,"n_rows":304,"n_cols":9,"rows_kept":304,"cut":false,"hidden":true,"merged":[]}
[302,null,{"$f":"+SampleId","v":0},{"$f":"+TestNumber","v":0}]
["Fld_nbr","Value","Desc_1","Desc_2","Desc_3","Desc_4","Desc_5","Desc_6","Desc_7"]
[1,{"$f":"IF(Worksheet!$B$57=\"\",\"\",Worksheet!$B$57)","v":""},{"$f":"Worksheet!$B$56","v":"Remarks:"}]
[2,{"$f":"IF(Worksheet!$D$19=\"\",\"\",Worksheet!$D$19)","v":""},{"$f":"IF(Worksheet!$C$19=\"\",\"\",Worksheet!$C$19)","v":"COURSE\\LIFT:"}]
[3,{"$f":"IF(Worksheet!$C$66=\"\",\"\",Worksheet!$C$66)","v":""},"Tested By ",{"$f":"IF(Worksheet!$B$66=\"\",\"\",Worksheet!$B$66)","v":"TX117"}]
[4,{"$f":"IF(Worksheet!$F$66=\"\",\"\",Worksheet!$F$66)","v":""},"Tested Date ",{"$f":"IF(Worksheet!$B$66=\"\",\"\",Worksheet!$B$66)","v":"TX117"}]
[5,{"$f":"IF('Tex-113,4-E'!$C$59=\"\",\"\",'Tex-113,4-E'!$C$59)","v":""},"Tested By ",{"$f":"IF('Tex-113,4-E'!$B$59=\"\",\"\",'Tex-113,4-E'!$B$59)","v":"TX113"}]
[6,{"$f":"IF('Tex-113,4-E'!$F$59=\"\",\"\",'Tex-113,4-E'!$F$59)","v":""},"Tested Date ",{"$f":"IF('Tex-113,4-E'!$B$59=\"\",\"\",'Tex-113,4-E'!$B$59)","v":"TX113"}]
[7,{"$f":"IF('Tex-113,4-E'!$C$61=\"\",\"\",'Tex-113,4-E'!$C$61)","v":""},"Tested By ",{"$f":"IF('Tex-113,4-E'!$B$61=\"\",\"\",'Tex-113,4-E'!$B$61)","v":"TX114"}]
[8,{"$f":"IF('Tex-113,4-E'!$F$61=\"\",\"\",'Tex-113,4-E'!$F$61)","v":""},"Tested Date ",{"$f":"IF('Tex-113,4-E'!$B$61=\"\",\"\",'Tex-113,4-E'!$B$61)","v":"TX114"}]
[9,{"$f":"IF(Worksheet!$D$25=\"\",\"\",Worksheet!$D$25)","v":""},{"$f":"IF(Worksheet!$B$21=\"\",\"\",Worksheet!$B$21)","v":"Performed By Tex-117-E:"},{"$f":"IF(Worksheet!$B$25=\"\",\"\",Worksheet!$B$25)","v":"Initial Height of Specimen, in.:"},{"$f":"IF(Worksheet!$D$24=\"\",\"\",Worksheet!$D$24)","v":1}]
[10,{"$f":"IF(Worksheet!$E$25=\"\",\"\",Worksheet!$E$25)","v":""},{"$f":"IF(Worksheet!$B$21=\"\",\"\",Worksheet!$B$21)","v":"Performed By Tex-117-E:"},{"$f":"IF(Worksheet!$B$25=\"\",\"\",Worksheet!$B$25)","v":"Initial Height of Specimen, in.:"},{"$f":"IF(Worksheet!$E$24=\"\",\"\",Worksheet!$E$24)","v":2}]
[11,{"$f":"IF(Worksheet!$F$25=\"\",\"\",Worksheet!$F$25)","v":""},{"$f":"IF(Worksheet!$B$21=\"\",\"\",Worksheet!$B$21)","v":"Performed By Tex-117-E:"},{"$f":"IF(Worksheet!$B$25=\"\",\"\",Worksheet!$B$25)","v":"Initial Height of Specimen, in.:"},{"$f":"IF(Worksheet!$F$24=\"\",\"\",Worksheet!$F$24)","v":3}]
[12,{"$f":"IF(Worksheet!$G$25=\"\",\"\",Worksheet!$G$25)","v":""},{"$f":"IF(Worksheet!$B$21=\"\",\"\",Worksheet!$B$21)","v":"Performed By Tex-117-E:"},{"$f":"IF(Worksheet!$B$25=\"\",\"\",Worksheet!$B$25)","v":"Initial Height of Specimen, in.:"},{"$f":"IF(Worksheet!$G$24=\"\",\"\",Worksheet!$G$24)","v":4}]
[13,{"$f":"IF(Worksheet!$H$25=\"\",\"\",Worksheet!$H$25)","v":""},{"$f":"IF(Worksheet!$B$21=\"\",\"\",Worksheet!$B$21)","v":"Performed By Tex-117-E:"},{"$f":"IF(Worksheet!$B$25=\"\",\"\",Worksheet!$B$25)","v":"Initial Height of Specimen, in.:"},{"$f":"IF(Worksheet!$H$24=\"\",\"\",Worksheet!$H$24)","v":5}]
{"$rows_left_out":290}
{"sheet":"Revisions","index":17,"n_rows":2,"n_cols":4,"rows_kept":2,"cut":false,"hidden":true,"merged":[]}
["Date","Changes","By","Comments"]
["2005-08-05","AuthorizePersion from B61 to B63, Authorized date from E61 to E63","Joe Liu"]