{"text_format":"1","workbook":"xlsx","n_sheets":5,"sheets":["SumTestResults","PVR BH","RX","Figdata","Calculations"],"not_rendered":{"charts":1,"images":2,"macros":1,"external_links":0,"defined_names":106,"comments":1,"pivot_tables":0},"unopened":[],"bounds":{"document_bytes":16777216,"sheet_cells":100000,"rows_first":2000,"rows_last":500,"rows_between":2000,"halvings":0,"cell_chars":16384,"cell_head_chars":4096},"cells_cut":0,"cells_raw":0,"read":"whole","date_system":"1900"}

{"sheet":"SumTestResults","index":0,"n_rows":12,"n_cols":9,"rows_kept":12,"cut":false,"hidden":true,"merged":[[6,0,6,8],[8,3,8,5],[0,0,0,8],[1,0,1,8],[2,0,2,8],[3,0,3,8]]}
["Geotechnical Soil Survey"]
[]
["Tarrant County, Texas"]
[]
[]
[]
["TABLE 1: SUMMARY OF LABORATORY TEST RESULTS"]
[]
[null,null,null,"Atterberg Limits",null,null,"Percent","Percent","Soluble"]
["Borehole","Sample","Moisture","Liquid","Plastic","Plasticity","Passing,","Passing,","Sulfate"]
["Number","Depth,","Content,","Limit","Limit","Index","Sieve","Sieve","Content,"]
[null,"ft","%","(LL)","(PL)","(PI)","No. 40","No. 200","ppm"]

{"sheet":"PVR BH","index":1,"n_rows":71,"n_cols":19,"rows_kept":71,"cut":false,"hidden":false,"merged":[[11,9,11,11],[7,12,7,16],[8,12,8,16],[9,12,9,16],[10,12,10,16],[11,12,11,16],[0,0,0,1],[36,5,36,7],[36,1,36,3],[36,9,36,11],[7,4,7,8],[8,4,8,8],[9,4,9,8],[10,4,10,8],[11,4,11,8],[12,4,12,8],[16,9,16,11],[20,1,20,2],[7,9,7,11],[8,9,8,11],[9,9,9,11],[10,9,10,11],[18,12,18,16],[18,4,18,6],[13,12,13,16],[16,12,16,16],[16,4,16,8],[13,4,13,8],[18,8,18,9],[20,3,20,4],[20,7,20,8],[20,11,20,12],[20,15,20,16],[20,5,20,6],[20,9,20,10],[20,13,20,14],[12,9,12,11],[13,9,13,11],[14,4,14,16],[15,4,15,16],[12,12,12,16],[71,5,71,6],[71,1,71,4],[62,1,63,17],[65,2,65,6],[67,1,67,3],[67,5,67,6],[67,7,67,11]]}
["TxDOT Manuals >",null,null,"Tex-124-E"]
[null,"TEXAS DEPARTMENT OF TRANSPORTATION",null,null,null,null,null,null,null,null,null,null,null,null,null,null,null,null,60]
[null,null,null,null,null,null,null,null,null,null,null,null,null,null,null,null,null,null,1]
[null,"POTENTIAL VERTICAL RISE (PVR)",null,null,null,null,null,null,null,null,null,null,null,null,null,null,null,null,"tx124.xlsm::45454.659502"]
[null,"TEX-124-E"]
[]
[null,null,null,null,null,null,null,null,null,null,null,null,null,null,null,null,{"$f":"\"File Version: \" & TEXT(MID(sn,SEARCH(\"::\",sn,1)+2,20),\"mm/dd/yy hh:mm:ss\")","v":"File Version: 06/11/24 15:49:41"}]
[null,null,null,"SAMPLE ID:",null,null,null,null,null,"SAMPLED DATE:"]
[null,null,null,"TEST NUMBER:",null,null,null,null,null,"LETTING DATE:"]
[null,null,null,"SAMPLE STATUS:",null,null,null,null,null,"CONTROLLING CSJ:"]
[null,null,null,"COUNTY:",null,null,null,null,null,"SPEC YEAR:"]
[null,null,null,"SAMPLED BY:",null,null,null,null,null,"SPEC ITEM:"]
[null,null,null,"SAMPLE LOCATION:",null,null,null,null,null,"SPECIAL PROVISION:"]
[null,null,null,"MATERIAL CODE:",null,null,null,null,null,"GRADE:"]
[null,null,null,"MATERIAL NAME:"]
{"$rows_left_out":57}
{"sheet":"RX","index":2,"n_rows":208,"n_cols":9,"rows_kept":208,"cut":false,"hidden":true,"merged":[]}
[206]
["Fld_nbr","Value","Desc_1","Desc_2","Desc_3","Desc_4","Desc_5","Desc_6","Desc_7"]
[1,{"$f":"IF('PVR BH'!$B$63=\"\",\"\",'PVR BH'!$B$63)","v":""},{"$f":"'PVR BH'!$B$62","v":"Remarks:"}]
[2,{"$f":"IF('PVR BH'!$E$19=\"\",\"\",'PVR BH'!$E$19)","v":""},{"$f":"IF('PVR BH'!$D$19=\"\",\"\",'PVR BH'!$D$19)","v":"COURSE\\LIFT:"}]
[3,{"$f":"IF('PVR BH'!$C$66=\"\",\"\",'PVR BH'!$C$66)","v":""},"Tested By ",{"$f":"IF('PVR BH'!$B$66=\"\",\"\",'PVR BH'!$B$66)","v":"TX124"}]
[4,{"$f":"IF('PVR BH'!$H$66=\"\",\"\",'PVR BH'!$H$66)","v":""},"Tested Date ",{"$f":"IF('PVR BH'!$B$66=\"\",\"\",'PVR BH'!$B$66)","v":"TX124"}]
[5,{"$f":"IF('PVR BH'!$D$21=\"\",\"\",'PVR BH'!$D$21)","v":""},{"$f":"IF( 'PVR BH'!$B$5=\"\",\"\", 'PVR BH'!$B$5)","v":"TEX-124-E"},{"$f":"IF('PVR BH'!$B$21=\"\",\"\",'PVR BH'!$B$21)","v":"Boring Number:"}]
[6,{"$f":"IF('PVR BH'!$H$21=\"\",\"\",'PVR BH'!$H$21)","v":""},{"$f":"IF( 'PVR BH'!$B$5=\"\",\"\", 'PVR BH'!$B$5)","v":"TEX-124-E"},{"$f":"IF('PVR BH'!$F$21=\"\",\"\",'PVR BH'!$F$21)","v":"Ground Elevation (z):"}]
[7,{"$f":"IF('PVR BH'!$L$21=\"\",\"\",'PVR BH'!$L$21)","v":""},{"$f":"IF( 'PVR BH'!$B$5=\"\",\"\", 'PVR BH'!$B$5)","v":"TEX-124-E"},{"$f":"IF('PVR BH'!$J$21=\"\",\"\",'PVR BH'!$J$21)","v":"Longitude (x):"}]
[8,{"$f":"IF('PVR BH'!$P$21=\"\",\"\",'PVR BH'!$P$21)","v":""},{"$f":"IF( 'PVR BH'!$B$5=\"\",\"\", 'PVR BH'!$B$5)","v":"TEX-124-E"},{"$f":"IF('PVR BH'!$N$21=\"\",\"\",'PVR BH'!$N$21)","v":"Latitude (y):"}]
[9,{"$f":"IF('PVR BH'!$B$25=\"\",\"\",'PVR BH'!$B$25)","v":0},{"$f":"IF( 'PVR BH'!$B$5=\"\",\"\", 'PVR BH'!$B$5)","v":"TEX-124-E"},{"$f":"IF('PVR BH'!$B$24=\"\",\"\",'PVR BH'!$B$24)","v":"Depth to Bottom of Layer [ft]"},{"$f":"IF('PVR BH'!$A$25=\"\",\"\",'PVR BH'!$A$25)","v":0}]
[10,{"$f":"IF('PVR BH'!$B$26=\"\",\"\",'PVR BH'!$B$26)","v":""},{"$f":"IF( 'PVR BH'!$B$5=\"\",\"\", 'PVR BH'!$B$5)","v":"TEX-124-E"},{"$f":"IF('PVR BH'!$B$24=\"\",\"\",'PVR BH'!$B$24)","v":"Depth to Bottom of Layer [ft]"},{"$f":"IF('PVR BH'!$A$26=\"\",\"\",'PVR BH'!$A$26)","v":1}]
[11,{"$f":"IF('PVR BH'!$B$27=\"\",\"\",'PVR BH'!$B$27)","v":""},{"$f":"IF( 'PVR BH'!$B$5=\"\",\"\", 'PVR BH'!$B$5)","v":"TEX-124-E"},{"$f":"IF('PVR BH'!$B$24=\"\",\"\",'PVR BH'!$B$24)","v":"Depth to Bottom of Layer [ft]"},{"$f":"IF('PVR BH'!$A$27=\"\",\"\",'PVR BH'!$A$27)","v":2}]
[12,{"$f":"IF('PVR BH'!$B$28=\"\",\"\",'PVR BH'!$B$28)","v":""},{"$f":"IF( 'PVR BH'!$B$5=\"\",\"\", 'PVR BH'!$B$5)","v":"TEX-124-E"},{"$f":"IF('PVR BH'!$B$24=\"\",\"\",'PVR BH'!$B$24)","v":"Depth to Bottom of Layer [ft]"},{"$f":"IF('PVR BH'!$A$28=\"\",\"\",'PVR BH'!$A$28)","v":3}]
[13,{"$f":"IF('PVR BH'!$B$29=\"\",\"\",'PVR BH'!$B$29)","v":""},{"$f":"IF( 'PVR BH'!$B$5=\"\",\"\", 'PVR BH'!$B$5)","v":"TEX-124-E"},{"$f":"IF('PVR BH'!$B$24=\"\",\"\",'PVR BH'!$B$24)","v":"Depth to Bottom of Layer [ft]"},{"$f":"IF('PVR BH'!$A$29=\"\",\"\",'PVR BH'!$A$29)","v":4}]
{"$rows_left_out":194}
{"sheet":"Figdata","index":3,"n_rows":72,"n_cols":56,"rows_kept":72,"cut":false,"hidden":true,"merged":[]}
[]
[]
[]
[null,null,null,null,null,null,null,null,null,null,null,null,null,null,null,null,null,null,null,null,null,null,null,null,null,null,null,null,null,null,null,null,null,null,null,null,null,null,35,null,null,null,null,null,null,20,null,null,null,null,null,5]
[null,"LOAD","35","30","25","20","15","10","5",null,null,null,null,null,null,null,null,null,null,null,null,null,null,null,null,null,null,null,null,null,null,null,null,null,null,null,null,null,"Y","X","X2","X3","X4",null,null,"Y","X","X2","X3","X4",null,"Y","X","X2","X3","X4"]
[null,0,0,0,0,0,0,0,0,null,null,null,null,null,null,null,null,null,null,null,null,null,null,null,null,null,null,null,null,null,null,null,null,null,null,null,null,null,{"$f":"C6","v":0},{"$f":"B6","v":0},{"$f":"AN6^2","v":0},{"$f":"AO6*AN6","v":0},{"$f":"AO6*AO6","v":0},null,null,{"$f":"F6","v":0},{"$f":"B6","v":0},{"$f":"AU6^2","v":0},{"$f":"AV6*AU6","v":0},{"$f":"AV6*AV6","v":0},null,0,0,{"$f":"BA6^2","v":0},{"$f":"BB6*BA6","v":0},{"$f":"BB6*BB6","v":0}]
[null,{"$f":"B6+10","v":10},10.7,9,7,5.4,2.2999999999999998,1.45,0.3,null,null,null,null,null,null,null,null,null,null,null,null,null,null,null,null,null,null,null,null,null,null,null,null,null,null,null,null,null,{"$f":"C7","v":10.7},{"$f":"B7","v":10},{"$f":"AN7^2","v":100},{"$f":"AO7*AN7","v":1000},{"$f":"AO7*AO7","v":10000},null,null,{"$f":"F7","v":5.4},{"$f":"B7","v":10},{"$f":"AU7^2","v":100},{"$f":"AV7*AU7","v":1000},{"$f":"AV7*AV7","v":10000},null,0.3,2.5,6.25,15.625,39.0625]
[null,{"$f":"B7+10","v":20},16.600000000000001,13.6,10.199999999999999,7.55,3.4,1.9,0.38,null,null,null,null,null,null,null,null,null,null,null,null,null,null,null,null,null,null,null,null,null,null,null,null,null,null,null,null,null,16.600000000000001,20,400,8000,160000,null,null,{"$f":"F8","v":7.55},{"$f":"B8","v":20},{"$f":"AU8^2","v":400},{"$f":"AV8*AU8","v":8000},{"$f":"AV8*AV8","v":160000},null,0.38,5,25,125,625]
[null,30,20.6,16.43,12,8.6,3.98,2.1,0.4,null,null,null,null,null,null,null,null,null,null,null,null,null,null,null,null,null,null,null,null,null,null,null,null,null,null,null,null,null,20.6,30,900,27000,810000,null,null,{"$f":"F9","v":8.6},{"$f":"B9","v":30},{"$f":"AU9^2","v":900},{"$f":"AV9*AU9","v":27000},{"$f":"AV9*AV9","v":810000},null,0.4,7.5,56.25,421.875,3164.0625]
[null,40,23.2,18.09,12.8,9.0299999999999994,4.3,2.19,0.4,null,null,null,null,null,null,null,null,null,null,null,null,null,null,null,null,null,null,null,null,null,null,null,null,null,null,null,null,null,23.2,40,1600,64000,2560000,null,null,{"$f":"F10","v":9.0299999999999994},{"$f":"B10","v":40},{"$f":"AU10^2","v":1600},{"$f":"AV10*AU10","v":64000},{"$f":"AV10*AV10","v":2560000},null,0.4,10,100,1000,10000]
[null,50,24.8,18.899999999999999,13.1,null,4.47,null,0.4,null,null,null,null,null,null,null,null,null,null,null,null,null,null,null,null,null,null,null,null,null,null,null,null,null,null,null,null,null,24.8,50,2500,125000,6250000,null,null,null,null,null,null,null,null,0.4,15,225,3375,50625]
[null,60,25.6,18.38,null,null,null,null,null,null,null,null,null,null,null,null,null,null,null,null,null,null,null,null,null,null,null,null,null,null,null,null,null,null,null,null,null,null,25.6,60,3600,216000,12960000]
[null,70,26,null,null,null,null,null,null,null,null,null,null,null,null,null,null,null,null,null,null,null,null,null,null,null,null,null,null,null,null,null,null,null,null,null,null,null,26,70,4900,343000,24010000]
[]
[null,"LOAD","35",34,33,32,31,"30",29,28,27,26,"25",24,23,22,21,"20",19,18,17,16,"15",14,13,12,11,"10",{"$f":"AD15+1","v":9},{"$f":"AE15+1","v":8},{"$f":"AF15+1","v":7},{"$f":"AG15+1","v":6},"5",4,3,2,1,0,"A",{"$f":"INDEX(LINEST($AM$6:$AM$13,$AN$6:$AQ$13),0)","v":-1.8844696969697313E-6},null,null,null,null,null,"A",{"$f":"INDEX(LINEST($AT$6:$AT$10,$AU$6:$AX$10),0)","v":-6.9583333333331978E-6},null,null,null,null,"A",{"$f":"INDEX(LINEST($AZ$6:$AZ$11,$BA$6:$BD$11),0)","v":-6.2591194968553425E-5}]
{"$rows_left_out":58}
{"sheet":"Calculations","index":4,"n_rows":24,"n_cols":35,"rows_kept":24,"cut":false,"hidden":true,"merged":[]}
[]
[]
[]
[null,null,null,null,"CALC"]
[]
[]
[]
[]
[]
[]
[null,null,null,null,null,null,"Supplemental Calculations"]
[]
[null,"PVR [in] Top of Layer","PVR [in] Bottom of Layer","Average Moisture","Dry / Average Moisture","Wet / Average Moisture",null,"% Vol Swell: Wet","% Vol Swell: Avg","% Vol Swell:  Dry",null,"Percent       +No.40",null,{"$f":"'PVR BH'!C24","v":"Average Load [psi]"},"% Vol Swell: Avg","LAYER","35-30","29-24","23-18","17-12","11-5","<5",null,null,null,{"$f":"'PVR BH'!C24","v":"Average Load [psi]"},"% Vol Swell: Avg","LAYER","35-30","29-24","23-18","17-12","11-5","<5"]
[null,null,null,{"$f":"AVERAGE('PVR BH'!E25:F25)","v":{"$error":"#DIV/0!"}},{"$f":"AVERAGE('PVR BH'!E25,D14)","v":{"$error":"#DIV/0!"}},{"$f":"AVERAGE('PVR BH'!F25,D14)","v":{"$error":"#DIV/0!"}},null,{"$f":"(0.217*'PVR BH'!J25)-2.9","v":{"$error":"#VALUE!"}},{"$f":"(0.294*'PVR BH'!J25)-2.9","v":{"$error":"#VALUE!"}},{"$f":"('PVR BH'!J25*0.325)-1.75","v":{"$error":"#VALUE!"}},null,{"$f":"100-'PVR BH'!I25","v":{"$error":"#VALUE!"}},null,{"$f":"'PVR BH'!C25","v":0},{"$f":"ROUND('PVR BH'!L26,0)","v":0},1,{"$f":"IF(O14=35,VLOOKUP(N14,Figdata!$B$15:$C$63,2),IF(O14=34,VLOOKUP(N14,Figdata!$B$15:$D$63,3),IF(O14=33,VLOOKUP(N14,Figdata!$B$15:$E$63,4),IF(O14=32,VLOOKUP(N14,Figdata!$B$15:$F$63,5),IF(O14=31,VLOOKUP(N14,Figdata!$B$15:$G$63,6),IF(O14=30,VLOOKUP(N14,Figdata!$B$15:$H$63,7),\"\"))))))","v":""},{"$f":"IF(O14=29,VLOOKUP(N14,Figdata!$B$16:$I$64,8),IF(O14=28,VLOOKUP(N14,Figdata!$B$16:$J$64,9),IF(O14=27,VLOOKUP(N14,Figdata!$B$16:$K$64,10),IF(O14=26,VLOOKUP(N14,Figdata!$B$16:$L$64,11),IF(O14=25,VLOOKUP(N14,Figdata!$B$16:$M$64,12),IF(O14=24,VLOOKUP(N14,Figdata!$B$16:$N$64,13),\"\"))))))","v":""},{"$f":"IF(O14=23,VLOOKUP(N14,Figdata!$B$16:$O$64,14),IF(O14=22,VLOOKUP(N14,Figdata!$B$16:$P$64,15),IF(O14=21,VLOOKUP(N14,Figdata!$B$16:$Q$64,16),IF(O14=20,VLOOKUP(N14,Figdata!$B$16:$R$64,17),IF(O14=19,VLOOKUP(N14,Figdata!$B$16:$S$64,18),IF(O14=18,VLOOKUP(N14,Figdata!$B$16:$T$64,19),\"\"))))))","v":""},{"$f":"IF(O14=17,VLOOKUP(N14,Figdata!$B$16:$U$64,20),IF(O14=16,VLOOKUP(N14,Figdata!$B$16:$V$64,21),IF(O14=15,VLOOKUP(N14,Figdata!$B$16:$W$64,22),IF(O14=14,VLOOKUP(N14,Figdata!$B$16:$X$64,23),IF(O14=13,VLOOKUP(N14,Figdata!$B$16:$Y$64,24),IF(O14=12,VLOOKUP(N14,Figdata!$B$16:$Z$64,25),\"\"))))))","v":""},{"$f":"IF(O14=11,VLOOKUP(N14,Figdata!$B$16:$AA$64,26),IF(O14=10,VLOOKUP(N14,Figdata!$B$16:$AB$64,27),IF(O14=9,VLOOKUP(N14,Figdata!$B$16:$AC$64,28),IF(O14=8,VLOOKUP(N14,Figdata!$B$16:$AD$64,29),IF(O14=7,VLOOKUP(N14,Figdata!$B$16:$AE$64,30),IF(O14=6,VLOOKUP(N14,Figdata!$B$16:$AF$64,31),IF(O14=5,VLOOKUP(N14,Figdata!$B$16:$AG$64,32),\"\")))))))","v":""},{"$f":"IF(O14=4,VLOOKUP(N14,Figdata!$B$16:$AH$64,33),IF(O14=3,VLOOKUP(N14,Figdata!$B$16:$AI$64,34),IF(O14=2,VLOOKUP(N14,Figdata!$B$16:$AJ$64,35),IF(O14=1,VLOOKUP(N14,Figdata!$B$16:$AK$64,36),\"\"))))","v":""},{"$f":"MAX(Q14:V14)","v":0},null,null,{"$f":"'PVR BH'!C26","v":0},{"$f":"ROUND('PVR BH'!L26,0)","v":0},1,{"$f":"IF(AA14=35,VLOOKUP(Z14,Figdata!$B$15:$C$63,2),IF(AA14=34,VLOOKUP(Z14,Figdata!$B$15:$D$63,3),IF(AA14=33,VLOOKUP(Z14,Figdata!$B$15:$E$63,4),IF(AA14=32,VLOOKUP(Z14,Figdata!$B$15:$F$63,5),IF(AA14=31,VLOOKUP(Z14,Figdata!$B$15:$G$63,6),IF(AA14=30,VLOOKUP(Z14,Figdata!$B$15:$H$63,7),\"\"))))))","v":""},{"$f":"IF(AA14=29,VLOOKUP(Z14,Figdata!$B$16:$I$64,8),IF(AA14=28,VLOOKUP(Z14,Figdata!$B$16:$J$64,9),IF(AA14=27,VLOOKUP(Z14,Figdata!$B$16:$K$64,10),IF(AA14=26,VLOOKUP(Z14,Figdata!$B$16:$L$64,11),IF(AA14=25,VLOOKUP(Z14,Figdata!$B$16:$M$64,12),IF(AA14=24,VLOOKUP(Z14,Figdata!$B$16:$N$64,13),\"\"))))))","v":""},{"$f":"IF(AA14=23,VLOOKUP(Z14,Figdata!$B$16:$O$64,14),IF(AA14=22,VLOOKUP(Z14,Figdata!$B$16:$P$64,15),IF(AA14=21,VLOOKUP(Z14,Figdata!$B$16:$Q$64,16),IF(AA14=20,VLOOKUP(Z14,Figdata!$B$16:$R$64,17),IF(AA14=19,VLOOKUP(Z14,Figdata!$B$16:$S$64,18),IF(AA14=18,VLOOKUP(Z14,Figdata!$B$16:$T$64,19),\"\"))))))","v":""},{"$f":"IF(AA14=17,VLOOKUP(Z14,Figdata!$B$16:$U$64,20),IF(AA14=16,VLOOKUP(Z14,Figdata!$B$16:$V$64,21),IF(AA14=15,VLOOKUP(Z14,Figdata!$B$16:$W$64,22),IF(AA14=14,VLOOKUP(Z14,Figdata!$B$16:$X$64,23),IF(AA14=13,VLOOKUP(Z14,Figdata!$B$16:$Y$64,24),IF(AA14=12,VLOOKUP(Z14,Figdata!$B$16:$Z$64,25),\"\"))))))","v":""},{"$f":"IF(AA14=11,VLOOKUP(Z14,Figdata!$B$16:$AA$64,26),IF(AA14=10,VLOOKUP(Z14,Figdata!$B$16:$AB$64,27),IF(AA14=9,VLOOKUP(Z14,Figdata!$B$16:$AC$64,28),IF(AA14=8,VLOOKUP(Z14,Figdata!$B$16:$AD$64,29),IF(AA14=7,VLOOKUP(Z14,Figdata!$B$16:$AE$64,30),IF(AA14=6,VLOOKUP(Z14,Figdata!$B$16:$AF$64,31),IF(AA14=5,VLOOKUP(Z14,Figdata!$B$16:$AG$64,32),\"\")))))))","v":""},{"$f":"IF(AA14=4,VLOOKUP(Z14,Figdata!$B$16:$AH$64,33),IF(AA14=3,VLOOKUP(Z14,Figdata!$B$16:$AI$64,34),IF(AA14=2,VLOOKUP(Z14,Figdata!$B$16:$AJ$64,35),IF(AA14=1,VLOOKUP(Z14,Figdata!$B$16:$AK$64,36),\"\"))))","v":""},{"$f":"MAX(AC14:AH14)","v":0}]
[null,0,1.1000000000000001,{"$f":"AVERAGE('PVR BH'!E26:F26)","v":5.5},{"$f":"AVERAGE('PVR BH'!E26,D15)","v":7.25},{"$f":"AVERAGE('PVR BH'!F26,D15)","v":3.75},null,{"$f":"(0.217*'PVR BH'!J26)-2.9","v":-2.9},{"$f":"(0.294*'PVR BH'!J26)-2.9","v":-2.9},{"$f":"('PVR BH'!J26*0.325)-1.75","v":-1.75},null,{"$f":"100-'PVR BH'!I26","v":100},null,{"$f":"'PVR BH'!C26","v":0},{"$f":"ROUND('PVR BH'!L27,0)","v":0},2,{"$f":"IF(O15=35,VLOOKUP(N15,Figdata!$B$15:$C$63,2),IF(O15=34,VLOOKUP(N15,Figdata!$B$15:$D$63,3),IF(O15=33,VLOOKUP(N15,Figdata!$B$15:$E$63,4),IF(O15=32,VLOOKUP(N15,Figdata!$B$15:$F$63,5),IF(O15=31,VLOOKUP(N15,Figdata!$B$15:$G$63,6),IF(O15=30,VLOOKUP(N15,Figdata!$B$15:$H$63,7),\"\"))))))","v":""},{"$f":"IF(O15=29,VLOOKUP(N15,Figdata!$B$16:$I$64,8),IF(O15=28,VLOOKUP(N15,Figdata!$B$16:$J$64,9),IF(O15=27,VLOOKUP(N15,Figdata!$B$16:$K$64,10),IF(O15=26,VLOOKUP(N15,Figdata!$B$16:$L$64,11),IF(O15=25,VLOOKUP(N15,Figdata!$B$16:$M$64,12),IF(O15=24,VLOOKUP(N15,Figdata!$B$16:$N$64,13),\"\"))))))","v":""},{"$f":"IF(O15=23,VLOOKUP(N15,Figdata!$B$16:$O$64,14),IF(O15=22,VLOOKUP(N15,Figdata!$B$16:$P$64,15),IF(O15=21,VLOOKUP(N15,Figdata!$B$16:$Q$64,16),IF(O15=20,VLOOKUP(N15,Figdata!$B$16:$R$64,17),IF(O15=19,VLOOKUP(N15,Figdata!$B$16:$S$64,18),IF(O15=18,VLOOKUP(N15,Figdata!$B$16:$T$64,19),\"\"))))))","v":""},{"$f":"IF(O15=17,VLOOKUP(N15,Figdata!$B$16:$U$64,20),IF(O15=16,VLOOKUP(N15,Figdata!$B$16:$V$64,21),IF(O15=15,VLOOKUP(N15,Figdata!$B$16:$W$64,22),IF(O15=14,VLOOKUP(N15,Figdata!$B$16:$X$64,23),IF(O15=13,VLOOKUP(N15,Figdata!$B$16:$Y$64,24),IF(O15=12,VLOOKUP(N15,Figdata!$B$16:$Z$64,25),\"\"))))))","v":""},{"$f":"IF(O15=11,VLOOKUP(N15,Figdata!$B$16:$AA$64,26),IF(O15=10,VLOOKUP(N15,Figdata!$B$16:$AB$64,27),IF(O15=9,VLOOKUP(N15,Figdata!$B$16:$AC$64,28),IF(O15=8,VLOOKUP(N15,Figdata!$B$16:$AD$64,29),IF(O15=7,VLOOKUP(N15,Figdata!$B$16:$AE$64,30),IF(O15=6,VLOOKUP(N15,Figdata!$B$16:$AF$64,31),IF(O15=5,VLOOKUP(N15,Figdata!$B$16:$AG$64,32),\"\")))))))","v":""},{"$f":"IF(O15=4,VLOOKUP(N15,Figdata!$B$16:$AH$64,33),IF(O15=3,VLOOKUP(N15,Figdata!$B$16:$AI$64,34),IF(O15=2,VLOOKUP(N15,Figdata!$B$16:$AJ$64,35),IF(O15=1,VLOOKUP(N15,Figdata!$B$16:$AK$64,36),\"\"))))","v":""},0,null,null,{"$f":"'PVR BH'!C27","v":0},{"$f":"ROUND('PVR BH'!L27,0)","v":0},2,{"$f":"IF(AA15=35,VLOOKUP(Z15,Figdata!$B$15:$C$63,2),IF(AA15=34,VLOOKUP(Z15,Figdata!$B$15:$D$63,3),IF(AA15=33,VLOOKUP(Z15,Figdata!$B$15:$E$63,4),IF(AA15=32,VLOOKUP(Z15,Figdata!$B$15:$F$63,5),IF(AA15=31,VLOOKUP(Z15,Figdata!$B$15:$G$63,6),IF(AA15=30,VLOOKUP(Z15,Figdata!$B$15:$H$63,7),\"\"))))))","v":""},{"$f":"IF(AA15=29,VLOOKUP(Z15,Figdata!$B$16:$I$64,8),IF(AA15=28,VLOOKUP(Z15,Figdata!$B$16:$J$64,9),IF(AA15=27,VLOOKUP(Z15,Figdata!$B$16:$K$64,10),IF(AA15=26,VLOOKUP(Z15,Figdata!$B$16:$L$64,11),IF(AA15=25,VLOOKUP(Z15,Figdata!$B$16:$M$64,12),IF(AA15=24,VLOOKUP(Z15,Figdata!$B$16:$N$64,13),\"\"))))))","v":""},{"$f":"IF(AA15=23,VLOOKUP(Z15,Figdata!$B$16:$O$64,14),IF(AA15=22,VLOOKUP(Z15,Figdata!$B$16:$P$64,15),IF(AA15=21,VLOOKUP(Z15,Figdata!$B$16:$Q$64,16),IF(AA15=20,VLOOKUP(Z15,Figdata!$B$16:$R$64,17),IF(AA15=19,VLOOKUP(Z15,Figdata!$B$16:$S$64,18),IF(AA15=18,VLOOKUP(Z15,Figdata!$B$16:$T$64,19),\"\"))))))","v":""},{"$f":"IF(AA15=17,VLOOKUP(Z15,Figdata!$B$16:$U$64,20),IF(AA15=16,VLOOKUP(Z15,Figdata!$B$16:$V$64,21),IF(AA15=15,VLOOKUP(Z15,Figdata!$B$16:$W$64,22),IF(AA15=14,VLOOKUP(Z15,Figdata!$B$16:$X$64,23),IF(AA15=13,VLOOKUP(Z15,Figdata!$B$16:$Y$64,24),IF(AA15=12,VLOOKUP(Z15,Figdata!$B$16:$Z$64,25),\"\"))))))","v":""},{"$f":"IF(AA15=11,VLOOKUP(Z15,Figdata!$B$16:$AA$64,26),IF(AA15=10,VLOOKUP(Z15,Figdata!$B$16:$AB$64,27),IF(AA15=9,VLOOKUP(Z15,Figdata!$B$16:$AC$64,28),IF(AA15=8,VLOOKUP(Z15,Figdata!$B$16:$AD$64,29),IF(AA15=7,VLOOKUP(Z15,Figdata!$B$16:$AE$64,30),IF(AA15=6,VLOOKUP(Z15,Figdata!$B$16:$AF$64,31),IF(AA15=5,VLOOKUP(Z15,Figdata!$B$16:$AG$64,32),\"\")))))))","v":""},{"$f":"IF(AA15=4,VLOOKUP(Z15,Figdata!$B$16:$AH$64,33),IF(AA15=3,VLOOKUP(Z15,Figdata!$B$16:$AI$64,34),IF(AA15=2,VLOOKUP(Z15,Figdata!$B$16:$AJ$64,35),IF(AA15=1,VLOOKUP(Z15,Figdata!$B$16:$AK$64,36),\"\"))))","v":""},0]
{"$rows_left_out":9}