{"text_format":"1","workbook":"xlsx","n_sheets":5,"sheets":["SumTestResults","PVR BH","RX","Figdata","Calculations"],"not_rendered":{"charts":1,"images":2,"macros":1,"external_links":0,"defined_names":106,"comments":1,"pivot_tables":0},"unopened":[],"bounds":{"document_bytes":16777216,"sheet_cells":100000,"rows_first":2000,"rows_last":500,"rows_between":2000,"halvings":0,"cell_chars":16384,"cell_head_chars":4096},"cells_cut":0,"cells_raw":0,"read":"whole","date_system":"1900"}

{"sheet":"SumTestResults","index":0,"n_rows":12,"n_cols":9,"rows_kept":12,"cut":false,"hidden":true,"merged":[[6,0,6,8],[8,3,8,5],[0,0,0,8],[1,0,1,8],[2,0,2,8],[3,0,3,8]]}
["Geotechnical Soil Survey"]
[]
["Tarrant County, Texas"]
[]
[]
[]
["TABLE 1: SUMMARY OF LABORATORY TEST RESULTS"]
[]
[null,null,null,"Atterberg Limits",null,null,"Percent","Percent","Soluble"]
["Borehole","Sample","Moisture","Liquid","Plastic","Plasticity","Passing,","Passing,","Sulfate"]
["Number","Depth,","Content,","Limit","Limit","Index","Sieve","Sieve","Content,"]
[null,"ft","%","(LL)","(PL)","(PI)","No. 40","No. 200","ppm"]

{"sheet":"PVR BH","index":1,"n_rows":71,"n_cols":19,"rows_kept":71,"cut":false,"hidden":false,"merged":[[11,9,11,11],[7,12,7,16],[8,12,8,16],[9,12,9,16],[10,12,10,16],[11,12,11,16],[0,0,0,1],[36,5,36,7],[36,1,36,3],[36,9,36,11],[7,4,7,8],[8,4,8,8],[9,4,9,8],[10,4,10,8],[11,4,11,8],[12,4,12,8],[16,9,16,11],[20,1,20,2],[7,9,7,11],[8,9,8,11],[9,9,9,11],[10,9,10,11],[18,12,18,16],[18,4,18,6],[13,12,13,16],[16,12,16,16],[16,4,16,8],[13,4,13,8],[18,8,18,9],[20,3,20,4],[20,7,20,8],[20,11,20,12],[20,15,20,16],[20,5,20,6],[20,9,20,10],[20,13,20,14],[12,9,12,11],[13,9,13,11],[14,4,14,16],[15,4,15,16],[12,12,12,16],[71,5,71,6],[71,1,71,4],[62,1,63,17],[65,2,65,6],[67,1,67,3],[67,5,67,6],[67,7,67,11]]}
["TxDOT Manuals >",null,null,"Tex-124-E"]
[null,"TEXAS DEPARTMENT OF TRANSPORTATION",null,null,null,null,null,null,null,null,null,null,null,null,null,null,null,null,60]
[null,null,null,null,null,null,null,null,null,null,null,null,null,null,null,null,null,null,1]
[null,"POTENTIAL VERTICAL RISE (PVR)",null,null,null,null,null,null,null,null,null,null,null,null,null,null,null,null,"tx124.xlsm::45454.659502"]
[null,"TEX-124-E"]
[]
[null,null,null,null,null,null,null,null,null,null,null,null,null,null,null,null,{"$f":"\"File Version: \" & TEXT(MID(sn,SEARCH(\"::\",sn,1)+2,20),\"mm/dd/yy hh:mm:ss\")","v":"File Version: 06/11/24 15:49:41"}]
[null,null,null,"SAMPLE ID:",null,null,null,null,null,"SAMPLED DATE:"]
[null,null,null,"TEST NUMBER:",null,null,null,null,null,"LETTING DATE:"]
[null,null,null,"SAMPLE STATUS:",null,null,null,null,null,"CONTROLLING CSJ:"]
[null,null,null,"COUNTY:",null,null,null,null,null,"SPEC YEAR:"]
[null,null,null,"SAMPLED BY:",null,null,null,null,null,"SPEC ITEM:"]
[null,null,null,"SAMPLE LOCATION:",null,null,null,null,null,"SPECIAL PROVISION:"]
[null,null,null,"MATERIAL CODE:",null,null,null,null,null,"GRADE:"]
[null,null,null,"MATERIAL NAME:"]
[null,null,null,"PRODUCER:",""]
[null,null,null,"AREA ENGINEER:","",null,null,null,null,"PROJECT MANAGER:"]
[]
[null,null,null,"COURSE\\LIFT:",null,null,null,"STATION:",null,null,null,"DIST. FROM CL:"]
[]
[null,"Boring Number:",null,null,null,"Ground Elevation (z):",null,null,null,"Longitude (x):",null,null,null,"Latitude (y):"]
[]
[null,"PVR Data BH"]
[null,"Depth to Bottom of Layer [ft]","Average Load [psi]","Liquid Limit (LL)","Dry 0.2LL+9","Wet 0.47LL+2","Percent Moisture","Dry       Avg       Wet","Percent       -No.40","Plasticity Index (PI)","Percent Volume Swell","Percent Free Swell","PVR [in] Top of Layer","PVR [in] Bottom of Layer","Differential Swell [in]","Modified                 -No.40 Factor","Modified Density Factor","PVR in Layers [in]","Total PVR [in]"]
[0,0,0,"-","-","-","-","-","-","-","-","-","-","-","-","-","-","-",{"$f":"SUM(R26:$R$35)","v":0}]
[1,null,{"$f":"(B26+B25)/2","v":0},null,{"$f":"(0.2*D26)+9","v":9},{"$f":"(0.47*D26)+2","v":2},null,{"$f":"IF(G26<Calculations!E15,\"Dry\",IF(G26>Calculations!F15,\"Wet\",\"Avg\"))","v":"Dry"},null,null,{"$f":"IF(J26=\"\",0,IF(J26>60,(0.429*J26)-11,IF(H26=\"Wet\",Calculations!H15,IF(H26=\"Avg\",Calculations!I15,IF(H26=\"Dry\",Calculations!J15)))))","v":0},{"$f":"IF(K26=0,0,K26*1.07+2.6)","v":0},0,{"$f":"IF(ISERROR(IF(Calculations!AI14=0,M26,Calculations!AI14)),0,IF(Calculations!AI14=0,M26,Calculations!AI14))","v":0},{"$f":"IF(N26=\"\",\"\",N26-M26)","v":0},{"$f":"I26*0.01","v":0},1,{"$f":"IF(O26=\"\",0,O26*P26*Q26)","v":0},{"$f":"SUM(R27:$R$35)","v":0}]
[2,null,0,null,9,2,null,{"$f":"IF(G27<Calculations!E16,\"Dry\",IF(G27>Calculations!F16,\"Wet\",\"Avg\"))","v":"Dry"},null,null,{"$f":"IF(J27=\"\",0,IF(J27>60,(0.429*J27)-11,IF(H27=\"Wet\",Calculations!H16,IF(H27=\"Avg\",Calculations!I16,IF(H27=\"Dry\",Calculations!J16)))))","v":0},0,{"$f":"IF(ISERROR(IF(Calculations!W15=0,N26,Calculations!W15)),0,IF(Calculations!W15=0,N26,Calculations!W15))","v":0},{"$f":"IF(ISERROR(IF(Calculations!AI15=0,M27,Calculations!AI15)),0,IF(Calculations!AI15=0,M27,Calculations!AI15))","v":0},0,0,1,0,{"$f":"SUM(R28:$R$35)","v":0}]
[3,null,0,null,9,2,null,{"$f":"IF(G28<Calculations!E17,\"Dry\",IF(G28>Calculations!F17,\"Wet\",\"Avg\"))","v":"Dry"},null,null,{"$f":"IF(J28=\"\",0,IF(J28>60,(0.429*J28)-11,IF(H28=\"Wet\",Calculations!H17,IF(H28=\"Avg\",Calculations!I17,IF(H28=\"Dry\",Calculations!J17)))))","v":0},0,{"$f":"IF(ISERROR(IF(Calculations!W16=0,N27,Calculations!W16)),0,IF(Calculations!W16=0,N27,Calculations!W16))","v":0},{"$f":"IF(ISERROR(IF(Calculations!AI16=0,M28,Calculations!AI16)),0,IF(Calculations!AI16=0,M28,Calculations!AI16))","v":0},0,0,1,0,{"$f":"SUM(R29:$R$35)","v":0}]
[4,null,0,null,9,2,null,{"$f":"IF(G29<Calculations!E18,\"Dry\",IF(G29>Calculations!F18,\"Wet\",\"Avg\"))","v":"Dry"},null,null,{"$f":"IF(J29=\"\",0,IF(J29>60,(0.429*J29)-11,IF(H29=\"Wet\",Calculations!H18,IF(H29=\"Avg\",Calculations!I18,IF(H29=\"Dry\",Calculations!J18)))))","v":0},0,{"$f":"IF(ISERROR(IF(Calculations!W17=0,N28,Calculations!W17)),0,IF(Calculations!W17=0,N28,Calculations!W17))","v":0},{"$f":"IF(ISERROR(IF(Calculations!AI17=0,M29,Calculations!AI17)),0,IF(Calculations!AI17=0,M29,Calculations!AI17))","v":0},0,0,1,0,{"$f":"SUM(R30:$R$35)","v":0}]
[5,null,0,null,9,2,null,{"$f":"IF(G30<Calculations!E19,\"Dry\",IF(G30>Calculations!F19,\"Wet\",\"Avg\"))","v":"Dry"},null,null,{"$f":"IF(J30=\"\",0,IF(J30>60,(0.429*J30)-11,IF(H30=\"Wet\",Calculations!H19,IF(H30=\"Avg\",Calculations!I19,IF(H30=\"Dry\",Calculations!J19)))))","v":0},0,{"$f":"IF(ISERROR(IF(Calculations!W18=0,N29,Calculations!W18)),0,IF(Calculations!W18=0,N29,Calculations!W18))","v":0},{"$f":"IF(ISERROR(IF(Calculations!AI18=0,M30,Calculations!AI18)),0,IF(Calculations!AI18=0,M30,Calculations!AI18))","v":0},0,0,1,0,{"$f":"SUM(R31:$R$35)","v":0}]
[6,null,0,null,9,2,null,{"$f":"IF(G31<Calculations!E20,\"Dry\",IF(G31>Calculations!F20,\"Wet\",\"Avg\"))","v":"Dry"},null,null,{"$f":"IF(J31=\"\",0,IF(J31>60,(0.429*J31)-11,IF(H31=\"Wet\",Calculations!H20,IF(H31=\"Avg\",Calculations!I20,IF(H31=\"Dry\",Calculations!J20)))))","v":0},0,{"$f":"IF(ISERROR(IF(Calculations!W19=0,N30,Calculations!W19)),0,IF(Calculations!W19=0,N30,Calculations!W19))","v":0},{"$f":"IF(ISERROR(IF(Calculations!AI19=0,M31,Calculations!AI19)),0,IF(Calculations!AI19=0,M31,Calculations!AI19))","v":0},0,0,1,0,{"$f":"SUM(R32:$R$35)","v":0}]
[7,null,0,null,9,2,null,{"$f":"IF(G32<Calculations!E21,\"Dry\",IF(G32>Calculations!F21,\"Wet\",\"Avg\"))","v":"Dry"},null,null,{"$f":"IF(J32=\"\",0,IF(J32>60,(0.429*J32)-11,IF(H32=\"Wet\",Calculations!H21,IF(H32=\"Avg\",Calculations!I21,IF(H32=\"Dry\",Calculations!J21)))))","v":0},0,{"$f":"IF(ISERROR(IF(Calculations!W20=0,N31,Calculations!W20)),0,IF(Calculations!W20=0,N31,Calculations!W20))","v":0},{"$f":"IF(ISERROR(IF(Calculations!AI20=0,M32,Calculations!AI20)),0,IF(Calculations!AI20=0,M32,Calculations!AI20))","v":0},0,0,1,0,{"$f":"SUM(R33:$R$35)","v":0}]
[8,null,0,null,9,2,null,{"$f":"IF(G33<Calculations!E22,\"Dry\",IF(G33>Calculations!F22,\"Wet\",\"Avg\"))","v":"Dry"},null,null,{"$f":"IF(J33=\"\",0,IF(J33>60,(0.429*J33)-11,IF(H33=\"Wet\",Calculations!H22,IF(H33=\"Avg\",Calculations!I22,IF(H33=\"Dry\",Calculations!J22)))))","v":0},0,{"$f":"IF(ISERROR(IF(Calculations!W21=0,N32,Calculations!W21)),0,IF(Calculations!W21=0,N32,Calculations!W21))","v":0},{"$f":"IF(ISERROR(IF(Calculations!AI21=0,M33,Calculations!AI21)),0,IF(Calculations!AI21=0,M33,Calculations!AI21))","v":0},0,0,1,0,{"$f":"SUM(R34:$R$35)","v":0}]
[9,null,0,null,9,2,null,{"$f":"IF(G34<Calculations!E23,\"Dry\",IF(G34>Calculations!F23,\"Wet\",\"Avg\"))","v":"Dry"},null,null,{"$f":"IF(J34=\"\",0,IF(J34>60,(0.429*J34)-11,IF(H34=\"Wet\",Calculations!H23,IF(H34=\"Avg\",Calculations!I23,IF(H34=\"Dry\",Calculations!J23)))))","v":0},0,{"$f":"IF(ISERROR(IF(Calculations!W22=0,N33,Calculations!W22)),0,IF(Calculations!W22=0,N33,Calculations!W22))","v":0},{"$f":"IF(ISERROR(IF(Calculations!AI22=0,M34,Calculations!AI22)),0,IF(Calculations!AI22=0,M34,Calculations!AI22))","v":0},0,0,1,0,{"$f":"SUM(R35:$R$35)","v":0}]
[10,null,0,null,9,2,null,{"$f":"IF(G35<Calculations!E24,\"Dry\",IF(G35>Calculations!F24,\"Wet\",\"Avg\"))","v":"Dry"},null,null,{"$f":"IF(J35=\"\",0,IF(J35>60,(0.429*J35)-11,IF(H35=\"Wet\",Calculations!H24,IF(H35=\"Avg\",Calculations!I24,IF(H35=\"Dry\",Calculations!J24)))))","v":0},0,{"$f":"IF(ISERROR(IF(Calculations!W23=0,N34,Calculations!W23)),0,IF(Calculations!W23=0,N34,Calculations!W23))","v":0},{"$f":"IF(ISERROR(IF(Calculations!AI23=0,M35,Calculations!AI23)),0,IF(Calculations!AI23=0,M35,Calculations!AI23))","v":0},0,0,1,0,0]
[]
[null,"Fields are chart inputs",null,null,null,"Fields are final answers per layer",null,null,null,"Final Total PVR for the borehole"]
[null,"Note: PVR calculations are based on future pavement grade being the same as present grade. Bold numbers are interpolated and extrapolated values."]
[]
[]
[]
[]
[]
[]
[]
[]
[]
[]
[]
[]
[]
[]
[]
[]
[]
[]
[]
[]
[]
[]
[]
[null,"Remarks:",{"$f":"NOW()","v":"2024-06-11T15:49:41.680"}]
[]
[]
[null,"Test Method:","Tested By:",null,null,null,null,"Tested Date:"]
[null,"TX124"]
[null,"Test Stamp Code:",null,null,"Omit Test:","Completed Date:",null,"Reviewed By:"]
[]
[null,"Locked By:","TxDOT:","District:","Area:"]
[null,"","","",""]
[null,"Authorized By:",null,null,null,"Authorized Date:"]

{"sheet":"RX","index":2,"n_rows":208,"n_cols":9,"rows_kept":208,"cut":false,"hidden":true,"merged":[]}
[206]
["Fld_nbr","Value","Desc_1","Desc_2","Desc_3","Desc_4","Desc_5","Desc_6","Desc_7"]
[1,{"$f":"IF('PVR BH'!$B$63=\"\",\"\",'PVR BH'!$B$63)","v":""},{"$f":"'PVR BH'!$B$62","v":"Remarks:"}]
[2,{"$f":"IF('PVR BH'!$E$19=\"\",\"\",'PVR BH'!$E$19)","v":""},{"$f":"IF('PVR BH'!$D$19=\"\",\"\",'PVR BH'!$D$19)","v":"COURSE\\LIFT:"}]
[3,{"$f":"IF('PVR BH'!$C$66=\"\",\"\",'PVR BH'!$C$66)","v":""},"Tested By ",{"$f":"IF('PVR BH'!$B$66=\"\",\"\",'PVR BH'!$B$66)","v":"TX124"}]
[4,{"$f":"IF('PVR BH'!$H$66=\"\",\"\",'PVR BH'!$H$66)","v":""},"Tested Date ",{"$f":"IF('PVR BH'!$B$66=\"\",\"\",'PVR BH'!$B$66)","v":"TX124"}]
[5,{"$f":"IF('PVR BH'!$D$21=\"\",\"\",'PVR BH'!$D$21)","v":""},{"$f":"IF( 'PVR BH'!$B$5=\"\",\"\", 'PVR BH'!$B$5)","v":"TEX-124-E"},{"$f":"IF('PVR BH'!$B$21=\"\",\"\",'PVR BH'!$B$21)","v":"Boring Number:"}]
[6,{"$f":"IF('PVR BH'!$H$21=\"\",\"\",'PVR BH'!$H$21)","v":""},{"$f":"IF( 'PVR BH'!$B$5=\"\",\"\", 'PVR BH'!$B$5)","v":"TEX-124-E"},{"$f":"IF('PVR BH'!$F$21=\"\",\"\",'PVR BH'!$F$21)","v":"Ground Elevation (z):"}]
[7,{"$f":"IF('PVR BH'!$L$21=\"\",\"\",'PVR BH'!$L$21)","v":""},{"$f":"IF( 'PVR BH'!$B$5=\"\",\"\", 'PVR BH'!$B$5)","v":"TEX-124-E"},{"$f":"IF('PVR BH'!$J$21=\"\",\"\",'PVR BH'!$J$21)","v":"Longitude (x):"}]
[8,{"$f":"IF('PVR BH'!$P$21=\"\",\"\",'PVR BH'!$P$21)","v":""},{"$f":"IF( 'PVR BH'!$B$5=\"\",\"\", 'PVR BH'!$B$5)","v":"TEX-124-E"},{"$f":"IF('PVR BH'!$N$21=\"\",\"\",'PVR BH'!$N$21)","v":"Latitude (y):"}]
[9,{"$f":"IF('PVR BH'!$B$25=\"\",\"\",'PVR BH'!$B$25)","v":0},{"$f":"IF( 'PVR BH'!$B$5=\"\",\"\", 'PVR BH'!$B$5)","v":"TEX-124-E"},{"$f":"IF('PVR BH'!$B$24=\"\",\"\",'PVR BH'!$B$24)","v":"Depth to Bottom of Layer [ft]"},{"$f":"IF('PVR BH'!$A$25=\"\",\"\",'PVR BH'!$A$25)","v":0}]
[10,{"$f":"IF('PVR BH'!$B$26=\"\",\"\",'PVR BH'!$B$26)","v":""},{"$f":"IF( 'PVR BH'!$B$5=\"\",\"\", 'PVR BH'!$B$5)","v":"TEX-124-E"},{"$f":"IF('PVR BH'!$B$24=\"\",\"\",'PVR BH'!$B$24)","v":"Depth to Bottom of Layer [ft]"},{"$f":"IF('PVR BH'!$A$26=\"\",\"\",'PVR BH'!$A$26)","v":1}]
[11,{"$f":"IF('PVR BH'!$B$27=\"\",\"\",'PVR BH'!$B$27)","v":""},{"$f":"IF( 'PVR BH'!$B$5=\"\",\"\", 'PVR BH'!$B$5)","v":"TEX-124-E"},{"$f":"IF('PVR BH'!$B$24=\"\",\"\",'PVR BH'!$B$24)","v":"Depth to Bottom of Layer [ft]"},{"$f":"IF('PVR BH'!$A$27=\"\",\"\",'PVR BH'!$A$27)","v":2}]
[12,{"$f":"IF('PVR BH'!$B$28=\"\",\"\",'PVR BH'!$B$28)","v":""},{"$f":"IF( 'PVR BH'!$B$5=\"\",\"\", 'PVR BH'!$B$5)","v":"TEX-124-E"},{"$f":"IF('PVR BH'!$B$24=\"\",\"\",'PVR BH'!$B$24)","v":"Depth to Bottom of Layer [ft]"},{"$f":"IF('PVR BH'!$A$28=\"\",\"\",'PVR BH'!$A$28)","v":3}]
[13,{"$f":"IF('PVR BH'!$B$29=\"\",\"\",'PVR BH'!$B$29)","v":""},{"$f":"IF( 'PVR BH'!$B$5=\"\",\"\", 'PVR BH'!$B$5)","v":"TEX-124-E"},{"$f":"IF('PVR BH'!$B$24=\"\",\"\",'PVR BH'!$B$24)","v":"Depth to Bottom of Layer [ft]"},{"$f":"IF('PVR BH'!$A$29=\"\",\"\",'PVR BH'!$A$29)","v":4}]
[14,{"$f":"IF('PVR BH'!$B$30=\"\",\"\",'PVR BH'!$B$30)","v":""},{"$f":"IF( 'PVR BH'!$B$5=\"\",\"\", 'PVR BH'!$B$5)","v":"TEX-124-E"},{"$f":"IF('PVR BH'!$B$24=\"\",\"\",'PVR BH'!$B$24)","v":"Depth to Bottom of Layer [ft]"},{"$f":"IF('PVR BH'!$A$30=\"\",\"\",'PVR BH'!$A$30)","v":5}]
[15,{"$f":"IF('PVR BH'!$B$31=\"\",\"\",'PVR BH'!$B$31)","v":""},{"$f":"IF( 'PVR BH'!$B$5=\"\",\"\", 'PVR BH'!$B$5)","v":"TEX-124-E"},{"$f":"IF('PVR BH'!$B$24=\"\",\"\",'PVR BH'!$B$24)","v":"Depth to Bottom of Layer [ft]"},{"$f":"IF('PVR BH'!$A$31=\"\",\"\",'PVR BH'!$A$31)","v":6}]
[16,{"$f":"IF('PVR BH'!$B$32=\"\",\"\",'PVR BH'!$B$32)","v":""},{"$f":"IF( 'PVR BH'!$B$5=\"\",\"\", 'PVR BH'!$B$5)","v":"TEX-124-E"},{"$f":"IF('PVR BH'!$B$24=\"\",\"\",'PVR BH'!$B$24)","v":"Depth to Bottom of Layer [ft]"},{"$f":"IF('PVR BH'!$A$32=\"\",\"\",'PVR BH'!$A$32)","v":7}]
[17,{"$f":"IF('PVR BH'!$B$33=\"\",\"\",'PVR BH'!$B$33)","v":""},{"$f":"IF( 'PVR BH'!$B$5=\"\",\"\", 'PVR BH'!$B$5)","v":"TEX-124-E"},{"$f":"IF('PVR BH'!$B$24=\"\",\"\",'PVR BH'!$B$24)","v":"Depth to Bottom of Layer [ft]"},{"$f":"IF('PVR BH'!$A$33=\"\",\"\",'PVR BH'!$A$33)","v":8}]
[18,{"$f":"IF('PVR BH'!$B$34=\"\",\"\",'PVR BH'!$B$34)","v":""},{"$f":"IF( 'PVR BH'!$B$5=\"\",\"\", 'PVR BH'!$B$5)","v":"TEX-124-E"},{"$f":"IF('PVR BH'!$B$24=\"\",\"\",'PVR BH'!$B$24)","v":"Depth to Bottom of Layer [ft]"},{"$f":"IF('PVR BH'!$A$34=\"\",\"\",'PVR BH'!$A$34)","v":9}]
[19,{"$f":"IF('PVR BH'!$B$35=\"\",\"\",'PVR BH'!$B$35)","v":""},{"$f":"IF( 'PVR BH'!$B$5=\"\",\"\", 'PVR BH'!$B$5)","v":"TEX-124-E"},{"$f":"IF('PVR BH'!$B$24=\"\",\"\",'PVR BH'!$B$24)","v":"Depth to Bottom of Layer [ft]"},{"$f":"IF('PVR BH'!$A$35=\"\",\"\",'PVR BH'!$A$35)","v":10}]
[20,{"$f":"IF('PVR BH'!$C$25=\"\",\"\",'PVR BH'!$C$25)","v":0},{"$f":"IF( 'PVR BH'!$B$5=\"\",\"\", 'PVR BH'!$B$5)","v":"TEX-124-E"},{"$f":"IF('PVR BH'!$C$24=\"\",\"\",'PVR BH'!$C$24)","v":"Average Load [psi]"},{"$f":"IF('PVR BH'!$A$25=\"\",\"\",'PVR BH'!$A$25)","v":0}]
[21,{"$f":"IF('PVR BH'!$C$26=\"\",\"\",'PVR BH'!$C$26)","v":0},{"$f":"IF( 'PVR BH'!$B$5=\"\",\"\", 'PVR BH'!$B$5)","v":"TEX-124-E"},{"$f":"IF('PVR BH'!$C$24=\"\",\"\",'PVR BH'!$C$24)","v":"Average Load [psi]"},{"$f":"IF('PVR BH'!$A$26=\"\",\"\",'PVR BH'!$A$26)","v":1}]
[22,{"$f":"IF('PVR BH'!$C$27=\"\",\"\",'PVR BH'!$C$27)","v":0},{"$f":"IF( 'PVR BH'!$B$5=\"\",\"\", 'PVR BH'!$B$5)","v":"TEX-124-E"},{"$f":"IF('PVR BH'!$C$24=\"\",\"\",'PVR BH'!$C$24)","v":"Average Load [psi]"},{"$f":"IF('PVR BH'!$A$27=\"\",\"\",'PVR BH'!$A$27)","v":2}]
[23,{"$f":"IF('PVR BH'!$C$28=\"\",\"\",'PVR BH'!$C$28)","v":0},{"$f":"IF( 'PVR BH'!$B$5=\"\",\"\", 'PVR BH'!$B$5)","v":"TEX-124-E"},{"$f":"IF('PVR BH'!$C$24=\"\",\"\",'PVR BH'!$C$24)","v":"Average Load [psi]"},{"$f":"IF('PVR BH'!$A$28=\"\",\"\",'PVR BH'!$A$28)","v":3}]
[24,{"$f":"IF('PVR BH'!$C$29=\"\",\"\",'PVR BH'!$C$29)","v":0},{"$f":"IF( 'PVR BH'!$B$5=\"\",\"\", 'PVR BH'!$B$5)","v":"TEX-124-E"},{"$f":"IF('PVR BH'!$C$24=\"\",\"\",'PVR BH'!$C$24)","v":"Average Load [psi]"},{"$f":"IF('PVR BH'!$A$29=\"\",\"\",'PVR BH'!$A$29)","v":4}]
[25,{"$f":"IF('PVR BH'!$C$30=\"\",\"\",'PVR BH'!$C$30)","v":0},{"$f":"IF( 'PVR BH'!$B$5=\"\",\"\", 'PVR BH'!$B$5)","v":"TEX-124-E"},{"$f":"IF('PVR BH'!$C$24=\"\",\"\",'PVR BH'!$C$24)","v":"Average Load [psi]"},{"$f":"IF('PVR BH'!$A$30=\"\",\"\",'PVR BH'!$A$30)","v":5}]
[26,{"$f":"IF('PVR BH'!$C$31=\"\",\"\",'PVR BH'!$C$31)","v":0},{"$f":"IF( 'PVR BH'!$B$5=\"\",\"\", 'PVR BH'!$B$5)","v":"TEX-124-E"},{"$f":"IF('PVR BH'!$C$24=\"\",\"\",'PVR BH'!$C$24)","v":"Average Load [psi]"},{"$f":"IF('PVR BH'!$A$31=\"\",\"\",'PVR BH'!$A$31)","v":6}]
[27,{"$f":"IF('PVR BH'!$C$32=\"\",\"\",'PVR BH'!$C$32)","v":0},{"$f":"IF( 'PVR BH'!$B$5=\"\",\"\", 'PVR BH'!$B$5)","v":"TEX-124-E"},{"$f":"IF('PVR BH'!$C$24=\"\",\"\",'PVR BH'!$C$24)","v":"Average Load [psi]"},{"$f":"IF('PVR BH'!$A$32=\"\",\"\",'PVR BH'!$A$32)","v":7}]
[28,{"$f":"IF('PVR BH'!$C$33=\"\",\"\",'PVR BH'!$C$33)","v":0},{"$f":"IF( 'PVR BH'!$B$5=\"\",\"\", 'PVR BH'!$B$5)","v":"TEX-124-E"},{"$f":"IF('PVR BH'!$C$24=\"\",\"\",'PVR BH'!$C$24)","v":"Average Load [psi]"},{"$f":"IF('PVR BH'!$A$33=\"\",\"\",'PVR BH'!$A$33)","v":8}]
[29,{"$f":"IF('PVR BH'!$C$34=\"\",\"\",'PVR BH'!$C$34)","v":0},{"$f":"IF( 'PVR BH'!$B$5=\"\",\"\", 'PVR BH'!$B$5)","v":"TEX-124-E"},{"$f":"IF('PVR BH'!$C$24=\"\",\"\",'PVR BH'!$C$24)","v":"Average Load [psi]"},{"$f":"IF('PVR BH'!$A$34=\"\",\"\",'PVR BH'!$A$34)","v":9}]
[30,{"$f":"IF('PVR BH'!$C$35=\"\",\"\",'PVR BH'!$C$35)","v":0},{"$f":"IF( 'PVR BH'!$B$5=\"\",\"\", 'PVR BH'!$B$5)","v":"TEX-124-E"},{"$f":"IF('PVR BH'!$C$24=\"\",\"\",'PVR BH'!$C$24)","v":"Average Load [psi]"},{"$f":"IF('PVR BH'!$A$35=\"\",\"\",'PVR BH'!$A$35)","v":10}]
[31,{"$f":"IF('PVR BH'!$D$25=\"\",\"\",'PVR BH'!$D$25)","v":"-"},{"$f":"IF( 'PVR BH'!$B$5=\"\",\"\", 'PVR BH'!$B$5)","v":"TEX-124-E"},{"$f":"IF('PVR BH'!$D$24=\"\",\"\",'PVR BH'!$D$24)","v":"Liquid Limit (LL)"},{"$f":"IF('PVR BH'!$A$25=\"\",\"\",'PVR BH'!$A$25)","v":0}]
[32,{"$f":"IF('PVR BH'!$D$26=\"\",\"\",'PVR BH'!$D$26)","v":""},{"$f":"IF( 'PVR BH'!$B$5=\"\",\"\", 'PVR BH'!$B$5)","v":"TEX-124-E"},{"$f":"IF('PVR BH'!$D$24=\"\",\"\",'PVR BH'!$D$24)","v":"Liquid Limit (LL)"},{"$f":"IF('PVR BH'!$A$26=\"\",\"\",'PVR BH'!$A$26)","v":1}]
[33,{"$f":"IF('PVR BH'!$D$27=\"\",\"\",'PVR BH'!$D$27)","v":""},{"$f":"IF( 'PVR BH'!$B$5=\"\",\"\", 'PVR BH'!$B$5)","v":"TEX-124-E"},{"$f":"IF('PVR BH'!$D$24=\"\",\"\",'PVR BH'!$D$24)","v":"Liquid Limit (LL)"},{"$f":"IF('PVR BH'!$A$27=\"\",\"\",'PVR BH'!$A$27)","v":2}]
[34,{"$f":"IF('PVR BH'!$D$28=\"\",\"\",'PVR BH'!$D$28)","v":""},{"$f":"IF( 'PVR BH'!$B$5=\"\",\"\", 'PVR BH'!$B$5)","v":"TEX-124-E"},{"$f":"IF('PVR BH'!$D$24=\"\",\"\",'PVR BH'!$D$24)","v":"Liquid Limit (LL)"},{"$f":"IF('PVR BH'!$A$28=\"\",\"\",'PVR BH'!$A$28)","v":3}]
[35,{"$f":"IF('PVR BH'!$D$29=\"\",\"\",'PVR BH'!$D$29)","v":""},{"$f":"IF( 'PVR BH'!$B$5=\"\",\"\", 'PVR BH'!$B$5)","v":"TEX-124-E"},{"$f":"IF('PVR BH'!$D$24=\"\",\"\",'PVR BH'!$D$24)","v":"Liquid Limit (LL)"},{"$f":"IF('PVR BH'!$A$29=\"\",\"\",'PVR BH'!$A$29)","v":4}]
[36,{"$f":"IF('PVR BH'!$D$30=\"\",\"\",'PVR BH'!$D$30)","v":""},{"$f":"IF( 'PVR BH'!$B$5=\"\",\"\", 'PVR BH'!$B$5)","v":"TEX-124-E"},{"$f":"IF('PVR BH'!$D$24=\"\",\"\",'PVR BH'!$D$24)","v":"Liquid Limit (LL)"},{"$f":"IF('PVR BH'!$A$30=\"\",\"\",'PVR BH'!$A$30)","v":5}]
[37,{"$f":"IF('PVR BH'!$D$31=\"\",\"\",'PVR BH'!$D$31)","v":""},{"$f":"IF( 'PVR BH'!$B$5=\"\",\"\", 'PVR BH'!$B$5)","v":"TEX-124-E"},{"$f":"IF('PVR BH'!$D$24=\"\",\"\",'PVR BH'!$D$24)","v":"Liquid Limit (LL)"},{"$f":"IF('PVR BH'!$A$31=\"\",\"\",'PVR BH'!$A$31)","v":6}]
[38,{"$f":"IF('PVR BH'!$D$32=\"\",\"\",'PVR BH'!$D$32)","v":""},{"$f":"IF( 'PVR BH'!$B$5=\"\",\"\", 'PVR BH'!$B$5)","v":"TEX-124-E"},{"$f":"IF('PVR BH'!$D$24=\"\",\"\",'PVR BH'!$D$24)","v":"Liquid Limit (LL)"},{"$f":"IF('PVR BH'!$A$32=\"\",\"\",'PVR BH'!$A$32)","v":7}]
[39,{"$f":"IF('PVR BH'!$D$33=\"\",\"\",'PVR BH'!$D$33)","v":""},{"$f":"IF( 'PVR BH'!$B$5=\"\",\"\", 'PVR BH'!$B$5)","v":"TEX-124-E"},{"$f":"IF('PVR BH'!$D$24=\"\",\"\",'PVR BH'!$D$24)","v":"Liquid Limit (LL)"},{"$f":"IF('PVR BH'!$A$33=\"\",\"\",'PVR BH'!$A$33)","v":8}]
[40,{"$f":"IF('PVR BH'!$D$34=\"\",\"\",'PVR BH'!$D$34)","v":""},{"$f":"IF( 'PVR BH'!$B$5=\"\",\"\", 'PVR BH'!$B$5)","v":"TEX-124-E"},{"$f":"IF('PVR BH'!$D$24=\"\",\"\",'PVR BH'!$D$24)","v":"Liquid Limit (LL)"},{"$f":"IF('PVR BH'!$A$34=\"\",\"\",'PVR BH'!$A$34)","v":9}]
[41,{"$f":"IF('PVR BH'!$D$35=\"\",\"\",'PVR BH'!$D$35)","v":""},{"$f":"IF( 'PVR BH'!$B$5=\"\",\"\", 'PVR BH'!$B$5)","v":"TEX-124-E"},{"$f":"IF('PVR BH'!$D$24=\"\",\"\",'PVR BH'!$D$24)","v":"Liquid Limit (LL)"},{"$f":"IF('PVR BH'!$A$35=\"\",\"\",'PVR BH'!$A$35)","v":10}]
[42,{"$f":"IF('PVR BH'!$E$25=\"\",\"\",'PVR BH'!$E$25)","v":"-"},{"$f":"IF( 'PVR BH'!$B$5=\"\",\"\", 'PVR BH'!$B$5)","v":"TEX-124-E"},{"$f":"IF('PVR BH'!$E$24=\"\",\"\",'PVR BH'!$E$24)","v":"Dry 0.2LL+9"},{"$f":"IF('PVR BH'!$A$25=\"\",\"\",'PVR BH'!$A$25)","v":0}]
[43,{"$f":"IF('PVR BH'!$E$26=\"\",\"\",'PVR BH'!$E$26)","v":9},{"$f":"IF( 'PVR BH'!$B$5=\"\",\"\", 'PVR BH'!$B$5)","v":"TEX-124-E"},{"$f":"IF('PVR BH'!$E$24=\"\",\"\",'PVR BH'!$E$24)","v":"Dry 0.2LL+9"},{"$f":"IF('PVR BH'!$A$26=\"\",\"\",'PVR BH'!$A$26)","v":1}]
[44,{"$f":"IF('PVR BH'!$E$27=\"\",\"\",'PVR BH'!$E$27)","v":9},{"$f":"IF( 'PVR BH'!$B$5=\"\",\"\", 'PVR BH'!$B$5)","v":"TEX-124-E"},{"$f":"IF('PVR BH'!$E$24=\"\",\"\",'PVR BH'!$E$24)","v":"Dry 0.2LL+9"},{"$f":"IF('PVR BH'!$A$27=\"\",\"\",'PVR BH'!$A$27)","v":2}]
[45,{"$f":"IF('PVR BH'!$E$28=\"\",\"\",'PVR BH'!$E$28)","v":9},{"$f":"IF( 'PVR BH'!$B$5=\"\",\"\", 'PVR BH'!$B$5)","v":"TEX-124-E"},{"$f":"IF('PVR BH'!$E$24=\"\",\"\",'PVR BH'!$E$24)","v":"Dry 0.2LL+9"},{"$f":"IF('PVR BH'!$A$28=\"\",\"\",'PVR BH'!$A$28)","v":3}]
[46,{"$f":"IF('PVR BH'!$E$29=\"\",\"\",'PVR BH'!$E$29)","v":9},{"$f":"IF( 'PVR BH'!$B$5=\"\",\"\", 'PVR BH'!$B$5)","v":"TEX-124-E"},{"$f":"IF('PVR BH'!$E$24=\"\",\"\",'PVR BH'!$E$24)","v":"Dry 0.2LL+9"},{"$f":"IF('PVR BH'!$A$29=\"\",\"\",'PVR BH'!$A$29)","v":4}]
[47,{"$f":"IF('PVR BH'!$E$30=\"\",\"\",'PVR BH'!$E$30)","v":9},{"$f":"IF( 'PVR BH'!$B$5=\"\",\"\", 'PVR BH'!$B$5)","v":"TEX-124-E"},{"$f":"IF('PVR BH'!$E$24=\"\",\"\",'PVR BH'!$E$24)","v":"Dry 0.2LL+9"},{"$f":"IF('PVR BH'!$A$30=\"\",\"\",'PVR BH'!$A$30)","v":5}]
[48,{"$f":"IF('PVR BH'!$E$31=\"\",\"\",'PVR BH'!$E$31)","v":9},{"$f":"IF( 'PVR BH'!$B$5=\"\",\"\", 'PVR BH'!$B$5)","v":"TEX-124-E"},{"$f":"IF('PVR BH'!$E$24=\"\",\"\",'PVR BH'!$E$24)","v":"Dry 0.2LL+9"},{"$f":"IF('PVR BH'!$A$31=\"\",\"\",'PVR BH'!$A$31)","v":6}]
[49,{"$f":"IF('PVR BH'!$E$32=\"\",\"\",'PVR BH'!$E$32)","v":9},{"$f":"IF( 'PVR BH'!$B$5=\"\",\"\", 'PVR BH'!$B$5)","v":"TEX-124-E"},{"$f":"IF('PVR BH'!$E$24=\"\",\"\",'PVR BH'!$E$24)","v":"Dry 0.2LL+9"},{"$f":"IF('PVR BH'!$A$32=\"\",\"\",'PVR BH'!$A$32)","v":7}]
[50,{"$f":"IF('PVR BH'!$E$33=\"\",\"\",'PVR BH'!$E$33)","v":9},{"$f":"IF( 'PVR BH'!$B$5=\"\",\"\", 'PVR BH'!$B$5)","v":"TEX-124-E"},{"$f":"IF('PVR BH'!$E$24=\"\",\"\",'PVR BH'!$E$24)","v":"Dry 0.2LL+9"},{"$f":"IF('PVR BH'!$A$33=\"\",\"\",'PVR BH'!$A$33)","v":8}]
[51,{"$f":"IF('PVR BH'!$E$34=\"\",\"\",'PVR BH'!$E$34)","v":9},{"$f":"IF( 'PVR BH'!$B$5=\"\",\"\", 'PVR BH'!$B$5)","v":"TEX-124-E"},{"$f":"IF('PVR BH'!$E$24=\"\",\"\",'PVR BH'!$E$24)","v":"Dry 0.2LL+9"},{"$f":"IF('PVR BH'!$A$34=\"\",\"\",'PVR BH'!$A$34)","v":9}]
[52,{"$f":"IF('PVR BH'!$E$35=\"\",\"\",'PVR BH'!$E$35)","v":9},{"$f":"IF( 'PVR BH'!$B$5=\"\",\"\", 'PVR BH'!$B$5)","v":"TEX-124-E"},{"$f":"IF('PVR BH'!$E$24=\"\",\"\",'PVR BH'!$E$24)","v":"Dry 0.2LL+9"},{"$f":"IF('PVR BH'!$A$35=\"\",\"\",'PVR BH'!$A$35)","v":10}]
[53,{"$f":"IF('PVR BH'!$F$25=\"\",\"\",'PVR BH'!$F$25)","v":"-"},{"$f":"IF( 'PVR BH'!$B$5=\"\",\"\", 'PVR BH'!$B$5)","v":"TEX-124-E"},{"$f":"IF('PVR BH'!$F$24=\"\",\"\",'PVR BH'!$F$24)","v":"Wet 0.47LL+2"},{"$f":"IF('PVR BH'!$A$25=\"\",\"\",'PVR BH'!$A$25)","v":0}]
[54,{"$f":"IF('PVR BH'!$F$26=\"\",\"\",'PVR BH'!$F$26)","v":2},{"$f":"IF( 'PVR BH'!$B$5=\"\",\"\", 'PVR BH'!$B$5)","v":"TEX-124-E"},{"$f":"IF('PVR BH'!$F$24=\"\",\"\",'PVR BH'!$F$24)","v":"Wet 0.47LL+2"},{"$f":"IF('PVR BH'!$A$26=\"\",\"\",'PVR BH'!$A$26)","v":1}]
[55,{"$f":"IF('PVR BH'!$F$27=\"\",\"\",'PVR BH'!$F$27)","v":2},{"$f":"IF( 'PVR BH'!$B$5=\"\",\"\", 'PVR BH'!$B$5)","v":"TEX-124-E"},{"$f":"IF('PVR BH'!$F$24=\"\",\"\",'PVR BH'!$F$24)","v":"Wet 0.47LL+2"},{"$f":"IF('PVR BH'!$A$27=\"\",\"\",'PVR BH'!$A$27)","v":2}]
[56,{"$f":"IF('PVR BH'!$F$28=\"\",\"\",'PVR BH'!$F$28)","v":2},{"$f":"IF( 'PVR BH'!$B$5=\"\",\"\", 'PVR BH'!$B$5)","v":"TEX-124-E"},{"$f":"IF('PVR BH'!$F$24=\"\",\"\",'PVR BH'!$F$24)","v":"Wet 0.47LL+2"},{"$f":"IF('PVR BH'!$A$28=\"\",\"\",'PVR BH'!$A$28)","v":3}]
[57,{"$f":"IF('PVR BH'!$F$29=\"\",\"\",'PVR BH'!$F$29)","v":2},{"$f":"IF( 'PVR BH'!$B$5=\"\",\"\", 'PVR BH'!$B$5)","v":"TEX-124-E"},{"$f":"IF('PVR BH'!$F$24=\"\",\"\",'PVR BH'!$F$24)","v":"Wet 0.47LL+2"},{"$f":"IF('PVR BH'!$A$29=\"\",\"\",'PVR BH'!$A$29)","v":4}]
[58,{"$f":"IF('PVR BH'!$F$30=\"\",\"\",'PVR BH'!$F$30)","v":2},{"$f":"IF( 'PVR BH'!$B$5=\"\",\"\", 'PVR BH'!$B$5)","v":"TEX-124-E"},{"$f":"IF('PVR BH'!$F$24=\"\",\"\",'PVR BH'!$F$24)","v":"Wet 0.47LL+2"},{"$f":"IF('PVR BH'!$A$30=\"\",\"\",'PVR BH'!$A$30)","v":5}]
[59,{"$f":"IF('PVR BH'!$F$31=\"\",\"\",'PVR BH'!$F$31)","v":2},{"$f":"IF( 'PVR BH'!$B$5=\"\",\"\", 'PVR BH'!$B$5)","v":"TEX-124-E"},{"$f":"IF('PVR BH'!$F$24=\"\",\"\",'PVR BH'!$F$24)","v":"Wet 0.47LL+2"},{"$f":"IF('PVR BH'!$A$31=\"\",\"\",'PVR BH'!$A$31)","v":6}]
[60,{"$f":"IF('PVR BH'!$F$32=\"\",\"\",'PVR BH'!$F$32)","v":2},{"$f":"IF( 'PVR BH'!$B$5=\"\",\"\", 'PVR BH'!$B$5)","v":"TEX-124-E"},{"$f":"IF('PVR BH'!$F$24=\"\",\"\",'PVR BH'!$F$24)","v":"Wet 0.47LL+2"},{"$f":"IF('PVR BH'!$A$32=\"\",\"\",'PVR BH'!$A$32)","v":7}]
[61,{"$f":"IF('PVR BH'!$F$33=\"\",\"\",'PVR BH'!$F$33)","v":2},{"$f":"IF( 'PVR BH'!$B$5=\"\",\"\", 'PVR BH'!$B$5)","v":"TEX-124-E"},{"$f":"IF('PVR BH'!$F$24=\"\",\"\",'PVR BH'!$F$24)","v":"Wet 0.47LL+2"},{"$f":"IF('PVR BH'!$A$33=\"\",\"\",'PVR BH'!$A$33)","v":8}]
[62,{"$f":"IF('PVR BH'!$F$34=\"\",\"\",'PVR BH'!$F$34)","v":2},{"$f":"IF( 'PVR BH'!$B$5=\"\",\"\", 'PVR BH'!$B$5)","v":"TEX-124-E"},{"$f":"IF('PVR BH'!$F$24=\"\",\"\",'PVR BH'!$F$24)","v":"Wet 0.47LL+2"},{"$f":"IF('PVR BH'!$A$34=\"\",\"\",'PVR BH'!$A$34)","v":9}]
[63,{"$f":"IF('PVR BH'!$F$35=\"\",\"\",'PVR BH'!$F$35)","v":2},{"$f":"IF( 'PVR BH'!$B$5=\"\",\"\", 'PVR BH'!$B$5)","v":"TEX-124-E"},{"$f":"IF('PVR BH'!$F$24=\"\",\"\",'PVR BH'!$F$24)","v":"Wet 0.47LL+2"},{"$f":"IF('PVR BH'!$A$35=\"\",\"\",'PVR BH'!$A$35)","v":10}]
[64,{"$f":"IF('PVR BH'!$G$25=\"\",\"\",'PVR BH'!$G$25)","v":"-"},{"$f":"IF( 'PVR BH'!$B$5=\"\",\"\", 'PVR BH'!$B$5)","v":"TEX-124-E"},{"$f":"IF('PVR BH'!$G$24=\"\",\"\",'PVR BH'!$G$24)","v":"Percent Moisture"},{"$f":"IF('PVR BH'!$A$25=\"\",\"\",'PVR BH'!$A$25)","v":0}]
[65,{"$f":"IF('PVR BH'!$G$26=\"\",\"\",'PVR BH'!$G$26)","v":""},{"$f":"IF( 'PVR BH'!$B$5=\"\",\"\", 'PVR BH'!$B$5)","v":"TEX-124-E"},{"$f":"IF('PVR BH'!$G$24=\"\",\"\",'PVR BH'!$G$24)","v":"Percent Moisture"},{"$f":"IF('PVR BH'!$A$26=\"\",\"\",'PVR BH'!$A$26)","v":1}]
[66,{"$f":"IF('PVR BH'!$G$27=\"\",\"\",'PVR BH'!$G$27)","v":""},{"$f":"IF( 'PVR BH'!$B$5=\"\",\"\", 'PVR BH'!$B$5)","v":"TEX-124-E"},{"$f":"IF('PVR BH'!$G$24=\"\",\"\",'PVR BH'!$G$24)","v":"Percent Moisture"},{"$f":"IF('PVR BH'!$A$27=\"\",\"\",'PVR BH'!$A$27)","v":2}]
[67,{"$f":"IF('PVR BH'!$G$28=\"\",\"\",'PVR BH'!$G$28)","v":""},{"$f":"IF( 'PVR BH'!$B$5=\"\",\"\", 'PVR BH'!$B$5)","v":"TEX-124-E"},{"$f":"IF('PVR BH'!$G$24=\"\",\"\",'PVR BH'!$G$24)","v":"Percent Moisture"},{"$f":"IF('PVR BH'!$A$28=\"\",\"\",'PVR BH'!$A$28)","v":3}]
[68,{"$f":"IF('PVR BH'!$G$29=\"\",\"\",'PVR BH'!$G$29)","v":""},{"$f":"IF( 'PVR BH'!$B$5=\"\",\"\", 'PVR BH'!$B$5)","v":"TEX-124-E"},{"$f":"IF('PVR BH'!$G$24=\"\",\"\",'PVR BH'!$G$24)","v":"Percent Moisture"},{"$f":"IF('PVR BH'!$A$29=\"\",\"\",'PVR BH'!$A$29)","v":4}]
[69,{"$f":"IF('PVR BH'!$G$30=\"\",\"\",'PVR BH'!$G$30)","v":""},{"$f":"IF( 'PVR BH'!$B$5=\"\",\"\", 'PVR BH'!$B$5)","v":"TEX-124-E"},{"$f":"IF('PVR BH'!$G$24=\"\",\"\",'PVR BH'!$G$24)","v":"Percent Moisture"},{"$f":"IF('PVR BH'!$A$30=\"\",\"\",'PVR BH'!$A$30)","v":5}]
[70,{"$f":"IF('PVR BH'!$G$31=\"\",\"\",'PVR BH'!$G$31)","v":""},{"$f":"IF( 'PVR BH'!$B$5=\"\",\"\", 'PVR BH'!$B$5)","v":"TEX-124-E"},{"$f":"IF('PVR BH'!$G$24=\"\",\"\",'PVR BH'!$G$24)","v":"Percent Moisture"},{"$f":"IF('PVR BH'!$A$31=\"\",\"\",'PVR BH'!$A$31)","v":6}]
[71,{"$f":"IF('PVR BH'!$G$32=\"\",\"\",'PVR BH'!$G$32)","v":""},{"$f":"IF( 'PVR BH'!$B$5=\"\",\"\", 'PVR BH'!$B$5)","v":"TEX-124-E"},{"$f":"IF('PVR BH'!$G$24=\"\",\"\",'PVR BH'!$G$24)","v":"Percent Moisture"},{"$f":"IF('PVR BH'!$A$32=\"\",\"\",'PVR BH'!$A$32)","v":7}]
[72,{"$f":"IF('PVR BH'!$G$33=\"\",\"\",'PVR BH'!$G$33)","v":""},{"$f":"IF( 'PVR BH'!$B$5=\"\",\"\", 'PVR BH'!$B$5)","v":"TEX-124-E"},{"$f":"IF('PVR BH'!$G$24=\"\",\"\",'PVR BH'!$G$24)","v":"Percent Moisture"},{"$f":"IF('PVR BH'!$A$33=\"\",\"\",'PVR BH'!$A$33)","v":8}]
[73,{"$f":"IF('PVR BH'!$G$34=\"\",\"\",'PVR BH'!$G$34)","v":""},{"$f":"IF( 'PVR BH'!$B$5=\"\",\"\", 'PVR BH'!$B$5)","v":"TEX-124-E"},{"$f":"IF('PVR BH'!$G$24=\"\",\"\",'PVR BH'!$G$24)","v":"Percent Moisture"},{"$f":"IF('PVR BH'!$A$34=\"\",\"\",'PVR BH'!$A$34)","v":9}]
[74,{"$f":"IF('PVR BH'!$G$35=\"\",\"\",'PVR BH'!$G$35)","v":""},{"$f":"IF( 'PVR BH'!$B$5=\"\",\"\", 'PVR BH'!$B$5)","v":"TEX-124-E"},{"$f":"IF('PVR BH'!$G$24=\"\",\"\",'PVR BH'!$G$24)","v":"Percent Moisture"},{"$f":"IF('PVR BH'!$A$35=\"\",\"\",'PVR BH'!$A$35)","v":10}]
[75,{"$f":"IF('PVR BH'!$H$25=\"\",\"\",'PVR BH'!$H$25)","v":"-"},{"$f":"IF( 'PVR BH'!$B$5=\"\",\"\", 'PVR BH'!$B$5)","v":"TEX-124-E"},{"$f":"IF('PVR BH'!$H$24=\"\",\"\",'PVR BH'!$H$24)","v":"Dry       Avg       Wet"},{"$f":"IF('PVR BH'!$A$25=\"\",\"\",'PVR BH'!$A$25)","v":0}]
[76,{"$f":"IF('PVR BH'!$H$26=\"\",\"\",'PVR BH'!$H$26)","v":"Dry"},{"$f":"IF( 'PVR BH'!$B$5=\"\",\"\", 'PVR BH'!$B$5)","v":"TEX-124-E"},{"$f":"IF('PVR BH'!$H$24=\"\",\"\",'PVR BH'!$H$24)","v":"Dry       Avg       Wet"},{"$f":"IF('PVR BH'!$A$26=\"\",\"\",'PVR BH'!$A$26)","v":1}]
[77,{"$f":"IF('PVR BH'!$H$27=\"\",\"\",'PVR BH'!$H$27)","v":"Dry"},{"$f":"IF( 'PVR BH'!$B$5=\"\",\"\", 'PVR BH'!$B$5)","v":"TEX-124-E"},{"$f":"IF('PVR BH'!$H$24=\"\",\"\",'PVR BH'!$H$24)","v":"Dry       Avg       Wet"},{"$f":"IF('PVR BH'!$A$27=\"\",\"\",'PVR BH'!$A$27)","v":2}]
[78,{"$f":"IF('PVR BH'!$H$28=\"\",\"\",'PVR BH'!$H$28)","v":"Dry"},{"$f":"IF( 'PVR BH'!$B$5=\"\",\"\", 'PVR BH'!$B$5)","v":"TEX-124-E"},{"$f":"IF('PVR BH'!$H$24=\"\",\"\",'PVR BH'!$H$24)","v":"Dry       Avg       Wet"},{"$f":"IF('PVR BH'!$A$28=\"\",\"\",'PVR BH'!$A$28)","v":3}]
[79,{"$f":"IF('PVR BH'!$H$29=\"\",\"\",'PVR BH'!$H$29)","v":"Dry"},{"$f":"IF( 'PVR BH'!$B$5=\"\",\"\", 'PVR BH'!$B$5)","v":"TEX-124-E"},{"$f":"IF('PVR BH'!$H$24=\"\",\"\",'PVR BH'!$H$24)","v":"Dry       Avg       Wet"},{"$f":"IF('PVR BH'!$A$29=\"\",\"\",'PVR BH'!$A$29)","v":4}]
[80,{"$f":"IF('PVR BH'!$H$30=\"\",\"\",'PVR BH'!$H$30)","v":"Dry"},{"$f":"IF( 'PVR BH'!$B$5=\"\",\"\", 'PVR BH'!$B$5)","v":"TEX-124-E"},{"$f":"IF('PVR BH'!$H$24=\"\",\"\",'PVR BH'!$H$24)","v":"Dry       Avg       Wet"},{"$f":"IF('PVR BH'!$A$30=\"\",\"\",'PVR BH'!$A$30)","v":5}]
[81,{"$f":"IF('PVR BH'!$H$31=\"\",\"\",'PVR BH'!$H$31)","v":"Dry"},{"$f":"IF( 'PVR BH'!$B$5=\"\",\"\", 'PVR BH'!$B$5)","v":"TEX-124-E"},{"$f":"IF('PVR BH'!$H$24=\"\",\"\",'PVR BH'!$H$24)","v":"Dry       Avg       Wet"},{"$f":"IF('PVR BH'!$A$31=\"\",\"\",'PVR BH'!$A$31)","v":6}]
[82,{"$f":"IF('PVR BH'!$H$32=\"\",\"\",'PVR BH'!$H$32)","v":"Dry"},{"$f":"IF( 'PVR BH'!$B$5=\"\",\"\", 'PVR BH'!$B$5)","v":"TEX-124-E"},{"$f":"IF('PVR BH'!$H$24=\"\",\"\",'PVR BH'!$H$24)","v":"Dry       Avg       Wet"},{"$f":"IF('PVR BH'!$A$32=\"\",\"\",'PVR BH'!$A$32)","v":7}]
[83,{"$f":"IF('PVR BH'!$H$33=\"\",\"\",'PVR BH'!$H$33)","v":"Dry"},{"$f":"IF( 'PVR BH'!$B$5=\"\",\"\", 'PVR BH'!$B$5)","v":"TEX-124-E"},{"$f":"IF('PVR BH'!$H$24=\"\",\"\",'PVR BH'!$H$24)","v":"Dry       Avg       Wet"},{"$f":"IF('PVR BH'!$A$33=\"\",\"\",'PVR BH'!$A$33)","v":8}]
[84,{"$f":"IF('PVR BH'!$H$34=\"\",\"\",'PVR BH'!$H$34)","v":"Dry"},{"$f":"IF( 'PVR BH'!$B$5=\"\",\"\", 'PVR BH'!$B$5)","v":"TEX-124-E"},{"$f":"IF('PVR BH'!$H$24=\"\",\"\",'PVR BH'!$H$24)","v":"Dry       Avg       Wet"},{"$f":"IF('PVR BH'!$A$34=\"\",\"\",'PVR BH'!$A$34)","v":9}]
[85,{"$f":"IF('PVR BH'!$H$35=\"\",\"\",'PVR BH'!$H$35)","v":"Dry"},{"$f":"IF( 'PVR BH'!$B$5=\"\",\"\", 'PVR BH'!$B$5)","v":"TEX-124-E"},{"$f":"IF('PVR BH'!$H$24=\"\",\"\",'PVR BH'!$H$24)","v":"Dry       Avg       Wet"},{"$f":"IF('PVR BH'!$A$35=\"\",\"\",'PVR BH'!$A$35)","v":10}]
[86,{"$f":"IF('PVR BH'!$I$25=\"\",\"\",'PVR BH'!$I$25)","v":"-"},{"$f":"IF( 'PVR BH'!$B$5=\"\",\"\", 'PVR BH'!$B$5)","v":"TEX-124-E"},{"$f":"IF('PVR BH'!$I$24=\"\",\"\",'PVR BH'!$I$24)","v":"Percent       -No.40"},{"$f":"IF('PVR BH'!$A$25=\"\",\"\",'PVR BH'!$A$25)","v":0}]
[87,{"$f":"IF('PVR BH'!$I$26=\"\",\"\",'PVR BH'!$I$26)","v":""},{"$f":"IF( 'PVR BH'!$B$5=\"\",\"\", 'PVR BH'!$B$5)","v":"TEX-124-E"},{"$f":"IF('PVR BH'!$I$24=\"\",\"\",'PVR BH'!$I$24)","v":"Percent       -No.40"},{"$f":"IF('PVR BH'!$A$26=\"\",\"\",'PVR BH'!$A$26)","v":1}]
[88,{"$f":"IF('PVR BH'!$I$27=\"\",\"\",'PVR BH'!$I$27)","v":""},{"$f":"IF( 'PVR BH'!$B$5=\"\",\"\", 'PVR BH'!$B$5)","v":"TEX-124-E"},{"$f":"IF('PVR BH'!$I$24=\"\",\"\",'PVR BH'!$I$24)","v":"Percent       -No.40"},{"$f":"IF('PVR BH'!$A$27=\"\",\"\",'PVR BH'!$A$27)","v":2}]
[89,{"$f":"IF('PVR BH'!$I$28=\"\",\"\",'PVR BH'!$I$28)","v":""},{"$f":"IF( 'PVR BH'!$B$5=\"\",\"\", 'PVR BH'!$B$5)","v":"TEX-124-E"},{"$f":"IF('PVR BH'!$I$24=\"\",\"\",'PVR BH'!$I$24)","v":"Percent       -No.40"},{"$f":"IF('PVR BH'!$A$28=\"\",\"\",'PVR BH'!$A$28)","v":3}]
[90,{"$f":"IF('PVR BH'!$I$29=\"\",\"\",'PVR BH'!$I$29)","v":""},{"$f":"IF( 'PVR BH'!$B$5=\"\",\"\", 'PVR BH'!$B$5)","v":"TEX-124-E"},{"$f":"IF('PVR BH'!$I$24=\"\",\"\",'PVR BH'!$I$24)","v":"Percent       -No.40"},{"$f":"IF('PVR BH'!$A$29=\"\",\"\",'PVR BH'!$A$29)","v":4}]
[91,{"$f":"IF('PVR BH'!$I$30=\"\",\"\",'PVR BH'!$I$30)","v":""},{"$f":"IF( 'PVR BH'!$B$5=\"\",\"\", 'PVR BH'!$B$5)","v":"TEX-124-E"},{"$f":"IF('PVR BH'!$I$24=\"\",\"\",'PVR BH'!$I$24)","v":"Percent       -No.40"},{"$f":"IF('PVR BH'!$A$30=\"\",\"\",'PVR BH'!$A$30)","v":5}]
[92,{"$f":"IF('PVR BH'!$I$31=\"\",\"\",'PVR BH'!$I$31)","v":""},{"$f":"IF( 'PVR BH'!$B$5=\"\",\"\", 'PVR BH'!$B$5)","v":"TEX-124-E"},{"$f":"IF('PVR BH'!$I$24=\"\",\"\",'PVR BH'!$I$24)","v":"Percent       -No.40"},{"$f":"IF('PVR BH'!$A$31=\"\",\"\",'PVR BH'!$A$31)","v":6}]
[93,{"$f":"IF('PVR BH'!$I$32=\"\",\"\",'PVR BH'!$I$32)","v":""},{"$f":"IF( 'PVR BH'!$B$5=\"\",\"\", 'PVR BH'!$B$5)","v":"TEX-124-E"},{"$f":"IF('PVR BH'!$I$24=\"\",\"\",'PVR BH'!$I$24)","v":"Percent       -No.40"},{"$f":"IF('PVR BH'!$A$32=\"\",\"\",'PVR BH'!$A$32)","v":7}]
[94,{"$f":"IF('PVR BH'!$I$33=\"\",\"\",'PVR BH'!$I$33)","v":""},{"$f":"IF( 'PVR BH'!$B$5=\"\",\"\", 'PVR BH'!$B$5)","v":"TEX-124-E"},{"$f":"IF('PVR BH'!$I$24=\"\",\"\",'PVR BH'!$I$24)","v":"Percent       -No.40"},{"$f":"IF('PVR BH'!$A$33=\"\",\"\",'PVR BH'!$A$33)","v":8}]
[95,{"$f":"IF('PVR BH'!$I$34=\"\",\"\",'PVR BH'!$I$34)","v":""},{"$f":"IF( 'PVR BH'!$B$5=\"\",\"\", 'PVR BH'!$B$5)","v":"TEX-124-E"},{"$f":"IF('PVR BH'!$I$24=\"\",\"\",'PVR BH'!$I$24)","v":"Percent       -No.40"},{"$f":"IF('PVR BH'!$A$34=\"\",\"\",'PVR BH'!$A$34)","v":9}]
[96,{"$f":"IF('PVR BH'!$I$35=\"\",\"\",'PVR BH'!$I$35)","v":""},{"$f":"IF( 'PVR BH'!$B$5=\"\",\"\", 'PVR BH'!$B$5)","v":"TEX-124-E"},{"$f":"IF('PVR BH'!$I$24=\"\",\"\",'PVR BH'!$I$24)","v":"Percent       -No.40"},{"$f":"IF('PVR BH'!$A$35=\"\",\"\",'PVR BH'!$A$35)","v":10}]
[97,{"$f":"IF('PVR BH'!$J$25=\"\",\"\",'PVR BH'!$J$25)","v":"-"},{"$f":"IF( 'PVR BH'!$B$5=\"\",\"\", 'PVR BH'!$B$5)","v":"TEX-124-E"},{"$f":"IF('PVR BH'!$J$24=\"\",\"\",'PVR BH'!$J$24)","v":"Plasticity Index (PI)"},{"$f":"IF('PVR BH'!$A$25=\"\",\"\",'PVR BH'!$A$25)","v":0}]
[98,{"$f":"IF('PVR BH'!$J$26=\"\",\"\",'PVR BH'!$J$26)","v":""},{"$f":"IF( 'PVR BH'!$B$5=\"\",\"\", 'PVR BH'!$B$5)","v":"TEX-124-E"},{"$f":"IF('PVR BH'!$J$24=\"\",\"\",'PVR BH'!$J$24)","v":"Plasticity Index (PI)"},{"$f":"IF('PVR BH'!$A$26=\"\",\"\",'PVR BH'!$A$26)","v":1}]
[99,{"$f":"IF('PVR BH'!$J$27=\"\",\"\",'PVR BH'!$J$27)","v":""},{"$f":"IF( 'PVR BH'!$B$5=\"\",\"\", 'PVR BH'!$B$5)","v":"TEX-124-E"},{"$f":"IF('PVR BH'!$J$24=\"\",\"\",'PVR BH'!$J$24)","v":"Plasticity Index (PI)"},{"$f":"IF('PVR BH'!$A$27=\"\",\"\",'PVR BH'!$A$27)","v":2}]
[100,{"$f":"IF('PVR BH'!$J$28=\"\",\"\",'PVR BH'!$J$28)","v":""},{"$f":"IF( 'PVR BH'!$B$5=\"\",\"\", 'PVR BH'!$B$5)","v":"TEX-124-E"},{"$f":"IF('PVR BH'!$J$24=\"\",\"\",'PVR BH'!$J$24)","v":"Plasticity Index (PI)"},{"$f":"IF('PVR BH'!$A$28=\"\",\"\",'PVR BH'!$A$28)","v":3}]
[101,{"$f":"IF('PVR BH'!$J$29=\"\",\"\",'PVR BH'!$J$29)","v":""},{"$f":"IF( 'PVR BH'!$B$5=\"\",\"\", 'PVR BH'!$B$5)","v":"TEX-124-E"},{"$f":"IF('PVR BH'!$J$24=\"\",\"\",'PVR BH'!$J$24)","v":"Plasticity Index (PI)"},{"$f":"IF('PVR BH'!$A$29=\"\",\"\",'PVR BH'!$A$29)","v":4}]
[102,{"$f":"IF('PVR BH'!$J$30=\"\",\"\",'PVR BH'!$J$30)","v":""},{"$f":"IF( 'PVR BH'!$B$5=\"\",\"\", 'PVR BH'!$B$5)","v":"TEX-124-E"},{"$f":"IF('PVR BH'!$J$24=\"\",\"\",'PVR BH'!$J$24)","v":"Plasticity Index (PI)"},{"$f":"IF('PVR BH'!$A$30=\"\",\"\",'PVR BH'!$A$30)","v":5}]
[103,{"$f":"IF('PVR BH'!$J$31=\"\",\"\",'PVR BH'!$J$31)","v":""},{"$f":"IF( 'PVR BH'!$B$5=\"\",\"\", 'PVR BH'!$B$5)","v":"TEX-124-E"},{"$f":"IF('PVR BH'!$J$24=\"\",\"\",'PVR BH'!$J$24)","v":"Plasticity Index (PI)"},{"$f":"IF('PVR BH'!$A$31=\"\",\"\",'PVR BH'!$A$31)","v":6}]
[104,{"$f":"IF('PVR BH'!$J$32=\"\",\"\",'PVR BH'!$J$32)","v":""},{"$f":"IF( 'PVR BH'!$B$5=\"\",\"\", 'PVR BH'!$B$5)","v":"TEX-124-E"},{"$f":"IF('PVR BH'!$J$24=\"\",\"\",'PVR BH'!$J$24)","v":"Plasticity Index (PI)"},{"$f":"IF('PVR BH'!$A$32=\"\",\"\",'PVR BH'!$A$32)","v":7}]
[105,{"$f":"IF('PVR BH'!$J$33=\"\",\"\",'PVR BH'!$J$33)","v":""},{"$f":"IF( 'PVR BH'!$B$5=\"\",\"\", 'PVR BH'!$B$5)","v":"TEX-124-E"},{"$f":"IF('PVR BH'!$J$24=\"\",\"\",'PVR BH'!$J$24)","v":"Plasticity Index (PI)"},{"$f":"IF('PVR BH'!$A$33=\"\",\"\",'PVR BH'!$A$33)","v":8}]
[106,{"$f":"IF('PVR BH'!$J$34=\"\",\"\",'PVR BH'!$J$34)","v":""},{"$f":"IF( 'PVR BH'!$B$5=\"\",\"\", 'PVR BH'!$B$5)","v":"TEX-124-E"},{"$f":"IF('PVR BH'!$J$24=\"\",\"\",'PVR BH'!$J$24)","v":"Plasticity Index (PI)"},{"$f":"IF('PVR BH'!$A$34=\"\",\"\",'PVR BH'!$A$34)","v":9}]
[107,{"$f":"IF('PVR BH'!$J$35=\"\",\"\",'PVR BH'!$J$35)","v":""},{"$f":"IF( 'PVR BH'!$B$5=\"\",\"\", 'PVR BH'!$B$5)","v":"TEX-124-E"},{"$f":"IF('PVR BH'!$J$24=\"\",\"\",'PVR BH'!$J$24)","v":"Plasticity Index (PI)"},{"$f":"IF('PVR BH'!$A$35=\"\",\"\",'PVR BH'!$A$35)","v":10}]
[108,{"$f":"IF('PVR BH'!$K$25=\"\",\"\",'PVR BH'!$K$25)","v":"-"},{"$f":"IF( 'PVR BH'!$B$5=\"\",\"\", 'PVR BH'!$B$5)","v":"TEX-124-E"},{"$f":"IF('PVR BH'!$K$24=\"\",\"\",'PVR BH'!$K$24)","v":"Percent Volume Swell"},{"$f":"IF('PVR BH'!$A$25=\"\",\"\",'PVR BH'!$A$25)","v":0}]
[109,{"$f":"IF('PVR BH'!$K$26=\"\",\"\",'PVR BH'!$K$26)","v":0},{"$f":"IF( 'PVR BH'!$B$5=\"\",\"\", 'PVR BH'!$B$5)","v":"TEX-124-E"},{"$f":"IF('PVR BH'!$K$24=\"\",\"\",'PVR BH'!$K$24)","v":"Percent Volume Swell"},{"$f":"IF('PVR BH'!$A$26=\"\",\"\",'PVR BH'!$A$26)","v":1}]
[110,{"$f":"IF('PVR BH'!$K$27=\"\",\"\",'PVR BH'!$K$27)","v":0},{"$f":"IF( 'PVR BH'!$B$5=\"\",\"\", 'PVR BH'!$B$5)","v":"TEX-124-E"},{"$f":"IF('PVR BH'!$K$24=\"\",\"\",'PVR BH'!$K$24)","v":"Percent Volume Swell"},{"$f":"IF('PVR BH'!$A$27=\"\",\"\",'PVR BH'!$A$27)","v":2}]
[111,{"$f":"IF('PVR BH'!$K$28=\"\",\"\",'PVR BH'!$K$28)","v":0},{"$f":"IF( 'PVR BH'!$B$5=\"\",\"\", 'PVR BH'!$B$5)","v":"TEX-124-E"},{"$f":"IF('PVR BH'!$K$24=\"\",\"\",'PVR BH'!$K$24)","v":"Percent Volume Swell"},{"$f":"IF('PVR BH'!$A$28=\"\",\"\",'PVR BH'!$A$28)","v":3}]
[112,{"$f":"IF('PVR BH'!$K$29=\"\",\"\",'PVR BH'!$K$29)","v":0},{"$f":"IF( 'PVR BH'!$B$5=\"\",\"\", 'PVR BH'!$B$5)","v":"TEX-124-E"},{"$f":"IF('PVR BH'!$K$24=\"\",\"\",'PVR BH'!$K$24)","v":"Percent Volume Swell"},{"$f":"IF('PVR BH'!$A$29=\"\",\"\",'PVR BH'!$A$29)","v":4}]
[113,{"$f":"IF('PVR BH'!$K$30=\"\",\"\",'PVR BH'!$K$30)","v":0},{"$f":"IF( 'PVR BH'!$B$5=\"\",\"\", 'PVR BH'!$B$5)","v":"TEX-124-E"},{"$f":"IF('PVR BH'!$K$24=\"\",\"\",'PVR BH'!$K$24)","v":"Percent Volume Swell"},{"$f":"IF('PVR BH'!$A$30=\"\",\"\",'PVR BH'!$A$30)","v":5}]
[114,{"$f":"IF('PVR BH'!$K$31=\"\",\"\",'PVR BH'!$K$31)","v":0},{"$f":"IF( 'PVR BH'!$B$5=\"\",\"\", 'PVR BH'!$B$5)","v":"TEX-124-E"},{"$f":"IF('PVR BH'!$K$24=\"\",\"\",'PVR BH'!$K$24)","v":"Percent Volume Swell"},{"$f":"IF('PVR BH'!$A$31=\"\",\"\",'PVR BH'!$A$31)","v":6}]
[115,{"$f":"IF('PVR BH'!$K$32=\"\",\"\",'PVR BH'!$K$32)","v":0},{"$f":"IF( 'PVR BH'!$B$5=\"\",\"\", 'PVR BH'!$B$5)","v":"TEX-124-E"},{"$f":"IF('PVR BH'!$K$24=\"\",\"\",'PVR BH'!$K$24)","v":"Percent Volume Swell"},{"$f":"IF('PVR BH'!$A$32=\"\",\"\",'PVR BH'!$A$32)","v":7}]
[116,{"$f":"IF('PVR BH'!$K$33=\"\",\"\",'PVR BH'!$K$33)","v":0},{"$f":"IF( 'PVR BH'!$B$5=\"\",\"\", 'PVR BH'!$B$5)","v":"TEX-124-E"},{"$f":"IF('PVR BH'!$K$24=\"\",\"\",'PVR BH'!$K$24)","v":"Percent Volume Swell"},{"$f":"IF('PVR BH'!$A$33=\"\",\"\",'PVR BH'!$A$33)","v":8}]
[117,{"$f":"IF('PVR BH'!$K$34=\"\",\"\",'PVR BH'!$K$34)","v":0},{"$f":"IF( 'PVR BH'!$B$5=\"\",\"\", 'PVR BH'!$B$5)","v":"TEX-124-E"},{"$f":"IF('PVR BH'!$K$24=\"\",\"\",'PVR BH'!$K$24)","v":"Percent Volume Swell"},{"$f":"IF('PVR BH'!$A$34=\"\",\"\",'PVR BH'!$A$34)","v":9}]
[118,{"$f":"IF('PVR BH'!$K$35=\"\",\"\",'PVR BH'!$K$35)","v":0},{"$f":"IF( 'PVR BH'!$B$5=\"\",\"\", 'PVR BH'!$B$5)","v":"TEX-124-E"},{"$f":"IF('PVR BH'!$K$24=\"\",\"\",'PVR BH'!$K$24)","v":"Percent Volume Swell"},{"$f":"IF('PVR BH'!$A$35=\"\",\"\",'PVR BH'!$A$35)","v":10}]
[119,{"$f":"IF('PVR BH'!$L$25=\"\",\"\",'PVR BH'!$L$25)","v":"-"},{"$f":"IF( 'PVR BH'!$B$5=\"\",\"\", 'PVR BH'!$B$5)","v":"TEX-124-E"},{"$f":"IF('PVR BH'!$L$24=\"\",\"\",'PVR BH'!$L$24)","v":"Percent Free Swell"},{"$f":"IF('PVR BH'!$A$25=\"\",\"\",'PVR BH'!$A$25)","v":0}]
[120,{"$f":"IF('PVR BH'!$L$26=\"\",\"\",'PVR BH'!$L$26)","v":0},{"$f":"IF( 'PVR BH'!$B$5=\"\",\"\", 'PVR BH'!$B$5)","v":"TEX-124-E"},{"$f":"IF('PVR BH'!$L$24=\"\",\"\",'PVR BH'!$L$24)","v":"Percent Free Swell"},{"$f":"IF('PVR BH'!$A$26=\"\",\"\",'PVR BH'!$A$26)","v":1}]
[121,{"$f":"IF('PVR BH'!$L$27=\"\",\"\",'PVR BH'!$L$27)","v":0},{"$f":"IF( 'PVR BH'!$B$5=\"\",\"\", 'PVR BH'!$B$5)","v":"TEX-124-E"},{"$f":"IF('PVR BH'!$L$24=\"\",\"\",'PVR BH'!$L$24)","v":"Percent Free Swell"},{"$f":"IF('PVR BH'!$A$27=\"\",\"\",'PVR BH'!$A$27)","v":2}]
[122,{"$f":"IF('PVR BH'!$L$28=\"\",\"\",'PVR BH'!$L$28)","v":0},{"$f":"IF( 'PVR BH'!$B$5=\"\",\"\", 'PVR BH'!$B$5)","v":"TEX-124-E"},{"$f":"IF('PVR BH'!$L$24=\"\",\"\",'PVR BH'!$L$24)","v":"Percent Free Swell"},{"$f":"IF('PVR BH'!$A$28=\"\",\"\",'PVR BH'!$A$28)","v":3}]
[123,{"$f":"IF('PVR BH'!$L$29=\"\",\"\",'PVR BH'!$L$29)","v":0},{"$f":"IF( 'PVR BH'!$B$5=\"\",\"\", 'PVR BH'!$B$5)","v":"TEX-124-E"},{"$f":"IF('PVR BH'!$L$24=\"\",\"\",'PVR BH'!$L$24)","v":"Percent Free Swell"},{"$f":"IF('PVR BH'!$A$29=\"\",\"\",'PVR BH'!$A$29)","v":4}]
[124,{"$f":"IF('PVR BH'!$L$30=\"\",\"\",'PVR BH'!$L$30)","v":0},{"$f":"IF( 'PVR BH'!$B$5=\"\",\"\", 'PVR BH'!$B$5)","v":"TEX-124-E"},{"$f":"IF('PVR BH'!$L$24=\"\",\"\",'PVR BH'!$L$24)","v":"Percent Free Swell"},{"$f":"IF('PVR BH'!$A$30=\"\",\"\",'PVR BH'!$A$30)","v":5}]
[125,{"$f":"IF('PVR BH'!$L$31=\"\",\"\",'PVR BH'!$L$31)","v":0},{"$f":"IF( 'PVR BH'!$B$5=\"\",\"\", 'PVR BH'!$B$5)","v":"TEX-124-E"},{"$f":"IF('PVR BH'!$L$24=\"\",\"\",'PVR BH'!$L$24)","v":"Percent Free Swell"},{"$f":"IF('PVR BH'!$A$31=\"\",\"\",'PVR BH'!$A$31)","v":6}]
[126,{"$f":"IF('PVR BH'!$L$32=\"\",\"\",'PVR BH'!$L$32)","v":0},{"$f":"IF( 'PVR BH'!$B$5=\"\",\"\", 'PVR BH'!$B$5)","v":"TEX-124-E"},{"$f":"IF('PVR BH'!$L$24=\"\",\"\",'PVR BH'!$L$24)","v":"Percent Free Swell"},{"$f":"IF('PVR BH'!$A$32=\"\",\"\",'PVR BH'!$A$32)","v":7}]
[127,{"$f":"IF('PVR BH'!$L$33=\"\",\"\",'PVR BH'!$L$33)","v":0},{"$f":"IF( 'PVR BH'!$B$5=\"\",\"\", 'PVR BH'!$B$5)","v":"TEX-124-E"},{"$f":"IF('PVR BH'!$L$24=\"\",\"\",'PVR BH'!$L$24)","v":"Percent Free Swell"},{"$f":"IF('PVR BH'!$A$33=\"\",\"\",'PVR BH'!$A$33)","v":8}]
[128,{"$f":"IF('PVR BH'!$L$34=\"\",\"\",'PVR BH'!$L$34)","v":0},{"$f":"IF( 'PVR BH'!$B$5=\"\",\"\", 'PVR BH'!$B$5)","v":"TEX-124-E"},{"$f":"IF('PVR BH'!$L$24=\"\",\"\",'PVR BH'!$L$24)","v":"Percent Free Swell"},{"$f":"IF('PVR BH'!$A$34=\"\",\"\",'PVR BH'!$A$34)","v":9}]
[129,{"$f":"IF('PVR BH'!$L$35=\"\",\"\",'PVR BH'!$L$35)","v":0},{"$f":"IF( 'PVR BH'!$B$5=\"\",\"\", 'PVR BH'!$B$5)","v":"TEX-124-E"},{"$f":"IF('PVR BH'!$L$24=\"\",\"\",'PVR BH'!$L$24)","v":"Percent Free Swell"},{"$f":"IF('PVR BH'!$A$35=\"\",\"\",'PVR BH'!$A$35)","v":10}]
[130,{"$f":"IF('PVR BH'!$M$25=\"\",\"\",'PVR BH'!$M$25)","v":"-"},{"$f":"IF( 'PVR BH'!$B$5=\"\",\"\", 'PVR BH'!$B$5)","v":"TEX-124-E"},{"$f":"IF('PVR BH'!$M$24=\"\",\"\",'PVR BH'!$M$24)","v":"PVR [in] Top of Layer"},{"$f":"IF('PVR BH'!$A$25=\"\",\"\",'PVR BH'!$A$25)","v":0}]
[131,{"$f":"IF('PVR BH'!$M$26=\"\",\"\",'PVR BH'!$M$26)","v":0},{"$f":"IF( 'PVR BH'!$B$5=\"\",\"\", 'PVR BH'!$B$5)","v":"TEX-124-E"},{"$f":"IF('PVR BH'!$M$24=\"\",\"\",'PVR BH'!$M$24)","v":"PVR [in] Top of Layer"},{"$f":"IF('PVR BH'!$A$26=\"\",\"\",'PVR BH'!$A$26)","v":1}]
[132,{"$f":"IF('PVR BH'!$M$27=\"\",\"\",'PVR BH'!$M$27)","v":0},{"$f":"IF( 'PVR BH'!$B$5=\"\",\"\", 'PVR BH'!$B$5)","v":"TEX-124-E"},{"$f":"IF('PVR BH'!$M$24=\"\",\"\",'PVR BH'!$M$24)","v":"PVR [in] Top of Layer"},{"$f":"IF('PVR BH'!$A$27=\"\",\"\",'PVR BH'!$A$27)","v":2}]
[133,{"$f":"IF('PVR BH'!$M$28=\"\",\"\",'PVR BH'!$M$28)","v":0},{"$f":"IF( 'PVR BH'!$B$5=\"\",\"\", 'PVR BH'!$B$5)","v":"TEX-124-E"},{"$f":"IF('PVR BH'!$M$24=\"\",\"\",'PVR BH'!$M$24)","v":"PVR [in] Top of Layer"},{"$f":"IF('PVR BH'!$A$28=\"\",\"\",'PVR BH'!$A$28)","v":3}]
[134,{"$f":"IF('PVR BH'!$M$29=\"\",\"\",'PVR BH'!$M$29)","v":0},{"$f":"IF( 'PVR BH'!$B$5=\"\",\"\", 'PVR BH'!$B$5)","v":"TEX-124-E"},{"$f":"IF('PVR BH'!$M$24=\"\",\"\",'PVR BH'!$M$24)","v":"PVR [in] Top of Layer"},{"$f":"IF('PVR BH'!$A$29=\"\",\"\",'PVR BH'!$A$29)","v":4}]
[135,{"$f":"IF('PVR BH'!$M$30=\"\",\"\",'PVR BH'!$M$30)","v":0},{"$f":"IF( 'PVR BH'!$B$5=\"\",\"\", 'PVR BH'!$B$5)","v":"TEX-124-E"},{"$f":"IF('PVR BH'!$M$24=\"\",\"\",'PVR BH'!$M$24)","v":"PVR [in] Top of Layer"},{"$f":"IF('PVR BH'!$A$30=\"\",\"\",'PVR BH'!$A$30)","v":5}]
[136,{"$f":"IF('PVR BH'!$M$31=\"\",\"\",'PVR BH'!$M$31)","v":0},{"$f":"IF( 'PVR BH'!$B$5=\"\",\"\", 'PVR BH'!$B$5)","v":"TEX-124-E"},{"$f":"IF('PVR BH'!$M$24=\"\",\"\",'PVR BH'!$M$24)","v":"PVR [in] Top of Layer"},{"$f":"IF('PVR BH'!$A$31=\"\",\"\",'PVR BH'!$A$31)","v":6}]
[137,{"$f":"IF('PVR BH'!$M$32=\"\",\"\",'PVR BH'!$M$32)","v":0},{"$f":"IF( 'PVR BH'!$B$5=\"\",\"\", 'PVR BH'!$B$5)","v":"TEX-124-E"},{"$f":"IF('PVR BH'!$M$24=\"\",\"\",'PVR BH'!$M$24)","v":"PVR [in] Top of Layer"},{"$f":"IF('PVR BH'!$A$32=\"\",\"\",'PVR BH'!$A$32)","v":7}]
[138,{"$f":"IF('PVR BH'!$M$33=\"\",\"\",'PVR BH'!$M$33)","v":0},{"$f":"IF( 'PVR BH'!$B$5=\"\",\"\", 'PVR BH'!$B$5)","v":"TEX-124-E"},{"$f":"IF('PVR BH'!$M$24=\"\",\"\",'PVR BH'!$M$24)","v":"PVR [in] Top of Layer"},{"$f":"IF('PVR BH'!$A$33=\"\",\"\",'PVR BH'!$A$33)","v":8}]
[139,{"$f":"IF('PVR BH'!$M$34=\"\",\"\",'PVR BH'!$M$34)","v":0},{"$f":"IF( 'PVR BH'!$B$5=\"\",\"\", 'PVR BH'!$B$5)","v":"TEX-124-E"},{"$f":"IF('PVR BH'!$M$24=\"\",\"\",'PVR BH'!$M$24)","v":"PVR [in] Top of Layer"},{"$f":"IF('PVR BH'!$A$34=\"\",\"\",'PVR BH'!$A$34)","v":9}]
[140,{"$f":"IF('PVR BH'!$M$35=\"\",\"\",'PVR BH'!$M$35)","v":0},{"$f":"IF( 'PVR BH'!$B$5=\"\",\"\", 'PVR BH'!$B$5)","v":"TEX-124-E"},{"$f":"IF('PVR BH'!$M$24=\"\",\"\",'PVR BH'!$M$24)","v":"PVR [in] Top of Layer"},{"$f":"IF('PVR BH'!$A$35=\"\",\"\",'PVR BH'!$A$35)","v":10}]
[141,{"$f":"IF('PVR BH'!$N$25=\"\",\"\",'PVR BH'!$N$25)","v":"-"},{"$f":"IF( 'PVR BH'!$B$5=\"\",\"\", 'PVR BH'!$B$5)","v":"TEX-124-E"},{"$f":"IF('PVR BH'!$N$24=\"\",\"\",'PVR BH'!$N$24)","v":"PVR [in] Bottom of Layer"},{"$f":"IF('PVR BH'!$A$25=\"\",\"\",'PVR BH'!$A$25)","v":0}]
[142,{"$f":"IF('PVR BH'!$N$26=\"\",\"\",'PVR BH'!$N$26)","v":0},{"$f":"IF( 'PVR BH'!$B$5=\"\",\"\", 'PVR BH'!$B$5)","v":"TEX-124-E"},{"$f":"IF('PVR BH'!$N$24=\"\",\"\",'PVR BH'!$N$24)","v":"PVR [in] Bottom of Layer"},{"$f":"IF('PVR BH'!$A$26=\"\",\"\",'PVR BH'!$A$26)","v":1}]
[143,{"$f":"IF('PVR BH'!$N$27=\"\",\"\",'PVR BH'!$N$27)","v":0},{"$f":"IF( 'PVR BH'!$B$5=\"\",\"\", 'PVR BH'!$B$5)","v":"TEX-124-E"},{"$f":"IF('PVR BH'!$N$24=\"\",\"\",'PVR BH'!$N$24)","v":"PVR [in] Bottom of Layer"},{"$f":"IF('PVR BH'!$A$27=\"\",\"\",'PVR BH'!$A$27)","v":2}]
[144,{"$f":"IF('PVR BH'!$N$28=\"\",\"\",'PVR BH'!$N$28)","v":0},{"$f":"IF( 'PVR BH'!$B$5=\"\",\"\", 'PVR BH'!$B$5)","v":"TEX-124-E"},{"$f":"IF('PVR BH'!$N$24=\"\",\"\",'PVR BH'!$N$24)","v":"PVR [in] Bottom of Layer"},{"$f":"IF('PVR BH'!$A$28=\"\",\"\",'PVR BH'!$A$28)","v":3}]
[145,{"$f":"IF('PVR BH'!$N$29=\"\",\"\",'PVR BH'!$N$29)","v":0},{"$f":"IF( 'PVR BH'!$B$5=\"\",\"\", 'PVR BH'!$B$5)","v":"TEX-124-E"},{"$f":"IF('PVR BH'!$N$24=\"\",\"\",'PVR BH'!$N$24)","v":"PVR [in] Bottom of Layer"},{"$f":"IF('PVR BH'!$A$29=\"\",\"\",'PVR BH'!$A$29)","v":4}]
[146,{"$f":"IF('PVR BH'!$N$30=\"\",\"\",'PVR BH'!$N$30)","v":0},{"$f":"IF( 'PVR BH'!$B$5=\"\",\"\", 'PVR BH'!$B$5)","v":"TEX-124-E"},{"$f":"IF('PVR BH'!$N$24=\"\",\"\",'PVR BH'!$N$24)","v":"PVR [in] Bottom of Layer"},{"$f":"IF('PVR BH'!$A$30=\"\",\"\",'PVR BH'!$A$30)","v":5}]
[147,{"$f":"IF('PVR BH'!$N$31=\"\",\"\",'PVR BH'!$N$31)","v":0},{"$f":"IF( 'PVR BH'!$B$5=\"\",\"\", 'PVR BH'!$B$5)","v":"TEX-124-E"},{"$f":"IF('PVR BH'!$N$24=\"\",\"\",'PVR BH'!$N$24)","v":"PVR [in] Bottom of Layer"},{"$f":"IF('PVR BH'!$A$31=\"\",\"\",'PVR BH'!$A$31)","v":6}]
[148,{"$f":"IF('PVR BH'!$N$32=\"\",\"\",'PVR BH'!$N$32)","v":0},{"$f":"IF( 'PVR BH'!$B$5=\"\",\"\", 'PVR BH'!$B$5)","v":"TEX-124-E"},{"$f":"IF('PVR BH'!$N$24=\"\",\"\",'PVR BH'!$N$24)","v":"PVR [in] Bottom of Layer"},{"$f":"IF('PVR BH'!$A$32=\"\",\"\",'PVR BH'!$A$32)","v":7}]
[149,{"$f":"IF('PVR BH'!$N$33=\"\",\"\",'PVR BH'!$N$33)","v":0},{"$f":"IF( 'PVR BH'!$B$5=\"\",\"\", 'PVR BH'!$B$5)","v":"TEX-124-E"},{"$f":"IF('PVR BH'!$N$24=\"\",\"\",'PVR BH'!$N$24)","v":"PVR [in] Bottom of Layer"},{"$f":"IF('PVR BH'!$A$33=\"\",\"\",'PVR BH'!$A$33)","v":8}]
[150,{"$f":"IF('PVR BH'!$N$34=\"\",\"\",'PVR BH'!$N$34)","v":0},{"$f":"IF( 'PVR BH'!$B$5=\"\",\"\", 'PVR BH'!$B$5)","v":"TEX-124-E"},{"$f":"IF('PVR BH'!$N$24=\"\",\"\",'PVR BH'!$N$24)","v":"PVR [in] Bottom of Layer"},{"$f":"IF('PVR BH'!$A$34=\"\",\"\",'PVR BH'!$A$34)","v":9}]
[151,{"$f":"IF('PVR BH'!$N$35=\"\",\"\",'PVR BH'!$N$35)","v":0},{"$f":"IF( 'PVR BH'!$B$5=\"\",\"\", 'PVR BH'!$B$5)","v":"TEX-124-E"},{"$f":"IF('PVR BH'!$N$24=\"\",\"\",'PVR BH'!$N$24)","v":"PVR [in] Bottom of Layer"},{"$f":"IF('PVR BH'!$A$35=\"\",\"\",'PVR BH'!$A$35)","v":10}]
[152,{"$f":"IF('PVR BH'!$O$25=\"\",\"\",'PVR BH'!$O$25)","v":"-"},{"$f":"IF( 'PVR BH'!$B$5=\"\",\"\", 'PVR BH'!$B$5)","v":"TEX-124-E"},{"$f":"IF('PVR BH'!$O$24=\"\",\"\",'PVR BH'!$O$24)","v":"Differential Swell [in]"},{"$f":"IF('PVR BH'!$A$25=\"\",\"\",'PVR BH'!$A$25)","v":0}]
[153,{"$f":"IF('PVR BH'!$O$26=\"\",\"\",'PVR BH'!$O$26)","v":0},{"$f":"IF( 'PVR BH'!$B$5=\"\",\"\", 'PVR BH'!$B$5)","v":"TEX-124-E"},{"$f":"IF('PVR BH'!$O$24=\"\",\"\",'PVR BH'!$O$24)","v":"Differential Swell [in]"},{"$f":"IF('PVR BH'!$A$26=\"\",\"\",'PVR BH'!$A$26)","v":1}]
[154,{"$f":"IF('PVR BH'!$O$27=\"\",\"\",'PVR BH'!$O$27)","v":0},{"$f":"IF( 'PVR BH'!$B$5=\"\",\"\", 'PVR BH'!$B$5)","v":"TEX-124-E"},{"$f":"IF('PVR BH'!$O$24=\"\",\"\",'PVR BH'!$O$24)","v":"Differential Swell [in]"},{"$f":"IF('PVR BH'!$A$27=\"\",\"\",'PVR BH'!$A$27)","v":2}]
[155,{"$f":"IF('PVR BH'!$O$28=\"\",\"\",'PVR BH'!$O$28)","v":0},{"$f":"IF( 'PVR BH'!$B$5=\"\",\"\", 'PVR BH'!$B$5)","v":"TEX-124-E"},{"$f":"IF('PVR BH'!$O$24=\"\",\"\",'PVR BH'!$O$24)","v":"Differential Swell [in]"},{"$f":"IF('PVR BH'!$A$28=\"\",\"\",'PVR BH'!$A$28)","v":3}]
[156,{"$f":"IF('PVR BH'!$O$29=\"\",\"\",'PVR BH'!$O$29)","v":0},{"$f":"IF( 'PVR BH'!$B$5=\"\",\"\", 'PVR BH'!$B$5)","v":"TEX-124-E"},{"$f":"IF('PVR BH'!$O$24=\"\",\"\",'PVR BH'!$O$24)","v":"Differential Swell [in]"},{"$f":"IF('PVR BH'!$A$29=\"\",\"\",'PVR BH'!$A$29)","v":4}]
[157,{"$f":"IF('PVR BH'!$O$30=\"\",\"\",'PVR BH'!$O$30)","v":0},{"$f":"IF( 'PVR BH'!$B$5=\"\",\"\", 'PVR BH'!$B$5)","v":"TEX-124-E"},{"$f":"IF('PVR BH'!$O$24=\"\",\"\",'PVR BH'!$O$24)","v":"Differential Swell [in]"},{"$f":"IF('PVR BH'!$A$30=\"\",\"\",'PVR BH'!$A$30)","v":5}]
[158,{"$f":"IF('PVR BH'!$O$31=\"\",\"\",'PVR BH'!$O$31)","v":0},{"$f":"IF( 'PVR BH'!$B$5=\"\",\"\", 'PVR BH'!$B$5)","v":"TEX-124-E"},{"$f":"IF('PVR BH'!$O$24=\"\",\"\",'PVR BH'!$O$24)","v":"Differential Swell [in]"},{"$f":"IF('PVR BH'!$A$31=\"\",\"\",'PVR BH'!$A$31)","v":6}]
[159,{"$f":"IF('PVR BH'!$O$32=\"\",\"\",'PVR BH'!$O$32)","v":0},{"$f":"IF( 'PVR BH'!$B$5=\"\",\"\", 'PVR BH'!$B$5)","v":"TEX-124-E"},{"$f":"IF('PVR BH'!$O$24=\"\",\"\",'PVR BH'!$O$24)","v":"Differential Swell [in]"},{"$f":"IF('PVR BH'!$A$32=\"\",\"\",'PVR BH'!$A$32)","v":7}]
[160,{"$f":"IF('PVR BH'!$O$33=\"\",\"\",'PVR BH'!$O$33)","v":0},{"$f":"IF( 'PVR BH'!$B$5=\"\",\"\", 'PVR BH'!$B$5)","v":"TEX-124-E"},{"$f":"IF('PVR BH'!$O$24=\"\",\"\",'PVR BH'!$O$24)","v":"Differential Swell [in]"},{"$f":"IF('PVR BH'!$A$33=\"\",\"\",'PVR BH'!$A$33)","v":8}]
[161,{"$f":"IF('PVR BH'!$O$34=\"\",\"\",'PVR BH'!$O$34)","v":0},{"$f":"IF( 'PVR BH'!$B$5=\"\",\"\", 'PVR BH'!$B$5)","v":"TEX-124-E"},{"$f":"IF('PVR BH'!$O$24=\"\",\"\",'PVR BH'!$O$24)","v":"Differential Swell [in]"},{"$f":"IF('PVR BH'!$A$34=\"\",\"\",'PVR BH'!$A$34)","v":9}]
[162,{"$f":"IF('PVR BH'!$O$35=\"\",\"\",'PVR BH'!$O$35)","v":0},{"$f":"IF( 'PVR BH'!$B$5=\"\",\"\", 'PVR BH'!$B$5)","v":"TEX-124-E"},{"$f":"IF('PVR BH'!$O$24=\"\",\"\",'PVR BH'!$O$24)","v":"Differential Swell [in]"},{"$f":"IF('PVR BH'!$A$35=\"\",\"\",'PVR BH'!$A$35)","v":10}]
[163,{"$f":"IF('PVR BH'!$P$25=\"\",\"\",'PVR BH'!$P$25)","v":"-"},{"$f":"IF( 'PVR BH'!$B$5=\"\",\"\", 'PVR BH'!$B$5)","v":"TEX-124-E"},{"$f":"IF('PVR BH'!$P$24=\"\",\"\",'PVR BH'!$P$24)","v":"Modified                 -No.40 Factor"},{"$f":"IF('PVR BH'!$A$25=\"\",\"\",'PVR BH'!$A$25)","v":0}]
[164,{"$f":"IF('PVR BH'!$P$26=\"\",\"\",'PVR BH'!$P$26)","v":0},{"$f":"IF( 'PVR BH'!$B$5=\"\",\"\", 'PVR BH'!$B$5)","v":"TEX-124-E"},{"$f":"IF('PVR BH'!$P$24=\"\",\"\",'PVR BH'!$P$24)","v":"Modified                 -No.40 Factor"},{"$f":"IF('PVR BH'!$A$26=\"\",\"\",'PVR BH'!$A$26)","v":1}]
[165,{"$f":"IF('PVR BH'!$P$27=\"\",\"\",'PVR BH'!$P$27)","v":0},{"$f":"IF( 'PVR BH'!$B$5=\"\",\"\", 'PVR BH'!$B$5)","v":"TEX-124-E"},{"$f":"IF('PVR BH'!$P$24=\"\",\"\",'PVR BH'!$P$24)","v":"Modified                 -No.40 Factor"},{"$f":"IF('PVR BH'!$A$27=\"\",\"\",'PVR BH'!$A$27)","v":2}]
[166,{"$f":"IF('PVR BH'!$P$28=\"\",\"\",'PVR BH'!$P$28)","v":0},{"$f":"IF( 'PVR BH'!$B$5=\"\",\"\", 'PVR BH'!$B$5)","v":"TEX-124-E"},{"$f":"IF('PVR BH'!$P$24=\"\",\"\",'PVR BH'!$P$24)","v":"Modified                 -No.40 Factor"},{"$f":"IF('PVR BH'!$A$28=\"\",\"\",'PVR BH'!$A$28)","v":3}]
[167,{"$f":"IF('PVR BH'!$P$29=\"\",\"\",'PVR BH'!$P$29)","v":0},{"$f":"IF( 'PVR BH'!$B$5=\"\",\"\", 'PVR BH'!$B$5)","v":"TEX-124-E"},{"$f":"IF('PVR BH'!$P$24=\"\",\"\",'PVR BH'!$P$24)","v":"Modified                 -No.40 Factor"},{"$f":"IF('PVR BH'!$A$29=\"\",\"\",'PVR BH'!$A$29)","v":4}]
[168,{"$f":"IF('PVR BH'!$P$30=\"\",\"\",'PVR BH'!$P$30)","v":0},{"$f":"IF( 'PVR BH'!$B$5=\"\",\"\", 'PVR BH'!$B$5)","v":"TEX-124-E"},{"$f":"IF('PVR BH'!$P$24=\"\",\"\",'PVR BH'!$P$24)","v":"Modified                 -No.40 Factor"},{"$f":"IF('PVR BH'!$A$30=\"\",\"\",'PVR BH'!$A$30)","v":5}]
[169,{"$f":"IF('PVR BH'!$P$31=\"\",\"\",'PVR BH'!$P$31)","v":0},{"$f":"IF( 'PVR BH'!$B$5=\"\",\"\", 'PVR BH'!$B$5)","v":"TEX-124-E"},{"$f":"IF('PVR BH'!$P$24=\"\",\"\",'PVR BH'!$P$24)","v":"Modified                 -No.40 Factor"},{"$f":"IF('PVR BH'!$A$31=\"\",\"\",'PVR BH'!$A$31)","v":6}]
[170,{"$f":"IF('PVR BH'!$P$32=\"\",\"\",'PVR BH'!$P$32)","v":0},{"$f":"IF( 'PVR BH'!$B$5=\"\",\"\", 'PVR BH'!$B$5)","v":"TEX-124-E"},{"$f":"IF('PVR BH'!$P$24=\"\",\"\",'PVR BH'!$P$24)","v":"Modified                 -No.40 Factor"},{"$f":"IF('PVR BH'!$A$32=\"\",\"\",'PVR BH'!$A$32)","v":7}]
[171,{"$f":"IF('PVR BH'!$P$33=\"\",\"\",'PVR BH'!$P$33)","v":0},{"$f":"IF( 'PVR BH'!$B$5=\"\",\"\", 'PVR BH'!$B$5)","v":"TEX-124-E"},{"$f":"IF('PVR BH'!$P$24=\"\",\"\",'PVR BH'!$P$24)","v":"Modified                 -No.40 Factor"},{"$f":"IF('PVR BH'!$A$33=\"\",\"\",'PVR BH'!$A$33)","v":8}]
[172,{"$f":"IF('PVR BH'!$P$34=\"\",\"\",'PVR BH'!$P$34)","v":0},{"$f":"IF( 'PVR BH'!$B$5=\"\",\"\", 'PVR BH'!$B$5)","v":"TEX-124-E"},{"$f":"IF('PVR BH'!$P$24=\"\",\"\",'PVR BH'!$P$24)","v":"Modified                 -No.40 Factor"},{"$f":"IF('PVR BH'!$A$34=\"\",\"\",'PVR BH'!$A$34)","v":9}]
[173,{"$f":"IF('PVR BH'!$P$35=\"\",\"\",'PVR BH'!$P$35)","v":0},{"$f":"IF( 'PVR BH'!$B$5=\"\",\"\", 'PVR BH'!$B$5)","v":"TEX-124-E"},{"$f":"IF('PVR BH'!$P$24=\"\",\"\",'PVR BH'!$P$24)","v":"Modified                 -No.40 Factor"},{"$f":"IF('PVR BH'!$A$35=\"\",\"\",'PVR BH'!$A$35)","v":10}]
[174,{"$f":"IF('PVR BH'!$Q$25=\"\",\"\",'PVR BH'!$Q$25)","v":"-"},{"$f":"IF( 'PVR BH'!$B$5=\"\",\"\", 'PVR BH'!$B$5)","v":"TEX-124-E"},{"$f":"IF('PVR BH'!$Q$24=\"\",\"\",'PVR BH'!$Q$24)","v":"Modified Density Factor"},{"$f":"IF('PVR BH'!$A$25=\"\",\"\",'PVR BH'!$A$25)","v":0}]
[175,{"$f":"IF('PVR BH'!$Q$26=\"\",\"\",'PVR BH'!$Q$26)","v":1},{"$f":"IF( 'PVR BH'!$B$5=\"\",\"\", 'PVR BH'!$B$5)","v":"TEX-124-E"},{"$f":"IF('PVR BH'!$Q$24=\"\",\"\",'PVR BH'!$Q$24)","v":"Modified Density Factor"},{"$f":"IF('PVR BH'!$A$26=\"\",\"\",'PVR BH'!$A$26)","v":1}]
[176,{"$f":"IF('PVR BH'!$Q$27=\"\",\"\",'PVR BH'!$Q$27)","v":1},{"$f":"IF( 'PVR BH'!$B$5=\"\",\"\", 'PVR BH'!$B$5)","v":"TEX-124-E"},{"$f":"IF('PVR BH'!$Q$24=\"\",\"\",'PVR BH'!$Q$24)","v":"Modified Density Factor"},{"$f":"IF('PVR BH'!$A$27=\"\",\"\",'PVR BH'!$A$27)","v":2}]
[177,{"$f":"IF('PVR BH'!$Q$28=\"\",\"\",'PVR BH'!$Q$28)","v":1},{"$f":"IF( 'PVR BH'!$B$5=\"\",\"\", 'PVR BH'!$B$5)","v":"TEX-124-E"},{"$f":"IF('PVR BH'!$Q$24=\"\",\"\",'PVR BH'!$Q$24)","v":"Modified Density Factor"},{"$f":"IF('PVR BH'!$A$28=\"\",\"\",'PVR BH'!$A$28)","v":3}]
[178,{"$f":"IF('PVR BH'!$Q$29=\"\",\"\",'PVR BH'!$Q$29)","v":1},{"$f":"IF( 'PVR BH'!$B$5=\"\",\"\", 'PVR BH'!$B$5)","v":"TEX-124-E"},{"$f":"IF('PVR BH'!$Q$24=\"\",\"\",'PVR BH'!$Q$24)","v":"Modified Density Factor"},{"$f":"IF('PVR BH'!$A$29=\"\",\"\",'PVR BH'!$A$29)","v":4}]
[179,{"$f":"IF('PVR BH'!$Q$30=\"\",\"\",'PVR BH'!$Q$30)","v":1},{"$f":"IF( 'PVR BH'!$B$5=\"\",\"\", 'PVR BH'!$B$5)","v":"TEX-124-E"},{"$f":"IF('PVR BH'!$Q$24=\"\",\"\",'PVR BH'!$Q$24)","v":"Modified Density Factor"},{"$f":"IF('PVR BH'!$A$30=\"\",\"\",'PVR BH'!$A$30)","v":5}]
[180,{"$f":"IF('PVR BH'!$Q$31=\"\",\"\",'PVR BH'!$Q$31)","v":1},{"$f":"IF( 'PVR BH'!$B$5=\"\",\"\", 'PVR BH'!$B$5)","v":"TEX-124-E"},{"$f":"IF('PVR BH'!$Q$24=\"\",\"\",'PVR BH'!$Q$24)","v":"Modified Density Factor"},{"$f":"IF('PVR BH'!$A$31=\"\",\"\",'PVR BH'!$A$31)","v":6}]
[181,{"$f":"IF('PVR BH'!$Q$32=\"\",\"\",'PVR BH'!$Q$32)","v":1},{"$f":"IF( 'PVR BH'!$B$5=\"\",\"\", 'PVR BH'!$B$5)","v":"TEX-124-E"},{"$f":"IF('PVR BH'!$Q$24=\"\",\"\",'PVR BH'!$Q$24)","v":"Modified Density Factor"},{"$f":"IF('PVR BH'!$A$32=\"\",\"\",'PVR BH'!$A$32)","v":7}]
[182,{"$f":"IF('PVR BH'!$Q$33=\"\",\"\",'PVR BH'!$Q$33)","v":1},{"$f":"IF( 'PVR BH'!$B$5=\"\",\"\", 'PVR BH'!$B$5)","v":"TEX-124-E"},{"$f":"IF('PVR BH'!$Q$24=\"\",\"\",'PVR BH'!$Q$24)","v":"Modified Density Factor"},{"$f":"IF('PVR BH'!$A$33=\"\",\"\",'PVR BH'!$A$33)","v":8}]
[183,{"$f":"IF('PVR BH'!$Q$34=\"\",\"\",'PVR BH'!$Q$34)","v":1},{"$f":"IF( 'PVR BH'!$B$5=\"\",\"\", 'PVR BH'!$B$5)","v":"TEX-124-E"},{"$f":"IF('PVR BH'!$Q$24=\"\",\"\",'PVR BH'!$Q$24)","v":"Modified Density Factor"},{"$f":"IF('PVR BH'!$A$34=\"\",\"\",'PVR BH'!$A$34)","v":9}]
[184,{"$f":"IF('PVR BH'!$Q$35=\"\",\"\",'PVR BH'!$Q$35)","v":1},{"$f":"IF( 'PVR BH'!$B$5=\"\",\"\", 'PVR BH'!$B$5)","v":"TEX-124-E"},{"$f":"IF('PVR BH'!$Q$24=\"\",\"\",'PVR BH'!$Q$24)","v":"Modified Density Factor"},{"$f":"IF('PVR BH'!$A$35=\"\",\"\",'PVR BH'!$A$35)","v":10}]
[185,{"$f":"IF('PVR BH'!$R$25=\"\",\"\",'PVR BH'!$R$25)","v":"-"},{"$f":"IF( 'PVR BH'!$B$5=\"\",\"\", 'PVR BH'!$B$5)","v":"TEX-124-E"},{"$f":"IF('PVR BH'!$R$24=\"\",\"\",'PVR BH'!$R$24)","v":"PVR in Layers [in]"},{"$f":"IF('PVR BH'!$A$25=\"\",\"\",'PVR BH'!$A$25)","v":0}]
[186,{"$f":"IF('PVR BH'!$R$26=\"\",\"\",'PVR BH'!$R$26)","v":0},{"$f":"IF( 'PVR BH'!$B$5=\"\",\"\", 'PVR BH'!$B$5)","v":"TEX-124-E"},{"$f":"IF('PVR BH'!$R$24=\"\",\"\",'PVR BH'!$R$24)","v":"PVR in Layers [in]"},{"$f":"IF('PVR BH'!$A$26=\"\",\"\",'PVR BH'!$A$26)","v":1}]
[187,{"$f":"IF('PVR BH'!$R$27=\"\",\"\",'PVR BH'!$R$27)","v":0},{"$f":"IF( 'PVR BH'!$B$5=\"\",\"\", 'PVR BH'!$B$5)","v":"TEX-124-E"},{"$f":"IF('PVR BH'!$R$24=\"\",\"\",'PVR BH'!$R$24)","v":"PVR in Layers [in]"},{"$f":"IF('PVR BH'!$A$27=\"\",\"\",'PVR BH'!$A$27)","v":2}]
[188,{"$f":"IF('PVR BH'!$R$28=\"\",\"\",'PVR BH'!$R$28)","v":0},{"$f":"IF( 'PVR BH'!$B$5=\"\",\"\", 'PVR BH'!$B$5)","v":"TEX-124-E"},{"$f":"IF('PVR BH'!$R$24=\"\",\"\",'PVR BH'!$R$24)","v":"PVR in Layers [in]"},{"$f":"IF('PVR BH'!$A$28=\"\",\"\",'PVR BH'!$A$28)","v":3}]
[189,{"$f":"IF('PVR BH'!$R$29=\"\",\"\",'PVR BH'!$R$29)","v":0},{"$f":"IF( 'PVR BH'!$B$5=\"\",\"\", 'PVR BH'!$B$5)","v":"TEX-124-E"},{"$f":"IF('PVR BH'!$R$24=\"\",\"\",'PVR BH'!$R$24)","v":"PVR in Layers [in]"},{"$f":"IF('PVR BH'!$A$29=\"\",\"\",'PVR BH'!$A$29)","v":4}]
[190,{"$f":"IF('PVR BH'!$R$30=\"\",\"\",'PVR BH'!$R$30)","v":0},{"$f":"IF( 'PVR BH'!$B$5=\"\",\"\", 'PVR BH'!$B$5)","v":"TEX-124-E"},{"$f":"IF('PVR BH'!$R$24=\"\",\"\",'PVR BH'!$R$24)","v":"PVR in Layers [in]"},{"$f":"IF('PVR BH'!$A$30=\"\",\"\",'PVR BH'!$A$30)","v":5}]
[191,{"$f":"IF('PVR BH'!$R$31=\"\",\"\",'PVR BH'!$R$31)","v":0},{"$f":"IF( 'PVR BH'!$B$5=\"\",\"\", 'PVR BH'!$B$5)","v":"TEX-124-E"},{"$f":"IF('PVR BH'!$R$24=\"\",\"\",'PVR BH'!$R$24)","v":"PVR in Layers [in]"},{"$f":"IF('PVR BH'!$A$31=\"\",\"\",'PVR BH'!$A$31)","v":6}]
[192,{"$f":"IF('PVR BH'!$R$32=\"\",\"\",'PVR BH'!$R$32)","v":0},{"$f":"IF( 'PVR BH'!$B$5=\"\",\"\", 'PVR BH'!$B$5)","v":"TEX-124-E"},{"$f":"IF('PVR BH'!$R$24=\"\",\"\",'PVR BH'!$R$24)","v":"PVR in Layers [in]"},{"$f":"IF('PVR BH'!$A$32=\"\",\"\",'PVR BH'!$A$32)","v":7}]
[193,{"$f":"IF('PVR BH'!$R$33=\"\",\"\",'PVR BH'!$R$33)","v":0},{"$f":"IF( 'PVR BH'!$B$5=\"\",\"\", 'PVR BH'!$B$5)","v":"TEX-124-E"},{"$f":"IF('PVR BH'!$R$24=\"\",\"\",'PVR BH'!$R$24)","v":"PVR in Layers [in]"},{"$f":"IF('PVR BH'!$A$33=\"\",\"\",'PVR BH'!$A$33)","v":8}]
[194,{"$f":"IF('PVR BH'!$R$34=\"\",\"\",'PVR BH'!$R$34)","v":0},{"$f":"IF( 'PVR BH'!$B$5=\"\",\"\", 'PVR BH'!$B$5)","v":"TEX-124-E"},{"$f":"IF('PVR BH'!$R$24=\"\",\"\",'PVR BH'!$R$24)","v":"PVR in Layers [in]"},{"$f":"IF('PVR BH'!$A$34=\"\",\"\",'PVR BH'!$A$34)","v":9}]
[195,{"$f":"IF('PVR BH'!$R$35=\"\",\"\",'PVR BH'!$R$35)","v":0},{"$f":"IF( 'PVR BH'!$B$5=\"\",\"\", 'PVR BH'!$B$5)","v":"TEX-124-E"},{"$f":"IF('PVR BH'!$R$24=\"\",\"\",'PVR BH'!$R$24)","v":"PVR in Layers [in]"},{"$f":"IF('PVR BH'!$A$35=\"\",\"\",'PVR BH'!$A$35)","v":10}]
[196,{"$f":"IF('PVR BH'!$S$25=\"\",\"\",'PVR BH'!$S$25)","v":0},{"$f":"IF( 'PVR BH'!$B$5=\"\",\"\", 'PVR BH'!$B$5)","v":"TEX-124-E"},{"$f":"IF('PVR BH'!$S$24=\"\",\"\",'PVR BH'!$S$24)","v":"Total PVR [in]"},{"$f":"IF('PVR BH'!$A$25=\"\",\"\",'PVR BH'!$A$25)","v":0}]
[197,{"$f":"IF('PVR BH'!$S$26=\"\",\"\",'PVR BH'!$S$26)","v":0},{"$f":"IF( 'PVR BH'!$B$5=\"\",\"\", 'PVR BH'!$B$5)","v":"TEX-124-E"},{"$f":"IF('PVR BH'!$S$24=\"\",\"\",'PVR BH'!$S$24)","v":"Total PVR [in]"},{"$f":"IF('PVR BH'!$A$26=\"\",\"\",'PVR BH'!$A$26)","v":1}]
[198,{"$f":"IF('PVR BH'!$S$27=\"\",\"\",'PVR BH'!$S$27)","v":0},{"$f":"IF( 'PVR BH'!$B$5=\"\",\"\", 'PVR BH'!$B$5)","v":"TEX-124-E"},{"$f":"IF('PVR BH'!$S$24=\"\",\"\",'PVR BH'!$S$24)","v":"Total PVR [in]"},{"$f":"IF('PVR BH'!$A$27=\"\",\"\",'PVR BH'!$A$27)","v":2}]
[199,{"$f":"IF('PVR BH'!$S$28=\"\",\"\",'PVR BH'!$S$28)","v":0},{"$f":"IF( 'PVR BH'!$B$5=\"\",\"\", 'PVR BH'!$B$5)","v":"TEX-124-E"},{"$f":"IF('PVR BH'!$S$24=\"\",\"\",'PVR BH'!$S$24)","v":"Total PVR [in]"},{"$f":"IF('PVR BH'!$A$28=\"\",\"\",'PVR BH'!$A$28)","v":3}]
[200,{"$f":"IF('PVR BH'!$S$29=\"\",\"\",'PVR BH'!$S$29)","v":0},{"$f":"IF( 'PVR BH'!$B$5=\"\",\"\", 'PVR BH'!$B$5)","v":"TEX-124-E"},{"$f":"IF('PVR BH'!$S$24=\"\",\"\",'PVR BH'!$S$24)","v":"Total PVR [in]"},{"$f":"IF('PVR BH'!$A$29=\"\",\"\",'PVR BH'!$A$29)","v":4}]
[201,{"$f":"IF('PVR BH'!$S$30=\"\",\"\",'PVR BH'!$S$30)","v":0},{"$f":"IF( 'PVR BH'!$B$5=\"\",\"\", 'PVR BH'!$B$5)","v":"TEX-124-E"},{"$f":"IF('PVR BH'!$S$24=\"\",\"\",'PVR BH'!$S$24)","v":"Total PVR [in]"},{"$f":"IF('PVR BH'!$A$30=\"\",\"\",'PVR BH'!$A$30)","v":5}]
[202,{"$f":"IF('PVR BH'!$S$31=\"\",\"\",'PVR BH'!$S$31)","v":0},{"$f":"IF( 'PVR BH'!$B$5=\"\",\"\", 'PVR BH'!$B$5)","v":"TEX-124-E"},{"$f":"IF('PVR BH'!$S$24=\"\",\"\",'PVR BH'!$S$24)","v":"Total PVR [in]"},{"$f":"IF('PVR BH'!$A$31=\"\",\"\",'PVR BH'!$A$31)","v":6}]
[203,{"$f":"IF('PVR BH'!$S$32=\"\",\"\",'PVR BH'!$S$32)","v":0},{"$f":"IF( 'PVR BH'!$B$5=\"\",\"\", 'PVR BH'!$B$5)","v":"TEX-124-E"},{"$f":"IF('PVR BH'!$S$24=\"\",\"\",'PVR BH'!$S$24)","v":"Total PVR [in]"},{"$f":"IF('PVR BH'!$A$32=\"\",\"\",'PVR BH'!$A$32)","v":7}]
[204,{"$f":"IF('PVR BH'!$S$33=\"\",\"\",'PVR BH'!$S$33)","v":0},{"$f":"IF( 'PVR BH'!$B$5=\"\",\"\", 'PVR BH'!$B$5)","v":"TEX-124-E"},{"$f":"IF('PVR BH'!$S$24=\"\",\"\",'PVR BH'!$S$24)","v":"Total PVR [in]"},{"$f":"IF('PVR BH'!$A$33=\"\",\"\",'PVR BH'!$A$33)","v":8}]
[205,{"$f":"IF('PVR BH'!$S$34=\"\",\"\",'PVR BH'!$S$34)","v":0},{"$f":"IF( 'PVR BH'!$B$5=\"\",\"\", 'PVR BH'!$B$5)","v":"TEX-124-E"},{"$f":"IF('PVR BH'!$S$24=\"\",\"\",'PVR BH'!$S$24)","v":"Total PVR [in]"},{"$f":"IF('PVR BH'!$A$34=\"\",\"\",'PVR BH'!$A$34)","v":9}]
[206,{"$f":"IF('PVR BH'!$S$35=\"\",\"\",'PVR BH'!$S$35)","v":0},{"$f":"IF( 'PVR BH'!$B$5=\"\",\"\", 'PVR BH'!$B$5)","v":"TEX-124-E"},{"$f":"IF('PVR BH'!$S$24=\"\",\"\",'PVR BH'!$S$24)","v":"Total PVR [in]"},{"$f":"IF('PVR BH'!$A$35=\"\",\"\",'PVR BH'!$A$35)","v":10}]

{"sheet":"Figdata","index":3,"n_rows":72,"n_cols":56,"rows_kept":72,"cut":false,"hidden":true,"merged":[]}
[]
[]
[]
[null,null,null,null,null,null,null,null,null,null,null,null,null,null,null,null,null,null,null,null,null,null,null,null,null,null,null,null,null,null,null,null,null,null,null,null,null,null,35,null,null,null,null,null,null,20,null,null,null,null,null,5]
[null,"LOAD","35","30","25","20","15","10","5",null,null,null,null,null,null,null,null,null,null,null,null,null,null,null,null,null,null,null,null,null,null,null,null,null,null,null,null,null,"Y","X","X2","X3","X4",null,null,"Y","X","X2","X3","X4",null,"Y","X","X2","X3","X4"]
[null,0,0,0,0,0,0,0,0,null,null,null,null,null,null,null,null,null,null,null,null,null,null,null,null,null,null,null,null,null,null,null,null,null,null,null,null,null,{"$f":"C6","v":0},{"$f":"B6","v":0},{"$f":"AN6^2","v":0},{"$f":"AO6*AN6","v":0},{"$f":"AO6*AO6","v":0},null,null,{"$f":"F6","v":0},{"$f":"B6","v":0},{"$f":"AU6^2","v":0},{"$f":"AV6*AU6","v":0},{"$f":"AV6*AV6","v":0},null,0,0,{"$f":"BA6^2","v":0},{"$f":"BB6*BA6","v":0},{"$f":"BB6*BB6","v":0}]
[null,{"$f":"B6+10","v":10},10.7,9,7,5.4,2.2999999999999998,1.45,0.3,null,null,null,null,null,null,null,null,null,null,null,null,null,null,null,null,null,null,null,null,null,null,null,null,null,null,null,null,null,{"$f":"C7","v":10.7},{"$f":"B7","v":10},{"$f":"AN7^2","v":100},{"$f":"AO7*AN7","v":1000},{"$f":"AO7*AO7","v":10000},null,null,{"$f":"F7","v":5.4},{"$f":"B7","v":10},{"$f":"AU7^2","v":100},{"$f":"AV7*AU7","v":1000},{"$f":"AV7*AV7","v":10000},null,0.3,2.5,6.25,15.625,39.0625]
[null,{"$f":"B7+10","v":20},16.600000000000001,13.6,10.199999999999999,7.55,3.4,1.9,0.38,null,null,null,null,null,null,null,null,null,null,null,null,null,null,null,null,null,null,null,null,null,null,null,null,null,null,null,null,null,16.600000000000001,20,400,8000,160000,null,null,{"$f":"F8","v":7.55},{"$f":"B8","v":20},{"$f":"AU8^2","v":400},{"$f":"AV8*AU8","v":8000},{"$f":"AV8*AV8","v":160000},null,0.38,5,25,125,625]
[null,30,20.6,16.43,12,8.6,3.98,2.1,0.4,null,null,null,null,null,null,null,null,null,null,null,null,null,null,null,null,null,null,null,null,null,null,null,null,null,null,null,null,null,20.6,30,900,27000,810000,null,null,{"$f":"F9","v":8.6},{"$f":"B9","v":30},{"$f":"AU9^2","v":900},{"$f":"AV9*AU9","v":27000},{"$f":"AV9*AV9","v":810000},null,0.4,7.5,56.25,421.875,3164.0625]
[null,40,23.2,18.09,12.8,9.0299999999999994,4.3,2.19,0.4,null,null,null,null,null,null,null,null,null,null,null,null,null,null,null,null,null,null,null,null,null,null,null,null,null,null,null,null,null,23.2,40,1600,64000,2560000,null,null,{"$f":"F10","v":9.0299999999999994},{"$f":"B10","v":40},{"$f":"AU10^2","v":1600},{"$f":"AV10*AU10","v":64000},{"$f":"AV10*AV10","v":2560000},null,0.4,10,100,1000,10000]
[null,50,24.8,18.899999999999999,13.1,null,4.47,null,0.4,null,null,null,null,null,null,null,null,null,null,null,null,null,null,null,null,null,null,null,null,null,null,null,null,null,null,null,null,null,24.8,50,2500,125000,6250000,null,null,null,null,null,null,null,null,0.4,15,225,3375,50625]
[null,60,25.6,18.38,null,null,null,null,null,null,null,null,null,null,null,null,null,null,null,null,null,null,null,null,null,null,null,null,null,null,null,null,null,null,null,null,null,null,25.6,60,3600,216000,12960000]
[null,70,26,null,null,null,null,null,null,null,null,null,null,null,null,null,null,null,null,null,null,null,null,null,null,null,null,null,null,null,null,null,null,null,null,null,null,null,26,70,4900,343000,24010000]
[]
[null,"LOAD","35",34,33,32,31,"30",29,28,27,26,"25",24,23,22,21,"20",19,18,17,16,"15",14,13,12,11,"10",{"$f":"AD15+1","v":9},{"$f":"AE15+1","v":8},{"$f":"AF15+1","v":7},{"$f":"AG15+1","v":6},"5",4,3,2,1,0,"A",{"$f":"INDEX(LINEST($AM$6:$AM$13,$AN$6:$AQ$13),0)","v":-1.8844696969697313E-6},null,null,null,null,null,"A",{"$f":"INDEX(LINEST($AT$6:$AT$10,$AU$6:$AX$10),0)","v":-6.9583333333331978E-6},null,null,null,null,"A",{"$f":"INDEX(LINEST($AZ$6:$AZ$11,$BA$6:$BD$11),0)","v":-6.2591194968553425E-5}]
[null,0,{"$f":"$AN$15*B16^4+$AN$16*B16^3+$AN$17*B16^2+$AN$18*B16+0","v":0},{"$f":"C16-(C16-H16)*(($C$15-$D$15)/($C$15-$H$15))","v":0},{"$f":"C16-(C16-H16)*(($C$15-$E$15)/($C$15-$H$15))","v":0},{"$f":"C16-(C16-H16)*(($C$15-$F$15)/($C$15-$H$15))","v":0},{"$f":"C16-(C16-H16)*(($C$15-$G$15)/($C$15-$H$15))","v":0},{"$f":"-0.000002916253*B16^4+0.000482296*B16^3+-0.032226153*B16^2+1.153912525*B16+0","v":0},{"$f":"H16-(H16-M16)*(($H$15-$I$15)/($H$15-$M$15))","v":0},{"$f":"H16-(H16-M16)*(($H$15-$J$15)/($H$15-$M$15))","v":0},{"$f":"H16-(H16-M16)*(($H$15-$K$15)/($H$15-$M$15))","v":0},{"$f":"H16-(H16-M16)*(($H$15-$L$15)/($H$15-$M$15))","v":0},{"$f":"$AN$48*B16^4+$AN$49*B16^3+$AN$50*B16^2+$AN$51*B16+0","v":0},{"$f":"M16-(M16-R16)*(($M$15-$N$15)/($M$15-$R$15))","v":0},{"$f":"M16-(M16-R16)*(($M$15-$O$15)/($M$15-$R$15))","v":0},{"$f":"M16-(M16-R16)*(($M$15-$P$15)/($M$15-$R$15))","v":0},{"$f":"M16-(M16-R16)*(($M$15-$Q$15)/($M$15-$R$15))","v":0},{"$f":"$AU$15*B16^4+$AU$16*B16^3+$AU$17*B16^2+$AU$18*B16+0","v":0},{"$f":"R16-(R16-W16)*(($R$15-$S$15)/($R$15-$W$15))","v":0},{"$f":"R16-(R16-W16)*(($R$15-$T$15)/($R$15-$W$15))","v":0},{"$f":"R16-(R16-W16)*(($R$15-$U$15)/($R$15-$W$15))","v":0},{"$f":"R16-(R16-W16)*(($R$15-$V$15)/($R$15-$W$15))","v":0},{"$f":"$AU$31*B16^4+$AU$32*B16^3+$AU$33*B16^2+$AU$34*B16+0","v":0},{"$f":"W16-(W16-AB16)*(($W$15-$X$15)/($W$15-$AB$15))","v":0},{"$f":"W16-(W16-AB16)*(($W$15-$Y$15)/($W$15-$AB$15))","v":0},{"$f":"W16-(W16-AB16)*(($W$15-$Z$15)/($W$15-$AB$15))","v":0},{"$f":"W16-(W16-AB16)*(($W$15-$AA$15)/($W$15-$AB$15))","v":0},{"$f":"$AU$48*B16^4+$AU$49*B16^3+$AU$50*B16^2+$AU$51*B16+0","v":0},{"$f":"AB16-(AB16-AG16)*((10-9)/5)","v":0},{"$f":"AB16-((AB16-AG16)*(($AB$15-$AD$15)/($AB$15-$AG$15)))","v":0},0,0,{"$f":"$BA$15*B16^4+$BA$16*B16^3+$BA$17*B16^2+$BA$18*B16+0","v":0},0,0,0,0,0,"B",{"$f":"INDEX(LINEST($AM$6:$AM$13,$AN$6:$AQ$13),2)","v":3.7064393939394472E-4},null,null,null,null,null,"B",{"$f":"INDEX(LINEST($AT$6:$AT$10,$AU$6:$AX$10),2)","v":7.7583333333332131E-4},null,null,null,null,"B",{"$f":"INDEX(LINEST($AZ$6:$AZ$11,$BA$6:$BD$11),2)","v":2.3436477987421362E-3}]
[null,1,{"$f":"$AN$15*B17^4+$AN$16*B17^3+$AN$17*B17^2+$AN$18*B17+0","v":1.2767081804653719},{"$f":"C17-(C17-H17)*(($C$15-$D$15)/($C$15-$H$15))","v":1.2457996947216976},{"$f":"C17-(C17-H17)*(($C$15-$E$15)/($C$15-$H$15))","v":1.2148912089780233},{"$f":"C17-(C17-H17)*(($C$15-$F$15)/($C$15-$H$15))","v":1.1839827232343487},{"$f":"C17-(C17-H17)*(($C$15-$G$15)/($C$15-$H$15))","v":1.1530742374906744},{"$f":"-0.000002916253*B17^4+0.000482296*B17^3+-0.032226153*B17^2+1.153912525*B17+0","v":1.1221657517470001},{"$f":"H17-(H17-M17)*(($H$15-$I$15)/($H$15-$M$15))","v":1.0843034763976009},{"$f":"H17-(H17-M17)*(($H$15-$J$15)/($H$15-$M$15))","v":1.0464412010482018},{"$f":"H17-(H17-M17)*(($H$15-$K$15)/($H$15-$M$15))","v":1.0085789256988027},0.97071665034940358,{"$f":"$AN$48*B17^4+$AN$49*B17^3+$AN$50*B17^2+$AN$51*B17+0","v":0.93285437500000445},{"$f":"M17-(M17-R17)*(($M$15-$N$15)/($M$15-$R$15))","v":0.90268977500000291},{"$f":"M17-(M17-R17)*(($M$15-$O$15)/($M$15-$R$15))","v":0.87252517500000148},{"$f":"M17-(M17-R17)*(($M$15-$P$15)/($M$15-$R$15))","v":0.84236057499999994},{"$f":"M17-(M17-R17)*(($M$15-$Q$15)/($M$15-$R$15))","v":0.81219597499999852},{"$f":"$AU$15*B17^4+$AU$16*B17^3+$AU$17*B17^2+$AU$18*B17+0","v":0.78203137499999698},{"$f":"R17-(R17-W17)*(($R$15-$S$15)/($R$15-$W$15))","v":0.74407515714285521},{"$f":"R17-(R17-W17)*(($R$15-$T$15)/($R$15-$W$15))","v":0.70611893928571345},{"$f":"R17-(R17-W17)*(($R$15-$U$15)/($R$15-$W$15))","v":0.66816272142857169},{"$f":"R17-(R17-W17)*(($R$15-$V$15)/($R$15-$W$15))","v":0.63020650357142982},{"$f":"$AU$31*B17^4+$AU$32*B17^3+$AU$33*B17^2+$AU$34*B17+0","v":0.59225028571428806},{"$f":"W17-(W17-AB17)*(($W$15-$X$15)/($W$15-$AB$15))","v":0.55909942857143002},{"$f":"W17-(W17-AB17)*(($W$15-$Y$15)/($W$15-$AB$15))","v":0.5259485714285721},{"$f":"W17-(W17-AB17)*(($W$15-$Z$15)/($W$15-$AB$15))","v":0.49279771428571406},{"$f":"W17-(W17-AB17)*(($W$15-$AA$15)/($W$15-$AB$15))","v":0.45964685714285608},0.4264959999999981,{"$f":"AB17-(AB17-AG17)*((10-9)/5)","v":0.37212603917340359},{"$f":"AB17-((AB17-AG17)*(($AB$15-$AD$15)/($AB$15-$AG$15)))","v":0.31775607834680908},{"$f":"AB17-((AB17-AG17)*(($AB$15-$AE$15)/($AB$15-$AG$15)))","v":0.26338611752021457},{"$f":"AB17-((AB17-AG17)*(($AB$15-$AF$15)/($AB$15-$AG$15)))","v":0.20901615669362009},0.1546461958670256,{"$f":"AG17-(AG17-AL17)*((5-4)/5)","v":0.12371695669362048},{"$f":"AG17-((AG17-AL17)*(($AG$15-$AI$15)/($AG$15-$AL$15)))","v":9.2787717520215363E-2},{"$f":"AG17-((AG17-AL17)*(($AG$15-$AJ$15)/($AG$15-$AL$15)))","v":6.1858478346810242E-2},{"$f":"AG17-((AG17-AL17)*(($AG$15-$AK$15)/($AG$15-$AL$15)))","v":3.0929239173405121E-2},0,"C",{"$f":"INDEX(LINEST($AM$6:$AM$13,$AN$6:$AQ$13),3)","v":-3.0091856060606333E-2},null,null,null,null,null,"C",{"$f":"INDEX(LINEST($AT$6:$AT$10,$AU$6:$AX$10),3)","v":-3.465416666666632E-2},null,null,null,null,"C",{"$f":"INDEX(LINEST($AZ$6:$AZ$11,$BA$6:$BD$11),3)","v":-3.1558490566037677E-2}]
[null,2,{"$f":"$AN$15*B18^4+$AN$16*B18^3+$AN$17*B18^2+$AN$18*B18+0","v":2.4954301298701376},{"$f":"C18-(C18-H18)*(($C$15-$D$15)/($C$15-$H$15))","v":2.43289053308651},{"$f":"C18-(C18-H18)*(($C$15-$E$15)/($C$15-$H$15))","v":2.3703509363028825},{"$f":"C18-(C18-H18)*(($C$15-$F$15)/($C$15-$H$15))","v":2.307811339519255},{"$f":"C18-(C18-H18)*(($C$15-$G$15)/($C$15-$H$15))","v":2.2452717427356275},2.1827321459519999,{"$f":"H18-(H18-M18)*(($H$15-$I$15)/($H$15-$M$15))","v":2.1071297167616017},{"$f":"H18-(H18-M18)*(($H$15-$J$15)/($H$15-$M$15))","v":2.0315272875712034},{"$f":"H18-(H18-M18)*(($H$15-$K$15)/($H$15-$M$15))","v":1.9559248583808051},1.8803224291904066,{"$f":"$AN$48*B18^4+$AN$49*B18^3+$AN$50*B18^2+$AN$51*B18+0","v":1.8047200000000083},{"$f":"M18-(M18-R18)*(($M$15-$N$15)/($M$15-$R$15))","v":1.7436384000000056},{"$f":"M18-(M18-R18)*(($M$15-$O$15)/($M$15-$R$15))","v":1.6825568000000029},{"$f":"M18-(M18-R18)*(($M$15-$P$15)/($M$15-$R$15))","v":1.6214751999999999},{"$f":"M18-(M18-R18)*(($M$15-$Q$15)/($M$15-$R$15))","v":1.5603935999999972},{"$f":"$AU$15*B18^4+$AU$16*B18^3+$AU$17*B18^2+$AU$18*B18+0","v":1.4993119999999944},{"$f":"R18-(R18-W18)*(($R$15-$S$15)/($R$15-$W$15))","v":1.4215025142857107},{"$f":"R18-(R18-W18)*(($R$15-$T$15)/($R$15-$W$15))","v":1.3436930285714268},{"$f":"R18-(R18-W18)*(($R$15-$U$15)/($R$15-$W$15))","v":1.2658835428571431},{"$f":"R18-(R18-W18)*(($R$15-$V$15)/($R$15-$W$15))","v":1.1880740571428592},{"$f":"$AU$31*B18^4+$AU$32*B18^3+$AU$33*B18^2+$AU$34*B18+0","v":1.1102645714285755},1.0428868571428598,{"$f":"W18-(W18-AB18)*(($W$15-$Y$15)/($W$15-$AB$15))","v":0.97550914285714407},{"$f":"W18-(W18-AB18)*(($W$15-$Z$15)/($W$15-$AB$15))","v":0.90813142857142837},{"$f":"W18-(W18-AB18)*(($W$15-$AA$15)/($W$15-$AB$15))","v":0.84075371428571266},0.77337599999999695,0.67057300413297138,0.5677700082659457,{"$f":"AB18-((AB18-AG18)*(($AB$15-$AE$15)/($AB$15-$AG$15)))","v":0.46496701239892013},0.36216401653189445,0.25936102066486894,{"$f":"AG18-(AG18-AL18)*((5-4)/5)","v":0.20748881653189516},{"$f":"AG18-((AG18-AL18)*(($AG$15-$AI$15)/($AG$15-$AL$15)))","v":0.15561661239892136},{"$f":"AG18-((AG18-AL18)*(($AG$15-$AJ$15)/($AG$15-$AL$15)))","v":0.10374440826594758},{"$f":"AG18-((AG18-AL18)*(($AG$15-$AK$15)/($AG$15-$AL$15)))","v":5.1872204132973776E-2},0,"D",{"$f":"INDEX(LINEST($AM$6:$AM$13,$AN$6:$AQ$13),4)","v":1.3064312770562814},null,null,null,null,null,"D",{"$f":"INDEX(LINEST($AT$6:$AT$10,$AU$6:$AX$10),4)","v":0.81591666666666329},null,null,null,null,"D",{"$f":"INDEX(LINEST($AZ$6:$AZ$11,$BA$6:$BD$11),4)","v":0.1839236298292897}]
[null,3,3.658321870941569,3.563555091454655,3.4687883119677414,3.3740215324808274,3.2792547529939133,{"$f":"-0.000002916253*B19^4+0.000482296*B19^3+-0.032226153*B19^2+1.153912525*B19+0","v":3.1844879735069997},3.0713529204722687,2.9582178674375377,2.8450828144028066,2.7319477613680756,{"$f":"$AN$48*B19^4+$AN$49*B19^3+$AN$50*B19^2+$AN$51*B19+0","v":2.6188127083333446},{"$f":"M19-(M19-R19)*(($M$15-$N$15)/($M$15-$R$15))","v":2.5262994416666742},{"$f":"M19-(M19-R19)*(($M$15-$O$15)/($M$15-$R$15))","v":2.4337861750000038},{"$f":"M19-(M19-R19)*(($M$15-$P$15)/($M$15-$R$15))","v":2.3412729083333335},{"$f":"M19-(M19-R19)*(($M$15-$Q$15)/($M$15-$R$15))","v":2.2487596416666631},{"$f":"$AU$15*B19^4+$AU$16*B19^3+$AU$17*B19^2+$AU$18*B19+0","v":2.1562463749999927},{"$f":"R19-(R19-W19)*(($R$15-$S$15)/($R$15-$W$15))","v":2.0373448714285667},{"$f":"R19-(R19-W19)*(($R$15-$T$15)/($R$15-$W$15))","v":1.9184433678571404},{"$f":"R19-(R19-W19)*(($R$15-$U$15)/($R$15-$W$15))","v":1.7995418642857144},{"$f":"R19-(R19-W19)*(($R$15-$V$15)/($R$15-$W$15))","v":1.6806403607142881},{"$f":"$AU$31*B19^4+$AU$32*B19^3+$AU$33*B19^2+$AU$34*B19+0","v":1.5617388571428621},{"$f":"W19-(W19-AB19)*(($W$15-$X$15)/($W$15-$AB$15))","v":1.459890285714289},{"$f":"W19-(W19-AB19)*(($W$15-$Y$15)/($W$15-$AB$15))","v":1.358041714285716},{"$f":"W19-(W19-AB19)*(($W$15-$Z$15)/($W$15-$AB$15))","v":1.2561931428571427},{"$f":"W19-(W19-AB19)*(($W$15-$AA$15)/($W$15-$AB$15))","v":1.1543445714285696},1.0524959999999965,{"$f":"AB19-(AB19-AG19)*((10-9)/5)","v":0.9071874156334202},{"$f":"AB19-((AB19-AG19)*(($AB$15-$AD$15)/($AB$15-$AG$15)))","v":0.76187883126684386},{"$f":"AB19-((AB19-AG19)*(($AB$15-$AE$15)/($AB$15-$AG$15)))","v":0.61657024690026763},0.47126166253369128,0.32595307816711494,0.26076246253369195,0.19557184690026896,0.13038123126684598,6.5190615633422988E-2,0]
[null,4,4.7674941991342124,4.6400257663537703,4.5125573335733273,4.3850889007928853,4.2576204680124423,4.1301520352320003,3.9797722948522698,3.8293925544725393,3.6790128140928084,3.528633073713078,3.3782533333333475,{"$f":"M20-(M20-R20)*(($M$15-$N$15)/($M$15-$R$15))","v":3.2540170666666763},{"$f":"M20-(M20-R20)*(($M$15-$O$15)/($M$15-$R$15))","v":3.1297808000000051},{"$f":"M20-(M20-R20)*(($M$15-$P$15)/($M$15-$R$15))","v":3.0055445333333335},{"$f":"M20-(M20-R20)*(($M$15-$Q$15)/($M$15-$R$15))","v":2.8813082666666623},2.7570719999999911,{"$f":"R20-(R20-W20)*(($R$15-$S$15)/($R$15-$W$15))","v":2.5964402285714225},{"$f":"R20-(R20-W20)*(($R$15-$T$15)/($R$15-$W$15))","v":2.435808457142854},{"$f":"R20-(R20-W20)*(($R$15-$U$15)/($R$15-$W$15))","v":2.2751766857142854},{"$f":"R20-(R20-W20)*(($R$15-$V$15)/($R$15-$W$15))","v":2.1145449142857169},1.9539131428571486,1.8180777142857181,{"$f":"W20-(W20-AB20)*(($W$15-$Y$15)/($W$15-$AB$15))","v":1.6822422857142878},{"$f":"W20-(W20-AB20)*(($W$15-$Z$15)/($W$15-$AB$15))","v":1.5464068571428573},{"$f":"W20-(W20-AB20)*(($W$15-$AA$15)/($W$15-$AB$15))","v":1.4105714285714268},1.2747359999999965,1.0927345566936177,0.91073311338723917,{"$f":"AB20-((AB20-AG20)*(($AB$15-$AE$15)/($AB$15-$AG$15)))","v":0.72873167008086048},0.54673022677448169,0.364728783468103,0.29178302677448242,0.21883727008086179,0.14589151338724121,7.2945756693620578E-2,0,30,null,null,null,null,null,null,15]
[null,5,5.825012682629886,5.6644847744789084,5.5039568663279317,5.3434289581769541,5.1829010500259773,{"$f":"-0.000002916253*B21^4+0.000482296*B21^3+-0.032226153*B21^2+1.153912525*B21+0","v":5.0223731418749997},4.83511205516667,4.6478509684583402,4.4605898817500096,4.2733287950416798,4.0860677083333501,3.9300260416666779,3.7739843750000062,3.617942708333334,3.4619010416666622,3.3058593749999901,3.1034017857142788,2.9009441964285676,2.6984866071428568,2.4960290178571456,2.2935714285714344,2.124857142857147,1.9561428571428592,1.7874285714285718,1.618714285714284,1.4499999999999966,1.2368984725965828,1.023796945193169,0.81069541778975518,0.59759389038634136,0.38449236298292766,0.30759389038634211,0.23069541778975658,0.15379694519317108,7.6898472596585499E-2,0,"Y","X","X2","X3","X4","X5",null,"Y","X","X2","X3","X4"]
[null,6,6.8328976623376798,6.6390641526925442,6.4452306430474078,6.2513971334022722,6.0575636237571358,5.8637301141120002,5.6400214246229368,5.4163127351338733,5.1926040456448108,4.9688953561557474,4.745186666666684,4.5574517333333455,4.3697168000000062,4.1819818666666677,3.9942469333333288,3.8065119999999899,3.5626179428571358,3.3187238857142818,3.0748298285714282,2.8309357714285741,2.5870417142857201,2.3870765714285755,2.1871114285714306,1.9871462857142863,1.7871811428571416,1.5872159999999971,1.3482819708894853,1.1093479417789736,0.8704139126684618,0.63147988355795004,0.39254585444743817,0.31403668355795056,0.23552751266846289,0.15701834177897528,7.8509170889487612E-2,0,{"$f":"D6","v":0},{"$f":"AN6","v":0},0,0,0,{"$f":"AQ22*AN22","v":0},null,0,0,{"$f":"AU22^2","v":0},{"$f":"AV22*AU22","v":0},{"$f":"AV22*AV22","v":0}]
[null,7,7.793124251893957,7.5658457580245653,7.3385672641551745,7.1112887702857828,6.884010276416392,{"$f":"-0.000002916253*B23^4+0.000482296*B23^3+-0.032226153*B23^2+1.153912525*B23+0","v":6.6567317825470003},6.397074634370937,6.1374174861948738,5.8777603380188115,5.6181031898427483,5.358446041666685,5.1393101083333459,4.9201741750000068,4.7010382416666676,4.4819023083333285,4.2627663749999893,3.9782522999999923,3.6937382249999957,3.4092241499999987,3.1247100750000021,2.840196000000005,2.6110240000000036,2.3818520000000021,2.1526800000000006,1.9235079999999991,1.6943359999999976,1.4344066213836457,1.1744772427672938,0.9145478641509418,0.65461848553458979,0.39468910691823778,0.3157512855345902,0.23681346415094265,0.15787564276729513,7.8937821383647522E-2,0,9,10,100,1000,10000,{"$f":"AQ23*AN23","v":100000},null,2.2999999999999998,5,25,125,625]
[null,8,{"$f":"$AN$15*B24^4+$AN$16*B24^3+$AN$17*B24^2+$AN$18*B24+0","v":8.7076223376623574},8.4468612676722863,8.1861001976822152,7.9253391276921432,7.6645780577020712,7.4038169877120001,7.108770923502937,6.8137248592938748,6.5186787950848117,6.2236327308757495,{"$f":"$AN$48*B24^4+$AN$49*B24^3+$AN$50*B24^2+$AN$51*B24+0","v":5.9285866666666864},5.6785077333333467,5.4284288000000078,5.1783498666666681,4.9282709333333283,{"$f":"$AU$15*B24^4+$AU$16*B24^3+$AU$17*B24^2+$AU$18*B24+0","v":4.6781919999999895},4.3542436571428498,4.0302953142857101,3.7063469714285704,3.3823986285714307,{"$f":"$AU$31*B24^4+$AU$32*B24^3+$AU$33*B24^2+$AU$34*B24+0","v":3.058450285714291},2.8024274285714323,2.5464045714285737,2.2903817142857155,2.0343588571428568,1.7783359999999984,1.5017127561545358,1.225089512309073,0.94846626846361048,0.67184302461814771,0.39521978077268516,0.31617582461814814,0.23713186846361109,0.15808791230907407,7.9043956154537021E-2,0,13.6,20,400,8000,160000,3200000,null,3.4,10,100,1000,10000]
[null,9,9.5782765787337869,9.2840921790004298,8.9899077792670727,8.6957233795337139,8.4015389798003568,8.1073545800669997,7.7775345390536037,7.4477144980402077,7.1178944570268126,6.7880744160134165,6.4582543750000205,6.1778417750000143,5.8974291750000081,5.6170165750000018,5.3366039749999956,5.0561913749999894,4.6943060142857069,4.3324206535714245,3.970535292857142,3.6086499321428591,3.2467645714285767,2.9664548571428608,2.6861451428571455,2.4058354285714296,2.1255257142857138,1.8452159999999984,1.5561727999999988,1.267129599999999,0.97808639999999936,0.68904319999999952,0.4,0.32,0.24,0.16000000000000003,7.999999999999996E-2,0,16.43,30,900,27000,810000,24300000,null,3.98,15,225,3375,50625]
[null,{"$f":"B24+2","v":10},10.406926406926429,10.079469809541143,9.7520132121558571,9.4245566147705713,9.0971000173852854,8.7696434199999995,8.4057147360000037,8.041786052000008,7.6778573680000122,7.3139286840000164,6.9500000000000206,6.6400000000000148,6.3300000000000081,6.0200000000000022,5.7099999999999955,5.3999999999999897,5.0019285714285644,4.6038571428571391,4.2057857142857138,3.8077142857142876,3.4096428571428623,3.1077142857142896,2.805785714285717,2.5038571428571439,2.2019285714285712,1.8999999999999986,1.5999999999999988,{"$f":"AB26-((AB26-AG26)*(($AB$15-$AD$15)/($AB$15-$AG$15)))","v":1.2999999999999989},0.99999999999999944,0.69999999999999951,0.4,0.32,0.24,0.16000000000000003,7.999999999999996E-2,0,18.09,40,1600,64000,2560000,102400000,null,4.3,20,400,8000,160000]
[null,11,11.195366026785734,10.834875296993987,10.474384567202241,10.113893837410494,9.7534031076187482,9.3929123778270007,8.9955857772616046,8.5982591766962084,8.2009325761308123,7.803605975565417,7.4062793750000209,{"$f":"M27-(M27-R27)*(($M$15-$N$15)/($M$15-$R$15))","v":7.0675607750000147},{"$f":"M27-(M27-R27)*(($M$15-$O$15)/($M$15-$R$15))","v":6.7288421750000094},{"$f":"M27-(M27-R27)*(($M$15-$P$15)/($M$15-$R$15))","v":6.3901235750000032},{"$f":"M27-(M27-R27)*(($M$15-$Q$15)/($M$15-$R$15))","v":6.051404974999997},5.7126863749999917,{"$f":"R27-(R27-W27)*(($R$15-$S$15)/($R$15-$W$15))","v":5.280375728571423},{"$f":"R27-(R27-W27)*(($R$15-$T$15)/($R$15-$W$15))","v":4.8480650821428535},{"$f":"R27-(R27-W27)*(($R$15-$U$15)/($R$15-$W$15))","v":4.4157544357142848},{"$f":"R27-(R27-W27)*(($R$15-$V$15)/($R$15-$W$15))","v":3.9834437892857162},3.5511331428571471,{"$f":"W27-(W27-AB27)*(($W$15-$X$15)/($W$15-$AB$15))","v":3.2302537142857175},{"$f":"W27-(W27-AB27)*(($W$15-$Y$15)/($W$15-$AB$15))","v":2.9093742857142879},{"$f":"W27-(W27-AB27)*(($W$15-$Z$15)/($W$15-$AB$15))","v":2.5884948571428583},{"$f":"W27-(W27-AB27)*(($W$15-$AA$15)/($W$15-$AB$15))","v":2.2676154285714287},1.9467359999999991,{"$f":"AB27-(AB27-AG27)*((10-9)/5)","v":1.6373887999999992},{"$f":"AB27-((AB27-AG27)*(($AB$15-$AD$15)/($AB$15-$AG$15)))","v":1.3280415999999993},{"$f":"AB27-((AB27-AG27)*(($AB$15-$AE$15)/($AB$15-$AG$15)))","v":1.0186943999999998},0.70934719999999962,0.4,0.32,0.24,0.16000000000000003,7.999999999999996E-2,0,18.899999999999999,50,2500,125000,6250000,312500000,null,4.47,25,625,15625,390625]
[null,{"$f":"B26+2","v":12},11.945344415584437,11.552139599225949,11.158934782867462,10.765729966508975,10.372525150150487,9.9793203337919998,9.5493469337002708,9.1193735336085417,8.689400133516811,8.2594267334250819,7.8294533333333529,7.4629930666666802,7.0965328000000083,6.7300725333333355,6.3636122666666637,5.9971519999999909,5.5326870857142794,5.0682221714285678,4.6037572571428562,4.1392923428571438,3.6748274285714322,3.3375611428571457,3.0002948571428592,2.6630285714285726,2.3257622857142857,1.9884959999999992,1.6707967999999993,{"$f":"AB28-((AB28-AG28)*(($AB$15-$AD$15)/($AB$15-$AG$15)))","v":1.3530975999999995},1.0353983999999996,0.7177,0.4,0.32,0.24,0.16000000000000003,7.999999999999996E-2,0,18.38,60,3600,216000,12960000,777600000]
[null,13,12.658565323322533,12.233043494271426,11.807521665220319,11.381999836169213,10.956478007118106,10.530956178066999,10.069122484120269,9.6072887901735395,9.1454550962268115,8.6836214022800817,8.2217877083333519,7.8286564416666797,7.4355251750000075,7.0423939083333362,6.649262641666664,6.2561313749999918,5.7616774428571373,5.267223510714282,4.7727695785714275,4.2783156464285721,3.7838617142857176,3.432564571428574,3.0812674285714303,2.7299702857142867,2.378673142857143,2.0273759999999994,{"$f":"AB29-(AB29-AG29)*((10-9)/5)","v":1.7019007999999995},{"$f":"AB29-((AB29-AG29)*(($AB$15-$AD$15)/($AB$15-$AG$15)))","v":1.3764255999999997},{"$f":"AB29-((AB29-AG29)*(($AB$15-$AE$15)/($AB$15-$AG$15)))","v":1.0509503999999996},{"$f":"AB29-((AB29-AG29)*(($AB$15-$AF$15)/($AB$15-$AG$15)))","v":0.72547519999999976},0.4,0.32,0.24,0.16000000000000003,7.999999999999996E-2,0]
[null,14,13.336687272727293,12.879317580332234,12.421947887937176,11.964578195542117,11.507208503147059,11.049838810752,10.556961715268271,10.064084619784541,9.5712075243008101,9.0783304288170807,8.5854533333333514,8.1668010666666788,7.7481488000000081,7.3294965333333364,6.9108442666666647,6.4921919999999931,5.9699367999999948,5.4476815999999975,4.9254263999999992,4.403171200000001,3.8809160000000036,3.5176320000000025,3.1543480000000019,2.7910640000000013,2.4277800000000003,2.0644959999999992,{"$f":"AB30-(AB30-AG30)*((10-9)/5)","v":1.7315967999999993},{"$f":"AB30-((AB30-AG30)*(($AB$15-$AD$15)/($AB$15-$AG$15)))","v":1.3986975999999993},1.0657983999999998,0.72547499999999998,0.4,0.32,0.24,0.16000000000000003,7.999999999999996E-2,0]
[null,15,13.981323559253267,13.492642275777614,13.003960992301961,12.515279708826307,12.026598425350654,11.537917141875001,11.014838921833338,10.491760701791675,9.9686824817500117,9.4456042617083487,8.9225260416666856,{"$f":"M31-(M31-R31)*(($M$15-$N$15)/($M$15-$R$15))","v":8.4795677083333469},{"$f":"M31-(M31-R31)*(($M$15-$O$15)/($M$15-$R$15))","v":8.0366093750000083},{"$f":"M31-(M31-R31)*(($M$15-$P$15)/($M$15-$R$15))","v":7.5936510416666705},{"$f":"M31-(M31-R31)*(($M$15-$Q$15)/($M$15-$R$15))","v":7.1506927083333327},6.707734374999994,{"$f":"R31-(R31-W31)*(($R$15-$S$15)/($R$15-$W$15))","v":6.1598303571428534},{"$f":"R31-(R31-W31)*(($R$15-$T$15)/($R$15-$W$15))","v":5.6119263392857128},{"$f":"R31-(R31-W31)*(($R$15-$U$15)/($R$15-$W$15))","v":5.0640223214285722},{"$f":"R31-(R31-W31)*(($R$15-$V$15)/($R$15-$W$15))","v":4.5161183035714316},3.968214285714291,{"$f":"W31-(W31-AB31)*(($W$15-$X$15)/($W$15-$AB$15))","v":3.5945714285714327},{"$f":"W31-(W31-AB31)*(($W$15-$Y$15)/($W$15-$AB$15))","v":3.220928571428574},{"$f":"W31-(W31-AB31)*(($W$15-$Z$15)/($W$15-$AB$15))","v":2.8472857142857158},{"$f":"W31-(W31-AB31)*(($W$15-$AA$15)/($W$15-$AB$15))","v":2.473642857142857},2.0999999999999988,1.7558,1.4085490000000001,1.079,0.72547499999999998,null,null,null,null,null,null,"A",{"$f":"INDEX(LINEST($AM$22:$AM$28,$AN$22:$AR$28),0)","v":5.1249999999998113E-8},null,null,null,null,null,"A",{"$f":"INDEX(LINEST($AT$22:$AT$27,$AU$22:$AX$27),0)","v":-1.9000000000000448E-5}]
[null,{"$f":"B30+2","v":16},14.59404225108227,14.074647819144216,13.555253387206163,13.035858955268107,12.516464523330054,11.997070091392001,11.444653406446937,10.892236721501874,10.339820036556812,9.7874033516117489,9.2349866666666856,8.768987733333347,8.3029888000000085,7.8369898666666709,7.3709909333333332,6.9049919999999947,6.3334985142857114,5.7620050285714273,5.190511542857144,4.6190180571428598,4.0475245714285766,3.664630857142861,3.2817371428571454,2.8988434285714302,2.5159497142857141,2.133055999999999,1.78,1.425,1.0900000000000001,null,null,null,null,null,null,null,"B",{"$f":"INDEX(LINEST($AM$22:$AM$28,$AN$22:$AR$28),2)","v":-1.1433712121211738E-5},null,null,null,null,null,"B",{"$f":"INDEX(LINEST($AT$22:$AT$27,$AU$22:$AX$27),2)","v":1.3966666666666917E-3}]
[null,17,15.176366189123394,{"$f":"C33-(C33-H33)*(($C$15-$D$15)/($C$15-$H$15))","v":14.626914269136115},{"$f":"C33-(C33-H33)*(($C$15-$E$15)/($C$15-$H$15))","v":14.077462349148837},{"$f":"C33-(C33-H33)*(($C$15-$F$15)/($C$15-$H$15))","v":13.528010429161556},{"$f":"C33-(C33-H33)*(($C$15-$G$15)/($C$15-$H$15))","v":12.978558509174277},12.429106589186999,{"$f":"H33-(H33-M33)*(($H$15-$I$15)/($H$15-$M$15))","v":11.848229479682935},{"$f":"H33-(H33-M33)*(($H$15-$J$15)/($H$15-$M$15))","v":11.267352370178873},{"$f":"H33-(H33-M33)*(($H$15-$K$15)/($H$15-$M$15))","v":10.686475260674809},10.105598151170746,9.5247210416666839,{"$f":"M33-(M33-R33)*(($M$15-$N$15)/($M$15-$R$15))","v":9.0369831083333452},{"$f":"M33-(M33-R33)*(($M$15-$O$15)/($M$15-$R$15))","v":8.5492451750000082},{"$f":"M33-(M33-R33)*(($M$15-$P$15)/($M$15-$R$15))","v":8.0615072416666713},{"$f":"M33-(M33-R33)*(($M$15-$Q$15)/($M$15-$R$15))","v":7.5737693083333326},7.0860313749999948,{"$f":"R33-(R33-W33)*(($R$15-$S$15)/($R$15-$W$15))","v":6.492856871428569},{"$f":"R33-(R33-W33)*(($R$15-$T$15)/($R$15-$W$15))","v":5.8996823678571424},{"$f":"R33-(R33-W33)*(($R$15-$U$15)/($R$15-$W$15))","v":5.3065078642857166},{"$f":"R33-(R33-W33)*(($R$15-$V$15)/($R$15-$W$15))","v":4.7133333607142909},4.1201588571428642,{"$f":"W33-(W33-AB33)*(($W$15-$X$15)/($W$15-$AB$15))","v":3.7284982857142914},{"$f":"W33-(W33-AB33)*(($W$15-$Y$15)/($W$15-$AB$15))","v":3.3368377142857182},{"$f":"W33-(W33-AB33)*(($W$15-$Z$15)/($W$15-$AB$15))","v":2.9451771428571454},{"$f":"W33-(W33-AB33)*(($W$15-$AA$15)/($W$15-$AB$15))","v":2.5535165714285721},2.1618559999999993,{"$f":"1.795","v":1.7949999999999999},1.43,null,null,null,null,null,null,null,null,"C",{"$f":"INDEX(LINEST($AM$22:$AM$28,$AN$22:$AR$28),3)","v":9.6183712121209342E-4},null,null,null,null,null,"C",{"$f":"INDEX(LINEST($AT$22:$AT$27,$AU$22:$AX$27),3)","v":-4.117500000000044E-2}]
[null,{"$f":"B32+2","v":18},15.729772987013003,15.150971504624803,14.572170022236602,13.993368539848399,13.414567057460198,12.835765575071997,12.227316460057601,11.618867345043206,11.01041823002881,10.401969115014413,9.7935200000000187,9.2853664000000133,8.777212800000008,8.2690592000000045,7.7609055999999992,7.2527519999999939,6.639596228571425,6.026440457142856,5.413284685714288,4.8001289142857182,4.1869731428571502,3.7863017142857194,3.385630285714289,2.9849588571428587,2.5842874285714279,2.1836159999999971,1.81,1.4350000000000001,null,null,null,null,null,null,null,null,"D",{"$f":"INDEX(LINEST($AM$22:$AM$28,$AN$22:$AR$28),4)","v":-4.327632575757491E-2},null,null,null,null,null,"D",{"$f":"INDEX(LINEST($AT$22:$AT$27,$AU$22:$AX$27),4)","v":0.63204761904762186}]
[null,19,16.255695031114733,15.648299224649186,15.040903418183639,14.433507611718094,13.826111805252546,13.218715998786999,12.583588674029603,11.948461349272206,11.313334024514809,10.678206699757412,10.043079375000016,9.5158407750000116,8.9886021750000076,8.4613635750000054,7.9341249750000014,7.4068863749999974,6.7751825857142851,6.1434787964285729,5.5117750071428606,4.8800712178571484,4.2483674285714361,3.8376091428571488,3.4268508571428615,3.0160925714285742,{"$f":"W35-(W35-AB35)*(($W$15-$AA$15)/($W$15-$AB$15))+0.008","v":2.6133342857142869},2.1945759999999996,1.821,null,null,null,null,null,null,null,null,null,"E",{"$f":"INDEX(LINEST(AM22:AM28,AN22:AR28),5)","v":1.2457810606060515}]
[null,20,16.755519480519496,16.120326948415595,15.485134416311697,14.849941884207798,14.214749352103897,13.579556819999999,12.918645456000002,12.257734092000005,11.59682272800001,10.935911364000013,10.275000000000016,9.7300000000000111,9.1850000000000076,8.6400000000000023,8.0949999999999989,7.5499999999999936,6.9008571428571397,6.2517142857142849,5.602571428571431,4.9534285714285762,4.3042857142857223,{"$f":"W36-(W36-AB36)*(($W$15-$X$15)/($W$15-$AB$15))","v":3.8854285714285779},3.4665714285714335,3.0477142857142887,2.6288571428571443,2.21]
[null,21,17.230588267045469,16.568434015297775,15.906279763550081,15.244125511802388,14.581971260054692,13.919817008306998,13.234011148312268,12.548205288317538,11.86239942832281,11.17659356832808,10.49078770833335,9.92932844166668,9.3678691750000098,8.8064099083333396,8.2449506416666694,7.6834913749999991,7.0176363000000004,6.3517812250000016,5.6859261500000038,5.0200710750000042,4.3542160000000063,3.9350000000000001,3.5,3.0670000000000002,2.64,null,null,null,null,null,null,null,null,null,null,null,25,null,null,null,null,null,null,10]
[null,{"$f":"B36+2","v":22},17.682198095238107,16.993949584836887,16.305701074435664,15.617452564034444,14.929204053633223,14.240955543232001,13.531135101252271,12.82131465927254,12.11149421729281,11.401673775313078,10.691853333333349,10.115201066666678,9.5385488000000098,8.9618965333333396,8.3852442666666711,7.8085920000000009,7.1263116571428604,6.4440313142857191,5.7617509714285786,5.0794706285714373,4.3971902857142968,3.9649999999999999,3.52,3.08,null,null,null,null,null,null,null,null,null,null,null,null,"Y","X","X2","X3","X4",null,null,"Y","X","X2","X3","X4"]
[null,23,18.11160044237014,17.398152636741511,16.684704831112882,15.971257025484254,15.257809219855627,14.544361414226998,13.811391673048268,13.078421931869538,12.345452190690807,11.612482449512077,10.879512708333348,10.288883441666677,9.698254175000006,9.1076249083333369,8.5169956416666661,7.9263663749999953,7.2274500142857123,6.5285336535714293,5.8296172928571472,5.1307009321428634,4.4317845714285813,3.9849999999999999,3.53,null,null,null,null,null,null,null,null,null,null,null,null,null,{"$f":"E6","v":0},{"$f":"AN22","v":0},0,0,0,null,null,0,0,{"$f":"AU39^2","v":0},{"$f":"AV39*AU39","v":0},{"$f":"AV39*AV39","v":0}]
[null,24,18.520001558441567,17.782271970887653,17.044542383333741,16.306812795779827,15.569083208225914,14.831353620672001,14.076080229870936,13.320806839069872,12.565533448268807,11.810260057467744,11.054986666666679,10.451531733333342,9.8480768000000065,9.2446218666666695,8.6411669333333343,8.0377119999999973,7.3213933714285711,6.6050747428571448,5.8887561142857194,5.1724374857142923,4.4561188571428669,4,null,null,null,null,null,null,null,null,null,null,null,null,null,null,7,10,100,1000,10000,null,null,1.45,5,{"$f":"AU40^2","v":25},{"$f":"AV40*AU40","v":125},{"$f":"AV40*AV40","v":625}]
[null,{"$f":"B40+2","v":26},19.278398961038967,18.494923786245572,17.71144861145218,16.927973436658785,16.144498261865394,15.361023087071999,14.563575802990934,13.76612851890987,12.968681234828805,12.171233950747741,11.373786666666676,10.74780373333334,10.121820800000005,9.495837866666669,8.8698549333333325,8.2438719999999979,7.4889390857142857,6.7340061714285735,5.9790732571428613,5.2241403428571482,{"$f":"$AU$31*B41^4+$AU$32*B41^3+$AU$33*B41^2+$AU$34*B41+0.005","v":4.469207428571436},null,null,null,null,null,null,null,null,null,null,null,null,null,null,null,10.199999999999999,20,400,8000,160000,null,null,1.9,10,{"$f":"AU41^2","v":100},{"$f":"AV41*AU41","v":1000},{"$f":"AV41*AV41","v":10000}]
[null,28,19.96613575757576,19.140731833267008,18.315327908958256,17.489923984649508,16.664520060340756,15.839116136032004,15.002516908825607,14.165917681619208,13.32931845441281,12.492719227206411,11.656120000000014,11.011078400000009,10.366036800000007,9.7209952000000026,9.0759535999999983,8.4309119999999957,7.64,6.83,6.05,5.25,null,null,null,null,null,null,null,null,null,null,null,null,null,null,null,null,12,30,900,27000,810000,null,null,2.1,15,{"$f":"AU42^2","v":225},{"$f":"AV42*AU42","v":3375},{"$f":"AV42*AV42","v":50625}]
[null,30,20.591233766233771,19.727720036987016,18.864206307740265,18.00069257849351,17.137178849246759,16.273665120000004,15.400598762666672,14.527532405333341,13.654466048000009,12.781399690666678,11.908333333333346,11.246666666666677,10.585000000000006,9.9233333333333373,9.2616666666666667,8.5999999999999979,7.79,6.92,6.07,null,null,null,null,null,null,null,null,null,null,null,null,null,null,null,null,null,12.8,40,1600,64000,2560000,null,null,2.19,20,{"$f":"AU43^2","v":400},{"$f":"AV43*AU43","v":8000},{"$f":"AV43*AV43","v":160000}]
[null,32,21.160991168831167,20.263109445119333,19.3652277214075,18.467345997695666,17.569464273983833,16.671582550271999,15.764316706884269,14.857050863496537,13.949785020108807,13.042519176721076,12.135253333333345,11.458129066666675,10.781004800000005,10.103880533333335,9.4267562666666649,8.7496319999999947,7.9,6.97,null,null,null,null,null,null,null,null,null,null,null,null,null,null,null,null,null,null,13.1,50,2500,125000,6250000]
[null,34,21.681982510822507,20.753318228056408,19.824653945290304,18.895989662524205,17.967325379758101,17.038661096992001,16.098966210926935,15.159271324861873,14.219576438796807,13.279881552731743,12.340186666666678,11.647275733333341,10.954364800000006,10.261453866666669,9.5685429333333332,8.875631999999996,7.99,7.02]
[null,36,22.160058701298695,21.203961678869355,20.247864656440015,19.291767634010675,18.335670611581335,17.379573589151995,16.4086428713216,15.437712153491205,14.46678143566081,13.495850717830415,12.524920000000019,11.814166400000014,11.103412800000008,10.392659200000001,9.681905599999995,8.9711519999999894,8.0399999999999991]
[null,38,22.600347012987005,21.619852213308004,20.639357413629003,19.658862613949999,18.678367814270999,17.697873014591998,16.696242411673602,15.694611808755205,14.692981205836809,13.691350602918412,12.689720000000015,11.957110400000012,11.224500800000008,10.491891200000005,9.7592816000000013,9.0266719999999978,8.06]
[null,40,23.007251082251077,22.00499936980086,21.002747657350643,20.000495944900429,18.998244232450212,17.995992519999994,16.963460682666664,15.930928845333337,14.898397008000007,13.865865170666678,12.83333333333335,12.072666666666677,11.312000000000006,10.551333333333334,9.7906666666666631,9.0299999999999905,null,null,null,null,null,null,null,null,null,null,null,null,null,null,null,null,null,null,null,null,"A",{"$f":"INDEX(LINEST($AM$39:$AM$44,$AN$39:$AQ$44),0)","v":-3.9583333333334324E-6},null,null,null,null,null,"A",{"$f":"INDEX(LINEST($AT$39:$AT$43,$AU$39:$AX$43),0)","v":-4.0666666666665902E-5}]
[null,42,23.384450909090898,22.362609809455119,21.34076870981934,20.318927610183557,19.297086510547778,18.275245410911999,17.210793662062937,16.146341913213877,15.081890164364815,14.017438415515754,12.952986666666693,12.15,11.38,10.58,9.83,null,null,null,null,null,null,null,null,null,null,null,null,null,null,null,null,null,null,null,null,null,"B",{"$f":"INDEX(LINEST($AM$39:$AM$44,$AN$39:$AQ$44),2)","v":5.5972222222223293E-4},null,null,null,null,null,"B",{"$f":"INDEX(LINEST($AT$39:$AT$43,$AU$39:$AX$43),2)","v":2.2199999999999659E-3}]
[null,44,23.734902857142842,22.695087316056672,21.655271774970505,20.615456233884334,19.575640692798167,18.535825151711997,17.428660121369596,16.321495091027199,15.214330060684798,14.107165030342399,13,12.22,11.43,10.61,null,null,null,null,null,null,null,null,null,null,null,null,null,null,null,null,null,null,null,null,null,null,"C",{"$f":"INDEX(LINEST($AM$39:$AM$44,$AN$39:$AQ$44),3)","v":-3.2145833333333713E-2},null,null,null,null,null,"C",{"$f":"INDEX(LINEST($AT$39:$AT$43,$AU$39:$AX$43),3)","v":-4.6183333333332841E-2}]
[null,46,24.060839653679643,23.004032796070113,21.947225938460583,20.890419080851053,19.833612223241524,18.776805365631994,17.631444292505595,16.486083219379196,15.340722146252798,14.195361073126399,13.05,12.28,11.46,null,null,null,null,null,null,null,null,null,null,null,null,null,null,null,null,null,null,null,null,null,null,null,"D",{"$f":"INDEX(LINEST($AM$39:$AM$44,$AN$39:$AQ$44),4)","v":0.96444444444444932},null,null,null,null,null,"D",{"$f":"INDEX(LINEST($AT$39:$AT$43,$AU$39:$AX$43),4)","v":0.47049999999999764}]
[null,48,24.36377038961038,23.290244278638703,22.216718167667029,21.143192056695352,20.069665945723678,18.996139834752,17.806911867801599,16.617683900851201,15.4284559339008,{"$f":"H52-(H52-M52)*(($H$15-$L$15)/($H$15-$M$15))+0.02","v":14.2592279669504},13.05,12.32]
[null,50,24.644480519480496,23.553716915584396,22.462953311688295,21.372189707792195,20.281426103896095,19.190662499999995,17.969196666666665,16.747730833333335,15.526265000000008,{"$f":"H53-(H53-M53)*(($H$15-$L$15)/($H$15-$M$15))","v":14.30479916666668},{"$f":"$AN$48*B53^4+$AN$49*B53^3+$AN$50*B53^2+$AN$51*B53+0","v":13.08333333333335}]
[null,52,24.903031861471852,23.793642981407881,22.68425410134391,21.574865221279943,20.465476341215972,19.356087461152001,18.09,16.84,15.6,14.34]
[null,54,25.138762597402589,24.000411873288471,22.862061149174355,21.723710425060236,20.585359700946121,{"$f":"-0.000002916253*B55^4+0.000482296*B55^3+-0.032226153*B55^2+1.153912525*B55-0.04","v":19.447008976832002},18.190000000000001,16.920000000000002,15.66]
[null,56,25.350287272727257,24.195610111084207,23.040932949441153,21.886255787798103,20.731578626155049,{"$f":"-0.000002916253*B56^4+0.000482296*B56^3+-0.032226153*B56^2+1.153912525*B56+0","v":19.576901464511998},18.27,16.98]
[null,58,25.53549679653679,24.352021337331831,23.168545878126871,21.985070418921914,20.801594959716954,{"$f":"-0.000002916253*B57^4+0.000482296*B57^3+-0.032226153*B57^2+1.153912525*B57+0","v":19.618119500511995},18.329999999999998]
[null,60,25.691558441558442,24.493626317246754,23.295694192935066,22.097762068623382,20.899829944311694,{"$f":"-0.000002916253*B58^4+0.000482296*B58^3+-0.032226153*B58^2+1.153912525*B58+0.1","v":19.701897820000006}]
[null,62,25.814915844155834,24.61,23.41,22.17,20.95]
[null,64,25.901289004328987,24.71,23.46,{"$f":"22.25","v":22.25}]
[null,66,25.945674285714276,24.79,23.5]
[null,68,25.942344415584401,24.83]
[null,70,26]
[]
[]
[]
[]
[]
[]
[]
[]
[null,null,{"$f":"(-4/(0.773376-0.259361))","v":-7.7818740698228668}]

{"sheet":"Calculations","index":4,"n_rows":24,"n_cols":35,"rows_kept":24,"cut":false,"hidden":true,"merged":[]}
[]
[]
[]
[null,null,null,null,"CALC"]
[]
[]
[]
[]
[]
[]
[null,null,null,null,null,null,"Supplemental Calculations"]
[]
[null,"PVR [in] Top of Layer","PVR [in] Bottom of Layer","Average Moisture","Dry / Average Moisture","Wet / Average Moisture",null,"% Vol Swell: Wet","% Vol Swell: Avg","% Vol Swell:  Dry",null,"Percent       +No.40",null,{"$f":"'PVR BH'!C24","v":"Average Load [psi]"},"% Vol Swell: Avg","LAYER","35-30","29-24","23-18","17-12","11-5","<5",null,null,null,{"$f":"'PVR BH'!C24","v":"Average Load [psi]"},"% Vol Swell: Avg","LAYER","35-30","29-24","23-18","17-12","11-5","<5"]
[null,null,null,{"$f":"AVERAGE('PVR BH'!E25:F25)","v":{"$error":"#DIV/0!"}},{"$f":"AVERAGE('PVR BH'!E25,D14)","v":{"$error":"#DIV/0!"}},{"$f":"AVERAGE('PVR BH'!F25,D14)","v":{"$error":"#DIV/0!"}},null,{"$f":"(0.217*'PVR BH'!J25)-2.9","v":{"$error":"#VALUE!"}},{"$f":"(0.294*'PVR BH'!J25)-2.9","v":{"$error":"#VALUE!"}},{"$f":"('PVR BH'!J25*0.325)-1.75","v":{"$error":"#VALUE!"}},null,{"$f":"100-'PVR BH'!I25","v":{"$error":"#VALUE!"}},null,{"$f":"'PVR BH'!C25","v":0},{"$f":"ROUND('PVR BH'!L26,0)","v":0},1,{"$f":"IF(O14=35,VLOOKUP(N14,Figdata!$B$15:$C$63,2),IF(O14=34,VLOOKUP(N14,Figdata!$B$15:$D$63,3),IF(O14=33,VLOOKUP(N14,Figdata!$B$15:$E$63,4),IF(O14=32,VLOOKUP(N14,Figdata!$B$15:$F$63,5),IF(O14=31,VLOOKUP(N14,Figdata!$B$15:$G$63,6),IF(O14=30,VLOOKUP(N14,Figdata!$B$15:$H$63,7),\"\"))))))","v":""},{"$f":"IF(O14=29,VLOOKUP(N14,Figdata!$B$16:$I$64,8),IF(O14=28,VLOOKUP(N14,Figdata!$B$16:$J$64,9),IF(O14=27,VLOOKUP(N14,Figdata!$B$16:$K$64,10),IF(O14=26,VLOOKUP(N14,Figdata!$B$16:$L$64,11),IF(O14=25,VLOOKUP(N14,Figdata!$B$16:$M$64,12),IF(O14=24,VLOOKUP(N14,Figdata!$B$16:$N$64,13),\"\"))))))","v":""},{"$f":"IF(O14=23,VLOOKUP(N14,Figdata!$B$16:$O$64,14),IF(O14=22,VLOOKUP(N14,Figdata!$B$16:$P$64,15),IF(O14=21,VLOOKUP(N14,Figdata!$B$16:$Q$64,16),IF(O14=20,VLOOKUP(N14,Figdata!$B$16:$R$64,17),IF(O14=19,VLOOKUP(N14,Figdata!$B$16:$S$64,18),IF(O14=18,VLOOKUP(N14,Figdata!$B$16:$T$64,19),\"\"))))))","v":""},{"$f":"IF(O14=17,VLOOKUP(N14,Figdata!$B$16:$U$64,20),IF(O14=16,VLOOKUP(N14,Figdata!$B$16:$V$64,21),IF(O14=15,VLOOKUP(N14,Figdata!$B$16:$W$64,22),IF(O14=14,VLOOKUP(N14,Figdata!$B$16:$X$64,23),IF(O14=13,VLOOKUP(N14,Figdata!$B$16:$Y$64,24),IF(O14=12,VLOOKUP(N14,Figdata!$B$16:$Z$64,25),\"\"))))))","v":""},{"$f":"IF(O14=11,VLOOKUP(N14,Figdata!$B$16:$AA$64,26),IF(O14=10,VLOOKUP(N14,Figdata!$B$16:$AB$64,27),IF(O14=9,VLOOKUP(N14,Figdata!$B$16:$AC$64,28),IF(O14=8,VLOOKUP(N14,Figdata!$B$16:$AD$64,29),IF(O14=7,VLOOKUP(N14,Figdata!$B$16:$AE$64,30),IF(O14=6,VLOOKUP(N14,Figdata!$B$16:$AF$64,31),IF(O14=5,VLOOKUP(N14,Figdata!$B$16:$AG$64,32),\"\")))))))","v":""},{"$f":"IF(O14=4,VLOOKUP(N14,Figdata!$B$16:$AH$64,33),IF(O14=3,VLOOKUP(N14,Figdata!$B$16:$AI$64,34),IF(O14=2,VLOOKUP(N14,Figdata!$B$16:$AJ$64,35),IF(O14=1,VLOOKUP(N14,Figdata!$B$16:$AK$64,36),\"\"))))","v":""},{"$f":"MAX(Q14:V14)","v":0},null,null,{"$f":"'PVR BH'!C26","v":0},{"$f":"ROUND('PVR BH'!L26,0)","v":0},1,{"$f":"IF(AA14=35,VLOOKUP(Z14,Figdata!$B$15:$C$63,2),IF(AA14=34,VLOOKUP(Z14,Figdata!$B$15:$D$63,3),IF(AA14=33,VLOOKUP(Z14,Figdata!$B$15:$E$63,4),IF(AA14=32,VLOOKUP(Z14,Figdata!$B$15:$F$63,5),IF(AA14=31,VLOOKUP(Z14,Figdata!$B$15:$G$63,6),IF(AA14=30,VLOOKUP(Z14,Figdata!$B$15:$H$63,7),\"\"))))))","v":""},{"$f":"IF(AA14=29,VLOOKUP(Z14,Figdata!$B$16:$I$64,8),IF(AA14=28,VLOOKUP(Z14,Figdata!$B$16:$J$64,9),IF(AA14=27,VLOOKUP(Z14,Figdata!$B$16:$K$64,10),IF(AA14=26,VLOOKUP(Z14,Figdata!$B$16:$L$64,11),IF(AA14=25,VLOOKUP(Z14,Figdata!$B$16:$M$64,12),IF(AA14=24,VLOOKUP(Z14,Figdata!$B$16:$N$64,13),\"\"))))))","v":""},{"$f":"IF(AA14=23,VLOOKUP(Z14,Figdata!$B$16:$O$64,14),IF(AA14=22,VLOOKUP(Z14,Figdata!$B$16:$P$64,15),IF(AA14=21,VLOOKUP(Z14,Figdata!$B$16:$Q$64,16),IF(AA14=20,VLOOKUP(Z14,Figdata!$B$16:$R$64,17),IF(AA14=19,VLOOKUP(Z14,Figdata!$B$16:$S$64,18),IF(AA14=18,VLOOKUP(Z14,Figdata!$B$16:$T$64,19),\"\"))))))","v":""},{"$f":"IF(AA14=17,VLOOKUP(Z14,Figdata!$B$16:$U$64,20),IF(AA14=16,VLOOKUP(Z14,Figdata!$B$16:$V$64,21),IF(AA14=15,VLOOKUP(Z14,Figdata!$B$16:$W$64,22),IF(AA14=14,VLOOKUP(Z14,Figdata!$B$16:$X$64,23),IF(AA14=13,VLOOKUP(Z14,Figdata!$B$16:$Y$64,24),IF(AA14=12,VLOOKUP(Z14,Figdata!$B$16:$Z$64,25),\"\"))))))","v":""},{"$f":"IF(AA14=11,VLOOKUP(Z14,Figdata!$B$16:$AA$64,26),IF(AA14=10,VLOOKUP(Z14,Figdata!$B$16:$AB$64,27),IF(AA14=9,VLOOKUP(Z14,Figdata!$B$16:$AC$64,28),IF(AA14=8,VLOOKUP(Z14,Figdata!$B$16:$AD$64,29),IF(AA14=7,VLOOKUP(Z14,Figdata!$B$16:$AE$64,30),IF(AA14=6,VLOOKUP(Z14,Figdata!$B$16:$AF$64,31),IF(AA14=5,VLOOKUP(Z14,Figdata!$B$16:$AG$64,32),\"\")))))))","v":""},{"$f":"IF(AA14=4,VLOOKUP(Z14,Figdata!$B$16:$AH$64,33),IF(AA14=3,VLOOKUP(Z14,Figdata!$B$16:$AI$64,34),IF(AA14=2,VLOOKUP(Z14,Figdata!$B$16:$AJ$64,35),IF(AA14=1,VLOOKUP(Z14,Figdata!$B$16:$AK$64,36),\"\"))))","v":""},{"$f":"MAX(AC14:AH14)","v":0}]
[null,0,1.1000000000000001,{"$f":"AVERAGE('PVR BH'!E26:F26)","v":5.5},{"$f":"AVERAGE('PVR BH'!E26,D15)","v":7.25},{"$f":"AVERAGE('PVR BH'!F26,D15)","v":3.75},null,{"$f":"(0.217*'PVR BH'!J26)-2.9","v":-2.9},{"$f":"(0.294*'PVR BH'!J26)-2.9","v":-2.9},{"$f":"('PVR BH'!J26*0.325)-1.75","v":-1.75},null,{"$f":"100-'PVR BH'!I26","v":100},null,{"$f":"'PVR BH'!C26","v":0},{"$f":"ROUND('PVR BH'!L27,0)","v":0},2,{"$f":"IF(O15=35,VLOOKUP(N15,Figdata!$B$15:$C$63,2),IF(O15=34,VLOOKUP(N15,Figdata!$B$15:$D$63,3),IF(O15=33,VLOOKUP(N15,Figdata!$B$15:$E$63,4),IF(O15=32,VLOOKUP(N15,Figdata!$B$15:$F$63,5),IF(O15=31,VLOOKUP(N15,Figdata!$B$15:$G$63,6),IF(O15=30,VLOOKUP(N15,Figdata!$B$15:$H$63,7),\"\"))))))","v":""},{"$f":"IF(O15=29,VLOOKUP(N15,Figdata!$B$16:$I$64,8),IF(O15=28,VLOOKUP(N15,Figdata!$B$16:$J$64,9),IF(O15=27,VLOOKUP(N15,Figdata!$B$16:$K$64,10),IF(O15=26,VLOOKUP(N15,Figdata!$B$16:$L$64,11),IF(O15=25,VLOOKUP(N15,Figdata!$B$16:$M$64,12),IF(O15=24,VLOOKUP(N15,Figdata!$B$16:$N$64,13),\"\"))))))","v":""},{"$f":"IF(O15=23,VLOOKUP(N15,Figdata!$B$16:$O$64,14),IF(O15=22,VLOOKUP(N15,Figdata!$B$16:$P$64,15),IF(O15=21,VLOOKUP(N15,Figdata!$B$16:$Q$64,16),IF(O15=20,VLOOKUP(N15,Figdata!$B$16:$R$64,17),IF(O15=19,VLOOKUP(N15,Figdata!$B$16:$S$64,18),IF(O15=18,VLOOKUP(N15,Figdata!$B$16:$T$64,19),\"\"))))))","v":""},{"$f":"IF(O15=17,VLOOKUP(N15,Figdata!$B$16:$U$64,20),IF(O15=16,VLOOKUP(N15,Figdata!$B$16:$V$64,21),IF(O15=15,VLOOKUP(N15,Figdata!$B$16:$W$64,22),IF(O15=14,VLOOKUP(N15,Figdata!$B$16:$X$64,23),IF(O15=13,VLOOKUP(N15,Figdata!$B$16:$Y$64,24),IF(O15=12,VLOOKUP(N15,Figdata!$B$16:$Z$64,25),\"\"))))))","v":""},{"$f":"IF(O15=11,VLOOKUP(N15,Figdata!$B$16:$AA$64,26),IF(O15=10,VLOOKUP(N15,Figdata!$B$16:$AB$64,27),IF(O15=9,VLOOKUP(N15,Figdata!$B$16:$AC$64,28),IF(O15=8,VLOOKUP(N15,Figdata!$B$16:$AD$64,29),IF(O15=7,VLOOKUP(N15,Figdata!$B$16:$AE$64,30),IF(O15=6,VLOOKUP(N15,Figdata!$B$16:$AF$64,31),IF(O15=5,VLOOKUP(N15,Figdata!$B$16:$AG$64,32),\"\")))))))","v":""},{"$f":"IF(O15=4,VLOOKUP(N15,Figdata!$B$16:$AH$64,33),IF(O15=3,VLOOKUP(N15,Figdata!$B$16:$AI$64,34),IF(O15=2,VLOOKUP(N15,Figdata!$B$16:$AJ$64,35),IF(O15=1,VLOOKUP(N15,Figdata!$B$16:$AK$64,36),\"\"))))","v":""},0,null,null,{"$f":"'PVR BH'!C27","v":0},{"$f":"ROUND('PVR BH'!L27,0)","v":0},2,{"$f":"IF(AA15=35,VLOOKUP(Z15,Figdata!$B$15:$C$63,2),IF(AA15=34,VLOOKUP(Z15,Figdata!$B$15:$D$63,3),IF(AA15=33,VLOOKUP(Z15,Figdata!$B$15:$E$63,4),IF(AA15=32,VLOOKUP(Z15,Figdata!$B$15:$F$63,5),IF(AA15=31,VLOOKUP(Z15,Figdata!$B$15:$G$63,6),IF(AA15=30,VLOOKUP(Z15,Figdata!$B$15:$H$63,7),\"\"))))))","v":""},{"$f":"IF(AA15=29,VLOOKUP(Z15,Figdata!$B$16:$I$64,8),IF(AA15=28,VLOOKUP(Z15,Figdata!$B$16:$J$64,9),IF(AA15=27,VLOOKUP(Z15,Figdata!$B$16:$K$64,10),IF(AA15=26,VLOOKUP(Z15,Figdata!$B$16:$L$64,11),IF(AA15=25,VLOOKUP(Z15,Figdata!$B$16:$M$64,12),IF(AA15=24,VLOOKUP(Z15,Figdata!$B$16:$N$64,13),\"\"))))))","v":""},{"$f":"IF(AA15=23,VLOOKUP(Z15,Figdata!$B$16:$O$64,14),IF(AA15=22,VLOOKUP(Z15,Figdata!$B$16:$P$64,15),IF(AA15=21,VLOOKUP(Z15,Figdata!$B$16:$Q$64,16),IF(AA15=20,VLOOKUP(Z15,Figdata!$B$16:$R$64,17),IF(AA15=19,VLOOKUP(Z15,Figdata!$B$16:$S$64,18),IF(AA15=18,VLOOKUP(Z15,Figdata!$B$16:$T$64,19),\"\"))))))","v":""},{"$f":"IF(AA15=17,VLOOKUP(Z15,Figdata!$B$16:$U$64,20),IF(AA15=16,VLOOKUP(Z15,Figdata!$B$16:$V$64,21),IF(AA15=15,VLOOKUP(Z15,Figdata!$B$16:$W$64,22),IF(AA15=14,VLOOKUP(Z15,Figdata!$B$16:$X$64,23),IF(AA15=13,VLOOKUP(Z15,Figdata!$B$16:$Y$64,24),IF(AA15=12,VLOOKUP(Z15,Figdata!$B$16:$Z$64,25),\"\"))))))","v":""},{"$f":"IF(AA15=11,VLOOKUP(Z15,Figdata!$B$16:$AA$64,26),IF(AA15=10,VLOOKUP(Z15,Figdata!$B$16:$AB$64,27),IF(AA15=9,VLOOKUP(Z15,Figdata!$B$16:$AC$64,28),IF(AA15=8,VLOOKUP(Z15,Figdata!$B$16:$AD$64,29),IF(AA15=7,VLOOKUP(Z15,Figdata!$B$16:$AE$64,30),IF(AA15=6,VLOOKUP(Z15,Figdata!$B$16:$AF$64,31),IF(AA15=5,VLOOKUP(Z15,Figdata!$B$16:$AG$64,32),\"\")))))))","v":""},{"$f":"IF(AA15=4,VLOOKUP(Z15,Figdata!$B$16:$AH$64,33),IF(AA15=3,VLOOKUP(Z15,Figdata!$B$16:$AI$64,34),IF(AA15=2,VLOOKUP(Z15,Figdata!$B$16:$AJ$64,35),IF(AA15=1,VLOOKUP(Z15,Figdata!$B$16:$AK$64,36),\"\"))))","v":""},0]
[null,1.3,1.9,{"$f":"AVERAGE('PVR BH'!E27:F27)","v":5.5},{"$f":"AVERAGE('PVR BH'!E27,D16)","v":7.25},{"$f":"AVERAGE('PVR BH'!F27,D16)","v":3.75},null,{"$f":"(0.217*'PVR BH'!J27)-2.9","v":-2.9},{"$f":"(0.294*'PVR BH'!J27)-2.9","v":-2.9},{"$f":"('PVR BH'!J27*0.325)-1.75","v":-1.75},null,{"$f":"100-'PVR BH'!I27","v":100},null,{"$f":"'PVR BH'!C27","v":0},{"$f":"ROUND('PVR BH'!L28,0)","v":0},3,{"$f":"IF(O16=35,VLOOKUP(N16,Figdata!$B$15:$C$63,2),IF(O16=34,VLOOKUP(N16,Figdata!$B$15:$D$63,3),IF(O16=33,VLOOKUP(N16,Figdata!$B$15:$E$63,4),IF(O16=32,VLOOKUP(N16,Figdata!$B$15:$F$63,5),IF(O16=31,VLOOKUP(N16,Figdata!$B$15:$G$63,6),IF(O16=30,VLOOKUP(N16,Figdata!$B$15:$H$63,7),\"\"))))))","v":""},{"$f":"IF(O16=29,VLOOKUP(N16,Figdata!$B$16:$I$64,8),IF(O16=28,VLOOKUP(N16,Figdata!$B$16:$J$64,9),IF(O16=27,VLOOKUP(N16,Figdata!$B$16:$K$64,10),IF(O16=26,VLOOKUP(N16,Figdata!$B$16:$L$64,11),IF(O16=25,VLOOKUP(N16,Figdata!$B$16:$M$64,12),IF(O16=24,VLOOKUP(N16,Figdata!$B$16:$N$64,13),\"\"))))))","v":""},{"$f":"IF(O16=23,VLOOKUP(N16,Figdata!$B$16:$O$64,14),IF(O16=22,VLOOKUP(N16,Figdata!$B$16:$P$64,15),IF(O16=21,VLOOKUP(N16,Figdata!$B$16:$Q$64,16),IF(O16=20,VLOOKUP(N16,Figdata!$B$16:$R$64,17),IF(O16=19,VLOOKUP(N16,Figdata!$B$16:$S$64,18),IF(O16=18,VLOOKUP(N16,Figdata!$B$16:$T$64,19),\"\"))))))","v":""},{"$f":"IF(O16=17,VLOOKUP(N16,Figdata!$B$16:$U$64,20),IF(O16=16,VLOOKUP(N16,Figdata!$B$16:$V$64,21),IF(O16=15,VLOOKUP(N16,Figdata!$B$16:$W$64,22),IF(O16=14,VLOOKUP(N16,Figdata!$B$16:$X$64,23),IF(O16=13,VLOOKUP(N16,Figdata!$B$16:$Y$64,24),IF(O16=12,VLOOKUP(N16,Figdata!$B$16:$Z$64,25),\"\"))))))","v":""},{"$f":"IF(O16=11,VLOOKUP(N16,Figdata!$B$16:$AA$64,26),IF(O16=10,VLOOKUP(N16,Figdata!$B$16:$AB$64,27),IF(O16=9,VLOOKUP(N16,Figdata!$B$16:$AC$64,28),IF(O16=8,VLOOKUP(N16,Figdata!$B$16:$AD$64,29),IF(O16=7,VLOOKUP(N16,Figdata!$B$16:$AE$64,30),IF(O16=6,VLOOKUP(N16,Figdata!$B$16:$AF$64,31),IF(O16=5,VLOOKUP(N16,Figdata!$B$16:$AG$64,32),\"\")))))))","v":""},{"$f":"IF(O16=4,VLOOKUP(N16,Figdata!$B$16:$AH$64,33),IF(O16=3,VLOOKUP(N16,Figdata!$B$16:$AI$64,34),IF(O16=2,VLOOKUP(N16,Figdata!$B$16:$AJ$64,35),IF(O16=1,VLOOKUP(N16,Figdata!$B$16:$AK$64,36),\"\"))))","v":""},0,null,null,{"$f":"'PVR BH'!C28","v":0},{"$f":"ROUND('PVR BH'!L28,0)","v":0},3,{"$f":"IF(AA16=35,VLOOKUP(Z16,Figdata!$B$15:$C$63,2),IF(AA16=34,VLOOKUP(Z16,Figdata!$B$15:$D$63,3),IF(AA16=33,VLOOKUP(Z16,Figdata!$B$15:$E$63,4),IF(AA16=32,VLOOKUP(Z16,Figdata!$B$15:$F$63,5),IF(AA16=31,VLOOKUP(Z16,Figdata!$B$15:$G$63,6),IF(AA16=30,VLOOKUP(Z16,Figdata!$B$15:$H$63,7),\"\"))))))","v":""},{"$f":"IF(AA16=29,VLOOKUP(Z16,Figdata!$B$16:$I$64,8),IF(AA16=28,VLOOKUP(Z16,Figdata!$B$16:$J$64,9),IF(AA16=27,VLOOKUP(Z16,Figdata!$B$16:$K$64,10),IF(AA16=26,VLOOKUP(Z16,Figdata!$B$16:$L$64,11),IF(AA16=25,VLOOKUP(Z16,Figdata!$B$16:$M$64,12),IF(AA16=24,VLOOKUP(Z16,Figdata!$B$16:$N$64,13),\"\"))))))","v":""},{"$f":"IF(AA16=23,VLOOKUP(Z16,Figdata!$B$16:$O$64,14),IF(AA16=22,VLOOKUP(Z16,Figdata!$B$16:$P$64,15),IF(AA16=21,VLOOKUP(Z16,Figdata!$B$16:$Q$64,16),IF(AA16=20,VLOOKUP(Z16,Figdata!$B$16:$R$64,17),IF(AA16=19,VLOOKUP(Z16,Figdata!$B$16:$S$64,18),IF(AA16=18,VLOOKUP(Z16,Figdata!$B$16:$T$64,19),\"\"))))))","v":""},{"$f":"IF(AA16=17,VLOOKUP(Z16,Figdata!$B$16:$U$64,20),IF(AA16=16,VLOOKUP(Z16,Figdata!$B$16:$V$64,21),IF(AA16=15,VLOOKUP(Z16,Figdata!$B$16:$W$64,22),IF(AA16=14,VLOOKUP(Z16,Figdata!$B$16:$X$64,23),IF(AA16=13,VLOOKUP(Z16,Figdata!$B$16:$Y$64,24),IF(AA16=12,VLOOKUP(Z16,Figdata!$B$16:$Z$64,25),\"\"))))))","v":""},{"$f":"IF(AA16=11,VLOOKUP(Z16,Figdata!$B$16:$AA$64,26),IF(AA16=10,VLOOKUP(Z16,Figdata!$B$16:$AB$64,27),IF(AA16=9,VLOOKUP(Z16,Figdata!$B$16:$AC$64,28),IF(AA16=8,VLOOKUP(Z16,Figdata!$B$16:$AD$64,29),IF(AA16=7,VLOOKUP(Z16,Figdata!$B$16:$AE$64,30),IF(AA16=6,VLOOKUP(Z16,Figdata!$B$16:$AF$64,31),IF(AA16=5,VLOOKUP(Z16,Figdata!$B$16:$AG$64,32),\"\")))))))","v":""},{"$f":"IF(AA16=4,VLOOKUP(Z16,Figdata!$B$16:$AH$64,33),IF(AA16=3,VLOOKUP(Z16,Figdata!$B$16:$AI$64,34),IF(AA16=2,VLOOKUP(Z16,Figdata!$B$16:$AJ$64,35),IF(AA16=1,VLOOKUP(Z16,Figdata!$B$16:$AK$64,36),\"\"))))","v":""},0]
[null,1.7,2.1,{"$f":"AVERAGE('PVR BH'!E28:F28)","v":5.5},{"$f":"AVERAGE('PVR BH'!E28,D17)","v":7.25},{"$f":"AVERAGE('PVR BH'!F28,D17)","v":3.75},null,{"$f":"(0.217*'PVR BH'!J28)-2.9","v":-2.9},{"$f":"(0.294*'PVR BH'!J28)-2.9","v":-2.9},{"$f":"('PVR BH'!J28*0.325)-1.75","v":-1.75},null,{"$f":"100-'PVR BH'!I28","v":100},null,{"$f":"'PVR BH'!C28","v":0},{"$f":"ROUND('PVR BH'!L29,0)","v":0},4,{"$f":"IF(O17=35,VLOOKUP(N17,Figdata!$B$15:$C$63,2),IF(O17=34,VLOOKUP(N17,Figdata!$B$15:$D$63,3),IF(O17=33,VLOOKUP(N17,Figdata!$B$15:$E$63,4),IF(O17=32,VLOOKUP(N17,Figdata!$B$15:$F$63,5),IF(O17=31,VLOOKUP(N17,Figdata!$B$15:$G$63,6),IF(O17=30,VLOOKUP(N17,Figdata!$B$15:$H$63,7),\"\"))))))","v":""},{"$f":"IF(O17=29,VLOOKUP(N17,Figdata!$B$16:$I$64,8),IF(O17=28,VLOOKUP(N17,Figdata!$B$16:$J$64,9),IF(O17=27,VLOOKUP(N17,Figdata!$B$16:$K$64,10),IF(O17=26,VLOOKUP(N17,Figdata!$B$16:$L$64,11),IF(O17=25,VLOOKUP(N17,Figdata!$B$16:$M$64,12),IF(O17=24,VLOOKUP(N17,Figdata!$B$16:$N$64,13),\"\"))))))","v":""},{"$f":"IF(O17=23,VLOOKUP(N17,Figdata!$B$16:$O$64,14),IF(O17=22,VLOOKUP(N17,Figdata!$B$16:$P$64,15),IF(O17=21,VLOOKUP(N17,Figdata!$B$16:$Q$64,16),IF(O17=20,VLOOKUP(N17,Figdata!$B$16:$R$64,17),IF(O17=19,VLOOKUP(N17,Figdata!$B$16:$S$64,18),IF(O17=18,VLOOKUP(N17,Figdata!$B$16:$T$64,19),\"\"))))))","v":""},{"$f":"IF(O17=17,VLOOKUP(N17,Figdata!$B$16:$U$64,20),IF(O17=16,VLOOKUP(N17,Figdata!$B$16:$V$64,21),IF(O17=15,VLOOKUP(N17,Figdata!$B$16:$W$64,22),IF(O17=14,VLOOKUP(N17,Figdata!$B$16:$X$64,23),IF(O17=13,VLOOKUP(N17,Figdata!$B$16:$Y$64,24),IF(O17=12,VLOOKUP(N17,Figdata!$B$16:$Z$64,25),\"\"))))))","v":""},{"$f":"IF(O17=11,VLOOKUP(N17,Figdata!$B$16:$AA$64,26),IF(O17=10,VLOOKUP(N17,Figdata!$B$16:$AB$64,27),IF(O17=9,VLOOKUP(N17,Figdata!$B$16:$AC$64,28),IF(O17=8,VLOOKUP(N17,Figdata!$B$16:$AD$64,29),IF(O17=7,VLOOKUP(N17,Figdata!$B$16:$AE$64,30),IF(O17=6,VLOOKUP(N17,Figdata!$B$16:$AF$64,31),IF(O17=5,VLOOKUP(N17,Figdata!$B$16:$AG$64,32),\"\")))))))","v":""},{"$f":"IF(O17=4,VLOOKUP(N17,Figdata!$B$16:$AH$64,33),IF(O17=3,VLOOKUP(N17,Figdata!$B$16:$AI$64,34),IF(O17=2,VLOOKUP(N17,Figdata!$B$16:$AJ$64,35),IF(O17=1,VLOOKUP(N17,Figdata!$B$16:$AK$64,36),\"\"))))","v":""},0,null,null,{"$f":"'PVR BH'!C29","v":0},{"$f":"ROUND('PVR BH'!L29,0)","v":0},4,{"$f":"IF(AA17=35,VLOOKUP(Z17,Figdata!$B$15:$C$63,2),IF(AA17=34,VLOOKUP(Z17,Figdata!$B$15:$D$63,3),IF(AA17=33,VLOOKUP(Z17,Figdata!$B$15:$E$63,4),IF(AA17=32,VLOOKUP(Z17,Figdata!$B$15:$F$63,5),IF(AA17=31,VLOOKUP(Z17,Figdata!$B$15:$G$63,6),IF(AA17=30,VLOOKUP(Z17,Figdata!$B$15:$H$63,7),\"\"))))))","v":""},{"$f":"IF(AA17=29,VLOOKUP(Z17,Figdata!$B$16:$I$64,8),IF(AA17=28,VLOOKUP(Z17,Figdata!$B$16:$J$64,9),IF(AA17=27,VLOOKUP(Z17,Figdata!$B$16:$K$64,10),IF(AA17=26,VLOOKUP(Z17,Figdata!$B$16:$L$64,11),IF(AA17=25,VLOOKUP(Z17,Figdata!$B$16:$M$64,12),IF(AA17=24,VLOOKUP(Z17,Figdata!$B$16:$N$64,13),\"\"))))))","v":""},{"$f":"IF(AA17=23,VLOOKUP(Z17,Figdata!$B$16:$O$64,14),IF(AA17=22,VLOOKUP(Z17,Figdata!$B$16:$P$64,15),IF(AA17=21,VLOOKUP(Z17,Figdata!$B$16:$Q$64,16),IF(AA17=20,VLOOKUP(Z17,Figdata!$B$16:$R$64,17),IF(AA17=19,VLOOKUP(Z17,Figdata!$B$16:$S$64,18),IF(AA17=18,VLOOKUP(Z17,Figdata!$B$16:$T$64,19),\"\"))))))","v":""},{"$f":"IF(AA17=17,VLOOKUP(Z17,Figdata!$B$16:$U$64,20),IF(AA17=16,VLOOKUP(Z17,Figdata!$B$16:$V$64,21),IF(AA17=15,VLOOKUP(Z17,Figdata!$B$16:$W$64,22),IF(AA17=14,VLOOKUP(Z17,Figdata!$B$16:$X$64,23),IF(AA17=13,VLOOKUP(Z17,Figdata!$B$16:$Y$64,24),IF(AA17=12,VLOOKUP(Z17,Figdata!$B$16:$Z$64,25),\"\"))))))","v":""},{"$f":"IF(AA17=11,VLOOKUP(Z17,Figdata!$B$16:$AA$64,26),IF(AA17=10,VLOOKUP(Z17,Figdata!$B$16:$AB$64,27),IF(AA17=9,VLOOKUP(Z17,Figdata!$B$16:$AC$64,28),IF(AA17=8,VLOOKUP(Z17,Figdata!$B$16:$AD$64,29),IF(AA17=7,VLOOKUP(Z17,Figdata!$B$16:$AE$64,30),IF(AA17=6,VLOOKUP(Z17,Figdata!$B$16:$AF$64,31),IF(AA17=5,VLOOKUP(Z17,Figdata!$B$16:$AG$64,32),\"\")))))))","v":""},{"$f":"IF(AA17=4,VLOOKUP(Z17,Figdata!$B$16:$AH$64,33),IF(AA17=3,VLOOKUP(Z17,Figdata!$B$16:$AI$64,34),IF(AA17=2,VLOOKUP(Z17,Figdata!$B$16:$AJ$64,35),IF(AA17=1,VLOOKUP(Z17,Figdata!$B$16:$AK$64,36),\"\"))))","v":""},0]
[null,3.2,3.7,{"$f":"AVERAGE('PVR BH'!E29:F29)","v":5.5},{"$f":"AVERAGE('PVR BH'!E29,D18)","v":7.25},{"$f":"AVERAGE('PVR BH'!F29,D18)","v":3.75},null,{"$f":"(0.217*'PVR BH'!J29)-2.9","v":-2.9},{"$f":"(0.294*'PVR BH'!J29)-2.9","v":-2.9},{"$f":"('PVR BH'!J29*0.325)-1.75","v":-1.75},null,{"$f":"100-'PVR BH'!I29","v":100},"*",{"$f":"'PVR BH'!C29","v":0},{"$f":"ROUND('PVR BH'!L30,0)","v":0},5,{"$f":"IF(O18=35,VLOOKUP(N18,Figdata!$B$15:$C$63,2),IF(O18=34,VLOOKUP(N18,Figdata!$B$15:$D$63,3),IF(O18=33,VLOOKUP(N18,Figdata!$B$15:$E$63,4),IF(O18=32,VLOOKUP(N18,Figdata!$B$15:$F$63,5),IF(O18=31,VLOOKUP(N18,Figdata!$B$15:$G$63,6),IF(O18=30,VLOOKUP(N18,Figdata!$B$15:$H$63,7),\"\"))))))","v":""},{"$f":"IF(O18=29,VLOOKUP(N18,Figdata!$B$16:$I$64,8),IF(O18=28,VLOOKUP(N18,Figdata!$B$16:$J$64,9),IF(O18=27,VLOOKUP(N18,Figdata!$B$16:$K$64,10),IF(O18=26,VLOOKUP(N18,Figdata!$B$16:$L$64,11),IF(O18=25,VLOOKUP(N18,Figdata!$B$16:$M$64,12),IF(O18=24,VLOOKUP(N18,Figdata!$B$16:$N$64,13),\"\"))))))","v":""},{"$f":"IF(O18=23,VLOOKUP(N18,Figdata!$B$16:$O$64,14),IF(O18=22,VLOOKUP(N18,Figdata!$B$16:$P$64,15),IF(O18=21,VLOOKUP(N18,Figdata!$B$16:$Q$64,16),IF(O18=20,VLOOKUP(N18,Figdata!$B$16:$R$64,17),IF(O18=19,VLOOKUP(N18,Figdata!$B$16:$S$64,18),IF(O18=18,VLOOKUP(N18,Figdata!$B$16:$T$64,19),\"\"))))))","v":""},{"$f":"IF(O18=17,VLOOKUP(N18,Figdata!$B$16:$U$64,20),IF(O18=16,VLOOKUP(N18,Figdata!$B$16:$V$64,21),IF(O18=15,VLOOKUP(N18,Figdata!$B$16:$W$64,22),IF(O18=14,VLOOKUP(N18,Figdata!$B$16:$X$64,23),IF(O18=13,VLOOKUP(N18,Figdata!$B$16:$Y$64,24),IF(O18=12,VLOOKUP(N18,Figdata!$B$16:$Z$64,25),\"\"))))))","v":""},{"$f":"IF(O18=11,VLOOKUP(N18,Figdata!$B$16:$AA$64,26),IF(O18=10,VLOOKUP(N18,Figdata!$B$16:$AB$64,27),IF(O18=9,VLOOKUP(N18,Figdata!$B$16:$AC$64,28),IF(O18=8,VLOOKUP(N18,Figdata!$B$16:$AD$64,29),IF(O18=7,VLOOKUP(N18,Figdata!$B$16:$AE$64,30),IF(O18=6,VLOOKUP(N18,Figdata!$B$16:$AF$64,31),IF(O18=5,VLOOKUP(N18,Figdata!$B$16:$AG$64,32),\"\")))))))","v":""},{"$f":"IF(O18=4,VLOOKUP(N18,Figdata!$B$16:$AH$64,33),IF(O18=3,VLOOKUP(N18,Figdata!$B$16:$AI$64,34),IF(O18=2,VLOOKUP(N18,Figdata!$B$16:$AJ$64,35),IF(O18=1,VLOOKUP(N18,Figdata!$B$16:$AK$64,36),\"\"))))","v":""},0,null,null,{"$f":"'PVR BH'!C30","v":0},{"$f":"ROUND('PVR BH'!L30,0)","v":0},5,{"$f":"IF(AA18=35,VLOOKUP(Z18,Figdata!$B$15:$C$63,2),IF(AA18=34,VLOOKUP(Z18,Figdata!$B$15:$D$63,3),IF(AA18=33,VLOOKUP(Z18,Figdata!$B$15:$E$63,4),IF(AA18=32,VLOOKUP(Z18,Figdata!$B$15:$F$63,5),IF(AA18=31,VLOOKUP(Z18,Figdata!$B$15:$G$63,6),IF(AA18=30,VLOOKUP(Z18,Figdata!$B$15:$H$63,7),\"\"))))))","v":""},{"$f":"IF(AA18=29,VLOOKUP(Z18,Figdata!$B$16:$I$64,8),IF(AA18=28,VLOOKUP(Z18,Figdata!$B$16:$J$64,9),IF(AA18=27,VLOOKUP(Z18,Figdata!$B$16:$K$64,10),IF(AA18=26,VLOOKUP(Z18,Figdata!$B$16:$L$64,11),IF(AA18=25,VLOOKUP(Z18,Figdata!$B$16:$M$64,12),IF(AA18=24,VLOOKUP(Z18,Figdata!$B$16:$N$64,13),\"\"))))))","v":""},{"$f":"IF(AA18=23,VLOOKUP(Z18,Figdata!$B$16:$O$64,14),IF(AA18=22,VLOOKUP(Z18,Figdata!$B$16:$P$64,15),IF(AA18=21,VLOOKUP(Z18,Figdata!$B$16:$Q$64,16),IF(AA18=20,VLOOKUP(Z18,Figdata!$B$16:$R$64,17),IF(AA18=19,VLOOKUP(Z18,Figdata!$B$16:$S$64,18),IF(AA18=18,VLOOKUP(Z18,Figdata!$B$16:$T$64,19),\"\"))))))","v":""},{"$f":"IF(AA18=17,VLOOKUP(Z18,Figdata!$B$16:$U$64,20),IF(AA18=16,VLOOKUP(Z18,Figdata!$B$16:$V$64,21),IF(AA18=15,VLOOKUP(Z18,Figdata!$B$16:$W$64,22),IF(AA18=14,VLOOKUP(Z18,Figdata!$B$16:$X$64,23),IF(AA18=13,VLOOKUP(Z18,Figdata!$B$16:$Y$64,24),IF(AA18=12,VLOOKUP(Z18,Figdata!$B$16:$Z$64,25),\"\"))))))","v":""},{"$f":"IF(AA18=11,VLOOKUP(Z18,Figdata!$B$16:$AA$64,26),IF(AA18=10,VLOOKUP(Z18,Figdata!$B$16:$AB$64,27),IF(AA18=9,VLOOKUP(Z18,Figdata!$B$16:$AC$64,28),IF(AA18=8,VLOOKUP(Z18,Figdata!$B$16:$AD$64,29),IF(AA18=7,VLOOKUP(Z18,Figdata!$B$16:$AE$64,30),IF(AA18=6,VLOOKUP(Z18,Figdata!$B$16:$AF$64,31),IF(AA18=5,VLOOKUP(Z18,Figdata!$B$16:$AG$64,32),\"\")))))))","v":""},{"$f":"IF(AA18=4,VLOOKUP(Z18,Figdata!$B$16:$AH$64,33),IF(AA18=3,VLOOKUP(Z18,Figdata!$B$16:$AI$64,34),IF(AA18=2,VLOOKUP(Z18,Figdata!$B$16:$AJ$64,35),IF(AA18=1,VLOOKUP(Z18,Figdata!$B$16:$AK$64,36),\"\"))))","v":""},0]
[null,3.7,4.0999999999999996,{"$f":"AVERAGE('PVR BH'!E30:F30)","v":5.5},{"$f":"AVERAGE('PVR BH'!E30,D19)","v":7.25},{"$f":"AVERAGE('PVR BH'!F30,D19)","v":3.75},null,{"$f":"(0.217*'PVR BH'!J30)-2.9","v":-2.9},{"$f":"(0.294*'PVR BH'!J30)-2.9","v":-2.9},{"$f":"('PVR BH'!J30*0.325)-1.75","v":-1.75},null,{"$f":"100-'PVR BH'!I30","v":100},null,{"$f":"'PVR BH'!C30","v":0},{"$f":"ROUND('PVR BH'!L31,0)","v":0},6,{"$f":"IF(O19=35,VLOOKUP(N19,Figdata!$B$15:$C$63,2),IF(O19=34,VLOOKUP(N19,Figdata!$B$15:$D$63,3),IF(O19=33,VLOOKUP(N19,Figdata!$B$15:$E$63,4),IF(O19=32,VLOOKUP(N19,Figdata!$B$15:$F$63,5),IF(O19=31,VLOOKUP(N19,Figdata!$B$15:$G$63,6),IF(O19=30,VLOOKUP(N19,Figdata!$B$15:$H$63,7),\"\"))))))","v":""},{"$f":"IF(O19=29,VLOOKUP(N19,Figdata!$B$16:$I$64,8),IF(O19=28,VLOOKUP(N19,Figdata!$B$16:$J$64,9),IF(O19=27,VLOOKUP(N19,Figdata!$B$16:$K$64,10),IF(O19=26,VLOOKUP(N19,Figdata!$B$16:$L$64,11),IF(O19=25,VLOOKUP(N19,Figdata!$B$16:$M$64,12),IF(O19=24,VLOOKUP(N19,Figdata!$B$16:$N$64,13),\"\"))))))","v":""},{"$f":"IF(O19=23,VLOOKUP(N19,Figdata!$B$16:$O$64,14),IF(O19=22,VLOOKUP(N19,Figdata!$B$16:$P$64,15),IF(O19=21,VLOOKUP(N19,Figdata!$B$16:$Q$64,16),IF(O19=20,VLOOKUP(N19,Figdata!$B$16:$R$64,17),IF(O19=19,VLOOKUP(N19,Figdata!$B$16:$S$64,18),IF(O19=18,VLOOKUP(N19,Figdata!$B$16:$T$64,19),\"\"))))))","v":""},{"$f":"IF(O19=17,VLOOKUP(N19,Figdata!$B$16:$U$64,20),IF(O19=16,VLOOKUP(N19,Figdata!$B$16:$V$64,21),IF(O19=15,VLOOKUP(N19,Figdata!$B$16:$W$64,22),IF(O19=14,VLOOKUP(N19,Figdata!$B$16:$X$64,23),IF(O19=13,VLOOKUP(N19,Figdata!$B$16:$Y$64,24),IF(O19=12,VLOOKUP(N19,Figdata!$B$16:$Z$64,25),\"\"))))))","v":""},{"$f":"IF(O19=11,VLOOKUP(N19,Figdata!$B$16:$AA$64,26),IF(O19=10,VLOOKUP(N19,Figdata!$B$16:$AB$64,27),IF(O19=9,VLOOKUP(N19,Figdata!$B$16:$AC$64,28),IF(O19=8,VLOOKUP(N19,Figdata!$B$16:$AD$64,29),IF(O19=7,VLOOKUP(N19,Figdata!$B$16:$AE$64,30),IF(O19=6,VLOOKUP(N19,Figdata!$B$16:$AF$64,31),IF(O19=5,VLOOKUP(N19,Figdata!$B$16:$AG$64,32),\"\")))))))","v":""},{"$f":"IF(O19=4,VLOOKUP(N19,Figdata!$B$16:$AH$64,33),IF(O19=3,VLOOKUP(N19,Figdata!$B$16:$AI$64,34),IF(O19=2,VLOOKUP(N19,Figdata!$B$16:$AJ$64,35),IF(O19=1,VLOOKUP(N19,Figdata!$B$16:$AK$64,36),\"\"))))","v":""},0,null,null,{"$f":"'PVR BH'!C31","v":0},{"$f":"ROUND('PVR BH'!L31,0)","v":0},6,{"$f":"IF(AA19=35,VLOOKUP(Z19,Figdata!$B$15:$C$63,2),IF(AA19=34,VLOOKUP(Z19,Figdata!$B$15:$D$63,3),IF(AA19=33,VLOOKUP(Z19,Figdata!$B$15:$E$63,4),IF(AA19=32,VLOOKUP(Z19,Figdata!$B$15:$F$63,5),IF(AA19=31,VLOOKUP(Z19,Figdata!$B$15:$G$63,6),IF(AA19=30,VLOOKUP(Z19,Figdata!$B$15:$H$63,7),\"\"))))))","v":""},{"$f":"IF(AA19=29,VLOOKUP(Z19,Figdata!$B$16:$I$64,8),IF(AA19=28,VLOOKUP(Z19,Figdata!$B$16:$J$64,9),IF(AA19=27,VLOOKUP(Z19,Figdata!$B$16:$K$64,10),IF(AA19=26,VLOOKUP(Z19,Figdata!$B$16:$L$64,11),IF(AA19=25,VLOOKUP(Z19,Figdata!$B$16:$M$64,12),IF(AA19=24,VLOOKUP(Z19,Figdata!$B$16:$N$64,13),\"\"))))))","v":""},{"$f":"IF(AA19=23,VLOOKUP(Z19,Figdata!$B$16:$O$64,14),IF(AA19=22,VLOOKUP(Z19,Figdata!$B$16:$P$64,15),IF(AA19=21,VLOOKUP(Z19,Figdata!$B$16:$Q$64,16),IF(AA19=20,VLOOKUP(Z19,Figdata!$B$16:$R$64,17),IF(AA19=19,VLOOKUP(Z19,Figdata!$B$16:$S$64,18),IF(AA19=18,VLOOKUP(Z19,Figdata!$B$16:$T$64,19),\"\"))))))","v":""},{"$f":"IF(AA19=17,VLOOKUP(Z19,Figdata!$B$16:$U$64,20),IF(AA19=16,VLOOKUP(Z19,Figdata!$B$16:$V$64,21),IF(AA19=15,VLOOKUP(Z19,Figdata!$B$16:$W$64,22),IF(AA19=14,VLOOKUP(Z19,Figdata!$B$16:$X$64,23),IF(AA19=13,VLOOKUP(Z19,Figdata!$B$16:$Y$64,24),IF(AA19=12,VLOOKUP(Z19,Figdata!$B$16:$Z$64,25),\"\"))))))","v":""},{"$f":"IF(AA19=11,VLOOKUP(Z19,Figdata!$B$16:$AA$64,26),IF(AA19=10,VLOOKUP(Z19,Figdata!$B$16:$AB$64,27),IF(AA19=9,VLOOKUP(Z19,Figdata!$B$16:$AC$64,28),IF(AA19=8,VLOOKUP(Z19,Figdata!$B$16:$AD$64,29),IF(AA19=7,VLOOKUP(Z19,Figdata!$B$16:$AE$64,30),IF(AA19=6,VLOOKUP(Z19,Figdata!$B$16:$AF$64,31),IF(AA19=5,VLOOKUP(Z19,Figdata!$B$16:$AG$64,32),\"\")))))))","v":""},{"$f":"IF(AA19=4,VLOOKUP(Z19,Figdata!$B$16:$AH$64,33),IF(AA19=3,VLOOKUP(Z19,Figdata!$B$16:$AI$64,34),IF(AA19=2,VLOOKUP(Z19,Figdata!$B$16:$AJ$64,35),IF(AA19=1,VLOOKUP(Z19,Figdata!$B$16:$AK$64,36),\"\"))))","v":""},0]
[null,2.2000000000000002,2.4,{"$f":"AVERAGE('PVR BH'!E31:F31)","v":5.5},{"$f":"AVERAGE('PVR BH'!E31,D20)","v":7.25},{"$f":"AVERAGE('PVR BH'!F31,D20)","v":3.75},null,{"$f":"(0.217*'PVR BH'!J31)-2.9","v":-2.9},{"$f":"(0.294*'PVR BH'!J31)-2.9","v":-2.9},{"$f":"('PVR BH'!J31*0.325)-1.75","v":-1.75},null,{"$f":"100-'PVR BH'!I31","v":100},null,{"$f":"'PVR BH'!C31","v":0},{"$f":"ROUND('PVR BH'!L32,0)","v":0},7,{"$f":"IF(O20=35,VLOOKUP(N20,Figdata!$B$15:$C$63,2),IF(O20=34,VLOOKUP(N20,Figdata!$B$15:$D$63,3),IF(O20=33,VLOOKUP(N20,Figdata!$B$15:$E$63,4),IF(O20=32,VLOOKUP(N20,Figdata!$B$15:$F$63,5),IF(O20=31,VLOOKUP(N20,Figdata!$B$15:$G$63,6),IF(O20=30,VLOOKUP(N20,Figdata!$B$15:$H$63,7),\"\"))))))","v":""},{"$f":"IF(O20=29,VLOOKUP(N20,Figdata!$B$16:$I$64,8),IF(O20=28,VLOOKUP(N20,Figdata!$B$16:$J$64,9),IF(O20=27,VLOOKUP(N20,Figdata!$B$16:$K$64,10),IF(O20=26,VLOOKUP(N20,Figdata!$B$16:$L$64,11),IF(O20=25,VLOOKUP(N20,Figdata!$B$16:$M$64,12),IF(O20=24,VLOOKUP(N20,Figdata!$B$16:$N$64,13),\"\"))))))","v":""},{"$f":"IF(O20=23,VLOOKUP(N20,Figdata!$B$16:$O$64,14),IF(O20=22,VLOOKUP(N20,Figdata!$B$16:$P$64,15),IF(O20=21,VLOOKUP(N20,Figdata!$B$16:$Q$64,16),IF(O20=20,VLOOKUP(N20,Figdata!$B$16:$R$64,17),IF(O20=19,VLOOKUP(N20,Figdata!$B$16:$S$64,18),IF(O20=18,VLOOKUP(N20,Figdata!$B$16:$T$64,19),\"\"))))))","v":""},{"$f":"IF(O20=17,VLOOKUP(N20,Figdata!$B$16:$U$64,20),IF(O20=16,VLOOKUP(N20,Figdata!$B$16:$V$64,21),IF(O20=15,VLOOKUP(N20,Figdata!$B$16:$W$64,22),IF(O20=14,VLOOKUP(N20,Figdata!$B$16:$X$64,23),IF(O20=13,VLOOKUP(N20,Figdata!$B$16:$Y$64,24),IF(O20=12,VLOOKUP(N20,Figdata!$B$16:$Z$64,25),\"\"))))))","v":""},{"$f":"IF(O20=11,VLOOKUP(N20,Figdata!$B$16:$AA$64,26),IF(O20=10,VLOOKUP(N20,Figdata!$B$16:$AB$64,27),IF(O20=9,VLOOKUP(N20,Figdata!$B$16:$AC$64,28),IF(O20=8,VLOOKUP(N20,Figdata!$B$16:$AD$64,29),IF(O20=7,VLOOKUP(N20,Figdata!$B$16:$AE$64,30),IF(O20=6,VLOOKUP(N20,Figdata!$B$16:$AF$64,31),IF(O20=5,VLOOKUP(N20,Figdata!$B$16:$AG$64,32),\"\")))))))","v":""},{"$f":"IF(O20=4,VLOOKUP(N20,Figdata!$B$16:$AH$64,33),IF(O20=3,VLOOKUP(N20,Figdata!$B$16:$AI$64,34),IF(O20=2,VLOOKUP(N20,Figdata!$B$16:$AJ$64,35),IF(O20=1,VLOOKUP(N20,Figdata!$B$16:$AK$64,36),\"\"))))","v":""},0,null,null,{"$f":"'PVR BH'!C32","v":0},{"$f":"ROUND('PVR BH'!L32,0)","v":0},7,{"$f":"IF(AA20=35,VLOOKUP(Z20,Figdata!$B$15:$C$63,2),IF(AA20=34,VLOOKUP(Z20,Figdata!$B$15:$D$63,3),IF(AA20=33,VLOOKUP(Z20,Figdata!$B$15:$E$63,4),IF(AA20=32,VLOOKUP(Z20,Figdata!$B$15:$F$63,5),IF(AA20=31,VLOOKUP(Z20,Figdata!$B$15:$G$63,6),IF(AA20=30,VLOOKUP(Z20,Figdata!$B$15:$H$63,7),\"\"))))))","v":""},{"$f":"IF(AA20=29,VLOOKUP(Z20,Figdata!$B$16:$I$64,8),IF(AA20=28,VLOOKUP(Z20,Figdata!$B$16:$J$64,9),IF(AA20=27,VLOOKUP(Z20,Figdata!$B$16:$K$64,10),IF(AA20=26,VLOOKUP(Z20,Figdata!$B$16:$L$64,11),IF(AA20=25,VLOOKUP(Z20,Figdata!$B$16:$M$64,12),IF(AA20=24,VLOOKUP(Z20,Figdata!$B$16:$N$64,13),\"\"))))))","v":""},{"$f":"IF(AA20=23,VLOOKUP(Z20,Figdata!$B$16:$O$64,14),IF(AA20=22,VLOOKUP(Z20,Figdata!$B$16:$P$64,15),IF(AA20=21,VLOOKUP(Z20,Figdata!$B$16:$Q$64,16),IF(AA20=20,VLOOKUP(Z20,Figdata!$B$16:$R$64,17),IF(AA20=19,VLOOKUP(Z20,Figdata!$B$16:$S$64,18),IF(AA20=18,VLOOKUP(Z20,Figdata!$B$16:$T$64,19),\"\"))))))","v":""},{"$f":"IF(AA20=17,VLOOKUP(Z20,Figdata!$B$16:$U$64,20),IF(AA20=16,VLOOKUP(Z20,Figdata!$B$16:$V$64,21),IF(AA20=15,VLOOKUP(Z20,Figdata!$B$16:$W$64,22),IF(AA20=14,VLOOKUP(Z20,Figdata!$B$16:$X$64,23),IF(AA20=13,VLOOKUP(Z20,Figdata!$B$16:$Y$64,24),IF(AA20=12,VLOOKUP(Z20,Figdata!$B$16:$Z$64,25),\"\"))))))","v":""},{"$f":"IF(AA20=11,VLOOKUP(Z20,Figdata!$B$16:$AA$64,26),IF(AA20=10,VLOOKUP(Z20,Figdata!$B$16:$AB$64,27),IF(AA20=9,VLOOKUP(Z20,Figdata!$B$16:$AC$64,28),IF(AA20=8,VLOOKUP(Z20,Figdata!$B$16:$AD$64,29),IF(AA20=7,VLOOKUP(Z20,Figdata!$B$16:$AE$64,30),IF(AA20=6,VLOOKUP(Z20,Figdata!$B$16:$AF$64,31),IF(AA20=5,VLOOKUP(Z20,Figdata!$B$16:$AG$64,32),\"\")))))))","v":""},{"$f":"IF(AA20=4,VLOOKUP(Z20,Figdata!$B$16:$AH$64,33),IF(AA20=3,VLOOKUP(Z20,Figdata!$B$16:$AI$64,34),IF(AA20=2,VLOOKUP(Z20,Figdata!$B$16:$AJ$64,35),IF(AA20=1,VLOOKUP(Z20,Figdata!$B$16:$AK$64,36),\"\"))))","v":""},0]
[null,2.4,2.5,{"$f":"AVERAGE('PVR BH'!E32:F32)","v":5.5},{"$f":"AVERAGE('PVR BH'!E32,D21)","v":7.25},{"$f":"AVERAGE('PVR BH'!F32,D21)","v":3.75},null,{"$f":"(0.217*'PVR BH'!J32)-2.9","v":-2.9},{"$f":"(0.294*'PVR BH'!J32)-2.9","v":-2.9},{"$f":"('PVR BH'!J32*0.325)-1.75","v":-1.75},null,{"$f":"100-'PVR BH'!I32","v":100},"*",{"$f":"'PVR BH'!C32","v":0},{"$f":"ROUND('PVR BH'!L33,0)","v":0},8,{"$f":"IF(O21=35,VLOOKUP(N21,Figdata!$B$15:$C$63,2),IF(O21=34,VLOOKUP(N21,Figdata!$B$15:$D$63,3),IF(O21=33,VLOOKUP(N21,Figdata!$B$15:$E$63,4),IF(O21=32,VLOOKUP(N21,Figdata!$B$15:$F$63,5),IF(O21=31,VLOOKUP(N21,Figdata!$B$15:$G$63,6),IF(O21=30,VLOOKUP(N21,Figdata!$B$15:$H$63,7),\"\"))))))","v":""},{"$f":"IF(O21=29,VLOOKUP(N21,Figdata!$B$16:$I$64,8),IF(O21=28,VLOOKUP(N21,Figdata!$B$16:$J$64,9),IF(O21=27,VLOOKUP(N21,Figdata!$B$16:$K$64,10),IF(O21=26,VLOOKUP(N21,Figdata!$B$16:$L$64,11),IF(O21=25,VLOOKUP(N21,Figdata!$B$16:$M$64,12),IF(O21=24,VLOOKUP(N21,Figdata!$B$16:$N$64,13),\"\"))))))","v":""},{"$f":"IF(O21=23,VLOOKUP(N21,Figdata!$B$16:$O$64,14),IF(O21=22,VLOOKUP(N21,Figdata!$B$16:$P$64,15),IF(O21=21,VLOOKUP(N21,Figdata!$B$16:$Q$64,16),IF(O21=20,VLOOKUP(N21,Figdata!$B$16:$R$64,17),IF(O21=19,VLOOKUP(N21,Figdata!$B$16:$S$64,18),IF(O21=18,VLOOKUP(N21,Figdata!$B$16:$T$64,19),\"\"))))))","v":""},{"$f":"IF(O21=17,VLOOKUP(N21,Figdata!$B$16:$U$64,20),IF(O21=16,VLOOKUP(N21,Figdata!$B$16:$V$64,21),IF(O21=15,VLOOKUP(N21,Figdata!$B$16:$W$64,22),IF(O21=14,VLOOKUP(N21,Figdata!$B$16:$X$64,23),IF(O21=13,VLOOKUP(N21,Figdata!$B$16:$Y$64,24),IF(O21=12,VLOOKUP(N21,Figdata!$B$16:$Z$64,25),\"\"))))))","v":""},{"$f":"IF(O21=11,VLOOKUP(N21,Figdata!$B$16:$AA$64,26),IF(O21=10,VLOOKUP(N21,Figdata!$B$16:$AB$64,27),IF(O21=9,VLOOKUP(N21,Figdata!$B$16:$AC$64,28),IF(O21=8,VLOOKUP(N21,Figdata!$B$16:$AD$64,29),IF(O21=7,VLOOKUP(N21,Figdata!$B$16:$AE$64,30),IF(O21=6,VLOOKUP(N21,Figdata!$B$16:$AF$64,31),IF(O21=5,VLOOKUP(N21,Figdata!$B$16:$AG$64,32),\"\")))))))","v":""},{"$f":"IF(O21=4,VLOOKUP(N21,Figdata!$B$16:$AH$64,33),IF(O21=3,VLOOKUP(N21,Figdata!$B$16:$AI$64,34),IF(O21=2,VLOOKUP(N21,Figdata!$B$16:$AJ$64,35),IF(O21=1,VLOOKUP(N21,Figdata!$B$16:$AK$64,36),\"\"))))","v":""},0,null,null,{"$f":"'PVR BH'!C33","v":0},{"$f":"ROUND('PVR BH'!L33,0)","v":0},8,{"$f":"IF(AA21=35,VLOOKUP(Z21,Figdata!$B$15:$C$63,2),IF(AA21=34,VLOOKUP(Z21,Figdata!$B$15:$D$63,3),IF(AA21=33,VLOOKUP(Z21,Figdata!$B$15:$E$63,4),IF(AA21=32,VLOOKUP(Z21,Figdata!$B$15:$F$63,5),IF(AA21=31,VLOOKUP(Z21,Figdata!$B$15:$G$63,6),IF(AA21=30,VLOOKUP(Z21,Figdata!$B$15:$H$63,7),\"\"))))))","v":""},{"$f":"IF(AA21=29,VLOOKUP(Z21,Figdata!$B$16:$I$64,8),IF(AA21=28,VLOOKUP(Z21,Figdata!$B$16:$J$64,9),IF(AA21=27,VLOOKUP(Z21,Figdata!$B$16:$K$64,10),IF(AA21=26,VLOOKUP(Z21,Figdata!$B$16:$L$64,11),IF(AA21=25,VLOOKUP(Z21,Figdata!$B$16:$M$64,12),IF(AA21=24,VLOOKUP(Z21,Figdata!$B$16:$N$64,13),\"\"))))))","v":""},{"$f":"IF(AA21=23,VLOOKUP(Z21,Figdata!$B$16:$O$64,14),IF(AA21=22,VLOOKUP(Z21,Figdata!$B$16:$P$64,15),IF(AA21=21,VLOOKUP(Z21,Figdata!$B$16:$Q$64,16),IF(AA21=20,VLOOKUP(Z21,Figdata!$B$16:$R$64,17),IF(AA21=19,VLOOKUP(Z21,Figdata!$B$16:$S$64,18),IF(AA21=18,VLOOKUP(Z21,Figdata!$B$16:$T$64,19),\"\"))))))","v":""},{"$f":"IF(AA21=17,VLOOKUP(Z21,Figdata!$B$16:$U$64,20),IF(AA21=16,VLOOKUP(Z21,Figdata!$B$16:$V$64,21),IF(AA21=15,VLOOKUP(Z21,Figdata!$B$16:$W$64,22),IF(AA21=14,VLOOKUP(Z21,Figdata!$B$16:$X$64,23),IF(AA21=13,VLOOKUP(Z21,Figdata!$B$16:$Y$64,24),IF(AA21=12,VLOOKUP(Z21,Figdata!$B$16:$Z$64,25),\"\"))))))","v":""},{"$f":"IF(AA21=11,VLOOKUP(Z21,Figdata!$B$16:$AA$64,26),IF(AA21=10,VLOOKUP(Z21,Figdata!$B$16:$AB$64,27),IF(AA21=9,VLOOKUP(Z21,Figdata!$B$16:$AC$64,28),IF(AA21=8,VLOOKUP(Z21,Figdata!$B$16:$AD$64,29),IF(AA21=7,VLOOKUP(Z21,Figdata!$B$16:$AE$64,30),IF(AA21=6,VLOOKUP(Z21,Figdata!$B$16:$AF$64,31),IF(AA21=5,VLOOKUP(Z21,Figdata!$B$16:$AG$64,32),\"\")))))))","v":""},{"$f":"IF(AA21=4,VLOOKUP(Z21,Figdata!$B$16:$AH$64,33),IF(AA21=3,VLOOKUP(Z21,Figdata!$B$16:$AI$64,34),IF(AA21=2,VLOOKUP(Z21,Figdata!$B$16:$AJ$64,35),IF(AA21=1,VLOOKUP(Z21,Figdata!$B$16:$AK$64,36),\"\"))))","v":""},0]
[null,1.9,1.95,{"$f":"AVERAGE('PVR BH'!E33:F33)","v":5.5},{"$f":"AVERAGE('PVR BH'!E33,D22)","v":7.25},{"$f":"AVERAGE('PVR BH'!F33,D22)","v":3.75},null,{"$f":"(0.217*'PVR BH'!J33)-2.9","v":-2.9},{"$f":"(0.294*'PVR BH'!J33)-2.9","v":-2.9},{"$f":"('PVR BH'!J33*0.325)-1.75","v":-1.75},null,{"$f":"100-'PVR BH'!I33","v":100},null,{"$f":"'PVR BH'!C33","v":0},{"$f":"ROUND('PVR BH'!L34,0)","v":0},9,{"$f":"IF(O22=35,VLOOKUP(N22,Figdata!$B$15:$C$63,2),IF(O22=34,VLOOKUP(N22,Figdata!$B$15:$D$63,3),IF(O22=33,VLOOKUP(N22,Figdata!$B$15:$E$63,4),IF(O22=32,VLOOKUP(N22,Figdata!$B$15:$F$63,5),IF(O22=31,VLOOKUP(N22,Figdata!$B$15:$G$63,6),IF(O22=30,VLOOKUP(N22,Figdata!$B$15:$H$63,7),\"\"))))))","v":""},{"$f":"IF(O22=29,VLOOKUP(N22,Figdata!$B$16:$I$64,8),IF(O22=28,VLOOKUP(N22,Figdata!$B$16:$J$64,9),IF(O22=27,VLOOKUP(N22,Figdata!$B$16:$K$64,10),IF(O22=26,VLOOKUP(N22,Figdata!$B$16:$L$64,11),IF(O22=25,VLOOKUP(N22,Figdata!$B$16:$M$64,12),IF(O22=24,VLOOKUP(N22,Figdata!$B$16:$N$64,13),\"\"))))))","v":""},{"$f":"IF(O22=23,VLOOKUP(N22,Figdata!$B$16:$O$64,14),IF(O22=22,VLOOKUP(N22,Figdata!$B$16:$P$64,15),IF(O22=21,VLOOKUP(N22,Figdata!$B$16:$Q$64,16),IF(O22=20,VLOOKUP(N22,Figdata!$B$16:$R$64,17),IF(O22=19,VLOOKUP(N22,Figdata!$B$16:$S$64,18),IF(O22=18,VLOOKUP(N22,Figdata!$B$16:$T$64,19),\"\"))))))","v":""},{"$f":"IF(O22=17,VLOOKUP(N22,Figdata!$B$16:$U$64,20),IF(O22=16,VLOOKUP(N22,Figdata!$B$16:$V$64,21),IF(O22=15,VLOOKUP(N22,Figdata!$B$16:$W$64,22),IF(O22=14,VLOOKUP(N22,Figdata!$B$16:$X$64,23),IF(O22=13,VLOOKUP(N22,Figdata!$B$16:$Y$64,24),IF(O22=12,VLOOKUP(N22,Figdata!$B$16:$Z$64,25),\"\"))))))","v":""},{"$f":"IF(O22=11,VLOOKUP(N22,Figdata!$B$16:$AA$64,26),IF(O22=10,VLOOKUP(N22,Figdata!$B$16:$AB$64,27),IF(O22=9,VLOOKUP(N22,Figdata!$B$16:$AC$64,28),IF(O22=8,VLOOKUP(N22,Figdata!$B$16:$AD$64,29),IF(O22=7,VLOOKUP(N22,Figdata!$B$16:$AE$64,30),IF(O22=6,VLOOKUP(N22,Figdata!$B$16:$AF$64,31),IF(O22=5,VLOOKUP(N22,Figdata!$B$16:$AG$64,32),\"\")))))))","v":""},{"$f":"IF(O22=4,VLOOKUP(N22,Figdata!$B$16:$AH$64,33),IF(O22=3,VLOOKUP(N22,Figdata!$B$16:$AI$64,34),IF(O22=2,VLOOKUP(N22,Figdata!$B$16:$AJ$64,35),IF(O22=1,VLOOKUP(N22,Figdata!$B$16:$AK$64,36),\"\"))))","v":""},0,null,null,{"$f":"'PVR BH'!C34","v":0},{"$f":"ROUND('PVR BH'!L34,0)","v":0},9,{"$f":"IF(AA22=35,VLOOKUP(Z22,Figdata!$B$15:$C$63,2),IF(AA22=34,VLOOKUP(Z22,Figdata!$B$15:$D$63,3),IF(AA22=33,VLOOKUP(Z22,Figdata!$B$15:$E$63,4),IF(AA22=32,VLOOKUP(Z22,Figdata!$B$15:$F$63,5),IF(AA22=31,VLOOKUP(Z22,Figdata!$B$15:$G$63,6),IF(AA22=30,VLOOKUP(Z22,Figdata!$B$15:$H$63,7),\"\"))))))","v":""},{"$f":"IF(AA22=29,VLOOKUP(Z22,Figdata!$B$16:$I$64,8),IF(AA22=28,VLOOKUP(Z22,Figdata!$B$16:$J$64,9),IF(AA22=27,VLOOKUP(Z22,Figdata!$B$16:$K$64,10),IF(AA22=26,VLOOKUP(Z22,Figdata!$B$16:$L$64,11),IF(AA22=25,VLOOKUP(Z22,Figdata!$B$16:$M$64,12),IF(AA22=24,VLOOKUP(Z22,Figdata!$B$16:$N$64,13),\"\"))))))","v":""},{"$f":"IF(AA22=23,VLOOKUP(Z22,Figdata!$B$16:$O$64,14),IF(AA22=22,VLOOKUP(Z22,Figdata!$B$16:$P$64,15),IF(AA22=21,VLOOKUP(Z22,Figdata!$B$16:$Q$64,16),IF(AA22=20,VLOOKUP(Z22,Figdata!$B$16:$R$64,17),IF(AA22=19,VLOOKUP(Z22,Figdata!$B$16:$S$64,18),IF(AA22=18,VLOOKUP(Z22,Figdata!$B$16:$T$64,19),\"\"))))))","v":""},{"$f":"IF(AA22=17,VLOOKUP(Z22,Figdata!$B$16:$U$64,20),IF(AA22=16,VLOOKUP(Z22,Figdata!$B$16:$V$64,21),IF(AA22=15,VLOOKUP(Z22,Figdata!$B$16:$W$64,22),IF(AA22=14,VLOOKUP(Z22,Figdata!$B$16:$X$64,23),IF(AA22=13,VLOOKUP(Z22,Figdata!$B$16:$Y$64,24),IF(AA22=12,VLOOKUP(Z22,Figdata!$B$16:$Z$64,25),\"\"))))))","v":""},{"$f":"IF(AA22=11,VLOOKUP(Z22,Figdata!$B$16:$AA$64,26),IF(AA22=10,VLOOKUP(Z22,Figdata!$B$16:$AB$64,27),IF(AA22=9,VLOOKUP(Z22,Figdata!$B$16:$AC$64,28),IF(AA22=8,VLOOKUP(Z22,Figdata!$B$16:$AD$64,29),IF(AA22=7,VLOOKUP(Z22,Figdata!$B$16:$AE$64,30),IF(AA22=6,VLOOKUP(Z22,Figdata!$B$16:$AF$64,31),IF(AA22=5,VLOOKUP(Z22,Figdata!$B$16:$AG$64,32),\"\")))))))","v":""},{"$f":"IF(AA22=4,VLOOKUP(Z22,Figdata!$B$16:$AH$64,33),IF(AA22=3,VLOOKUP(Z22,Figdata!$B$16:$AI$64,34),IF(AA22=2,VLOOKUP(Z22,Figdata!$B$16:$AJ$64,35),IF(AA22=1,VLOOKUP(Z22,Figdata!$B$16:$AK$64,36),\"\"))))","v":""},0]
[null,1.95,2,{"$f":"AVERAGE('PVR BH'!E34:F34)","v":5.5},{"$f":"AVERAGE('PVR BH'!E34,D23)","v":7.25},{"$f":"AVERAGE('PVR BH'!F34,D23)","v":3.75},null,{"$f":"(0.217*'PVR BH'!J34)-2.9","v":-2.9},{"$f":"(0.294*'PVR BH'!J34)-2.9","v":-2.9},{"$f":"('PVR BH'!J34*0.325)-1.75","v":-1.75},null,{"$f":"100-'PVR BH'!I34","v":100},null,{"$f":"'PVR BH'!C34","v":0},{"$f":"ROUND('PVR BH'!L35,0)","v":0},10,{"$f":"IF(O23=35,VLOOKUP(N23,Figdata!$B$15:$C$63,2),IF(O23=34,VLOOKUP(N23,Figdata!$B$15:$D$63,3),IF(O23=33,VLOOKUP(N23,Figdata!$B$15:$E$63,4),IF(O23=32,VLOOKUP(N23,Figdata!$B$15:$F$63,5),IF(O23=31,VLOOKUP(N23,Figdata!$B$15:$G$63,6),IF(O23=30,VLOOKUP(N23,Figdata!$B$15:$H$63,7),\"\"))))))","v":""},{"$f":"IF(O23=29,VLOOKUP(N23,Figdata!$B$16:$I$64,8),IF(O23=28,VLOOKUP(N23,Figdata!$B$16:$J$64,9),IF(O23=27,VLOOKUP(N23,Figdata!$B$16:$K$64,10),IF(O23=26,VLOOKUP(N23,Figdata!$B$16:$L$64,11),IF(O23=25,VLOOKUP(N23,Figdata!$B$16:$M$64,12),IF(O23=24,VLOOKUP(N23,Figdata!$B$16:$N$64,13),\"\"))))))","v":""},{"$f":"IF(O23=23,VLOOKUP(N23,Figdata!$B$16:$O$64,14),IF(O23=22,VLOOKUP(N23,Figdata!$B$16:$P$64,15),IF(O23=21,VLOOKUP(N23,Figdata!$B$16:$Q$64,16),IF(O23=20,VLOOKUP(N23,Figdata!$B$16:$R$64,17),IF(O23=19,VLOOKUP(N23,Figdata!$B$16:$S$64,18),IF(O23=18,VLOOKUP(N23,Figdata!$B$16:$T$64,19),\"\"))))))","v":""},{"$f":"IF(O23=17,VLOOKUP(N23,Figdata!$B$16:$U$64,20),IF(O23=16,VLOOKUP(N23,Figdata!$B$16:$V$64,21),IF(O23=15,VLOOKUP(N23,Figdata!$B$16:$W$64,22),IF(O23=14,VLOOKUP(N23,Figdata!$B$16:$X$64,23),IF(O23=13,VLOOKUP(N23,Figdata!$B$16:$Y$64,24),IF(O23=12,VLOOKUP(N23,Figdata!$B$16:$Z$64,25),\"\"))))))","v":""},{"$f":"IF(O23=11,VLOOKUP(N23,Figdata!$B$16:$AA$64,26),IF(O23=10,VLOOKUP(N23,Figdata!$B$16:$AB$64,27),IF(O23=9,VLOOKUP(N23,Figdata!$B$16:$AC$64,28),IF(O23=8,VLOOKUP(N23,Figdata!$B$16:$AD$64,29),IF(O23=7,VLOOKUP(N23,Figdata!$B$16:$AE$64,30),IF(O23=6,VLOOKUP(N23,Figdata!$B$16:$AF$64,31),IF(O23=5,VLOOKUP(N23,Figdata!$B$16:$AG$64,32),\"\")))))))","v":""},{"$f":"IF(O23=4,VLOOKUP(N23,Figdata!$B$16:$AH$64,33),IF(O23=3,VLOOKUP(N23,Figdata!$B$16:$AI$64,34),IF(O23=2,VLOOKUP(N23,Figdata!$B$16:$AJ$64,35),IF(O23=1,VLOOKUP(N23,Figdata!$B$16:$AK$64,36),\"\"))))","v":""},0,null,null,{"$f":"'PVR BH'!C35","v":0},{"$f":"ROUND('PVR BH'!L35,0)","v":0},10,{"$f":"IF(AA23=35,VLOOKUP(Z23,Figdata!$B$15:$C$63,2),IF(AA23=34,VLOOKUP(Z23,Figdata!$B$15:$D$63,3),IF(AA23=33,VLOOKUP(Z23,Figdata!$B$15:$E$63,4),IF(AA23=32,VLOOKUP(Z23,Figdata!$B$15:$F$63,5),IF(AA23=31,VLOOKUP(Z23,Figdata!$B$15:$G$63,6),IF(AA23=30,VLOOKUP(Z23,Figdata!$B$15:$H$63,7),\"\"))))))","v":""},{"$f":"IF(AA23=29,VLOOKUP(Z23,Figdata!$B$16:$I$64,8),IF(AA23=28,VLOOKUP(Z23,Figdata!$B$16:$J$64,9),IF(AA23=27,VLOOKUP(Z23,Figdata!$B$16:$K$64,10),IF(AA23=26,VLOOKUP(Z23,Figdata!$B$16:$L$64,11),IF(AA23=25,VLOOKUP(Z23,Figdata!$B$16:$M$64,12),IF(AA23=24,VLOOKUP(Z23,Figdata!$B$16:$N$64,13),\"\"))))))","v":""},{"$f":"IF(AA23=23,VLOOKUP(Z23,Figdata!$B$16:$O$64,14),IF(AA23=22,VLOOKUP(Z23,Figdata!$B$16:$P$64,15),IF(AA23=21,VLOOKUP(Z23,Figdata!$B$16:$Q$64,16),IF(AA23=20,VLOOKUP(Z23,Figdata!$B$16:$R$64,17),IF(AA23=19,VLOOKUP(Z23,Figdata!$B$16:$S$64,18),IF(AA23=18,VLOOKUP(Z23,Figdata!$B$16:$T$64,19),\"\"))))))","v":""},{"$f":"IF(AA23=17,VLOOKUP(Z23,Figdata!$B$16:$U$64,20),IF(AA23=16,VLOOKUP(Z23,Figdata!$B$16:$V$64,21),IF(AA23=15,VLOOKUP(Z23,Figdata!$B$16:$W$64,22),IF(AA23=14,VLOOKUP(Z23,Figdata!$B$16:$X$64,23),IF(AA23=13,VLOOKUP(Z23,Figdata!$B$16:$Y$64,24),IF(AA23=12,VLOOKUP(Z23,Figdata!$B$16:$Z$64,25),\"\"))))))","v":""},{"$f":"IF(AA23=11,VLOOKUP(Z23,Figdata!$B$16:$AA$64,26),IF(AA23=10,VLOOKUP(Z23,Figdata!$B$16:$AB$64,27),IF(AA23=9,VLOOKUP(Z23,Figdata!$B$16:$AC$64,28),IF(AA23=8,VLOOKUP(Z23,Figdata!$B$16:$AD$64,29),IF(AA23=7,VLOOKUP(Z23,Figdata!$B$16:$AE$64,30),IF(AA23=6,VLOOKUP(Z23,Figdata!$B$16:$AF$64,31),IF(AA23=5,VLOOKUP(Z23,Figdata!$B$16:$AG$64,32),\"\")))))))","v":""},{"$f":"IF(AA23=4,VLOOKUP(Z23,Figdata!$B$16:$AH$64,33),IF(AA23=3,VLOOKUP(Z23,Figdata!$B$16:$AI$64,34),IF(AA23=2,VLOOKUP(Z23,Figdata!$B$16:$AJ$64,35),IF(AA23=1,VLOOKUP(Z23,Figdata!$B$16:$AK$64,36),\"\"))))","v":""},0]
[null,2,2.0499999999999998,{"$f":"AVERAGE('PVR BH'!E35:F35)","v":5.5},{"$f":"AVERAGE('PVR BH'!E35,D24)","v":7.25},{"$f":"AVERAGE('PVR BH'!F35,D24)","v":3.75},null,{"$f":"(0.217*'PVR BH'!J35)-2.9","v":-2.9},{"$f":"(0.294*'PVR BH'!J35)-2.9","v":-2.9},{"$f":"('PVR BH'!J35*0.325)-1.75","v":-1.75},null,{"$f":"100-'PVR BH'!I35","v":100}]