{"text_format":"1","workbook":"xlsx","n_sheets":3,"sheets":["Tex-126-E","RX","Compressive Strength Graph "],"not_rendered":{"charts":2,"images":1,"macros":1,"external_links":0,"defined_names":106,"comments":1,"pivot_tables":0},"unopened":[{"sheet":"Compressive Strength Graph ","index":2,"reason":"not_a_worksheet"}],"bounds":{"document_bytes":16777216,"sheet_cells":100000,"rows_first":2000,"rows_last":500,"rows_between":2000,"halvings":0,"cell_chars":16384,"cell_head_chars":4096},"cells_cut":0,"cells_raw":0,"read":"whole","date_system":"1900"}

{"sheet":"Tex-126-E","index":0,"n_rows":59,"n_cols":11,"rows_kept":59,"cut":false,"hidden":false,"merged":[[49,2,49,4],[50,2,50,4],[16,3,16,4],[16,7,16,8],[24,2,24,5],[25,2,25,5],[34,2,34,5],[20,2,21,5],[35,3,35,5],[27,2,27,5],[28,2,28,5],[29,2,29,5],[30,2,30,5],[22,2,22,5],[23,2,23,5],[26,2,26,5],[11,7,11,8],[12,7,12,8],[15,3,15,8],[11,3,11,4],[12,3,12,4],[13,3,13,4],[13,7,13,8],[14,3,14,8],[7,3,7,4],[7,7,7,8],[10,7,10,8],[8,3,8,4],[8,7,8,8],[10,3,10,4],[9,7,9,8],[9,3,9,4],[0,0,0,1],[59,1,59,3],[20,6,21,6],[20,7,21,7],[37,6,38,6],[37,7,38,7],[31,2,31,5],[32,2,32,5],[53,2,53,4],[33,2,33,5],[55,6,55,8],[45,1,46,8],[52,2,52,4],[48,1,48,8],[55,1,55,3],[47,1,47,8],[41,2,41,6],[42,2,42,6],[43,2,43,6],[37,2,38,5],[40,2,40,7]]}
["TxDOT Manuals >",null,null,"Tex-126-E"]
[null,"TEXAS DEPARTMENT OF TRANSPORTATION",null,null,null,null,null,null,null,null,34]
[null,null,null,null,null,null,null,null,null,null,1]
[null,null,null,null,null,null,null,null,null,null,"tx12asb.xlsm::45169.32081"]
[null,"DENSITY OF ASPHALT STABILIZED BASE "]
[null,"Tex-126-E"]
[null,null,null,null,null,null,null,null,{"$f":"\"File Version: \" & TEXT(MID(sn,SEARCH(\"::\",sn,1)+2,20),\"mm/dd/yy hh:mm:ss\")","v":"File Version: 08/31/23 07:41:58"}]
[null,null,"SAMPLE ID:",null,null,null,"SAMPLED DATE:"]
[null,null,"TEST NUMBER:",null,null,null,"LETTING DATE:"]
[null,null,"SAMPLE STATUS:",null,null,null,"CONTROLLING CSJ:"]
[null,null,"COUNTY:",null,null,null,"SPEC YEAR:"]
[null,null,"SAMPLED BY:",null,null,null,"SPEC ITEM:"]
[null,null,"SAMPLE LOCATION:",null,null,null,"SPECIAL PROVISION:"]
[null,null,"MATERIAL CODE:",null,null,null,"GRADE:"]
[null,null,"MATERIAL NAME:"]
[null,null,"PRODUCER:"]
[null,null,"AREA ENGINEER:",null,null,null,"PROJECT MANAGER:"]
[]
[null,null,"COURSE\\LIFT:",null,"STATION:",null,null,"DIST. FROM CL:"]
[]
[null,null,"Value Description",null,null,null,"Max. Density Specimen","Lower Density Specimen"]
[]
[null,null,"Date Molded:"]
[null,null,"Mold Number:"]
[null,null,"Percent Asphalt in Mix;"]
[null,null,{"$f":"IF(SpecYear=\"\",\"\",\"Weight of Material, \" & IF(SpecYear=\"1995\",\"(Kg):\",\"(lbs.):\"))","v":""}]
[null,null,{"$f":"IF(SpecYear=\"\",\"\",\"Height of Specimen \" & IF(SpecYear=\"1995\",\"(mm)\",\"(in.)\")) & \" (A):\"","v":" (A):"}]
[null,null,{"$f":"IF(SpecYear=\"\",\"\",\"Measured Weight \" & IF(SpecYear=\"1995\",\"(Kg)\",\"(lbs.)\")) & \" (B):\"","v":" (B):"}]
[null,null,{"$f":"IF(SpecYear=\"\",\"\",\"Weight of Plates \" & IF(SpecYear=\"1995\",\"(Kg)\",\"(lbs.)\")) & \" (C):\"","v":" (C):"}]
[null,null,{"$f":"IF(SpecYear=\"\",\"\",\"Weight of Filters \" & IF(SpecYear=\"1995\",\"(Kg)\",\"(lbs.)\")) & \" (D):\"","v":" (D):"}]
[null,null,{"$f":"IF(SpecYear=\"\",\"\",\"Weight of Specimen \" & IF(SpecYear=\"1995\",\"(Kg)\",\"(lbs.)\")) & \" (E= B-C-D):\"","v":" (E= B-C-D):"},null,null,null,{"$f":"IF(SUM(G28:G30)=0,\"\",G28-G29-G30)","v":""},{"$f":"IF(SUM(H28:H30)=0,\"\",H28-H29-H30)","v":""}]
[null,null,{"$f":"IF(SpecYear=\"\",\"\",\"Volume of Mold \" & IF(SpecYear=\"1995\",\"(m³/mm)\",\"(ft³/in.)\")) & \" (F):\"","v":" (F):"}]
[null,null,{"$f":"IF(SpecYear=\"\",\"\",\"Volume of Specimen \" & IF(SpecYear=\"1995\",\"(m³)\",\"(ft³)\")) & \" (G= A*F):\"","v":" (G= A*F):"},null,null,null,{"$f":"IF(SUM(G27,G32)=0,\"\",G27*G32)","v":""},{"$f":"IF(SUM(H27,H32)=0,\"\",H27*H32)","v":""}]
[null,null,{"$f":"IF(SpecYear=\"\",\"\",\"Density of Specimen \" & IF(SpecYear=\"1995\",\"(Kg/m³)\",\"(lbs./ft³)\")) & \" (E/G):\"","v":" (E/G):"},null,null,null,{"$f":"IF(ISERROR(G31/G33),\"\",G31/G33)","v":""},{"$f":"IF(ISERROR(H31/H33),\"\",H31/H33)","v":""}]
[null,null,"Date Broken"]
[null,null,null,{"$f":" Break & \" Gauge Reading, (psi):\"","v":" Gauge Reading, (psi):"}]
[]
[null,null,{"$f":"\"Unconfined Compressive Strength \"&IF(SpecYear=\"\",\"\",IF(SpecYear=\"1995\",\"(kPa) = (Gauge (psi) / 1.73) * 6.895\",\" (psi) = Gauge (psi) / 1.73\")) & \", \" & +C36 & IF(SpecYear=\"\",\"\",IF(SpecYear=\"1995\",\" (kPa)\",\" (psi)\")) & \":\"","v":"Unconfined Compressive Strength , :"},null,null,null,{"$f":"IF(G36=\"\",\"\",IF(SpecYear=\"1995\",G36/1.73*6.895,G36/1.73))","v":""},{"$f":"IF(H36=\"\",\"\",IF(SpecYear=\"1995\",H36/1.73*6.895,H36/1.73))","v":""}]
[]
[]
[null,null,"Minimum Percent Density = (Minimum Allowable Density / Maximum Gyrated Density ) * 100"]
[null,null,"Minimum Allowable Density:",null,null,null,null,{"$f":"IF(ISERROR($G$34-(($G$34-$H$34)/($G$38-$H$38)*($G$38-$H$44))),\"\",$G$34-(($G$34-$H$34)/($G$38-$H$38)*($G$38-$H$44)))","v":""}]
[null,null,"Minimum Percent Density:",null,null,null,null,{"$f":"IF(ISERROR(H42/G34*100),\"\",H42/G34*100)","v":""}]
[null,null,"Minimum Specimen Unconfined Compressive Strength:",null,null,null,null,{"$f":"IF(AND(Break=\"\",SpecYear=\"\"),\"\",IF(Break=\"Fast Break\",IF(SpecYear=\"1995\",6.895,1)*150,IF(SpecYear=\"1995\",6.895,1)*50))","v":""}]
[null,"Remarks:",{"$f":"NOW()","v":"2023-08-31T07:41:58.910"}]
[]
[]
[]
[]
[null,"Sample Method:","Sampled By:",null,null,"Sampled Date:"]
[null,"TX400"," ",null,null," "]
[]
[null,"Test Method:","Tested By:",null,null,"Tested Date:"]
[null,"TX126"]
[null,"Test Stamp Code:",null,null,"Omit Test:","Completed Date:","Reviewed By:"]
[]
[null,"Locked By:","TxDOT:","District:","Area:"]
[]
[null,"Authorized By:",null,null,"Authorized Date:"]

{"sheet":"RX","index":1,"n_rows":41,"n_cols":9,"rows_kept":41,"cut":false,"hidden":true,"merged":[]}
[39]
["Fld_nbr","Value","Desc_1","Desc_2","Desc_3","Desc_4","Desc_5","Desc_6","Desc_7"]
[1,{"$f":"IF('Tex-126-E'!$B$46=\"\",\"\",'Tex-126-E'!$B$46)","v":""},{"$f":"'Tex-126-E'!$B$45","v":"Remarks:"}]
[2,{"$f":"IF('Tex-126-E'!$D$19=\"\",\"\",'Tex-126-E'!$D$19)","v":""},{"$f":"IF('Tex-126-E'!$C$19=\"\",\"\",'Tex-126-E'!$C$19)","v":"COURSE\\LIFT:"}]
[3,{"$f":"IF('Tex-126-E'!$C$54=\"\",\"\",'Tex-126-E'!$C$54)","v":""},"Tested By ",{"$f":"IF('Tex-126-E'!$B$54=\"\",\"\",'Tex-126-E'!$B$54)","v":"TX126"}]
[4,{"$f":"IF('Tex-126-E'!$F$54=\"\",\"\",'Tex-126-E'!$F$54)","v":""},"Tested Date ",{"$f":"IF('Tex-126-E'!$B$54=\"\",\"\",'Tex-126-E'!$B$54)","v":"TX126"}]
[5,{"$f":"IF('Tex-126-E'!$G$23=\"\",\"\",'Tex-126-E'!$G$23)","v":""},{"$f":"IF('Tex-126-E'!$B$6=\"\",\"\",'Tex-126-E'!$B$6)","v":"Tex-126-E"},{"$f":"IF('Tex-126-E'!$G$21=\"\",\"\",'Tex-126-E'!$G$21)","v":"Max. Density Specimen"},{"$f":"IF('Tex-126-E'!$C$23=\"\",\"\",'Tex-126-E'!$C$23)","v":"Date Molded:"}]
[6,{"$f":"IF('Tex-126-E'!$G$24=\"\",\"\",'Tex-126-E'!$G$24)","v":""},{"$f":"IF('Tex-126-E'!$B$6=\"\",\"\",'Tex-126-E'!$B$6)","v":"Tex-126-E"},{"$f":"IF('Tex-126-E'!$G$21=\"\",\"\",'Tex-126-E'!$G$21)","v":"Max. Density Specimen"},{"$f":"IF('Tex-126-E'!$C$24=\"\",\"\",'Tex-126-E'!$C$24)","v":"Mold Number:"}]
[7,{"$f":"IF('Tex-126-E'!$G$25=\"\",\"\",'Tex-126-E'!$G$25)","v":""},{"$f":"IF('Tex-126-E'!$B$6=\"\",\"\",'Tex-126-E'!$B$6)","v":"Tex-126-E"},{"$f":"IF('Tex-126-E'!$G$21=\"\",\"\",'Tex-126-E'!$G$21)","v":"Max. Density Specimen"},{"$f":"IF('Tex-126-E'!$C$25=\"\",\"\",'Tex-126-E'!$C$25)","v":"Percent Asphalt in Mix;"}]
[8,{"$f":"IF('Tex-126-E'!$G$26=\"\",\"\",'Tex-126-E'!$G$26)","v":""},{"$f":"IF('Tex-126-E'!$B$6=\"\",\"\",'Tex-126-E'!$B$6)","v":"Tex-126-E"},{"$f":"IF('Tex-126-E'!$G$21=\"\",\"\",'Tex-126-E'!$G$21)","v":"Max. Density Specimen"},{"$f":"IF('Tex-126-E'!$C$26=\"\",\"\",'Tex-126-E'!$C$26)","v":""}]
[9,{"$f":"IF('Tex-126-E'!$G$27=\"\",\"\",'Tex-126-E'!$G$27)","v":""},{"$f":"IF('Tex-126-E'!$B$6=\"\",\"\",'Tex-126-E'!$B$6)","v":"Tex-126-E"},{"$f":"IF('Tex-126-E'!$G$21=\"\",\"\",'Tex-126-E'!$G$21)","v":"Max. Density Specimen"},{"$f":"IF('Tex-126-E'!$C$27=\"\",\"\",'Tex-126-E'!$C$27)","v":" (A):"}]
[10,{"$f":"IF('Tex-126-E'!$G$28=\"\",\"\",'Tex-126-E'!$G$28)","v":""},{"$f":"IF('Tex-126-E'!$B$6=\"\",\"\",'Tex-126-E'!$B$6)","v":"Tex-126-E"},{"$f":"IF('Tex-126-E'!$G$21=\"\",\"\",'Tex-126-E'!$G$21)","v":"Max. Density Specimen"},{"$f":"IF('Tex-126-E'!$C$28=\"\",\"\",'Tex-126-E'!$C$28)","v":" (B):"}]
[11,{"$f":"IF('Tex-126-E'!$G$29=\"\",\"\",'Tex-126-E'!$G$29)","v":""},{"$f":"IF('Tex-126-E'!$B$6=\"\",\"\",'Tex-126-E'!$B$6)","v":"Tex-126-E"},{"$f":"IF('Tex-126-E'!$G$21=\"\",\"\",'Tex-126-E'!$G$21)","v":"Max. Density Specimen"},{"$f":"IF('Tex-126-E'!$C$29=\"\",\"\",'Tex-126-E'!$C$29)","v":" (C):"}]
[12,{"$f":"IF('Tex-126-E'!$G$30=\"\",\"\",'Tex-126-E'!$G$30)","v":""},{"$f":"IF('Tex-126-E'!$B$6=\"\",\"\",'Tex-126-E'!$B$6)","v":"Tex-126-E"},{"$f":"IF('Tex-126-E'!$G$21=\"\",\"\",'Tex-126-E'!$G$21)","v":"Max. Density Specimen"},{"$f":"IF('Tex-126-E'!$C$30=\"\",\"\",'Tex-126-E'!$C$30)","v":" (D):"}]
[13,{"$f":"IF('Tex-126-E'!$G$31=\"\",\"\",'Tex-126-E'!$G$31)","v":""},{"$f":"IF('Tex-126-E'!$B$6=\"\",\"\",'Tex-126-E'!$B$6)","v":"Tex-126-E"},{"$f":"IF('Tex-126-E'!$G$21=\"\",\"\",'Tex-126-E'!$G$21)","v":"Max. Density Specimen"},{"$f":"IF('Tex-126-E'!$C$31=\"\",\"\",'Tex-126-E'!$C$31)","v":" (E= B-C-D):"}]
[14,{"$f":"IF('Tex-126-E'!$G$32=\"\",\"\",'Tex-126-E'!$G$32)","v":""},{"$f":"IF('Tex-126-E'!$B$6=\"\",\"\",'Tex-126-E'!$B$6)","v":"Tex-126-E"},{"$f":"IF('Tex-126-E'!$G$21=\"\",\"\",'Tex-126-E'!$G$21)","v":"Max. Density Specimen"},{"$f":"IF('Tex-126-E'!$C$32=\"\",\"\",'Tex-126-E'!$C$32)","v":" (F):"}]
[15,{"$f":"IF('Tex-126-E'!$G$33=\"\",\"\",'Tex-126-E'!$G$33)","v":""},{"$f":"IF('Tex-126-E'!$B$6=\"\",\"\",'Tex-126-E'!$B$6)","v":"Tex-126-E"},{"$f":"IF('Tex-126-E'!$G$21=\"\",\"\",'Tex-126-E'!$G$21)","v":"Max. Density Specimen"},{"$f":"IF('Tex-126-E'!$C$33=\"\",\"\",'Tex-126-E'!$C$33)","v":" (G= A*F):"}]
[16,{"$f":"IF('Tex-126-E'!$G$34=\"\",\"\",'Tex-126-E'!$G$34)","v":""},{"$f":"IF('Tex-126-E'!$B$6=\"\",\"\",'Tex-126-E'!$B$6)","v":"Tex-126-E"},{"$f":"IF('Tex-126-E'!$G$21=\"\",\"\",'Tex-126-E'!$G$21)","v":"Max. Density Specimen"},{"$f":"IF('Tex-126-E'!$C$34=\"\",\"\",'Tex-126-E'!$C$34)","v":" (E/G):"}]
[17,{"$f":"IF('Tex-126-E'!$G$35=\"\",\"\",'Tex-126-E'!$G$35)","v":""},{"$f":"IF('Tex-126-E'!$B$6=\"\",\"\",'Tex-126-E'!$B$6)","v":"Tex-126-E"},{"$f":"IF('Tex-126-E'!$G$21=\"\",\"\",'Tex-126-E'!$G$21)","v":"Max. Density Specimen"},{"$f":"IF('Tex-126-E'!$C$35=\"\",\"\",'Tex-126-E'!$C$35)","v":"Date Broken"}]
[18,{"$f":"IF('Tex-126-E'!$G$36=\"\",\"\",'Tex-126-E'!$G$36)","v":""},{"$f":"IF('Tex-126-E'!$B$6=\"\",\"\",'Tex-126-E'!$B$6)","v":"Tex-126-E"},{"$f":"IF('Tex-126-E'!$G$21=\"\",\"\",'Tex-126-E'!$G$21)","v":"Max. Density Specimen"},{"$f":"IF('Tex-126-E'!$D$36=\"\",\"\",'Tex-126-E'!$D$36)","v":" Gauge Reading, (psi):"}]
[19,{"$f":"IF('Tex-126-E'!$G$38=\"\",\"\",'Tex-126-E'!$G$38)","v":""},{"$f":"IF('Tex-126-E'!$B$6=\"\",\"\",'Tex-126-E'!$B$6)","v":"Tex-126-E"},{"$f":"IF('Tex-126-E'!$G$21=\"\",\"\",'Tex-126-E'!$G$21)","v":"Max. Density Specimen"},{"$f":"IF('Tex-126-E'!$C$38=\"\",\"\",'Tex-126-E'!$C$38)","v":"Unconfined Compressive Strength , :"}]
[20,{"$f":"IF('Tex-126-E'!$H$23=\"\",\"\",'Tex-126-E'!$H$23)","v":""},{"$f":"IF('Tex-126-E'!$B$6=\"\",\"\",'Tex-126-E'!$B$6)","v":"Tex-126-E"},{"$f":"IF('Tex-126-E'!$H$21=\"\",\"\",'Tex-126-E'!$H$21)","v":"Lower Density Specimen"},{"$f":"IF('Tex-126-E'!$C$23=\"\",\"\",'Tex-126-E'!$C$23)","v":"Date Molded:"}]
[21,{"$f":"IF('Tex-126-E'!$H$24=\"\",\"\",'Tex-126-E'!$H$24)","v":""},{"$f":"IF('Tex-126-E'!$B$6=\"\",\"\",'Tex-126-E'!$B$6)","v":"Tex-126-E"},{"$f":"IF('Tex-126-E'!$H$21=\"\",\"\",'Tex-126-E'!$H$21)","v":"Lower Density Specimen"},{"$f":"IF('Tex-126-E'!$C$24=\"\",\"\",'Tex-126-E'!$C$24)","v":"Mold Number:"}]
[22,{"$f":"IF('Tex-126-E'!$H$25=\"\",\"\",'Tex-126-E'!$H$25)","v":""},{"$f":"IF('Tex-126-E'!$B$6=\"\",\"\",'Tex-126-E'!$B$6)","v":"Tex-126-E"},{"$f":"IF('Tex-126-E'!$H$21=\"\",\"\",'Tex-126-E'!$H$21)","v":"Lower Density Specimen"},{"$f":"IF('Tex-126-E'!$C$25=\"\",\"\",'Tex-126-E'!$C$25)","v":"Percent Asphalt in Mix;"}]
[23,{"$f":"IF('Tex-126-E'!$H$26=\"\",\"\",'Tex-126-E'!$H$26)","v":""},{"$f":"IF('Tex-126-E'!$B$6=\"\",\"\",'Tex-126-E'!$B$6)","v":"Tex-126-E"},{"$f":"IF('Tex-126-E'!$H$21=\"\",\"\",'Tex-126-E'!$H$21)","v":"Lower Density Specimen"},{"$f":"IF('Tex-126-E'!$C$26=\"\",\"\",'Tex-126-E'!$C$26)","v":""}]
[24,{"$f":"IF('Tex-126-E'!$H$27=\"\",\"\",'Tex-126-E'!$H$27)","v":""},{"$f":"IF('Tex-126-E'!$B$6=\"\",\"\",'Tex-126-E'!$B$6)","v":"Tex-126-E"},{"$f":"IF('Tex-126-E'!$H$21=\"\",\"\",'Tex-126-E'!$H$21)","v":"Lower Density Specimen"},{"$f":"IF('Tex-126-E'!$C$27=\"\",\"\",'Tex-126-E'!$C$27)","v":" (A):"}]
[25,{"$f":"IF('Tex-126-E'!$H$28=\"\",\"\",'Tex-126-E'!$H$28)","v":""},{"$f":"IF('Tex-126-E'!$B$6=\"\",\"\",'Tex-126-E'!$B$6)","v":"Tex-126-E"},{"$f":"IF('Tex-126-E'!$H$21=\"\",\"\",'Tex-126-E'!$H$21)","v":"Lower Density Specimen"},{"$f":"IF('Tex-126-E'!$C$28=\"\",\"\",'Tex-126-E'!$C$28)","v":" (B):"}]
[26,{"$f":"IF('Tex-126-E'!$H$29=\"\",\"\",'Tex-126-E'!$H$29)","v":""},{"$f":"IF('Tex-126-E'!$B$6=\"\",\"\",'Tex-126-E'!$B$6)","v":"Tex-126-E"},{"$f":"IF('Tex-126-E'!$H$21=\"\",\"\",'Tex-126-E'!$H$21)","v":"Lower Density Specimen"},{"$f":"IF('Tex-126-E'!$C$29=\"\",\"\",'Tex-126-E'!$C$29)","v":" (C):"}]
[27,{"$f":"IF('Tex-126-E'!$H$30=\"\",\"\",'Tex-126-E'!$H$30)","v":""},{"$f":"IF('Tex-126-E'!$B$6=\"\",\"\",'Tex-126-E'!$B$6)","v":"Tex-126-E"},{"$f":"IF('Tex-126-E'!$H$21=\"\",\"\",'Tex-126-E'!$H$21)","v":"Lower Density Specimen"},{"$f":"IF('Tex-126-E'!$C$30=\"\",\"\",'Tex-126-E'!$C$30)","v":" (D):"}]
[28,{"$f":"IF('Tex-126-E'!$H$31=\"\",\"\",'Tex-126-E'!$H$31)","v":""},{"$f":"IF('Tex-126-E'!$B$6=\"\",\"\",'Tex-126-E'!$B$6)","v":"Tex-126-E"},{"$f":"IF('Tex-126-E'!$H$21=\"\",\"\",'Tex-126-E'!$H$21)","v":"Lower Density Specimen"},{"$f":"IF('Tex-126-E'!$C$31=\"\",\"\",'Tex-126-E'!$C$31)","v":" (E= B-C-D):"}]
[29,{"$f":"IF('Tex-126-E'!$H$32=\"\",\"\",'Tex-126-E'!$H$32)","v":""},{"$f":"IF('Tex-126-E'!$B$6=\"\",\"\",'Tex-126-E'!$B$6)","v":"Tex-126-E"},{"$f":"IF('Tex-126-E'!$H$21=\"\",\"\",'Tex-126-E'!$H$21)","v":"Lower Density Specimen"},{"$f":"IF('Tex-126-E'!$C$32=\"\",\"\",'Tex-126-E'!$C$32)","v":" (F):"}]
[30,{"$f":"IF('Tex-126-E'!$H$33=\"\",\"\",'Tex-126-E'!$H$33)","v":""},{"$f":"IF('Tex-126-E'!$B$6=\"\",\"\",'Tex-126-E'!$B$6)","v":"Tex-126-E"},{"$f":"IF('Tex-126-E'!$H$21=\"\",\"\",'Tex-126-E'!$H$21)","v":"Lower Density Specimen"},{"$f":"IF('Tex-126-E'!$C$33=\"\",\"\",'Tex-126-E'!$C$33)","v":" (G= A*F):"}]
[31,{"$f":"IF('Tex-126-E'!$H$34=\"\",\"\",'Tex-126-E'!$H$34)","v":""},{"$f":"IF('Tex-126-E'!$B$6=\"\",\"\",'Tex-126-E'!$B$6)","v":"Tex-126-E"},{"$f":"IF('Tex-126-E'!$H$21=\"\",\"\",'Tex-126-E'!$H$21)","v":"Lower Density Specimen"},{"$f":"IF('Tex-126-E'!$C$34=\"\",\"\",'Tex-126-E'!$C$34)","v":" (E/G):"}]
[32,{"$f":"IF('Tex-126-E'!$H$35=\"\",\"\",'Tex-126-E'!$H$35)","v":""},{"$f":"IF('Tex-126-E'!$B$6=\"\",\"\",'Tex-126-E'!$B$6)","v":"Tex-126-E"},{"$f":"IF('Tex-126-E'!$H$21=\"\",\"\",'Tex-126-E'!$H$21)","v":"Lower Density Specimen"},{"$f":"IF('Tex-126-E'!$C$35=\"\",\"\",'Tex-126-E'!$C$35)","v":"Date Broken"}]
[33,{"$f":"IF('Tex-126-E'!$H$36=\"\",\"\",'Tex-126-E'!$H$36)","v":""},{"$f":"IF('Tex-126-E'!$B$6=\"\",\"\",'Tex-126-E'!$B$6)","v":"Tex-126-E"},{"$f":"IF('Tex-126-E'!$H$21=\"\",\"\",'Tex-126-E'!$H$21)","v":"Lower Density Specimen"},{"$f":"IF('Tex-126-E'!$D$36=\"\",\"\",'Tex-126-E'!$D$36)","v":" Gauge Reading, (psi):"}]
[34,{"$f":"IF('Tex-126-E'!$H$38=\"\",\"\",'Tex-126-E'!$H$38)","v":""},{"$f":"IF('Tex-126-E'!$B$6=\"\",\"\",'Tex-126-E'!$B$6)","v":"Tex-126-E"},{"$f":"IF('Tex-126-E'!$H$21=\"\",\"\",'Tex-126-E'!$H$21)","v":"Lower Density Specimen"},{"$f":"IF('Tex-126-E'!$C$38=\"\",\"\",'Tex-126-E'!$C$38)","v":"Unconfined Compressive Strength , :"}]
[35,{"$f":"IF('Tex-126-E'!$H$42=\"\",\"\",'Tex-126-E'!$H$42)","v":""},{"$f":"IF('Tex-126-E'!$B$6=\"\",\"\",'Tex-126-E'!$B$6)","v":"Tex-126-E"},{"$f":"IF('Tex-126-E'!$C$41=\"\",\"\",'Tex-126-E'!$C$41)","v":"Minimum Percent Density = (Minimum Allowable Density / Maximum Gyrated Density ) * 100"},{"$f":"IF('Tex-126-E'!$C$42=\"\",\"\",'Tex-126-E'!$C$42)","v":"Minimum Allowable Density:"}]
[36,{"$f":"IF('Tex-126-E'!$H$43=\"\",\"\",'Tex-126-E'!$H$43)","v":""},{"$f":"IF('Tex-126-E'!$B$6=\"\",\"\",'Tex-126-E'!$B$6)","v":"Tex-126-E"},{"$f":"IF('Tex-126-E'!$C$41=\"\",\"\",'Tex-126-E'!$C$41)","v":"Minimum Percent Density = (Minimum Allowable Density / Maximum Gyrated Density ) * 100"},{"$f":"IF('Tex-126-E'!$C$43=\"\",\"\",'Tex-126-E'!$C$43)","v":"Minimum Percent Density:"}]
[37,{"$f":"IF('Tex-126-E'!$H$44=\"\",\"\",'Tex-126-E'!$H$44)","v":""},{"$f":"IF('Tex-126-E'!$B$6=\"\",\"\",'Tex-126-E'!$B$6)","v":"Tex-126-E"},{"$f":"IF('Tex-126-E'!$C$41=\"\",\"\",'Tex-126-E'!$C$41)","v":"Minimum Percent Density = (Minimum Allowable Density / Maximum Gyrated Density ) * 100"},{"$f":"IF('Tex-126-E'!$C$44=\"\",\"\",'Tex-126-E'!$C$44)","v":"Minimum Specimen Unconfined Compressive Strength:"}]
[38,{"$f":"IF('Tex-126-E'!$C$51=\"\",\"\",'Tex-126-E'!$C$51)","v":" "},"Sampled By ",{"$f":"IF('Tex-126-E'!$B$51=\"\",\"\",'Tex-126-E'!$B$51)","v":"TX400"}]
[39,{"$f":"IF('Tex-126-E'!$F$51=\"\",\"\",'Tex-126-E'!$F$51)","v":" "},"Sampled Date ",{"$f":"IF('Tex-126-E'!$B$51=\"\",\"\",'Tex-126-E'!$B$51)","v":"TX400"}]