{"text_format":"1","workbook":"xlsx","n_sheets":8,"sheets":["Report - Specimen #1","Sheet1","Report - Specimen #2","Compaction Info","DV vs. Time Chart - Specimen #1","DV vs. Time Chart - Specime #2","Average DV & UCS and R","RX"],"not_rendered":{"charts":9,"images":4,"macros":1,"external_links":0,"defined_names":209,"comments":2,"pivot_tables":0},"unopened":[{"sheet":"DV vs. Time Chart - Specimen #1","index":4,"reason":"not_a_worksheet"},{"sheet":"DV vs. Time Chart - Specime #2","index":5,"reason":"not_a_worksheet"},{"sheet":"Average DV & UCS and R","index":6,"reason":"not_a_worksheet"}],"bounds":{"document_bytes":16777216,"sheet_cells":100000,"rows_first":2000,"rows_last":500,"rows_between":2000,"halvings":0,"cell_chars":16384,"cell_head_chars":4096},"cells_cut":0,"cells_raw":0,"read":"whole","date_system":"1900"}

{"sheet":"Report - Specimen #1","index":0,"n_rows":83,"n_cols":11,"rows_kept":83,"cut":false,"hidden":false,"merged":[[15,3,15,8],[13,3,13,4],[7,7,7,8],[10,7,10,8],[7,3,7,4],[8,3,8,4],[8,7,8,8],[10,3,10,4],[9,7,9,8],[9,3,9,4],[0,0,0,1],[71,1,72,8],[12,7,12,8],[11,3,11,4],[12,3,12,4],[11,7,11,8],[14,3,14,8],[16,3,16,4],[13,7,13,8],[16,7,16,8],[37,7,37,8],[22,1,22,2],[37,1,37,2],[37,4,37,5],[22,7,22,8],[20,1,20,8],[83,1,83,3],[23,7,23,8],[22,3,22,4],[77,2,77,4],[79,1,79,3],[79,6,79,8],[76,2,76,4],[22,5,22,6],[74,2,74,4],[75,2,75,4]]}
["TxDOT Manuals >",null,null,"Tex-144-E"]
[null,"TEXAS DEPARTMENT OF TRANSPORTATION",null,null,null,null,null,null,null,null,159]
[null,null,null,null,null,null,null,null,null,null,1]
[null,null,null,null,null,null,null,null,null,null,"tx144.xlsm::45502.56022"]
[null,"Dielectric Value Test"]
[null,"Tex-144-E"]
[null,null,null,null,null,null,null,null,{"$f":"\"File Version: \" & TEXT(MID(sn,SEARCH(\"::\",sn,1)+2,20),\"mm/dd/yy hh:mm:ss\")","v":"File Version: 07/29/24 13:26:43"}]
[null,null,"SAMPLE ID:",null,null,null,"SAMPLED DATE:"," "]
[null,null,"TEST NUMBER:",null,null,null,"LETTING DATE:"," "]
[null,null,"SAMPLE STATUS:",null,null,null,"CONTROLLING CSJ:"," "]
[null,null,"COUNTY:",null,null,null,"SPEC YEAR:"]
[null,null,"SAMPLED BY:",null,null,null,"SPEC ITEM:"," "]
[null,null,"SAMPLE LOCATION:",null,null,null,"SPECIAL PROVISION:"]
[null,null,"MATERIAL CODE:",null,null,null,"GRADE:"]
[null,null,"MATERIAL NAME:"]
[null,null,"PRODUCER:"]
[null,null,"AREA ENGINEER:",null,null,null,"PROJECT MANAGER:"," "]
[]
[null,null,"COURSE\\LIFT:",null,"STATION:"," ",null,"DIST. FROM CL:"," "]
[]
[null,"Report - Specimen #1"]
[]
[null,"Optimum MC (%):",null,null,null,"Max. Dry Density (pcf):"]
[]
[null,"Day No.","Reading 1","Reading 2","Reading 3","Reading 4","Reading 5","Average"]
[null,1,null,null,null,null,null,{"$f":"IF(ISERROR(AVERAGE(LARGE(C26:G26,1),LARGE(C26:G26,2),LARGE(C26:G26,3))),\"\",AVERAGE(LARGE(C26:G26,1),LARGE(C26:G26,2),LARGE(C26:G26,3)))","v":""}]
[null,2,null,null,null,null,null,{"$f":"IF(ISERROR(AVERAGE(LARGE(C27:G27,1),LARGE(C27:G27,2),LARGE(C27:G27,3))),\"\",AVERAGE(LARGE(C27:G27,1),LARGE(C27:G27,2),LARGE(C27:G27,3)))","v":""}]
[null,3,null,null,null,null,null,""]
[null,4,null,null,null,null,null,""]
[null,5,null,null,null,null,null,""]
[null,6,null,null,null,null,null,""]
[null,7,null,null,null,null,null,""]
[null,8,null,null,null,null,null,""]
[null,9,null,null,null,null,null,""]
[null,10,null,null,null,null,null,""]
["Initial DV","Final DV","Initial MC","Final MC","Initial UCS","Final UCS","Retained UCS Ratio",{"$f":"IF(ISERROR(AVERAGE(H33:H35)),\"\",AVERAGE(H33:H35))","v":""}]
[{"$f":"AVERAGE(H26,'Report - Specimen #2'!H26)","v":{"$error":"#DIV/0!"}},{"$f":"AVERAGE(H36,'Report - Specimen #2'!H36)","v":{"$error":"#DIV/0!"}},{"$f":"AVERAGE(F43,'Report - Specimen #2'!F43)","v":{"$error":"#DIV/0!"}},{"$f":"AVERAGE(I43,'Report - Specimen #2'!I43)","v":{"$error":"#DIV/0!"}},{"$f":"Field63","v":0},{"$f":"AVERAGE(Field62,Field126)","v":{"$error":"#DIV/0!"}},{"$f":"AVERAGE(I45,'Report - Specimen #2'!I45)","v":{"$error":"#DIV/0!"}}]
[null,"Compaction Information",null,null,"2-Day Drying Back Info.",null,null,"10-Day Soaking Info."]
[null,"Specimen Wet Wt.",null,null,"Specimen Dry Wt.",null,null,"Soaked Specimen Wt."]
[null,"Specimen Height",null,null,"Dry Soil Wt.",{"$f":"IF(I40-I41=0,\"\",I40-I41)","v":""},null,"Dry Soil Wt."]
[null,"Dry Soil Wt.",null,null,"Two Stones Wt.",{"$f":"IF(C42=\"\",\"\",C42)","v":""},null,"Pan Wt."]
[null,"Two Stones Wt."]
[null,"MCCOMPACT:",{"$f":"IF(ISERROR(((C39-C42)-C41)/C41*100),\"\",((C39-C42)-C41)/C41*100)","v":""},null,"MCINITIAL:",{"$f":"IF(ISERROR(((F39-N(F41)-N(F40))/(N(F40)))*100),\"\",((F39-N(F41)-N(F40))/(N(F40)))*100)","v":""},null,"MCFINAL:",{"$f":"IF(ISERROR(((I39-I40)/(I40-I41))*100),\"\",((I39-I40)/(I40-I41))*100)","v":""}]
[null,"Dry Density:",{"$f":"IF(ISERROR((C39-C42)/(0.25*PI()*6^2*C40*(1+C43/100))*12*12*12),\"\",(C39-C42)/(0.25*PI()*6^2*C40*(1+C43/100))*12*12*12)","v":""},null,null,null,null,"URET:"]
[null,"UCOMPACT:",null,null,null,null,null,"R:",{"$f":"IF(ISERROR(I44/C45),\"\",I44/C45)","v":""}]
[]
[null,null,null,null,null,"For Technical Support, Call Zhiming Si @ 512-506-5901"]
[]
[]
[]
[]
[]
[]
[]
[]
[]
[]
[]
[]
[]
[]
[]
[]
[]
[]
[]
[]
[]
[]
[]
[null,"Remarks:",{"$f":"NOW()","v":"2024-07-29T13:26:43.990"}]
[]
[]
[]
[null,"Sample Method:","Sampled By:",null,null,"Sampled Date:"]
[null,"TX400"," ",null,null," "]
[null,"Test Method:","Tested By:",null,null,"Tested Date:"]
[null,"TX144"," ",null,null," "]
[null,"Test Stamp Code:",null,null,"Omit Test:","Completed Date:","Reviewed By:"]
[]
[null,"Locked By:","TxDOT:","District:","Area:"]
[]
[null,"Authorized By:",null,null,"Authorized Date:"]

{"sheet":"Sheet1","index":1,"n_rows":26,"n_cols":1,"rows_kept":26,"cut":false,"hidden":true,"merged":[]}
["01-Paris"]
["02-Fort Worth"]
["03-Wichita Falls"]
["04-Amarillo"]
["05-Lubbock"]
["06-Odessa"]
["07-San Angelo"]
["08-Abilene"]
["09-Waco"]
["10-Tyler"]
["11-Lufkin"]
["12-Houston"]
["13-Yoakum"]
["14-Austin"]
["15-San Antonio"]
["16-Corpus Christi"]
["17-Bryan"]
["18-Dallas"]
["19-Atlanta"]
["20-Beaumont"]
["21-Pharr"]
["22-Laredo"]
["23-Brownwood"]
["24-El Paso"]
["25-Childress"]
["26-M&P"]

{"sheet":"Report - Specimen #2","index":2,"n_rows":71,"n_cols":11,"rows_kept":71,"cut":false,"hidden":false,"merged":[[0,0,0,1],[7,3,7,4],[7,7,7,8],[8,3,8,4],[8,7,8,8],[11,7,11,8],[14,3,14,8],[9,7,9,8],[10,3,10,4],[10,7,10,8],[13,3,13,4],[9,3,9,4],[11,3,11,4],[12,3,12,4],[22,3,22,4],[22,1,22,2],[22,7,22,8],[71,1,72,8],[12,7,12,8],[20,1,20,8],[23,7,23,8],[22,5,22,6],[37,1,37,2],[37,4,37,5],[37,7,37,8],[16,3,16,4],[15,3,15,8],[13,7,13,8],[16,7,16,8]]}
["TxDOT Manuals >",null,null,"Tex-144-E"]
[null,"TEXAS DEPARTMENT OF TRANSPORTATION",null,null,null,null,null,null,null,null,125]
[null,null,null,null,null,null,null,null,null,null,1]
[null,null,null,null,null,null,null,null,null,null,"Tx144.xls::39351.446285"]
[null,"Dielectric Value Test"]
[null,"Tex-144-E"]
[null,null,null,null,null,null,null,null,{"$f":"\"File Version: \" & TEXT(MID(sn,SEARCH(\"::\",sn,1)+2,20),\"mm/dd/yy hh:mm:ss\")","v":"File Version: 07/29/24 13:26:43"}]
[null,null,"SAMPLE ID:",{"$f":"IF(SampleId=\"\",\"\",SampleId)","v":""},null,null,"SAMPLED DATE:",{"$f":"IF(SampledDate=\"\",\"\",SampledDate)","v":" "}]
[null,null,"TEST NUMBER:",{"$f":"IF(TestNumber=\"\",\"\",TestNumber)","v":""},null,null,"LETTING DATE:",{"$f":"IF(LettingDate=\"\",\"\",LettingDate)","v":" "}]
[null,null,"SAMPLE STATUS:",{"$f":"IF(Status=\"\",\"\",Status)","v":""},null,null,"CONTROLLING CSJ:",{"$f":"IF(CCSJ=\"\",\"\",CCSJ)","v":" "}]
[null,null,"COUNTY:",{"$f":"IF(County=\"\",\"\",County)","v":""},null,null,"SPEC YEAR:",{"$f":"IF(SpecYear=\"\",\"\",SpecYear)","v":""}]
[null,null,"SAMPLED BY:",{"$f":"IF(SampledBy=\"\",\"\",SampledBy)","v":""},null,null,"SPEC ITEM:",{"$f":"IF(SpecItem=\"\",\"\",SpecItem)","v":" "}]
[null,null,"SAMPLE LOCATION:",{"$f":"IF(SampleLocation=\"\",\"\",SampleLocation)","v":""},null,null,"SPECIAL PROVISION:",{"$f":"IF(SpecialProvision=\"\",\"\",SpecialProvision)","v":""}]
[null,null,"MATERIAL CODE:",{"$f":"IF(Material=\"\",\"\",Material)","v":""},null,null,"GRADE:",{"$f":"IF(Grade=\"\",\"\",Grade)","v":""}]
[null,null,"MATERIAL NAME:",{"$f":"IF(matl_nm=\"\",\"\",matl_nm)","v":""}]
[null,null,"PRODUCER:",{"$f":"IF(Producer=\"\",\"\",Producer)","v":""}]
[null,null,"AREA ENGINEER:",{"$f":"IF(AreaEngineer=\"\",\"\",AreaEngineer)","v":""},null,null,"PROJECT MANAGER:",{"$f":"IF(ProjectManager=\"\",\"\",ProjectManager)","v":" "}]
[]
[null,null,"COURSE\\LIFT:",{"$f":"IF(CourseLift=\"\",\"\",CourseLift)","v":""},"STATION:",{"$f":"IF(Station=\"\",\"\",Station)","v":" "},null,"DIST. FROM CL:",{"$f":"IF(DistFromCL=\"\",\"\",DistFromCL)","v":" "}]
[]
[null,"Report - Specimen #2"]
[]
[null,"Optimum MC (%):",null,{"$f":"IF('Report - Specimen #1'!D$23=\"\",\"\",'Report - Specimen #1'!D$23)","v":""},null,"Max. Dry Density (pcf):",null,{"$f":"IF('Report - Specimen #1'!H$23=\"\",\"\",'Report - Specimen #1'!H$23)","v":""}]
[]
[null,"Day No.","Reading 1","Reading 2","Reading 3","Reading 4","Reading 5","Average"]
[null,1,null,null,null,null,null,{"$f":"IF(ISERROR(AVERAGE(LARGE(C26:G26,1),LARGE(C26:G26,2),LARGE(C26:G26,3))),\"\",AVERAGE(LARGE(C26:G26,1),LARGE(C26:G26,2),LARGE(C26:G26,3)))","v":""}]
[null,2,null,null,null,null,null,""]
[null,3,null,null,null,null,null,""]
[null,4,null,null,null,null,null,""]
[null,5,null,null,null,null,null,""]
[null,6,null,null,null,null,null,""]
[null,7,null,null,null,null,null,""]
[null,8,null,null,null,null,null,""]
[null,9,null,null,null,null,null,""]
[null,10,null,null,null,null,null,""]
[null,null,null,null,null,null,"DV:",{"$f":"IF(ISERROR(AVERAGE(H33:H35)),\"\",AVERAGE(H33:H35))","v":""}]
[]
[null,"Compaction Information",null,null,"2-Day Drying Back Info.",null,null,"10-Day Soaking Info."]
[null,"Specimen Wet Wt.",null,null,"Specimen Dry Wt.",null,null,"Soaked Specimen Wt."]
[null,"Specimen Height",null,null,"Dry Soil Wt.",{"$f":"IF(I40-I41=0,\"\",I40-I41)","v":""},null,"Dry Soil Wt."]
[null,"Dry Soil Wt.",null,null,"Two Stones Wt.",{"$f":"IF(C42=\"\",\"\",C42)","v":""},null,"Pan Wt."]
[null,"Two Stones Wt."]
[null,"MCCOMPACT:",{"$f":"IF(ISERROR(((C39-C42)-C41)/C41*100),\"\",((C39-C42)-C41)/C41*100)","v":""},null,"MCINITIAL:",{"$f":"IF(ISERROR(((F39-N(F41)-N(F40))/(N(F40)))*100),\"\",((F39-N(F41)-N(F40))/(N(F40)))*100)","v":""},null,"MCFINAL:",{"$f":"IF(ISERROR(((I39-I40)/(I40-I41))*100),\"\",((I39-I40)/(I40-I41))*100)","v":""}]
[null,"Dry Density:",{"$f":"IF(ISERROR((C39-C42)/(0.25*PI()*6^2*C40*(1+C43/100))*12*12*12),\"\",(C39-C42)/(0.25*PI()*6^2*C40*(1+C43/100))*12*12*12)","v":""},null,null,null,null,"URET:"]
[null,"UCOMPACT:",{"$f":"IF('Report - Specimen #1'!$C$45=0,\"\",('Report - Specimen #1'!$C$45))","v":""},null,null,null,null,"R:",{"$f":"IF(ISERROR(I44/C45),\"\",I44/C45)","v":""}]
[]
[null,null,null,null,null,"For Technical Support, Call Zhiming Si @ 512-506-5901"]
[]
[]
[]
[]
[]
[]
[]
[]
[]
[]
[]
[]
[]
[]
[]
[]
[]
[]
[]
[]
[]
[]
[]
[null,"Remarks:",{"$f":"NOW()","v":"2024-07-29T13:26:43.990"}]

{"sheet":"Compaction Info","index":3,"n_rows":50,"n_cols":16,"rows_kept":50,"cut":false,"hidden":false,"merged":[[23,1,23,15],[30,13,31,13],[30,14,31,14],[30,15,31,15],[30,9,31,9],[30,10,31,10],[30,11,31,11],[30,12,31,12],[30,5,31,5],[30,6,31,6],[30,7,31,7],[30,8,31,8],[30,1,31,1],[30,2,31,2],[30,3,31,3],[30,4,31,4],[28,12,28,13],[27,8,27,9],[28,8,28,9],[24,1,24,15],[25,5,25,10],[27,1,27,2],[27,4,27,5],[27,12,27,13]]}
[]
[]
[]
[]
[]
[]
[]
[]
[]
[]
[]
[]
[]
[]
[]
[]
[]
[]
[]
[]
[]
[]
[]
[null,"Tex-144-E"]
[null,"Specimen Compaction Worksheet"]
[null,null,null,null,null,"All highlighted cells need to be filled out."]
[]
[null,"Wt. of Mold, lb.",null,null,"Mold Factor, ft3/in.",null,null,null,"Max. Dry Density, pcf",null,null,null,"OMC, %"]
[null,null,null,null,null,null,null,null,"Dry Weight of Sample, lb.",null,null,null,"Moisture Added, ml"]
[]
[null,"Specimen No.","WTOTAL (lb)","Wt. of Moist Specimen (lb)"," Ht (in)","Specimen Dia. (in)","Wet Density","WSTONES (lb)","After Molding WCOMPACT (lb)","After Drying WPARTIAL DRY (lb)","At Conclusion of Test WWET + Pan (lb)","At Conclusion of Test WDRY + Pan (lb)","At Conclusion of Test Pan Wt. (lb)","MCCOMPACT (%)","MCINITIAL (%)","MCFINAL (%)"]
[]
[null,1,null,{"$f":"IF(C33=\"\",\"\",C33-$D$28)","v":""},null,6,{"$f":"IF(ISERROR(D33/(E33*$G$28)),\"\",D33/(E33*$G$28))","v":""},null,null,null,null,null,null,{"$f":"IF(ISERROR(((I33-H33)-(L33-M33))/(L33-M33)*100),\"\",((I33-H33)-(L33-M33))/(L33-M33)*100)","v":""},{"$f":"IF(ISERROR(((J33-H33-L33+M33)/(L33-M33))*100),\"\",((J33-H33-L33+M33)/(L33-M33))*100)","v":""},{"$f":"IF(ISERROR(((K33-L33)/(L33-M33))*100),\"\",((K33-L33)/(L33-M33))*100)","v":""}]
[null,2,null,{"$f":"IF(C34=\"\",\"\",C34-$D$28)","v":""},null,6,{"$f":"IF(ISERROR(D34/(E34*$G$28)),\"\",D34/(E34*$G$28))","v":""},null,null,null,null,null,null,{"$f":"IF(ISERROR(((I34-H34)-(L34-M34))/(L34-M34)*100),\"\",((I34-H34)-(L34-M34))/(L34-M34)*100)","v":""},{"$f":"IF(ISERROR(((J34-H34-L34+M34)/(L34-M34))*100),\"\",((J34-H34-L34+M34)/(L34-M34))*100)","v":""},{"$f":"IF(ISERROR(((K34-L34)/(L34-M34))*100),\"\",((K34-L34)/(L34-M34))*100)","v":""}]
[null,3,null,{"$f":"IF(C35=\"\",\"\",C35-$D$28)","v":""},null,6,{"$f":"IF(ISERROR(D35/(E35*$G$28)),\"\",D35/(E35*$G$28))","v":""},null,null,null,null,null,null,{"$f":"IF(ISERROR(((I35-H35)-(L35-M35))/(L35-M35)*100),\"\",((I35-H35)-(L35-M35))/(L35-M35)*100)","v":""},{"$f":"IF(ISERROR(((J35-H35-L35+M35)/(L35-M35))*100),\"\",((J35-H35-L35+M35)/(L35-M35))*100)","v":""},{"$f":"IF(ISERROR(((K35-L35)/(L35-M35))*100),\"\",((K35-L35)/(L35-M35))*100)","v":""}]
[]
[null,"For technical support, please contact Zhiming Si at 512-506-5901"]
[]
[null,null,"Note:"]
[null,null,null,"OMC","Optimum moisture content"]
[null,null,null,"WTOTAL","Total weight of the mold and the specimen"]
[null,null,null,"Ht","Specimen height"]
[null,null,null,"WSTONES","Total dry weight of two dry porous stones"]
[null,null,null,"WCOMPACT","Total weight of the specimen and the two dry porous stones after molding"]
[null,null,null,"WPARTIAL DRY","Total weight of the specimen and the two porous stones after the two-day at 140°F drying"]
[null,null,null,"WWET","Weight of the broken speciemn after the ten-day soaking period"]
[null,null,null,"WDRY","Weight of the broken speciemn after 230°F drying"]
[null,null,null,"MCCOMPACT","Gravimetric moisture content when the specimen is molded"]
[null,null,null,"MCINITIAL","Gravimetric moisture content after the two-day drying period"]
[null,null,null,"MCFINAL","Gravimetric moisture content after the ten-day soaking period"]

{"sheet":"RX","index":7,"n_rows":216,"n_cols":9,"rows_kept":216,"cut":false,"hidden":true,"merged":[]}
[214]
["Fld_nbr","Value","Desc_1","Desc_2","Desc_3","Desc_4","Desc_5","Desc_6","Desc_7"]
[1,{"$f":"IF('Report - Specimen #1'!$B$72=\"\",\"\",'Report - Specimen #1'!$B$72)","v":""},{"$f":"'Report - Specimen #1'!$B$71","v":"Remarks:"}]
[2,{"$f":"IF('Report - Specimen #1'!$D$19=\"\",\"\",'Report - Specimen #1'!$D$19)","v":""},{"$f":"IF('Report - Specimen #1'!$C$19=\"\",\"\",'Report - Specimen #1'!$C$19)","v":"COURSE\\LIFT:"}]
[3,{"$f":"IF('Report - Specimen #1'!$C$78=\"\",\"\",'Report - Specimen #1'!$C$78)","v":" "},"Tested By ",{"$f":"IF('Report - Specimen #1'!$B$78=\"\",\"\",'Report - Specimen #1'!$B$78)","v":"TX144"}]
[4,{"$f":"IF('Report - Specimen #1'!$F$78=\"\",\"\",'Report - Specimen #1'!$F$78)","v":" "},"Tested Date ",{"$f":"IF('Report - Specimen #1'!$B$78=\"\",\"\",'Report - Specimen #1'!$B$78)","v":"TX144"}]
[5,{"$f":"IF('Report - Specimen #1'!$D$23=\"\",\"\",'Report - Specimen #1'!$D$23)","v":""},{"$f":"IF('Report - Specimen #1'!$B$6=\"\",\"\",'Report - Specimen #1'!$B$6)","v":"Tex-144-E"},{"$f":"IF( 'Report - Specimen #1'!$B$21=\"\",\"\", 'Report - Specimen #1'!$B$21)","v":"Report - Specimen #1"},{"$f":"IF('Report - Specimen #1'!$B$23=\"\",\"\",'Report - Specimen #1'!$B$23)","v":"Optimum MC (%):"}]
[6,{"$f":"IF('Report - Specimen #1'!$H$23=\"\",\"\",'Report - Specimen #1'!$H$23)","v":""},{"$f":"IF('Report - Specimen #1'!$B$6=\"\",\"\",'Report - Specimen #1'!$B$6)","v":"Tex-144-E"},{"$f":"IF( 'Report - Specimen #1'!$B$21=\"\",\"\", 'Report - Specimen #1'!$B$21)","v":"Report - Specimen #1"},{"$f":"IF('Report - Specimen #1'!$F$23=\"\",\"\",'Report - Specimen #1'!$F$23)","v":"Max. Dry Density (pcf):"}]
[7,{"$f":"IF('Report - Specimen #1'!$C$26=\"\",\"\",'Report - Specimen #1'!$C$26)","v":""},{"$f":"IF('Report - Specimen #1'!$B$6=\"\",\"\",'Report - Specimen #1'!$B$6)","v":"Tex-144-E"},{"$f":"IF( 'Report - Specimen #1'!$B$21=\"\",\"\", 'Report - Specimen #1'!$B$21)","v":"Report - Specimen #1"},{"$f":"IF('Report - Specimen #1'!$C$25=\"\",\"\",'Report - Specimen #1'!$C$25)","v":"Reading 1"},{"$f":"IF('Report - Specimen #1'!$B$25=\"\",\"\",'Report - Specimen #1'!$B$25)","v":"Day No."},{"$f":"IF('Report - Specimen #1'!$B$26=\"\",\"\",'Report - Specimen #1'!$B$26)","v":1}]
[8,{"$f":"IF('Report - Specimen #1'!$C$27=\"\",\"\",'Report - Specimen #1'!$C$27)","v":""},{"$f":"IF('Report - Specimen #1'!$B$6=\"\",\"\",'Report - Specimen #1'!$B$6)","v":"Tex-144-E"},{"$f":"IF( 'Report - Specimen #1'!$B$21=\"\",\"\", 'Report - Specimen #1'!$B$21)","v":"Report - Specimen #1"},{"$f":"IF('Report - Specimen #1'!$C$25=\"\",\"\",'Report - Specimen #1'!$C$25)","v":"Reading 1"},{"$f":"IF('Report - Specimen #1'!$B$25=\"\",\"\",'Report - Specimen #1'!$B$25)","v":"Day No."},{"$f":"IF('Report - Specimen #1'!$B$27=\"\",\"\",'Report - Specimen #1'!$B$27)","v":2}]
[9,{"$f":"IF('Report - Specimen #1'!$C$28=\"\",\"\",'Report - Specimen #1'!$C$28)","v":""},{"$f":"IF('Report - Specimen #1'!$B$6=\"\",\"\",'Report - Specimen #1'!$B$6)","v":"Tex-144-E"},{"$f":"IF( 'Report - Specimen #1'!$B$21=\"\",\"\", 'Report - Specimen #1'!$B$21)","v":"Report - Specimen #1"},{"$f":"IF('Report - Specimen #1'!$C$25=\"\",\"\",'Report - Specimen #1'!$C$25)","v":"Reading 1"},{"$f":"IF('Report - Specimen #1'!$B$25=\"\",\"\",'Report - Specimen #1'!$B$25)","v":"Day No."},{"$f":"IF('Report - Specimen #1'!$B$28=\"\",\"\",'Report - Specimen #1'!$B$28)","v":3}]
[10,{"$f":"IF('Report - Specimen #1'!$C$29=\"\",\"\",'Report - Specimen #1'!$C$29)","v":""},{"$f":"IF('Report - Specimen #1'!$B$6=\"\",\"\",'Report - Specimen #1'!$B$6)","v":"Tex-144-E"},{"$f":"IF( 'Report - Specimen #1'!$B$21=\"\",\"\", 'Report - Specimen #1'!$B$21)","v":"Report - Specimen #1"},{"$f":"IF('Report - Specimen #1'!$C$25=\"\",\"\",'Report - Specimen #1'!$C$25)","v":"Reading 1"},{"$f":"IF('Report - Specimen #1'!$B$25=\"\",\"\",'Report - Specimen #1'!$B$25)","v":"Day No."},{"$f":"IF('Report - Specimen #1'!$B$29=\"\",\"\",'Report - Specimen #1'!$B$29)","v":4}]
[11,{"$f":"IF('Report - Specimen #1'!$C$30=\"\",\"\",'Report - Specimen #1'!$C$30)","v":""},{"$f":"IF('Report - Specimen #1'!$B$6=\"\",\"\",'Report - Specimen #1'!$B$6)","v":"Tex-144-E"},{"$f":"IF( 'Report - Specimen #1'!$B$21=\"\",\"\", 'Report - Specimen #1'!$B$21)","v":"Report - Specimen #1"},{"$f":"IF('Report - Specimen #1'!$C$25=\"\",\"\",'Report - Specimen #1'!$C$25)","v":"Reading 1"},{"$f":"IF('Report - Specimen #1'!$B$25=\"\",\"\",'Report - Specimen #1'!$B$25)","v":"Day No."},{"$f":"IF('Report - Specimen #1'!$B$30=\"\",\"\",'Report - Specimen #1'!$B$30)","v":5}]
[12,{"$f":"IF('Report - Specimen #1'!$C$31=\"\",\"\",'Report - Specimen #1'!$C$31)","v":""},{"$f":"IF('Report - Specimen #1'!$B$6=\"\",\"\",'Report - Specimen #1'!$B$6)","v":"Tex-144-E"},{"$f":"IF( 'Report - Specimen #1'!$B$21=\"\",\"\", 'Report - Specimen #1'!$B$21)","v":"Report - Specimen #1"},{"$f":"IF('Report - Specimen #1'!$C$25=\"\",\"\",'Report - Specimen #1'!$C$25)","v":"Reading 1"},{"$f":"IF('Report - Specimen #1'!$B$25=\"\",\"\",'Report - Specimen #1'!$B$25)","v":"Day No."},{"$f":"IF('Report - Specimen #1'!$B$31=\"\",\"\",'Report - Specimen #1'!$B$31)","v":6}]
[13,{"$f":"IF('Report - Specimen #1'!$C$32=\"\",\"\",'Report - Specimen #1'!$C$32)","v":""},{"$f":"IF('Report - Specimen #1'!$B$6=\"\",\"\",'Report - Specimen #1'!$B$6)","v":"Tex-144-E"},{"$f":"IF( 'Report - Specimen #1'!$B$21=\"\",\"\", 'Report - Specimen #1'!$B$21)","v":"Report - Specimen #1"},{"$f":"IF('Report - Specimen #1'!$C$25=\"\",\"\",'Report - Specimen #1'!$C$25)","v":"Reading 1"},{"$f":"IF('Report - Specimen #1'!$B$25=\"\",\"\",'Report - Specimen #1'!$B$25)","v":"Day No."},{"$f":"IF('Report - Specimen #1'!$B$32=\"\",\"\",'Report - Specimen #1'!$B$32)","v":7}]
[14,{"$f":"IF('Report - Specimen #1'!$C$33=\"\",\"\",'Report - Specimen #1'!$C$33)","v":""},{"$f":"IF('Report - Specimen #1'!$B$6=\"\",\"\",'Report - Specimen #1'!$B$6)","v":"Tex-144-E"},{"$f":"IF( 'Report - Specimen #1'!$B$21=\"\",\"\", 'Report - Specimen #1'!$B$21)","v":"Report - Specimen #1"},{"$f":"IF('Report - Specimen #1'!$C$25=\"\",\"\",'Report - Specimen #1'!$C$25)","v":"Reading 1"},{"$f":"IF('Report - Specimen #1'!$B$25=\"\",\"\",'Report - Specimen #1'!$B$25)","v":"Day No."},{"$f":"IF('Report - Specimen #1'!$B$33=\"\",\"\",'Report - Specimen #1'!$B$33)","v":8}]
[15,{"$f":"IF('Report - Specimen #1'!$C$34=\"\",\"\",'Report - Specimen #1'!$C$34)","v":""},{"$f":"IF('Report - Specimen #1'!$B$6=\"\",\"\",'Report - Specimen #1'!$B$6)","v":"Tex-144-E"},{"$f":"IF( 'Report - Specimen #1'!$B$21=\"\",\"\", 'Report - Specimen #1'!$B$21)","v":"Report - Specimen #1"},{"$f":"IF('Report - Specimen #1'!$C$25=\"\",\"\",'Report - Specimen #1'!$C$25)","v":"Reading 1"},{"$f":"IF('Report - Specimen #1'!$B$25=\"\",\"\",'Report - Specimen #1'!$B$25)","v":"Day No."},{"$f":"IF('Report - Specimen #1'!$B$34=\"\",\"\",'Report - Specimen #1'!$B$34)","v":9}]
[16,{"$f":"IF('Report - Specimen #1'!$C$35=\"\",\"\",'Report - Specimen #1'!$C$35)","v":""},{"$f":"IF('Report - Specimen #1'!$B$6=\"\",\"\",'Report - Specimen #1'!$B$6)","v":"Tex-144-E"},{"$f":"IF( 'Report - Specimen #1'!$B$21=\"\",\"\", 'Report - Specimen #1'!$B$21)","v":"Report - Specimen #1"},{"$f":"IF('Report - Specimen #1'!$C$25=\"\",\"\",'Report - Specimen #1'!$C$25)","v":"Reading 1"},{"$f":"IF('Report - Specimen #1'!$B$25=\"\",\"\",'Report - Specimen #1'!$B$25)","v":"Day No."},{"$f":"IF('Report - Specimen #1'!$B$35=\"\",\"\",'Report - Specimen #1'!$B$35)","v":10}]
[17,{"$f":"IF('Report - Specimen #1'!$D$26=\"\",\"\",'Report - Specimen #1'!$D$26)","v":""},{"$f":"IF('Report - Specimen #1'!$B$6=\"\",\"\",'Report - Specimen #1'!$B$6)","v":"Tex-144-E"},{"$f":"IF( 'Report - Specimen #1'!$B$21=\"\",\"\", 'Report - Specimen #1'!$B$21)","v":"Report - Specimen #1"},{"$f":"IF('Report - Specimen #1'!$D$25=\"\",\"\",'Report - Specimen #1'!$D$25)","v":"Reading 2"},{"$f":"IF('Report - Specimen #1'!$B$25=\"\",\"\",'Report - Specimen #1'!$B$25)","v":"Day No."},{"$f":"IF('Report - Specimen #1'!$B$26=\"\",\"\",'Report - Specimen #1'!$B$26)","v":1}]
[18,{"$f":"IF('Report - Specimen #1'!$D$27=\"\",\"\",'Report - Specimen #1'!$D$27)","v":""},{"$f":"IF('Report - Specimen #1'!$B$6=\"\",\"\",'Report - Specimen #1'!$B$6)","v":"Tex-144-E"},{"$f":"IF( 'Report - Specimen #1'!$B$21=\"\",\"\", 'Report - Specimen #1'!$B$21)","v":"Report - Specimen #1"},{"$f":"IF('Report - Specimen #1'!$D$25=\"\",\"\",'Report - Specimen #1'!$D$25)","v":"Reading 2"},{"$f":"IF('Report - Specimen #1'!$B$25=\"\",\"\",'Report - Specimen #1'!$B$25)","v":"Day No."},{"$f":"IF('Report - Specimen #1'!$B$27=\"\",\"\",'Report - Specimen #1'!$B$27)","v":2}]
[19,{"$f":"IF('Report - Specimen #1'!$D$28=\"\",\"\",'Report - Specimen #1'!$D$28)","v":""},{"$f":"IF('Report - Specimen #1'!$B$6=\"\",\"\",'Report - Specimen #1'!$B$6)","v":"Tex-144-E"},{"$f":"IF( 'Report - Specimen #1'!$B$21=\"\",\"\", 'Report - Specimen #1'!$B$21)","v":"Report - Specimen #1"},{"$f":"IF('Report - Specimen #1'!$D$25=\"\",\"\",'Report - Specimen #1'!$D$25)","v":"Reading 2"},{"$f":"IF('Report - Specimen #1'!$B$25=\"\",\"\",'Report - Specimen #1'!$B$25)","v":"Day No."},{"$f":"IF('Report - Specimen #1'!$B$28=\"\",\"\",'Report - Specimen #1'!$B$28)","v":3}]
[20,{"$f":"IF('Report - Specimen #1'!$D$29=\"\",\"\",'Report - Specimen #1'!$D$29)","v":""},{"$f":"IF('Report - Specimen #1'!$B$6=\"\",\"\",'Report - Specimen #1'!$B$6)","v":"Tex-144-E"},{"$f":"IF( 'Report - Specimen #1'!$B$21=\"\",\"\", 'Report - Specimen #1'!$B$21)","v":"Report - Specimen #1"},{"$f":"IF('Report - Specimen #1'!$D$25=\"\",\"\",'Report - Specimen #1'!$D$25)","v":"Reading 2"},{"$f":"IF('Report - Specimen #1'!$B$25=\"\",\"\",'Report - Specimen #1'!$B$25)","v":"Day No."},{"$f":"IF('Report - Specimen #1'!$B$29=\"\",\"\",'Report - Specimen #1'!$B$29)","v":4}]
[21,{"$f":"IF('Report - Specimen #1'!$D$30=\"\",\"\",'Report - Specimen #1'!$D$30)","v":""},{"$f":"IF('Report - Specimen #1'!$B$6=\"\",\"\",'Report - Specimen #1'!$B$6)","v":"Tex-144-E"},{"$f":"IF( 'Report - Specimen #1'!$B$21=\"\",\"\", 'Report - Specimen #1'!$B$21)","v":"Report - Specimen #1"},{"$f":"IF('Report - Specimen #1'!$D$25=\"\",\"\",'Report - Specimen #1'!$D$25)","v":"Reading 2"},{"$f":"IF('Report - Specimen #1'!$B$25=\"\",\"\",'Report - Specimen #1'!$B$25)","v":"Day No."},{"$f":"IF('Report - Specimen #1'!$B$30=\"\",\"\",'Report - Specimen #1'!$B$30)","v":5}]
[22,{"$f":"IF('Report - Specimen #1'!$D$31=\"\",\"\",'Report - Specimen #1'!$D$31)","v":""},{"$f":"IF('Report - Specimen #1'!$B$6=\"\",\"\",'Report - Specimen #1'!$B$6)","v":"Tex-144-E"},{"$f":"IF( 'Report - Specimen #1'!$B$21=\"\",\"\", 'Report - Specimen #1'!$B$21)","v":"Report - Specimen #1"},{"$f":"IF('Report - Specimen #1'!$D$25=\"\",\"\",'Report - Specimen #1'!$D$25)","v":"Reading 2"},{"$f":"IF('Report - Specimen #1'!$B$25=\"\",\"\",'Report - Specimen #1'!$B$25)","v":"Day No."},{"$f":"IF('Report - Specimen #1'!$B$31=\"\",\"\",'Report - Specimen #1'!$B$31)","v":6}]
[23,{"$f":"IF('Report - Specimen #1'!$D$32=\"\",\"\",'Report - Specimen #1'!$D$32)","v":""},{"$f":"IF('Report - Specimen #1'!$B$6=\"\",\"\",'Report - Specimen #1'!$B$6)","v":"Tex-144-E"},{"$f":"IF( 'Report - Specimen #1'!$B$21=\"\",\"\", 'Report - Specimen #1'!$B$21)","v":"Report - Specimen #1"},{"$f":"IF('Report - Specimen #1'!$D$25=\"\",\"\",'Report - Specimen #1'!$D$25)","v":"Reading 2"},{"$f":"IF('Report - Specimen #1'!$B$25=\"\",\"\",'Report - Specimen #1'!$B$25)","v":"Day No."},{"$f":"IF('Report - Specimen #1'!$B$32=\"\",\"\",'Report - Specimen #1'!$B$32)","v":7}]
[24,{"$f":"IF('Report - Specimen #1'!$D$33=\"\",\"\",'Report - Specimen #1'!$D$33)","v":""},{"$f":"IF('Report - Specimen #1'!$B$6=\"\",\"\",'Report - Specimen #1'!$B$6)","v":"Tex-144-E"},{"$f":"IF( 'Report - Specimen #1'!$B$21=\"\",\"\", 'Report - Specimen #1'!$B$21)","v":"Report - Specimen #1"},{"$f":"IF('Report - Specimen #1'!$D$25=\"\",\"\",'Report - Specimen #1'!$D$25)","v":"Reading 2"},{"$f":"IF('Report - Specimen #1'!$B$25=\"\",\"\",'Report - Specimen #1'!$B$25)","v":"Day No."},{"$f":"IF('Report - Specimen #1'!$B$33=\"\",\"\",'Report - Specimen #1'!$B$33)","v":8}]
[25,{"$f":"IF('Report - Specimen #1'!$D$34=\"\",\"\",'Report - Specimen #1'!$D$34)","v":""},{"$f":"IF('Report - Specimen #1'!$B$6=\"\",\"\",'Report - Specimen #1'!$B$6)","v":"Tex-144-E"},{"$f":"IF( 'Report - Specimen #1'!$B$21=\"\",\"\", 'Report - Specimen #1'!$B$21)","v":"Report - Specimen #1"},{"$f":"IF('Report - Specimen #1'!$D$25=\"\",\"\",'Report - Specimen #1'!$D$25)","v":"Reading 2"},{"$f":"IF('Report - Specimen #1'!$B$25=\"\",\"\",'Report - Specimen #1'!$B$25)","v":"Day No."},{"$f":"IF('Report - Specimen #1'!$B$34=\"\",\"\",'Report - Specimen #1'!$B$34)","v":9}]
[26,{"$f":"IF('Report - Specimen #1'!$D$35=\"\",\"\",'Report - Specimen #1'!$D$35)","v":""},{"$f":"IF('Report - Specimen #1'!$B$6=\"\",\"\",'Report - Specimen #1'!$B$6)","v":"Tex-144-E"},{"$f":"IF( 'Report - Specimen #1'!$B$21=\"\",\"\", 'Report - Specimen #1'!$B$21)","v":"Report - Specimen #1"},{"$f":"IF('Report - Specimen #1'!$D$25=\"\",\"\",'Report - Specimen #1'!$D$25)","v":"Reading 2"},{"$f":"IF('Report - Specimen #1'!$B$25=\"\",\"\",'Report - Specimen #1'!$B$25)","v":"Day No."},{"$f":"IF('Report - Specimen #1'!$B$35=\"\",\"\",'Report - Specimen #1'!$B$35)","v":10}]
[27,{"$f":"IF('Report - Specimen #1'!$E$26=\"\",\"\",'Report - Specimen #1'!$E$26)","v":""},{"$f":"IF('Report - Specimen #1'!$B$6=\"\",\"\",'Report - Specimen #1'!$B$6)","v":"Tex-144-E"},{"$f":"IF( 'Report - Specimen #1'!$B$21=\"\",\"\", 'Report - Specimen #1'!$B$21)","v":"Report - Specimen #1"},{"$f":"IF('Report - Specimen #1'!$E$25=\"\",\"\",'Report - Specimen #1'!$E$25)","v":"Reading 3"},{"$f":"IF('Report - Specimen #1'!$B$25=\"\",\"\",'Report - Specimen #1'!$B$25)","v":"Day No."},{"$f":"IF('Report - Specimen #1'!$B$26=\"\",\"\",'Report - Specimen #1'!$B$26)","v":1}]
[28,{"$f":"IF('Report - Specimen #1'!$E$27=\"\",\"\",'Report - Specimen #1'!$E$27)","v":""},{"$f":"IF('Report - Specimen #1'!$B$6=\"\",\"\",'Report - Specimen #1'!$B$6)","v":"Tex-144-E"},{"$f":"IF( 'Report - Specimen #1'!$B$21=\"\",\"\", 'Report - Specimen #1'!$B$21)","v":"Report - Specimen #1"},{"$f":"IF('Report - Specimen #1'!$E$25=\"\",\"\",'Report - Specimen #1'!$E$25)","v":"Reading 3"},{"$f":"IF('Report - Specimen #1'!$B$25=\"\",\"\",'Report - Specimen #1'!$B$25)","v":"Day No."},{"$f":"IF('Report - Specimen #1'!$B$27=\"\",\"\",'Report - Specimen #1'!$B$27)","v":2}]
[29,{"$f":"IF('Report - Specimen #1'!$E$28=\"\",\"\",'Report - Specimen #1'!$E$28)","v":""},{"$f":"IF('Report - Specimen #1'!$B$6=\"\",\"\",'Report - Specimen #1'!$B$6)","v":"Tex-144-E"},{"$f":"IF( 'Report - Specimen #1'!$B$21=\"\",\"\", 'Report - Specimen #1'!$B$21)","v":"Report - Specimen #1"},{"$f":"IF('Report - Specimen #1'!$E$25=\"\",\"\",'Report - Specimen #1'!$E$25)","v":"Reading 3"},{"$f":"IF('Report - Specimen #1'!$B$25=\"\",\"\",'Report - Specimen #1'!$B$25)","v":"Day No."},{"$f":"IF('Report - Specimen #1'!$B$28=\"\",\"\",'Report - Specimen #1'!$B$28)","v":3}]
[30,{"$f":"IF('Report - Specimen #1'!$E$29=\"\",\"\",'Report - Specimen #1'!$E$29)","v":""},{"$f":"IF('Report - Specimen #1'!$B$6=\"\",\"\",'Report - Specimen #1'!$B$6)","v":"Tex-144-E"},{"$f":"IF( 'Report - Specimen #1'!$B$21=\"\",\"\", 'Report - Specimen #1'!$B$21)","v":"Report - Specimen #1"},{"$f":"IF('Report - Specimen #1'!$E$25=\"\",\"\",'Report - Specimen #1'!$E$25)","v":"Reading 3"},{"$f":"IF('Report - Specimen #1'!$B$25=\"\",\"\",'Report - Specimen #1'!$B$25)","v":"Day No."},{"$f":"IF('Report - Specimen #1'!$B$29=\"\",\"\",'Report - Specimen #1'!$B$29)","v":4}]
[31,{"$f":"IF('Report - Specimen #1'!$E$30=\"\",\"\",'Report - Specimen #1'!$E$30)","v":""},{"$f":"IF('Report - Specimen #1'!$B$6=\"\",\"\",'Report - Specimen #1'!$B$6)","v":"Tex-144-E"},{"$f":"IF( 'Report - Specimen #1'!$B$21=\"\",\"\", 'Report - Specimen #1'!$B$21)","v":"Report - Specimen #1"},{"$f":"IF('Report - Specimen #1'!$E$25=\"\",\"\",'Report - Specimen #1'!$E$25)","v":"Reading 3"},{"$f":"IF('Report - Specimen #1'!$B$25=\"\",\"\",'Report - Specimen #1'!$B$25)","v":"Day No."},{"$f":"IF('Report - Specimen #1'!$B$30=\"\",\"\",'Report - Specimen #1'!$B$30)","v":5}]
[32,{"$f":"IF('Report - Specimen #1'!$E$31=\"\",\"\",'Report - Specimen #1'!$E$31)","v":""},{"$f":"IF('Report - Specimen #1'!$B$6=\"\",\"\",'Report - Specimen #1'!$B$6)","v":"Tex-144-E"},{"$f":"IF( 'Report - Specimen #1'!$B$21=\"\",\"\", 'Report - Specimen #1'!$B$21)","v":"Report - Specimen #1"},{"$f":"IF('Report - Specimen #1'!$E$25=\"\",\"\",'Report - Specimen #1'!$E$25)","v":"Reading 3"},{"$f":"IF('Report - Specimen #1'!$B$25=\"\",\"\",'Report - Specimen #1'!$B$25)","v":"Day No."},{"$f":"IF('Report - Specimen #1'!$B$31=\"\",\"\",'Report - Specimen #1'!$B$31)","v":6}]
[33,{"$f":"IF('Report - Specimen #1'!$E$32=\"\",\"\",'Report - Specimen #1'!$E$32)","v":""},{"$f":"IF('Report - Specimen #1'!$B$6=\"\",\"\",'Report - Specimen #1'!$B$6)","v":"Tex-144-E"},{"$f":"IF( 'Report - Specimen #1'!$B$21=\"\",\"\", 'Report - Specimen #1'!$B$21)","v":"Report - Specimen #1"},{"$f":"IF('Report - Specimen #1'!$E$25=\"\",\"\",'Report - Specimen #1'!$E$25)","v":"Reading 3"},{"$f":"IF('Report - Specimen #1'!$B$25=\"\",\"\",'Report - Specimen #1'!$B$25)","v":"Day No."},{"$f":"IF('Report - Specimen #1'!$B$32=\"\",\"\",'Report - Specimen #1'!$B$32)","v":7}]
[34,{"$f":"IF('Report - Specimen #1'!$E$33=\"\",\"\",'Report - Specimen #1'!$E$33)","v":""},{"$f":"IF('Report - Specimen #1'!$B$6=\"\",\"\",'Report - Specimen #1'!$B$6)","v":"Tex-144-E"},{"$f":"IF( 'Report - Specimen #1'!$B$21=\"\",\"\", 'Report - Specimen #1'!$B$21)","v":"Report - Specimen #1"},{"$f":"IF('Report - Specimen #1'!$E$25=\"\",\"\",'Report - Specimen #1'!$E$25)","v":"Reading 3"},{"$f":"IF('Report - Specimen #1'!$B$25=\"\",\"\",'Report - Specimen #1'!$B$25)","v":"Day No."},{"$f":"IF('Report - Specimen #1'!$B$33=\"\",\"\",'Report - Specimen #1'!$B$33)","v":8}]
[35,{"$f":"IF('Report - Specimen #1'!$E$34=\"\",\"\",'Report - Specimen #1'!$E$34)","v":""},{"$f":"IF('Report - Specimen #1'!$B$6=\"\",\"\",'Report - Specimen #1'!$B$6)","v":"Tex-144-E"},{"$f":"IF( 'Report - Specimen #1'!$B$21=\"\",\"\", 'Report - Specimen #1'!$B$21)","v":"Report - Specimen #1"},{"$f":"IF('Report - Specimen #1'!$E$25=\"\",\"\",'Report - Specimen #1'!$E$25)","v":"Reading 3"},{"$f":"IF('Report - Specimen #1'!$B$25=\"\",\"\",'Report - Specimen #1'!$B$25)","v":"Day No."},{"$f":"IF('Report - Specimen #1'!$B$34=\"\",\"\",'Report - Specimen #1'!$B$34)","v":9}]
[36,{"$f":"IF('Report - Specimen #1'!$E$35=\"\",\"\",'Report - Specimen #1'!$E$35)","v":""},{"$f":"IF('Report - Specimen #1'!$B$6=\"\",\"\",'Report - Specimen #1'!$B$6)","v":"Tex-144-E"},{"$f":"IF( 'Report - Specimen #1'!$B$21=\"\",\"\", 'Report - Specimen #1'!$B$21)","v":"Report - Specimen #1"},{"$f":"IF('Report - Specimen #1'!$E$25=\"\",\"\",'Report - Specimen #1'!$E$25)","v":"Reading 3"},{"$f":"IF('Report - Specimen #1'!$B$25=\"\",\"\",'Report - Specimen #1'!$B$25)","v":"Day No."},{"$f":"IF('Report - Specimen #1'!$B$35=\"\",\"\",'Report - Specimen #1'!$B$35)","v":10}]
[37,{"$f":"IF('Report - Specimen #1'!$F$26=\"\",\"\",'Report - Specimen #1'!$F$26)","v":""},{"$f":"IF('Report - Specimen #1'!$B$6=\"\",\"\",'Report - Specimen #1'!$B$6)","v":"Tex-144-E"},{"$f":"IF( 'Report - Specimen #1'!$B$21=\"\",\"\", 'Report - Specimen #1'!$B$21)","v":"Report - Specimen #1"},{"$f":"IF('Report - Specimen #1'!$F$25=\"\",\"\",'Report - Specimen #1'!$F$25)","v":"Reading 4"},{"$f":"IF('Report - Specimen #1'!$B$25=\"\",\"\",'Report - Specimen #1'!$B$25)","v":"Day No."},{"$f":"IF('Report - Specimen #1'!$B$26=\"\",\"\",'Report - Specimen #1'!$B$26)","v":1}]
[38,{"$f":"IF('Report - Specimen #1'!$F$27=\"\",\"\",'Report - Specimen #1'!$F$27)","v":""},{"$f":"IF('Report - Specimen #1'!$B$6=\"\",\"\",'Report - Specimen #1'!$B$6)","v":"Tex-144-E"},{"$f":"IF( 'Report - Specimen #1'!$B$21=\"\",\"\", 'Report - Specimen #1'!$B$21)","v":"Report - Specimen #1"},{"$f":"IF('Report - Specimen #1'!$F$25=\"\",\"\",'Report - Specimen #1'!$F$25)","v":"Reading 4"},{"$f":"IF('Report - Specimen #1'!$B$25=\"\",\"\",'Report - Specimen #1'!$B$25)","v":"Day No."},{"$f":"IF('Report - Specimen #1'!$B$27=\"\",\"\",'Report - Specimen #1'!$B$27)","v":2}]
[39,{"$f":"IF('Report - Specimen #1'!$F$28=\"\",\"\",'Report - Specimen #1'!$F$28)","v":""},{"$f":"IF('Report - Specimen #1'!$B$6=\"\",\"\",'Report - Specimen #1'!$B$6)","v":"Tex-144-E"},{"$f":"IF( 'Report - Specimen #1'!$B$21=\"\",\"\", 'Report - Specimen #1'!$B$21)","v":"Report - Specimen #1"},{"$f":"IF('Report - Specimen #1'!$F$25=\"\",\"\",'Report - Specimen #1'!$F$25)","v":"Reading 4"},{"$f":"IF('Report - Specimen #1'!$B$25=\"\",\"\",'Report - Specimen #1'!$B$25)","v":"Day No."},{"$f":"IF('Report - Specimen #1'!$B$28=\"\",\"\",'Report - Specimen #1'!$B$28)","v":3}]
[40,{"$f":"IF('Report - Specimen #1'!$F$29=\"\",\"\",'Report - Specimen #1'!$F$29)","v":""},{"$f":"IF('Report - Specimen #1'!$B$6=\"\",\"\",'Report - Specimen #1'!$B$6)","v":"Tex-144-E"},{"$f":"IF( 'Report - Specimen #1'!$B$21=\"\",\"\", 'Report - Specimen #1'!$B$21)","v":"Report - Specimen #1"},{"$f":"IF('Report - Specimen #1'!$F$25=\"\",\"\",'Report - Specimen #1'!$F$25)","v":"Reading 4"},{"$f":"IF('Report - Specimen #1'!$B$25=\"\",\"\",'Report - Specimen #1'!$B$25)","v":"Day No."},{"$f":"IF('Report - Specimen #1'!$B$29=\"\",\"\",'Report - Specimen #1'!$B$29)","v":4}]
[41,{"$f":"IF('Report - Specimen #1'!$F$30=\"\",\"\",'Report - Specimen #1'!$F$30)","v":""},{"$f":"IF('Report - Specimen #1'!$B$6=\"\",\"\",'Report - Specimen #1'!$B$6)","v":"Tex-144-E"},{"$f":"IF( 'Report - Specimen #1'!$B$21=\"\",\"\", 'Report - Specimen #1'!$B$21)","v":"Report - Specimen #1"},{"$f":"IF('Report - Specimen #1'!$F$25=\"\",\"\",'Report - Specimen #1'!$F$25)","v":"Reading 4"},{"$f":"IF('Report - Specimen #1'!$B$25=\"\",\"\",'Report - Specimen #1'!$B$25)","v":"Day No."},{"$f":"IF('Report - Specimen #1'!$B$30=\"\",\"\",'Report - Specimen #1'!$B$30)","v":5}]
[42,{"$f":"IF('Report - Specimen #1'!$F$31=\"\",\"\",'Report - Specimen #1'!$F$31)","v":""},{"$f":"IF('Report - Specimen #1'!$B$6=\"\",\"\",'Report - Specimen #1'!$B$6)","v":"Tex-144-E"},{"$f":"IF( 'Report - Specimen #1'!$B$21=\"\",\"\", 'Report - Specimen #1'!$B$21)","v":"Report - Specimen #1"},{"$f":"IF('Report - Specimen #1'!$F$25=\"\",\"\",'Report - Specimen #1'!$F$25)","v":"Reading 4"},{"$f":"IF('Report - Specimen #1'!$B$25=\"\",\"\",'Report - Specimen #1'!$B$25)","v":"Day No."},{"$f":"IF('Report - Specimen #1'!$B$31=\"\",\"\",'Report - Specimen #1'!$B$31)","v":6}]
[43,{"$f":"IF('Report - Specimen #1'!$F$32=\"\",\"\",'Report - Specimen #1'!$F$32)","v":""},{"$f":"IF('Report - Specimen #1'!$B$6=\"\",\"\",'Report - Specimen #1'!$B$6)","v":"Tex-144-E"},{"$f":"IF( 'Report - Specimen #1'!$B$21=\"\",\"\", 'Report - Specimen #1'!$B$21)","v":"Report - Specimen #1"},{"$f":"IF('Report - Specimen #1'!$F$25=\"\",\"\",'Report - Specimen #1'!$F$25)","v":"Reading 4"},{"$f":"IF('Report - Specimen #1'!$B$25=\"\",\"\",'Report - Specimen #1'!$B$25)","v":"Day No."},{"$f":"IF('Report - Specimen #1'!$B$32=\"\",\"\",'Report - Specimen #1'!$B$32)","v":7}]
[44,{"$f":"IF('Report - Specimen #1'!$F$33=\"\",\"\",'Report - Specimen #1'!$F$33)","v":""},{"$f":"IF('Report - Specimen #1'!$B$6=\"\",\"\",'Report - Specimen #1'!$B$6)","v":"Tex-144-E"},{"$f":"IF( 'Report - Specimen #1'!$B$21=\"\",\"\", 'Report - Specimen #1'!$B$21)","v":"Report - Specimen #1"},{"$f":"IF('Report - Specimen #1'!$F$25=\"\",\"\",'Report - Specimen #1'!$F$25)","v":"Reading 4"},{"$f":"IF('Report - Specimen #1'!$B$25=\"\",\"\",'Report - Specimen #1'!$B$25)","v":"Day No."},{"$f":"IF('Report - Specimen #1'!$B$33=\"\",\"\",'Report - Specimen #1'!$B$33)","v":8}]
[45,{"$f":"IF('Report - Specimen #1'!$F$34=\"\",\"\",'Report - Specimen #1'!$F$34)","v":""},{"$f":"IF('Report - Specimen #1'!$B$6=\"\",\"\",'Report - Specimen #1'!$B$6)","v":"Tex-144-E"},{"$f":"IF( 'Report - Specimen #1'!$B$21=\"\",\"\", 'Report - Specimen #1'!$B$21)","v":"Report - Specimen #1"},{"$f":"IF('Report - Specimen #1'!$F$25=\"\",\"\",'Report - Specimen #1'!$F$25)","v":"Reading 4"},{"$f":"IF('Report - Specimen #1'!$B$25=\"\",\"\",'Report - Specimen #1'!$B$25)","v":"Day No."},{"$f":"IF('Report - Specimen #1'!$B$34=\"\",\"\",'Report - Specimen #1'!$B$34)","v":9}]
[46,{"$f":"IF('Report - Specimen #1'!$F$35=\"\",\"\",'Report - Specimen #1'!$F$35)","v":""},{"$f":"IF('Report - Specimen #1'!$B$6=\"\",\"\",'Report - Specimen #1'!$B$6)","v":"Tex-144-E"},{"$f":"IF( 'Report - Specimen #1'!$B$21=\"\",\"\", 'Report - Specimen #1'!$B$21)","v":"Report - Specimen #1"},{"$f":"IF('Report - Specimen #1'!$F$25=\"\",\"\",'Report - Specimen #1'!$F$25)","v":"Reading 4"},{"$f":"IF('Report - Specimen #1'!$B$25=\"\",\"\",'Report - Specimen #1'!$B$25)","v":"Day No."},{"$f":"IF('Report - Specimen #1'!$B$35=\"\",\"\",'Report - Specimen #1'!$B$35)","v":10}]
[47,{"$f":"IF('Report - Specimen #1'!$G$26=\"\",\"\",'Report - Specimen #1'!$G$26)","v":""},{"$f":"IF('Report - Specimen #1'!$B$6=\"\",\"\",'Report - Specimen #1'!$B$6)","v":"Tex-144-E"},{"$f":"IF( 'Report - Specimen #1'!$B$21=\"\",\"\", 'Report - Specimen #1'!$B$21)","v":"Report - Specimen #1"},{"$f":"IF('Report - Specimen #1'!$G$25=\"\",\"\",'Report - Specimen #1'!$G$25)","v":"Reading 5"},{"$f":"IF('Report - Specimen #1'!$B$25=\"\",\"\",'Report - Specimen #1'!$B$25)","v":"Day No."},{"$f":"IF('Report - Specimen #1'!$B$26=\"\",\"\",'Report - Specimen #1'!$B$26)","v":1}]
[48,{"$f":"IF('Report - Specimen #1'!$G$27=\"\",\"\",'Report - Specimen #1'!$G$27)","v":""},{"$f":"IF('Report - Specimen #1'!$B$6=\"\",\"\",'Report - Specimen #1'!$B$6)","v":"Tex-144-E"},{"$f":"IF( 'Report - Specimen #1'!$B$21=\"\",\"\", 'Report - Specimen #1'!$B$21)","v":"Report - Specimen #1"},{"$f":"IF('Report - Specimen #1'!$G$25=\"\",\"\",'Report - Specimen #1'!$G$25)","v":"Reading 5"},{"$f":"IF('Report - Specimen #1'!$B$25=\"\",\"\",'Report - Specimen #1'!$B$25)","v":"Day No."},{"$f":"IF('Report - Specimen #1'!$B$27=\"\",\"\",'Report - Specimen #1'!$B$27)","v":2}]
[49,{"$f":"IF('Report - Specimen #1'!$G$28=\"\",\"\",'Report - Specimen #1'!$G$28)","v":""},{"$f":"IF('Report - Specimen #1'!$B$6=\"\",\"\",'Report - Specimen #1'!$B$6)","v":"Tex-144-E"},{"$f":"IF( 'Report - Specimen #1'!$B$21=\"\",\"\", 'Report - Specimen #1'!$B$21)","v":"Report - Specimen #1"},{"$f":"IF('Report - Specimen #1'!$G$25=\"\",\"\",'Report - Specimen #1'!$G$25)","v":"Reading 5"},{"$f":"IF('Report - Specimen #1'!$B$25=\"\",\"\",'Report - Specimen #1'!$B$25)","v":"Day No."},{"$f":"IF('Report - Specimen #1'!$B$28=\"\",\"\",'Report - Specimen #1'!$B$28)","v":3}]
[50,{"$f":"IF('Report - Specimen #1'!$G$29=\"\",\"\",'Report - Specimen #1'!$G$29)","v":""},{"$f":"IF('Report - Specimen #1'!$B$6=\"\",\"\",'Report - Specimen #1'!$B$6)","v":"Tex-144-E"},{"$f":"IF( 'Report - Specimen #1'!$B$21=\"\",\"\", 'Report - Specimen #1'!$B$21)","v":"Report - Specimen #1"},{"$f":"IF('Report - Specimen #1'!$G$25=\"\",\"\",'Report - Specimen #1'!$G$25)","v":"Reading 5"},{"$f":"IF('Report - Specimen #1'!$B$25=\"\",\"\",'Report - Specimen #1'!$B$25)","v":"Day No."},{"$f":"IF('Report - Specimen #1'!$B$29=\"\",\"\",'Report - Specimen #1'!$B$29)","v":4}]
[51,{"$f":"IF('Report - Specimen #1'!$G$30=\"\",\"\",'Report - Specimen #1'!$G$30)","v":""},{"$f":"IF('Report - Specimen #1'!$B$6=\"\",\"\",'Report - Specimen #1'!$B$6)","v":"Tex-144-E"},{"$f":"IF( 'Report - Specimen #1'!$B$21=\"\",\"\", 'Report - Specimen #1'!$B$21)","v":"Report - Specimen #1"},{"$f":"IF('Report - Specimen #1'!$G$25=\"\",\"\",'Report - Specimen #1'!$G$25)","v":"Reading 5"},{"$f":"IF('Report - Specimen #1'!$B$25=\"\",\"\",'Report - Specimen #1'!$B$25)","v":"Day No."},{"$f":"IF('Report - Specimen #1'!$B$30=\"\",\"\",'Report - Specimen #1'!$B$30)","v":5}]
[52,{"$f":"IF('Report - Specimen #1'!$G$31=\"\",\"\",'Report - Specimen #1'!$G$31)","v":""},{"$f":"IF('Report - Specimen #1'!$B$6=\"\",\"\",'Report - Specimen #1'!$B$6)","v":"Tex-144-E"},{"$f":"IF( 'Report - Specimen #1'!$B$21=\"\",\"\", 'Report - Specimen #1'!$B$21)","v":"Report - Specimen #1"},{"$f":"IF('Report - Specimen #1'!$G$25=\"\",\"\",'Report - Specimen #1'!$G$25)","v":"Reading 5"},{"$f":"IF('Report - Specimen #1'!$B$25=\"\",\"\",'Report - Specimen #1'!$B$25)","v":"Day No."},{"$f":"IF('Report - Specimen #1'!$B$31=\"\",\"\",'Report - Specimen #1'!$B$31)","v":6}]
[53,{"$f":"IF('Report - Specimen #1'!$G$32=\"\",\"\",'Report - Specimen #1'!$G$32)","v":""},{"$f":"IF('Report - Specimen #1'!$B$6=\"\",\"\",'Report - Specimen #1'!$B$6)","v":"Tex-144-E"},{"$f":"IF( 'Report - Specimen #1'!$B$21=\"\",\"\", 'Report - Specimen #1'!$B$21)","v":"Report - Specimen #1"},{"$f":"IF('Report - Specimen #1'!$G$25=\"\",\"\",'Report - Specimen #1'!$G$25)","v":"Reading 5"},{"$f":"IF('Report - Specimen #1'!$B$25=\"\",\"\",'Report - Specimen #1'!$B$25)","v":"Day No."},{"$f":"IF('Report - Specimen #1'!$B$32=\"\",\"\",'Report - Specimen #1'!$B$32)","v":7}]
[54,{"$f":"IF('Report - Specimen #1'!$G$33=\"\",\"\",'Report - Specimen #1'!$G$33)","v":""},{"$f":"IF('Report - Specimen #1'!$B$6=\"\",\"\",'Report - Specimen #1'!$B$6)","v":"Tex-144-E"},{"$f":"IF( 'Report - Specimen #1'!$B$21=\"\",\"\", 'Report - Specimen #1'!$B$21)","v":"Report - Specimen #1"},{"$f":"IF('Report - Specimen #1'!$G$25=\"\",\"\",'Report - Specimen #1'!$G$25)","v":"Reading 5"},{"$f":"IF('Report - Specimen #1'!$B$25=\"\",\"\",'Report - Specimen #1'!$B$25)","v":"Day No."},{"$f":"IF('Report - Specimen #1'!$B$33=\"\",\"\",'Report - Specimen #1'!$B$33)","v":8}]
[55,{"$f":"IF('Report - Specimen #1'!$G$34=\"\",\"\",'Report - Specimen #1'!$G$34)","v":""},{"$f":"IF('Report - Specimen #1'!$B$6=\"\",\"\",'Report - Specimen #1'!$B$6)","v":"Tex-144-E"},{"$f":"IF( 'Report - Specimen #1'!$B$21=\"\",\"\", 'Report - Specimen #1'!$B$21)","v":"Report - Specimen #1"},{"$f":"IF('Report - Specimen #1'!$G$25=\"\",\"\",'Report - Specimen #1'!$G$25)","v":"Reading 5"},{"$f":"IF('Report - Specimen #1'!$B$25=\"\",\"\",'Report - Specimen #1'!$B$25)","v":"Day No."},{"$f":"IF('Report - Specimen #1'!$B$34=\"\",\"\",'Report - Specimen #1'!$B$34)","v":9}]
[56,{"$f":"IF('Report - Specimen #1'!$G$35=\"\",\"\",'Report - Specimen #1'!$G$35)","v":""},{"$f":"IF('Report - Specimen #1'!$B$6=\"\",\"\",'Report - Specimen #1'!$B$6)","v":"Tex-144-E"},{"$f":"IF( 'Report - Specimen #1'!$B$21=\"\",\"\", 'Report - Specimen #1'!$B$21)","v":"Report - Specimen #1"},{"$f":"IF('Report - Specimen #1'!$G$25=\"\",\"\",'Report - Specimen #1'!$G$25)","v":"Reading 5"},{"$f":"IF('Report - Specimen #1'!$B$25=\"\",\"\",'Report - Specimen #1'!$B$25)","v":"Day No."},{"$f":"IF('Report - Specimen #1'!$B$35=\"\",\"\",'Report - Specimen #1'!$B$35)","v":10}]
[57,{"$f":"IF('Report - Specimen #1'!$H$26=\"\",\"\",'Report - Specimen #1'!$H$26)","v":""},{"$f":"IF('Report - Specimen #1'!$B$6=\"\",\"\",'Report - Specimen #1'!$B$6)","v":"Tex-144-E"},{"$f":"IF( 'Report - Specimen #1'!$B$21=\"\",\"\", 'Report - Specimen #1'!$B$21)","v":"Report - Specimen #1"},{"$f":"IF('Report - Specimen #1'!$H$25=\"\",\"\",'Report - Specimen #1'!$H$25)","v":"Average"},{"$f":"IF('Report - Specimen #1'!$B$25=\"\",\"\",'Report - Specimen #1'!$B$25)","v":"Day No."},{"$f":"IF('Report - Specimen #1'!$B$26=\"\",\"\",'Report - Specimen #1'!$B$26)","v":1}]
[58,{"$f":"IF('Report - Specimen #1'!$H$27=\"\",\"\",'Report - Specimen #1'!$H$27)","v":""},{"$f":"IF('Report - Specimen #1'!$B$6=\"\",\"\",'Report - Specimen #1'!$B$6)","v":"Tex-144-E"},{"$f":"IF( 'Report - Specimen #1'!$B$21=\"\",\"\", 'Report - Specimen #1'!$B$21)","v":"Report - Specimen #1"},{"$f":"IF('Report - Specimen #1'!$H$25=\"\",\"\",'Report - Specimen #1'!$H$25)","v":"Average"},{"$f":"IF('Report - Specimen #1'!$B$25=\"\",\"\",'Report - Specimen #1'!$B$25)","v":"Day No."},{"$f":"IF('Report - Specimen #1'!$B$27=\"\",\"\",'Report - Specimen #1'!$B$27)","v":2}]
[59,{"$f":"IF('Report - Specimen #1'!$H$28=\"\",\"\",'Report - Specimen #1'!$H$28)","v":""},{"$f":"IF('Report - Specimen #1'!$B$6=\"\",\"\",'Report - Specimen #1'!$B$6)","v":"Tex-144-E"},{"$f":"IF( 'Report - Specimen #1'!$B$21=\"\",\"\", 'Report - Specimen #1'!$B$21)","v":"Report - Specimen #1"},{"$f":"IF('Report - Specimen #1'!$H$25=\"\",\"\",'Report - Specimen #1'!$H$25)","v":"Average"},{"$f":"IF('Report - Specimen #1'!$B$25=\"\",\"\",'Report - Specimen #1'!$B$25)","v":"Day No."},{"$f":"IF('Report - Specimen #1'!$B$28=\"\",\"\",'Report - Specimen #1'!$B$28)","v":3}]
[60,{"$f":"IF('Report - Specimen #1'!$H$29=\"\",\"\",'Report - Specimen #1'!$H$29)","v":""},{"$f":"IF('Report - Specimen #1'!$B$6=\"\",\"\",'Report - Specimen #1'!$B$6)","v":"Tex-144-E"},{"$f":"IF( 'Report - Specimen #1'!$B$21=\"\",\"\", 'Report - Specimen #1'!$B$21)","v":"Report - Specimen #1"},{"$f":"IF('Report - Specimen #1'!$H$25=\"\",\"\",'Report - Specimen #1'!$H$25)","v":"Average"},{"$f":"IF('Report - Specimen #1'!$B$25=\"\",\"\",'Report - Specimen #1'!$B$25)","v":"Day No."},{"$f":"IF('Report - Specimen #1'!$B$29=\"\",\"\",'Report - Specimen #1'!$B$29)","v":4}]
[61,{"$f":"IF('Report - Specimen #1'!$H$30=\"\",\"\",'Report - Specimen #1'!$H$30)","v":""},{"$f":"IF('Report - Specimen #1'!$B$6=\"\",\"\",'Report - Specimen #1'!$B$6)","v":"Tex-144-E"},{"$f":"IF( 'Report - Specimen #1'!$B$21=\"\",\"\", 'Report - Specimen #1'!$B$21)","v":"Report - Specimen #1"},{"$f":"IF('Report - Specimen #1'!$H$25=\"\",\"\",'Report - Specimen #1'!$H$25)","v":"Average"},{"$f":"IF('Report - Specimen #1'!$B$25=\"\",\"\",'Report - Specimen #1'!$B$25)","v":"Day No."},{"$f":"IF('Report - Specimen #1'!$B$30=\"\",\"\",'Report - Specimen #1'!$B$30)","v":5}]
[62,{"$f":"IF('Report - Specimen #1'!$H$31=\"\",\"\",'Report - Specimen #1'!$H$31)","v":""},{"$f":"IF('Report - Specimen #1'!$B$6=\"\",\"\",'Report - Specimen #1'!$B$6)","v":"Tex-144-E"},{"$f":"IF( 'Report - Specimen #1'!$B$21=\"\",\"\", 'Report - Specimen #1'!$B$21)","v":"Report - Specimen #1"},{"$f":"IF('Report - Specimen #1'!$H$25=\"\",\"\",'Report - Specimen #1'!$H$25)","v":"Average"},{"$f":"IF('Report - Specimen #1'!$B$25=\"\",\"\",'Report - Specimen #1'!$B$25)","v":"Day No."},{"$f":"IF('Report - Specimen #1'!$B$31=\"\",\"\",'Report - Specimen #1'!$B$31)","v":6}]
[63,{"$f":"IF('Report - Specimen #1'!$H$32=\"\",\"\",'Report - Specimen #1'!$H$32)","v":""},{"$f":"IF('Report - Specimen #1'!$B$6=\"\",\"\",'Report - Specimen #1'!$B$6)","v":"Tex-144-E"},{"$f":"IF( 'Report - Specimen #1'!$B$21=\"\",\"\", 'Report - Specimen #1'!$B$21)","v":"Report - Specimen #1"},{"$f":"IF('Report - Specimen #1'!$H$25=\"\",\"\",'Report - Specimen #1'!$H$25)","v":"Average"},{"$f":"IF('Report - Specimen #1'!$B$25=\"\",\"\",'Report - Specimen #1'!$B$25)","v":"Day No."},{"$f":"IF('Report - Specimen #1'!$B$32=\"\",\"\",'Report - Specimen #1'!$B$32)","v":7}]
[64,{"$f":"IF('Report - Specimen #1'!$H$33=\"\",\"\",'Report - Specimen #1'!$H$33)","v":""},{"$f":"IF('Report - Specimen #1'!$B$6=\"\",\"\",'Report - Specimen #1'!$B$6)","v":"Tex-144-E"},{"$f":"IF( 'Report - Specimen #1'!$B$21=\"\",\"\", 'Report - Specimen #1'!$B$21)","v":"Report - Specimen #1"},{"$f":"IF('Report - Specimen #1'!$H$25=\"\",\"\",'Report - Specimen #1'!$H$25)","v":"Average"},{"$f":"IF('Report - Specimen #1'!$B$25=\"\",\"\",'Report - Specimen #1'!$B$25)","v":"Day No."},{"$f":"IF('Report - Specimen #1'!$B$33=\"\",\"\",'Report - Specimen #1'!$B$33)","v":8}]
[65,{"$f":"IF('Report - Specimen #1'!$H$34=\"\",\"\",'Report - Specimen #1'!$H$34)","v":""},{"$f":"IF('Report - Specimen #1'!$B$6=\"\",\"\",'Report - Specimen #1'!$B$6)","v":"Tex-144-E"},{"$f":"IF( 'Report - Specimen #1'!$B$21=\"\",\"\", 'Report - Specimen #1'!$B$21)","v":"Report - Specimen #1"},{"$f":"IF('Report - Specimen #1'!$H$25=\"\",\"\",'Report - Specimen #1'!$H$25)","v":"Average"},{"$f":"IF('Report - Specimen #1'!$B$25=\"\",\"\",'Report - Specimen #1'!$B$25)","v":"Day No."},{"$f":"IF('Report - Specimen #1'!$B$34=\"\",\"\",'Report - Specimen #1'!$B$34)","v":9}]
[66,{"$f":"IF('Report - Specimen #1'!$H$35=\"\",\"\",'Report - Specimen #1'!$H$35)","v":""},{"$f":"IF('Report - Specimen #1'!$B$6=\"\",\"\",'Report - Specimen #1'!$B$6)","v":"Tex-144-E"},{"$f":"IF( 'Report - Specimen #1'!$B$21=\"\",\"\", 'Report - Specimen #1'!$B$21)","v":"Report - Specimen #1"},{"$f":"IF('Report - Specimen #1'!$H$25=\"\",\"\",'Report - Specimen #1'!$H$25)","v":"Average"},{"$f":"IF('Report - Specimen #1'!$B$25=\"\",\"\",'Report - Specimen #1'!$B$25)","v":"Day No."},{"$f":"IF('Report - Specimen #1'!$B$35=\"\",\"\",'Report - Specimen #1'!$B$35)","v":10}]
[67,{"$f":"IF('Report - Specimen #1'!$H$36=\"\",\"\",'Report - Specimen #1'!$H$36)","v":""},{"$f":"IF('Report - Specimen #1'!$B$6=\"\",\"\",'Report - Specimen #1'!$B$6)","v":"Tex-144-E"},{"$f":"IF( 'Report - Specimen #1'!$B$21=\"\",\"\", 'Report - Specimen #1'!$B$21)","v":"Report - Specimen #1"},{"$f":"IF('Report - Specimen #1'!$H$25=\"\",\"\",'Report - Specimen #1'!$H$25)","v":"Average"}]
[68,{"$f":"IF('Report - Specimen #1'!$C$39=\"\",\"\",'Report - Specimen #1'!$C$39)","v":""},{"$f":"IF('Report - Specimen #1'!$B$6=\"\",\"\",'Report - Specimen #1'!$B$6)","v":"Tex-144-E"},{"$f":"IF( 'Report - Specimen #1'!$B$21=\"\",\"\", 'Report - Specimen #1'!$B$21)","v":"Report - Specimen #1"},{"$f":"IF('Report - Specimen #1'!$B$39=\"\",\"\",'Report - Specimen #1'!$B$39)","v":"Specimen Wet Wt."}]
[69,{"$f":"IF('Report - Specimen #1'!$C$40=\"\",\"\",'Report - Specimen #1'!$C$40)","v":""},{"$f":"IF('Report - Specimen #1'!$B$6=\"\",\"\",'Report - Specimen #1'!$B$6)","v":"Tex-144-E"},{"$f":"IF( 'Report - Specimen #1'!$B$21=\"\",\"\", 'Report - Specimen #1'!$B$21)","v":"Report - Specimen #1"},{"$f":"IF('Report - Specimen #1'!$B$40=\"\",\"\",'Report - Specimen #1'!$B$40)","v":"Specimen Height"}]
[70,{"$f":"IF('Report - Specimen #1'!$C$41=\"\",\"\",'Report - Specimen #1'!$C$41)","v":""},{"$f":"IF('Report - Specimen #1'!$B$6=\"\",\"\",'Report - Specimen #1'!$B$6)","v":"Tex-144-E"},{"$f":"IF( 'Report - Specimen #1'!$B$21=\"\",\"\", 'Report - Specimen #1'!$B$21)","v":"Report - Specimen #1"},{"$f":"IF('Report - Specimen #1'!$B$41=\"\",\"\",'Report - Specimen #1'!$B$41)","v":"Dry Soil Wt."}]
[71,{"$f":"IF('Report - Specimen #1'!$C$42=\"\",\"\",'Report - Specimen #1'!$C$42)","v":""},{"$f":"IF('Report - Specimen #1'!$B$6=\"\",\"\",'Report - Specimen #1'!$B$6)","v":"Tex-144-E"},{"$f":"IF( 'Report - Specimen #1'!$B$21=\"\",\"\", 'Report - Specimen #1'!$B$21)","v":"Report - Specimen #1"},{"$f":"IF('Report - Specimen #1'!$B$42=\"\",\"\",'Report - Specimen #1'!$B$42)","v":"Two Stones Wt."}]
[72,{"$f":"IF('Report - Specimen #1'!$C$43=\"\",\"\",'Report - Specimen #1'!$C$43)","v":""},{"$f":"IF('Report - Specimen #1'!$B$6=\"\",\"\",'Report - Specimen #1'!$B$6)","v":"Tex-144-E"},{"$f":"IF( 'Report - Specimen #1'!$B$21=\"\",\"\", 'Report - Specimen #1'!$B$21)","v":"Report - Specimen #1"},{"$f":"IF('Report - Specimen #1'!$B$43=\"\",\"\",'Report - Specimen #1'!$B$43)","v":"MCCOMPACT:"}]
[73,{"$f":"IF('Report - Specimen #1'!$C$44=\"\",\"\",'Report - Specimen #1'!$C$44)","v":""},{"$f":"IF('Report - Specimen #1'!$B$6=\"\",\"\",'Report - Specimen #1'!$B$6)","v":"Tex-144-E"},{"$f":"IF( 'Report - Specimen #1'!$B$21=\"\",\"\", 'Report - Specimen #1'!$B$21)","v":"Report - Specimen #1"},{"$f":"IF('Report - Specimen #1'!$B$44=\"\",\"\",'Report - Specimen #1'!$B$44)","v":"Dry Density:"}]
[74,{"$f":"IF('Report - Specimen #1'!$C$45=\"\",\"\",'Report - Specimen #1'!$C$45)","v":""},{"$f":"IF('Report - Specimen #1'!$B$6=\"\",\"\",'Report - Specimen #1'!$B$6)","v":"Tex-144-E"},{"$f":"IF( 'Report - Specimen #1'!$B$21=\"\",\"\", 'Report - Specimen #1'!$B$21)","v":"Report - Specimen #1"},{"$f":"IF('Report - Specimen #1'!$B$45=\"\",\"\",'Report - Specimen #1'!$B$45)","v":"UCOMPACT:"}]
[75,{"$f":"IF('Report - Specimen #1'!$F$39=\"\",\"\",'Report - Specimen #1'!$F$39)","v":""},{"$f":"IF('Report - Specimen #1'!$B$6=\"\",\"\",'Report - Specimen #1'!$B$6)","v":"Tex-144-E"},{"$f":"IF( 'Report - Specimen #1'!$B$21=\"\",\"\", 'Report - Specimen #1'!$B$21)","v":"Report - Specimen #1"},{"$f":"IF('Report - Specimen #1'!$E$39=\"\",\"\",'Report - Specimen #1'!$E$39)","v":"Specimen Dry Wt."}]
[76,{"$f":"IF('Report - Specimen #1'!$F$40=\"\",\"\",'Report - Specimen #1'!$F$40)","v":""},{"$f":"IF('Report - Specimen #1'!$B$6=\"\",\"\",'Report - Specimen #1'!$B$6)","v":"Tex-144-E"},{"$f":"IF( 'Report - Specimen #1'!$B$21=\"\",\"\", 'Report - Specimen #1'!$B$21)","v":"Report - Specimen #1"},{"$f":"IF('Report - Specimen #1'!$E$40=\"\",\"\",'Report - Specimen #1'!$E$40)","v":"Dry Soil Wt."}]
[77,{"$f":"IF('Report - Specimen #1'!$F$41=\"\",\"\",'Report - Specimen #1'!$F$41)","v":""},{"$f":"IF('Report - Specimen #1'!$B$6=\"\",\"\",'Report - Specimen #1'!$B$6)","v":"Tex-144-E"},{"$f":"IF( 'Report - Specimen #1'!$B$21=\"\",\"\", 'Report - Specimen #1'!$B$21)","v":"Report - Specimen #1"},{"$f":"IF('Report - Specimen #1'!$E$41=\"\",\"\",'Report - Specimen #1'!$E$41)","v":"Two Stones Wt."}]
[78,{"$f":"IF('Report - Specimen #1'!$F$43=\"\",\"\",'Report - Specimen #1'!$F$43)","v":""},{"$f":"IF('Report - Specimen #1'!$B$6=\"\",\"\",'Report - Specimen #1'!$B$6)","v":"Tex-144-E"},{"$f":"IF( 'Report - Specimen #1'!$B$21=\"\",\"\", 'Report - Specimen #1'!$B$21)","v":"Report - Specimen #1"},{"$f":"IF('Report - Specimen #1'!$E$43=\"\",\"\",'Report - Specimen #1'!$E$43)","v":"MCINITIAL:"}]
[79,{"$f":"IF('Report - Specimen #1'!$I$39=\"\",\"\",'Report - Specimen #1'!$I$39)","v":""},{"$f":"IF('Report - Specimen #1'!$B$6=\"\",\"\",'Report - Specimen #1'!$B$6)","v":"Tex-144-E"},{"$f":"IF( 'Report - Specimen #1'!$B$21=\"\",\"\", 'Report - Specimen #1'!$B$21)","v":"Report - Specimen #1"},{"$f":"IF('Report - Specimen #1'!$H$39=\"\",\"\",'Report - Specimen #1'!$H$39)","v":"Soaked Specimen Wt."}]
[80,{"$f":"IF('Report - Specimen #1'!$I$40=\"\",\"\",'Report - Specimen #1'!$I$40)","v":""},{"$f":"IF('Report - Specimen #1'!$B$6=\"\",\"\",'Report - Specimen #1'!$B$6)","v":"Tex-144-E"},{"$f":"IF( 'Report - Specimen #1'!$B$21=\"\",\"\", 'Report - Specimen #1'!$B$21)","v":"Report - Specimen #1"},{"$f":"IF('Report - Specimen #1'!$H$40=\"\",\"\",'Report - Specimen #1'!$H$40)","v":"Dry Soil Wt."}]
[81,{"$f":"IF('Report - Specimen #1'!$I$41=\"\",\"\",'Report - Specimen #1'!$I$41)","v":""},{"$f":"IF('Report - Specimen #1'!$B$6=\"\",\"\",'Report - Specimen #1'!$B$6)","v":"Tex-144-E"},{"$f":"IF( 'Report - Specimen #1'!$B$21=\"\",\"\", 'Report - Specimen #1'!$B$21)","v":"Report - Specimen #1"},{"$f":"IF('Report - Specimen #1'!$H$41=\"\",\"\",'Report - Specimen #1'!$H$41)","v":"Pan Wt."}]
[82,{"$f":"IF('Report - Specimen #1'!$I$43=\"\",\"\",'Report - Specimen #1'!$I$43)","v":""},{"$f":"IF('Report - Specimen #1'!$B$6=\"\",\"\",'Report - Specimen #1'!$B$6)","v":"Tex-144-E"},{"$f":"IF( 'Report - Specimen #1'!$B$21=\"\",\"\", 'Report - Specimen #1'!$B$21)","v":"Report - Specimen #1"},{"$f":"IF('Report - Specimen #1'!$H$43=\"\",\"\",'Report - Specimen #1'!$H$43)","v":"MCFINAL:"}]
[83,{"$f":"IF('Report - Specimen #1'!$I$44=\"\",\"\",'Report - Specimen #1'!$I$44)","v":""},{"$f":"IF('Report - Specimen #1'!$B$6=\"\",\"\",'Report - Specimen #1'!$B$6)","v":"Tex-144-E"},{"$f":"IF( 'Report - Specimen #1'!$B$21=\"\",\"\", 'Report - Specimen #1'!$B$21)","v":"Report - Specimen #1"},{"$f":"IF('Report - Specimen #1'!$H$44=\"\",\"\",'Report - Specimen #1'!$H$44)","v":"URET:"}]
[84,{"$f":"IF('Report - Specimen #1'!$I$45=\"\",\"\",'Report - Specimen #1'!$I$45)","v":""},{"$f":"IF('Report - Specimen #1'!$B$6=\"\",\"\",'Report - Specimen #1'!$B$6)","v":"Tex-144-E"},{"$f":"IF( 'Report - Specimen #1'!$B$21=\"\",\"\", 'Report - Specimen #1'!$B$21)","v":"Report - Specimen #1"},{"$f":"IF('Report - Specimen #1'!$H$45=\"\",\"\",'Report - Specimen #1'!$H$45)","v":"R:"}]
[85,{"$f":"IF('Report - Specimen #2'!$D$23=\"\",\"\",'Report - Specimen #2'!$D$23)","v":""},{"$f":"IF('Report - Specimen #2'!$B$6=\"\",\"\",'Report - Specimen #2'!$B$6)","v":"Tex-144-E"},{"$f":"IF( 'Report - Specimen #2'!$B$21=\"\",\"\", 'Report - Specimen #2'!$B$21)","v":"Report - Specimen #2"},{"$f":"IF('Report - Specimen #2'!$B$23=\"\",\"\",'Report - Specimen #2'!$B$23)","v":"Optimum MC (%):"}]
[86,{"$f":"IF('Report - Specimen #2'!$H$23=\"\",\"\",'Report - Specimen #2'!$H$23)","v":""},{"$f":"IF('Report - Specimen #2'!$B$6=\"\",\"\",'Report - Specimen #2'!$B$6)","v":"Tex-144-E"},{"$f":"IF( 'Report - Specimen #2'!$B$21=\"\",\"\", 'Report - Specimen #2'!$B$21)","v":"Report - Specimen #2"},{"$f":"IF('Report - Specimen #2'!$F$23=\"\",\"\",'Report - Specimen #2'!$F$23)","v":"Max. Dry Density (pcf):"}]
[87,{"$f":"IF('Report - Specimen #2'!$C$26=\"\",\"\",'Report - Specimen #2'!$C$26)","v":""},{"$f":"IF('Report - Specimen #2'!$B$6=\"\",\"\",'Report - Specimen #2'!$B$6)","v":"Tex-144-E"},{"$f":"IF( 'Report - Specimen #2'!$B$21=\"\",\"\", 'Report - Specimen #2'!$B$21)","v":"Report - Specimen #2"},{"$f":"IF('Report - Specimen #2'!$C$25=\"\",\"\",'Report - Specimen #2'!$C$25)","v":"Reading 1"},{"$f":"IF('Report - Specimen #2'!$B$25=\"\",\"\",'Report - Specimen #2'!$B$25)","v":"Day No."},{"$f":"IF('Report - Specimen #2'!$B$26=\"\",\"\",'Report - Specimen #2'!$B$26)","v":1}]
[88,{"$f":"IF('Report - Specimen #2'!$C$27=\"\",\"\",'Report - Specimen #2'!$C$27)","v":""},{"$f":"IF('Report - Specimen #2'!$B$6=\"\",\"\",'Report - Specimen #2'!$B$6)","v":"Tex-144-E"},{"$f":"IF( 'Report - Specimen #2'!$B$21=\"\",\"\", 'Report - Specimen #2'!$B$21)","v":"Report - Specimen #2"},{"$f":"IF('Report - Specimen #2'!$C$25=\"\",\"\",'Report - Specimen #2'!$C$25)","v":"Reading 1"},{"$f":"IF('Report - Specimen #2'!$B$25=\"\",\"\",'Report - Specimen #2'!$B$25)","v":"Day No."},{"$f":"IF('Report - Specimen #2'!$B$27=\"\",\"\",'Report - Specimen #2'!$B$27)","v":2}]
[89,{"$f":"IF('Report - Specimen #2'!$C$28=\"\",\"\",'Report - Specimen #2'!$C$28)","v":""},{"$f":"IF('Report - Specimen #2'!$B$6=\"\",\"\",'Report - Specimen #2'!$B$6)","v":"Tex-144-E"},{"$f":"IF( 'Report - Specimen #2'!$B$21=\"\",\"\", 'Report - Specimen #2'!$B$21)","v":"Report - Specimen #2"},{"$f":"IF('Report - Specimen #2'!$C$25=\"\",\"\",'Report - Specimen #2'!$C$25)","v":"Reading 1"},{"$f":"IF('Report - Specimen #2'!$B$25=\"\",\"\",'Report - Specimen #2'!$B$25)","v":"Day No."},{"$f":"IF('Report - Specimen #2'!$B$28=\"\",\"\",'Report - Specimen #2'!$B$28)","v":3}]
[90,{"$f":"IF('Report - Specimen #2'!$C$29=\"\",\"\",'Report - Specimen #2'!$C$29)","v":""},{"$f":"IF('Report - Specimen #2'!$B$6=\"\",\"\",'Report - Specimen #2'!$B$6)","v":"Tex-144-E"},{"$f":"IF( 'Report - Specimen #2'!$B$21=\"\",\"\", 'Report - Specimen #2'!$B$21)","v":"Report - Specimen #2"},{"$f":"IF('Report - Specimen #2'!$C$25=\"\",\"\",'Report - Specimen #2'!$C$25)","v":"Reading 1"},{"$f":"IF('Report - Specimen #2'!$B$25=\"\",\"\",'Report - Specimen #2'!$B$25)","v":"Day No."},{"$f":"IF('Report - Specimen #2'!$B$29=\"\",\"\",'Report - Specimen #2'!$B$29)","v":4}]
[91,{"$f":"IF('Report - Specimen #2'!$C$30=\"\",\"\",'Report - Specimen #2'!$C$30)","v":""},{"$f":"IF('Report - Specimen #2'!$B$6=\"\",\"\",'Report - Specimen #2'!$B$6)","v":"Tex-144-E"},{"$f":"IF( 'Report - Specimen #2'!$B$21=\"\",\"\", 'Report - Specimen #2'!$B$21)","v":"Report - Specimen #2"},{"$f":"IF('Report - Specimen #2'!$C$25=\"\",\"\",'Report - Specimen #2'!$C$25)","v":"Reading 1"},{"$f":"IF('Report - Specimen #2'!$B$25=\"\",\"\",'Report - Specimen #2'!$B$25)","v":"Day No."},{"$f":"IF('Report - Specimen #2'!$B$30=\"\",\"\",'Report - Specimen #2'!$B$30)","v":5}]
[92,{"$f":"IF('Report - Specimen #2'!$C$31=\"\",\"\",'Report - Specimen #2'!$C$31)","v":""},{"$f":"IF('Report - Specimen #2'!$B$6=\"\",\"\",'Report - Specimen #2'!$B$6)","v":"Tex-144-E"},{"$f":"IF( 'Report - Specimen #2'!$B$21=\"\",\"\", 'Report - Specimen #2'!$B$21)","v":"Report - Specimen #2"},{"$f":"IF('Report - Specimen #2'!$C$25=\"\",\"\",'Report - Specimen #2'!$C$25)","v":"Reading 1"},{"$f":"IF('Report - Specimen #2'!$B$25=\"\",\"\",'Report - Specimen #2'!$B$25)","v":"Day No."},{"$f":"IF('Report - Specimen #2'!$B$31=\"\",\"\",'Report - Specimen #2'!$B$31)","v":6}]
[93,{"$f":"IF('Report - Specimen #2'!$C$32=\"\",\"\",'Report - Specimen #2'!$C$32)","v":""},{"$f":"IF('Report - Specimen #2'!$B$6=\"\",\"\",'Report - Specimen #2'!$B$6)","v":"Tex-144-E"},{"$f":"IF( 'Report - Specimen #2'!$B$21=\"\",\"\", 'Report - Specimen #2'!$B$21)","v":"Report - Specimen #2"},{"$f":"IF('Report - Specimen #2'!$C$25=\"\",\"\",'Report - Specimen #2'!$C$25)","v":"Reading 1"},{"$f":"IF('Report - Specimen #2'!$B$25=\"\",\"\",'Report - Specimen #2'!$B$25)","v":"Day No."},{"$f":"IF('Report - Specimen #2'!$B$32=\"\",\"\",'Report - Specimen #2'!$B$32)","v":7}]
[94,{"$f":"IF('Report - Specimen #2'!$C$33=\"\",\"\",'Report - Specimen #2'!$C$33)","v":""},{"$f":"IF('Report - Specimen #2'!$B$6=\"\",\"\",'Report - Specimen #2'!$B$6)","v":"Tex-144-E"},{"$f":"IF( 'Report - Specimen #2'!$B$21=\"\",\"\", 'Report - Specimen #2'!$B$21)","v":"Report - Specimen #2"},{"$f":"IF('Report - Specimen #2'!$C$25=\"\",\"\",'Report - Specimen #2'!$C$25)","v":"Reading 1"},{"$f":"IF('Report - Specimen #2'!$B$25=\"\",\"\",'Report - Specimen #2'!$B$25)","v":"Day No."},{"$f":"IF('Report - Specimen #2'!$B$33=\"\",\"\",'Report - Specimen #2'!$B$33)","v":8}]
[95,{"$f":"IF('Report - Specimen #2'!$C$34=\"\",\"\",'Report - Specimen #2'!$C$34)","v":""},{"$f":"IF('Report - Specimen #2'!$B$6=\"\",\"\",'Report - Specimen #2'!$B$6)","v":"Tex-144-E"},{"$f":"IF( 'Report - Specimen #2'!$B$21=\"\",\"\", 'Report - Specimen #2'!$B$21)","v":"Report - Specimen #2"},{"$f":"IF('Report - Specimen #2'!$C$25=\"\",\"\",'Report - Specimen #2'!$C$25)","v":"Reading 1"},{"$f":"IF('Report - Specimen #2'!$B$25=\"\",\"\",'Report - Specimen #2'!$B$25)","v":"Day No."},{"$f":"IF('Report - Specimen #2'!$B$34=\"\",\"\",'Report - Specimen #2'!$B$34)","v":9}]
[96,{"$f":"IF('Report - Specimen #2'!$C$35=\"\",\"\",'Report - Specimen #2'!$C$35)","v":""},{"$f":"IF('Report - Specimen #2'!$B$6=\"\",\"\",'Report - Specimen #2'!$B$6)","v":"Tex-144-E"},{"$f":"IF( 'Report - Specimen #2'!$B$21=\"\",\"\", 'Report - Specimen #2'!$B$21)","v":"Report - Specimen #2"},{"$f":"IF('Report - Specimen #2'!$C$25=\"\",\"\",'Report - Specimen #2'!$C$25)","v":"Reading 1"},{"$f":"IF('Report - Specimen #2'!$B$25=\"\",\"\",'Report - Specimen #2'!$B$25)","v":"Day No."},{"$f":"IF('Report - Specimen #2'!$B$35=\"\",\"\",'Report - Specimen #2'!$B$35)","v":10}]
[97,{"$f":"IF('Report - Specimen #2'!$D$26=\"\",\"\",'Report - Specimen #2'!$D$26)","v":""},{"$f":"IF('Report - Specimen #2'!$B$6=\"\",\"\",'Report - Specimen #2'!$B$6)","v":"Tex-144-E"},{"$f":"IF( 'Report - Specimen #2'!$B$21=\"\",\"\", 'Report - Specimen #2'!$B$21)","v":"Report - Specimen #2"},{"$f":"IF('Report - Specimen #2'!$D$25=\"\",\"\",'Report - Specimen #2'!$D$25)","v":"Reading 2"},{"$f":"IF('Report - Specimen #2'!$B$25=\"\",\"\",'Report - Specimen #2'!$B$25)","v":"Day No."},{"$f":"IF('Report - Specimen #2'!$B$26=\"\",\"\",'Report - Specimen #2'!$B$26)","v":1}]
[98,{"$f":"IF('Report - Specimen #2'!$D$27=\"\",\"\",'Report - Specimen #2'!$D$27)","v":""},{"$f":"IF('Report - Specimen #2'!$B$6=\"\",\"\",'Report - Specimen #2'!$B$6)","v":"Tex-144-E"},{"$f":"IF( 'Report - Specimen #2'!$B$21=\"\",\"\", 'Report - Specimen #2'!$B$21)","v":"Report - Specimen #2"},{"$f":"IF('Report - Specimen #2'!$D$25=\"\",\"\",'Report - Specimen #2'!$D$25)","v":"Reading 2"},{"$f":"IF('Report - Specimen #2'!$B$25=\"\",\"\",'Report - Specimen #2'!$B$25)","v":"Day No."},{"$f":"IF('Report - Specimen #2'!$B$27=\"\",\"\",'Report - Specimen #2'!$B$27)","v":2}]
[99,{"$f":"IF('Report - Specimen #2'!$D$28=\"\",\"\",'Report - Specimen #2'!$D$28)","v":""},{"$f":"IF('Report - Specimen #2'!$B$6=\"\",\"\",'Report - Specimen #2'!$B$6)","v":"Tex-144-E"},{"$f":"IF( 'Report - Specimen #2'!$B$21=\"\",\"\", 'Report - Specimen #2'!$B$21)","v":"Report - Specimen #2"},{"$f":"IF('Report - Specimen #2'!$D$25=\"\",\"\",'Report - Specimen #2'!$D$25)","v":"Reading 2"},{"$f":"IF('Report - Specimen #2'!$B$25=\"\",\"\",'Report - Specimen #2'!$B$25)","v":"Day No."},{"$f":"IF('Report - Specimen #2'!$B$28=\"\",\"\",'Report - Specimen #2'!$B$28)","v":3}]
[100,{"$f":"IF('Report - Specimen #2'!$D$29=\"\",\"\",'Report - Specimen #2'!$D$29)","v":""},{"$f":"IF('Report - Specimen #2'!$B$6=\"\",\"\",'Report - Specimen #2'!$B$6)","v":"Tex-144-E"},{"$f":"IF( 'Report - Specimen #2'!$B$21=\"\",\"\", 'Report - Specimen #2'!$B$21)","v":"Report - Specimen #2"},{"$f":"IF('Report - Specimen #2'!$D$25=\"\",\"\",'Report - Specimen #2'!$D$25)","v":"Reading 2"},{"$f":"IF('Report - Specimen #2'!$B$25=\"\",\"\",'Report - Specimen #2'!$B$25)","v":"Day No."},{"$f":"IF('Report - Specimen #2'!$B$29=\"\",\"\",'Report - Specimen #2'!$B$29)","v":4}]
[101,{"$f":"IF('Report - Specimen #2'!$D$30=\"\",\"\",'Report - Specimen #2'!$D$30)","v":""},{"$f":"IF('Report - Specimen #2'!$B$6=\"\",\"\",'Report - Specimen #2'!$B$6)","v":"Tex-144-E"},{"$f":"IF( 'Report - Specimen #2'!$B$21=\"\",\"\", 'Report - Specimen #2'!$B$21)","v":"Report - Specimen #2"},{"$f":"IF('Report - Specimen #2'!$D$25=\"\",\"\",'Report - Specimen #2'!$D$25)","v":"Reading 2"},{"$f":"IF('Report - Specimen #2'!$B$25=\"\",\"\",'Report - Specimen #2'!$B$25)","v":"Day No."},{"$f":"IF('Report - Specimen #2'!$B$30=\"\",\"\",'Report - Specimen #2'!$B$30)","v":5}]
[102,{"$f":"IF('Report - Specimen #2'!$D$31=\"\",\"\",'Report - Specimen #2'!$D$31)","v":""},{"$f":"IF('Report - Specimen #2'!$B$6=\"\",\"\",'Report - Specimen #2'!$B$6)","v":"Tex-144-E"},{"$f":"IF( 'Report - Specimen #2'!$B$21=\"\",\"\", 'Report - Specimen #2'!$B$21)","v":"Report - Specimen #2"},{"$f":"IF('Report - Specimen #2'!$D$25=\"\",\"\",'Report - Specimen #2'!$D$25)","v":"Reading 2"},{"$f":"IF('Report - Specimen #2'!$B$25=\"\",\"\",'Report - Specimen #2'!$B$25)","v":"Day No."},{"$f":"IF('Report - Specimen #2'!$B$31=\"\",\"\",'Report - Specimen #2'!$B$31)","v":6}]
[103,{"$f":"IF('Report - Specimen #2'!$D$32=\"\",\"\",'Report - Specimen #2'!$D$32)","v":""},{"$f":"IF('Report - Specimen #2'!$B$6=\"\",\"\",'Report - Specimen #2'!$B$6)","v":"Tex-144-E"},{"$f":"IF( 'Report - Specimen #2'!$B$21=\"\",\"\", 'Report - Specimen #2'!$B$21)","v":"Report - Specimen #2"},{"$f":"IF('Report - Specimen #2'!$D$25=\"\",\"\",'Report - Specimen #2'!$D$25)","v":"Reading 2"},{"$f":"IF('Report - Specimen #2'!$B$25=\"\",\"\",'Report - Specimen #2'!$B$25)","v":"Day No."},{"$f":"IF('Report - Specimen #2'!$B$32=\"\",\"\",'Report - Specimen #2'!$B$32)","v":7}]
[104,{"$f":"IF('Report - Specimen #2'!$D$33=\"\",\"\",'Report - Specimen #2'!$D$33)","v":""},{"$f":"IF('Report - Specimen #2'!$B$6=\"\",\"\",'Report - Specimen #2'!$B$6)","v":"Tex-144-E"},{"$f":"IF( 'Report - Specimen #2'!$B$21=\"\",\"\", 'Report - Specimen #2'!$B$21)","v":"Report - Specimen #2"},{"$f":"IF('Report - Specimen #2'!$D$25=\"\",\"\",'Report - Specimen #2'!$D$25)","v":"Reading 2"},{"$f":"IF('Report - Specimen #2'!$B$25=\"\",\"\",'Report - Specimen #2'!$B$25)","v":"Day No."},{"$f":"IF('Report - Specimen #2'!$B$33=\"\",\"\",'Report - Specimen #2'!$B$33)","v":8}]
[105,{"$f":"IF('Report - Specimen #2'!$D$34=\"\",\"\",'Report - Specimen #2'!$D$34)","v":""},{"$f":"IF('Report - Specimen #2'!$B$6=\"\",\"\",'Report - Specimen #2'!$B$6)","v":"Tex-144-E"},{"$f":"IF( 'Report - Specimen #2'!$B$21=\"\",\"\", 'Report - Specimen #2'!$B$21)","v":"Report - Specimen #2"},{"$f":"IF('Report - Specimen #2'!$D$25=\"\",\"\",'Report - Specimen #2'!$D$25)","v":"Reading 2"},{"$f":"IF('Report - Specimen #2'!$B$25=\"\",\"\",'Report - Specimen #2'!$B$25)","v":"Day No."},{"$f":"IF('Report - Specimen #2'!$B$34=\"\",\"\",'Report - Specimen #2'!$B$34)","v":9}]
[106,{"$f":"IF('Report - Specimen #2'!$D$35=\"\",\"\",'Report - Specimen #2'!$D$35)","v":""},{"$f":"IF('Report - Specimen #2'!$B$6=\"\",\"\",'Report - Specimen #2'!$B$6)","v":"Tex-144-E"},{"$f":"IF( 'Report - Specimen #2'!$B$21=\"\",\"\", 'Report - Specimen #2'!$B$21)","v":"Report - Specimen #2"},{"$f":"IF('Report - Specimen #2'!$D$25=\"\",\"\",'Report - Specimen #2'!$D$25)","v":"Reading 2"},{"$f":"IF('Report - Specimen #2'!$B$25=\"\",\"\",'Report - Specimen #2'!$B$25)","v":"Day No."},{"$f":"IF('Report - Specimen #2'!$B$35=\"\",\"\",'Report - Specimen #2'!$B$35)","v":10}]
[107,{"$f":"IF('Report - Specimen #2'!$E$26=\"\",\"\",'Report - Specimen #2'!$E$26)","v":""},{"$f":"IF('Report - Specimen #2'!$B$6=\"\",\"\",'Report - Specimen #2'!$B$6)","v":"Tex-144-E"},{"$f":"IF( 'Report - Specimen #2'!$B$21=\"\",\"\", 'Report - Specimen #2'!$B$21)","v":"Report - Specimen #2"},{"$f":"IF('Report - Specimen #2'!$E$25=\"\",\"\",'Report - Specimen #2'!$E$25)","v":"Reading 3"},{"$f":"IF('Report - Specimen #2'!$B$25=\"\",\"\",'Report - Specimen #2'!$B$25)","v":"Day No."},{"$f":"IF('Report - Specimen #2'!$B$26=\"\",\"\",'Report - Specimen #2'!$B$26)","v":1}]
[108,{"$f":"IF('Report - Specimen #2'!$E$27=\"\",\"\",'Report - Specimen #2'!$E$27)","v":""},{"$f":"IF('Report - Specimen #2'!$B$6=\"\",\"\",'Report - Specimen #2'!$B$6)","v":"Tex-144-E"},{"$f":"IF( 'Report - Specimen #2'!$B$21=\"\",\"\", 'Report - Specimen #2'!$B$21)","v":"Report - Specimen #2"},{"$f":"IF('Report - Specimen #2'!$E$25=\"\",\"\",'Report - Specimen #2'!$E$25)","v":"Reading 3"},{"$f":"IF('Report - Specimen #2'!$B$25=\"\",\"\",'Report - Specimen #2'!$B$25)","v":"Day No."},{"$f":"IF('Report - Specimen #2'!$B$27=\"\",\"\",'Report - Specimen #2'!$B$27)","v":2}]
[109,{"$f":"IF('Report - Specimen #2'!$E$28=\"\",\"\",'Report - Specimen #2'!$E$28)","v":""},{"$f":"IF('Report - Specimen #2'!$B$6=\"\",\"\",'Report - Specimen #2'!$B$6)","v":"Tex-144-E"},{"$f":"IF( 'Report - Specimen #2'!$B$21=\"\",\"\", 'Report - Specimen #2'!$B$21)","v":"Report - Specimen #2"},{"$f":"IF('Report - Specimen #2'!$E$25=\"\",\"\",'Report - Specimen #2'!$E$25)","v":"Reading 3"},{"$f":"IF('Report - Specimen #2'!$B$25=\"\",\"\",'Report - Specimen #2'!$B$25)","v":"Day No."},{"$f":"IF('Report - Specimen #2'!$B$28=\"\",\"\",'Report - Specimen #2'!$B$28)","v":3}]
[110,{"$f":"IF('Report - Specimen #2'!$E$29=\"\",\"\",'Report - Specimen #2'!$E$29)","v":""},{"$f":"IF('Report - Specimen #2'!$B$6=\"\",\"\",'Report - Specimen #2'!$B$6)","v":"Tex-144-E"},{"$f":"IF( 'Report - Specimen #2'!$B$21=\"\",\"\", 'Report - Specimen #2'!$B$21)","v":"Report - Specimen #2"},{"$f":"IF('Report - Specimen #2'!$E$25=\"\",\"\",'Report - Specimen #2'!$E$25)","v":"Reading 3"},{"$f":"IF('Report - Specimen #2'!$B$25=\"\",\"\",'Report - Specimen #2'!$B$25)","v":"Day No."},{"$f":"IF('Report - Specimen #2'!$B$29=\"\",\"\",'Report - Specimen #2'!$B$29)","v":4}]
[111,{"$f":"IF('Report - Specimen #2'!$E$30=\"\",\"\",'Report - Specimen #2'!$E$30)","v":""},{"$f":"IF('Report - Specimen #2'!$B$6=\"\",\"\",'Report - Specimen #2'!$B$6)","v":"Tex-144-E"},{"$f":"IF( 'Report - Specimen #2'!$B$21=\"\",\"\", 'Report - Specimen #2'!$B$21)","v":"Report - Specimen #2"},{"$f":"IF('Report - Specimen #2'!$E$25=\"\",\"\",'Report - Specimen #2'!$E$25)","v":"Reading 3"},{"$f":"IF('Report - Specimen #2'!$B$25=\"\",\"\",'Report - Specimen #2'!$B$25)","v":"Day No."},{"$f":"IF('Report - Specimen #2'!$B$30=\"\",\"\",'Report - Specimen #2'!$B$30)","v":5}]
[112,{"$f":"IF('Report - Specimen #2'!$E$31=\"\",\"\",'Report - Specimen #2'!$E$31)","v":""},{"$f":"IF('Report - Specimen #2'!$B$6=\"\",\"\",'Report - Specimen #2'!$B$6)","v":"Tex-144-E"},{"$f":"IF( 'Report - Specimen #2'!$B$21=\"\",\"\", 'Report - Specimen #2'!$B$21)","v":"Report - Specimen #2"},{"$f":"IF('Report - Specimen #2'!$E$25=\"\",\"\",'Report - Specimen #2'!$E$25)","v":"Reading 3"},{"$f":"IF('Report - Specimen #2'!$B$25=\"\",\"\",'Report - Specimen #2'!$B$25)","v":"Day No."},{"$f":"IF('Report - Specimen #2'!$B$31=\"\",\"\",'Report - Specimen #2'!$B$31)","v":6}]
[113,{"$f":"IF('Report - Specimen #2'!$E$32=\"\",\"\",'Report - Specimen #2'!$E$32)","v":""},{"$f":"IF('Report - Specimen #2'!$B$6=\"\",\"\",'Report - Specimen #2'!$B$6)","v":"Tex-144-E"},{"$f":"IF( 'Report - Specimen #2'!$B$21=\"\",\"\", 'Report - Specimen #2'!$B$21)","v":"Report - Specimen #2"},{"$f":"IF('Report - Specimen #2'!$E$25=\"\",\"\",'Report - Specimen #2'!$E$25)","v":"Reading 3"},{"$f":"IF('Report - Specimen #2'!$B$25=\"\",\"\",'Report - Specimen #2'!$B$25)","v":"Day No."},{"$f":"IF('Report - Specimen #2'!$B$32=\"\",\"\",'Report - Specimen #2'!$B$32)","v":7}]
[114,{"$f":"IF('Report - Specimen #2'!$E$33=\"\",\"\",'Report - Specimen #2'!$E$33)","v":""},{"$f":"IF('Report - Specimen #2'!$B$6=\"\",\"\",'Report - Specimen #2'!$B$6)","v":"Tex-144-E"},{"$f":"IF( 'Report - Specimen #2'!$B$21=\"\",\"\", 'Report - Specimen #2'!$B$21)","v":"Report - Specimen #2"},{"$f":"IF('Report - Specimen #2'!$E$25=\"\",\"\",'Report - Specimen #2'!$E$25)","v":"Reading 3"},{"$f":"IF('Report - Specimen #2'!$B$25=\"\",\"\",'Report - Specimen #2'!$B$25)","v":"Day No."},{"$f":"IF('Report - Specimen #2'!$B$33=\"\",\"\",'Report - Specimen #2'!$B$33)","v":8}]
[115,{"$f":"IF('Report - Specimen #2'!$E$34=\"\",\"\",'Report - Specimen #2'!$E$34)","v":""},{"$f":"IF('Report - Specimen #2'!$B$6=\"\",\"\",'Report - Specimen #2'!$B$6)","v":"Tex-144-E"},{"$f":"IF( 'Report - Specimen #2'!$B$21=\"\",\"\", 'Report - Specimen #2'!$B$21)","v":"Report - Specimen #2"},{"$f":"IF('Report - Specimen #2'!$E$25=\"\",\"\",'Report - Specimen #2'!$E$25)","v":"Reading 3"},{"$f":"IF('Report - Specimen #2'!$B$25=\"\",\"\",'Report - Specimen #2'!$B$25)","v":"Day No."},{"$f":"IF('Report - Specimen #2'!$B$34=\"\",\"\",'Report - Specimen #2'!$B$34)","v":9}]
[116,{"$f":"IF('Report - Specimen #2'!$E$35=\"\",\"\",'Report - Specimen #2'!$E$35)","v":""},{"$f":"IF('Report - Specimen #2'!$B$6=\"\",\"\",'Report - Specimen #2'!$B$6)","v":"Tex-144-E"},{"$f":"IF( 'Report - Specimen #2'!$B$21=\"\",\"\", 'Report - Specimen #2'!$B$21)","v":"Report - Specimen #2"},{"$f":"IF('Report - Specimen #2'!$E$25=\"\",\"\",'Report - Specimen #2'!$E$25)","v":"Reading 3"},{"$f":"IF('Report - Specimen #2'!$B$25=\"\",\"\",'Report - Specimen #2'!$B$25)","v":"Day No."},{"$f":"IF('Report - Specimen #2'!$B$35=\"\",\"\",'Report - Specimen #2'!$B$35)","v":10}]
[117,{"$f":"IF('Report - Specimen #2'!$F$26=\"\",\"\",'Report - Specimen #2'!$F$26)","v":""},{"$f":"IF('Report - Specimen #2'!$B$6=\"\",\"\",'Report - Specimen #2'!$B$6)","v":"Tex-144-E"},{"$f":"IF( 'Report - Specimen #2'!$B$21=\"\",\"\", 'Report - Specimen #2'!$B$21)","v":"Report - Specimen #2"},{"$f":"IF('Report - Specimen #2'!$F$25=\"\",\"\",'Report - Specimen #2'!$F$25)","v":"Reading 4"},{"$f":"IF('Report - Specimen #2'!$B$25=\"\",\"\",'Report - Specimen #2'!$B$25)","v":"Day No."},{"$f":"IF('Report - Specimen #2'!$B$26=\"\",\"\",'Report - Specimen #2'!$B$26)","v":1}]
[118,{"$f":"IF('Report - Specimen #2'!$F$27=\"\",\"\",'Report - Specimen #2'!$F$27)","v":""},{"$f":"IF('Report - Specimen #2'!$B$6=\"\",\"\",'Report - Specimen #2'!$B$6)","v":"Tex-144-E"},{"$f":"IF( 'Report - Specimen #2'!$B$21=\"\",\"\", 'Report - Specimen #2'!$B$21)","v":"Report - Specimen #2"},{"$f":"IF('Report - Specimen #2'!$F$25=\"\",\"\",'Report - Specimen #2'!$F$25)","v":"Reading 4"},{"$f":"IF('Report - Specimen #2'!$B$25=\"\",\"\",'Report - Specimen #2'!$B$25)","v":"Day No."},{"$f":"IF('Report - Specimen #2'!$B$27=\"\",\"\",'Report - Specimen #2'!$B$27)","v":2}]
[119,{"$f":"IF('Report - Specimen #2'!$F$28=\"\",\"\",'Report - Specimen #2'!$F$28)","v":""},{"$f":"IF('Report - Specimen #2'!$B$6=\"\",\"\",'Report - Specimen #2'!$B$6)","v":"Tex-144-E"},{"$f":"IF( 'Report - Specimen #2'!$B$21=\"\",\"\", 'Report - Specimen #2'!$B$21)","v":"Report - Specimen #2"},{"$f":"IF('Report - Specimen #2'!$F$25=\"\",\"\",'Report - Specimen #2'!$F$25)","v":"Reading 4"},{"$f":"IF('Report - Specimen #2'!$B$25=\"\",\"\",'Report - Specimen #2'!$B$25)","v":"Day No."},{"$f":"IF('Report - Specimen #2'!$B$28=\"\",\"\",'Report - Specimen #2'!$B$28)","v":3}]
[120,{"$f":"IF('Report - Specimen #2'!$F$29=\"\",\"\",'Report - Specimen #2'!$F$29)","v":""},{"$f":"IF('Report - Specimen #2'!$B$6=\"\",\"\",'Report - Specimen #2'!$B$6)","v":"Tex-144-E"},{"$f":"IF( 'Report - Specimen #2'!$B$21=\"\",\"\", 'Report - Specimen #2'!$B$21)","v":"Report - Specimen #2"},{"$f":"IF('Report - Specimen #2'!$F$25=\"\",\"\",'Report - Specimen #2'!$F$25)","v":"Reading 4"},{"$f":"IF('Report - Specimen #2'!$B$25=\"\",\"\",'Report - Specimen #2'!$B$25)","v":"Day No."},{"$f":"IF('Report - Specimen #2'!$B$29=\"\",\"\",'Report - Specimen #2'!$B$29)","v":4}]
[121,{"$f":"IF('Report - Specimen #2'!$F$30=\"\",\"\",'Report - Specimen #2'!$F$30)","v":""},{"$f":"IF('Report - Specimen #2'!$B$6=\"\",\"\",'Report - Specimen #2'!$B$6)","v":"Tex-144-E"},{"$f":"IF( 'Report - Specimen #2'!$B$21=\"\",\"\", 'Report - Specimen #2'!$B$21)","v":"Report - Specimen #2"},{"$f":"IF('Report - Specimen #2'!$F$25=\"\",\"\",'Report - Specimen #2'!$F$25)","v":"Reading 4"},{"$f":"IF('Report - Specimen #2'!$B$25=\"\",\"\",'Report - Specimen #2'!$B$25)","v":"Day No."},{"$f":"IF('Report - Specimen #2'!$B$30=\"\",\"\",'Report - Specimen #2'!$B$30)","v":5}]
[122,{"$f":"IF('Report - Specimen #2'!$F$31=\"\",\"\",'Report - Specimen #2'!$F$31)","v":""},{"$f":"IF('Report - Specimen #2'!$B$6=\"\",\"\",'Report - Specimen #2'!$B$6)","v":"Tex-144-E"},{"$f":"IF( 'Report - Specimen #2'!$B$21=\"\",\"\", 'Report - Specimen #2'!$B$21)","v":"Report - Specimen #2"},{"$f":"IF('Report - Specimen #2'!$F$25=\"\",\"\",'Report - Specimen #2'!$F$25)","v":"Reading 4"},{"$f":"IF('Report - Specimen #2'!$B$25=\"\",\"\",'Report - Specimen #2'!$B$25)","v":"Day No."},{"$f":"IF('Report - Specimen #2'!$B$31=\"\",\"\",'Report - Specimen #2'!$B$31)","v":6}]
[123,{"$f":"IF('Report - Specimen #2'!$F$32=\"\",\"\",'Report - Specimen #2'!$F$32)","v":""},{"$f":"IF('Report - Specimen #2'!$B$6=\"\",\"\",'Report - Specimen #2'!$B$6)","v":"Tex-144-E"},{"$f":"IF( 'Report - Specimen #2'!$B$21=\"\",\"\", 'Report - Specimen #2'!$B$21)","v":"Report - Specimen #2"},{"$f":"IF('Report - Specimen #2'!$F$25=\"\",\"\",'Report - Specimen #2'!$F$25)","v":"Reading 4"},{"$f":"IF('Report - Specimen #2'!$B$25=\"\",\"\",'Report - Specimen #2'!$B$25)","v":"Day No."},{"$f":"IF('Report - Specimen #2'!$B$32=\"\",\"\",'Report - Specimen #2'!$B$32)","v":7}]
[124,{"$f":"IF('Report - Specimen #2'!$F$33=\"\",\"\",'Report - Specimen #2'!$F$33)","v":""},{"$f":"IF('Report - Specimen #2'!$B$6=\"\",\"\",'Report - Specimen #2'!$B$6)","v":"Tex-144-E"},{"$f":"IF( 'Report - Specimen #2'!$B$21=\"\",\"\", 'Report - Specimen #2'!$B$21)","v":"Report - Specimen #2"},{"$f":"IF('Report - Specimen #2'!$F$25=\"\",\"\",'Report - Specimen #2'!$F$25)","v":"Reading 4"},{"$f":"IF('Report - Specimen #2'!$B$25=\"\",\"\",'Report - Specimen #2'!$B$25)","v":"Day No."},{"$f":"IF('Report - Specimen #2'!$B$33=\"\",\"\",'Report - Specimen #2'!$B$33)","v":8}]
[125,{"$f":"IF('Report - Specimen #2'!$F$34=\"\",\"\",'Report - Specimen #2'!$F$34)","v":""},{"$f":"IF('Report - Specimen #2'!$B$6=\"\",\"\",'Report - Specimen #2'!$B$6)","v":"Tex-144-E"},{"$f":"IF( 'Report - Specimen #2'!$B$21=\"\",\"\", 'Report - Specimen #2'!$B$21)","v":"Report - Specimen #2"},{"$f":"IF('Report - Specimen #2'!$F$25=\"\",\"\",'Report - Specimen #2'!$F$25)","v":"Reading 4"},{"$f":"IF('Report - Specimen #2'!$B$25=\"\",\"\",'Report - Specimen #2'!$B$25)","v":"Day No."},{"$f":"IF('Report - Specimen #2'!$B$34=\"\",\"\",'Report - Specimen #2'!$B$34)","v":9}]
[126,{"$f":"IF('Report - Specimen #2'!$F$35=\"\",\"\",'Report - Specimen #2'!$F$35)","v":""},{"$f":"IF('Report - Specimen #2'!$B$6=\"\",\"\",'Report - Specimen #2'!$B$6)","v":"Tex-144-E"},{"$f":"IF( 'Report - Specimen #2'!$B$21=\"\",\"\", 'Report - Specimen #2'!$B$21)","v":"Report - Specimen #2"},{"$f":"IF('Report - Specimen #2'!$F$25=\"\",\"\",'Report - Specimen #2'!$F$25)","v":"Reading 4"},{"$f":"IF('Report - Specimen #2'!$B$25=\"\",\"\",'Report - Specimen #2'!$B$25)","v":"Day No."},{"$f":"IF('Report - Specimen #2'!$B$35=\"\",\"\",'Report - Specimen #2'!$B$35)","v":10}]
[127,{"$f":"IF('Report - Specimen #2'!$G$26=\"\",\"\",'Report - Specimen #2'!$G$26)","v":""},{"$f":"IF('Report - Specimen #2'!$B$6=\"\",\"\",'Report - Specimen #2'!$B$6)","v":"Tex-144-E"},{"$f":"IF( 'Report - Specimen #2'!$B$21=\"\",\"\", 'Report - Specimen #2'!$B$21)","v":"Report - Specimen #2"},{"$f":"IF('Report - Specimen #2'!$G$25=\"\",\"\",'Report - Specimen #2'!$G$25)","v":"Reading 5"},{"$f":"IF('Report - Specimen #2'!$B$25=\"\",\"\",'Report - Specimen #2'!$B$25)","v":"Day No."},{"$f":"IF('Report - Specimen #2'!$B$26=\"\",\"\",'Report - Specimen #2'!$B$26)","v":1}]
[128,{"$f":"IF('Report - Specimen #2'!$G$27=\"\",\"\",'Report - Specimen #2'!$G$27)","v":""},{"$f":"IF('Report - Specimen #2'!$B$6=\"\",\"\",'Report - Specimen #2'!$B$6)","v":"Tex-144-E"},{"$f":"IF( 'Report - Specimen #2'!$B$21=\"\",\"\", 'Report - Specimen #2'!$B$21)","v":"Report - Specimen #2"},{"$f":"IF('Report - Specimen #2'!$G$25=\"\",\"\",'Report - Specimen #2'!$G$25)","v":"Reading 5"},{"$f":"IF('Report - Specimen #2'!$B$25=\"\",\"\",'Report - Specimen #2'!$B$25)","v":"Day No."},{"$f":"IF('Report - Specimen #2'!$B$27=\"\",\"\",'Report - Specimen #2'!$B$27)","v":2}]
[129,{"$f":"IF('Report - Specimen #2'!$G$28=\"\",\"\",'Report - Specimen #2'!$G$28)","v":""},{"$f":"IF('Report - Specimen #2'!$B$6=\"\",\"\",'Report - Specimen #2'!$B$6)","v":"Tex-144-E"},{"$f":"IF( 'Report - Specimen #2'!$B$21=\"\",\"\", 'Report - Specimen #2'!$B$21)","v":"Report - Specimen #2"},{"$f":"IF('Report - Specimen #2'!$G$25=\"\",\"\",'Report - Specimen #2'!$G$25)","v":"Reading 5"},{"$f":"IF('Report - Specimen #2'!$B$25=\"\",\"\",'Report - Specimen #2'!$B$25)","v":"Day No."},{"$f":"IF('Report - Specimen #2'!$B$28=\"\",\"\",'Report - Specimen #2'!$B$28)","v":3}]
[130,{"$f":"IF('Report - Specimen #2'!$G$29=\"\",\"\",'Report - Specimen #2'!$G$29)","v":""},{"$f":"IF('Report - Specimen #2'!$B$6=\"\",\"\",'Report - Specimen #2'!$B$6)","v":"Tex-144-E"},{"$f":"IF( 'Report - Specimen #2'!$B$21=\"\",\"\", 'Report - Specimen #2'!$B$21)","v":"Report - Specimen #2"},{"$f":"IF('Report - Specimen #2'!$G$25=\"\",\"\",'Report - Specimen #2'!$G$25)","v":"Reading 5"},{"$f":"IF('Report - Specimen #2'!$B$25=\"\",\"\",'Report - Specimen #2'!$B$25)","v":"Day No."},{"$f":"IF('Report - Specimen #2'!$B$29=\"\",\"\",'Report - Specimen #2'!$B$29)","v":4}]
[131,{"$f":"IF('Report - Specimen #2'!$G$30=\"\",\"\",'Report - Specimen #2'!$G$30)","v":""},{"$f":"IF('Report - Specimen #2'!$B$6=\"\",\"\",'Report - Specimen #2'!$B$6)","v":"Tex-144-E"},{"$f":"IF( 'Report - Specimen #2'!$B$21=\"\",\"\", 'Report - Specimen #2'!$B$21)","v":"Report - Specimen #2"},{"$f":"IF('Report - Specimen #2'!$G$25=\"\",\"\",'Report - Specimen #2'!$G$25)","v":"Reading 5"},{"$f":"IF('Report - Specimen #2'!$B$25=\"\",\"\",'Report - Specimen #2'!$B$25)","v":"Day No."},{"$f":"IF('Report - Specimen #2'!$B$30=\"\",\"\",'Report - Specimen #2'!$B$30)","v":5}]
[132,{"$f":"IF('Report - Specimen #2'!$G$31=\"\",\"\",'Report - Specimen #2'!$G$31)","v":""},{"$f":"IF('Report - Specimen #2'!$B$6=\"\",\"\",'Report - Specimen #2'!$B$6)","v":"Tex-144-E"},{"$f":"IF( 'Report - Specimen #2'!$B$21=\"\",\"\", 'Report - Specimen #2'!$B$21)","v":"Report - Specimen #2"},{"$f":"IF('Report - Specimen #2'!$G$25=\"\",\"\",'Report - Specimen #2'!$G$25)","v":"Reading 5"},{"$f":"IF('Report - Specimen #2'!$B$25=\"\",\"\",'Report - Specimen #2'!$B$25)","v":"Day No."},{"$f":"IF('Report - Specimen #2'!$B$31=\"\",\"\",'Report - Specimen #2'!$B$31)","v":6}]
[133,{"$f":"IF('Report - Specimen #2'!$G$32=\"\",\"\",'Report - Specimen #2'!$G$32)","v":""},{"$f":"IF('Report - Specimen #2'!$B$6=\"\",\"\",'Report - Specimen #2'!$B$6)","v":"Tex-144-E"},{"$f":"IF( 'Report - Specimen #2'!$B$21=\"\",\"\", 'Report - Specimen #2'!$B$21)","v":"Report - Specimen #2"},{"$f":"IF('Report - Specimen #2'!$G$25=\"\",\"\",'Report - Specimen #2'!$G$25)","v":"Reading 5"},{"$f":"IF('Report - Specimen #2'!$B$25=\"\",\"\",'Report - Specimen #2'!$B$25)","v":"Day No."},{"$f":"IF('Report - Specimen #2'!$B$32=\"\",\"\",'Report - Specimen #2'!$B$32)","v":7}]
[134,{"$f":"IF('Report - Specimen #2'!$G$33=\"\",\"\",'Report - Specimen #2'!$G$33)","v":""},{"$f":"IF('Report - Specimen #2'!$B$6=\"\",\"\",'Report - Specimen #2'!$B$6)","v":"Tex-144-E"},{"$f":"IF( 'Report - Specimen #2'!$B$21=\"\",\"\", 'Report - Specimen #2'!$B$21)","v":"Report - Specimen #2"},{"$f":"IF('Report - Specimen #2'!$G$25=\"\",\"\",'Report - Specimen #2'!$G$25)","v":"Reading 5"},{"$f":"IF('Report - Specimen #2'!$B$25=\"\",\"\",'Report - Specimen #2'!$B$25)","v":"Day No."},{"$f":"IF('Report - Specimen #2'!$B$33=\"\",\"\",'Report - Specimen #2'!$B$33)","v":8}]
[135,{"$f":"IF('Report - Specimen #2'!$G$34=\"\",\"\",'Report - Specimen #2'!$G$34)","v":""},{"$f":"IF('Report - Specimen #2'!$B$6=\"\",\"\",'Report - Specimen #2'!$B$6)","v":"Tex-144-E"},{"$f":"IF( 'Report - Specimen #2'!$B$21=\"\",\"\", 'Report - Specimen #2'!$B$21)","v":"Report - Specimen #2"},{"$f":"IF('Report - Specimen #2'!$G$25=\"\",\"\",'Report - Specimen #2'!$G$25)","v":"Reading 5"},{"$f":"IF('Report - Specimen #2'!$B$25=\"\",\"\",'Report - Specimen #2'!$B$25)","v":"Day No."},{"$f":"IF('Report - Specimen #2'!$B$34=\"\",\"\",'Report - Specimen #2'!$B$34)","v":9}]
[136,{"$f":"IF('Report - Specimen #2'!$G$35=\"\",\"\",'Report - Specimen #2'!$G$35)","v":""},{"$f":"IF('Report - Specimen #2'!$B$6=\"\",\"\",'Report - Specimen #2'!$B$6)","v":"Tex-144-E"},{"$f":"IF( 'Report - Specimen #2'!$B$21=\"\",\"\", 'Report - Specimen #2'!$B$21)","v":"Report - Specimen #2"},{"$f":"IF('Report - Specimen #2'!$G$25=\"\",\"\",'Report - Specimen #2'!$G$25)","v":"Reading 5"},{"$f":"IF('Report - Specimen #2'!$B$25=\"\",\"\",'Report - Specimen #2'!$B$25)","v":"Day No."},{"$f":"IF('Report - Specimen #2'!$B$35=\"\",\"\",'Report - Specimen #2'!$B$35)","v":10}]
[137,{"$f":"IF('Report - Specimen #2'!$H$26=\"\",\"\",'Report - Specimen #2'!$H$26)","v":""},{"$f":"IF('Report - Specimen #2'!$B$6=\"\",\"\",'Report - Specimen #2'!$B$6)","v":"Tex-144-E"},{"$f":"IF( 'Report - Specimen #2'!$B$21=\"\",\"\", 'Report - Specimen #2'!$B$21)","v":"Report - Specimen #2"},{"$f":"IF('Report - Specimen #2'!$H$25=\"\",\"\",'Report - Specimen #2'!$H$25)","v":"Average"},{"$f":"IF('Report - Specimen #2'!$B$25=\"\",\"\",'Report - Specimen #2'!$B$25)","v":"Day No."},{"$f":"IF('Report - Specimen #2'!$B$26=\"\",\"\",'Report - Specimen #2'!$B$26)","v":1}]
[138,{"$f":"IF('Report - Specimen #2'!$H$27=\"\",\"\",'Report - Specimen #2'!$H$27)","v":""},{"$f":"IF('Report - Specimen #2'!$B$6=\"\",\"\",'Report - Specimen #2'!$B$6)","v":"Tex-144-E"},{"$f":"IF( 'Report - Specimen #2'!$B$21=\"\",\"\", 'Report - Specimen #2'!$B$21)","v":"Report - Specimen #2"},{"$f":"IF('Report - Specimen #2'!$H$25=\"\",\"\",'Report - Specimen #2'!$H$25)","v":"Average"},{"$f":"IF('Report - Specimen #2'!$B$25=\"\",\"\",'Report - Specimen #2'!$B$25)","v":"Day No."},{"$f":"IF('Report - Specimen #2'!$B$27=\"\",\"\",'Report - Specimen #2'!$B$27)","v":2}]
[139,{"$f":"IF('Report - Specimen #2'!$H$28=\"\",\"\",'Report - Specimen #2'!$H$28)","v":""},{"$f":"IF('Report - Specimen #2'!$B$6=\"\",\"\",'Report - Specimen #2'!$B$6)","v":"Tex-144-E"},{"$f":"IF( 'Report - Specimen #2'!$B$21=\"\",\"\", 'Report - Specimen #2'!$B$21)","v":"Report - Specimen #2"},{"$f":"IF('Report - Specimen #2'!$H$25=\"\",\"\",'Report - Specimen #2'!$H$25)","v":"Average"},{"$f":"IF('Report - Specimen #2'!$B$25=\"\",\"\",'Report - Specimen #2'!$B$25)","v":"Day No."},{"$f":"IF('Report - Specimen #2'!$B$28=\"\",\"\",'Report - Specimen #2'!$B$28)","v":3}]
[140,{"$f":"IF('Report - Specimen #2'!$H$29=\"\",\"\",'Report - Specimen #2'!$H$29)","v":""},{"$f":"IF('Report - Specimen #2'!$B$6=\"\",\"\",'Report - Specimen #2'!$B$6)","v":"Tex-144-E"},{"$f":"IF( 'Report - Specimen #2'!$B$21=\"\",\"\", 'Report - Specimen #2'!$B$21)","v":"Report - Specimen #2"},{"$f":"IF('Report - Specimen #2'!$H$25=\"\",\"\",'Report - Specimen #2'!$H$25)","v":"Average"},{"$f":"IF('Report - Specimen #2'!$B$25=\"\",\"\",'Report - Specimen #2'!$B$25)","v":"Day No."},{"$f":"IF('Report - Specimen #2'!$B$29=\"\",\"\",'Report - Specimen #2'!$B$29)","v":4}]
[141,{"$f":"IF('Report - Specimen #2'!$H$30=\"\",\"\",'Report - Specimen #2'!$H$30)","v":""},{"$f":"IF('Report - Specimen #2'!$B$6=\"\",\"\",'Report - Specimen #2'!$B$6)","v":"Tex-144-E"},{"$f":"IF( 'Report - Specimen #2'!$B$21=\"\",\"\", 'Report - Specimen #2'!$B$21)","v":"Report - Specimen #2"},{"$f":"IF('Report - Specimen #2'!$H$25=\"\",\"\",'Report - Specimen #2'!$H$25)","v":"Average"},{"$f":"IF('Report - Specimen #2'!$B$25=\"\",\"\",'Report - Specimen #2'!$B$25)","v":"Day No."},{"$f":"IF('Report - Specimen #2'!$B$30=\"\",\"\",'Report - Specimen #2'!$B$30)","v":5}]
[142,{"$f":"IF('Report - Specimen #2'!$H$31=\"\",\"\",'Report - Specimen #2'!$H$31)","v":""},{"$f":"IF('Report - Specimen #2'!$B$6=\"\",\"\",'Report - Specimen #2'!$B$6)","v":"Tex-144-E"},{"$f":"IF( 'Report - Specimen #2'!$B$21=\"\",\"\", 'Report - Specimen #2'!$B$21)","v":"Report - Specimen #2"},{"$f":"IF('Report - Specimen #2'!$H$25=\"\",\"\",'Report - Specimen #2'!$H$25)","v":"Average"},{"$f":"IF('Report - Specimen #2'!$B$25=\"\",\"\",'Report - Specimen #2'!$B$25)","v":"Day No."},{"$f":"IF('Report - Specimen #2'!$B$31=\"\",\"\",'Report - Specimen #2'!$B$31)","v":6}]
[143,{"$f":"IF('Report - Specimen #2'!$H$32=\"\",\"\",'Report - Specimen #2'!$H$32)","v":""},{"$f":"IF('Report - Specimen #2'!$B$6=\"\",\"\",'Report - Specimen #2'!$B$6)","v":"Tex-144-E"},{"$f":"IF( 'Report - Specimen #2'!$B$21=\"\",\"\", 'Report - Specimen #2'!$B$21)","v":"Report - Specimen #2"},{"$f":"IF('Report - Specimen #2'!$H$25=\"\",\"\",'Report - Specimen #2'!$H$25)","v":"Average"},{"$f":"IF('Report - Specimen #2'!$B$25=\"\",\"\",'Report - Specimen #2'!$B$25)","v":"Day No."},{"$f":"IF('Report - Specimen #2'!$B$32=\"\",\"\",'Report - Specimen #2'!$B$32)","v":7}]
[144,{"$f":"IF('Report - Specimen #2'!$H$33=\"\",\"\",'Report - Specimen #2'!$H$33)","v":""},{"$f":"IF('Report - Specimen #2'!$B$6=\"\",\"\",'Report - Specimen #2'!$B$6)","v":"Tex-144-E"},{"$f":"IF( 'Report - Specimen #2'!$B$21=\"\",\"\", 'Report - Specimen #2'!$B$21)","v":"Report - Specimen #2"},{"$f":"IF('Report - Specimen #2'!$H$25=\"\",\"\",'Report - Specimen #2'!$H$25)","v":"Average"},{"$f":"IF('Report - Specimen #2'!$B$25=\"\",\"\",'Report - Specimen #2'!$B$25)","v":"Day No."},{"$f":"IF('Report - Specimen #2'!$B$33=\"\",\"\",'Report - Specimen #2'!$B$33)","v":8}]
[145,{"$f":"IF('Report - Specimen #2'!$H$34=\"\",\"\",'Report - Specimen #2'!$H$34)","v":""},{"$f":"IF('Report - Specimen #2'!$B$6=\"\",\"\",'Report - Specimen #2'!$B$6)","v":"Tex-144-E"},{"$f":"IF( 'Report - Specimen #2'!$B$21=\"\",\"\", 'Report - Specimen #2'!$B$21)","v":"Report - Specimen #2"},{"$f":"IF('Report - Specimen #2'!$H$25=\"\",\"\",'Report - Specimen #2'!$H$25)","v":"Average"},{"$f":"IF('Report - Specimen #2'!$B$25=\"\",\"\",'Report - Specimen #2'!$B$25)","v":"Day No."},{"$f":"IF('Report - Specimen #2'!$B$34=\"\",\"\",'Report - Specimen #2'!$B$34)","v":9}]
[146,{"$f":"IF('Report - Specimen #2'!$H$35=\"\",\"\",'Report - Specimen #2'!$H$35)","v":""},{"$f":"IF('Report - Specimen #2'!$B$6=\"\",\"\",'Report - Specimen #2'!$B$6)","v":"Tex-144-E"},{"$f":"IF( 'Report - Specimen #2'!$B$21=\"\",\"\", 'Report - Specimen #2'!$B$21)","v":"Report - Specimen #2"},{"$f":"IF('Report - Specimen #2'!$H$25=\"\",\"\",'Report - Specimen #2'!$H$25)","v":"Average"},{"$f":"IF('Report - Specimen #2'!$B$25=\"\",\"\",'Report - Specimen #2'!$B$25)","v":"Day No."},{"$f":"IF('Report - Specimen #2'!$B$35=\"\",\"\",'Report - Specimen #2'!$B$35)","v":10}]
[147,{"$f":"IF('Report - Specimen #2'!$H$36=\"\",\"\",'Report - Specimen #2'!$H$36)","v":""},{"$f":"IF('Report - Specimen #2'!$B$6=\"\",\"\",'Report - Specimen #2'!$B$6)","v":"Tex-144-E"},{"$f":"IF( 'Report - Specimen #2'!$B$21=\"\",\"\", 'Report - Specimen #2'!$B$21)","v":"Report - Specimen #2"},{"$f":"IF('Report - Specimen #2'!$H$25=\"\",\"\",'Report - Specimen #2'!$H$25)","v":"Average"}]
[148,{"$f":"IF('Report - Specimen #2'!$C$39=\"\",\"\",'Report - Specimen #2'!$C$39)","v":""},{"$f":"IF('Report - Specimen #2'!$B$6=\"\",\"\",'Report - Specimen #2'!$B$6)","v":"Tex-144-E"},{"$f":"IF( 'Report - Specimen #2'!$B$21=\"\",\"\", 'Report - Specimen #2'!$B$21)","v":"Report - Specimen #2"},{"$f":"IF('Report - Specimen #2'!$B$39=\"\",\"\",'Report - Specimen #2'!$B$39)","v":"Specimen Wet Wt."}]
[149,{"$f":"IF('Report - Specimen #2'!$C$40=\"\",\"\",'Report - Specimen #2'!$C$40)","v":""},{"$f":"IF('Report - Specimen #2'!$B$6=\"\",\"\",'Report - Specimen #2'!$B$6)","v":"Tex-144-E"},{"$f":"IF( 'Report - Specimen #2'!$B$21=\"\",\"\", 'Report - Specimen #2'!$B$21)","v":"Report - Specimen #2"},{"$f":"IF('Report - Specimen #2'!$B$40=\"\",\"\",'Report - Specimen #2'!$B$40)","v":"Specimen Height"}]
[150,{"$f":"IF('Report - Specimen #2'!$C$41=\"\",\"\",'Report - Specimen #2'!$C$41)","v":""},{"$f":"IF('Report - Specimen #2'!$B$6=\"\",\"\",'Report - Specimen #2'!$B$6)","v":"Tex-144-E"},{"$f":"IF( 'Report - Specimen #2'!$B$21=\"\",\"\", 'Report - Specimen #2'!$B$21)","v":"Report - Specimen #2"},{"$f":"IF('Report - Specimen #2'!$B$41=\"\",\"\",'Report - Specimen #2'!$B$41)","v":"Dry Soil Wt."}]
[151,{"$f":"IF('Report - Specimen #2'!$C$42=\"\",\"\",'Report - Specimen #2'!$C$42)","v":""},{"$f":"IF('Report - Specimen #2'!$B$6=\"\",\"\",'Report - Specimen #2'!$B$6)","v":"Tex-144-E"},{"$f":"IF( 'Report - Specimen #2'!$B$21=\"\",\"\", 'Report - Specimen #2'!$B$21)","v":"Report - Specimen #2"},{"$f":"IF('Report - Specimen #2'!$B$42=\"\",\"\",'Report - Specimen #2'!$B$42)","v":"Two Stones Wt."}]
[152,{"$f":"IF('Report - Specimen #2'!$C$43=\"\",\"\",'Report - Specimen #2'!$C$43)","v":""},{"$f":"IF('Report - Specimen #2'!$B$6=\"\",\"\",'Report - Specimen #2'!$B$6)","v":"Tex-144-E"},{"$f":"IF( 'Report - Specimen #2'!$B$21=\"\",\"\", 'Report - Specimen #2'!$B$21)","v":"Report - Specimen #2"},{"$f":"IF('Report - Specimen #2'!$B$43=\"\",\"\",'Report - Specimen #2'!$B$43)","v":"MCCOMPACT:"}]
[153,{"$f":"IF('Report - Specimen #2'!$C$44=\"\",\"\",'Report - Specimen #2'!$C$44)","v":""},{"$f":"IF('Report - Specimen #2'!$B$6=\"\",\"\",'Report - Specimen #2'!$B$6)","v":"Tex-144-E"},{"$f":"IF( 'Report - Specimen #2'!$B$21=\"\",\"\", 'Report - Specimen #2'!$B$21)","v":"Report - Specimen #2"},{"$f":"IF('Report - Specimen #2'!$B$44=\"\",\"\",'Report - Specimen #2'!$B$44)","v":"Dry Density:"}]
[154,{"$f":"IF('Report - Specimen #2'!$C$45=\"\",\"\",'Report - Specimen #2'!$C$45)","v":""},{"$f":"IF('Report - Specimen #2'!$B$6=\"\",\"\",'Report - Specimen #2'!$B$6)","v":"Tex-144-E"},{"$f":"IF( 'Report - Specimen #2'!$B$21=\"\",\"\", 'Report - Specimen #2'!$B$21)","v":"Report - Specimen #2"},{"$f":"IF('Report - Specimen #2'!$B$45=\"\",\"\",'Report - Specimen #2'!$B$45)","v":"UCOMPACT:"}]
[155,{"$f":"IF('Report - Specimen #2'!$F$39=\"\",\"\",'Report - Specimen #2'!$F$39)","v":""},{"$f":"IF('Report - Specimen #2'!$B$6=\"\",\"\",'Report - Specimen #2'!$B$6)","v":"Tex-144-E"},{"$f":"IF( 'Report - Specimen #2'!$B$21=\"\",\"\", 'Report - Specimen #2'!$B$21)","v":"Report - Specimen #2"},{"$f":"IF('Report - Specimen #2'!$E$39=\"\",\"\",'Report - Specimen #2'!$E$39)","v":"Specimen Dry Wt."}]
[156,{"$f":"IF('Report - Specimen #2'!$F$40=\"\",\"\",'Report - Specimen #2'!$F$40)","v":""},{"$f":"IF('Report - Specimen #2'!$B$6=\"\",\"\",'Report - Specimen #2'!$B$6)","v":"Tex-144-E"},{"$f":"IF( 'Report - Specimen #2'!$B$21=\"\",\"\", 'Report - Specimen #2'!$B$21)","v":"Report - Specimen #2"},{"$f":"IF('Report - Specimen #2'!$E$40=\"\",\"\",'Report - Specimen #2'!$E$40)","v":"Dry Soil Wt."}]
[157,{"$f":"IF('Report - Specimen #2'!$F$41=\"\",\"\",'Report - Specimen #2'!$F$41)","v":""},{"$f":"IF('Report - Specimen #2'!$B$6=\"\",\"\",'Report - Specimen #2'!$B$6)","v":"Tex-144-E"},{"$f":"IF( 'Report - Specimen #2'!$B$21=\"\",\"\", 'Report - Specimen #2'!$B$21)","v":"Report - Specimen #2"},{"$f":"IF('Report - Specimen #2'!$E$41=\"\",\"\",'Report - Specimen #2'!$E$41)","v":"Two Stones Wt."}]
[158,{"$f":"IF('Report - Specimen #2'!$F$43=\"\",\"\",'Report - Specimen #2'!$F$43)","v":""},{"$f":"IF('Report - Specimen #2'!$B$6=\"\",\"\",'Report - Specimen #2'!$B$6)","v":"Tex-144-E"},{"$f":"IF( 'Report - Specimen #2'!$B$21=\"\",\"\", 'Report - Specimen #2'!$B$21)","v":"Report - Specimen #2"},{"$f":"IF('Report - Specimen #2'!$E$43=\"\",\"\",'Report - Specimen #2'!$E$43)","v":"MCINITIAL:"}]
[159,{"$f":"IF('Report - Specimen #2'!$I$39=\"\",\"\",'Report - Specimen #2'!$I$39)","v":""},{"$f":"IF('Report - Specimen #2'!$B$6=\"\",\"\",'Report - Specimen #2'!$B$6)","v":"Tex-144-E"},{"$f":"IF( 'Report - Specimen #2'!$B$21=\"\",\"\", 'Report - Specimen #2'!$B$21)","v":"Report - Specimen #2"},{"$f":"IF('Report - Specimen #2'!$H$39=\"\",\"\",'Report - Specimen #2'!$H$39)","v":"Soaked Specimen Wt."}]
[160,{"$f":"IF('Report - Specimen #2'!$I$40=\"\",\"\",'Report - Specimen #2'!$I$40)","v":""},{"$f":"IF('Report - Specimen #2'!$B$6=\"\",\"\",'Report - Specimen #2'!$B$6)","v":"Tex-144-E"},{"$f":"IF( 'Report - Specimen #2'!$B$21=\"\",\"\", 'Report - Specimen #2'!$B$21)","v":"Report - Specimen #2"},{"$f":"IF('Report - Specimen #2'!$H$40=\"\",\"\",'Report - Specimen #2'!$H$40)","v":"Dry Soil Wt."}]
[161,{"$f":"IF('Report - Specimen #2'!$I$41=\"\",\"\",'Report - Specimen #2'!$I$41)","v":""},{"$f":"IF('Report - Specimen #2'!$B$6=\"\",\"\",'Report - Specimen #2'!$B$6)","v":"Tex-144-E"},{"$f":"IF( 'Report - Specimen #2'!$B$21=\"\",\"\", 'Report - Specimen #2'!$B$21)","v":"Report - Specimen #2"},{"$f":"IF('Report - Specimen #2'!$H$41=\"\",\"\",'Report - Specimen #2'!$H$41)","v":"Pan Wt."}]
[162,{"$f":"IF('Report - Specimen #2'!$I$43=\"\",\"\",'Report - Specimen #2'!$I$43)","v":""},{"$f":"IF('Report - Specimen #2'!$B$6=\"\",\"\",'Report - Specimen #2'!$B$6)","v":"Tex-144-E"},{"$f":"IF( 'Report - Specimen #2'!$B$21=\"\",\"\", 'Report - Specimen #2'!$B$21)","v":"Report - Specimen #2"},{"$f":"IF('Report - Specimen #2'!$H$43=\"\",\"\",'Report - Specimen #2'!$H$43)","v":"MCFINAL:"}]
[163,{"$f":"IF('Report - Specimen #2'!$I$44=\"\",\"\",'Report - Specimen #2'!$I$44)","v":""},{"$f":"IF('Report - Specimen #2'!$B$6=\"\",\"\",'Report - Specimen #2'!$B$6)","v":"Tex-144-E"},{"$f":"IF( 'Report - Specimen #2'!$B$21=\"\",\"\", 'Report - Specimen #2'!$B$21)","v":"Report - Specimen #2"},{"$f":"IF('Report - Specimen #2'!$H$44=\"\",\"\",'Report - Specimen #2'!$H$44)","v":"URET:"}]
[164,{"$f":"IF('Report - Specimen #2'!$I$45=\"\",\"\",'Report - Specimen #2'!$I$45)","v":""},{"$f":"IF('Report - Specimen #2'!$B$6=\"\",\"\",'Report - Specimen #2'!$B$6)","v":"Tex-144-E"},{"$f":"IF( 'Report - Specimen #2'!$B$21=\"\",\"\", 'Report - Specimen #2'!$B$21)","v":"Report - Specimen #2"},{"$f":"IF('Report - Specimen #2'!$H$45=\"\",\"\",'Report - Specimen #2'!$H$45)","v":"R:"}]
[165,{"$f":"IF('Compaction Info'!$D$28=\"\",\"\",'Compaction Info'!$D$28)","v":""},{"$f":"IF('Compaction Info'!$B$24=\"\",\"\",'Compaction Info'!$B$24)","v":"Tex-144-E"},{"$f":"IF( 'Compaction Info'!$B$25=\"\",\"\", 'Compaction Info'!$B$25)","v":"Specimen Compaction Worksheet"},{"$f":"IF('Compaction Info'!$B$28=\"\",\"\",'Compaction Info'!$B$28)","v":"Wt. of Mold, lb."}]
[166,{"$f":"IF('Compaction Info'!$G$28=\"\",\"\",'Compaction Info'!$G$28)","v":""},{"$f":"IF('Compaction Info'!$B$24=\"\",\"\",'Compaction Info'!$B$24)","v":"Tex-144-E"},{"$f":"IF( 'Compaction Info'!$B$25=\"\",\"\", 'Compaction Info'!$B$25)","v":"Specimen Compaction Worksheet"},{"$f":"IF('Compaction Info'!$E$28=\"\",\"\",'Compaction Info'!$E$28)","v":"Mold Factor, ft3/in."}]
[167,{"$f":"IF('Compaction Info'!$K$28=\"\",\"\",'Compaction Info'!$K$28)","v":""},{"$f":"IF('Compaction Info'!$B$24=\"\",\"\",'Compaction Info'!$B$24)","v":"Tex-144-E"},{"$f":"IF( 'Compaction Info'!$B$25=\"\",\"\", 'Compaction Info'!$B$25)","v":"Specimen Compaction Worksheet"},{"$f":"IF('Compaction Info'!$I$28=\"\",\"\",'Compaction Info'!$I$28)","v":"Max. Dry Density, pcf"}]
[168,{"$f":"IF('Compaction Info'!$K$29=\"\",\"\",'Compaction Info'!$K$29)","v":""},{"$f":"IF('Compaction Info'!$B$24=\"\",\"\",'Compaction Info'!$B$24)","v":"Tex-144-E"},{"$f":"IF( 'Compaction Info'!$B$25=\"\",\"\", 'Compaction Info'!$B$25)","v":"Specimen Compaction Worksheet"},{"$f":"IF('Compaction Info'!$I$29=\"\",\"\",'Compaction Info'!$I$29)","v":"Dry Weight of Sample, lb."}]
[169,{"$f":"IF('Compaction Info'!$O$28=\"\",\"\",'Compaction Info'!$O$28)","v":""},{"$f":"IF('Compaction Info'!$B$24=\"\",\"\",'Compaction Info'!$B$24)","v":"Tex-144-E"},{"$f":"IF( 'Compaction Info'!$B$25=\"\",\"\", 'Compaction Info'!$B$25)","v":"Specimen Compaction Worksheet"},{"$f":"IF('Compaction Info'!$M$28=\"\",\"\",'Compaction Info'!$M$28)","v":"OMC, %"}]
[170,{"$f":"IF('Compaction Info'!$O$29=\"\",\"\",'Compaction Info'!$O$29)","v":""},{"$f":"IF('Compaction Info'!$B$24=\"\",\"\",'Compaction Info'!$B$24)","v":"Tex-144-E"},{"$f":"IF( 'Compaction Info'!$B$25=\"\",\"\", 'Compaction Info'!$B$25)","v":"Specimen Compaction Worksheet"},{"$f":"IF('Compaction Info'!$M$29=\"\",\"\",'Compaction Info'!$M$29)","v":"Moisture Added, ml"}]
[171,{"$f":"IF('Compaction Info'!$C$33=\"\",\"\",'Compaction Info'!$C$33)","v":""},{"$f":"IF('Compaction Info'!$B$24=\"\",\"\",'Compaction Info'!$B$24)","v":"Tex-144-E"},{"$f":"IF( 'Compaction Info'!$B$25=\"\",\"\", 'Compaction Info'!$B$25)","v":"Specimen Compaction Worksheet"},{"$f":"IF('Compaction Info'!$C$31=\"\",\"\",'Compaction Info'!$C$31)","v":"WTOTAL (lb)"},{"$f":"IF('Compaction Info'!$B$31=\"\",\"\",'Compaction Info'!$B$31)","v":"Specimen No."},{"$f":"IF('Compaction Info'!$B$33=\"\",\"\",'Compaction Info'!$B$33)","v":1}]
[172,{"$f":"IF('Compaction Info'!$D$33=\"\",\"\",'Compaction Info'!$D$33)","v":""},{"$f":"IF('Compaction Info'!$B$24=\"\",\"\",'Compaction Info'!$B$24)","v":"Tex-144-E"},{"$f":"IF( 'Compaction Info'!$B$25=\"\",\"\", 'Compaction Info'!$B$25)","v":"Specimen Compaction Worksheet"},{"$f":"IF('Compaction Info'!$D$31=\"\",\"\",'Compaction Info'!$D$31)","v":"Wt. of Moist Specimen (lb)"},{"$f":"IF('Compaction Info'!$B$31=\"\",\"\",'Compaction Info'!$B$31)","v":"Specimen No."},{"$f":"IF('Compaction Info'!$B$33=\"\",\"\",'Compaction Info'!$B$33)","v":1}]
[173,{"$f":"IF('Compaction Info'!$E$33=\"\",\"\",'Compaction Info'!$E$33)","v":""},{"$f":"IF('Compaction Info'!$B$24=\"\",\"\",'Compaction Info'!$B$24)","v":"Tex-144-E"},{"$f":"IF( 'Compaction Info'!$B$25=\"\",\"\", 'Compaction Info'!$B$25)","v":"Specimen Compaction Worksheet"},{"$f":"IF('Compaction Info'!$E$31=\"\",\"\",'Compaction Info'!$E$31)","v":" Ht (in)"},{"$f":"IF('Compaction Info'!$B$31=\"\",\"\",'Compaction Info'!$B$31)","v":"Specimen No."},{"$f":"IF('Compaction Info'!$B$33=\"\",\"\",'Compaction Info'!$B$33)","v":1}]
[174,{"$f":"IF('Compaction Info'!$F$33=\"\",\"\",'Compaction Info'!$F$33)","v":6},{"$f":"IF('Compaction Info'!$B$24=\"\",\"\",'Compaction Info'!$B$24)","v":"Tex-144-E"},{"$f":"IF( 'Compaction Info'!$B$25=\"\",\"\", 'Compaction Info'!$B$25)","v":"Specimen Compaction Worksheet"},{"$f":"IF('Compaction Info'!$F$31=\"\",\"\",'Compaction Info'!$F$31)","v":"Specimen Dia. (in)"},{"$f":"IF('Compaction Info'!$B$31=\"\",\"\",'Compaction Info'!$B$31)","v":"Specimen No."},{"$f":"IF('Compaction Info'!$B$33=\"\",\"\",'Compaction Info'!$B$33)","v":1}]
[175,{"$f":"IF('Compaction Info'!$G$33=\"\",\"\",'Compaction Info'!$G$33)","v":""},{"$f":"IF('Compaction Info'!$B$24=\"\",\"\",'Compaction Info'!$B$24)","v":"Tex-144-E"},{"$f":"IF( 'Compaction Info'!$B$25=\"\",\"\", 'Compaction Info'!$B$25)","v":"Specimen Compaction Worksheet"},{"$f":"IF('Compaction Info'!$G$31=\"\",\"\",'Compaction Info'!$G$31)","v":"Wet Density"},{"$f":"IF('Compaction Info'!$B$31=\"\",\"\",'Compaction Info'!$B$31)","v":"Specimen No."},{"$f":"IF('Compaction Info'!$B$33=\"\",\"\",'Compaction Info'!$B$33)","v":1}]
[176,{"$f":"IF('Compaction Info'!$H$33=\"\",\"\",'Compaction Info'!$H$33)","v":""},{"$f":"IF('Compaction Info'!$B$24=\"\",\"\",'Compaction Info'!$B$24)","v":"Tex-144-E"},{"$f":"IF( 'Compaction Info'!$B$25=\"\",\"\", 'Compaction Info'!$B$25)","v":"Specimen Compaction Worksheet"},{"$f":"IF('Compaction Info'!$H$31=\"\",\"\",'Compaction Info'!$H$31)","v":"WSTONES (lb)"},{"$f":"IF('Compaction Info'!$B$31=\"\",\"\",'Compaction Info'!$B$31)","v":"Specimen No."},{"$f":"IF('Compaction Info'!$B$33=\"\",\"\",'Compaction Info'!$B$33)","v":1}]
[177,{"$f":"IF('Compaction Info'!$I$33=\"\",\"\",'Compaction Info'!$I$33)","v":""},{"$f":"IF('Compaction Info'!$B$24=\"\",\"\",'Compaction Info'!$B$24)","v":"Tex-144-E"},{"$f":"IF( 'Compaction Info'!$B$25=\"\",\"\", 'Compaction Info'!$B$25)","v":"Specimen Compaction Worksheet"},{"$f":"IF('Compaction Info'!$I$31=\"\",\"\",'Compaction Info'!$I$31)","v":"After Molding WCOMPACT (lb)"},{"$f":"IF('Compaction Info'!$B$31=\"\",\"\",'Compaction Info'!$B$31)","v":"Specimen No."},{"$f":"IF('Compaction Info'!$B$33=\"\",\"\",'Compaction Info'!$B$33)","v":1}]
[178,{"$f":"IF('Compaction Info'!$J$33=\"\",\"\",'Compaction Info'!$J$33)","v":""},{"$f":"IF('Compaction Info'!$B$24=\"\",\"\",'Compaction Info'!$B$24)","v":"Tex-144-E"},{"$f":"IF( 'Compaction Info'!$B$25=\"\",\"\", 'Compaction Info'!$B$25)","v":"Specimen Compaction Worksheet"},{"$f":"IF('Compaction Info'!$J$31=\"\",\"\",'Compaction Info'!$J$31)","v":"After Drying WPARTIAL DRY (lb)"},{"$f":"IF('Compaction Info'!$B$31=\"\",\"\",'Compaction Info'!$B$31)","v":"Specimen No."},{"$f":"IF('Compaction Info'!$B$33=\"\",\"\",'Compaction Info'!$B$33)","v":1}]
[179,{"$f":"IF('Compaction Info'!$K$33=\"\",\"\",'Compaction Info'!$K$33)","v":""},{"$f":"IF('Compaction Info'!$B$24=\"\",\"\",'Compaction Info'!$B$24)","v":"Tex-144-E"},{"$f":"IF( 'Compaction Info'!$B$25=\"\",\"\", 'Compaction Info'!$B$25)","v":"Specimen Compaction Worksheet"},{"$f":"IF('Compaction Info'!$K$31=\"\",\"\",'Compaction Info'!$K$31)","v":"At Conclusion of Test WWET + Pan (lb)"},{"$f":"IF('Compaction Info'!$B$31=\"\",\"\",'Compaction Info'!$B$31)","v":"Specimen No."},{"$f":"IF('Compaction Info'!$B$33=\"\",\"\",'Compaction Info'!$B$33)","v":1}]
[180,{"$f":"IF('Compaction Info'!$L$33=\"\",\"\",'Compaction Info'!$L$33)","v":""},{"$f":"IF('Compaction Info'!$B$24=\"\",\"\",'Compaction Info'!$B$24)","v":"Tex-144-E"},{"$f":"IF( 'Compaction Info'!$B$25=\"\",\"\", 'Compaction Info'!$B$25)","v":"Specimen Compaction Worksheet"},{"$f":"IF('Compaction Info'!$L$31=\"\",\"\",'Compaction Info'!$L$31)","v":"At Conclusion of Test WDRY + Pan (lb)"},{"$f":"IF('Compaction Info'!$B$31=\"\",\"\",'Compaction Info'!$B$31)","v":"Specimen No."},{"$f":"IF('Compaction Info'!$B$33=\"\",\"\",'Compaction Info'!$B$33)","v":1}]
[181,{"$f":"IF('Compaction Info'!$M$33=\"\",\"\",'Compaction Info'!$M$33)","v":""},{"$f":"IF('Compaction Info'!$B$24=\"\",\"\",'Compaction Info'!$B$24)","v":"Tex-144-E"},{"$f":"IF( 'Compaction Info'!$B$25=\"\",\"\", 'Compaction Info'!$B$25)","v":"Specimen Compaction Worksheet"},{"$f":"IF('Compaction Info'!$M$31=\"\",\"\",'Compaction Info'!$M$31)","v":"At Conclusion of Test Pan Wt. (lb)"},{"$f":"IF('Compaction Info'!$B$31=\"\",\"\",'Compaction Info'!$B$31)","v":"Specimen No."},{"$f":"IF('Compaction Info'!$B$33=\"\",\"\",'Compaction Info'!$B$33)","v":1}]
[182,{"$f":"IF('Compaction Info'!$N$33=\"\",\"\",'Compaction Info'!$N$33)","v":""},{"$f":"IF('Compaction Info'!$B$24=\"\",\"\",'Compaction Info'!$B$24)","v":"Tex-144-E"},{"$f":"IF( 'Compaction Info'!$B$25=\"\",\"\", 'Compaction Info'!$B$25)","v":"Specimen Compaction Worksheet"},{"$f":"IF('Compaction Info'!$N$31=\"\",\"\",'Compaction Info'!$N$31)","v":"MCCOMPACT (%)"},{"$f":"IF('Compaction Info'!$B$31=\"\",\"\",'Compaction Info'!$B$31)","v":"Specimen No."},{"$f":"IF('Compaction Info'!$B$33=\"\",\"\",'Compaction Info'!$B$33)","v":1}]
[183,{"$f":"IF('Compaction Info'!$O$33=\"\",\"\",'Compaction Info'!$O$33)","v":""},{"$f":"IF('Compaction Info'!$B$24=\"\",\"\",'Compaction Info'!$B$24)","v":"Tex-144-E"},{"$f":"IF( 'Compaction Info'!$B$25=\"\",\"\", 'Compaction Info'!$B$25)","v":"Specimen Compaction Worksheet"},{"$f":"IF('Compaction Info'!$O$31=\"\",\"\",'Compaction Info'!$O$31)","v":"MCINITIAL (%)"},{"$f":"IF('Compaction Info'!$B$31=\"\",\"\",'Compaction Info'!$B$31)","v":"Specimen No."},{"$f":"IF('Compaction Info'!$B$33=\"\",\"\",'Compaction Info'!$B$33)","v":1}]
[184,{"$f":"IF('Compaction Info'!$P$33=\"\",\"\",'Compaction Info'!$P$33)","v":""},{"$f":"IF('Compaction Info'!$B$24=\"\",\"\",'Compaction Info'!$B$24)","v":"Tex-144-E"},{"$f":"IF( 'Compaction Info'!$B$25=\"\",\"\", 'Compaction Info'!$B$25)","v":"Specimen Compaction Worksheet"},{"$f":"IF('Compaction Info'!$P$31=\"\",\"\",'Compaction Info'!$P$31)","v":"MCFINAL (%)"},{"$f":"IF('Compaction Info'!$B$31=\"\",\"\",'Compaction Info'!$B$31)","v":"Specimen No."},{"$f":"IF('Compaction Info'!$B$33=\"\",\"\",'Compaction Info'!$B$33)","v":1}]
[185,{"$f":"IF('Compaction Info'!$C$34=\"\",\"\",'Compaction Info'!$C$34)","v":""},{"$f":"IF('Compaction Info'!$B$24=\"\",\"\",'Compaction Info'!$B$24)","v":"Tex-144-E"},{"$f":"IF( 'Compaction Info'!$B$25=\"\",\"\", 'Compaction Info'!$B$25)","v":"Specimen Compaction Worksheet"},{"$f":"IF('Compaction Info'!$C$31=\"\",\"\",'Compaction Info'!$C$31)","v":"WTOTAL (lb)"},{"$f":"IF('Compaction Info'!$B$31=\"\",\"\",'Compaction Info'!$B$31)","v":"Specimen No."},{"$f":"IF('Compaction Info'!$B$34=\"\",\"\",'Compaction Info'!$B$34)","v":2}]
[186,{"$f":"IF('Compaction Info'!$D$34=\"\",\"\",'Compaction Info'!$D$34)","v":""},{"$f":"IF('Compaction Info'!$B$24=\"\",\"\",'Compaction Info'!$B$24)","v":"Tex-144-E"},{"$f":"IF( 'Compaction Info'!$B$25=\"\",\"\", 'Compaction Info'!$B$25)","v":"Specimen Compaction Worksheet"},{"$f":"IF('Compaction Info'!$D$31=\"\",\"\",'Compaction Info'!$D$31)","v":"Wt. of Moist Specimen (lb)"},{"$f":"IF('Compaction Info'!$B$31=\"\",\"\",'Compaction Info'!$B$31)","v":"Specimen No."},{"$f":"IF('Compaction Info'!$B$34=\"\",\"\",'Compaction Info'!$B$34)","v":2}]
[187,{"$f":"IF('Compaction Info'!$E$34=\"\",\"\",'Compaction Info'!$E$34)","v":""},{"$f":"IF('Compaction Info'!$B$24=\"\",\"\",'Compaction Info'!$B$24)","v":"Tex-144-E"},{"$f":"IF( 'Compaction Info'!$B$25=\"\",\"\", 'Compaction Info'!$B$25)","v":"Specimen Compaction Worksheet"},{"$f":"IF('Compaction Info'!$E$31=\"\",\"\",'Compaction Info'!$E$31)","v":" Ht (in)"},{"$f":"IF('Compaction Info'!$B$31=\"\",\"\",'Compaction Info'!$B$31)","v":"Specimen No."},{"$f":"IF('Compaction Info'!$B$34=\"\",\"\",'Compaction Info'!$B$34)","v":2}]
[188,{"$f":"IF('Compaction Info'!$F$34=\"\",\"\",'Compaction Info'!$F$34)","v":6},{"$f":"IF('Compaction Info'!$B$24=\"\",\"\",'Compaction Info'!$B$24)","v":"Tex-144-E"},{"$f":"IF( 'Compaction Info'!$B$25=\"\",\"\", 'Compaction Info'!$B$25)","v":"Specimen Compaction Worksheet"},{"$f":"IF('Compaction Info'!$F$31=\"\",\"\",'Compaction Info'!$F$31)","v":"Specimen Dia. (in)"},{"$f":"IF('Compaction Info'!$B$31=\"\",\"\",'Compaction Info'!$B$31)","v":"Specimen No."},{"$f":"IF('Compaction Info'!$B$34=\"\",\"\",'Compaction Info'!$B$34)","v":2}]
[189,{"$f":"IF('Compaction Info'!$G$34=\"\",\"\",'Compaction Info'!$G$34)","v":""},{"$f":"IF('Compaction Info'!$B$24=\"\",\"\",'Compaction Info'!$B$24)","v":"Tex-144-E"},{"$f":"IF( 'Compaction Info'!$B$25=\"\",\"\", 'Compaction Info'!$B$25)","v":"Specimen Compaction Worksheet"},{"$f":"IF('Compaction Info'!$G$31=\"\",\"\",'Compaction Info'!$G$31)","v":"Wet Density"},{"$f":"IF('Compaction Info'!$B$31=\"\",\"\",'Compaction Info'!$B$31)","v":"Specimen No."},{"$f":"IF('Compaction Info'!$B$34=\"\",\"\",'Compaction Info'!$B$34)","v":2}]
[190,{"$f":"IF('Compaction Info'!$H$34=\"\",\"\",'Compaction Info'!$H$34)","v":""},{"$f":"IF('Compaction Info'!$B$24=\"\",\"\",'Compaction Info'!$B$24)","v":"Tex-144-E"},{"$f":"IF( 'Compaction Info'!$B$25=\"\",\"\", 'Compaction Info'!$B$25)","v":"Specimen Compaction Worksheet"},{"$f":"IF('Compaction Info'!$H$31=\"\",\"\",'Compaction Info'!$H$31)","v":"WSTONES (lb)"},{"$f":"IF('Compaction Info'!$B$31=\"\",\"\",'Compaction Info'!$B$31)","v":"Specimen No."},{"$f":"IF('Compaction Info'!$B$34=\"\",\"\",'Compaction Info'!$B$34)","v":2}]
[191,{"$f":"IF('Compaction Info'!$I$34=\"\",\"\",'Compaction Info'!$I$34)","v":""},{"$f":"IF('Compaction Info'!$B$24=\"\",\"\",'Compaction Info'!$B$24)","v":"Tex-144-E"},{"$f":"IF( 'Compaction Info'!$B$25=\"\",\"\", 'Compaction Info'!$B$25)","v":"Specimen Compaction Worksheet"},{"$f":"IF('Compaction Info'!$I$31=\"\",\"\",'Compaction Info'!$I$31)","v":"After Molding WCOMPACT (lb)"},{"$f":"IF('Compaction Info'!$B$31=\"\",\"\",'Compaction Info'!$B$31)","v":"Specimen No."},{"$f":"IF('Compaction Info'!$B$34=\"\",\"\",'Compaction Info'!$B$34)","v":2}]
[192,{"$f":"IF('Compaction Info'!$J$34=\"\",\"\",'Compaction Info'!$J$34)","v":""},{"$f":"IF('Compaction Info'!$B$24=\"\",\"\",'Compaction Info'!$B$24)","v":"Tex-144-E"},{"$f":"IF( 'Compaction Info'!$B$25=\"\",\"\", 'Compaction Info'!$B$25)","v":"Specimen Compaction Worksheet"},{"$f":"IF('Compaction Info'!$J$31=\"\",\"\",'Compaction Info'!$J$31)","v":"After Drying WPARTIAL DRY (lb)"},{"$f":"IF('Compaction Info'!$B$31=\"\",\"\",'Compaction Info'!$B$31)","v":"Specimen No."},{"$f":"IF('Compaction Info'!$B$34=\"\",\"\",'Compaction Info'!$B$34)","v":2}]
[193,{"$f":"IF('Compaction Info'!$K$34=\"\",\"\",'Compaction Info'!$K$34)","v":""},{"$f":"IF('Compaction Info'!$B$24=\"\",\"\",'Compaction Info'!$B$24)","v":"Tex-144-E"},{"$f":"IF( 'Compaction Info'!$B$25=\"\",\"\", 'Compaction Info'!$B$25)","v":"Specimen Compaction Worksheet"},{"$f":"IF('Compaction Info'!$K$31=\"\",\"\",'Compaction Info'!$K$31)","v":"At Conclusion of Test WWET + Pan (lb)"},{"$f":"IF('Compaction Info'!$B$31=\"\",\"\",'Compaction Info'!$B$31)","v":"Specimen No."},{"$f":"IF('Compaction Info'!$B$34=\"\",\"\",'Compaction Info'!$B$34)","v":2}]
[194,{"$f":"IF('Compaction Info'!$L$34=\"\",\"\",'Compaction Info'!$L$34)","v":""},{"$f":"IF('Compaction Info'!$B$24=\"\",\"\",'Compaction Info'!$B$24)","v":"Tex-144-E"},{"$f":"IF( 'Compaction Info'!$B$25=\"\",\"\", 'Compaction Info'!$B$25)","v":"Specimen Compaction Worksheet"},{"$f":"IF('Compaction Info'!$L$31=\"\",\"\",'Compaction Info'!$L$31)","v":"At Conclusion of Test WDRY + Pan (lb)"},{"$f":"IF('Compaction Info'!$B$31=\"\",\"\",'Compaction Info'!$B$31)","v":"Specimen No."},{"$f":"IF('Compaction Info'!$B$34=\"\",\"\",'Compaction Info'!$B$34)","v":2}]
[195,{"$f":"IF('Compaction Info'!$M$34=\"\",\"\",'Compaction Info'!$M$34)","v":""},{"$f":"IF('Compaction Info'!$B$24=\"\",\"\",'Compaction Info'!$B$24)","v":"Tex-144-E"},{"$f":"IF( 'Compaction Info'!$B$25=\"\",\"\", 'Compaction Info'!$B$25)","v":"Specimen Compaction Worksheet"},{"$f":"IF('Compaction Info'!$M$31=\"\",\"\",'Compaction Info'!$M$31)","v":"At Conclusion of Test Pan Wt. (lb)"},{"$f":"IF('Compaction Info'!$B$31=\"\",\"\",'Compaction Info'!$B$31)","v":"Specimen No."},{"$f":"IF('Compaction Info'!$B$34=\"\",\"\",'Compaction Info'!$B$34)","v":2}]
[196,{"$f":"IF('Compaction Info'!$N$34=\"\",\"\",'Compaction Info'!$N$34)","v":""},{"$f":"IF('Compaction Info'!$B$24=\"\",\"\",'Compaction Info'!$B$24)","v":"Tex-144-E"},{"$f":"IF( 'Compaction Info'!$B$25=\"\",\"\", 'Compaction Info'!$B$25)","v":"Specimen Compaction Worksheet"},{"$f":"IF('Compaction Info'!$N$31=\"\",\"\",'Compaction Info'!$N$31)","v":"MCCOMPACT (%)"},{"$f":"IF('Compaction Info'!$B$31=\"\",\"\",'Compaction Info'!$B$31)","v":"Specimen No."},{"$f":"IF('Compaction Info'!$B$34=\"\",\"\",'Compaction Info'!$B$34)","v":2}]
[197,{"$f":"IF('Compaction Info'!$O$34=\"\",\"\",'Compaction Info'!$O$34)","v":""},{"$f":"IF('Compaction Info'!$B$24=\"\",\"\",'Compaction Info'!$B$24)","v":"Tex-144-E"},{"$f":"IF( 'Compaction Info'!$B$25=\"\",\"\", 'Compaction Info'!$B$25)","v":"Specimen Compaction Worksheet"},{"$f":"IF('Compaction Info'!$O$31=\"\",\"\",'Compaction Info'!$O$31)","v":"MCINITIAL (%)"},{"$f":"IF('Compaction Info'!$B$31=\"\",\"\",'Compaction Info'!$B$31)","v":"Specimen No."},{"$f":"IF('Compaction Info'!$B$34=\"\",\"\",'Compaction Info'!$B$34)","v":2}]
[198,{"$f":"IF('Compaction Info'!$P$34=\"\",\"\",'Compaction Info'!$P$34)","v":""},{"$f":"IF('Compaction Info'!$B$24=\"\",\"\",'Compaction Info'!$B$24)","v":"Tex-144-E"},{"$f":"IF( 'Compaction Info'!$B$25=\"\",\"\", 'Compaction Info'!$B$25)","v":"Specimen Compaction Worksheet"},{"$f":"IF('Compaction Info'!$P$31=\"\",\"\",'Compaction Info'!$P$31)","v":"MCFINAL (%)"},{"$f":"IF('Compaction Info'!$B$31=\"\",\"\",'Compaction Info'!$B$31)","v":"Specimen No."},{"$f":"IF('Compaction Info'!$B$34=\"\",\"\",'Compaction Info'!$B$34)","v":2}]
[199,{"$f":"IF('Compaction Info'!$C$35=\"\",\"\",'Compaction Info'!$C$35)","v":""},{"$f":"IF('Compaction Info'!$B$24=\"\",\"\",'Compaction Info'!$B$24)","v":"Tex-144-E"},{"$f":"IF( 'Compaction Info'!$B$25=\"\",\"\", 'Compaction Info'!$B$25)","v":"Specimen Compaction Worksheet"},{"$f":"IF('Compaction Info'!$C$31=\"\",\"\",'Compaction Info'!$C$31)","v":"WTOTAL (lb)"},{"$f":"IF('Compaction Info'!$B$31=\"\",\"\",'Compaction Info'!$B$31)","v":"Specimen No."},{"$f":"IF('Compaction Info'!$B$35=\"\",\"\",'Compaction Info'!$B$35)","v":3}]
[200,{"$f":"IF('Compaction Info'!$D$35=\"\",\"\",'Compaction Info'!$D$35)","v":""},{"$f":"IF('Compaction Info'!$B$24=\"\",\"\",'Compaction Info'!$B$24)","v":"Tex-144-E"},{"$f":"IF( 'Compaction Info'!$B$25=\"\",\"\", 'Compaction Info'!$B$25)","v":"Specimen Compaction Worksheet"},{"$f":"IF('Compaction Info'!$D$31=\"\",\"\",'Compaction Info'!$D$31)","v":"Wt. of Moist Specimen (lb)"},{"$f":"IF('Compaction Info'!$B$31=\"\",\"\",'Compaction Info'!$B$31)","v":"Specimen No."},{"$f":"IF('Compaction Info'!$B$35=\"\",\"\",'Compaction Info'!$B$35)","v":3}]
[201,{"$f":"IF('Compaction Info'!$E$35=\"\",\"\",'Compaction Info'!$E$35)","v":""},{"$f":"IF('Compaction Info'!$B$24=\"\",\"\",'Compaction Info'!$B$24)","v":"Tex-144-E"},{"$f":"IF( 'Compaction Info'!$B$25=\"\",\"\", 'Compaction Info'!$B$25)","v":"Specimen Compaction Worksheet"},{"$f":"IF('Compaction Info'!$E$31=\"\",\"\",'Compaction Info'!$E$31)","v":" Ht (in)"},{"$f":"IF('Compaction Info'!$B$31=\"\",\"\",'Compaction Info'!$B$31)","v":"Specimen No."},{"$f":"IF('Compaction Info'!$B$35=\"\",\"\",'Compaction Info'!$B$35)","v":3}]
[202,{"$f":"IF('Compaction Info'!$F$35=\"\",\"\",'Compaction Info'!$F$35)","v":6},{"$f":"IF('Compaction Info'!$B$24=\"\",\"\",'Compaction Info'!$B$24)","v":"Tex-144-E"},{"$f":"IF( 'Compaction Info'!$B$25=\"\",\"\", 'Compaction Info'!$B$25)","v":"Specimen Compaction Worksheet"},{"$f":"IF('Compaction Info'!$F$31=\"\",\"\",'Compaction Info'!$F$31)","v":"Specimen Dia. (in)"},{"$f":"IF('Compaction Info'!$B$31=\"\",\"\",'Compaction Info'!$B$31)","v":"Specimen No."},{"$f":"IF('Compaction Info'!$B$35=\"\",\"\",'Compaction Info'!$B$35)","v":3}]
[203,{"$f":"IF('Compaction Info'!$G$35=\"\",\"\",'Compaction Info'!$G$35)","v":""},{"$f":"IF('Compaction Info'!$B$24=\"\",\"\",'Compaction Info'!$B$24)","v":"Tex-144-E"},{"$f":"IF( 'Compaction Info'!$B$25=\"\",\"\", 'Compaction Info'!$B$25)","v":"Specimen Compaction Worksheet"},{"$f":"IF('Compaction Info'!$G$31=\"\",\"\",'Compaction Info'!$G$31)","v":"Wet Density"},{"$f":"IF('Compaction Info'!$B$31=\"\",\"\",'Compaction Info'!$B$31)","v":"Specimen No."},{"$f":"IF('Compaction Info'!$B$35=\"\",\"\",'Compaction Info'!$B$35)","v":3}]
[204,{"$f":"IF('Compaction Info'!$H$35=\"\",\"\",'Compaction Info'!$H$35)","v":""},{"$f":"IF('Compaction Info'!$B$24=\"\",\"\",'Compaction Info'!$B$24)","v":"Tex-144-E"},{"$f":"IF( 'Compaction Info'!$B$25=\"\",\"\", 'Compaction Info'!$B$25)","v":"Specimen Compaction Worksheet"},{"$f":"IF('Compaction Info'!$H$31=\"\",\"\",'Compaction Info'!$H$31)","v":"WSTONES (lb)"},{"$f":"IF('Compaction Info'!$B$31=\"\",\"\",'Compaction Info'!$B$31)","v":"Specimen No."},{"$f":"IF('Compaction Info'!$B$35=\"\",\"\",'Compaction Info'!$B$35)","v":3}]
[205,{"$f":"IF('Compaction Info'!$I$35=\"\",\"\",'Compaction Info'!$I$35)","v":""},{"$f":"IF('Compaction Info'!$B$24=\"\",\"\",'Compaction Info'!$B$24)","v":"Tex-144-E"},{"$f":"IF( 'Compaction Info'!$B$25=\"\",\"\", 'Compaction Info'!$B$25)","v":"Specimen Compaction Worksheet"},{"$f":"IF('Compaction Info'!$I$31=\"\",\"\",'Compaction Info'!$I$31)","v":"After Molding WCOMPACT (lb)"},{"$f":"IF('Compaction Info'!$B$31=\"\",\"\",'Compaction Info'!$B$31)","v":"Specimen No."},{"$f":"IF('Compaction Info'!$B$35=\"\",\"\",'Compaction Info'!$B$35)","v":3}]
[206,{"$f":"IF('Compaction Info'!$J$35=\"\",\"\",'Compaction Info'!$J$35)","v":""},{"$f":"IF('Compaction Info'!$B$24=\"\",\"\",'Compaction Info'!$B$24)","v":"Tex-144-E"},{"$f":"IF( 'Compaction Info'!$B$25=\"\",\"\", 'Compaction Info'!$B$25)","v":"Specimen Compaction Worksheet"},{"$f":"IF('Compaction Info'!$J$31=\"\",\"\",'Compaction Info'!$J$31)","v":"After Drying WPARTIAL DRY (lb)"},{"$f":"IF('Compaction Info'!$B$31=\"\",\"\",'Compaction Info'!$B$31)","v":"Specimen No."},{"$f":"IF('Compaction Info'!$B$35=\"\",\"\",'Compaction Info'!$B$35)","v":3}]
[207,{"$f":"IF('Compaction Info'!$K$35=\"\",\"\",'Compaction Info'!$K$35)","v":""},{"$f":"IF('Compaction Info'!$B$24=\"\",\"\",'Compaction Info'!$B$24)","v":"Tex-144-E"},{"$f":"IF( 'Compaction Info'!$B$25=\"\",\"\", 'Compaction Info'!$B$25)","v":"Specimen Compaction Worksheet"},{"$f":"IF('Compaction Info'!$K$31=\"\",\"\",'Compaction Info'!$K$31)","v":"At Conclusion of Test WWET + Pan (lb)"},{"$f":"IF('Compaction Info'!$B$31=\"\",\"\",'Compaction Info'!$B$31)","v":"Specimen No."},{"$f":"IF('Compaction Info'!$B$35=\"\",\"\",'Compaction Info'!$B$35)","v":3}]
[208,{"$f":"IF('Compaction Info'!$L$35=\"\",\"\",'Compaction Info'!$L$35)","v":""},{"$f":"IF('Compaction Info'!$B$24=\"\",\"\",'Compaction Info'!$B$24)","v":"Tex-144-E"},{"$f":"IF( 'Compaction Info'!$B$25=\"\",\"\", 'Compaction Info'!$B$25)","v":"Specimen Compaction Worksheet"},{"$f":"IF('Compaction Info'!$L$31=\"\",\"\",'Compaction Info'!$L$31)","v":"At Conclusion of Test WDRY + Pan (lb)"},{"$f":"IF('Compaction Info'!$B$31=\"\",\"\",'Compaction Info'!$B$31)","v":"Specimen No."},{"$f":"IF('Compaction Info'!$B$35=\"\",\"\",'Compaction Info'!$B$35)","v":3}]
[209,{"$f":"IF('Compaction Info'!$M$35=\"\",\"\",'Compaction Info'!$M$35)","v":""},{"$f":"IF('Compaction Info'!$B$24=\"\",\"\",'Compaction Info'!$B$24)","v":"Tex-144-E"},{"$f":"IF( 'Compaction Info'!$B$25=\"\",\"\", 'Compaction Info'!$B$25)","v":"Specimen Compaction Worksheet"},{"$f":"IF('Compaction Info'!$M$31=\"\",\"\",'Compaction Info'!$M$31)","v":"At Conclusion of Test Pan Wt. (lb)"},{"$f":"IF('Compaction Info'!$B$31=\"\",\"\",'Compaction Info'!$B$31)","v":"Specimen No."},{"$f":"IF('Compaction Info'!$B$35=\"\",\"\",'Compaction Info'!$B$35)","v":3}]
[210,{"$f":"IF('Compaction Info'!$N$35=\"\",\"\",'Compaction Info'!$N$35)","v":""},{"$f":"IF('Compaction Info'!$B$24=\"\",\"\",'Compaction Info'!$B$24)","v":"Tex-144-E"},{"$f":"IF( 'Compaction Info'!$B$25=\"\",\"\", 'Compaction Info'!$B$25)","v":"Specimen Compaction Worksheet"},{"$f":"IF('Compaction Info'!$N$31=\"\",\"\",'Compaction Info'!$N$31)","v":"MCCOMPACT (%)"},{"$f":"IF('Compaction Info'!$B$31=\"\",\"\",'Compaction Info'!$B$31)","v":"Specimen No."},{"$f":"IF('Compaction Info'!$B$35=\"\",\"\",'Compaction Info'!$B$35)","v":3}]
[211,{"$f":"IF('Compaction Info'!$O$35=\"\",\"\",'Compaction Info'!$O$35)","v":""},{"$f":"IF('Compaction Info'!$B$24=\"\",\"\",'Compaction Info'!$B$24)","v":"Tex-144-E"},{"$f":"IF( 'Compaction Info'!$B$25=\"\",\"\", 'Compaction Info'!$B$25)","v":"Specimen Compaction Worksheet"},{"$f":"IF('Compaction Info'!$O$31=\"\",\"\",'Compaction Info'!$O$31)","v":"MCINITIAL (%)"},{"$f":"IF('Compaction Info'!$B$31=\"\",\"\",'Compaction Info'!$B$31)","v":"Specimen No."},{"$f":"IF('Compaction Info'!$B$35=\"\",\"\",'Compaction Info'!$B$35)","v":3}]
[212,{"$f":"IF('Compaction Info'!$P$35=\"\",\"\",'Compaction Info'!$P$35)","v":""},{"$f":"IF('Compaction Info'!$B$24=\"\",\"\",'Compaction Info'!$B$24)","v":"Tex-144-E"},{"$f":"IF( 'Compaction Info'!$B$25=\"\",\"\", 'Compaction Info'!$B$25)","v":"Specimen Compaction Worksheet"},{"$f":"IF('Compaction Info'!$P$31=\"\",\"\",'Compaction Info'!$P$31)","v":"MCFINAL (%)"},{"$f":"IF('Compaction Info'!$B$31=\"\",\"\",'Compaction Info'!$B$31)","v":"Specimen No."},{"$f":"IF('Compaction Info'!$B$35=\"\",\"\",'Compaction Info'!$B$35)","v":3}]
[213,{"$f":"IF('Report - Specimen #1'!$C$76=\"\",\"\",'Report - Specimen #1'!$C$76)","v":" "},"Tested By ",{"$f":"IF('Report - Specimen #1'!$B$76=\"\",\"\",'Report - Specimen #1'!$B$76)","v":"TX400"}]
[214,{"$f":"IF('Report - Specimen #1'!$F$76=\"\",\"\",'Report - Specimen #1'!$F$76)","v":" "},"Tested Date ",{"$f":"IF('Report - Specimen #1'!$B$76=\"\",\"\",'Report - Specimen #1'!$B$76)","v":"TX400"}]