{"text_format":"1","workbook":"xlsx","n_sheets":3,"sheets":["Tex-200-F","RX","Sieves"],"not_rendered":{"charts":0,"images":1,"macros":1,"external_links":0,"defined_names":134,"comments":1,"pivot_tables":0},"unopened":[],"bounds":{"document_bytes":16777216,"sheet_cells":100000,"rows_first":2000,"rows_last":500,"rows_between":2000,"halvings":0,"cell_chars":16384,"cell_head_chars":4096},"cells_cut":0,"cells_raw":0,"read":"whole","date_system":"1900"}

{"sheet":"Tex-200-F","index":0,"n_rows":66,"n_cols":11,"rows_kept":66,"cut":false,"hidden":false,"merged":[[62,1,62,3],[27,7,28,7],[27,8,28,8],[16,3,16,4],[23,1,23,3],[24,1,24,3],[27,6,28,6],[26,6,26,7],[16,7,16,8],[52,1,52,8],[26,3,28,3],[58,2,58,4],[60,2,60,4],[53,2,53,4],[54,2,54,4],[66,1,66,3],[15,3,15,8],[11,3,11,4],[12,3,12,4],[11,7,11,8],[13,3,13,4],[13,7,13,8],[51,1,51,8],[12,7,12,8],[56,2,56,4],[62,6,62,8],[26,1,28,1],[55,2,55,4],[49,1,50,8],[42,3,42,7],[26,2,27,2],[14,3,14,8],[43,3,43,7],[0,0,0,1],[7,3,7,4],[7,7,7,8],[10,7,10,8],[8,7,8,8],[8,3,8,4],[10,3,10,4],[9,7,9,8],[9,3,9,4],[26,5,28,5],[26,4,28,4]]}
["TxDOT Manuals >",null,null,"Tex-200-F"]
[null,"TEXAS DEPARTMENT OF TRANSPORTATION",null,null,null,null,null,null,null,null,68]
[null,null,null,null,null,null,null,null,null,null,4]
[null,null,null,null,null,null,null,null,null,null,"tx200.xlsm::45574.602025"]
[null,"SIEVE ANALYSIS OF NON-SURFACE TREATMENT AGGREGATES"]
[null,"Tex-200-F"]
[null,null,null,null,null,null,null,null,{"$f":"\"TX200 :: File Version: \" & TEXT(MID(sn,SEARCH(\"::\",sn,1)+2,20),\"mm/dd/yy hh:mm:ss\")","v":"TX200 :: File Version: 10/09/24 14:26:55"}]
[null,null,"SAMPLE ID:",null,null,null,"SAMPLED DATE:"]
[null,null,"TEST NUMBER:",null,null,null,"LETTING DATE:"]
[null,null,"SAMPLE STATUS:",null,null,null,"CONTROLLING CSJ:"]
[null,null,"COUNTY:",null,null,null,"SPEC YEAR:"]
[null,null,"SAMPLED BY:",null,null,null,"SPEC ITEM:"]
[null,null,"SAMPLE LOCATION:",null,null,null,"SPECIAL PROVISION:"]
[null,null,"MATERIAL CODE:",null,null,null,"GRADE:"]
[null,null,"MATERIAL NAME:"]
[null,null,"PRODUCER:"]
[null,null,"AREA ENGINEER:",null,null,null,"PROJECT MANAGER:"]
[]
[null,null,"COURSE\\LIFT:",null,"STATION:",null,null,"DIST. FROM CL:"]
[]
[null,"SIEVE ANALYSIS"]
[null,"Tex-200-F: Part I & II"]
[]
[null,"Original Dry Weight, (g):"]
[null,"Dry Weight After Washing, (g):"]
[]
[null,"Sieve Size",{"$f":"IF(Field7=\"\",\"Individual\",Field7) & \" Weight Retained, (g)\"","v":"Individual Weight Retained, (g)"},{"$f":"IF(C29=\"Cumulative\",\"Individual\",\"Cumulative\")&\" Weight Retained, (g)\"","v":"Cumulative Weight Retained, (g)"},"Cumulative Percent Retained, (%)","Cumulative Percent Passing, (%)","Limits as Percent:"]
[null,null,null,null,null,null,"Lower Limit of Grading (%)","Upper Limit of Grading (%)","Within Grading Limits"]
[]
[null,null,null,{"$f":"IF($C30=\"\",\"\",$C30)","v":""},{"$f":"IF($C30=\"\",\"\",IF(RetainedMethod=\"Cumulative\",C30/Total*100,D30/Total*100))","v":""},{"$f":"IF($E30=\"\",\"\",100-$E30)","v":""},null,null,{"$f":"IF(OR($G30=\"\",$H30=\"\"),\"\",IF(PassingRetained=\"passing\",IF(AND($F30>=$G30,$F30<=$H30),\"Yes\",\"No\"),IF(AND($E30>=$G30,$E30<=$H30),\"Yes\",\"No\")))","v":""}]
[null,null,null,{"$f":"IF(C31=\"\",\"\",IF(RetainedMethod=\"Cumulative\",($C31-$C30),SUM($C$30:$C31)))","v":""},"","",null,null,""]
[null,null,null,{"$f":"IF(C32=\"\",\"\",IF(RetainedMethod=\"Cumulative\",($C32-$C31),SUM($C$30:$C32)))","v":""},"","",null,null,""]
[null,null,null,{"$f":"IF(C33=\"\",\"\",IF(RetainedMethod=\"Cumulative\",($C33-$C32),SUM($C$30:$C33)))","v":""},"","",null,null,""]
[null,null,null,{"$f":"IF(C34=\"\",\"\",IF(RetainedMethod=\"Cumulative\",($C34-$C33),SUM($C$30:$C34)))","v":""},"","",null,null,""]
[null,null,null,{"$f":"IF(C35=\"\",\"\",IF(RetainedMethod=\"Cumulative\",($C35-$C34),SUM($C$30:$C35)))","v":""},"","",null,null,""]
[null,null,null,{"$f":"IF(C36=\"\",\"\",IF(RetainedMethod=\"Cumulative\",($C36-$C35),SUM($C$30:$C36)))","v":""},"","",null,null,""]
[null,null,null,{"$f":"IF(C37=\"\",\"\",IF(RetainedMethod=\"Cumulative\",($C37-$C36),SUM($C$30:$C37)))","v":""},"","",null,null,""]
[null,null,null,{"$f":"IF(C38=\"\",\"\",IF(RetainedMethod=\"Cumulative\",($C38-$C37),SUM($C$30:$C38)))","v":""},"","",null,null,""]
[null,null,null,{"$f":"IF(C39=\"\",\"\",IF(RetainedMethod=\"Cumulative\",($C39-$C38),SUM($C$30:$C39)))","v":""},"","",null,null,""]
[null,null,null,{"$f":"IF(C40=\"\",\"\",IF(RetainedMethod=\"Cumulative\",($C40-$C39),SUM($C$30:$C40)))","v":""},"","",null,null,""]
[null,null,null,{"$f":"IF(C41=\"\",\"\",IF(RetainedMethod=\"Cumulative\",($C41-$C40),SUM($C$30:$C41)))","v":""},"","",null,null,""]
[null,{"$f":"\"-\"&OFFSET(B42,-COUNTBLANK(B30:B41)-1,0)","v":"-"}]
[null,{"$f":"IF(sloss=0,\"\",IF(sloss<0,\"Check >>\",IF(ODSW<>\"\",IF(ABS(sloss)>ODSW*0.002,\"Too High >>\",\"\"),\"\")))","v":""},{"$f":"IF(SUM(C30:C42)=0,\"\",IF(DWAW<>\"\",DWAW-IF(RetainedMethod=\"Cumulative\",IF(ISERROR(LARGE(C30:C42,1)),0,LARGE(C30:C42,1)),SUM(C30:C42)),IF(ODSW<>\"\",ODSW-IF(RetainedMethod=\"Cumulative\",IF(ISERROR(LARGE(C30:C42,1)),0,LARGE(C30:C42,1)),SUM(C30:C42)),0)))","v":""},{"$f":"\"Sieving \" & IF(sloss<0,\"Gain\",\"Loss\") & \", (g) \" & IF(DWAW<>\"\",\"from 'Dry Weight After Washing'\",IF(ODSW<>\"\",\"from 'Original Dry Sample'\",\"\")) & \" weight\"","v":"Sieving Loss, (g)  weight"}]
[null,null,{"$f":"IF(SUM(C30:C42)=0,\"\",IF(AND(DWAW<>\"\",ODSW<>\"\"),ODSW-DWAW,0))","v":""},{"$f":"IF(ODSW-DWAW<0,\"ERROR, Wash Weight Greater Than Original Weight\",\"Washing Loss, (g)\")","v":"Washing Loss, (g)"}]
[null,{"$f":"\"Total \" & B42","v":"Total -"},{"$f":"IF(ISERROR(IF(RetainedMethod=\"cumulative\",LARGE(C30:C42,1),prepan)+sloss+wloss),\"\",IF(RetainedMethod=\"cumulative\",LARGE(C30:C42,1),prepan)+sloss+wloss)","v":""},{"$f":"IF(C42=\"\",\"\",IF(RetainedMethod=\"Cumulative\",(C45-SUM(D$30:D41)),SUM(C30:C41,pan)))","v":""},{"$f":"IF(C42=\"\",\"\",IF(RetainedMethod=\"cumulative\",pan/Total*100,D45/Total*100) )","v":""}]
[null,"Total Weight:",{"$f":"IF(ISERROR(IF(RetainedMethod=\"cumulative\",LARGE(C30:C42,1),prepan)+sloss+wloss),\"\",IF(RetainedMethod=\"Cumulative\",pan,SUM(C30:C41)+pan))","v":""}]
[]
[]
[null,"Remarks:",{"$f":"NOW()","v":"2024-10-09T14:26:55.680"}]
[]
[]
[]
[]
[null,"Sample Method:","Sampled By:",null,null,"Sampled Date:"]
[null,"TX400"]
[null,"Test Method:","Tested By:",null,null,"Tested Date:"]
[null,"TX200"]
[]
[null,"TX200PI"]
[]
[null,"TX200PII"]
[null,"Test Stamp Code:",null,null,"Omit Test:","Completed Date:","Reviewed By:"]
[]
[null,"Locked By:","TxDOT:","District:","Area:"]
[]
[null,"Authorized By:",null,null,"Authorized Date:"]

{"sheet":"RX","index":1,"n_rows":106,"n_cols":9,"rows_kept":106,"cut":false,"hidden":true,"merged":[]}
[{"$f":"COUNT(A3:A494)","v":104}]
["Fld_nbr","Value","Desc_1","Desc_2","Desc_3","Desc_4","Desc_5","Desc_6","Desc_7"]
[1,{"$f":"IF('Tex-200-F'!$B$50=\"\",\"\",'Tex-200-F'!$B$50)","v":""},{"$f":"'Tex-200-F'!$B$49","v":"Remarks:"}]
[2,{"$f":"IF('Tex-200-F'!$D$19=\"\",\"\",'Tex-200-F'!$D$19)","v":""},{"$f":"IF('Tex-200-F'!$C$19=\"\",\"\",'Tex-200-F'!$C$19)","v":"COURSE\\LIFT:"}]
[3,{"$f":"IF('Tex-200-F'!$C$57=\"\",\"\",'Tex-200-F'!$C$57)","v":""},"Tested By ",{"$f":"IF('Tex-200-F'!$B$57=\"\",\"\",'Tex-200-F'!$B$57)","v":"TX200"}]
[4,{"$f":"IF('Tex-200-F'!$F$57=\"\",\"\",'Tex-200-F'!$F$57)","v":""},"Tested Date ",{"$f":"IF('Tex-200-F'!$B$57=\"\",\"\",'Tex-200-F'!$B$57)","v":"TX200"}]
[5,{"$f":"IF('Tex-200-F'!$E$24=\"\",\"\",'Tex-200-F'!$E$24)","v":""},{"$f":"IF('Tex-200-F'!$B$22=\"\",\"\",'Tex-200-F'!$B$22)","v":"Tex-200-F: Part I & II"},{"$f":"IF('Tex-200-F'!$B$24=\"\",\"\",'Tex-200-F'!$B$24)","v":"Original Dry Weight, (g):"}]
[6,{"$f":"IF('Tex-200-F'!$E$25=\"\",\"\",'Tex-200-F'!$E$25)","v":""},{"$f":"IF('Tex-200-F'!$B$22=\"\",\"\",'Tex-200-F'!$B$22)","v":"Tex-200-F: Part I & II"},{"$f":"IF('Tex-200-F'!$B$25=\"\",\"\",'Tex-200-F'!$B$25)","v":"Dry Weight After Washing, (g):"}]
[7,{"$f":"IF('Tex-200-F'!$I$27=\"\",\"\",'Tex-200-F'!$I$27)","v":""},{"$f":"IF('Tex-200-F'!$B$22=\"\",\"\",'Tex-200-F'!$B$22)","v":"Tex-200-F: Part I & II"},{"$f":"IF('Tex-200-F'!$G$27=\"\",\"\",'Tex-200-F'!$G$27)","v":"Limits as Percent:"}]
[8,{"$f":"IF('Tex-200-F'!$C$30=\"\",\"\",'Tex-200-F'!$C$30)","v":""},{"$f":"IF('Tex-200-F'!$B$22=\"\",\"\",'Tex-200-F'!$B$22)","v":"Tex-200-F: Part I & II"},{"$f":"IF('Tex-200-F'!$C$27=\"\",\"\",'Tex-200-F'!$C$27)","v":"Individual Weight Retained, (g)"},{"$f":"IF('Tex-200-F'!$B$27=\"\",\"\",'Tex-200-F'!$B$27)","v":"Sieve Size"},{"$f":"IF('Tex-200-F'!$B$30=\"\",\"\",'Tex-200-F'!$B$30)","v":""}]
[9,{"$f":"IF('Tex-200-F'!$C$31=\"\",\"\",'Tex-200-F'!$C$31)","v":""},{"$f":"IF('Tex-200-F'!$B$22=\"\",\"\",'Tex-200-F'!$B$22)","v":"Tex-200-F: Part I & II"},{"$f":"IF('Tex-200-F'!$C$27=\"\",\"\",'Tex-200-F'!$C$27)","v":"Individual Weight Retained, (g)"},{"$f":"IF('Tex-200-F'!$B$27=\"\",\"\",'Tex-200-F'!$B$27)","v":"Sieve Size"},{"$f":"IF('Tex-200-F'!$B$31=\"\",\"\",'Tex-200-F'!$B$31)","v":""}]
[10,{"$f":"IF('Tex-200-F'!$C$32=\"\",\"\",'Tex-200-F'!$C$32)","v":""},{"$f":"IF('Tex-200-F'!$B$22=\"\",\"\",'Tex-200-F'!$B$22)","v":"Tex-200-F: Part I & II"},{"$f":"IF('Tex-200-F'!$C$27=\"\",\"\",'Tex-200-F'!$C$27)","v":"Individual Weight Retained, (g)"},{"$f":"IF('Tex-200-F'!$B$27=\"\",\"\",'Tex-200-F'!$B$27)","v":"Sieve Size"},{"$f":"IF('Tex-200-F'!$B$32=\"\",\"\",'Tex-200-F'!$B$32)","v":""}]
[11,{"$f":"IF('Tex-200-F'!$C$33=\"\",\"\",'Tex-200-F'!$C$33)","v":""},{"$f":"IF('Tex-200-F'!$B$22=\"\",\"\",'Tex-200-F'!$B$22)","v":"Tex-200-F: Part I & II"},{"$f":"IF('Tex-200-F'!$C$27=\"\",\"\",'Tex-200-F'!$C$27)","v":"Individual Weight Retained, (g)"},{"$f":"IF('Tex-200-F'!$B$27=\"\",\"\",'Tex-200-F'!$B$27)","v":"Sieve Size"},{"$f":"IF('Tex-200-F'!$B$33=\"\",\"\",'Tex-200-F'!$B$33)","v":""}]
[12,{"$f":"IF('Tex-200-F'!$C$34=\"\",\"\",'Tex-200-F'!$C$34)","v":""},{"$f":"IF('Tex-200-F'!$B$22=\"\",\"\",'Tex-200-F'!$B$22)","v":"Tex-200-F: Part I & II"},{"$f":"IF('Tex-200-F'!$C$27=\"\",\"\",'Tex-200-F'!$C$27)","v":"Individual Weight Retained, (g)"},{"$f":"IF('Tex-200-F'!$B$27=\"\",\"\",'Tex-200-F'!$B$27)","v":"Sieve Size"},{"$f":"IF('Tex-200-F'!$B$34=\"\",\"\",'Tex-200-F'!$B$34)","v":""}]
[13,{"$f":"IF('Tex-200-F'!$C$35=\"\",\"\",'Tex-200-F'!$C$35)","v":""},{"$f":"IF('Tex-200-F'!$B$22=\"\",\"\",'Tex-200-F'!$B$22)","v":"Tex-200-F: Part I & II"},{"$f":"IF('Tex-200-F'!$C$27=\"\",\"\",'Tex-200-F'!$C$27)","v":"Individual Weight Retained, (g)"},{"$f":"IF('Tex-200-F'!$B$27=\"\",\"\",'Tex-200-F'!$B$27)","v":"Sieve Size"},{"$f":"IF('Tex-200-F'!$B$35=\"\",\"\",'Tex-200-F'!$B$35)","v":""}]
[14,{"$f":"IF('Tex-200-F'!$C$36=\"\",\"\",'Tex-200-F'!$C$36)","v":""},{"$f":"IF('Tex-200-F'!$B$22=\"\",\"\",'Tex-200-F'!$B$22)","v":"Tex-200-F: Part I & II"},{"$f":"IF('Tex-200-F'!$C$27=\"\",\"\",'Tex-200-F'!$C$27)","v":"Individual Weight Retained, (g)"},{"$f":"IF('Tex-200-F'!$B$27=\"\",\"\",'Tex-200-F'!$B$27)","v":"Sieve Size"},{"$f":"IF('Tex-200-F'!$B$36=\"\",\"\",'Tex-200-F'!$B$36)","v":""}]
[15,{"$f":"IF('Tex-200-F'!$C$37=\"\",\"\",'Tex-200-F'!$C$37)","v":""},{"$f":"IF('Tex-200-F'!$B$22=\"\",\"\",'Tex-200-F'!$B$22)","v":"Tex-200-F: Part I & II"},{"$f":"IF('Tex-200-F'!$C$27=\"\",\"\",'Tex-200-F'!$C$27)","v":"Individual Weight Retained, (g)"},{"$f":"IF('Tex-200-F'!$B$27=\"\",\"\",'Tex-200-F'!$B$27)","v":"Sieve Size"},{"$f":"IF('Tex-200-F'!$B$37=\"\",\"\",'Tex-200-F'!$B$37)","v":""}]
[16,{"$f":"IF('Tex-200-F'!$C$38=\"\",\"\",'Tex-200-F'!$C$38)","v":""},{"$f":"IF('Tex-200-F'!$B$22=\"\",\"\",'Tex-200-F'!$B$22)","v":"Tex-200-F: Part I & II"},{"$f":"IF('Tex-200-F'!$C$27=\"\",\"\",'Tex-200-F'!$C$27)","v":"Individual Weight Retained, (g)"},{"$f":"IF('Tex-200-F'!$B$27=\"\",\"\",'Tex-200-F'!$B$27)","v":"Sieve Size"},{"$f":"IF('Tex-200-F'!$B$38=\"\",\"\",'Tex-200-F'!$B$38)","v":""}]
[17,{"$f":"IF('Tex-200-F'!$C$39=\"\",\"\",'Tex-200-F'!$C$39)","v":""},{"$f":"IF('Tex-200-F'!$B$22=\"\",\"\",'Tex-200-F'!$B$22)","v":"Tex-200-F: Part I & II"},{"$f":"IF('Tex-200-F'!$C$27=\"\",\"\",'Tex-200-F'!$C$27)","v":"Individual Weight Retained, (g)"},{"$f":"IF('Tex-200-F'!$B$27=\"\",\"\",'Tex-200-F'!$B$27)","v":"Sieve Size"},{"$f":"IF('Tex-200-F'!$B$39=\"\",\"\",'Tex-200-F'!$B$39)","v":""}]
[18,{"$f":"IF('Tex-200-F'!$C$40=\"\",\"\",'Tex-200-F'!$C$40)","v":""},{"$f":"IF('Tex-200-F'!$B$22=\"\",\"\",'Tex-200-F'!$B$22)","v":"Tex-200-F: Part I & II"},{"$f":"IF('Tex-200-F'!$C$27=\"\",\"\",'Tex-200-F'!$C$27)","v":"Individual Weight Retained, (g)"},{"$f":"IF('Tex-200-F'!$B$27=\"\",\"\",'Tex-200-F'!$B$27)","v":"Sieve Size"},{"$f":"IF('Tex-200-F'!$B$40=\"\",\"\",'Tex-200-F'!$B$40)","v":""}]
[19,{"$f":"IF('Tex-200-F'!$C$41=\"\",\"\",'Tex-200-F'!$C$41)","v":""},{"$f":"IF('Tex-200-F'!$B$22=\"\",\"\",'Tex-200-F'!$B$22)","v":"Tex-200-F: Part I & II"},{"$f":"IF('Tex-200-F'!$C$27=\"\",\"\",'Tex-200-F'!$C$27)","v":"Individual Weight Retained, (g)"},{"$f":"IF('Tex-200-F'!$B$27=\"\",\"\",'Tex-200-F'!$B$27)","v":"Sieve Size"},{"$f":"IF('Tex-200-F'!$B$41=\"\",\"\",'Tex-200-F'!$B$41)","v":""}]
[20,{"$f":"IF('Tex-200-F'!$C$42=\"\",\"\",'Tex-200-F'!$C$42)","v":""},{"$f":"IF('Tex-200-F'!$B$22=\"\",\"\",'Tex-200-F'!$B$22)","v":"Tex-200-F: Part I & II"},{"$f":"IF('Tex-200-F'!$C$27=\"\",\"\",'Tex-200-F'!$C$27)","v":"Individual Weight Retained, (g)"},{"$f":"IF('Tex-200-F'!$B$27=\"\",\"\",'Tex-200-F'!$B$27)","v":"Sieve Size"},{"$f":"IF('Tex-200-F'!$B$42=\"\",\"\",'Tex-200-F'!$B$42)","v":"-"}]
[21,{"$f":"IF('Tex-200-F'!$C$43=\"\",\"\",'Tex-200-F'!$C$43)","v":""},{"$f":"IF('Tex-200-F'!$B$22=\"\",\"\",'Tex-200-F'!$B$22)","v":"Tex-200-F: Part I & II"},{"$f":"IF('Tex-200-F'!$D$43=\"\",\"\",'Tex-200-F'!$D$43)","v":"Sieving Loss, (g)  weight"}]
[22,{"$f":"IF('Tex-200-F'!$C$44=\"\",\"\",'Tex-200-F'!$C$44)","v":""},{"$f":"IF('Tex-200-F'!$B$22=\"\",\"\",'Tex-200-F'!$B$22)","v":"Tex-200-F: Part I & II"},{"$f":"IF('Tex-200-F'!$D$44=\"\",\"\",'Tex-200-F'!$D$44)","v":"Washing Loss, (g)"}]
[23,{"$f":"IF('Tex-200-F'!$C$45=\"\",\"\",'Tex-200-F'!$C$45)","v":""},{"$f":"IF('Tex-200-F'!$B$22=\"\",\"\",'Tex-200-F'!$B$22)","v":"Tex-200-F: Part I & II"},{"$f":"IF('Tex-200-F'!$C$27=\"\",\"\",'Tex-200-F'!$C$27)","v":"Individual Weight Retained, (g)"},{"$f":"IF('Tex-200-F'!$B$27=\"\",\"\",'Tex-200-F'!$B$27)","v":"Sieve Size"},{"$f":"IF('Tex-200-F'!$B$45=\"\",\"\",'Tex-200-F'!$B$45)","v":"Total -"}]
[24,{"$f":"IF('Tex-200-F'!$C$46=\"\",\"\",'Tex-200-F'!$C$46)","v":""},{"$f":"IF('Tex-200-F'!$B$22=\"\",\"\",'Tex-200-F'!$B$22)","v":"Tex-200-F: Part I & II"},{"$f":"IF('Tex-200-F'!$C$27=\"\",\"\",'Tex-200-F'!$C$27)","v":"Individual Weight Retained, (g)"},{"$f":"IF('Tex-200-F'!$B$27=\"\",\"\",'Tex-200-F'!$B$27)","v":"Sieve Size"},{"$f":"IF('Tex-200-F'!$B$46=\"\",\"\",'Tex-200-F'!$B$46)","v":"Total Weight:"}]
[25,{"$f":"IF('Tex-200-F'!$D$30=\"\",\"\",'Tex-200-F'!$D$30)","v":""},{"$f":"IF('Tex-200-F'!$B$22=\"\",\"\",'Tex-200-F'!$B$22)","v":"Tex-200-F: Part I & II"},{"$f":"IF('Tex-200-F'!$D$27=\"\",\"\",'Tex-200-F'!$D$27)","v":"Cumulative Weight Retained, (g)"},{"$f":"IF('Tex-200-F'!$B$27=\"\",\"\",'Tex-200-F'!$B$27)","v":"Sieve Size"},{"$f":"IF('Tex-200-F'!$B$30=\"\",\"\",'Tex-200-F'!$B$30)","v":""}]
[26,{"$f":"IF('Tex-200-F'!$D$31=\"\",\"\",'Tex-200-F'!$D$31)","v":""},{"$f":"IF('Tex-200-F'!$B$22=\"\",\"\",'Tex-200-F'!$B$22)","v":"Tex-200-F: Part I & II"},{"$f":"IF('Tex-200-F'!$D$27=\"\",\"\",'Tex-200-F'!$D$27)","v":"Cumulative Weight Retained, (g)"},{"$f":"IF('Tex-200-F'!$B$27=\"\",\"\",'Tex-200-F'!$B$27)","v":"Sieve Size"},{"$f":"IF('Tex-200-F'!$B$31=\"\",\"\",'Tex-200-F'!$B$31)","v":""}]
[27,{"$f":"IF('Tex-200-F'!$D$32=\"\",\"\",'Tex-200-F'!$D$32)","v":""},{"$f":"IF('Tex-200-F'!$B$22=\"\",\"\",'Tex-200-F'!$B$22)","v":"Tex-200-F: Part I & II"},{"$f":"IF('Tex-200-F'!$D$27=\"\",\"\",'Tex-200-F'!$D$27)","v":"Cumulative Weight Retained, (g)"},{"$f":"IF('Tex-200-F'!$B$27=\"\",\"\",'Tex-200-F'!$B$27)","v":"Sieve Size"},{"$f":"IF('Tex-200-F'!$B$32=\"\",\"\",'Tex-200-F'!$B$32)","v":""}]
[28,{"$f":"IF('Tex-200-F'!$D$33=\"\",\"\",'Tex-200-F'!$D$33)","v":""},{"$f":"IF('Tex-200-F'!$B$22=\"\",\"\",'Tex-200-F'!$B$22)","v":"Tex-200-F: Part I & II"},{"$f":"IF('Tex-200-F'!$D$27=\"\",\"\",'Tex-200-F'!$D$27)","v":"Cumulative Weight Retained, (g)"},{"$f":"IF('Tex-200-F'!$B$27=\"\",\"\",'Tex-200-F'!$B$27)","v":"Sieve Size"},{"$f":"IF('Tex-200-F'!$B$33=\"\",\"\",'Tex-200-F'!$B$33)","v":""}]
[29,{"$f":"IF('Tex-200-F'!$D$34=\"\",\"\",'Tex-200-F'!$D$34)","v":""},{"$f":"IF('Tex-200-F'!$B$22=\"\",\"\",'Tex-200-F'!$B$22)","v":"Tex-200-F: Part I & II"},{"$f":"IF('Tex-200-F'!$D$27=\"\",\"\",'Tex-200-F'!$D$27)","v":"Cumulative Weight Retained, (g)"},{"$f":"IF('Tex-200-F'!$B$27=\"\",\"\",'Tex-200-F'!$B$27)","v":"Sieve Size"},{"$f":"IF('Tex-200-F'!$B$34=\"\",\"\",'Tex-200-F'!$B$34)","v":""}]
[30,{"$f":"IF('Tex-200-F'!$D$35=\"\",\"\",'Tex-200-F'!$D$35)","v":""},{"$f":"IF('Tex-200-F'!$B$22=\"\",\"\",'Tex-200-F'!$B$22)","v":"Tex-200-F: Part I & II"},{"$f":"IF('Tex-200-F'!$D$27=\"\",\"\",'Tex-200-F'!$D$27)","v":"Cumulative Weight Retained, (g)"},{"$f":"IF('Tex-200-F'!$B$27=\"\",\"\",'Tex-200-F'!$B$27)","v":"Sieve Size"},{"$f":"IF('Tex-200-F'!$B$35=\"\",\"\",'Tex-200-F'!$B$35)","v":""}]
[31,{"$f":"IF('Tex-200-F'!$D$36=\"\",\"\",'Tex-200-F'!$D$36)","v":""},{"$f":"IF('Tex-200-F'!$B$22=\"\",\"\",'Tex-200-F'!$B$22)","v":"Tex-200-F: Part I & II"},{"$f":"IF('Tex-200-F'!$D$27=\"\",\"\",'Tex-200-F'!$D$27)","v":"Cumulative Weight Retained, (g)"},{"$f":"IF('Tex-200-F'!$B$27=\"\",\"\",'Tex-200-F'!$B$27)","v":"Sieve Size"},{"$f":"IF('Tex-200-F'!$B$36=\"\",\"\",'Tex-200-F'!$B$36)","v":""}]
[32,{"$f":"IF('Tex-200-F'!$D$37=\"\",\"\",'Tex-200-F'!$D$37)","v":""},{"$f":"IF('Tex-200-F'!$B$22=\"\",\"\",'Tex-200-F'!$B$22)","v":"Tex-200-F: Part I & II"},{"$f":"IF('Tex-200-F'!$D$27=\"\",\"\",'Tex-200-F'!$D$27)","v":"Cumulative Weight Retained, (g)"},{"$f":"IF('Tex-200-F'!$B$27=\"\",\"\",'Tex-200-F'!$B$27)","v":"Sieve Size"},{"$f":"IF('Tex-200-F'!$B$37=\"\",\"\",'Tex-200-F'!$B$37)","v":""}]
[33,{"$f":"IF('Tex-200-F'!$D$38=\"\",\"\",'Tex-200-F'!$D$38)","v":""},{"$f":"IF('Tex-200-F'!$B$22=\"\",\"\",'Tex-200-F'!$B$22)","v":"Tex-200-F: Part I & II"},{"$f":"IF('Tex-200-F'!$D$27=\"\",\"\",'Tex-200-F'!$D$27)","v":"Cumulative Weight Retained, (g)"},{"$f":"IF('Tex-200-F'!$B$27=\"\",\"\",'Tex-200-F'!$B$27)","v":"Sieve Size"},{"$f":"IF('Tex-200-F'!$B$38=\"\",\"\",'Tex-200-F'!$B$38)","v":""}]
[34,{"$f":"IF('Tex-200-F'!$D$39=\"\",\"\",'Tex-200-F'!$D$39)","v":""},{"$f":"IF('Tex-200-F'!$B$22=\"\",\"\",'Tex-200-F'!$B$22)","v":"Tex-200-F: Part I & II"},{"$f":"IF('Tex-200-F'!$D$27=\"\",\"\",'Tex-200-F'!$D$27)","v":"Cumulative Weight Retained, (g)"},{"$f":"IF('Tex-200-F'!$B$27=\"\",\"\",'Tex-200-F'!$B$27)","v":"Sieve Size"},{"$f":"IF('Tex-200-F'!$B$39=\"\",\"\",'Tex-200-F'!$B$39)","v":""}]
[35,{"$f":"IF('Tex-200-F'!$D$40=\"\",\"\",'Tex-200-F'!$D$40)","v":""},{"$f":"IF('Tex-200-F'!$B$22=\"\",\"\",'Tex-200-F'!$B$22)","v":"Tex-200-F: Part I & II"},{"$f":"IF('Tex-200-F'!$D$27=\"\",\"\",'Tex-200-F'!$D$27)","v":"Cumulative Weight Retained, (g)"},{"$f":"IF('Tex-200-F'!$B$27=\"\",\"\",'Tex-200-F'!$B$27)","v":"Sieve Size"},{"$f":"IF('Tex-200-F'!$B$40=\"\",\"\",'Tex-200-F'!$B$40)","v":""}]
[36,{"$f":"IF('Tex-200-F'!$D$41=\"\",\"\",'Tex-200-F'!$D$41)","v":""},{"$f":"IF('Tex-200-F'!$B$22=\"\",\"\",'Tex-200-F'!$B$22)","v":"Tex-200-F: Part I & II"},{"$f":"IF('Tex-200-F'!$D$27=\"\",\"\",'Tex-200-F'!$D$27)","v":"Cumulative Weight Retained, (g)"},{"$f":"IF('Tex-200-F'!$B$27=\"\",\"\",'Tex-200-F'!$B$27)","v":"Sieve Size"},{"$f":"IF('Tex-200-F'!$B$41=\"\",\"\",'Tex-200-F'!$B$41)","v":""}]
[37,{"$f":"IF('Tex-200-F'!$D$45=\"\",\"\",'Tex-200-F'!$D$45)","v":""},{"$f":"IF('Tex-200-F'!$B$22=\"\",\"\",'Tex-200-F'!$B$22)","v":"Tex-200-F: Part I & II"},{"$f":"IF('Tex-200-F'!$D$27=\"\",\"\",'Tex-200-F'!$D$27)","v":"Cumulative Weight Retained, (g)"},{"$f":"IF('Tex-200-F'!$B$27=\"\",\"\",'Tex-200-F'!$B$27)","v":"Sieve Size"},{"$f":"IF('Tex-200-F'!$B$45=\"\",\"\",'Tex-200-F'!$B$45)","v":"Total -"}]
[38,{"$f":"IF('Tex-200-F'!$E$30=\"\",\"\",'Tex-200-F'!$E$30)","v":""},{"$f":"IF('Tex-200-F'!$B$22=\"\",\"\",'Tex-200-F'!$B$22)","v":"Tex-200-F: Part I & II"},{"$f":"IF('Tex-200-F'!$E$27=\"\",\"\",'Tex-200-F'!$E$27)","v":"Cumulative Percent Retained, (%)"},{"$f":"IF('Tex-200-F'!$B$27=\"\",\"\",'Tex-200-F'!$B$27)","v":"Sieve Size"},{"$f":"IF('Tex-200-F'!$B$30=\"\",\"\",'Tex-200-F'!$B$30)","v":""}]
[39,{"$f":"IF('Tex-200-F'!$E$31=\"\",\"\",'Tex-200-F'!$E$31)","v":""},{"$f":"IF('Tex-200-F'!$B$22=\"\",\"\",'Tex-200-F'!$B$22)","v":"Tex-200-F: Part I & II"},{"$f":"IF('Tex-200-F'!$E$27=\"\",\"\",'Tex-200-F'!$E$27)","v":"Cumulative Percent Retained, (%)"},{"$f":"IF('Tex-200-F'!$B$27=\"\",\"\",'Tex-200-F'!$B$27)","v":"Sieve Size"},{"$f":"IF('Tex-200-F'!$B$31=\"\",\"\",'Tex-200-F'!$B$31)","v":""}]
[40,{"$f":"IF('Tex-200-F'!$E$32=\"\",\"\",'Tex-200-F'!$E$32)","v":""},{"$f":"IF('Tex-200-F'!$B$22=\"\",\"\",'Tex-200-F'!$B$22)","v":"Tex-200-F: Part I & II"},{"$f":"IF('Tex-200-F'!$E$27=\"\",\"\",'Tex-200-F'!$E$27)","v":"Cumulative Percent Retained, (%)"},{"$f":"IF('Tex-200-F'!$B$27=\"\",\"\",'Tex-200-F'!$B$27)","v":"Sieve Size"},{"$f":"IF('Tex-200-F'!$B$32=\"\",\"\",'Tex-200-F'!$B$32)","v":""}]
[41,{"$f":"IF('Tex-200-F'!$E$33=\"\",\"\",'Tex-200-F'!$E$33)","v":""},{"$f":"IF('Tex-200-F'!$B$22=\"\",\"\",'Tex-200-F'!$B$22)","v":"Tex-200-F: Part I & II"},{"$f":"IF('Tex-200-F'!$E$27=\"\",\"\",'Tex-200-F'!$E$27)","v":"Cumulative Percent Retained, (%)"},{"$f":"IF('Tex-200-F'!$B$27=\"\",\"\",'Tex-200-F'!$B$27)","v":"Sieve Size"},{"$f":"IF('Tex-200-F'!$B$33=\"\",\"\",'Tex-200-F'!$B$33)","v":""}]
[42,{"$f":"IF('Tex-200-F'!$E$34=\"\",\"\",'Tex-200-F'!$E$34)","v":""},{"$f":"IF('Tex-200-F'!$B$22=\"\",\"\",'Tex-200-F'!$B$22)","v":"Tex-200-F: Part I & II"},{"$f":"IF('Tex-200-F'!$E$27=\"\",\"\",'Tex-200-F'!$E$27)","v":"Cumulative Percent Retained, (%)"},{"$f":"IF('Tex-200-F'!$B$27=\"\",\"\",'Tex-200-F'!$B$27)","v":"Sieve Size"},{"$f":"IF('Tex-200-F'!$B$34=\"\",\"\",'Tex-200-F'!$B$34)","v":""}]
[43,{"$f":"IF('Tex-200-F'!$E$35=\"\",\"\",'Tex-200-F'!$E$35)","v":""},{"$f":"IF('Tex-200-F'!$B$22=\"\",\"\",'Tex-200-F'!$B$22)","v":"Tex-200-F: Part I & II"},{"$f":"IF('Tex-200-F'!$E$27=\"\",\"\",'Tex-200-F'!$E$27)","v":"Cumulative Percent Retained, (%)"},{"$f":"IF('Tex-200-F'!$B$27=\"\",\"\",'Tex-200-F'!$B$27)","v":"Sieve Size"},{"$f":"IF('Tex-200-F'!$B$35=\"\",\"\",'Tex-200-F'!$B$35)","v":""}]
[44,{"$f":"IF('Tex-200-F'!$E$36=\"\",\"\",'Tex-200-F'!$E$36)","v":""},{"$f":"IF('Tex-200-F'!$B$22=\"\",\"\",'Tex-200-F'!$B$22)","v":"Tex-200-F: Part I & II"},{"$f":"IF('Tex-200-F'!$E$27=\"\",\"\",'Tex-200-F'!$E$27)","v":"Cumulative Percent Retained, (%)"},{"$f":"IF('Tex-200-F'!$B$27=\"\",\"\",'Tex-200-F'!$B$27)","v":"Sieve Size"},{"$f":"IF('Tex-200-F'!$B$36=\"\",\"\",'Tex-200-F'!$B$36)","v":""}]
[45,{"$f":"IF('Tex-200-F'!$E$37=\"\",\"\",'Tex-200-F'!$E$37)","v":""},{"$f":"IF('Tex-200-F'!$B$22=\"\",\"\",'Tex-200-F'!$B$22)","v":"Tex-200-F: Part I & II"},{"$f":"IF('Tex-200-F'!$E$27=\"\",\"\",'Tex-200-F'!$E$27)","v":"Cumulative Percent Retained, (%)"},{"$f":"IF('Tex-200-F'!$B$27=\"\",\"\",'Tex-200-F'!$B$27)","v":"Sieve Size"},{"$f":"IF('Tex-200-F'!$B$37=\"\",\"\",'Tex-200-F'!$B$37)","v":""}]
[46,{"$f":"IF('Tex-200-F'!$E$38=\"\",\"\",'Tex-200-F'!$E$38)","v":""},{"$f":"IF('Tex-200-F'!$B$22=\"\",\"\",'Tex-200-F'!$B$22)","v":"Tex-200-F: Part I & II"},{"$f":"IF('Tex-200-F'!$E$27=\"\",\"\",'Tex-200-F'!$E$27)","v":"Cumulative Percent Retained, (%)"},{"$f":"IF('Tex-200-F'!$B$27=\"\",\"\",'Tex-200-F'!$B$27)","v":"Sieve Size"},{"$f":"IF('Tex-200-F'!$B$38=\"\",\"\",'Tex-200-F'!$B$38)","v":""}]
[47,{"$f":"IF('Tex-200-F'!$E$39=\"\",\"\",'Tex-200-F'!$E$39)","v":""},{"$f":"IF('Tex-200-F'!$B$22=\"\",\"\",'Tex-200-F'!$B$22)","v":"Tex-200-F: Part I & II"},{"$f":"IF('Tex-200-F'!$E$27=\"\",\"\",'Tex-200-F'!$E$27)","v":"Cumulative Percent Retained, (%)"},{"$f":"IF('Tex-200-F'!$B$27=\"\",\"\",'Tex-200-F'!$B$27)","v":"Sieve Size"},{"$f":"IF('Tex-200-F'!$B$39=\"\",\"\",'Tex-200-F'!$B$39)","v":""}]
[48,{"$f":"IF('Tex-200-F'!$E$40=\"\",\"\",'Tex-200-F'!$E$40)","v":""},{"$f":"IF('Tex-200-F'!$B$22=\"\",\"\",'Tex-200-F'!$B$22)","v":"Tex-200-F: Part I & II"},{"$f":"IF('Tex-200-F'!$E$27=\"\",\"\",'Tex-200-F'!$E$27)","v":"Cumulative Percent Retained, (%)"},{"$f":"IF('Tex-200-F'!$B$27=\"\",\"\",'Tex-200-F'!$B$27)","v":"Sieve Size"},{"$f":"IF('Tex-200-F'!$B$40=\"\",\"\",'Tex-200-F'!$B$40)","v":""}]
[49,{"$f":"IF('Tex-200-F'!$E$41=\"\",\"\",'Tex-200-F'!$E$41)","v":""},{"$f":"IF('Tex-200-F'!$B$22=\"\",\"\",'Tex-200-F'!$B$22)","v":"Tex-200-F: Part I & II"},{"$f":"IF('Tex-200-F'!$E$27=\"\",\"\",'Tex-200-F'!$E$27)","v":"Cumulative Percent Retained, (%)"},{"$f":"IF('Tex-200-F'!$B$27=\"\",\"\",'Tex-200-F'!$B$27)","v":"Sieve Size"},{"$f":"IF('Tex-200-F'!$B$41=\"\",\"\",'Tex-200-F'!$B$41)","v":""}]
[50,{"$f":"IF('Tex-200-F'!$E$45=\"\",\"\",'Tex-200-F'!$E$45)","v":""},{"$f":"IF('Tex-200-F'!$B$22=\"\",\"\",'Tex-200-F'!$B$22)","v":"Tex-200-F: Part I & II"},{"$f":"IF('Tex-200-F'!$E$27=\"\",\"\",'Tex-200-F'!$E$27)","v":"Cumulative Percent Retained, (%)"},{"$f":"IF('Tex-200-F'!$B$27=\"\",\"\",'Tex-200-F'!$B$27)","v":"Sieve Size"},{"$f":"IF('Tex-200-F'!$B$45=\"\",\"\",'Tex-200-F'!$B$45)","v":"Total -"}]
[51,{"$f":"IF('Tex-200-F'!$F$30=\"\",\"\",'Tex-200-F'!$F$30)","v":""},{"$f":"IF('Tex-200-F'!$B$22=\"\",\"\",'Tex-200-F'!$B$22)","v":"Tex-200-F: Part I & II"},{"$f":"IF('Tex-200-F'!$F$27=\"\",\"\",'Tex-200-F'!$F$27)","v":"Cumulative Percent Passing, (%)"},{"$f":"IF('Tex-200-F'!$B$27=\"\",\"\",'Tex-200-F'!$B$27)","v":"Sieve Size"},{"$f":"IF('Tex-200-F'!$B$30=\"\",\"\",'Tex-200-F'!$B$30)","v":""}]
[52,{"$f":"IF('Tex-200-F'!$F$31=\"\",\"\",'Tex-200-F'!$F$31)","v":""},{"$f":"IF('Tex-200-F'!$B$22=\"\",\"\",'Tex-200-F'!$B$22)","v":"Tex-200-F: Part I & II"},{"$f":"IF('Tex-200-F'!$F$27=\"\",\"\",'Tex-200-F'!$F$27)","v":"Cumulative Percent Passing, (%)"},{"$f":"IF('Tex-200-F'!$B$27=\"\",\"\",'Tex-200-F'!$B$27)","v":"Sieve Size"},{"$f":"IF('Tex-200-F'!$B$31=\"\",\"\",'Tex-200-F'!$B$31)","v":""}]
[53,{"$f":"IF('Tex-200-F'!$F$32=\"\",\"\",'Tex-200-F'!$F$32)","v":""},{"$f":"IF('Tex-200-F'!$B$22=\"\",\"\",'Tex-200-F'!$B$22)","v":"Tex-200-F: Part I & II"},{"$f":"IF('Tex-200-F'!$F$27=\"\",\"\",'Tex-200-F'!$F$27)","v":"Cumulative Percent Passing, (%)"},{"$f":"IF('Tex-200-F'!$B$27=\"\",\"\",'Tex-200-F'!$B$27)","v":"Sieve Size"},{"$f":"IF('Tex-200-F'!$B$32=\"\",\"\",'Tex-200-F'!$B$32)","v":""}]
[54,{"$f":"IF('Tex-200-F'!$F$33=\"\",\"\",'Tex-200-F'!$F$33)","v":""},{"$f":"IF('Tex-200-F'!$B$22=\"\",\"\",'Tex-200-F'!$B$22)","v":"Tex-200-F: Part I & II"},{"$f":"IF('Tex-200-F'!$F$27=\"\",\"\",'Tex-200-F'!$F$27)","v":"Cumulative Percent Passing, (%)"},{"$f":"IF('Tex-200-F'!$B$27=\"\",\"\",'Tex-200-F'!$B$27)","v":"Sieve Size"},{"$f":"IF('Tex-200-F'!$B$33=\"\",\"\",'Tex-200-F'!$B$33)","v":""}]
[55,{"$f":"IF('Tex-200-F'!$F$34=\"\",\"\",'Tex-200-F'!$F$34)","v":""},{"$f":"IF('Tex-200-F'!$B$22=\"\",\"\",'Tex-200-F'!$B$22)","v":"Tex-200-F: Part I & II"},{"$f":"IF('Tex-200-F'!$F$27=\"\",\"\",'Tex-200-F'!$F$27)","v":"Cumulative Percent Passing, (%)"},{"$f":"IF('Tex-200-F'!$B$27=\"\",\"\",'Tex-200-F'!$B$27)","v":"Sieve Size"},{"$f":"IF('Tex-200-F'!$B$34=\"\",\"\",'Tex-200-F'!$B$34)","v":""}]
[56,{"$f":"IF('Tex-200-F'!$F$35=\"\",\"\",'Tex-200-F'!$F$35)","v":""},{"$f":"IF('Tex-200-F'!$B$22=\"\",\"\",'Tex-200-F'!$B$22)","v":"Tex-200-F: Part I & II"},{"$f":"IF('Tex-200-F'!$F$27=\"\",\"\",'Tex-200-F'!$F$27)","v":"Cumulative Percent Passing, (%)"},{"$f":"IF('Tex-200-F'!$B$27=\"\",\"\",'Tex-200-F'!$B$27)","v":"Sieve Size"},{"$f":"IF('Tex-200-F'!$B$35=\"\",\"\",'Tex-200-F'!$B$35)","v":""}]
[57,{"$f":"IF('Tex-200-F'!$F$36=\"\",\"\",'Tex-200-F'!$F$36)","v":""},{"$f":"IF('Tex-200-F'!$B$22=\"\",\"\",'Tex-200-F'!$B$22)","v":"Tex-200-F: Part I & II"},{"$f":"IF('Tex-200-F'!$F$27=\"\",\"\",'Tex-200-F'!$F$27)","v":"Cumulative Percent Passing, (%)"},{"$f":"IF('Tex-200-F'!$B$27=\"\",\"\",'Tex-200-F'!$B$27)","v":"Sieve Size"},{"$f":"IF('Tex-200-F'!$B$36=\"\",\"\",'Tex-200-F'!$B$36)","v":""}]
[58,{"$f":"IF('Tex-200-F'!$F$37=\"\",\"\",'Tex-200-F'!$F$37)","v":""},{"$f":"IF('Tex-200-F'!$B$22=\"\",\"\",'Tex-200-F'!$B$22)","v":"Tex-200-F: Part I & II"},{"$f":"IF('Tex-200-F'!$F$27=\"\",\"\",'Tex-200-F'!$F$27)","v":"Cumulative Percent Passing, (%)"},{"$f":"IF('Tex-200-F'!$B$27=\"\",\"\",'Tex-200-F'!$B$27)","v":"Sieve Size"},{"$f":"IF('Tex-200-F'!$B$37=\"\",\"\",'Tex-200-F'!$B$37)","v":""}]
[59,{"$f":"IF('Tex-200-F'!$F$38=\"\",\"\",'Tex-200-F'!$F$38)","v":""},{"$f":"IF('Tex-200-F'!$B$22=\"\",\"\",'Tex-200-F'!$B$22)","v":"Tex-200-F: Part I & II"},{"$f":"IF('Tex-200-F'!$F$27=\"\",\"\",'Tex-200-F'!$F$27)","v":"Cumulative Percent Passing, (%)"},{"$f":"IF('Tex-200-F'!$B$27=\"\",\"\",'Tex-200-F'!$B$27)","v":"Sieve Size"},{"$f":"IF('Tex-200-F'!$B$38=\"\",\"\",'Tex-200-F'!$B$38)","v":""}]
[60,{"$f":"IF('Tex-200-F'!$F$39=\"\",\"\",'Tex-200-F'!$F$39)","v":""},{"$f":"IF('Tex-200-F'!$B$22=\"\",\"\",'Tex-200-F'!$B$22)","v":"Tex-200-F: Part I & II"},{"$f":"IF('Tex-200-F'!$F$27=\"\",\"\",'Tex-200-F'!$F$27)","v":"Cumulative Percent Passing, (%)"},{"$f":"IF('Tex-200-F'!$B$27=\"\",\"\",'Tex-200-F'!$B$27)","v":"Sieve Size"},{"$f":"IF('Tex-200-F'!$B$39=\"\",\"\",'Tex-200-F'!$B$39)","v":""}]
[61,{"$f":"IF('Tex-200-F'!$F$40=\"\",\"\",'Tex-200-F'!$F$40)","v":""},{"$f":"IF('Tex-200-F'!$B$22=\"\",\"\",'Tex-200-F'!$B$22)","v":"Tex-200-F: Part I & II"},{"$f":"IF('Tex-200-F'!$F$27=\"\",\"\",'Tex-200-F'!$F$27)","v":"Cumulative Percent Passing, (%)"},{"$f":"IF('Tex-200-F'!$B$27=\"\",\"\",'Tex-200-F'!$B$27)","v":"Sieve Size"},{"$f":"IF('Tex-200-F'!$B$40=\"\",\"\",'Tex-200-F'!$B$40)","v":""}]
[62,{"$f":"IF('Tex-200-F'!$F$41=\"\",\"\",'Tex-200-F'!$F$41)","v":""},{"$f":"IF('Tex-200-F'!$B$22=\"\",\"\",'Tex-200-F'!$B$22)","v":"Tex-200-F: Part I & II"},{"$f":"IF('Tex-200-F'!$F$27=\"\",\"\",'Tex-200-F'!$F$27)","v":"Cumulative Percent Passing, (%)"},{"$f":"IF('Tex-200-F'!$B$27=\"\",\"\",'Tex-200-F'!$B$27)","v":"Sieve Size"},{"$f":"IF('Tex-200-F'!$B$41=\"\",\"\",'Tex-200-F'!$B$41)","v":""}]
[63,{"$f":"IF('Tex-200-F'!$G$30=\"\",\"\",'Tex-200-F'!$G$30)","v":""},{"$f":"IF('Tex-200-F'!$B$22=\"\",\"\",'Tex-200-F'!$B$22)","v":"Tex-200-F: Part I & II"},{"$f":"IF('Tex-200-F'!$G$28=\"\",\"\",'Tex-200-F'!$G$28)","v":"Lower Limit of Grading (%)"},{"$f":"IF('Tex-200-F'!$B$27=\"\",\"\",'Tex-200-F'!$B$27)","v":"Sieve Size"},{"$f":"IF('Tex-200-F'!$B$30=\"\",\"\",'Tex-200-F'!$B$30)","v":""}]
[64,{"$f":"IF('Tex-200-F'!$G$31=\"\",\"\",'Tex-200-F'!$G$31)","v":""},{"$f":"IF('Tex-200-F'!$B$22=\"\",\"\",'Tex-200-F'!$B$22)","v":"Tex-200-F: Part I & II"},{"$f":"IF('Tex-200-F'!$G$28=\"\",\"\",'Tex-200-F'!$G$28)","v":"Lower Limit of Grading (%)"},{"$f":"IF('Tex-200-F'!$B$27=\"\",\"\",'Tex-200-F'!$B$27)","v":"Sieve Size"},{"$f":"IF('Tex-200-F'!$B$31=\"\",\"\",'Tex-200-F'!$B$31)","v":""}]
[65,{"$f":"IF('Tex-200-F'!$G$32=\"\",\"\",'Tex-200-F'!$G$32)","v":""},{"$f":"IF('Tex-200-F'!$B$22=\"\",\"\",'Tex-200-F'!$B$22)","v":"Tex-200-F: Part I & II"},{"$f":"IF('Tex-200-F'!$G$28=\"\",\"\",'Tex-200-F'!$G$28)","v":"Lower Limit of Grading (%)"},{"$f":"IF('Tex-200-F'!$B$27=\"\",\"\",'Tex-200-F'!$B$27)","v":"Sieve Size"},{"$f":"IF('Tex-200-F'!$B$32=\"\",\"\",'Tex-200-F'!$B$32)","v":""}]
[66,{"$f":"IF('Tex-200-F'!$G$33=\"\",\"\",'Tex-200-F'!$G$33)","v":""},{"$f":"IF('Tex-200-F'!$B$22=\"\",\"\",'Tex-200-F'!$B$22)","v":"Tex-200-F: Part I & II"},{"$f":"IF('Tex-200-F'!$G$28=\"\",\"\",'Tex-200-F'!$G$28)","v":"Lower Limit of Grading (%)"},{"$f":"IF('Tex-200-F'!$B$27=\"\",\"\",'Tex-200-F'!$B$27)","v":"Sieve Size"},{"$f":"IF('Tex-200-F'!$B$33=\"\",\"\",'Tex-200-F'!$B$33)","v":""}]
[67,{"$f":"IF('Tex-200-F'!$G$34=\"\",\"\",'Tex-200-F'!$G$34)","v":""},{"$f":"IF('Tex-200-F'!$B$22=\"\",\"\",'Tex-200-F'!$B$22)","v":"Tex-200-F: Part I & II"},{"$f":"IF('Tex-200-F'!$G$28=\"\",\"\",'Tex-200-F'!$G$28)","v":"Lower Limit of Grading (%)"},{"$f":"IF('Tex-200-F'!$B$27=\"\",\"\",'Tex-200-F'!$B$27)","v":"Sieve Size"},{"$f":"IF('Tex-200-F'!$B$34=\"\",\"\",'Tex-200-F'!$B$34)","v":""}]
[68,{"$f":"IF('Tex-200-F'!$G$35=\"\",\"\",'Tex-200-F'!$G$35)","v":""},{"$f":"IF('Tex-200-F'!$B$22=\"\",\"\",'Tex-200-F'!$B$22)","v":"Tex-200-F: Part I & II"},{"$f":"IF('Tex-200-F'!$G$28=\"\",\"\",'Tex-200-F'!$G$28)","v":"Lower Limit of Grading (%)"},{"$f":"IF('Tex-200-F'!$B$27=\"\",\"\",'Tex-200-F'!$B$27)","v":"Sieve Size"},{"$f":"IF('Tex-200-F'!$B$35=\"\",\"\",'Tex-200-F'!$B$35)","v":""}]
[69,{"$f":"IF('Tex-200-F'!$G$36=\"\",\"\",'Tex-200-F'!$G$36)","v":""},{"$f":"IF('Tex-200-F'!$B$22=\"\",\"\",'Tex-200-F'!$B$22)","v":"Tex-200-F: Part I & II"},{"$f":"IF('Tex-200-F'!$G$28=\"\",\"\",'Tex-200-F'!$G$28)","v":"Lower Limit of Grading (%)"},{"$f":"IF('Tex-200-F'!$B$27=\"\",\"\",'Tex-200-F'!$B$27)","v":"Sieve Size"},{"$f":"IF('Tex-200-F'!$B$36=\"\",\"\",'Tex-200-F'!$B$36)","v":""}]
[70,{"$f":"IF('Tex-200-F'!$G$37=\"\",\"\",'Tex-200-F'!$G$37)","v":""},{"$f":"IF('Tex-200-F'!$B$22=\"\",\"\",'Tex-200-F'!$B$22)","v":"Tex-200-F: Part I & II"},{"$f":"IF('Tex-200-F'!$G$28=\"\",\"\",'Tex-200-F'!$G$28)","v":"Lower Limit of Grading (%)"},{"$f":"IF('Tex-200-F'!$B$27=\"\",\"\",'Tex-200-F'!$B$27)","v":"Sieve Size"},{"$f":"IF('Tex-200-F'!$B$37=\"\",\"\",'Tex-200-F'!$B$37)","v":""}]
[71,{"$f":"IF('Tex-200-F'!$G$38=\"\",\"\",'Tex-200-F'!$G$38)","v":""},{"$f":"IF('Tex-200-F'!$B$22=\"\",\"\",'Tex-200-F'!$B$22)","v":"Tex-200-F: Part I & II"},{"$f":"IF('Tex-200-F'!$G$28=\"\",\"\",'Tex-200-F'!$G$28)","v":"Lower Limit of Grading (%)"},{"$f":"IF('Tex-200-F'!$B$27=\"\",\"\",'Tex-200-F'!$B$27)","v":"Sieve Size"},{"$f":"IF('Tex-200-F'!$B$38=\"\",\"\",'Tex-200-F'!$B$38)","v":""}]
[72,{"$f":"IF('Tex-200-F'!$G$39=\"\",\"\",'Tex-200-F'!$G$39)","v":""},{"$f":"IF('Tex-200-F'!$B$22=\"\",\"\",'Tex-200-F'!$B$22)","v":"Tex-200-F: Part I & II"},{"$f":"IF('Tex-200-F'!$G$28=\"\",\"\",'Tex-200-F'!$G$28)","v":"Lower Limit of Grading (%)"},{"$f":"IF('Tex-200-F'!$B$27=\"\",\"\",'Tex-200-F'!$B$27)","v":"Sieve Size"},{"$f":"IF('Tex-200-F'!$B$39=\"\",\"\",'Tex-200-F'!$B$39)","v":""}]
[73,{"$f":"IF('Tex-200-F'!$G$40=\"\",\"\",'Tex-200-F'!$G$40)","v":""},{"$f":"IF('Tex-200-F'!$B$22=\"\",\"\",'Tex-200-F'!$B$22)","v":"Tex-200-F: Part I & II"},{"$f":"IF('Tex-200-F'!$G$28=\"\",\"\",'Tex-200-F'!$G$28)","v":"Lower Limit of Grading (%)"},{"$f":"IF('Tex-200-F'!$B$27=\"\",\"\",'Tex-200-F'!$B$27)","v":"Sieve Size"},{"$f":"IF('Tex-200-F'!$B$40=\"\",\"\",'Tex-200-F'!$B$40)","v":""}]
[74,{"$f":"IF('Tex-200-F'!$G$41=\"\",\"\",'Tex-200-F'!$G$41)","v":""},{"$f":"IF('Tex-200-F'!$B$22=\"\",\"\",'Tex-200-F'!$B$22)","v":"Tex-200-F: Part I & II"},{"$f":"IF('Tex-200-F'!$G$28=\"\",\"\",'Tex-200-F'!$G$28)","v":"Lower Limit of Grading (%)"},{"$f":"IF('Tex-200-F'!$B$27=\"\",\"\",'Tex-200-F'!$B$27)","v":"Sieve Size"},{"$f":"IF('Tex-200-F'!$B$41=\"\",\"\",'Tex-200-F'!$B$41)","v":""}]
[75,{"$f":"IF('Tex-200-F'!$H$30=\"\",\"\",'Tex-200-F'!$H$30)","v":""},{"$f":"IF('Tex-200-F'!$B$22=\"\",\"\",'Tex-200-F'!$B$22)","v":"Tex-200-F: Part I & II"},{"$f":"IF('Tex-200-F'!$H$28=\"\",\"\",'Tex-200-F'!$H$28)","v":"Upper Limit of Grading (%)"},{"$f":"IF('Tex-200-F'!$B$27=\"\",\"\",'Tex-200-F'!$B$27)","v":"Sieve Size"},{"$f":"IF('Tex-200-F'!$B$30=\"\",\"\",'Tex-200-F'!$B$30)","v":""}]
[76,{"$f":"IF('Tex-200-F'!$H$31=\"\",\"\",'Tex-200-F'!$H$31)","v":""},{"$f":"IF('Tex-200-F'!$B$22=\"\",\"\",'Tex-200-F'!$B$22)","v":"Tex-200-F: Part I & II"},{"$f":"IF('Tex-200-F'!$H$28=\"\",\"\",'Tex-200-F'!$H$28)","v":"Upper Limit of Grading (%)"},{"$f":"IF('Tex-200-F'!$B$27=\"\",\"\",'Tex-200-F'!$B$27)","v":"Sieve Size"},{"$f":"IF('Tex-200-F'!$B$31=\"\",\"\",'Tex-200-F'!$B$31)","v":""}]
[77,{"$f":"IF('Tex-200-F'!$H$32=\"\",\"\",'Tex-200-F'!$H$32)","v":""},{"$f":"IF('Tex-200-F'!$B$22=\"\",\"\",'Tex-200-F'!$B$22)","v":"Tex-200-F: Part I & II"},{"$f":"IF('Tex-200-F'!$H$28=\"\",\"\",'Tex-200-F'!$H$28)","v":"Upper Limit of Grading (%)"},{"$f":"IF('Tex-200-F'!$B$27=\"\",\"\",'Tex-200-F'!$B$27)","v":"Sieve Size"},{"$f":"IF('Tex-200-F'!$B$32=\"\",\"\",'Tex-200-F'!$B$32)","v":""}]
[78,{"$f":"IF('Tex-200-F'!$H$33=\"\",\"\",'Tex-200-F'!$H$33)","v":""},{"$f":"IF('Tex-200-F'!$B$22=\"\",\"\",'Tex-200-F'!$B$22)","v":"Tex-200-F: Part I & II"},{"$f":"IF('Tex-200-F'!$H$28=\"\",\"\",'Tex-200-F'!$H$28)","v":"Upper Limit of Grading (%)"},{"$f":"IF('Tex-200-F'!$B$27=\"\",\"\",'Tex-200-F'!$B$27)","v":"Sieve Size"},{"$f":"IF('Tex-200-F'!$B$33=\"\",\"\",'Tex-200-F'!$B$33)","v":""}]
[79,{"$f":"IF('Tex-200-F'!$H$34=\"\",\"\",'Tex-200-F'!$H$34)","v":""},{"$f":"IF('Tex-200-F'!$B$22=\"\",\"\",'Tex-200-F'!$B$22)","v":"Tex-200-F: Part I & II"},{"$f":"IF('Tex-200-F'!$H$28=\"\",\"\",'Tex-200-F'!$H$28)","v":"Upper Limit of Grading (%)"},{"$f":"IF('Tex-200-F'!$B$27=\"\",\"\",'Tex-200-F'!$B$27)","v":"Sieve Size"},{"$f":"IF('Tex-200-F'!$B$34=\"\",\"\",'Tex-200-F'!$B$34)","v":""}]
[80,{"$f":"IF('Tex-200-F'!$H$35=\"\",\"\",'Tex-200-F'!$H$35)","v":""},{"$f":"IF('Tex-200-F'!$B$22=\"\",\"\",'Tex-200-F'!$B$22)","v":"Tex-200-F: Part I & II"},{"$f":"IF('Tex-200-F'!$H$28=\"\",\"\",'Tex-200-F'!$H$28)","v":"Upper Limit of Grading (%)"},{"$f":"IF('Tex-200-F'!$B$27=\"\",\"\",'Tex-200-F'!$B$27)","v":"Sieve Size"},{"$f":"IF('Tex-200-F'!$B$35=\"\",\"\",'Tex-200-F'!$B$35)","v":""}]
[81,{"$f":"IF('Tex-200-F'!$H$36=\"\",\"\",'Tex-200-F'!$H$36)","v":""},{"$f":"IF('Tex-200-F'!$B$22=\"\",\"\",'Tex-200-F'!$B$22)","v":"Tex-200-F: Part I & II"},{"$f":"IF('Tex-200-F'!$H$28=\"\",\"\",'Tex-200-F'!$H$28)","v":"Upper Limit of Grading (%)"},{"$f":"IF('Tex-200-F'!$B$27=\"\",\"\",'Tex-200-F'!$B$27)","v":"Sieve Size"},{"$f":"IF('Tex-200-F'!$B$36=\"\",\"\",'Tex-200-F'!$B$36)","v":""}]
[82,{"$f":"IF('Tex-200-F'!$H$37=\"\",\"\",'Tex-200-F'!$H$37)","v":""},{"$f":"IF('Tex-200-F'!$B$22=\"\",\"\",'Tex-200-F'!$B$22)","v":"Tex-200-F: Part I & II"},{"$f":"IF('Tex-200-F'!$H$28=\"\",\"\",'Tex-200-F'!$H$28)","v":"Upper Limit of Grading (%)"},{"$f":"IF('Tex-200-F'!$B$27=\"\",\"\",'Tex-200-F'!$B$27)","v":"Sieve Size"},{"$f":"IF('Tex-200-F'!$B$37=\"\",\"\",'Tex-200-F'!$B$37)","v":""}]
[83,{"$f":"IF('Tex-200-F'!$H$38=\"\",\"\",'Tex-200-F'!$H$38)","v":""},{"$f":"IF('Tex-200-F'!$B$22=\"\",\"\",'Tex-200-F'!$B$22)","v":"Tex-200-F: Part I & II"},{"$f":"IF('Tex-200-F'!$H$28=\"\",\"\",'Tex-200-F'!$H$28)","v":"Upper Limit of Grading (%)"},{"$f":"IF('Tex-200-F'!$B$27=\"\",\"\",'Tex-200-F'!$B$27)","v":"Sieve Size"},{"$f":"IF('Tex-200-F'!$B$38=\"\",\"\",'Tex-200-F'!$B$38)","v":""}]
[84,{"$f":"IF('Tex-200-F'!$H$39=\"\",\"\",'Tex-200-F'!$H$39)","v":""},{"$f":"IF('Tex-200-F'!$B$22=\"\",\"\",'Tex-200-F'!$B$22)","v":"Tex-200-F: Part I & II"},{"$f":"IF('Tex-200-F'!$H$28=\"\",\"\",'Tex-200-F'!$H$28)","v":"Upper Limit of Grading (%)"},{"$f":"IF('Tex-200-F'!$B$27=\"\",\"\",'Tex-200-F'!$B$27)","v":"Sieve Size"},{"$f":"IF('Tex-200-F'!$B$39=\"\",\"\",'Tex-200-F'!$B$39)","v":""}]
[85,{"$f":"IF('Tex-200-F'!$H$40=\"\",\"\",'Tex-200-F'!$H$40)","v":""},{"$f":"IF('Tex-200-F'!$B$22=\"\",\"\",'Tex-200-F'!$B$22)","v":"Tex-200-F: Part I & II"},{"$f":"IF('Tex-200-F'!$H$28=\"\",\"\",'Tex-200-F'!$H$28)","v":"Upper Limit of Grading (%)"},{"$f":"IF('Tex-200-F'!$B$27=\"\",\"\",'Tex-200-F'!$B$27)","v":"Sieve Size"},{"$f":"IF('Tex-200-F'!$B$40=\"\",\"\",'Tex-200-F'!$B$40)","v":""}]
[86,{"$f":"IF('Tex-200-F'!$H$41=\"\",\"\",'Tex-200-F'!$H$41)","v":""},{"$f":"IF('Tex-200-F'!$B$22=\"\",\"\",'Tex-200-F'!$B$22)","v":"Tex-200-F: Part I & II"},{"$f":"IF('Tex-200-F'!$H$28=\"\",\"\",'Tex-200-F'!$H$28)","v":"Upper Limit of Grading (%)"},{"$f":"IF('Tex-200-F'!$B$27=\"\",\"\",'Tex-200-F'!$B$27)","v":"Sieve Size"},{"$f":"IF('Tex-200-F'!$B$41=\"\",\"\",'Tex-200-F'!$B$41)","v":""}]
[87,{"$f":"IF('Tex-200-F'!$I$30=\"\",\"\",'Tex-200-F'!$I$30)","v":""},{"$f":"IF('Tex-200-F'!$B$22=\"\",\"\",'Tex-200-F'!$B$22)","v":"Tex-200-F: Part I & II"},{"$f":"IF('Tex-200-F'!$I$28=\"\",\"\",'Tex-200-F'!$I$28)","v":"Within Grading Limits"},{"$f":"IF('Tex-200-F'!$B$27=\"\",\"\",'Tex-200-F'!$B$27)","v":"Sieve Size"},{"$f":"IF('Tex-200-F'!$B$30=\"\",\"\",'Tex-200-F'!$B$30)","v":""}]
[88,{"$f":"IF('Tex-200-F'!$I$31=\"\",\"\",'Tex-200-F'!$I$31)","v":""},{"$f":"IF('Tex-200-F'!$B$22=\"\",\"\",'Tex-200-F'!$B$22)","v":"Tex-200-F: Part I & II"},{"$f":"IF('Tex-200-F'!$I$28=\"\",\"\",'Tex-200-F'!$I$28)","v":"Within Grading Limits"},{"$f":"IF('Tex-200-F'!$B$27=\"\",\"\",'Tex-200-F'!$B$27)","v":"Sieve Size"},{"$f":"IF('Tex-200-F'!$B$31=\"\",\"\",'Tex-200-F'!$B$31)","v":""}]
[89,{"$f":"IF('Tex-200-F'!$I$32=\"\",\"\",'Tex-200-F'!$I$32)","v":""},{"$f":"IF('Tex-200-F'!$B$22=\"\",\"\",'Tex-200-F'!$B$22)","v":"Tex-200-F: Part I & II"},{"$f":"IF('Tex-200-F'!$I$28=\"\",\"\",'Tex-200-F'!$I$28)","v":"Within Grading Limits"},{"$f":"IF('Tex-200-F'!$B$27=\"\",\"\",'Tex-200-F'!$B$27)","v":"Sieve Size"},{"$f":"IF('Tex-200-F'!$B$32=\"\",\"\",'Tex-200-F'!$B$32)","v":""}]
[90,{"$f":"IF('Tex-200-F'!$I$33=\"\",\"\",'Tex-200-F'!$I$33)","v":""},{"$f":"IF('Tex-200-F'!$B$22=\"\",\"\",'Tex-200-F'!$B$22)","v":"Tex-200-F: Part I & II"},{"$f":"IF('Tex-200-F'!$I$28=\"\",\"\",'Tex-200-F'!$I$28)","v":"Within Grading Limits"},{"$f":"IF('Tex-200-F'!$B$27=\"\",\"\",'Tex-200-F'!$B$27)","v":"Sieve Size"},{"$f":"IF('Tex-200-F'!$B$33=\"\",\"\",'Tex-200-F'!$B$33)","v":""}]
[91,{"$f":"IF('Tex-200-F'!$I$34=\"\",\"\",'Tex-200-F'!$I$34)","v":""},{"$f":"IF('Tex-200-F'!$B$22=\"\",\"\",'Tex-200-F'!$B$22)","v":"Tex-200-F: Part I & II"},{"$f":"IF('Tex-200-F'!$I$28=\"\",\"\",'Tex-200-F'!$I$28)","v":"Within Grading Limits"},{"$f":"IF('Tex-200-F'!$B$27=\"\",\"\",'Tex-200-F'!$B$27)","v":"Sieve Size"},{"$f":"IF('Tex-200-F'!$B$34=\"\",\"\",'Tex-200-F'!$B$34)","v":""}]
[92,{"$f":"IF('Tex-200-F'!$I$35=\"\",\"\",'Tex-200-F'!$I$35)","v":""},{"$f":"IF('Tex-200-F'!$B$22=\"\",\"\",'Tex-200-F'!$B$22)","v":"Tex-200-F: Part I & II"},{"$f":"IF('Tex-200-F'!$I$28=\"\",\"\",'Tex-200-F'!$I$28)","v":"Within Grading Limits"},{"$f":"IF('Tex-200-F'!$B$27=\"\",\"\",'Tex-200-F'!$B$27)","v":"Sieve Size"},{"$f":"IF('Tex-200-F'!$B$35=\"\",\"\",'Tex-200-F'!$B$35)","v":""}]
[93,{"$f":"IF('Tex-200-F'!$I$36=\"\",\"\",'Tex-200-F'!$I$36)","v":""},{"$f":"IF('Tex-200-F'!$B$22=\"\",\"\",'Tex-200-F'!$B$22)","v":"Tex-200-F: Part I & II"},{"$f":"IF('Tex-200-F'!$I$28=\"\",\"\",'Tex-200-F'!$I$28)","v":"Within Grading Limits"},{"$f":"IF('Tex-200-F'!$B$27=\"\",\"\",'Tex-200-F'!$B$27)","v":"Sieve Size"},{"$f":"IF('Tex-200-F'!$B$36=\"\",\"\",'Tex-200-F'!$B$36)","v":""}]
[94,{"$f":"IF('Tex-200-F'!$I$37=\"\",\"\",'Tex-200-F'!$I$37)","v":""},{"$f":"IF('Tex-200-F'!$B$22=\"\",\"\",'Tex-200-F'!$B$22)","v":"Tex-200-F: Part I & II"},{"$f":"IF('Tex-200-F'!$I$28=\"\",\"\",'Tex-200-F'!$I$28)","v":"Within Grading Limits"},{"$f":"IF('Tex-200-F'!$B$27=\"\",\"\",'Tex-200-F'!$B$27)","v":"Sieve Size"},{"$f":"IF('Tex-200-F'!$B$37=\"\",\"\",'Tex-200-F'!$B$37)","v":""}]
[95,{"$f":"IF('Tex-200-F'!$I$38=\"\",\"\",'Tex-200-F'!$I$38)","v":""},{"$f":"IF('Tex-200-F'!$B$22=\"\",\"\",'Tex-200-F'!$B$22)","v":"Tex-200-F: Part I & II"},{"$f":"IF('Tex-200-F'!$I$28=\"\",\"\",'Tex-200-F'!$I$28)","v":"Within Grading Limits"},{"$f":"IF('Tex-200-F'!$B$27=\"\",\"\",'Tex-200-F'!$B$27)","v":"Sieve Size"},{"$f":"IF('Tex-200-F'!$B$38=\"\",\"\",'Tex-200-F'!$B$38)","v":""}]
[96,{"$f":"IF('Tex-200-F'!$I$39=\"\",\"\",'Tex-200-F'!$I$39)","v":""},{"$f":"IF('Tex-200-F'!$B$22=\"\",\"\",'Tex-200-F'!$B$22)","v":"Tex-200-F: Part I & II"},{"$f":"IF('Tex-200-F'!$I$28=\"\",\"\",'Tex-200-F'!$I$28)","v":"Within Grading Limits"},{"$f":"IF('Tex-200-F'!$B$27=\"\",\"\",'Tex-200-F'!$B$27)","v":"Sieve Size"},{"$f":"IF('Tex-200-F'!$B$39=\"\",\"\",'Tex-200-F'!$B$39)","v":""}]
[97,{"$f":"IF('Tex-200-F'!$I$40=\"\",\"\",'Tex-200-F'!$I$40)","v":""},{"$f":"IF('Tex-200-F'!$B$22=\"\",\"\",'Tex-200-F'!$B$22)","v":"Tex-200-F: Part I & II"},{"$f":"IF('Tex-200-F'!$I$28=\"\",\"\",'Tex-200-F'!$I$28)","v":"Within Grading Limits"},{"$f":"IF('Tex-200-F'!$B$27=\"\",\"\",'Tex-200-F'!$B$27)","v":"Sieve Size"},{"$f":"IF('Tex-200-F'!$B$40=\"\",\"\",'Tex-200-F'!$B$40)","v":""}]
[98,{"$f":"IF('Tex-200-F'!$I$41=\"\",\"\",'Tex-200-F'!$I$41)","v":""},{"$f":"IF('Tex-200-F'!$B$22=\"\",\"\",'Tex-200-F'!$B$22)","v":"Tex-200-F: Part I & II"},{"$f":"IF('Tex-200-F'!$I$28=\"\",\"\",'Tex-200-F'!$I$28)","v":"Within Grading Limits"},{"$f":"IF('Tex-200-F'!$B$27=\"\",\"\",'Tex-200-F'!$B$27)","v":"Sieve Size"},{"$f":"IF('Tex-200-F'!$B$41=\"\",\"\",'Tex-200-F'!$B$41)","v":""}]
[99,{"$f":"IF('Tex-200-F'!$C$59=\"\",\"\",'Tex-200-F'!$C$59)","v":""},"Tested By ",{"$f":"IF('Tex-200-F'!$B$59=\"\",\"\",'Tex-200-F'!$B$59)","v":"TX200PI"}]
[100,{"$f":"IF('Tex-200-F'!$F$59=\"\",\"\",'Tex-200-F'!$F$59)","v":""},"Tested Date ",{"$f":"IF('Tex-200-F'!$B$59=\"\",\"\",'Tex-200-F'!$B$59)","v":"TX200PI"}]
[101,{"$f":"IF('Tex-200-F'!$C$61=\"\",\"\",'Tex-200-F'!$C$61)","v":""},"Tested By ",{"$f":"IF('Tex-200-F'!$B$61=\"\",\"\",'Tex-200-F'!$B$61)","v":"TX200PII"}]
[102,{"$f":"IF('Tex-200-F'!$F$61=\"\",\"\",'Tex-200-F'!$F$61)","v":""},"Tested Date ",{"$f":"IF('Tex-200-F'!$B$61=\"\",\"\",'Tex-200-F'!$B$61)","v":"TX200PII"}]
[103,{"$f":"IF('Tex-200-F'!$C$55=\"\",\"\",'Tex-200-F'!$C$55)","v":""},"Sampled By ",{"$f":"IF('Tex-200-F'!$B$55=\"\",\"\",'Tex-200-F'!$B$55)","v":"TX400"}]
[104,{"$f":"IF('Tex-200-F'!$F$55=\"\",\"\",'Tex-200-F'!$F$55)","v":""},"Sampled Date ",{"$f":"IF('Tex-200-F'!$B$55=\"\",\"\",'Tex-200-F'!$B$55)","v":"TX400"}]

{"sheet":"Sieves","index":2,"n_rows":27,"n_cols":4,"rows_kept":27,"cut":false,"hidden":true,"merged":[]}
[null,"Sieve Size Inches","Sieve Size Metric","Selection"]
[null,"2\"","50 mm",{"$f":"IF(SpecYear=\"\",\"\",IF(SpecYear=\"1995\",C2,B2))","v":""}]
[null,"1-3/4\"","45 mm",{"$f":"IF(SpecYear=\"\",\"Spec Year ?\",IF(SpecYear=\"1995\",C3,B3))","v":"Spec Year ?"}]
[null,"1-1/2\"","37.5 mm",{"$f":"IF(SpecYear=\"\",\"\",IF(SpecYear=\"1995\",C4,B4))","v":""}]
[null,"1-1/4\"","31.5 mm",""]
[null,"1\"","25 mm",""]
[null,"7/8\"","22.4 mm",""]
[null,"3/4\"","19 mm",""]
[null,"5/8\"","16 mm",""]
[null,"1/2\"","12.5 mm",""]
[null,"7/16\"","11.2 mm",""]
[null,"3/8\"","9.5 mm",""]
[null,"5/16\"","8 mm",""]
[null,"1/4\"","6.3 mm",""]
[null,"No. 4","4.75 mm",""]
[null,"No. 6","3.35 mm",""]
[null,"No. 8","2.36 mm",""]
[null,"No. 10","2 mm",""]
[null,"No. 14","1.4 mm",""]
[null,"No. 16","1.18 mm",""]
[null,"No. 20",".85 µm",""]
[null,"No. 30",".6 µm",""]
[null,"No. 40",".425 µm",""]
[null,"No. 50",".3 µm",""]
[null,"No. 80",".18 µm",""]
[null,"No. 100",".15 µm",""]
[null,"No. 200",".075 µm",""]