{"text_format":"1","workbook":"xlsx","n_sheets":5,"sheets":["Tex-200-F","Revisions","GRADATIONS","RX","spcyr"],"not_rendered":{"charts":0,"images":1,"macros":1,"external_links":0,"defined_names":199,"comments":1,"pivot_tables":0},"unopened":[],"bounds":{"document_bytes":16777216,"sheet_cells":100000,"rows_first":2000,"rows_last":500,"rows_between":2000,"halvings":0,"cell_chars":16384,"cell_head_chars":4096},"cells_cut":0,"cells_raw":0,"read":"whole","date_system":"1900"}

{"sheet":"Tex-200-F","index":0,"n_rows":64,"n_cols":11,"rows_kept":64,"cut":false,"hidden":false,"merged":[[0,0,0,1],[39,3,39,7],[49,1,49,8],[48,1,48,8],[46,1,47,8],[28,8,29,8],[28,3,29,3],[9,3,9,4],[13,3,13,4],[9,7,9,8],[12,7,12,8],[14,3,14,8],[10,3,10,4],[63,1,63,3],[28,1,29,1],[25,1,25,3],[7,3,7,4],[16,3,16,4],[26,1,26,3],[40,3,40,7],[7,7,7,8],[54,2,54,4],[28,6,29,6],[8,3,8,4],[8,7,8,8],[13,7,13,8],[15,3,15,8],[11,3,11,4],[12,3,12,4],[59,6,59,8],[16,7,16,8],[10,7,10,8],[11,7,11,8],[55,2,55,4],[28,5,29,5],[28,7,29,7],[28,4,29,4],[25,6,26,7],[25,8,26,8],[59,1,59,3],[57,2,57,4],[50,2,50,4],[51,2,51,4],[53,2,53,4]]}
["TxDOT Manuals >",null,null,"Tex-200-F"]
[null,"TEXAS DEPARTMENT OF TRANSPORTATION",null,null,null,null,null,null,null,null,55]
[null,null,null,null,null,null,null,null,null,null,4]
[null,null,null,null,null,null,null,null,null,null,"tx200st.xlsm::45574.60265"]
[null,"SIEVE ANALYSIS OF SURFACE TREATMENT AGGREGATE "]
[null,"Tex-200-F"]
[null,null,null,null,null,null,null,null,{"$f":"\"TX200ST :: File Version: \" & TEXT(MID(sn,SEARCH(\"::\",sn,1)+2,20),\"mm/dd/yy hh:mm:ss\")","v":"TX200ST :: File Version: 10/09/24 14:27:49"}]
[null,null,"SAMPLE ID:"," ",null,null,"SAMPLED DATE:"]
[null,null,"TEST NUMBER:",null,null,null,"LETTING DATE:"]
[null,null,"SAMPLE STATUS:",null,null,null,"CONTROLLING CSJ:"]
[null,null,"COUNTY:",null,null,null,"SPEC YEAR:"]
[null,null,"SAMPLED BY:",null,null,null,"SPEC ITEM:"]
[null,null,"SAMPLE LOCATION:",null,null,null,"SPECIAL PROVISION:"]
[null,null,"MATERIAL CODE:",null,null,null,"GRADE:"]
[null,null,"MATERIAL NAME:"]
[null,null,"PRODUCER:"]
[null,null,"AREA ENGINEER:",null,null,null,"PROJECT MANAGER:"]
[]
[null,null,"COURSE\\LIFT:",null,"STATION:",null,null,"DIST. FROM CL:"]
[]
[null,"TYPE:",null,"ASPHALT %:",null,"MOISTURE %:"]
[]
[null,"SIEVE ANALYSIS"]
[null,"Tex-200-F: Part I"]
[]
[null,"Original Dry Weight, (g):",null,null,null,null,"Round test results to the nearest whole number?"]
[null,"Dry Weight After Washing, (g):"]
[]
[null,"Sieve Size",{"$f":"IF(Field10=\"\",\"Individual\",\"Cumulative\") & \" Weight Retained (g)\"","v":"Individual Weight Retained (g)"},{"$f":"IF(C30=\"Cumulative\",\"Individual\",\"Cumulative\") & \" Weight Retained (g)\"","v":"Cumulative Weight Retained (g)"},"Individual Percent Retained","Cumulative Percent Retained","Cumulative Percent Passing","Lower & Upper Retained Limit (%)","Within Master Grading"]
[]
[null,{"$f":"IF(ISERROR(INDEX(INDIRECT(\"grade\"&Grade&SpecYear),1,IF(SpecYear=\"\",6,IF(SpecYear=\"1995\",3,2)))),\"\",IF(INDEX(INDIRECT(\"grade\"&Grade&SpecYear),1,IF(SpecYear=\"\",6,IF(SpecYear=\"1995\",3,2)))=0,\"\",INDEX(INDIRECT(\"grade\"&Grade&SpecYear),1,IF(SpecYear=\"\",6,IF(SpecYear=\"1995\",3,2)))))","v":""},null,{"$f":"IF($C31=\"\",\"\",ROUND($C31,1))","v":""},{"$f":"IF(C31=\"\",\"\",IF(Rounding=\"Yes\",IF(retainedMethod=\"cumulative\",FIXED(ROUND(D31/Total*100,0),0),FIXED(ROUND(C31/Total*100,0),0)),IF(retainedMethod=\"cumulative\",ROUND(D31/Total*100,1),ROUND(C31/Total*100,1))))","v":""},{"$f":"IF($C31=\"\",\"\",IF(Rounding=\"Yes\",IF(retainedMethod=\"Cumulative\",FIXED(ROUND(C31/Total*100,0),0),FIXED(ROUND(D31/Total*100,0),0)),IF(retainedMethod=\"Cumulative\",ROUND(C31/Total*100,1),ROUND(D31/Total*100,1))))","v":""},{"$f":"IF(F31=\"\",\"\",IF(Rounding=\"Yes\",FIXED(100-F31,0),ROUND(100-F31,1)))","v":""},{"$f":"IF(B31=\"\",\"\",GRADATIONS!G4 & \"-\" & GRADATIONS!H4)","v":""},{"$f":"IF($C31=\"\",\"\",IF(AND(ROUND($F31,1)<=GRADATIONS!$H4,ROUND($F31,1)>=GRADATIONS!$G4),\"Yes\",\"No\"))","v":""}]
[null,{"$f":"IF(ISERROR(INDEX(INDIRECT(\"grade\"&Grade&SpecYear),2,IF(SpecYear=\"\",6,IF(SpecYear=\"1995\",3,2)))),\"\",IF(INDEX(INDIRECT(\"grade\"&Grade&SpecYear),2,IF(SpecYear=\"\",6,IF(SpecYear=\"1995\",3,2)))=0,\"\",INDEX(INDIRECT(\"grade\"&Grade&SpecYear),2,IF(SpecYear=\"\",6,IF(SpecYear=\"1995\",3,2)))))","v":""},null,{"$f":"IF(C32=\"\",\"\",IF(retainedMethod=\"Cumulative\",ROUND(($C32-$C31),1),ROUND(SUM($C$31:$C32),1)))","v":""},"","","",{"$f":"IF(B32=\"\",\"\",GRADATIONS!G5 & \"-\" & GRADATIONS!H5)","v":""},{"$f":"IF($C32=\"\",\"\",IF(AND(ROUND($F32,1)<=GRADATIONS!$H5,ROUND($F32,1)>=GRADATIONS!$G5),\"Yes\",\"No\"))","v":""}]
[null,{"$f":"IF(ISERROR(INDEX(INDIRECT(\"grade\"&Grade&SpecYear),3,IF(SpecYear=\"\",6,IF(SpecYear=\"1995\",3,2)))),\"\",IF(INDEX(INDIRECT(\"grade\"&Grade&SpecYear),3,IF(SpecYear=\"\",6,IF(SpecYear=\"1995\",3,2)))=0,\"\",INDEX(INDIRECT(\"grade\"&Grade&SpecYear),3,IF(SpecYear=\"\",6,IF(SpecYear=\"1995\",3,2)))))","v":""},null,{"$f":"IF(C33=\"\",\"\",IF(retainedMethod=\"Cumulative\",ROUND(($C33-$C32),1),ROUND(SUM($C$31:$C33),1)))","v":""},"","","",{"$f":"IF(B33=\"\",\"\",GRADATIONS!G6 & \"-\" & GRADATIONS!H6)","v":""},{"$f":"IF($C33=\"\",\"\",IF(AND(ROUND($F33,1)<=GRADATIONS!$H6,ROUND($F33,1)>=GRADATIONS!$G6),\"Yes\",\"No\"))","v":""}]
[null,{"$f":"IF(ISERROR(INDEX(INDIRECT(\"grade\"&Grade&SpecYear),4,IF(SpecYear=\"\",6,IF(SpecYear=\"1995\",3,2)))),\"\",IF(INDEX(INDIRECT(\"grade\"&Grade&SpecYear),4,IF(SpecYear=\"\",6,IF(SpecYear=\"1995\",3,2)))=0,\"\",INDEX(INDIRECT(\"grade\"&Grade&SpecYear),4,IF(SpecYear=\"\",6,IF(SpecYear=\"1995\",3,2)))))","v":""},null,{"$f":"IF(C34=\"\",\"\",IF(retainedMethod=\"Cumulative\",ROUND(($C34-$C33),1),ROUND(SUM($C$31:$C34),1)))","v":""},"","","",{"$f":"IF(B34=\"\",\"\",GRADATIONS!G7 & \"-\" & GRADATIONS!H7)","v":""},{"$f":"IF($C34=\"\",\"\",IF(AND(ROUND($F34,1)<=GRADATIONS!$H7,ROUND($F34,1)>=GRADATIONS!$G7),\"Yes\",\"No\"))","v":""}]
[null,{"$f":"IF(ISERROR(INDEX(INDIRECT(\"grade\"&Grade&SpecYear),5,IF(SpecYear=\"\",6,IF(SpecYear=\"1995\",3,2)))),\"\",IF(INDEX(INDIRECT(\"grade\"&Grade&SpecYear),5,IF(SpecYear=\"\",6,IF(SpecYear=\"1995\",3,2)))=0,\"\",INDEX(INDIRECT(\"grade\"&Grade&SpecYear),5,IF(SpecYear=\"\",6,IF(SpecYear=\"1995\",3,2)))))","v":""},null,{"$f":"IF(C35=\"\",\"\",IF(retainedMethod=\"Cumulative\",ROUND(($C35-$C34),1),ROUND(SUM($C$31:$C35),1)))","v":""},"","","",{"$f":"IF(B35=\"\",\"\",GRADATIONS!G8 & \"-\" & GRADATIONS!H8)","v":""},{"$f":"IF($C35=\"\",\"\",IF(AND(ROUND($F35,1)<=GRADATIONS!$H8,ROUND($F35,1)>=GRADATIONS!$G8),\"Yes\",\"No\"))","v":""}]
[null,{"$f":"IF(ISERROR(INDEX(INDIRECT(\"grade\"&Grade&SpecYear),6,IF(SpecYear=\"\",6,IF(SpecYear=\"1995\",3,2)))),\"\",IF(INDEX(INDIRECT(\"grade\"&Grade&SpecYear),6,IF(SpecYear=\"\",6,IF(SpecYear=\"1995\",3,2)))=0,\"\",INDEX(INDIRECT(\"grade\"&Grade&SpecYear),6,IF(SpecYear=\"\",6,IF(SpecYear=\"1995\",3,2)))))","v":""},null,{"$f":"IF(C36=\"\",\"\",IF(retainedMethod=\"Cumulative\",ROUND(($C36-$C35),1),ROUND(SUM($C$31:$C36),1)))","v":""},"","","",{"$f":"IF(B36=\"\",\"\",GRADATIONS!G9 & \"-\" & GRADATIONS!H9)","v":""},{"$f":"IF($C36=\"\",\"\",IF(AND(ROUND($F36,1)<=GRADATIONS!$H9,ROUND($F36,1)>=GRADATIONS!$G9),\"Yes\",\"No\"))","v":""}]
[null,{"$f":"IF(ISERROR(INDEX(INDIRECT(\"grade\"&Grade&SpecYear),7,IF(SpecYear=\"\",6,IF(SpecYear=\"1995\",3,2)))),\"\",IF(INDEX(INDIRECT(\"grade\"&Grade&SpecYear),7,IF(SpecYear=\"\",6,IF(SpecYear=\"1995\",3,2)))=0,\"\",INDEX(INDIRECT(\"grade\"&Grade&SpecYear),7,IF(SpecYear=\"\",6,IF(SpecYear=\"1995\",3,2)))))","v":""},null,{"$f":"IF(C37=\"\",\"\",IF(retainedMethod=\"Cumulative\",ROUND(($C37-$C36),1),ROUND(SUM($C$31:$C37),1)))","v":""},"","","",{"$f":"IF(B37=\"\",\"\",GRADATIONS!G10 & \"-\" & GRADATIONS!H10)","v":""},{"$f":"IF($C37=\"\",\"\",IF(AND(ROUND($F37,1)<=GRADATIONS!$H10,ROUND($F37,1)>=GRADATIONS!$G10),\"Yes\",\"No\"))","v":""}]
[null,{"$f":"IF(ISERROR(INDEX(INDIRECT(\"grade\"&Grade&SpecYear),8,IF(SpecYear=\"\",6,IF(SpecYear=\"1995\",3,2)))),\"\",IF(INDEX(INDIRECT(\"grade\"&Grade&SpecYear),8,IF(SpecYear=\"\",6,IF(SpecYear=\"1995\",3,2)))=0,\"\",INDEX(INDIRECT(\"grade\"&Grade&SpecYear),8,IF(SpecYear=\"\",6,IF(SpecYear=\"1995\",3,2)))))","v":""},null,{"$f":"IF(C38=\"\",\"\",IF(retainedMethod=\"Cumulative\",ROUND(($C38-$C37),1),ROUND(SUM($C$31:$C38),1)))","v":""},"","","",{"$f":"IF(B38=\"\",\"\",GRADATIONS!G11 & \"-\" & GRADATIONS!H11)","v":""},{"$f":"IF($C38=\"\",\"\",IF(AND(ROUND($F38,1)<=GRADATIONS!$H11,ROUND($F38,1)>=GRADATIONS!$G11),\"Yes\",\"No\"))","v":""}]
[null,{"$f":"IF(Grade=\"\",\"\",\"-\" & OFFSET(B39,-COUNTBLANK(B31:B38)-1,0))","v":""}]
[null,{"$f":"IF(sloss=0,\"\",IF(sloss<0,\"Check >>\",IF(ODSW<>\"\",IF(ABS(sloss)>ODSW*0.002,\"Too High >>\",\"\"),\"\")))","v":""},{"$f":"IF(SUM(C31:C39)=0,\"\",IF(DWAW<>\"\",DWAW-IF(retainedMethod=\"Cumulative\",IF(ISERROR(LARGE(C31:C39,1)),0,LARGE(C31:C39,1)),SUM(C31:C39)),IF(ODSW<>\"\",ODSW-IF(retainedMethod=\"Cumulative\",IF(ISERROR(LARGE(C31:C39,1)),0,LARGE(C31:C39,1)),SUM(C31:C39)),0)))","v":""},{"$f":"\"Sieving \" & IF(sloss<0,\"Gain\",\"Loss\") & \", (g) \" & IF(DWAW<>\"\",\"from 'Dry Weight After Washing'\",IF(ODSW<>\"\",\"from 'Original Dry Sample'\",\"\")) & \" weight\"","v":"Sieving Loss, (g)  weight"}]
[null,null,{"$f":"IF(SUM(C31:C39)=0,\"\",IF(AND(DWAW<>\"\",ODSW<>\"\"),ODSW-DWAW,0))","v":""},{"$f":"IF(ODSW-DWAW<0,\"ERROR, Wash Weight Greater Than Original Weight\",\"Washing Loss, (g)\")","v":"Washing Loss, (g)"}]
[null,{"$f":"\"Total \" & B39","v":"Total "},{"$f":"IF(ISERROR(IF(retainedMethod=\"cumulative\",LARGE(C31:C39,1),prepan)+sloss+wloss),\"\",IF(retainedMethod=\"cumulative\",LARGE(C31:C39,1),prepan)+sloss+wloss)","v":""},{"$f":"IF(C39=\"\",\"\",IF(retainedMethod=\"Cumulative\",(C42-SUM(D$30:D36)),SUM(C25:C36,Pan)))","v":""},{"$f":"IF(C39=\"\",\"\",IF(retainedMethod=\"cumulative\",Pan/Total*100,D42/Total*100) )","v":""}]
[null,"Total Weight:",{"$f":"IF(ISERROR(IF(retainedMethod=\"cumulative\",LARGE(C31:C39,1),prepan)+sloss+wloss),\"\",IF(retainedMethod=\"Cumulative\",Pan,SUM(C31:C38)+Pan))","v":""}]
[]
[]
[null,"Remarks:",{"$f":"NOW()","v":"2024-10-09T14:27:49.920"}]
[]
[]
[]
[]
[null,"Sample Method:","Sampled By:",null,null,"Sampled Date:"]
[null,"TX221"]
[]
[null,"TX400"]
[null,"Test Method:","Tested By:",null,null,"Tested Date:"]
[null,"TX200"]
[]
[null,"TX200PI"]
[null,"Test Stamp Code:",null,null,"Omit Test:","Completed Date:","Reviewed By:"]
[]
[null,"Locked By:","TxDOT:","District:","Area:"]
[]
[null,"Authorized By:",null,null,"Authorized Date:"]
[null,null,null,null,null,{"$f":"IF(OR(ISBLANK(AuthorizedDate),AuthorizedDate>42771),1,0)","v":1}]

{"sheet":"Revisions","index":1,"n_rows":16,"n_cols":3,"rows_kept":16,"cut":false,"hidden":true,"merged":[[5,0,13,0],[5,2,13,2],[6,1,8,1],[9,1,11,1],[12,1,13,1]]}
["Date","Changes","By"]
["2005-05-09","Add Shown on Plans to Spec Year 2004 Grade Validation.  Add Range Shown_On_Plans2004","Joe Liu"]
[]
["2005-10-20","Gradations B82 1/4 -> No.4 C82 6.3mm -> 4.75mm","Joe Liu"]
[]
["2010-01-25","Add the option to round test results to the nearest whole number (cell I 26)","Gisel Carrasco"]
[null,"By changing the \"Individual Percent Retained\" formula from =IF(C31=\"\",\"\",IF(retainedMethod=\"cumulative\",ROUND(D31/Total*100,1),ROUND(C31/Total*100,1)))  To   =IF(C31=\"\",\"\",IF(Rounding=\"Yes\",IF(retainedMethod=\"cumulative\",FIXED(ROUND(D31/Total*100,0),0),FIXED(ROUND(C31/Total*100,0),0)),IF(retainedMethod=\"cumulative\",ROUND(D31/Total*100,1),ROUND(C31/Total*100,1))))"]
[]
[]
[null,"By changing the \"Cumulative Percent Retained\" formula from =IF($C31=\"\",\"\",IF(retainedMethod=\"Cumulative\",ROUND(C31/Total*100,1),ROUND(D31/Total*100,1)))  To   =IF(C31=\"\",\"\",IF(Rounding=\"Yes\",IF(retainedMethod=\"cumulative\",FIXED(ROUND(D31/Total*100,0),0),FIXED(ROUND(C31/Total*100,0),0)),IF(retainedMethod=\"cumulative\",ROUND(D31/Total*100,1),ROUND(C31/Total*100,1))))"]
[]
[]
[null,"By changing the \"Cumulative Percent Passing\" formula from    =IF(F31=\"\",\"\",ROUND(100-F31,1))  To   =IF(F31=\"\",\"\",IF(Rounding=\"Yes\",FIXED(100-F31,0),ROUND(100-F31,1)))"]
[]
["2017-02-03","Added Part I to title","T Patton"]
["2024-08-06","Added 2024 items","Syeda Rahman"]

{"sheet":"GRADATIONS","index":2,"n_rows":228,"n_cols":8,"rows_kept":228,"cut":false,"hidden":true,"merged":[[0,7,2,7],[44,0,49,0],[50,0,55,0],[56,0,60,0],[78,0,82,0],[83,0,88,0],[194,0,199,0],[0,6,2,6],[61,0,65,0],[66,0,69,0],[70,0,77,0]]}
["Grade","\"1993\" Sieve Size","\"1995\" Sieve Size","Min","Max",null,"Lower Retained Limit, (%)","Upper Retained Limit (%)"]
[1,"1\"","25 mm",0,0]
[null,"7/8\"","22.4 mm",0,2]
[null,"3/4\"","19 mm",20,35,null,{"$f":"IF(ISERROR(INDEX(INDIRECT(\"grade\"&Grade&SpecYear),1,4)),\"\",INDEX(INDIRECT(\"grade\"&Grade&SpecYear),1,4))","v":""},{"$f":"IF(ISERROR(INDEX(INDIRECT(\"grade\"&Grade&SpecYear),1,5)),\"\",INDEX(INDIRECT(\"grade\"&Grade&SpecYear),1,5))","v":""}]
[null,"5/8\"","16 mm",85,100,null,{"$f":"IF(ISERROR(INDEX(INDIRECT(\"grade\"&Grade&SpecYear),2,4)),\"\",INDEX(INDIRECT(\"grade\"&Grade&SpecYear),2,4))","v":""},{"$f":"IF(ISERROR(INDEX(INDIRECT(\"grade\"&Grade&SpecYear),2,5)),\"\",INDEX(INDIRECT(\"grade\"&Grade&SpecYear),2,5))","v":""}]
[null,"3/8\"","9.5 mm",95,100,null,{"$f":"IF(ISERROR(INDEX(INDIRECT(\"grade\"&Grade&SpecYear),3,4)),\"\",INDEX(INDIRECT(\"grade\"&Grade&SpecYear),3,4))","v":""},{"$f":"IF(ISERROR(INDEX(INDIRECT(\"grade\"&Grade&SpecYear),3,5)),\"\",INDEX(INDIRECT(\"grade\"&Grade&SpecYear),3,5))","v":""}]
[null,"No. 10","2 mm",99,100,null,{"$f":"IF(ISERROR(INDEX(INDIRECT(\"grade\"&Grade&SpecYear),4,4)),\"\",INDEX(INDIRECT(\"grade\"&Grade&SpecYear),4,4))","v":""},{"$f":"IF(ISERROR(INDEX(INDIRECT(\"grade\"&Grade&SpecYear),4,5)),\"\",INDEX(INDIRECT(\"grade\"&Grade&SpecYear),4,5))","v":""}]
[2,"7/8\"","22.4 mm",0,0,null,{"$f":"IF(ISERROR(INDEX(INDIRECT(\"grade\"&Grade&SpecYear),5,4)),\"\",INDEX(INDIRECT(\"grade\"&Grade&SpecYear),5,4))","v":""},{"$f":"IF(ISERROR(INDEX(INDIRECT(\"grade\"&Grade&SpecYear),5,5)),\"\",INDEX(INDIRECT(\"grade\"&Grade&SpecYear),5,5))","v":""}]
[null,"3/4\"","19 mm",0,2,null,{"$f":"IF(ISERROR(INDEX(INDIRECT(\"grade\"&Grade&SpecYear),6,4)),\"\",INDEX(INDIRECT(\"grade\"&Grade&SpecYear),6,4))","v":""},{"$f":"IF(ISERROR(INDEX(INDIRECT(\"grade\"&Grade&SpecYear),6,5)),\"\",INDEX(INDIRECT(\"grade\"&Grade&SpecYear),6,5))","v":""}]
[null,"5/8\"","16 mm",20,40,null,{"$f":"IF(ISERROR(INDEX(INDIRECT(\"grade\"&Grade&SpecYear),7,4)),\"\",INDEX(INDIRECT(\"grade\"&Grade&SpecYear),7,4))","v":""},{"$f":"IF(ISERROR(INDEX(INDIRECT(\"grade\"&Grade&SpecYear),7,5)),\"\",INDEX(INDIRECT(\"grade\"&Grade&SpecYear),7,5))","v":""}]
[null,"1/2\"","12.5 mm",80,100,null,{"$f":"IF(ISERROR(INDEX(INDIRECT(\"grade\"&Grade&SpecYear),8,4)),\"\",INDEX(INDIRECT(\"grade\"&Grade&SpecYear),8,4))","v":""},{"$f":"IF(ISERROR(INDEX(INDIRECT(\"grade\"&Grade&SpecYear),8,5)),\"\",INDEX(INDIRECT(\"grade\"&Grade&SpecYear),8,5))","v":""}]
[null,"3/8\"","9.5 mm",95,100,null,{"$f":"IF(ISERROR(INDEX(INDIRECT(\"grade\"&Grade&SpecYear),9,4)),\"\",INDEX(INDIRECT(\"grade\"&Grade&SpecYear),9,4))","v":""},{"$f":"IF(ISERROR(INDEX(INDIRECT(\"grade\"&Grade&SpecYear),9,5)),\"\",INDEX(INDIRECT(\"grade\"&Grade&SpecYear),9,5))","v":""}]
[null,"No. 10","2 mm",99,100]
[3,"3/4\"","19 mm",0,0]
[null,"5/8\"","16 mm",0,2]
[null,"1/2\"","12.5 mm",20,40]
[null,"3/8\"","9.5 mm",80,100]
[null,"1/4\"","6.3 mm",95,100]
[null,"No. 10","2 mm",99,100]
[4,"5/8\"","16 mm",0,0]
[null,"1/2\"","12.5 mm",0,2]
[null,"3/8\"","9.5 mm",20,35]
[null,"No. 4","4.75 mm",95,100]
[null,"No. 10","2 mm",99,100]
[5,"1/2\"","12.5 mm",0,0]
[null,"3/8\"","9.5 mm",0,5]
[null,"No. 4","4.75 mm",40,85]
[null,"No. 10","2 mm",98,100]
[null,"No. 20","850 µm",99,100]
["3Lw","3/4\"","19 mm",0,0]
[null,"5/8\"","16 mm",0,2]
[null,"1/2\"","12.5 mm",10,25]
[null,"3/8\"","9.5 mm",60,80]
[null,"1/4\"","6.3 mm",95,100]
[null,"No. 10","2 mm",98,100]
["4Lw","5/8\"","16 mm",0,0]
[null,"1/2\"","12.5 mm",0,5]
[null,"3/8\"","9.5 mm",20,40]
[null,"No. 4","4.75 mm",95,100]
[null,"No. 10","2 mm",98,100]
["5Lw","1/2\"","12.5 mm",0,0]
[null,"3/8\"","9.5 mm",0,2]
[null,"No. 4","4.75 mm",60,80]
[null,"No. 10","2 mm",98,100]
["ASTM Grade 6","1\"","25 mm",0,0]
[null,"3/4\"","19 mm",0,10]
[null,"1/2\"","12.5 mm",45,80]
[null,"3/8\"","9.5 mm",85,100]
[null,"No. 4","4.75 mm",98,100]
[null,"No. 200",".075 µm",98.5,100]
["ASTM Grade 7","3/4\"","19 mm",0,0]
[null,"1/2\"","12.5 mm",0,10]
[null,"3/8\"","9.5 mm",30,60]
[null,"No. 4","4.75 mm",85,100]
[null,"No. 8","2.36 mm",95,100]
[null,"No. 200",".075 µm",98.5,100]
["Grade 3 Modified","5/8\"","16 mm",0,0]
[null,"1/2\"","12.5 mm",10,25]
[null,"3/8\"","9.5 mm",80,100]
[null,"1/4\"","6.3 mm",98,100]
[null,"No. 10","2 mm",99,100]
["Grade 5 Modified","1/2\"","12.5 mm",0,0]
[null,"3/8\"","9.5 mm",0,2]
[null,"No. 4","4.75 mm",5,40]
[null,"No. 10","2 mm",70,100]
[null,"No. 20",".85 µm",98,100]
["Type D","1/2\"","12.5 mm",0,0]
[null,"3/8\"","9.5 mm",0,8]
[null,"No. 4","4.75 mm",60,75]
[null,"No. 10","2 mm",85,100]
["MICRO Grade 2","3/8\"","9.5 mm",0,1]
[null,"No. 4","4.75 mm",6,14]
[null,"No. 8","2.36 mm",35,55]
[null,"No. 16","1.18 mm",54,75]
[null,"No. 30",".6 µm",65,85]
[null,"No. 50",".3 µm",75,90]
[null,"No. 100",".15 µm",82,93]
[null,"No. 200",".075 µm",85,95]
["Grade 4 Modified Uvalde","5/8\"","16 mm",0,0,null,"Gr4 Modified","Gr3 Modified"]
[null,"1/2\"","12.5 mm",0,5,null,"5/8\" - 0","3/4\" - 0"]
[null,"3/8\"","9.5 mm",60,85,null,"½\" - 0-5","5/8\" - 0-5"]
[null,"No. 4","4.75 mm",95,100,null,"3/8\" - 60-85","½\" - 55-85"]
[null,"No. 10","2 mm",99,100,null,"#4 - 95-100","3/8\" - 95-100"]
["Grade 3 Modified Uvalde","3/4\"","19 mm",0,0,null,"#10 - 99-100","1/4\" - 95-100"]
[null,"5/8\"","16 mm",0,5,null,null,"#10 - 99-100"]
[null,"1/2\"","12.5 mm",55,85]
[null,"3/8\"","9.5 mm",95,100]
[null,"1/4\"","6.3 mm",95,100]
[null,"No. 10","2 mm",99,100]
[1,"7/8\"",null,0,2]
[null,"3/4\"",null,20,35]
[2004,"5/8\"",null,85,100]
[null,"3/8\"",null,95,100]
[null,"No. 8",null,99,100]
[2,"7/8\"",null,0,0]
[null,"3/4\"",null,0,2]
[2004,"5/8\"",null,20,40]
[null,"1/2\"",null,80,100]
[null,"3/8\"",null,95,100]
[null,"No. 8",null,99,100]
["3S2","3/4\"",null,0,0]
[null,"5/8\"",null,0,5]
[2004,"1/2\"",null,55,85]
[null,"3/8\"",null,95,100]
[null,"No. 8",null,99,100]
["3NLW","3/4\"",null,0,0]
[null,"5/8\"",null,0,5]
[2004,"1/2\"",null,20,40]
[null,"3/8\"",null,80,100]
[null,"1/4\"",null,95,100]
[null,"No. 8",null,99,100]
["3LW","3/4\"",null,0,0]
[null,"5/8\"",null,0,2]
[2004,"1/2\"",null,10,25]
[null,"3/8\"",null,60,80]
[null,"1/4\"",null,95,100]
[null,"No. 8",null,98,100]
["4S2","5/8\"",null,0,0]
[null,"1/2\"",null,0,5]
[2004,"3/8\"",null,60,85]
[null,"No. 4",null,95,100]
[null,"No. 8",null,98,100]
[4,"5/8\"",null,0,0]
[null,"1/2\"",null,0,5]
[2004,"3/8\"",null,20,40]
[null,"No. 4",null,95,100]
[null,"No. 8",null,98,100]
["5S2","1/2\"",null,0,0]
[null,"3/8\"",null,0,5]
[2004,"1/4\"",null,65,85]
[null,"No. 4",null,95,100]
[null,"No. 8",null,98,100]
[5,"1/2\"",null,0,0]
[null,"3/8\"",null,0,5]
[2004,"No. 4",null,50,80]
[null,"No. 8",null,98,100]
[1,"7/8\"",null,0,2]
[null,"3/4\"",null,20,35]
[2014,"5/8\"",null,85,100]
[null,"3/8\"",null,95,100]
[null,"No. 8",null,99,100]
[2,"7/8\"",null,0,0]
[null,"3/4\"",null,0,2]
[2014,"5/8\"",null,20,40]
[null,"1/2\"",null,80,100]
[null,"3/8\"",null,95,100]
[null,"No. 8",null,99,100]
["3S2","3/4\"",null,0,0]
[null,"5/8\"",null,0,5]
[2014,"1/2\"",null,55,85]
[null,"3/8\"",null,95,100]
[null,"No. 8",null,99,100]
["3NLW","3/4\"",null,0,0]
[null,"5/8\"",null,0,5]
[2014,"1/2\"",null,20,40]
[null,"3/8\"",null,80,100]
[null,"1/4\"",null,95,100]
[null,"No. 8",null,99,100]
["3LW","3/4\"",null,0,0]
[null,"5/8\"",null,0,2]
[2014,"1/2\"",null,10,25]
[null,"3/8\"",null,60,80]
[null,"1/4\"",null,95,100]
[null,"No. 8",null,98,100]
["4S2","5/8\"",null,0,0]
[null,"1/2\"",null,0,5]
[2014,"3/8\"",null,60,85]
[null,"No. 4",null,95,100]
[null,"No. 8",null,98,100]
[4,"5/8\"",null,0,0]
[null,"1/2\"",null,0,5]
[2014,"3/8\"",null,20,40]
[null,"No. 4",null,95,100]
[null,"No. 8",null,98,100]
["5S2","1/2\"",null,0,0]
[null,"3/8\"",null,0,5]
[2014,"1/4\"",null,65,85]
[null,"No. 4",null,95,100]
[null,"No. 8",null,98,100]
[5,"1/2\"",null,0,0]
[null,"3/8\"",null,0,5]
[2014,"No. 4",null,50,80]
[null,"No. 8",null,98,100]
["3NLW","3/4\"",null,0,0]
[null,"5/8\"",null,0,5]
[2024,"1/2\"",null,20,45]
[null,"3/8\"",null,80,100]
[null,"1/4\"",null,95,100]
[null,"No. 8",null,98,100]
[4,"5/8\"",null,0,0]
[null,"1/2\"",null,0,5]
[2024,"3/8\"",null,20,45]
[null,"No. 4",null,95,100]
[null,"No. 8",null,98,100]
["Shown On Plans"]
[]
[]
[]
[]
[]
[]
["English","Metric","Selection"]
["2\"","50 mm",{"$f":"IF(SpecYear=\"\",\"\",IF(SpecYear=\"1995\",B203,A203))","v":""}]
["1-3/4\"","45 mm",""]
["1-1/2\"","37.5 mm",""]
["1-1/4\"","31.5 mm",""]
["1\"","25 mm",""]
["7/8\"","22.4 mm",""]
["3/4\"","19 mm",""]
["5/8\"","16 mm",""]
["1/2\"","12.5 mm",""]
["7/16\"","11.2 mm",""]
["3/8\"","9.5 mm",""]
["5/16\"","8 mm",""]
["1/4\"","6.3 mm",""]
["No. 4","4.75 mm",""]
["No. 6","3.35 mm",""]
["No. 8","2.36 mm",""]
["No. 10","2 mm",""]
["No. 14","1.4 mm",""]
["No. 16","1.18 mm",""]
["No. 20",".85 µm",""]
["No. 30",".6 µm",""]
["No. 40",".425 µm",""]
["No. 50",".3 µm",""]
["No. 80",".18 µm",""]
["No. 100",".15 µm",""]
["No. 200",".075 µm",""]

{"sheet":"RX","index":3,"n_rows":81,"n_cols":9,"rows_kept":81,"cut":false,"hidden":true,"merged":[]}
[{"$f":"COUNT(A3:A496)","v":79}]
["Fld_nbr","Value","Desc_1","Desc_2","Desc_3","Desc_4","Desc_5","Desc_6","Desc_7"]
[1,{"$f":"IF('Tex-200-F'!$B$47=\"\",\"\",'Tex-200-F'!$B$47)","v":""},{"$f":"'Tex-200-F'!$B$46","v":"Remarks:"}]
[2,{"$f":"IF('Tex-200-F'!$D$19=\"\",\"\",'Tex-200-F'!$D$19)","v":""},{"$f":"IF('Tex-200-F'!$C$19=\"\",\"\",'Tex-200-F'!$C$19)","v":"COURSE\\LIFT:"}]
[3,{"$f":"IF('Tex-200-F'!$C$56=\"\",\"\",'Tex-200-F'!$C$56)","v":""},"Tested By ",{"$f":"IF('Tex-200-F'!$B$56=\"\",\"\",'Tex-200-F'!$B$56)","v":"TX200"}]
[4,{"$f":"IF('Tex-200-F'!$F$56=\"\",\"\",'Tex-200-F'!$F$56)","v":""},"Tested Date ",{"$f":"IF('Tex-200-F'!$B$56=\"\",\"\",'Tex-200-F'!$B$56)","v":"TX200"}]
[5,{"$f":"IF('Tex-200-F'!$C$21=\"\",\"\",'Tex-200-F'!$C$21)","v":""},{"$f":"IF('Tex-200-F'!$B$6=\"\",\"\",'Tex-200-F'!$B$6)","v":"Tex-200-F"},{"$f":"IF('Tex-200-F'!$B$21=\"\",\"\",'Tex-200-F'!$B$21)","v":"TYPE:"}]
[6,{"$f":"IF('Tex-200-F'!$E$21=\"\",\"\",'Tex-200-F'!$E$21)","v":""},{"$f":"IF('Tex-200-F'!$B$6=\"\",\"\",'Tex-200-F'!$B$6)","v":"Tex-200-F"},{"$f":"IF('Tex-200-F'!$D$21=\"\",\"\",'Tex-200-F'!$D$21)","v":"ASPHALT %:"}]
[7,{"$f":"IF('Tex-200-F'!$G$21=\"\",\"\",'Tex-200-F'!$G$21)","v":""},{"$f":"IF('Tex-200-F'!$B$6=\"\",\"\",'Tex-200-F'!$B$6)","v":"Tex-200-F"},{"$f":"IF('Tex-200-F'!$F$21=\"\",\"\",'Tex-200-F'!$F$21)","v":"MOISTURE %:"}]
[8,{"$f":"IF('Tex-200-F'!$E$26=\"\",\"\",'Tex-200-F'!$E$26)","v":""},{"$f":"IF('Tex-200-F'!$B$24=\"\",\"\",'Tex-200-F'!$B$24)","v":"Tex-200-F: Part I"},{"$f":"IF('Tex-200-F'!$B$26=\"\",\"\",'Tex-200-F'!$B$26)","v":"Original Dry Weight, (g):"}]
[9,{"$f":"IF('Tex-200-F'!$E$27=\"\",\"\",'Tex-200-F'!$E$27)","v":""},{"$f":"IF('Tex-200-F'!$B$24=\"\",\"\",'Tex-200-F'!$B$24)","v":"Tex-200-F: Part I"},{"$f":"IF('Tex-200-F'!$B$27=\"\",\"\",'Tex-200-F'!$B$27)","v":"Dry Weight After Washing, (g):"}]
[10,{"$f":"IF('Tex-200-F'!$C$31=\"\",\"\",'Tex-200-F'!$C$31)","v":""},{"$f":"IF('Tex-200-F'!$B$24=\"\",\"\",'Tex-200-F'!$B$24)","v":"Tex-200-F: Part I"},{"$f":"IF('Tex-200-F'!$C$29=\"\",\"\",'Tex-200-F'!$C$29)","v":"Individual Weight Retained (g)"},{"$f":"IF('Tex-200-F'!$B$29=\"\",\"\",'Tex-200-F'!$B$29)","v":"Sieve Size"},{"$f":"IF('Tex-200-F'!$B$31=\"\",\"\",'Tex-200-F'!$B$31)","v":""}]
[11,{"$f":"IF('Tex-200-F'!$C$32=\"\",\"\",'Tex-200-F'!$C$32)","v":""},{"$f":"IF('Tex-200-F'!$B$24=\"\",\"\",'Tex-200-F'!$B$24)","v":"Tex-200-F: Part I"},{"$f":"IF('Tex-200-F'!$C$29=\"\",\"\",'Tex-200-F'!$C$29)","v":"Individual Weight Retained (g)"},{"$f":"IF('Tex-200-F'!$B$29=\"\",\"\",'Tex-200-F'!$B$29)","v":"Sieve Size"},{"$f":"IF('Tex-200-F'!$B$32=\"\",\"\",'Tex-200-F'!$B$32)","v":""}]
[12,{"$f":"IF('Tex-200-F'!$C$33=\"\",\"\",'Tex-200-F'!$C$33)","v":""},{"$f":"IF('Tex-200-F'!$B$24=\"\",\"\",'Tex-200-F'!$B$24)","v":"Tex-200-F: Part I"},{"$f":"IF('Tex-200-F'!$C$29=\"\",\"\",'Tex-200-F'!$C$29)","v":"Individual Weight Retained (g)"},{"$f":"IF('Tex-200-F'!$B$29=\"\",\"\",'Tex-200-F'!$B$29)","v":"Sieve Size"},{"$f":"IF('Tex-200-F'!$B$33=\"\",\"\",'Tex-200-F'!$B$33)","v":""}]
[13,{"$f":"IF('Tex-200-F'!$C$34=\"\",\"\",'Tex-200-F'!$C$34)","v":""},{"$f":"IF('Tex-200-F'!$B$24=\"\",\"\",'Tex-200-F'!$B$24)","v":"Tex-200-F: Part I"},{"$f":"IF('Tex-200-F'!$C$29=\"\",\"\",'Tex-200-F'!$C$29)","v":"Individual Weight Retained (g)"},{"$f":"IF('Tex-200-F'!$B$29=\"\",\"\",'Tex-200-F'!$B$29)","v":"Sieve Size"},{"$f":"IF('Tex-200-F'!$B$34=\"\",\"\",'Tex-200-F'!$B$34)","v":""}]
[14,{"$f":"IF('Tex-200-F'!$C$35=\"\",\"\",'Tex-200-F'!$C$35)","v":""},{"$f":"IF('Tex-200-F'!$B$24=\"\",\"\",'Tex-200-F'!$B$24)","v":"Tex-200-F: Part I"},{"$f":"IF('Tex-200-F'!$C$29=\"\",\"\",'Tex-200-F'!$C$29)","v":"Individual Weight Retained (g)"},{"$f":"IF('Tex-200-F'!$B$29=\"\",\"\",'Tex-200-F'!$B$29)","v":"Sieve Size"},{"$f":"IF('Tex-200-F'!$B$35=\"\",\"\",'Tex-200-F'!$B$35)","v":""}]
[15,{"$f":"IF('Tex-200-F'!$C$36=\"\",\"\",'Tex-200-F'!$C$36)","v":""},{"$f":"IF('Tex-200-F'!$B$24=\"\",\"\",'Tex-200-F'!$B$24)","v":"Tex-200-F: Part I"},{"$f":"IF('Tex-200-F'!$C$29=\"\",\"\",'Tex-200-F'!$C$29)","v":"Individual Weight Retained (g)"},{"$f":"IF('Tex-200-F'!$B$29=\"\",\"\",'Tex-200-F'!$B$29)","v":"Sieve Size"},{"$f":"IF('Tex-200-F'!$B$36=\"\",\"\",'Tex-200-F'!$B$36)","v":""}]
[16,{"$f":"IF('Tex-200-F'!$C$37=\"\",\"\",'Tex-200-F'!$C$37)","v":""},{"$f":"IF('Tex-200-F'!$B$24=\"\",\"\",'Tex-200-F'!$B$24)","v":"Tex-200-F: Part I"},{"$f":"IF('Tex-200-F'!$C$29=\"\",\"\",'Tex-200-F'!$C$29)","v":"Individual Weight Retained (g)"},{"$f":"IF('Tex-200-F'!$B$29=\"\",\"\",'Tex-200-F'!$B$29)","v":"Sieve Size"},{"$f":"IF('Tex-200-F'!$B$37=\"\",\"\",'Tex-200-F'!$B$37)","v":""}]
[17,{"$f":"IF('Tex-200-F'!$C$38=\"\",\"\",'Tex-200-F'!$C$38)","v":""},{"$f":"IF('Tex-200-F'!$B$24=\"\",\"\",'Tex-200-F'!$B$24)","v":"Tex-200-F: Part I"},{"$f":"IF('Tex-200-F'!$C$29=\"\",\"\",'Tex-200-F'!$C$29)","v":"Individual Weight Retained (g)"},{"$f":"IF('Tex-200-F'!$B$29=\"\",\"\",'Tex-200-F'!$B$29)","v":"Sieve Size"},{"$f":"IF('Tex-200-F'!$B$38=\"\",\"\",'Tex-200-F'!$B$38)","v":""}]
[18,{"$f":"IF('Tex-200-F'!$C$39=\"\",\"\",'Tex-200-F'!$C$39)","v":""},{"$f":"IF('Tex-200-F'!$B$24=\"\",\"\",'Tex-200-F'!$B$24)","v":"Tex-200-F: Part I"},{"$f":"IF('Tex-200-F'!$C$29=\"\",\"\",'Tex-200-F'!$C$29)","v":"Individual Weight Retained (g)"},{"$f":"IF('Tex-200-F'!$B$29=\"\",\"\",'Tex-200-F'!$B$29)","v":"Sieve Size"},{"$f":"IF('Tex-200-F'!$B$39=\"\",\"\",'Tex-200-F'!$B$39)","v":""}]
[19,{"$f":"IF('Tex-200-F'!$C$40=\"\",\"\",'Tex-200-F'!$C$40)","v":""},{"$f":"IF('Tex-200-F'!$B$24=\"\",\"\",'Tex-200-F'!$B$24)","v":"Tex-200-F: Part I"},{"$f":"IF('Tex-200-F'!$D$40=\"\",\"\",'Tex-200-F'!$D$40)","v":"Sieving Loss, (g)  weight"}]
[20,{"$f":"IF('Tex-200-F'!$C$41=\"\",\"\",'Tex-200-F'!$C$41)","v":""},{"$f":"IF('Tex-200-F'!$B$24=\"\",\"\",'Tex-200-F'!$B$24)","v":"Tex-200-F: Part I"},{"$f":"IF('Tex-200-F'!$D$41=\"\",\"\",'Tex-200-F'!$D$41)","v":"Washing Loss, (g)"}]
[21,{"$f":"IF('Tex-200-F'!$C$42=\"\",\"\",'Tex-200-F'!$C$42)","v":""},{"$f":"IF('Tex-200-F'!$B$24=\"\",\"\",'Tex-200-F'!$B$24)","v":"Tex-200-F: Part I"},{"$f":"IF('Tex-200-F'!$C$29=\"\",\"\",'Tex-200-F'!$C$29)","v":"Individual Weight Retained (g)"},{"$f":"IF('Tex-200-F'!$B$29=\"\",\"\",'Tex-200-F'!$B$29)","v":"Sieve Size"},{"$f":"IF('Tex-200-F'!$B$42=\"\",\"\",'Tex-200-F'!$B$42)","v":"Total "}]
[22,{"$f":"IF('Tex-200-F'!$C$43=\"\",\"\",'Tex-200-F'!$C$43)","v":""},{"$f":"IF('Tex-200-F'!$B$24=\"\",\"\",'Tex-200-F'!$B$24)","v":"Tex-200-F: Part I"},{"$f":"IF('Tex-200-F'!$C$29=\"\",\"\",'Tex-200-F'!$C$29)","v":"Individual Weight Retained (g)"},{"$f":"IF('Tex-200-F'!$B$29=\"\",\"\",'Tex-200-F'!$B$29)","v":"Sieve Size"},{"$f":"IF('Tex-200-F'!$B$43=\"\",\"\",'Tex-200-F'!$B$43)","v":"Total Weight:"}]
[23,{"$f":"IF('Tex-200-F'!$D$31=\"\",\"\",'Tex-200-F'!$D$31)","v":""},{"$f":"IF('Tex-200-F'!$B$24=\"\",\"\",'Tex-200-F'!$B$24)","v":"Tex-200-F: Part I"},{"$f":"IF('Tex-200-F'!$D$29=\"\",\"\",'Tex-200-F'!$D$29)","v":"Cumulative Weight Retained (g)"},{"$f":"IF('Tex-200-F'!$B$29=\"\",\"\",'Tex-200-F'!$B$29)","v":"Sieve Size"},{"$f":"IF('Tex-200-F'!$B$31=\"\",\"\",'Tex-200-F'!$B$31)","v":""}]
[24,{"$f":"IF('Tex-200-F'!$D$32=\"\",\"\",'Tex-200-F'!$D$32)","v":""},{"$f":"IF('Tex-200-F'!$B$24=\"\",\"\",'Tex-200-F'!$B$24)","v":"Tex-200-F: Part I"},{"$f":"IF('Tex-200-F'!$D$29=\"\",\"\",'Tex-200-F'!$D$29)","v":"Cumulative Weight Retained (g)"},{"$f":"IF('Tex-200-F'!$B$29=\"\",\"\",'Tex-200-F'!$B$29)","v":"Sieve Size"},{"$f":"IF('Tex-200-F'!$B$32=\"\",\"\",'Tex-200-F'!$B$32)","v":""}]
[25,{"$f":"IF('Tex-200-F'!$D$33=\"\",\"\",'Tex-200-F'!$D$33)","v":""},{"$f":"IF('Tex-200-F'!$B$24=\"\",\"\",'Tex-200-F'!$B$24)","v":"Tex-200-F: Part I"},{"$f":"IF('Tex-200-F'!$D$29=\"\",\"\",'Tex-200-F'!$D$29)","v":"Cumulative Weight Retained (g)"},{"$f":"IF('Tex-200-F'!$B$29=\"\",\"\",'Tex-200-F'!$B$29)","v":"Sieve Size"},{"$f":"IF('Tex-200-F'!$B$33=\"\",\"\",'Tex-200-F'!$B$33)","v":""}]
[26,{"$f":"IF('Tex-200-F'!$D$34=\"\",\"\",'Tex-200-F'!$D$34)","v":""},{"$f":"IF('Tex-200-F'!$B$24=\"\",\"\",'Tex-200-F'!$B$24)","v":"Tex-200-F: Part I"},{"$f":"IF('Tex-200-F'!$D$29=\"\",\"\",'Tex-200-F'!$D$29)","v":"Cumulative Weight Retained (g)"},{"$f":"IF('Tex-200-F'!$B$29=\"\",\"\",'Tex-200-F'!$B$29)","v":"Sieve Size"},{"$f":"IF('Tex-200-F'!$B$34=\"\",\"\",'Tex-200-F'!$B$34)","v":""}]
[27,{"$f":"IF('Tex-200-F'!$D$35=\"\",\"\",'Tex-200-F'!$D$35)","v":""},{"$f":"IF('Tex-200-F'!$B$24=\"\",\"\",'Tex-200-F'!$B$24)","v":"Tex-200-F: Part I"},{"$f":"IF('Tex-200-F'!$D$29=\"\",\"\",'Tex-200-F'!$D$29)","v":"Cumulative Weight Retained (g)"},{"$f":"IF('Tex-200-F'!$B$29=\"\",\"\",'Tex-200-F'!$B$29)","v":"Sieve Size"},{"$f":"IF('Tex-200-F'!$B$35=\"\",\"\",'Tex-200-F'!$B$35)","v":""}]
[28,{"$f":"IF('Tex-200-F'!$D$36=\"\",\"\",'Tex-200-F'!$D$36)","v":""},{"$f":"IF('Tex-200-F'!$B$24=\"\",\"\",'Tex-200-F'!$B$24)","v":"Tex-200-F: Part I"},{"$f":"IF('Tex-200-F'!$D$29=\"\",\"\",'Tex-200-F'!$D$29)","v":"Cumulative Weight Retained (g)"},{"$f":"IF('Tex-200-F'!$B$29=\"\",\"\",'Tex-200-F'!$B$29)","v":"Sieve Size"},{"$f":"IF('Tex-200-F'!$B$36=\"\",\"\",'Tex-200-F'!$B$36)","v":""}]
[29,{"$f":"IF('Tex-200-F'!$D$37=\"\",\"\",'Tex-200-F'!$D$37)","v":""},{"$f":"IF('Tex-200-F'!$B$24=\"\",\"\",'Tex-200-F'!$B$24)","v":"Tex-200-F: Part I"},{"$f":"IF('Tex-200-F'!$D$29=\"\",\"\",'Tex-200-F'!$D$29)","v":"Cumulative Weight Retained (g)"},{"$f":"IF('Tex-200-F'!$B$29=\"\",\"\",'Tex-200-F'!$B$29)","v":"Sieve Size"},{"$f":"IF('Tex-200-F'!$B$37=\"\",\"\",'Tex-200-F'!$B$37)","v":""}]
[30,{"$f":"IF('Tex-200-F'!$D$38=\"\",\"\",'Tex-200-F'!$D$38)","v":""},{"$f":"IF('Tex-200-F'!$B$24=\"\",\"\",'Tex-200-F'!$B$24)","v":"Tex-200-F: Part I"},{"$f":"IF('Tex-200-F'!$D$29=\"\",\"\",'Tex-200-F'!$D$29)","v":"Cumulative Weight Retained (g)"},{"$f":"IF('Tex-200-F'!$B$29=\"\",\"\",'Tex-200-F'!$B$29)","v":"Sieve Size"},{"$f":"IF('Tex-200-F'!$B$38=\"\",\"\",'Tex-200-F'!$B$38)","v":""}]
[31,{"$f":"IF('Tex-200-F'!$D$42=\"\",\"\",'Tex-200-F'!$D$42)","v":""},{"$f":"IF('Tex-200-F'!$B$24=\"\",\"\",'Tex-200-F'!$B$24)","v":"Tex-200-F: Part I"},{"$f":"IF('Tex-200-F'!$D$29=\"\",\"\",'Tex-200-F'!$D$29)","v":"Cumulative Weight Retained (g)"},{"$f":"IF('Tex-200-F'!$B$29=\"\",\"\",'Tex-200-F'!$B$29)","v":"Sieve Size"},{"$f":"IF('Tex-200-F'!$B$42=\"\",\"\",'Tex-200-F'!$B$42)","v":"Total "}]
[32,{"$f":"IF('Tex-200-F'!$E$31=\"\",\"\",'Tex-200-F'!$E$31)","v":""},{"$f":"IF('Tex-200-F'!$B$24=\"\",\"\",'Tex-200-F'!$B$24)","v":"Tex-200-F: Part I"},{"$f":"IF('Tex-200-F'!$E$29=\"\",\"\",'Tex-200-F'!$E$29)","v":"Individual Percent Retained"},{"$f":"IF('Tex-200-F'!$B$29=\"\",\"\",'Tex-200-F'!$B$29)","v":"Sieve Size"},{"$f":"IF('Tex-200-F'!$B$31=\"\",\"\",'Tex-200-F'!$B$31)","v":""}]
[33,{"$f":"IF('Tex-200-F'!$E$32=\"\",\"\",'Tex-200-F'!$E$32)","v":""},{"$f":"IF('Tex-200-F'!$B$24=\"\",\"\",'Tex-200-F'!$B$24)","v":"Tex-200-F: Part I"},{"$f":"IF('Tex-200-F'!$E$29=\"\",\"\",'Tex-200-F'!$E$29)","v":"Individual Percent Retained"},{"$f":"IF('Tex-200-F'!$B$29=\"\",\"\",'Tex-200-F'!$B$29)","v":"Sieve Size"},{"$f":"IF('Tex-200-F'!$B$32=\"\",\"\",'Tex-200-F'!$B$32)","v":""}]
[34,{"$f":"IF('Tex-200-F'!$E$33=\"\",\"\",'Tex-200-F'!$E$33)","v":""},{"$f":"IF('Tex-200-F'!$B$24=\"\",\"\",'Tex-200-F'!$B$24)","v":"Tex-200-F: Part I"},{"$f":"IF('Tex-200-F'!$E$29=\"\",\"\",'Tex-200-F'!$E$29)","v":"Individual Percent Retained"},{"$f":"IF('Tex-200-F'!$B$29=\"\",\"\",'Tex-200-F'!$B$29)","v":"Sieve Size"},{"$f":"IF('Tex-200-F'!$B$33=\"\",\"\",'Tex-200-F'!$B$33)","v":""}]
[35,{"$f":"IF('Tex-200-F'!$E$34=\"\",\"\",'Tex-200-F'!$E$34)","v":""},{"$f":"IF('Tex-200-F'!$B$24=\"\",\"\",'Tex-200-F'!$B$24)","v":"Tex-200-F: Part I"},{"$f":"IF('Tex-200-F'!$E$29=\"\",\"\",'Tex-200-F'!$E$29)","v":"Individual Percent Retained"},{"$f":"IF('Tex-200-F'!$B$29=\"\",\"\",'Tex-200-F'!$B$29)","v":"Sieve Size"},{"$f":"IF('Tex-200-F'!$B$34=\"\",\"\",'Tex-200-F'!$B$34)","v":""}]
[36,{"$f":"IF('Tex-200-F'!$E$35=\"\",\"\",'Tex-200-F'!$E$35)","v":""},{"$f":"IF('Tex-200-F'!$B$24=\"\",\"\",'Tex-200-F'!$B$24)","v":"Tex-200-F: Part I"},{"$f":"IF('Tex-200-F'!$E$29=\"\",\"\",'Tex-200-F'!$E$29)","v":"Individual Percent Retained"},{"$f":"IF('Tex-200-F'!$B$29=\"\",\"\",'Tex-200-F'!$B$29)","v":"Sieve Size"},{"$f":"IF('Tex-200-F'!$B$35=\"\",\"\",'Tex-200-F'!$B$35)","v":""}]
[37,{"$f":"IF('Tex-200-F'!$E$36=\"\",\"\",'Tex-200-F'!$E$36)","v":""},{"$f":"IF('Tex-200-F'!$B$24=\"\",\"\",'Tex-200-F'!$B$24)","v":"Tex-200-F: Part I"},{"$f":"IF('Tex-200-F'!$E$29=\"\",\"\",'Tex-200-F'!$E$29)","v":"Individual Percent Retained"},{"$f":"IF('Tex-200-F'!$B$29=\"\",\"\",'Tex-200-F'!$B$29)","v":"Sieve Size"},{"$f":"IF('Tex-200-F'!$B$36=\"\",\"\",'Tex-200-F'!$B$36)","v":""}]
[38,{"$f":"IF('Tex-200-F'!$E$37=\"\",\"\",'Tex-200-F'!$E$37)","v":""},{"$f":"IF('Tex-200-F'!$B$24=\"\",\"\",'Tex-200-F'!$B$24)","v":"Tex-200-F: Part I"},{"$f":"IF('Tex-200-F'!$E$29=\"\",\"\",'Tex-200-F'!$E$29)","v":"Individual Percent Retained"},{"$f":"IF('Tex-200-F'!$B$29=\"\",\"\",'Tex-200-F'!$B$29)","v":"Sieve Size"},{"$f":"IF('Tex-200-F'!$B$37=\"\",\"\",'Tex-200-F'!$B$37)","v":""}]
[39,{"$f":"IF('Tex-200-F'!$E$38=\"\",\"\",'Tex-200-F'!$E$38)","v":""},{"$f":"IF('Tex-200-F'!$B$24=\"\",\"\",'Tex-200-F'!$B$24)","v":"Tex-200-F: Part I"},{"$f":"IF('Tex-200-F'!$E$29=\"\",\"\",'Tex-200-F'!$E$29)","v":"Individual Percent Retained"},{"$f":"IF('Tex-200-F'!$B$29=\"\",\"\",'Tex-200-F'!$B$29)","v":"Sieve Size"},{"$f":"IF('Tex-200-F'!$B$38=\"\",\"\",'Tex-200-F'!$B$38)","v":""}]
[40,{"$f":"IF('Tex-200-F'!$E$42=\"\",\"\",'Tex-200-F'!$E$42)","v":""},{"$f":"IF('Tex-200-F'!$B$24=\"\",\"\",'Tex-200-F'!$B$24)","v":"Tex-200-F: Part I"},{"$f":"IF('Tex-200-F'!$E$29=\"\",\"\",'Tex-200-F'!$E$29)","v":"Individual Percent Retained"},{"$f":"IF('Tex-200-F'!$B$29=\"\",\"\",'Tex-200-F'!$B$29)","v":"Sieve Size"},{"$f":"IF('Tex-200-F'!$B$42=\"\",\"\",'Tex-200-F'!$B$42)","v":"Total "}]
[41,{"$f":"IF('Tex-200-F'!$F$31=\"\",\"\",'Tex-200-F'!$F$31)","v":""},{"$f":"IF('Tex-200-F'!$B$24=\"\",\"\",'Tex-200-F'!$B$24)","v":"Tex-200-F: Part I"},{"$f":"IF('Tex-200-F'!$F$29=\"\",\"\",'Tex-200-F'!$F$29)","v":"Cumulative Percent Retained"},{"$f":"IF('Tex-200-F'!$B$29=\"\",\"\",'Tex-200-F'!$B$29)","v":"Sieve Size"},{"$f":"IF('Tex-200-F'!$B$31=\"\",\"\",'Tex-200-F'!$B$31)","v":""}]
[42,{"$f":"IF('Tex-200-F'!$F$32=\"\",\"\",'Tex-200-F'!$F$32)","v":""},{"$f":"IF('Tex-200-F'!$B$24=\"\",\"\",'Tex-200-F'!$B$24)","v":"Tex-200-F: Part I"},{"$f":"IF('Tex-200-F'!$F$29=\"\",\"\",'Tex-200-F'!$F$29)","v":"Cumulative Percent Retained"},{"$f":"IF('Tex-200-F'!$B$29=\"\",\"\",'Tex-200-F'!$B$29)","v":"Sieve Size"},{"$f":"IF('Tex-200-F'!$B$32=\"\",\"\",'Tex-200-F'!$B$32)","v":""}]
[43,{"$f":"IF('Tex-200-F'!$F$33=\"\",\"\",'Tex-200-F'!$F$33)","v":""},{"$f":"IF('Tex-200-F'!$B$24=\"\",\"\",'Tex-200-F'!$B$24)","v":"Tex-200-F: Part I"},{"$f":"IF('Tex-200-F'!$F$29=\"\",\"\",'Tex-200-F'!$F$29)","v":"Cumulative Percent Retained"},{"$f":"IF('Tex-200-F'!$B$29=\"\",\"\",'Tex-200-F'!$B$29)","v":"Sieve Size"},{"$f":"IF('Tex-200-F'!$B$33=\"\",\"\",'Tex-200-F'!$B$33)","v":""}]
[44,{"$f":"IF('Tex-200-F'!$F$34=\"\",\"\",'Tex-200-F'!$F$34)","v":""},{"$f":"IF('Tex-200-F'!$B$24=\"\",\"\",'Tex-200-F'!$B$24)","v":"Tex-200-F: Part I"},{"$f":"IF('Tex-200-F'!$F$29=\"\",\"\",'Tex-200-F'!$F$29)","v":"Cumulative Percent Retained"},{"$f":"IF('Tex-200-F'!$B$29=\"\",\"\",'Tex-200-F'!$B$29)","v":"Sieve Size"},{"$f":"IF('Tex-200-F'!$B$34=\"\",\"\",'Tex-200-F'!$B$34)","v":""}]
[45,{"$f":"IF('Tex-200-F'!$F$35=\"\",\"\",'Tex-200-F'!$F$35)","v":""},{"$f":"IF('Tex-200-F'!$B$24=\"\",\"\",'Tex-200-F'!$B$24)","v":"Tex-200-F: Part I"},{"$f":"IF('Tex-200-F'!$F$29=\"\",\"\",'Tex-200-F'!$F$29)","v":"Cumulative Percent Retained"},{"$f":"IF('Tex-200-F'!$B$29=\"\",\"\",'Tex-200-F'!$B$29)","v":"Sieve Size"},{"$f":"IF('Tex-200-F'!$B$35=\"\",\"\",'Tex-200-F'!$B$35)","v":""}]
[46,{"$f":"IF('Tex-200-F'!$F$36=\"\",\"\",'Tex-200-F'!$F$36)","v":""},{"$f":"IF('Tex-200-F'!$B$24=\"\",\"\",'Tex-200-F'!$B$24)","v":"Tex-200-F: Part I"},{"$f":"IF('Tex-200-F'!$F$29=\"\",\"\",'Tex-200-F'!$F$29)","v":"Cumulative Percent Retained"},{"$f":"IF('Tex-200-F'!$B$29=\"\",\"\",'Tex-200-F'!$B$29)","v":"Sieve Size"},{"$f":"IF('Tex-200-F'!$B$36=\"\",\"\",'Tex-200-F'!$B$36)","v":""}]
[47,{"$f":"IF('Tex-200-F'!$F$37=\"\",\"\",'Tex-200-F'!$F$37)","v":""},{"$f":"IF('Tex-200-F'!$B$24=\"\",\"\",'Tex-200-F'!$B$24)","v":"Tex-200-F: Part I"},{"$f":"IF('Tex-200-F'!$F$29=\"\",\"\",'Tex-200-F'!$F$29)","v":"Cumulative Percent Retained"},{"$f":"IF('Tex-200-F'!$B$29=\"\",\"\",'Tex-200-F'!$B$29)","v":"Sieve Size"},{"$f":"IF('Tex-200-F'!$B$37=\"\",\"\",'Tex-200-F'!$B$37)","v":""}]
[48,{"$f":"IF('Tex-200-F'!$F$38=\"\",\"\",'Tex-200-F'!$F$38)","v":""},{"$f":"IF('Tex-200-F'!$B$24=\"\",\"\",'Tex-200-F'!$B$24)","v":"Tex-200-F: Part I"},{"$f":"IF('Tex-200-F'!$F$29=\"\",\"\",'Tex-200-F'!$F$29)","v":"Cumulative Percent Retained"},{"$f":"IF('Tex-200-F'!$B$29=\"\",\"\",'Tex-200-F'!$B$29)","v":"Sieve Size"},{"$f":"IF('Tex-200-F'!$B$38=\"\",\"\",'Tex-200-F'!$B$38)","v":""}]
[49,{"$f":"IF('Tex-200-F'!$G$31=\"\",\"\",'Tex-200-F'!$G$31)","v":""},{"$f":"IF('Tex-200-F'!$B$24=\"\",\"\",'Tex-200-F'!$B$24)","v":"Tex-200-F: Part I"},{"$f":"IF('Tex-200-F'!$G$29=\"\",\"\",'Tex-200-F'!$G$29)","v":"Cumulative Percent Passing"},{"$f":"IF('Tex-200-F'!$B$29=\"\",\"\",'Tex-200-F'!$B$29)","v":"Sieve Size"},{"$f":"IF('Tex-200-F'!$B$31=\"\",\"\",'Tex-200-F'!$B$31)","v":""}]
[50,{"$f":"IF('Tex-200-F'!$G$32=\"\",\"\",'Tex-200-F'!$G$32)","v":""},{"$f":"IF('Tex-200-F'!$B$24=\"\",\"\",'Tex-200-F'!$B$24)","v":"Tex-200-F: Part I"},{"$f":"IF('Tex-200-F'!$G$29=\"\",\"\",'Tex-200-F'!$G$29)","v":"Cumulative Percent Passing"},{"$f":"IF('Tex-200-F'!$B$29=\"\",\"\",'Tex-200-F'!$B$29)","v":"Sieve Size"},{"$f":"IF('Tex-200-F'!$B$32=\"\",\"\",'Tex-200-F'!$B$32)","v":""}]
[51,{"$f":"IF('Tex-200-F'!$G$33=\"\",\"\",'Tex-200-F'!$G$33)","v":""},{"$f":"IF('Tex-200-F'!$B$24=\"\",\"\",'Tex-200-F'!$B$24)","v":"Tex-200-F: Part I"},{"$f":"IF('Tex-200-F'!$G$29=\"\",\"\",'Tex-200-F'!$G$29)","v":"Cumulative Percent Passing"},{"$f":"IF('Tex-200-F'!$B$29=\"\",\"\",'Tex-200-F'!$B$29)","v":"Sieve Size"},{"$f":"IF('Tex-200-F'!$B$33=\"\",\"\",'Tex-200-F'!$B$33)","v":""}]
[52,{"$f":"IF('Tex-200-F'!$G$34=\"\",\"\",'Tex-200-F'!$G$34)","v":""},{"$f":"IF('Tex-200-F'!$B$24=\"\",\"\",'Tex-200-F'!$B$24)","v":"Tex-200-F: Part I"},{"$f":"IF('Tex-200-F'!$G$29=\"\",\"\",'Tex-200-F'!$G$29)","v":"Cumulative Percent Passing"},{"$f":"IF('Tex-200-F'!$B$29=\"\",\"\",'Tex-200-F'!$B$29)","v":"Sieve Size"},{"$f":"IF('Tex-200-F'!$B$34=\"\",\"\",'Tex-200-F'!$B$34)","v":""}]
[53,{"$f":"IF('Tex-200-F'!$G$35=\"\",\"\",'Tex-200-F'!$G$35)","v":""},{"$f":"IF('Tex-200-F'!$B$24=\"\",\"\",'Tex-200-F'!$B$24)","v":"Tex-200-F: Part I"},{"$f":"IF('Tex-200-F'!$G$29=\"\",\"\",'Tex-200-F'!$G$29)","v":"Cumulative Percent Passing"},{"$f":"IF('Tex-200-F'!$B$29=\"\",\"\",'Tex-200-F'!$B$29)","v":"Sieve Size"},{"$f":"IF('Tex-200-F'!$B$35=\"\",\"\",'Tex-200-F'!$B$35)","v":""}]
[54,{"$f":"IF('Tex-200-F'!$G$36=\"\",\"\",'Tex-200-F'!$G$36)","v":""},{"$f":"IF('Tex-200-F'!$B$24=\"\",\"\",'Tex-200-F'!$B$24)","v":"Tex-200-F: Part I"},{"$f":"IF('Tex-200-F'!$G$29=\"\",\"\",'Tex-200-F'!$G$29)","v":"Cumulative Percent Passing"},{"$f":"IF('Tex-200-F'!$B$29=\"\",\"\",'Tex-200-F'!$B$29)","v":"Sieve Size"},{"$f":"IF('Tex-200-F'!$B$36=\"\",\"\",'Tex-200-F'!$B$36)","v":""}]
[55,{"$f":"IF('Tex-200-F'!$G$37=\"\",\"\",'Tex-200-F'!$G$37)","v":""},{"$f":"IF('Tex-200-F'!$B$24=\"\",\"\",'Tex-200-F'!$B$24)","v":"Tex-200-F: Part I"},{"$f":"IF('Tex-200-F'!$G$29=\"\",\"\",'Tex-200-F'!$G$29)","v":"Cumulative Percent Passing"},{"$f":"IF('Tex-200-F'!$B$29=\"\",\"\",'Tex-200-F'!$B$29)","v":"Sieve Size"},{"$f":"IF('Tex-200-F'!$B$37=\"\",\"\",'Tex-200-F'!$B$37)","v":""}]
[56,{"$f":"IF('Tex-200-F'!$G$38=\"\",\"\",'Tex-200-F'!$G$38)","v":""},{"$f":"IF('Tex-200-F'!$B$24=\"\",\"\",'Tex-200-F'!$B$24)","v":"Tex-200-F: Part I"},{"$f":"IF('Tex-200-F'!$G$29=\"\",\"\",'Tex-200-F'!$G$29)","v":"Cumulative Percent Passing"},{"$f":"IF('Tex-200-F'!$B$29=\"\",\"\",'Tex-200-F'!$B$29)","v":"Sieve Size"},{"$f":"IF('Tex-200-F'!$B$38=\"\",\"\",'Tex-200-F'!$B$38)","v":""}]
[57,{"$f":"IF('Tex-200-F'!$H$31=\"\",\"\",'Tex-200-F'!$H$31)","v":""},{"$f":"IF('Tex-200-F'!$B$24=\"\",\"\",'Tex-200-F'!$B$24)","v":"Tex-200-F: Part I"},{"$f":"IF('Tex-200-F'!$H$29=\"\",\"\",'Tex-200-F'!$H$29)","v":"Lower & Upper Retained Limit (%)"},{"$f":"IF('Tex-200-F'!$B$29=\"\",\"\",'Tex-200-F'!$B$29)","v":"Sieve Size"},{"$f":"IF('Tex-200-F'!$B$31=\"\",\"\",'Tex-200-F'!$B$31)","v":""}]
[58,{"$f":"IF('Tex-200-F'!$H$32=\"\",\"\",'Tex-200-F'!$H$32)","v":""},{"$f":"IF('Tex-200-F'!$B$24=\"\",\"\",'Tex-200-F'!$B$24)","v":"Tex-200-F: Part I"},{"$f":"IF('Tex-200-F'!$H$29=\"\",\"\",'Tex-200-F'!$H$29)","v":"Lower & Upper Retained Limit (%)"},{"$f":"IF('Tex-200-F'!$B$29=\"\",\"\",'Tex-200-F'!$B$29)","v":"Sieve Size"},{"$f":"IF('Tex-200-F'!$B$32=\"\",\"\",'Tex-200-F'!$B$32)","v":""}]
[59,{"$f":"IF('Tex-200-F'!$H$33=\"\",\"\",'Tex-200-F'!$H$33)","v":""},{"$f":"IF('Tex-200-F'!$B$24=\"\",\"\",'Tex-200-F'!$B$24)","v":"Tex-200-F: Part I"},{"$f":"IF('Tex-200-F'!$H$29=\"\",\"\",'Tex-200-F'!$H$29)","v":"Lower & Upper Retained Limit (%)"},{"$f":"IF('Tex-200-F'!$B$29=\"\",\"\",'Tex-200-F'!$B$29)","v":"Sieve Size"},{"$f":"IF('Tex-200-F'!$B$33=\"\",\"\",'Tex-200-F'!$B$33)","v":""}]
[60,{"$f":"IF('Tex-200-F'!$H$34=\"\",\"\",'Tex-200-F'!$H$34)","v":""},{"$f":"IF('Tex-200-F'!$B$24=\"\",\"\",'Tex-200-F'!$B$24)","v":"Tex-200-F: Part I"},{"$f":"IF('Tex-200-F'!$H$29=\"\",\"\",'Tex-200-F'!$H$29)","v":"Lower & Upper Retained Limit (%)"},{"$f":"IF('Tex-200-F'!$B$29=\"\",\"\",'Tex-200-F'!$B$29)","v":"Sieve Size"},{"$f":"IF('Tex-200-F'!$B$34=\"\",\"\",'Tex-200-F'!$B$34)","v":""}]
[61,{"$f":"IF('Tex-200-F'!$H$35=\"\",\"\",'Tex-200-F'!$H$35)","v":""},{"$f":"IF('Tex-200-F'!$B$24=\"\",\"\",'Tex-200-F'!$B$24)","v":"Tex-200-F: Part I"},{"$f":"IF('Tex-200-F'!$H$29=\"\",\"\",'Tex-200-F'!$H$29)","v":"Lower & Upper Retained Limit (%)"},{"$f":"IF('Tex-200-F'!$B$29=\"\",\"\",'Tex-200-F'!$B$29)","v":"Sieve Size"},{"$f":"IF('Tex-200-F'!$B$35=\"\",\"\",'Tex-200-F'!$B$35)","v":""}]
[62,{"$f":"IF('Tex-200-F'!$H$36=\"\",\"\",'Tex-200-F'!$H$36)","v":""},{"$f":"IF('Tex-200-F'!$B$24=\"\",\"\",'Tex-200-F'!$B$24)","v":"Tex-200-F: Part I"},{"$f":"IF('Tex-200-F'!$H$29=\"\",\"\",'Tex-200-F'!$H$29)","v":"Lower & Upper Retained Limit (%)"},{"$f":"IF('Tex-200-F'!$B$29=\"\",\"\",'Tex-200-F'!$B$29)","v":"Sieve Size"},{"$f":"IF('Tex-200-F'!$B$36=\"\",\"\",'Tex-200-F'!$B$36)","v":""}]
[63,{"$f":"IF('Tex-200-F'!$H$37=\"\",\"\",'Tex-200-F'!$H$37)","v":""},{"$f":"IF('Tex-200-F'!$B$24=\"\",\"\",'Tex-200-F'!$B$24)","v":"Tex-200-F: Part I"},{"$f":"IF('Tex-200-F'!$H$29=\"\",\"\",'Tex-200-F'!$H$29)","v":"Lower & Upper Retained Limit (%)"},{"$f":"IF('Tex-200-F'!$B$29=\"\",\"\",'Tex-200-F'!$B$29)","v":"Sieve Size"},{"$f":"IF('Tex-200-F'!$B$37=\"\",\"\",'Tex-200-F'!$B$37)","v":""}]
[64,{"$f":"IF('Tex-200-F'!$H$38=\"\",\"\",'Tex-200-F'!$H$38)","v":""},{"$f":"IF('Tex-200-F'!$B$24=\"\",\"\",'Tex-200-F'!$B$24)","v":"Tex-200-F: Part I"},{"$f":"IF('Tex-200-F'!$H$29=\"\",\"\",'Tex-200-F'!$H$29)","v":"Lower & Upper Retained Limit (%)"},{"$f":"IF('Tex-200-F'!$B$29=\"\",\"\",'Tex-200-F'!$B$29)","v":"Sieve Size"},{"$f":"IF('Tex-200-F'!$B$38=\"\",\"\",'Tex-200-F'!$B$38)","v":""}]
[65,{"$f":"IF('Tex-200-F'!$I$31=\"\",\"\",'Tex-200-F'!$I$31)","v":""},{"$f":"IF('Tex-200-F'!$B$24=\"\",\"\",'Tex-200-F'!$B$24)","v":"Tex-200-F: Part I"},{"$f":"IF('Tex-200-F'!$I$29=\"\",\"\",'Tex-200-F'!$I$29)","v":"Within Master Grading"},{"$f":"IF('Tex-200-F'!$B$29=\"\",\"\",'Tex-200-F'!$B$29)","v":"Sieve Size"},{"$f":"IF('Tex-200-F'!$B$31=\"\",\"\",'Tex-200-F'!$B$31)","v":""}]
[66,{"$f":"IF('Tex-200-F'!$I$32=\"\",\"\",'Tex-200-F'!$I$32)","v":""},{"$f":"IF('Tex-200-F'!$B$24=\"\",\"\",'Tex-200-F'!$B$24)","v":"Tex-200-F: Part I"},{"$f":"IF('Tex-200-F'!$I$29=\"\",\"\",'Tex-200-F'!$I$29)","v":"Within Master Grading"},{"$f":"IF('Tex-200-F'!$B$29=\"\",\"\",'Tex-200-F'!$B$29)","v":"Sieve Size"},{"$f":"IF('Tex-200-F'!$B$32=\"\",\"\",'Tex-200-F'!$B$32)","v":""}]
[67,{"$f":"IF('Tex-200-F'!$I$33=\"\",\"\",'Tex-200-F'!$I$33)","v":""},{"$f":"IF('Tex-200-F'!$B$24=\"\",\"\",'Tex-200-F'!$B$24)","v":"Tex-200-F: Part I"},{"$f":"IF('Tex-200-F'!$I$29=\"\",\"\",'Tex-200-F'!$I$29)","v":"Within Master Grading"},{"$f":"IF('Tex-200-F'!$B$29=\"\",\"\",'Tex-200-F'!$B$29)","v":"Sieve Size"},{"$f":"IF('Tex-200-F'!$B$33=\"\",\"\",'Tex-200-F'!$B$33)","v":""}]
[68,{"$f":"IF('Tex-200-F'!$I$34=\"\",\"\",'Tex-200-F'!$I$34)","v":""},{"$f":"IF('Tex-200-F'!$B$24=\"\",\"\",'Tex-200-F'!$B$24)","v":"Tex-200-F: Part I"},{"$f":"IF('Tex-200-F'!$I$29=\"\",\"\",'Tex-200-F'!$I$29)","v":"Within Master Grading"},{"$f":"IF('Tex-200-F'!$B$29=\"\",\"\",'Tex-200-F'!$B$29)","v":"Sieve Size"},{"$f":"IF('Tex-200-F'!$B$34=\"\",\"\",'Tex-200-F'!$B$34)","v":""}]
[69,{"$f":"IF('Tex-200-F'!$I$35=\"\",\"\",'Tex-200-F'!$I$35)","v":""},{"$f":"IF('Tex-200-F'!$B$24=\"\",\"\",'Tex-200-F'!$B$24)","v":"Tex-200-F: Part I"},{"$f":"IF('Tex-200-F'!$I$29=\"\",\"\",'Tex-200-F'!$I$29)","v":"Within Master Grading"},{"$f":"IF('Tex-200-F'!$B$29=\"\",\"\",'Tex-200-F'!$B$29)","v":"Sieve Size"},{"$f":"IF('Tex-200-F'!$B$35=\"\",\"\",'Tex-200-F'!$B$35)","v":""}]
[70,{"$f":"IF('Tex-200-F'!$I$36=\"\",\"\",'Tex-200-F'!$I$36)","v":""},{"$f":"IF('Tex-200-F'!$B$24=\"\",\"\",'Tex-200-F'!$B$24)","v":"Tex-200-F: Part I"},{"$f":"IF('Tex-200-F'!$I$29=\"\",\"\",'Tex-200-F'!$I$29)","v":"Within Master Grading"},{"$f":"IF('Tex-200-F'!$B$29=\"\",\"\",'Tex-200-F'!$B$29)","v":"Sieve Size"},{"$f":"IF('Tex-200-F'!$B$36=\"\",\"\",'Tex-200-F'!$B$36)","v":""}]
[71,{"$f":"IF('Tex-200-F'!$I$37=\"\",\"\",'Tex-200-F'!$I$37)","v":""},{"$f":"IF('Tex-200-F'!$B$24=\"\",\"\",'Tex-200-F'!$B$24)","v":"Tex-200-F: Part I"},{"$f":"IF('Tex-200-F'!$I$29=\"\",\"\",'Tex-200-F'!$I$29)","v":"Within Master Grading"},{"$f":"IF('Tex-200-F'!$B$29=\"\",\"\",'Tex-200-F'!$B$29)","v":"Sieve Size"},{"$f":"IF('Tex-200-F'!$B$37=\"\",\"\",'Tex-200-F'!$B$37)","v":""}]
[72,{"$f":"IF('Tex-200-F'!$I$38=\"\",\"\",'Tex-200-F'!$I$38)","v":""},{"$f":"IF('Tex-200-F'!$B$24=\"\",\"\",'Tex-200-F'!$B$24)","v":"Tex-200-F: Part I"},{"$f":"IF('Tex-200-F'!$I$29=\"\",\"\",'Tex-200-F'!$I$29)","v":"Within Master Grading"},{"$f":"IF('Tex-200-F'!$B$29=\"\",\"\",'Tex-200-F'!$B$29)","v":"Sieve Size"},{"$f":"IF('Tex-200-F'!$B$38=\"\",\"\",'Tex-200-F'!$B$38)","v":""}]
[73,{"$f":"IF('Tex-200-F'!$I$26=\"\",\"\",'Tex-200-F'!$I$26)","v":""},{"$f":"IF('Tex-200-F'!$B$24=\"\",\"\",'Tex-200-F'!$B$24)","v":"Tex-200-F: Part I"},{"$f":"IF('Tex-200-F'!$G$26=\"\",\"\",'Tex-200-F'!$G$26)","v":"Round test results to the nearest whole number?"}]
[74,{"$f":"IF('Tex-200-F'!$C$58=\"\",\"\",'Tex-200-F'!$C$58)","v":""},"Tested By ",{"$f":"IF('Tex-200-F'!$B$58=\"\",\"\",'Tex-200-F'!$B$58)","v":"TX200PI"}]
[75,{"$f":"IF('Tex-200-F'!$F$58=\"\",\"\",'Tex-200-F'!$F$58)","v":""},"Tested Date ",{"$f":"IF('Tex-200-F'!$B$58=\"\",\"\",'Tex-200-F'!$B$58)","v":"TX200PI"}]
[76,{"$f":"IF('Tex-200-F'!$C$52=\"\",\"\",'Tex-200-F'!$C$52)","v":""},"Sampled By ",{"$f":"IF('Tex-200-F'!$B$52=\"\",\"\",'Tex-200-F'!$B$52)","v":"TX221"}]
[77,{"$f":"IF('Tex-200-F'!$F$52=\"\",\"\",'Tex-200-F'!$F$52)","v":""},"Sampled Date ",{"$f":"IF('Tex-200-F'!$B$52=\"\",\"\",'Tex-200-F'!$B$52)","v":"TX221"}]
[78,{"$f":"IF('Tex-200-F'!$C$54=\"\",\"\",'Tex-200-F'!$C$54)","v":""},"Sampled By ",{"$f":"IF('Tex-200-F'!$B$54=\"\",\"\",'Tex-200-F'!$B$54)","v":"TX400"}]
[79,{"$f":"IF('Tex-200-F'!$F$54=\"\",\"\",'Tex-200-F'!$F$54)","v":""},"Sampled Date ",{"$f":"IF('Tex-200-F'!$B$54=\"\",\"\",'Tex-200-F'!$B$54)","v":"TX400"}]

{"sheet":"spcyr","index":4,"n_rows":18,"n_cols":4,"rows_kept":18,"cut":false,"hidden":true,"merged":[]}
["spec1993","spec1995","spec2004/2014","spec2024"]
["1","1","1","1"]
["2","2","2","2"]
["2_Micro","2_Micro","3S2","3S"]
["3","3","3NLW","3NLW"]
["3LW","3LW","3LW","3LW"]
["3_Mod","3_Mod","4S2","4S"]
["3_Mod_Uval","3_Mod_Uval","4","4"]
["4","4","5S2","5S"]
["4LW","4LW","5","5"]
["4_Mod_Uval","4_Mod_Uval","Shown_On_Plans","Shown_On_Plans"]
["5","5"]
["5LW","5LW"]
["5_Mod","5_Mod"]
["6_ASTM","6_ASTM"]
["7_ASTM","7_ASTM"]
["Type_D","Type_D"]
["Shown_On_Plans","Shown_On_Plans"]