{"text_format":"1","workbook":"xlsx","n_sheets":4,"sheets":["Tex-201","RX","Std Spec Gradations","spcyr"],"not_rendered":{"charts":0,"images":1,"macros":1,"external_links":0,"defined_names":164,"comments":1,"pivot_tables":0},"unopened":[],"bounds":{"document_bytes":16777216,"sheet_cells":100000,"rows_first":2000,"rows_last":500,"rows_between":2000,"halvings":0,"cell_chars":16384,"cell_head_chars":4096},"cells_cut":0,"cells_raw":0,"read":"whole","date_system":"1900"}

{"sheet":"Tex-201","index":0,"n_rows":56,"n_cols":33,"rows_kept":56,"cut":false,"hidden":false,"merged":[[22,9,22,11],[22,16,22,17],[22,22,22,23],[26,22,26,23],[26,24,26,25],[26,26,26,27],[26,12,26,13],[27,12,27,13],[26,1,26,11],[27,1,27,11],[22,4,22,6],[24,26,24,27],[24,1,24,11],[22,1,22,3],[22,12,22,13],[22,14,22,15],[26,20,26,21],[23,14,23,15],[23,26,23,27],[23,24,23,25],[23,16,23,17],[23,18,23,19],[26,28,26,29],[27,24,27,25],[26,14,26,15],[26,16,26,17],[26,18,26,19],[27,16,27,17],[32,14,32,15],[29,16,29,17],[29,18,29,19],[29,20,29,21],[29,22,29,23],[29,24,29,25],[30,26,30,27],[29,26,29,27],[30,24,30,25],[32,28,32,29],[31,28,31,29],[32,18,32,19],[32,20,32,21],[30,14,30,15],[30,22,30,23],[31,26,31,27],[30,28,30,29],[30,16,30,17],[27,28,27,29],[28,14,28,15],[28,18,28,19],[28,20,28,21],[28,22,28,23],[28,24,28,25],[28,26,28,27],[28,28,28,29],[27,18,27,19],[27,26,27,27],[27,20,27,21],[27,22,27,23],[28,16,28,17],[27,14,27,15],[52,15,52,17],[33,14,33,15],[33,12,33,13],[50,15,50,17],[30,12,30,13],[31,12,31,13],[32,12,32,13],[43,1,43,28],[52,12,52,14],[52,1,52,11],[45,1,45,3],[30,18,30,19],[30,20,30,21],[31,14,31,15],[32,22,32,23],[32,24,32,25],[31,22,31,23],[31,24,31,25],[32,26,32,27],[28,1,28,11],[33,22,33,23],[33,24,33,25],[33,26,33,27],[33,28,33,29],[33,16,33,17],[33,18,33,19],[33,20,33,21],[31,18,31,19],[31,20,31,21],[31,16,31,17],[29,28,29,29],[33,1,33,11],[29,1,29,11],[30,1,30,11],[31,1,31,11],[32,1,32,11],[28,12,28,13],[29,12,29,13],[29,14,29,15],[32,16,32,17],[56,1,56,11],[56,12,56,14],[35,12,35,14],[37,12,37,14],[50,1,50,3],[50,4,50,14],[49,4,49,14],[35,1,35,11],[54,1,54,3],[54,4,54,6],[40,1,41,28],[37,1,37,11],[52,18,52,28],[42,1,42,28],[54,7,54,9],[54,10,54,12],[45,4,45,14],[46,1,46,3],[45,15,45,17],[46,4,46,14],[46,15,46,17],[48,1,48,3],[48,4,48,14],[48,15,48,17],[18,15,18,18],[9,22,9,28],[15,8,15,28],[13,22,13,28],[16,22,16,28],[16,8,16,14],[12,22,12,28],[11,22,11,28],[10,22,10,28],[12,8,12,14],[13,8,13,14],[18,8,18,10],[18,11,18,14],[18,23,18,28],[18,19,18,22],[14,8,14,28],[0,0,0,3],[9,8,9,14],[7,22,7,28],[0,9,0,10],[7,8,7,14],[8,8,8,14],[8,22,8,28],[0,6,0,8],[11,8,11,14],[10,8,10,14],[22,30,22,31],[24,30,24,31],[24,12,24,13],[24,14,24,15],[24,16,24,17],[24,18,24,19],[24,20,24,21],[24,22,24,23],[24,24,24,25],[22,24,22,25],[23,22,23,23],[23,20,23,21],[22,26,22,27],[22,28,22,29],[23,28,23,29],[22,18,22,19],[22,20,22,21],[24,28,24,29],[23,12,23,13]]}
["TxDOT Manuals >",null,null,null,null,null,"Tex-201-F"]
[null,"TEXAS DEPARTMENT OF TRANSPORTATION",null,null,null,null,null,null,null,null,null,null,null,null,null,null,null,null,null,null,null,null,null,null,null,null,null,null,null,null,85]
[null,null,null,null,null,null,null,null,null,null,null,null,null,null,null,null,null,null,null,null,null,null,null,null,null,null,null,null,null,null,3]
[null,null,null,null,null,null,null,null,null,null,null,null,null,null,null,null,null,null,null,null,null,null,null,null,null,null,null,null,null,null,"tx201.xlsm::45574.605752"]
[null,"Bulk Specific Gravity and Water Absorption of Aggregate"]
[null,"Tex-201-F"]
[null,null,null,null,null,null,null,null,null,null,null,null,null,null,null,null,null,null,null,null,null,null,null,null,null,null,null,null,{"$f":"\"File Version: \" & TEXT(MID(sn,SEARCH(\"::\",sn,1)+2,20),\"mm/dd/yy hh:mm:ss\")","v":"File Version: 10/09/24 14:32:17"}]
[null,null,null,null,null,null,null,"SAMPLE ID:",null,null,null,null,null,null,null,null,null,null,null,null,null,"SAMPLED DATE:"]
[null,null,null,null,null,null,null,"TEST NUMBER:",null,null,null,null,null,null,null,null,null,null,null,null,null,"LETTING DATE:"]
[null,null,null,null,null,null,null,"SAMPLE STATUS:",null,null,null,null,null,null,null,null,null,null,null,null,null,"CONTROLLING CSJ:"]
[null,null,null,null,null,null,null,"COUNTY:",null,null,null,null,null,null,null,null,null,null,null,null,null,"SPEC YEAR:"]
[null,null,null,null,null,null,null,"SAMPLED BY:",null,null,null,null,null,null,null,null,null,null,null,null,null,"SPEC ITEM:"]
[null,null,null,null,null,null,null,"SAMPLE LOCATION:",null,null,null,null,null,null,null,null,null,null,null,null,null,"SPECIAL PROVISION:"]
[null,null,null,null,null,null,null,"MATERIAL CODE:",null,null,null,null,null,null,null,null,null,null,null,null,null,"GRADE:","Select_Sieve"]
[null,null,null,null,null,null,null,"MATERIAL NAME:"]
[null,null,null,null,null,null,null,"PRODUCER:"]
[null,null,null,null,null,null,null,"AREA ENGINEER:",null,null,null,null,null,null,null,null,null,null,null,null,null,"PROJECT MANAGER:"]
[]
[null,null,null,null,null,null,null,"COURSE\\LIFT:",null,null,null,"STATION:",null,null,null,null,null,null,null,"DIST. FROM CL:"]
[]
[null,"Apparent & Bulk Specific Gravity and Water Absorption"]
[]
[null,"By Method:",null,null,"Pycnometer",null,null,null,null,"Sieve Size:",null,null,{"$f":"IF(ISERROR(INDEX(INDIRECT(Grade),1,IF(SpecYear = \"1995\",3,2))),\"\",INDEX(INDIRECT(Grade),1,IF(SpecYear = \"1995\",3,2)))","v":0},null,{"$f":"IF(ISERROR(INDEX(INDIRECT(Grade),2,IF(SpecYear = \"1995\",3,2))),\"\",INDEX(INDIRECT(Grade),2,IF(SpecYear = \"1995\",3,2)))","v":0},null,{"$f":"IF(ISERROR(INDEX(INDIRECT(Grade),3,IF(SpecYear = \"1995\",3,2))),\"\",INDEX(INDIRECT(Grade),3,IF(SpecYear = \"1995\",3,2)))","v":0},null,{"$f":"IF(ISERROR(INDEX(INDIRECT(Grade),4,IF(SpecYear = \"1995\",3,2))),\"\",INDEX(INDIRECT(Grade),4,IF(SpecYear = \"1995\",3,2)))","v":0},null,{"$f":"IF(ISERROR(INDEX(INDIRECT(Grade),5,IF(SpecYear = \"1995\",3,2))),\"\",INDEX(INDIRECT(Grade),5,IF(SpecYear = \"1995\",3,2)))","v":0},null,{"$f":"IF(ISERROR(INDEX(INDIRECT(Grade),6,IF(SpecYear = \"1995\",3,2))),\"\",INDEX(INDIRECT(Grade),6,IF(SpecYear = \"1995\",3,2)))","v":0},null,{"$f":"IF(ISERROR(INDEX(INDIRECT(Grade),7,IF(SpecYear = \"1995\",3,2))),\"\",INDEX(INDIRECT(Grade),7,IF(SpecYear = \"1995\",3,2)))","v":0},null,{"$f":"IF(ISERROR(INDEX(INDIRECT(Grade),8,IF(SpecYear = \"1995\",3,2))),\"\",INDEX(INDIRECT(Grade),8,IF(SpecYear = \"1995\",3,2)))","v":0},null,{"$f":"IF(ISERROR(INDEX(INDIRECT(Grade),9,IF(SpecYear = \"1995\",3,2))),\"\",INDEX(INDIRECT(Grade),9,IF(SpecYear = \"1995\",3,2)))","v":0},null,"TOTAL"]
[null,null,null,null,null,null,null,null,null,null,null,null,{"$f":"IF(ISERROR(INDEX(INDIRECT(Grade),1,4)),\"\",INDEX(INDIRECT(Grade),1,4))","v":0},null,{"$f":"IF(ISERROR(INDEX(INDIRECT(Grade),2,4)),\"\",INDEX(INDIRECT(Grade),2,4))","v":0},null,{"$f":"IF(ISERROR(INDEX(INDIRECT(Grade),3,4)),\"\",INDEX(INDIRECT(Grade),3,4))","v":0},null,{"$f":"IF(ISERROR(INDEX(INDIRECT(Grade),4,4)),\"\",INDEX(INDIRECT(Grade),4,4))","v":0},null,{"$f":"IF(ISERROR(INDEX(INDIRECT(Grade),5,4)),\"\",INDEX(INDIRECT(Grade),5,4))","v":0},null,{"$f":"IF(ISERROR(INDEX(INDIRECT(Grade),6,4)),\"\",INDEX(INDIRECT(Grade),6,4))","v":0},null,{"$f":"IF(ISERROR(INDEX(INDIRECT(Grade),7,4)),\"\",INDEX(INDIRECT(Grade),7,4))","v":0},null,{"$f":"IF(ISERROR(INDEX(INDIRECT(Grade),8,4)),\"\",INDEX(INDIRECT(Grade),8,4))","v":0},null,{"$f":"IF(ISERROR(INDEX(INDIRECT(Grade),9,4)),\"\",INDEX(INDIRECT(Grade),9,4))","v":0}]
[null,"Percent Retained, (%):",null,null,null,null,null,null,null,null,null,null,null,null,null,null,null,null,null,null,null,null,null,null,null,null,null,null,null,null,{"$f":"IF(SUM(M25:AD25)=0,\"\",SUM(M25:AD25))","v":""},null,{"$f":"IF(AND(SUM(M25:AD25)<>100,SUM(M25:AD25)<>0),\"<< Total  must = 100\",\"\")","v":""}]
[]
[null,"X = mass of SSD sample, (g):"]
[null,"X1 = the net oven-dry mass of the sample, (g):"]
[null,"Y = calibrated pycnometer filled with water, (g):"]
[null,"Z = pycnometer with SSD sample and water, (g):"]
{"$rows_left_out":27}
{"sheet":"RX","index":1,"n_rows":85,"n_cols":9,"rows_kept":85,"cut":false,"hidden":true,"merged":[]}
[83]
["Fld_nbr","Value","Desc_1","Desc_2","Desc_3","Desc_4","Desc_5","Desc_6","Desc_7"]
[1,{"$f":"IF('Tex-201'!$B$41=\"\",\"\",'Tex-201'!$B$41)","v":""},{"$f":"'Tex-201'!$B$40","v":"Remarks:"}]
[2,{"$f":"IF('Tex-201'!$I$19=\"\",\"\",'Tex-201'!$I$19)","v":""},{"$f":"IF('Tex-201'!$H$19=\"\",\"\",'Tex-201'!$H$19)","v":"COURSE\\LIFT:"}]
[3,{"$f":"IF('Tex-201'!$E$51=\"\",\"\",'Tex-201'!$E$51)","v":""},{"$f":"IF(\"Tested By \"=\"\",\"\",\"Tested By \")","v":"Tested By "},{"$f":"IF('Tex-201'!$B$51=\"\",\"\",'Tex-201'!$B$51)","v":"TX201"}]
[4,{"$f":"IF('Tex-201'!$P$51=\"\",\"\",'Tex-201'!$P$51)","v":""},{"$f":"IF(\"Tested Date \"=\"\",\"\",\"Tested Date \")","v":"Tested Date "},{"$f":"IF('Tex-201'!$B$51=\"\",\"\",'Tex-201'!$B$51)","v":"TX201"}]
[5,{"$f":"IF('Tex-201'!$M$25=\"\",\"\",'Tex-201'!$M$25)","v":""},{"$f":"IF('Tex-201'!$B$6=\"\",\"\",'Tex-201'!$B$6)","v":"Tex-201-F"},{"$f":"IF('Tex-201'!$B$25=\"\",\"\",'Tex-201'!$B$25)","v":"Percent Retained, (%):"},{"$f":"IF('Tex-201'!$J$23=\"\",\"\",'Tex-201'!$J$23)","v":"Sieve Size:"},{"$f":"IF('Tex-201'!$M$23=\"\",\"\",'Tex-201'!$M$23)","v":0}]
[6,{"$f":"IF('Tex-201'!$O$25=\"\",\"\",'Tex-201'!$O$25)","v":""},{"$f":"IF('Tex-201'!$B$6=\"\",\"\",'Tex-201'!$B$6)","v":"Tex-201-F"},{"$f":"IF('Tex-201'!$B$25=\"\",\"\",'Tex-201'!$B$25)","v":"Percent Retained, (%):"},{"$f":"IF('Tex-201'!$J$23=\"\",\"\",'Tex-201'!$J$23)","v":"Sieve Size:"},{"$f":"IF('Tex-201'!$O$23=\"\",\"\",'Tex-201'!$O$23)","v":0}]
[7,{"$f":"IF('Tex-201'!$Q$25=\"\",\"\",'Tex-201'!$Q$25)","v":""},{"$f":"IF('Tex-201'!$B$6=\"\",\"\",'Tex-201'!$B$6)","v":"Tex-201-F"},{"$f":"IF('Tex-201'!$B$25=\"\",\"\",'Tex-201'!$B$25)","v":"Percent Retained, (%):"},{"$f":"IF('Tex-201'!$J$23=\"\",\"\",'Tex-201'!$J$23)","v":"Sieve Size:"},{"$f":"IF('Tex-201'!$Q$23=\"\",\"\",'Tex-201'!$Q$23)","v":0}]
[8,{"$f":"IF('Tex-201'!$S$25=\"\",\"\",'Tex-201'!$S$25)","v":""},{"$f":"IF('Tex-201'!$B$6=\"\",\"\",'Tex-201'!$B$6)","v":"Tex-201-F"},{"$f":"IF('Tex-201'!$B$25=\"\",\"\",'Tex-201'!$B$25)","v":"Percent Retained, (%):"},{"$f":"IF('Tex-201'!$J$23=\"\",\"\",'Tex-201'!$J$23)","v":"Sieve Size:"},{"$f":"IF('Tex-201'!$S$23=\"\",\"\",'Tex-201'!$S$23)","v":0}]
[9,{"$f":"IF('Tex-201'!$U$25=\"\",\"\",'Tex-201'!$U$25)","v":""},{"$f":"IF('Tex-201'!$B$6=\"\",\"\",'Tex-201'!$B$6)","v":"Tex-201-F"},{"$f":"IF('Tex-201'!$B$25=\"\",\"\",'Tex-201'!$B$25)","v":"Percent Retained, (%):"},{"$f":"IF('Tex-201'!$J$23=\"\",\"\",'Tex-201'!$J$23)","v":"Sieve Size:"},{"$f":"IF('Tex-201'!$U$23=\"\",\"\",'Tex-201'!$U$23)","v":0}]
[10,{"$f":"IF('Tex-201'!$W$25=\"\",\"\",'Tex-201'!$W$25)","v":""},{"$f":"IF('Tex-201'!$B$6=\"\",\"\",'Tex-201'!$B$6)","v":"Tex-201-F"},{"$f":"IF('Tex-201'!$B$25=\"\",\"\",'Tex-201'!$B$25)","v":"Percent Retained, (%):"},{"$f":"IF('Tex-201'!$J$23=\"\",\"\",'Tex-201'!$J$23)","v":"Sieve Size:"},{"$f":"IF('Tex-201'!$W$23=\"\",\"\",'Tex-201'!$W$23)","v":0}]
[11,{"$f":"IF('Tex-201'!$Y$25=\"\",\"\",'Tex-201'!$Y$25)","v":""},{"$f":"IF('Tex-201'!$B$6=\"\",\"\",'Tex-201'!$B$6)","v":"Tex-201-F"},{"$f":"IF('Tex-201'!$B$25=\"\",\"\",'Tex-201'!$B$25)","v":"Percent Retained, (%):"},{"$f":"IF('Tex-201'!$J$23=\"\",\"\",'Tex-201'!$J$23)","v":"Sieve Size:"},{"$f":"IF('Tex-201'!$Y$23=\"\",\"\",'Tex-201'!$Y$23)","v":0}]
[12,{"$f":"IF('Tex-201'!$AA$25=\"\",\"\",'Tex-201'!$AA$25)","v":""},{"$f":"IF('Tex-201'!$B$6=\"\",\"\",'Tex-201'!$B$6)","v":"Tex-201-F"},{"$f":"IF('Tex-201'!$B$25=\"\",\"\",'Tex-201'!$B$25)","v":"Percent Retained, (%):"},{"$f":"IF('Tex-201'!$J$23=\"\",\"\",'Tex-201'!$J$23)","v":"Sieve Size:"},{"$f":"IF('Tex-201'!$AA$23=\"\",\"\",'Tex-201'!$AA$23)","v":0}]
[13,{"$f":"IF('Tex-201'!$AC$25=\"\",\"\",'Tex-201'!$AC$25)","v":""},{"$f":"IF('Tex-201'!$B$6=\"\",\"\",'Tex-201'!$B$6)","v":"Tex-201-F"},{"$f":"IF('Tex-201'!$B$25=\"\",\"\",'Tex-201'!$B$25)","v":"Percent Retained, (%):"},{"$f":"IF('Tex-201'!$J$23=\"\",\"\",'Tex-201'!$J$23)","v":"Sieve Size:"},{"$f":"IF('Tex-201'!$AC$23=\"\",\"\",'Tex-201'!$AC$23)","v":0}]
[14,{"$f":"IF('Tex-201'!$AE$25=\"\",\"\",'Tex-201'!$AE$25)","v":""},{"$f":"IF('Tex-201'!$B$6=\"\",\"\",'Tex-201'!$B$6)","v":"Tex-201-F"},{"$f":"IF('Tex-201'!$B$25=\"\",\"\",'Tex-201'!$B$25)","v":"Percent Retained, (%):"},{"$f":"IF('Tex-201'!$J$23=\"\",\"\",'Tex-201'!$J$23)","v":"Sieve Size:"},{"$f":"IF('Tex-201'!$AE$23=\"\",\"\",'Tex-201'!$AE$23)","v":"TOTAL"}]
[15,{"$f":"IF('Tex-201'!$M$27=\"\",\"\",'Tex-201'!$M$27)","v":""},{"$f":"IF('Tex-201'!$B$6=\"\",\"\",'Tex-201'!$B$6)","v":"Tex-201-F"},{"$f":"IF('Tex-201'!$B$27=\"\",\"\",'Tex-201'!$B$27)","v":"X = mass of SSD sample, (g):"},{"$f":"IF('Tex-201'!$J$23=\"\",\"\",'Tex-201'!$J$23)","v":"Sieve Size:"},{"$f":"IF('Tex-201'!$M$23=\"\",\"\",'Tex-201'!$M$23)","v":0}]
[16,{"$f":"IF('Tex-201'!$O$27=\"\",\"\",'Tex-201'!$O$27)","v":""},{"$f":"IF('Tex-201'!$B$6=\"\",\"\",'Tex-201'!$B$6)","v":"Tex-201-F"},{"$f":"IF('Tex-201'!$B$27=\"\",\"\",'Tex-201'!$B$27)","v":"X = mass of SSD sample, (g):"},{"$f":"IF('Tex-201'!$J$23=\"\",\"\",'Tex-201'!$J$23)","v":"Sieve Size:"},{"$f":"IF('Tex-201'!$O$23=\"\",\"\",'Tex-201'!$O$23)","v":0}]
[17,{"$f":"IF('Tex-201'!$Q$27=\"\",\"\",'Tex-201'!$Q$27)","v":""},{"$f":"IF('Tex-201'!$B$6=\"\",\"\",'Tex-201'!$B$6)","v":"Tex-201-F"},{"$f":"IF('Tex-201'!$B$27=\"\",\"\",'Tex-201'!$B$27)","v":"X = mass of SSD sample, (g):"},{"$f":"IF('Tex-201'!$J$23=\"\",\"\",'Tex-201'!$J$23)","v":"Sieve Size:"},{"$f":"IF('Tex-201'!$Q$23=\"\",\"\",'Tex-201'!$Q$23)","v":0}]
[18,{"$f":"IF('Tex-201'!$S$27=\"\",\"\",'Tex-201'!$S$27)","v":""},{"$f":"IF('Tex-201'!$B$6=\"\",\"\",'Tex-201'!$B$6)","v":"Tex-201-F"},{"$f":"IF('Tex-201'!$B$27=\"\",\"\",'Tex-201'!$B$27)","v":"X = mass of SSD sample, (g):"},{"$f":"IF('Tex-201'!$J$23=\"\",\"\",'Tex-201'!$J$23)","v":"Sieve Size:"},{"$f":"IF('Tex-201'!$S$23=\"\",\"\",'Tex-201'!$S$23)","v":0}]
[19,{"$f":"IF('Tex-201'!$U$27=\"\",\"\",'Tex-201'!$U$27)","v":""},{"$f":"IF('Tex-201'!$B$6=\"\",\"\",'Tex-201'!$B$6)","v":"Tex-201-F"},{"$f":"IF('Tex-201'!$B$27=\"\",\"\",'Tex-201'!$B$27)","v":"X = mass of SSD sample, (g):"},{"$f":"IF('Tex-201'!$J$23=\"\",\"\",'Tex-201'!$J$23)","v":"Sieve Size:"},{"$f":"IF('Tex-201'!$U$23=\"\",\"\",'Tex-201'!$U$23)","v":0}]
[20,{"$f":"IF('Tex-201'!$W$27=\"\",\"\",'Tex-201'!$W$27)","v":""},{"$f":"IF('Tex-201'!$B$6=\"\",\"\",'Tex-201'!$B$6)","v":"Tex-201-F"},{"$f":"IF('Tex-201'!$B$27=\"\",\"\",'Tex-201'!$B$27)","v":"X = mass of SSD sample, (g):"},{"$f":"IF('Tex-201'!$J$23=\"\",\"\",'Tex-201'!$J$23)","v":"Sieve Size:"},{"$f":"IF('Tex-201'!$W$23=\"\",\"\",'Tex-201'!$W$23)","v":0}]
[21,{"$f":"IF('Tex-201'!$Y$27=\"\",\"\",'Tex-201'!$Y$27)","v":""},{"$f":"IF('Tex-201'!$B$6=\"\",\"\",'Tex-201'!$B$6)","v":"Tex-201-F"},{"$f":"IF('Tex-201'!$B$27=\"\",\"\",'Tex-201'!$B$27)","v":"X = mass of SSD sample, (g):"},{"$f":"IF('Tex-201'!$J$23=\"\",\"\",'Tex-201'!$J$23)","v":"Sieve Size:"},{"$f":"IF('Tex-201'!$Y$23=\"\",\"\",'Tex-201'!$Y$23)","v":0}]
[22,{"$f":"IF('Tex-201'!$AA$27=\"\",\"\",'Tex-201'!$AA$27)","v":""},{"$f":"IF('Tex-201'!$B$6=\"\",\"\",'Tex-201'!$B$6)","v":"Tex-201-F"},{"$f":"IF('Tex-201'!$B$27=\"\",\"\",'Tex-201'!$B$27)","v":"X = mass of SSD sample, (g):"},{"$f":"IF('Tex-201'!$J$23=\"\",\"\",'Tex-201'!$J$23)","v":"Sieve Size:"},{"$f":"IF('Tex-201'!$AA$23=\"\",\"\",'Tex-201'!$AA$23)","v":0}]
[23,{"$f":"IF('Tex-201'!$AC$27=\"\",\"\",'Tex-201'!$AC$27)","v":""},{"$f":"IF('Tex-201'!$B$6=\"\",\"\",'Tex-201'!$B$6)","v":"Tex-201-F"},{"$f":"IF('Tex-201'!$B$27=\"\",\"\",'Tex-201'!$B$27)","v":"X = mass of SSD sample, (g):"},{"$f":"IF('Tex-201'!$J$23=\"\",\"\",'Tex-201'!$J$23)","v":"Sieve Size:"},{"$f":"IF('Tex-201'!$AC$23=\"\",\"\",'Tex-201'!$AC$23)","v":0}]
[24,{"$f":"IF('Tex-201'!$M$28=\"\",\"\",'Tex-201'!$M$28)","v":""},{"$f":"IF('Tex-201'!$B$6=\"\",\"\",'Tex-201'!$B$6)","v":"Tex-201-F"},{"$f":"IF('Tex-201'!$B$28=\"\",\"\",'Tex-201'!$B$28)","v":"X1 = the net oven-dry mass of the sample, (g):"},{"$f":"IF('Tex-201'!$J$23=\"\",\"\",'Tex-201'!$J$23)","v":"Sieve Size:"},{"$f":"IF('Tex-201'!$M$23=\"\",\"\",'Tex-201'!$M$23)","v":0}]
[25,{"$f":"IF('Tex-201'!$O$28=\"\",\"\",'Tex-201'!$O$28)","v":""},{"$f":"IF('Tex-201'!$B$6=\"\",\"\",'Tex-201'!$B$6)","v":"Tex-201-F"},{"$f":"IF('Tex-201'!$B$28=\"\",\"\",'Tex-201'!$B$28)","v":"X1 = the net oven-dry mass of the sample, (g):"},{"$f":"IF('Tex-201'!$J$23=\"\",\"\",'Tex-201'!$J$23)","v":"Sieve Size:"},{"$f":"IF('Tex-201'!$O$23=\"\",\"\",'Tex-201'!$O$23)","v":0}]
[26,{"$f":"IF('Tex-201'!$Q$28=\"\",\"\",'Tex-201'!$Q$28)","v":""},{"$f":"IF('Tex-201'!$B$6=\"\",\"\",'Tex-201'!$B$6)","v":"Tex-201-F"},{"$f":"IF('Tex-201'!$B$28=\"\",\"\",'Tex-201'!$B$28)","v":"X1 = the net oven-dry mass of the sample, (g):"},{"$f":"IF('Tex-201'!$J$23=\"\",\"\",'Tex-201'!$J$23)","v":"Sieve Size:"},{"$f":"IF('Tex-201'!$Q$23=\"\",\"\",'Tex-201'!$Q$23)","v":0}]
[27,{"$f":"IF('Tex-201'!$S$28=\"\",\"\",'Tex-201'!$S$28)","v":""},{"$f":"IF('Tex-201'!$B$6=\"\",\"\",'Tex-201'!$B$6)","v":"Tex-201-F"},{"$f":"IF('Tex-201'!$B$28=\"\",\"\",'Tex-201'!$B$28)","v":"X1 = the net oven-dry mass of the sample, (g):"},{"$f":"IF('Tex-201'!$J$23=\"\",\"\",'Tex-201'!$J$23)","v":"Sieve Size:"},{"$f":"IF('Tex-201'!$S$23=\"\",\"\",'Tex-201'!$S$23)","v":0}]
[28,{"$f":"IF('Tex-201'!$U$28=\"\",\"\",'Tex-201'!$U$28)","v":""},{"$f":"IF('Tex-201'!$B$6=\"\",\"\",'Tex-201'!$B$6)","v":"Tex-201-F"},{"$f":"IF('Tex-201'!$B$28=\"\",\"\",'Tex-201'!$B$28)","v":"X1 = the net oven-dry mass of the sample, (g):"},{"$f":"IF('Tex-201'!$J$23=\"\",\"\",'Tex-201'!$J$23)","v":"Sieve Size:"},{"$f":"IF('Tex-201'!$U$23=\"\",\"\",'Tex-201'!$U$23)","v":0}]
{"$rows_left_out":56}
{"sheet":"Std Spec Gradations","index":2,"n_rows":102,"n_cols":10,"rows_kept":102,"cut":false,"hidden":true,"merged":[[32,1,36,1],[37,1,43,1],[3,1,10,1],[11,1,18,1],[19,1,25,1],[26,1,31,1],[44,1,49,1],[50,1,55,1],[56,1,61,1],[62,1,67,1],[89,1,92,1],[93,1,101,1],[68,1,72,1],[73,1,77,1],[78,1,83,1],[84,1,88,1]]}
[]
[null,null,null,null,null,null,"Gradation Table"]
[null,"Grade","1993 Sieve Size","1995 Sieve Size","Sieve Measurement",null,"English","Metric","Selection","Size"]
[null,"TYPE A","1-1/2\"","37.5 mm",37.5,null,"2\"","50 mm",{"$f":"IF(SpecYear=\"\",\"\",IF(SpecYear=\"1995\",H4,G4))","v":""},50]
[null,null,"1-1/4\"","31.5 mm",31.5,null,"1-3/4\"","45 mm",{"$f":"IF(SpecYear=\"\",\"\",IF(SpecYear=\"1995\",H5,G5))","v":""},45]
[null,null,"7/8\"","22.4 mm",22.4,null,"1-1/2\"","37.5 mm","",37.5]
[null,null,"1/2\"","12.5 mm",12.5,null,"1-1/4\"","31.5 mm","",31.5]
[null,null,"No. 4","4.75 mm",4.75,null,"1\"","25 mm","",25]
[null,null,"No. 10","2 mm",2,null,"7/8\"","22.4 mm","",22.4]
[null,null,"No. 40","425 µm",0.42499999999999999,null,"3/4\"","19 mm","",19]
[null,null,"No. 80","180 µm",0.18,null,"5/8\"","16 mm","",16]
[null,"TYPE B","1\"","25 mm",25,null,"1/2\"","12.5 mm","",12.5]
[null,null,"7/8\"","22.4 mm",22.4,null,"7/16\"","11.2 mm","",11.2]
[null,null,"5/8\"","16 mm",16,null,"3/8\"","9.5 mm","",9.5]
[null,null,"3/8\"","9.5 mm",9.5,null,"5/16\"","8 mm","",8]
[null,null,"No. 4","4.75 mm",4.75,null,"1/4\"","6.3 mm","",6.3]
[null,null,"No. 10","2 mm",2,null,"No. 4","4.75 mm","",4.75]
[null,null,"No. 40","425 µm",0.42499999999999999,null,"No. 6","3.35 mm","",3.35]
[null,null,"No. 80","180 µm",0.18,null,"No. 8","2.36 mm","",2.36]
[null,"TYPE C","7/8\"","22.4 mm",22.4,null,"No. 10","2 mm","",2]
[null,null,"5/8\"","16 mm",16,null,"No. 14","1.4 mm","",1.4]
[null,null,"3/8\"","9.5 mm",9.5,null,"No. 16","1.18 mm","",1.18]
[null,null,"No. 4","4.75 mm",4.75,null,"No. 20",".85 µm","",0.85]
[null,null,"No. 10","2 mm",2,null,"No. 30",".6 µm","",0.6]
[null,null,"No. 40","425 µm",0.42499999999999999,null,"No. 40",".425 µm","",0.42499999999999999]
[null,null,"No. 80","180 µm",0.18,null,"No. 50",".3 µm","",0.3]
[null,"TYPE D","1/2\"","12.5 mm",12.5,null,"No. 80",".18 µm","",0.18]
[null,null,"3/8\"","9.5 mm",9.5]
[null,null,"No. 4","4.75 mm",4.75]
[null,null,"No. 10","2 mm",2]
{"$rows_left_out":73}
{"sheet":"spcyr","index":3,"n_rows":17,"n_cols":3,"rows_kept":17,"cut":false,"hidden":true,"merged":[]}
["spec1993","spec1995","spec2004,2014,2024"]
["Type_A","Type_A","Select_Sieve"]
["Type_B","Type_B"]
["Type_C","Type_C"]
["Type_D","Type_D"]
["Type_F","Type_F"]
["Type_CMHB_C","Type_CMHB_C"]
["Type_CMHB_F","Type_CMHB_F"]
["Grade_1","Grade_1"]
["Grade_2","Grade_2"]
["Grade_3","Grade_3"]
["Grade_4","Grade_4"]
["Grade_5","Grade_5"]
["Grade_3LW","Grade_3LW"]
["Grade_4LW","Grade_4LW"]
["Grade_5LW","Grade_5LW"]
["Shown_On_Plans","Shown_On_Plans"]