{"text_format":"1","workbook":"xlsx","n_sheets":9,"sheets":["Segregation Density Profile_1","Segregation Density Profile_2","Segregation Density Profile_3","Segregation Density Profile_4","Summary","RX","Revision","Specs","spcyr"],"not_rendered":{"charts":0,"images":1,"macros":1,"external_links":0,"defined_names":316,"comments":1,"pivot_tables":0},"unopened":[],"bounds":{"document_bytes":16777216,"sheet_cells":100000,"rows_first":2000,"rows_last":500,"rows_between":2000,"halvings":0,"cell_chars":16384,"cell_head_chars":4096},"cells_cut":0,"cells_raw":0,"read":"whole","date_system":"1900"}

{"sheet":"Segregation Density Profile_1","index":0,"n_rows":62,"n_cols":11,"rows_kept":62,"cut":false,"hidden":false,"merged":[[12,7,12,8],[14,3,14,8],[15,3,15,4],[15,7,15,8],[12,3,12,4],[13,3,13,8],[9,7,9,8],[10,7,10,8],[11,3,11,4],[11,7,11,8],[10,3,10,4],[9,3,9,4],[6,7,6,8],[7,3,7,4],[7,7,7,8],[8,7,8,8],[6,3,6,4],[8,3,8,4],[48,1,49,8],[51,1,51,8],[50,1,50,8],[44,1,44,2],[24,7,25,7],[43,1,43,2],[42,1,42,3],[24,1,25,1],[38,1,38,2],[61,1,61,3],[57,6,57,8],[53,2,53,4],[52,2,52,4],[57,1,57,3],[55,2,55,4],[19,1,19,2],[24,2,24,6],[40,1,40,2],[39,1,39,2],[22,2,22,7],[21,2,21,7]]}
[null,"TxDOT Manuals >"]
[null,"TEXAS DEPARTMENT OF TRANSPORTATION"]
[null,null,null,null,null,null,null,null,null,null,246]
[null,"SEGREGATION PROFILE_1",null,null,null,null,null,null,null,null,2]
[null,"TEX-207-F, PART V"]
[null,null,null,null,null,null,null,null,{"$f":"\"Segregation Profile :: File Version: \" & TEXT(MID(sn,SEARCH(\"::\",sn,1)+2,20),\"mm/dd/yy hh:mm:ss\")","v":"Segregation Profile :: File Version: 10/09/24 14:50:36"},null,"tx207v-4.xlsm::45574.618472"]
[null,null,"SAMPLE ID:",null,null,null,"SAMPLED DATE:"]
[null,null,"TEST NUMBER:",null,null,null,"LETTING DATE:"]
[null,null,"SAMPLE STATUS:",null,null,null,"CONTROLLING CSJ:"]
[null,null,"COUNTY:",null,null,null,"SPEC YEAR:"]
[null,null,"SAMPLED BY:",null,null,null,"SPEC ITEM:"]
[null,null,"SAMPLE LOCATION:",null,null,null,"SPECIAL PROVISION:"]
[null,null,"MATERIAL CODE:",null,null,null,"MIX TYPE:"]
[null,null,"MATERIAL NAME:"]
[null,null,"PRODUCER:"]
[null,null,"AREA ENGINEER:",null,null,null,"PROJECT MANAGER:"]
[]
[null,null,"COURSE\\LIFT:",null,"STATION:",null,null,"DIST. FROM CL:"]
[]
[null,"TYPE OF DENSITY GAUGE:",null,null,"LOT:",null,"SUBLOT:"]
{"$rows_left_out":43}
{"sheet":"Segregation Density Profile_2","index":1,"n_rows":48,"n_cols":9,"rows_kept":48,"cut":false,"hidden":false,"merged":[[6,3,6,4],[7,3,7,4],[8,3,8,4],[9,3,9,4],[6,7,6,8],[7,7,7,8],[8,7,8,8],[9,7,9,8],[10,3,10,4],[11,3,11,4],[12,3,12,4],[19,1,19,2],[14,3,14,8],[15,7,15,8],[15,3,15,4],[10,7,10,8],[11,7,11,8],[44,1,44,2],[48,1,49,8],[39,1,39,2],[40,1,40,2],[42,1,42,3],[43,1,43,2],[38,1,38,2],[12,7,12,8],[13,3,13,8],[24,1,25,1],[24,2,24,6],[24,7,25,7],[20,1,20,2],[22,2,22,7]]}
[]
[null,"TEXAS DEPARTMENT OF TRANSPORTATION"]
[]
[null,"SEGREGATION PROFILE_2"]
[null,"TEX-207-F, PART V"]
[]
[null,null,"SAMPLE ID:",{"$f":"IF(sampleid=\"\",\"\",sampleid)","v":""},null,null,"SAMPLED DATE:",{"$f":"IF(SampledDate=\"\",\"\",SampledDate)","v":""}]
[null,null,"TEST NUMBER:",{"$f":"IF(TestNumber=\"\",\"\",TestNumber)","v":""},null,null,"LETTING DATE:",{"$f":"IF(LettingDate=\"\",\"\",LettingDate)","v":""}]
[null,null,"SAMPLE STATUS:",{"$f":"IF(Status=\"\",\"\",Status)","v":""},null,null,"CONTROLLING CSJ:",{"$f":"IF(CCSJ=\"\",\"\",CCSJ)","v":""}]
[null,null,"COUNTY:",{"$f":"IF(County=\"\",\"\",County)","v":""},null,null,"SPEC YEAR:",{"$f":"IF(SpecYear=\"\",\"\",SpecYear)","v":""}]
[null,null,"SAMPLED BY:",{"$f":"IF(SampledBy=\"\",\"\",SampledBy)","v":""},null,null,"SPEC ITEM:",{"$f":"IF(SpecItem=\"\",\"\",SpecItem)","v":""}]
[null,null,"SAMPLE LOCATION:",{"$f":"IF(SampleLocation=\"\",\"\",SampleLocation)","v":""},null,null,"SPECIAL PROVISION:",{"$f":"IF(SpecialProvision=\"\",\"\",SpecialProvision)","v":""}]
[null,null,"MATERIAL CODE:",{"$f":"IF(Material=\"\",\"\",Material)","v":""},null,null,"MIX TYPE:",{"$f":"IF(Grade=\"\",\"\",Grade)","v":""}]
[null,null,"MATERIAL NAME:",{"$f":"IF(matl_nm=\"\",\"\",matl_nm)","v":""}]
[null,null,"PRODUCER:",{"$f":"IF(Producer=\"\",\"\",Producer)","v":""}]
[null,null,"AREA ENGINEER:",{"$f":"IF(AreaEngineer=\"\",\"\",AreaEngineer)","v":""},null,null,"PROJECT MANAGER:",{"$f":"IF(ProjectManager=\"\",\"\",ProjectManager)","v":""}]
[]
[null,null,"COURSE\\LIFT:",{"$f":"IF(CourseLift=\"\",\"\",CourseLift)","v":""},"STATION:",{"$f":"IF(Station=\"\",\"\",Station)","v":""},null,"DIST. FROM CL:",{"$f":"IF(DistFromCL=\"\",\"\",DistFromCL)","v":""}]
[]
[null,"TYPE OF DENSITY GAUGE:",null,null,"LOT:",null,"SUBLOT:"]
{"$rows_left_out":29}
{"sheet":"Segregation Density Profile_3","index":2,"n_rows":48,"n_cols":9,"rows_kept":48,"cut":false,"hidden":false,"merged":[[38,1,38,2],[44,1,44,2],[48,1,49,8],[39,1,39,2],[40,1,40,2],[42,1,42,3],[43,1,43,2],[19,1,19,2],[20,1,20,2],[22,2,22,7],[24,1,25,1],[24,2,24,6],[24,7,25,7],[12,3,12,4],[12,7,12,8],[13,3,13,8],[14,3,14,8],[15,3,15,4],[15,7,15,8],[9,3,9,4],[9,7,9,8],[10,3,10,4],[10,7,10,8],[11,3,11,4],[11,7,11,8],[6,3,6,4],[6,7,6,8],[7,3,7,4],[7,7,7,8],[8,3,8,4],[8,7,8,8]]}
[]
[null,"TEXAS DEPARTMENT OF TRANSPORTATION"]
[]
[null,"SEGREGATION PROFILE_3"]
[null,"TEX-207-F, PART V"]
[]
[null,null,"SAMPLE ID:",{"$f":"IF(sampleid=\"\",\"\",sampleid)","v":""},null,null,"SAMPLED DATE:",{"$f":"IF(SampledDate=\"\",\"\",SampledDate)","v":""}]
[null,null,"TEST NUMBER:",{"$f":"IF(TestNumber=\"\",\"\",TestNumber)","v":""},null,null,"LETTING DATE:",{"$f":"IF(LettingDate=\"\",\"\",LettingDate)","v":""}]
[null,null,"SAMPLE STATUS:",{"$f":"IF(Status=\"\",\"\",Status)","v":""},null,null,"CONTROLLING CSJ:",{"$f":"IF(CCSJ=\"\",\"\",CCSJ)","v":""}]
[null,null,"COUNTY:",{"$f":"IF(County=\"\",\"\",County)","v":""},null,null,"SPEC YEAR:",{"$f":"IF(SpecYear=\"\",\"\",SpecYear)","v":""}]
[null,null,"SAMPLED BY:",{"$f":"IF(SampledBy=\"\",\"\",SampledBy)","v":""},null,null,"SPEC ITEM:",{"$f":"IF(SpecItem=\"\",\"\",SpecItem)","v":""}]
[null,null,"SAMPLE LOCATION:",{"$f":"IF(SampleLocation=\"\",\"\",SampleLocation)","v":""},null,null,"SPECIAL PROVISION:",{"$f":"IF(SpecialProvision=\"\",\"\",SpecialProvision)","v":""}]
[null,null,"MATERIAL CODE:",{"$f":"IF(Material=\"\",\"\",Material)","v":""},null,null,"MIX TYPE:",{"$f":"IF(Grade=\"\",\"\",Grade)","v":""}]
[null,null,"MATERIAL NAME:",{"$f":"IF(matl_nm=\"\",\"\",matl_nm)","v":""}]
[null,null,"PRODUCER:",{"$f":"IF(Producer=\"\",\"\",Producer)","v":""}]
[null,null,"AREA ENGINEER:",{"$f":"IF(AreaEngineer=\"\",\"\",AreaEngineer)","v":""},null,null,"PROJECT MANAGER:",{"$f":"IF(ProjectManager=\"\",\"\",ProjectManager)","v":""}]
[]
[null,null,"COURSE\\LIFT:",{"$f":"IF(CourseLift=\"\",\"\",CourseLift)","v":""},"STATION:",{"$f":"IF(Station=\"\",\"\",Station)","v":""},null,"DIST. FROM CL:",{"$f":"IF(DistFromCL=\"\",\"\",DistFromCL)","v":""}]
[]
[null,"TYPE OF DENSITY GAUGE:",null,null,"LOT:",null,"SUBLOT:"]
{"$rows_left_out":29}
{"sheet":"Segregation Density Profile_4","index":3,"n_rows":48,"n_cols":9,"rows_kept":48,"cut":false,"hidden":false,"merged":[[38,1,38,2],[44,1,44,2],[48,1,49,8],[39,1,39,2],[40,1,40,2],[42,1,42,3],[43,1,43,2],[19,1,19,2],[20,1,20,2],[22,2,22,7],[24,1,25,1],[24,2,24,6],[24,7,25,7],[12,3,12,4],[12,7,12,8],[13,3,13,8],[14,3,14,8],[15,3,15,4],[15,7,15,8],[9,3,9,4],[9,7,9,8],[10,3,10,4],[10,7,10,8],[11,3,11,4],[11,7,11,8],[6,3,6,4],[6,7,6,8],[7,3,7,4],[7,7,7,8],[8,3,8,4],[8,7,8,8]]}
[]
[null,"TEXAS DEPARTMENT OF TRANSPORTATION"]
[]
[null,"SEGREGATION PROFILE_4"]
[null,"TEX-207-F, PART V"]
[]
[null,null,"SAMPLE ID:",{"$f":"IF(sampleid=\"\",\"\",sampleid)","v":""},null,null,"SAMPLED DATE:",{"$f":"IF(SampledDate=\"\",\"\",SampledDate)","v":""}]
[null,null,"TEST NUMBER:",{"$f":"IF(TestNumber=\"\",\"\",TestNumber)","v":""},null,null,"LETTING DATE:",{"$f":"IF(LettingDate=\"\",\"\",LettingDate)","v":""}]
[null,null,"SAMPLE STATUS:",{"$f":"IF(Status=\"\",\"\",Status)","v":""},null,null,"CONTROLLING CSJ:",{"$f":"IF(CCSJ=\"\",\"\",CCSJ)","v":""}]
[null,null,"COUNTY:",{"$f":"IF(County=\"\",\"\",County)","v":""},null,null,"SPEC YEAR:",{"$f":"IF(SpecYear=\"\",\"\",SpecYear)","v":""}]
[null,null,"SAMPLED BY:",{"$f":"IF(SampledBy=\"\",\"\",SampledBy)","v":""},null,null,"SPEC ITEM:",{"$f":"IF(SpecItem=\"\",\"\",SpecItem)","v":""}]
[null,null,"SAMPLE LOCATION:",{"$f":"IF(SampleLocation=\"\",\"\",SampleLocation)","v":""},null,null,"SPECIAL PROVISION:",{"$f":"IF(SpecialProvision=\"\",\"\",SpecialProvision)","v":""}]
[null,null,"MATERIAL CODE:",{"$f":"IF(Material=\"\",\"\",Material)","v":""},null,null,"MIX TYPE:",{"$f":"IF(Grade=\"\",\"\",Grade)","v":""}]
[null,null,"MATERIAL NAME:",{"$f":"IF(matl_nm=\"\",\"\",matl_nm)","v":""}]
[null,null,"PRODUCER:",{"$f":"IF(Producer=\"\",\"\",Producer)","v":""}]
[null,null,"AREA ENGINEER:",{"$f":"IF(AreaEngineer=\"\",\"\",AreaEngineer)","v":""},null,null,"PROJECT MANAGER:",{"$f":"IF(ProjectManager=\"\",\"\",ProjectManager)","v":""}]
[]
[null,null,"COURSE\\LIFT:",{"$f":"IF(CourseLift=\"\",\"\",CourseLift)","v":""},"STATION:",{"$f":"IF(Station=\"\",\"\",Station)","v":""},null,"DIST. FROM CL:",{"$f":"IF(DistFromCL=\"\",\"\",DistFromCL)","v":""}]
[]
[null,"TYPE OF DENSITY GAUGE:",null,null,"LOT:",null,"SUBLOT:"]
{"$rows_left_out":29}
{"sheet":"Summary","index":4,"n_rows":41,"n_cols":9,"rows_kept":41,"cut":false,"hidden":false,"merged":[[21,2,21,3],[22,2,22,3],[39,2,39,3],[23,2,23,7],[40,2,40,3],[35,2,35,3],[36,2,36,3],[37,2,37,3],[38,2,38,7],[20,2,20,3],[15,3,15,4],[15,7,15,8],[10,3,10,4],[12,3,12,4],[12,7,12,8],[13,3,13,8],[10,7,10,8],[11,3,11,4],[11,7,11,8],[14,3,14,8],[8,3,8,4],[8,7,8,8],[9,3,9,4],[9,7,9,8],[6,3,6,4],[6,7,6,8],[7,3,7,4],[7,7,7,8]]}
[]
[null,"TEXAS DEPARTMENT OF TRANSPORTATION"]
[]
[null,"TEST SUMMARY"]
[null,"TEX-207-F, PART V"]
[]
[null,null,"SAMPLE ID:",{"$f":"IF(sampleid=\"\",\"\",sampleid)","v":""},null,null,"SAMPLED DATE:",{"$f":"IF(SampledDate=\"\",\"\",SampledDate)","v":""}]
[null,null,"TEST NUMBER:",{"$f":"IF(TestNumber=\"\",\"\",TestNumber)","v":""},null,null,"LETTING DATE:",{"$f":"IF(LettingDate=\"\",\"\",LettingDate)","v":""}]
[null,null,"SAMPLE STATUS:",{"$f":"IF(Status=\"\",\"\",Status)","v":""},null,null,"CONTROLLING CSJ:",{"$f":"IF(CCSJ=\"\",\"\",CCSJ)","v":""}]
[null,null,"COUNTY:",{"$f":"IF(County=\"\",\"\",County)","v":""},null,null,"SPEC YEAR:",{"$f":"IF(SpecYear=\"\",\"\",SpecYear)","v":""}]
[null,null,"SAMPLED BY:",{"$f":"IF(SampledBy=\"\",\"\",SampledBy)","v":""},null,null,"SPEC ITEM:",{"$f":"IF(SpecItem=\"\",\"\",SpecItem)","v":""}]
[null,null,"SAMPLE LOCATION:",{"$f":"IF(SampleLocation=\"\",\"\",SampleLocation)","v":""},null,null,"SPECIAL PROVISION:",{"$f":"IF(SpecialProvision=\"\",\"\",SpecialProvision)","v":""}]
[null,null,"MATERIAL CODE:",{"$f":"IF(Material=\"\",\"\",Material)","v":""},null,null,"MIX TYPE:",{"$f":"IF(Grade=\"\",\"\",Grade)","v":""}]
[null,null,"MATERIAL NAME:",{"$f":"IF(matl_nm=\"\",\"\",matl_nm)","v":""}]
[null,null,"PRODUCER:",{"$f":"IF(Producer=\"\",\"\",Producer)","v":""}]
[null,null,"AREA ENGINEER:",{"$f":"IF(AreaEngineer=\"\",\"\",AreaEngineer)","v":""},null,null,"PROJECT MANAGER:",{"$f":"IF(ProjectManager=\"\",\"\",ProjectManager)","v":""}]
[]
[null,null,"COURSE\\LIFT:",{"$f":"IF(CourseLift=\"\",\"\",CourseLift)","v":""},"STATION:",{"$f":"IF(Station=\"\",\"\",Station)","v":""},null,"DIST. FROM CL:",{"$f":"IF(DistFromCL=\"\",\"\",DistFromCL)","v":""}]
[]
[]
{"$rows_left_out":22}
{"sheet":"RX","index":5,"n_rows":310,"n_cols":10,"rows_kept":310,"cut":false,"hidden":true,"merged":[]}
[309]
["Fld_nbr","Value","Desc_1","Desc_2","Desc_3","Desc_4","Desc_5","Desc_6","Desc_7","Desc_8"]
[1,{"$f":"IF('Segregation Density Profile_1'!$B$49=\"\",\"\",'Segregation Density Profile_1'!$B$49)","v":""},{"$f":"'Segregation Density Profile_1'!$B$48","v":"Remarks:"},{"$f":"IF('Segregation Density Profile_1'!$B$4=\"\",\"\",'Segregation Density Profile_1'!$B$4)","v":"SEGREGATION PROFILE_1"}]
[2,{"$f":"IF('Segregation Density Profile_2'!$B$49=\"\",\"\",'Segregation Density Profile_2'!$B$49)","v":""},{"$f":"'Segregation Density Profile_2'!$B$48","v":"Remarks:"},{"$f":"IF('Segregation Density Profile_2'!$B$4=\"\",\"\",'Segregation Density Profile_2'!$B$4)","v":"SEGREGATION PROFILE_2"}]
[3,{"$f":"IF('Segregation Density Profile_3'!$B$49=\"\",\"\",'Segregation Density Profile_3'!$B$49)","v":""},{"$f":"'Segregation Density Profile_3'!$B$48","v":"Remarks:"},{"$f":"IF('Segregation Density Profile_3'!$B$4=\"\",\"\",'Segregation Density Profile_3'!$B$4)","v":"SEGREGATION PROFILE_3"}]
[4,{"$f":"IF('Segregation Density Profile_4'!$B$49=\"\",\"\",'Segregation Density Profile_4'!$B$49)","v":""},{"$f":"'Segregation Density Profile_4'!$B$48","v":"Remarks:"},{"$f":"IF('Segregation Density Profile_4'!$B$4=\"\",\"\",'Segregation Density Profile_4'!$B$4)","v":"SEGREGATION PROFILE_4"}]
[5,{"$f":"IF('Segregation Density Profile_1'!$D$18=\"\",\"\",'Segregation Density Profile_1'!$D$18)","v":""},{"$f":"IF('Segregation Density Profile_1'!$C$18=\"\",\"\",'Segregation Density Profile_1'!$C$18)","v":"COURSE\\LIFT:"}]
[6,{"$f":"IF('Segregation Density Profile_1'!$C$54=\"\",\"\",'Segregation Density Profile_1'!$C$54)","v":""},"Tested By ",{"$f":"IF('Segregation Density Profile_1'!$B$54=\"\",\"\",'Segregation Density Profile_1'!$B$54)","v":"TX207"}]
[7,{"$f":"IF('Segregation Density Profile_1'!$F$54=\"\",\"\",'Segregation Density Profile_1'!$F$54)","v":""},"Tested Date ",{"$f":"IF('Segregation Density Profile_1'!$B$54=\"\",\"\",'Segregation Density Profile_1'!$B$54)","v":"TX207"}]
[8,{"$f":"IF('Segregation Density Profile_1'!$D$20=\"\",\"\",'Segregation Density Profile_1'!$D$20)","v":""},{"$f":"IF('Segregation Density Profile_1'!$B$5=\"\",\"\",'Segregation Density Profile_1'!$B$5)","v":"TEX-207-F, PART V"},{"$f":"IF('Segregation Density Profile_1'!$B$4=\"\",\"\",'Segregation Density Profile_1'!$B$4)","v":"SEGREGATION PROFILE_1"},{"$f":"IF('Segregation Density Profile_1'!$B$20=\"\",\"\",'Segregation Density Profile_1'!$B$20)","v":"TYPE OF DENSITY GAUGE:"}]
[9,{"$f":"IF('Segregation Density Profile_1'!$C$27=\"\",\"\",'Segregation Density Profile_1'!$C$27)","v":""},{"$f":"IF('Segregation Density Profile_1'!$B$5=\"\",\"\",'Segregation Density Profile_1'!$B$5)","v":"TEX-207-F, PART V"},{"$f":"IF('Segregation Density Profile_1'!$B$4=\"\",\"\",'Segregation Density Profile_1'!$B$4)","v":"SEGREGATION PROFILE_1"},{"$f":"IF('Segregation Density Profile_1'!$B$25=\"\",\"\",'Segregation Density Profile_1'!$B$25)","v":"LOCATION"},{"$f":"IF('Segregation Density Profile_1'!$B$27=\"\",\"\",'Segregation Density Profile_1'!$B$27)","v":"0'"},{"$f":"IF('Segregation Density Profile_1'!$C$25=\"\",\"\",'Segregation Density Profile_1'!$C$25)","v":"DENSITY READINGS"},{"$f":"IF('Segregation Density Profile_1'!$C$26=\"\",\"\",'Segregation Density Profile_1'!$C$26)","v":1}]
[10,{"$f":"IF('Segregation Density Profile_1'!$D$27=\"\",\"\",'Segregation Density Profile_1'!$D$27)","v":""},{"$f":"IF('Segregation Density Profile_1'!$B$5=\"\",\"\",'Segregation Density Profile_1'!$B$5)","v":"TEX-207-F, PART V"},{"$f":"IF('Segregation Density Profile_1'!$B$4=\"\",\"\",'Segregation Density Profile_1'!$B$4)","v":"SEGREGATION PROFILE_1"},{"$f":"IF('Segregation Density Profile_1'!$B$25=\"\",\"\",'Segregation Density Profile_1'!$B$25)","v":"LOCATION"},{"$f":"IF('Segregation Density Profile_1'!$B$27=\"\",\"\",'Segregation Density Profile_1'!$B$27)","v":"0'"},{"$f":"IF('Segregation Density Profile_1'!$C$25=\"\",\"\",'Segregation Density Profile_1'!$C$25)","v":"DENSITY READINGS"},{"$f":"IF('Segregation Density Profile_1'!$D$26=\"\",\"\",'Segregation Density Profile_1'!$D$26)","v":2}]
[11,{"$f":"IF('Segregation Density Profile_1'!$E$27=\"\",\"\",'Segregation Density Profile_1'!$E$27)","v":""},{"$f":"IF('Segregation Density Profile_1'!$B$5=\"\",\"\",'Segregation Density Profile_1'!$B$5)","v":"TEX-207-F, PART V"},{"$f":"IF('Segregation Density Profile_1'!$B$4=\"\",\"\",'Segregation Density Profile_1'!$B$4)","v":"SEGREGATION PROFILE_1"},{"$f":"IF('Segregation Density Profile_1'!$B$25=\"\",\"\",'Segregation Density Profile_1'!$B$25)","v":"LOCATION"},{"$f":"IF('Segregation Density Profile_1'!$B$27=\"\",\"\",'Segregation Density Profile_1'!$B$27)","v":"0'"},{"$f":"IF('Segregation Density Profile_1'!$C$25=\"\",\"\",'Segregation Density Profile_1'!$C$25)","v":"DENSITY READINGS"},{"$f":"IF('Segregation Density Profile_1'!$E$26=\"\",\"\",'Segregation Density Profile_1'!$E$26)","v":3}]
[12,{"$f":"IF('Segregation Density Profile_1'!$F$27=\"\",\"\",'Segregation Density Profile_1'!$F$27)","v":""},{"$f":"IF('Segregation Density Profile_1'!$B$5=\"\",\"\",'Segregation Density Profile_1'!$B$5)","v":"TEX-207-F, PART V"},{"$f":"IF('Segregation Density Profile_1'!$B$4=\"\",\"\",'Segregation Density Profile_1'!$B$4)","v":"SEGREGATION PROFILE_1"},{"$f":"IF('Segregation Density Profile_1'!$B$25=\"\",\"\",'Segregation Density Profile_1'!$B$25)","v":"LOCATION"},{"$f":"IF('Segregation Density Profile_1'!$B$27=\"\",\"\",'Segregation Density Profile_1'!$B$27)","v":"0'"},{"$f":"IF('Segregation Density Profile_1'!$C$25=\"\",\"\",'Segregation Density Profile_1'!$C$25)","v":"DENSITY READINGS"},{"$f":"IF('Segregation Density Profile_1'!$F$26=\"\",\"\",'Segregation Density Profile_1'!$F$26)","v":4}]
[13,{"$f":"IF('Segregation Density Profile_1'!$G$27=\"\",\"\",'Segregation Density Profile_1'!$G$27)","v":""},{"$f":"IF('Segregation Density Profile_1'!$B$5=\"\",\"\",'Segregation Density Profile_1'!$B$5)","v":"TEX-207-F, PART V"},{"$f":"IF('Segregation Density Profile_1'!$B$4=\"\",\"\",'Segregation Density Profile_1'!$B$4)","v":"SEGREGATION PROFILE_1"},{"$f":"IF('Segregation Density Profile_1'!$B$25=\"\",\"\",'Segregation Density Profile_1'!$B$25)","v":"LOCATION"},{"$f":"IF('Segregation Density Profile_1'!$B$27=\"\",\"\",'Segregation Density Profile_1'!$B$27)","v":"0'"},{"$f":"IF('Segregation Density Profile_1'!$C$25=\"\",\"\",'Segregation Density Profile_1'!$C$25)","v":"DENSITY READINGS"},{"$f":"IF('Segregation Density Profile_1'!$G$26=\"\",\"\",'Segregation Density Profile_1'!$G$26)","v":5}]
[14,{"$f":"IF('Segregation Density Profile_1'!$H$27=\"\",\"\",'Segregation Density Profile_1'!$H$27)","v":""},{"$f":"IF('Segregation Density Profile_1'!$B$5=\"\",\"\",'Segregation Density Profile_1'!$B$5)","v":"TEX-207-F, PART V"},{"$f":"IF('Segregation Density Profile_1'!$B$4=\"\",\"\",'Segregation Density Profile_1'!$B$4)","v":"SEGREGATION PROFILE_1"},{"$f":"IF('Segregation Density Profile_1'!$B$25=\"\",\"\",'Segregation Density Profile_1'!$B$25)","v":"LOCATION"},{"$f":"IF('Segregation Density Profile_1'!$B$27=\"\",\"\",'Segregation Density Profile_1'!$B$27)","v":"0'"},{"$f":"IF('Segregation Density Profile_1'!$H$25=\"\",\"\",'Segregation Density Profile_1'!$H$25)","v":"AVERAGE"}]
[15,{"$f":"IF('Segregation Density Profile_1'!$C$28=\"\",\"\",'Segregation Density Profile_1'!$C$28)","v":""},{"$f":"IF('Segregation Density Profile_1'!$B$5=\"\",\"\",'Segregation Density Profile_1'!$B$5)","v":"TEX-207-F, PART V"},{"$f":"IF('Segregation Density Profile_1'!$B$4=\"\",\"\",'Segregation Density Profile_1'!$B$4)","v":"SEGREGATION PROFILE_1"},{"$f":"IF('Segregation Density Profile_1'!$B$25=\"\",\"\",'Segregation Density Profile_1'!$B$25)","v":"LOCATION"},{"$f":"IF('Segregation Density Profile_1'!$B$28=\"\",\"\",'Segregation Density Profile_1'!$B$28)","v":"5'"},{"$f":"IF('Segregation Density Profile_1'!$C$25=\"\",\"\",'Segregation Density Profile_1'!$C$25)","v":"DENSITY READINGS"},{"$f":"IF('Segregation Density Profile_1'!$C$26=\"\",\"\",'Segregation Density Profile_1'!$C$26)","v":1}]
[16,{"$f":"IF('Segregation Density Profile_1'!$D$28=\"\",\"\",'Segregation Density Profile_1'!$D$28)","v":""},{"$f":"IF('Segregation Density Profile_1'!$B$5=\"\",\"\",'Segregation Density Profile_1'!$B$5)","v":"TEX-207-F, PART V"},{"$f":"IF('Segregation Density Profile_1'!$B$4=\"\",\"\",'Segregation Density Profile_1'!$B$4)","v":"SEGREGATION PROFILE_1"},{"$f":"IF('Segregation Density Profile_1'!$B$25=\"\",\"\",'Segregation Density Profile_1'!$B$25)","v":"LOCATION"},{"$f":"IF('Segregation Density Profile_1'!$B$28=\"\",\"\",'Segregation Density Profile_1'!$B$28)","v":"5'"},{"$f":"IF('Segregation Density Profile_1'!$C$25=\"\",\"\",'Segregation Density Profile_1'!$C$25)","v":"DENSITY READINGS"},{"$f":"IF('Segregation Density Profile_1'!$D$26=\"\",\"\",'Segregation Density Profile_1'!$D$26)","v":2}]
[17,{"$f":"IF('Segregation Density Profile_1'!$E$28=\"\",\"\",'Segregation Density Profile_1'!$E$28)","v":""},{"$f":"IF('Segregation Density Profile_1'!$B$5=\"\",\"\",'Segregation Density Profile_1'!$B$5)","v":"TEX-207-F, PART V"},{"$f":"IF('Segregation Density Profile_1'!$B$4=\"\",\"\",'Segregation Density Profile_1'!$B$4)","v":"SEGREGATION PROFILE_1"},{"$f":"IF('Segregation Density Profile_1'!$B$25=\"\",\"\",'Segregation Density Profile_1'!$B$25)","v":"LOCATION"},{"$f":"IF('Segregation Density Profile_1'!$B$28=\"\",\"\",'Segregation Density Profile_1'!$B$28)","v":"5'"},{"$f":"IF('Segregation Density Profile_1'!$C$25=\"\",\"\",'Segregation Density Profile_1'!$C$25)","v":"DENSITY READINGS"},{"$f":"IF('Segregation Density Profile_1'!$E$26=\"\",\"\",'Segregation Density Profile_1'!$E$26)","v":3}]
[18,{"$f":"IF('Segregation Density Profile_1'!$F$28=\"\",\"\",'Segregation Density Profile_1'!$F$28)","v":""},{"$f":"IF('Segregation Density Profile_1'!$B$5=\"\",\"\",'Segregation Density Profile_1'!$B$5)","v":"TEX-207-F, PART V"},{"$f":"IF('Segregation Density Profile_1'!$B$4=\"\",\"\",'Segregation Density Profile_1'!$B$4)","v":"SEGREGATION PROFILE_1"},{"$f":"IF('Segregation Density Profile_1'!$B$25=\"\",\"\",'Segregation Density Profile_1'!$B$25)","v":"LOCATION"},{"$f":"IF('Segregation Density Profile_1'!$B$28=\"\",\"\",'Segregation Density Profile_1'!$B$28)","v":"5'"},{"$f":"IF('Segregation Density Profile_1'!$C$25=\"\",\"\",'Segregation Density Profile_1'!$C$25)","v":"DENSITY READINGS"},{"$f":"IF('Segregation Density Profile_1'!$F$26=\"\",\"\",'Segregation Density Profile_1'!$F$26)","v":4}]
{"$rows_left_out":291}
{"sheet":"Revision","index":6,"n_rows":15,"n_cols":4,"rows_kept":15,"cut":false,"hidden":true,"merged":[[4,3,12,3],[4,1,6,1],[11,1,12,1],[4,0,12,0],[4,2,12,2],[7,1,9,1]]}
["Date","Changes","Change by","Comments"]
["2005-07-20","Remove comment from cell G25 and F25","Joe Liu","Requested by Richard Izzo"]
["2006-11-29","Adjust the conditional formatting for cells D43 & D44 to reference the \"Grade\" instead of the \"Course\\Lift\"","Corey Schwarz"]
["2008-08-04","Add worksheets for every sublot","Gisel Carrasco/Brett Haggerty","Requested by Richard Izzo"]
["2010-12-06","Change Gauge type cell on worksheets 2, 3, and 4 from an equation to a dropdown list as shown on the first worksheet, so that you will be able to select the gauge type on each worksheet.","Gisel Carrasco","Requested by Richard Izzo"]
[]
[]
[null,"Change Lot# cell on worksheets 2, 3, and 4 from an equation to a dropdown list as shown on the first worksheet, so that you will be able to select the Lot number on each worksheet."]
[]
[]
[null,"Using version #2 (December 6, 2010)"]
[null,"Flagging when not meeting segregation acceptance criteria in each worksheet and summary"]
[]
["2019-11-26","Add part number to the test method on Segregation Density Profile_1 worksheet","Syeda Rahman","Requested by Travis Patton"]
["2024-08-06","Add 2024 spec items","Syeda Rahman","Requested by Travis Patton"]

{"sheet":"Specs","index":7,"n_rows":21,"n_cols":4,"rows_kept":21,"cut":false,"hidden":true,"merged":[]}
[]
[]
[null,"Mix","Maximum","Maximum"]
[null,"Type","Highest - Lowest","Average - Lowest"]
[null,"CAM",6,3]
[null,"CMHB C",6,3]
[null,"CMHB F",6,3]
[null,"SMA C",8,5]
[null,"SMA D",6,3]
[null,"SMA F",6,3]
[null,"SMAR C",8,5]
[null,"SMAR F",6,3]
[null,"SP A",8,5]
[null,"SP B",8,5]
[null,"SP C",6,3]
[null,"SP D",6,3]
[null,"Type A",8,5]
[null,"Type B",8,5]
[null,"Type C",6,3]
[null,"Type D",6,3]
{"$rows_left_out":2}
{"sheet":"spcyr","index":8,"n_rows":18,"n_cols":4,"rows_kept":18,"cut":false,"hidden":true,"merged":[]}
["spec1993","spec1995","spec2004","spec2024"]
["CMHB C","CMHB C","CMHB C","SMA C"]
["CMHB F","CMHB F","CMHB F","SMA D"]
["SMA C","SMA C","SMA C","SMA F"]
["SMA D","SMA D","SMA D","SMAR F"]
["SMA F","SMA F","SMA F","SP B"]
["SMAR C","SMAR C","SMAR C","SP C"]
["SMAR F","SMAR F","SMAR F","SP D"]
["SP A","SP A","SP A","Type B"]
["SP B","SP B","SP B","Type C"]
["SP C","SP C","SP C","Type D"]
["SP D","SP D","SP D","Type F"]
["Type A","Type A","Type A","CAM"]
["Type B","Type B","Type B"]
["Type C","Type C","Type C"]
["Type D","Type D","Type D"]
["Type F","Type F","Type F"]
[null,null,"CAM"]