{"text_format":"1","workbook":"xlsx","n_sheets":4,"sheets":["TEX-208 or 231-F","RX","Sheet1","spcyr"],"not_rendered":{"charts":0,"images":1,"macros":1,"external_links":1,"defined_names":101,"comments":1,"pivot_tables":0},"unopened":[],"bounds":{"document_bytes":16777216,"sheet_cells":100000,"rows_first":2000,"rows_last":500,"rows_between":2000,"halvings":0,"cell_chars":16384,"cell_head_chars":4096},"cells_cut":0,"cells_raw":0,"read":"whole","date_system":"1900"}

{"sheet":"TEX-208 or 231-F","index":0,"n_rows":60,"n_cols":11,"rows_kept":60,"cut":false,"hidden":false,"merged":[[25,1,25,2],[39,2,39,5],[40,2,40,5],[27,1,27,2],[60,1,60,3],[54,2,54,4],[51,2,51,4],[44,1,45,8],[46,1,46,8],[47,1,47,8],[56,6,56,8],[52,2,52,4],[29,7,29,8],[56,1,56,3],[41,2,41,5],[49,2,49,4],[15,3,15,8],[13,3,13,4],[13,7,13,8],[16,7,16,8],[25,4,25,5],[21,5,21,6],[14,3,14,8],[16,3,16,4],[0,0,0,1],[7,7,7,8],[8,7,8,8],[8,3,8,4],[7,3,7,4],[12,7,12,8],[9,7,9,8],[11,3,11,4],[12,3,12,4],[9,3,9,4],[11,7,11,8],[10,3,10,4],[10,7,10,8],[50,2,50,4],[30,9,34,9],[30,7,30,8],[31,7,31,8],[32,7,32,8],[33,7,33,8],[34,7,34,8]]}
["TxDOT Manuals >",null,null,"Tex-208-F","Tex-231-F"]
[null,"TEXAS DEPARTMENT OF TRANSPORTATION",null,null,null,null,null,null,null,null,45]
[null,null,null,null,null,null,null,null,null,null,2]
[null,null,null,null,null,null,null,null,null,null,"tx208,31.xlsm::45169.602465"]
[null,"DETERMINING STABILITY OF BITUMINOUS MIXTURES"]
[null,"TEX-208 or TEX-231-F"]
[null,null,null,null,null,null,null,null,{"$f":"\"File Version: \" & TEXT(MID(sn,SEARCH(\"::\",sn,1)+2,20),\"mm/dd/yy hh:mm:ss\")","v":"File Version: 08/31/23 14:27:33"}]
[null,null,"SAMPLE ID:",null,null,null,"SAMPLED DATE:"]
[null,null,"TEST NUMBER:",null,null,null,"LETTING DATE:"]
[null,null,"SAMPLE STATUS:",null,null,null,"CONTROLLING CSJ:"]
[null,null,"COUNTY:",null,null,null,"SPEC YEAR:"]
[null,null,"SAMPLED BY:",null,null,null,"SPEC ITEM:"]
[null,null,"SAMPLE LOCATION:",null,null,null,"SPECIAL PROVISION:"]
[null,null,"MATERIAL CODE:",null,null,null,"MIX TYPE:"]
[null,null,"MATERIAL NAME:"]
[null,null,"PRODUCER:"]
[null,null,"AREA ENGINEER:",null,null,null,"PROJECT MANAGER:"]
[]
[null,null,"COURSE\\LIFT:",null,"STATION:",null,null,"DIST. FROM CL:"]
[]
[]
[null,null,null,null,"Select Method for Determining Stability:"]
[]
[null,"DETERMINING HVEEM STABILITY OF BITUMINOUS MIXTURES "]
[null,"Tex-208-F"]
[null,"Asphalt Content,(%):",null,null,"Spec. Requirement,(%):"]
[]
[null,"Specimen Density,(%):"]
[]
[null,"Specimen","Specimen ID","Specimen Height (in)","Lateral Pressure (psi)","Final Displacement (in)","Hveem Stability,(%)","Hveem Remarks",null,"Average Hveem Stability,(%)"]
[null,1,null,null,null,null,{"$f":"IF(AND(D31<>0,E31<>0,F31<>0),(22.2/(((E31*10*F31)/(400-E31))+0.222))-20.1*(2.3125-D31),\"\")","v":""},null,null,{"$f":"IF(ISERROR(AVERAGE(G31:G35)),\"\",AVERAGE(G31:G35))","v":""}]
[null,2,null,null,null,null,{"$f":"IF(AND(D32<>0,E32<>0,F32<>0),(22.2/(((E32*10*F32)/(400-E32))+0.222))-20.1*(2.3125-D32),\"\")","v":""}]
[null,3,null,null,null,null,{"$f":"IF(AND(D33<>0,E33<>0,F33<>0),(22.2/(((E33*10*F33)/(400-E33))+0.222))-20.1*(2.3125-D33),\"\")","v":""}]
[null,4,null,null,null,null,{"$f":"IF(AND(D34<>0,E34<>0,F34<>0),(22.2/(((E34*10*F34)/(400-E34))+0.222))-20.1*(2.3125-D34),\"\")","v":""}]
[null,5,null,null,null,null,{"$f":"IF(AND(D35<>0,E35<>0,F35<>0),(22.2/(((E35*10*F35)/(400-E35))+0.222))-20.1*(2.3125-D35),\"\")","v":""}]
[]
[]
[null,"DETERMINING STATIC CREEP OF BITUMINOUS MIXTURES "]
[null,"Tex-231-F"]
[null,null,{"$f":"\"Average Permanent Strain, \" & IF(SpecYear=\"\",\"\",IF(SpecYear=\"1995\",\"mm/mm\",\"in/in\")) & \":\"","v":"Average Permanent Strain, :"}]
[null,null,{"$f":"\"Average Creep Slope, \" & IF(SpecYear=\"\",\"\",IF(SpecYear=\"1995\",\"mm/mm/sec\",\"in/in/sec\")) & \":\"","v":"Average Creep Slope, :"}]
[null,null,{"$f":"\"Average Stiffness, \" & IF(SpecYear=\"\",\"\",IF(SpecYear=\"1995\",\"kPa\",\"psi\")) & \":\"","v":"Average Stiffness, :"}]
[]
[null,"Remarks:",{"$f":"NOW()","v":"2023-08-31T14:27:33.800"}]
[]
[]
[]
[]
[]
[null,"Sample Method:","Sampled By:",null,null,"Sampled Date:"]
[null,"TX222"]
[null,"Test Method:","Tested By:",null,null,"Tested Date:"]
[null,"TX208"]
[]
[null,"TX231"]
[null,"Test Stamp Code:",null,null,"Omit Test:","Completed Date:","Reviewed By:"]
[]
[null,"Locked By:","TxDOT:","District:","Area:"]
[]
[null,"Authorized By:",null,null,"Authorized Date:"]

{"sheet":"RX","index":1,"n_rows":48,"n_cols":9,"rows_kept":48,"cut":false,"hidden":true,"merged":[]}
[46]
["Fld_nbr","Value","Desc_1","Desc_2","Desc_3","Desc_4","Desc_5","Desc_6","Desc_7"]
[1,{"$f":"IF('TEX-208 or 231-F'!$B$45=\"\",\"\",'TEX-208 or 231-F'!$B$45)","v":""},{"$f":"'TEX-208 or 231-F'!$B$44","v":"Remarks:"}]
[2,{"$f":"IF('TEX-208 or 231-F'!$D$19=\"\",\"\",'TEX-208 or 231-F'!$D$19)","v":""},{"$f":"IF('TEX-208 or 231-F'!$C$19=\"\",\"\",'TEX-208 or 231-F'!$C$19)","v":"COURSE\\LIFT:"}]
[3,{"$f":"IF('TEX-208 or 231-F'!$C$53=\"\",\"\",'TEX-208 or 231-F'!$C$53)","v":""},"Tested By ",{"$f":"IF('TEX-208 or 231-F'!$B$53=\"\",\"\",'TEX-208 or 231-F'!$B$53)","v":"TX208"}]
[4,{"$f":"IF('TEX-208 or 231-F'!$F$53=\"\",\"\",'TEX-208 or 231-F'!$F$53)","v":""},"Tested Date ",{"$f":"IF('TEX-208 or 231-F'!$B$53=\"\",\"\",'TEX-208 or 231-F'!$B$53)","v":"TX208"}]
[5,{"$f":"IF('TEX-208 or 231-F'!$C$55=\"\",\"\",'TEX-208 or 231-F'!$C$55)","v":""},"Tested By ",{"$f":"IF('TEX-208 or 231-F'!$B$55=\"\",\"\",'TEX-208 or 231-F'!$B$55)","v":"TX231"}]
[6,{"$f":"IF('TEX-208 or 231-F'!$F$55=\"\",\"\",'TEX-208 or 231-F'!$F$55)","v":""},"Tested Date ",{"$f":"IF('TEX-208 or 231-F'!$B$55=\"\",\"\",'TEX-208 or 231-F'!$B$55)","v":"TX231"}]
[7,{"$f":"IF('TEX-208 or 231-F'!$F$22=\"\",\"\",'TEX-208 or 231-F'!$F$22)","v":""},{"$f":"IF('TEX-208 or 231-F'!$B$6=\"\",\"\",'TEX-208 or 231-F'!$B$6)","v":"TEX-208 or TEX-231-F"},{"$f":"IF('TEX-208 or 231-F'!$E$22=\"\",\"\",'TEX-208 or 231-F'!$E$22)","v":"Select Method for Determining Stability:"}]
[8,{"$f":"IF('TEX-208 or 231-F'!$D$26=\"\",\"\",'TEX-208 or 231-F'!$D$26)","v":""},{"$f":"IF('TEX-208 or 231-F'!$B$25=\"\",\"\",'TEX-208 or 231-F'!$B$25)","v":"Tex-208-F"},{"$f":"IF('TEX-208 or 231-F'!$B$26=\"\",\"\",'TEX-208 or 231-F'!$B$26)","v":"Asphalt Content,(%):"}]
[9,{"$f":"IF('TEX-208 or 231-F'!$G$26=\"\",\"\",'TEX-208 or 231-F'!$G$26)","v":""},{"$f":"IF('TEX-208 or 231-F'!$B$25=\"\",\"\",'TEX-208 or 231-F'!$B$25)","v":"Tex-208-F"},{"$f":"IF('TEX-208 or 231-F'!$E$26=\"\",\"\",'TEX-208 or 231-F'!$E$26)","v":"Spec. Requirement,(%):"}]
[10,{"$f":"IF('TEX-208 or 231-F'!$D$28=\"\",\"\",'TEX-208 or 231-F'!$D$28)","v":""},{"$f":"IF('TEX-208 or 231-F'!$B$25=\"\",\"\",'TEX-208 or 231-F'!$B$25)","v":"Tex-208-F"},{"$f":"IF('TEX-208 or 231-F'!$B$28=\"\",\"\",'TEX-208 or 231-F'!$B$28)","v":"Specimen Density,(%):"}]
[11,{"$f":"IF('TEX-208 or 231-F'!$C$31=\"\",\"\",'TEX-208 or 231-F'!$C$31)","v":""},{"$f":"IF('TEX-208 or 231-F'!$B$25=\"\",\"\",'TEX-208 or 231-F'!$B$25)","v":"Tex-208-F"},{"$f":"IF('TEX-208 or 231-F'!$C$30=\"\",\"\",'TEX-208 or 231-F'!$C$30)","v":"Specimen ID"},{"$f":"IF('TEX-208 or 231-F'!$B$30=\"\",\"\",'TEX-208 or 231-F'!$B$30)","v":"Specimen"},{"$f":"IF('TEX-208 or 231-F'!$B$31=\"\",\"\",'TEX-208 or 231-F'!$B$31)","v":1}]
[12,{"$f":"IF('TEX-208 or 231-F'!$D$31=\"\",\"\",'TEX-208 or 231-F'!$D$31)","v":""},{"$f":"IF('TEX-208 or 231-F'!$B$25=\"\",\"\",'TEX-208 or 231-F'!$B$25)","v":"Tex-208-F"},{"$f":"IF('TEX-208 or 231-F'!$D$30=\"\",\"\",'TEX-208 or 231-F'!$D$30)","v":"Specimen Height (in)"},{"$f":"IF('TEX-208 or 231-F'!$B$30=\"\",\"\",'TEX-208 or 231-F'!$B$30)","v":"Specimen"},{"$f":"IF('TEX-208 or 231-F'!$B$31=\"\",\"\",'TEX-208 or 231-F'!$B$31)","v":1}]
[13,{"$f":"IF('TEX-208 or 231-F'!$E$31=\"\",\"\",'TEX-208 or 231-F'!$E$31)","v":""},{"$f":"IF('TEX-208 or 231-F'!$B$25=\"\",\"\",'TEX-208 or 231-F'!$B$25)","v":"Tex-208-F"},{"$f":"IF('TEX-208 or 231-F'!$E$30=\"\",\"\",'TEX-208 or 231-F'!$E$30)","v":"Lateral Pressure (psi)"},{"$f":"IF('TEX-208 or 231-F'!$B$30=\"\",\"\",'TEX-208 or 231-F'!$B$30)","v":"Specimen"},{"$f":"IF('TEX-208 or 231-F'!$B$31=\"\",\"\",'TEX-208 or 231-F'!$B$31)","v":1}]
[14,{"$f":"IF('TEX-208 or 231-F'!$F$31=\"\",\"\",'TEX-208 or 231-F'!$F$31)","v":""},{"$f":"IF('TEX-208 or 231-F'!$B$25=\"\",\"\",'TEX-208 or 231-F'!$B$25)","v":"Tex-208-F"},{"$f":"IF('TEX-208 or 231-F'!$F$30=\"\",\"\",'TEX-208 or 231-F'!$F$30)","v":"Final Displacement (in)"},{"$f":"IF('TEX-208 or 231-F'!$B$30=\"\",\"\",'TEX-208 or 231-F'!$B$30)","v":"Specimen"},{"$f":"IF('TEX-208 or 231-F'!$B$31=\"\",\"\",'TEX-208 or 231-F'!$B$31)","v":1}]
[15,{"$f":"IF('TEX-208 or 231-F'!$G$31=\"\",\"\",'TEX-208 or 231-F'!$G$31)","v":""},{"$f":"IF('TEX-208 or 231-F'!$B$25=\"\",\"\",'TEX-208 or 231-F'!$B$25)","v":"Tex-208-F"},{"$f":"IF('TEX-208 or 231-F'!$G$30=\"\",\"\",'TEX-208 or 231-F'!$G$30)","v":"Hveem Stability,(%)"},{"$f":"IF('TEX-208 or 231-F'!$B$30=\"\",\"\",'TEX-208 or 231-F'!$B$30)","v":"Specimen"},{"$f":"IF('TEX-208 or 231-F'!$B$31=\"\",\"\",'TEX-208 or 231-F'!$B$31)","v":1}]
[16,{"$f":"IF('TEX-208 or 231-F'!$H$31=\"\",\"\",'TEX-208 or 231-F'!$H$31)","v":""},{"$f":"IF('TEX-208 or 231-F'!$B$25=\"\",\"\",'TEX-208 or 231-F'!$B$25)","v":"Tex-208-F"},{"$f":"IF('TEX-208 or 231-F'!$H$30=\"\",\"\",'TEX-208 or 231-F'!$H$30)","v":"Hveem Remarks"},{"$f":"IF('TEX-208 or 231-F'!$B$30=\"\",\"\",'TEX-208 or 231-F'!$B$30)","v":"Specimen"},{"$f":"IF('TEX-208 or 231-F'!$B$31=\"\",\"\",'TEX-208 or 231-F'!$B$31)","v":1}]
[17,{"$f":"IF('TEX-208 or 231-F'!$J$31=\"\",\"\",'TEX-208 or 231-F'!$J$31)","v":""},{"$f":"IF('TEX-208 or 231-F'!$B$25=\"\",\"\",'TEX-208 or 231-F'!$B$25)","v":"Tex-208-F"},{"$f":"IF('TEX-208 or 231-F'!$J$30=\"\",\"\",'TEX-208 or 231-F'!$J$30)","v":"Average Hveem Stability,(%)"},{"$f":"IF('TEX-208 or 231-F'!$B$30=\"\",\"\",'TEX-208 or 231-F'!$B$30)","v":"Specimen"},{"$f":"IF('TEX-208 or 231-F'!$B$31=\"\",\"\",'TEX-208 or 231-F'!$B$31)","v":1}]
[18,{"$f":"IF('TEX-208 or 231-F'!$C$32=\"\",\"\",'TEX-208 or 231-F'!$C$32)","v":""},{"$f":"IF('TEX-208 or 231-F'!$B$25=\"\",\"\",'TEX-208 or 231-F'!$B$25)","v":"Tex-208-F"},{"$f":"IF('TEX-208 or 231-F'!$C$30=\"\",\"\",'TEX-208 or 231-F'!$C$30)","v":"Specimen ID"},{"$f":"IF('TEX-208 or 231-F'!$B$30=\"\",\"\",'TEX-208 or 231-F'!$B$30)","v":"Specimen"},{"$f":"IF('TEX-208 or 231-F'!$B$32=\"\",\"\",'TEX-208 or 231-F'!$B$32)","v":2}]
[19,{"$f":"IF('TEX-208 or 231-F'!$D$32=\"\",\"\",'TEX-208 or 231-F'!$D$32)","v":""},{"$f":"IF('TEX-208 or 231-F'!$B$25=\"\",\"\",'TEX-208 or 231-F'!$B$25)","v":"Tex-208-F"},{"$f":"IF('TEX-208 or 231-F'!$D$30=\"\",\"\",'TEX-208 or 231-F'!$D$30)","v":"Specimen Height (in)"},{"$f":"IF('TEX-208 or 231-F'!$B$30=\"\",\"\",'TEX-208 or 231-F'!$B$30)","v":"Specimen"},{"$f":"IF('TEX-208 or 231-F'!$B$32=\"\",\"\",'TEX-208 or 231-F'!$B$32)","v":2}]
[20,{"$f":"IF('TEX-208 or 231-F'!$E$32=\"\",\"\",'TEX-208 or 231-F'!$E$32)","v":""},{"$f":"IF('TEX-208 or 231-F'!$B$25=\"\",\"\",'TEX-208 or 231-F'!$B$25)","v":"Tex-208-F"},{"$f":"IF('TEX-208 or 231-F'!$E$30=\"\",\"\",'TEX-208 or 231-F'!$E$30)","v":"Lateral Pressure (psi)"},{"$f":"IF('TEX-208 or 231-F'!$B$30=\"\",\"\",'TEX-208 or 231-F'!$B$30)","v":"Specimen"},{"$f":"IF('TEX-208 or 231-F'!$B$32=\"\",\"\",'TEX-208 or 231-F'!$B$32)","v":2}]
[21,{"$f":"IF('TEX-208 or 231-F'!$F$32=\"\",\"\",'TEX-208 or 231-F'!$F$32)","v":""},{"$f":"IF('TEX-208 or 231-F'!$B$25=\"\",\"\",'TEX-208 or 231-F'!$B$25)","v":"Tex-208-F"},{"$f":"IF('TEX-208 or 231-F'!$F$30=\"\",\"\",'TEX-208 or 231-F'!$F$30)","v":"Final Displacement (in)"},{"$f":"IF('TEX-208 or 231-F'!$B$30=\"\",\"\",'TEX-208 or 231-F'!$B$30)","v":"Specimen"},{"$f":"IF('TEX-208 or 231-F'!$B$32=\"\",\"\",'TEX-208 or 231-F'!$B$32)","v":2}]
[22,{"$f":"IF('TEX-208 or 231-F'!$G$32=\"\",\"\",'TEX-208 or 231-F'!$G$32)","v":""},{"$f":"IF('TEX-208 or 231-F'!$B$25=\"\",\"\",'TEX-208 or 231-F'!$B$25)","v":"Tex-208-F"},{"$f":"IF('TEX-208 or 231-F'!$G$30=\"\",\"\",'TEX-208 or 231-F'!$G$30)","v":"Hveem Stability,(%)"},{"$f":"IF('TEX-208 or 231-F'!$B$30=\"\",\"\",'TEX-208 or 231-F'!$B$30)","v":"Specimen"},{"$f":"IF('TEX-208 or 231-F'!$B$32=\"\",\"\",'TEX-208 or 231-F'!$B$32)","v":2}]
[23,{"$f":"IF('TEX-208 or 231-F'!$H$32=\"\",\"\",'TEX-208 or 231-F'!$H$32)","v":""},{"$f":"IF('TEX-208 or 231-F'!$B$25=\"\",\"\",'TEX-208 or 231-F'!$B$25)","v":"Tex-208-F"},{"$f":"IF('TEX-208 or 231-F'!$H$30=\"\",\"\",'TEX-208 or 231-F'!$H$30)","v":"Hveem Remarks"},{"$f":"IF('TEX-208 or 231-F'!$B$30=\"\",\"\",'TEX-208 or 231-F'!$B$30)","v":"Specimen"},{"$f":"IF('TEX-208 or 231-F'!$B$32=\"\",\"\",'TEX-208 or 231-F'!$B$32)","v":2}]
[24,{"$f":"IF('TEX-208 or 231-F'!$C$33=\"\",\"\",'TEX-208 or 231-F'!$C$33)","v":""},{"$f":"IF('TEX-208 or 231-F'!$B$25=\"\",\"\",'TEX-208 or 231-F'!$B$25)","v":"Tex-208-F"},{"$f":"IF('TEX-208 or 231-F'!$C$30=\"\",\"\",'TEX-208 or 231-F'!$C$30)","v":"Specimen ID"},{"$f":"IF('TEX-208 or 231-F'!$B$30=\"\",\"\",'TEX-208 or 231-F'!$B$30)","v":"Specimen"},{"$f":"IF('TEX-208 or 231-F'!$B$33=\"\",\"\",'TEX-208 or 231-F'!$B$33)","v":3}]
[25,{"$f":"IF('TEX-208 or 231-F'!$D$33=\"\",\"\",'TEX-208 or 231-F'!$D$33)","v":""},{"$f":"IF('TEX-208 or 231-F'!$B$25=\"\",\"\",'TEX-208 or 231-F'!$B$25)","v":"Tex-208-F"},{"$f":"IF('TEX-208 or 231-F'!$D$30=\"\",\"\",'TEX-208 or 231-F'!$D$30)","v":"Specimen Height (in)"},{"$f":"IF('TEX-208 or 231-F'!$B$30=\"\",\"\",'TEX-208 or 231-F'!$B$30)","v":"Specimen"},{"$f":"IF('TEX-208 or 231-F'!$B$33=\"\",\"\",'TEX-208 or 231-F'!$B$33)","v":3}]
[26,{"$f":"IF('TEX-208 or 231-F'!$E$33=\"\",\"\",'TEX-208 or 231-F'!$E$33)","v":""},{"$f":"IF('TEX-208 or 231-F'!$B$25=\"\",\"\",'TEX-208 or 231-F'!$B$25)","v":"Tex-208-F"},{"$f":"IF('TEX-208 or 231-F'!$E$30=\"\",\"\",'TEX-208 or 231-F'!$E$30)","v":"Lateral Pressure (psi)"},{"$f":"IF('TEX-208 or 231-F'!$B$30=\"\",\"\",'TEX-208 or 231-F'!$B$30)","v":"Specimen"},{"$f":"IF('TEX-208 or 231-F'!$B$33=\"\",\"\",'TEX-208 or 231-F'!$B$33)","v":3}]
[27,{"$f":"IF('TEX-208 or 231-F'!$F$33=\"\",\"\",'TEX-208 or 231-F'!$F$33)","v":""},{"$f":"IF('TEX-208 or 231-F'!$B$25=\"\",\"\",'TEX-208 or 231-F'!$B$25)","v":"Tex-208-F"},{"$f":"IF('TEX-208 or 231-F'!$F$30=\"\",\"\",'TEX-208 or 231-F'!$F$30)","v":"Final Displacement (in)"},{"$f":"IF('TEX-208 or 231-F'!$B$30=\"\",\"\",'TEX-208 or 231-F'!$B$30)","v":"Specimen"},{"$f":"IF('TEX-208 or 231-F'!$B$33=\"\",\"\",'TEX-208 or 231-F'!$B$33)","v":3}]
[28,{"$f":"IF('TEX-208 or 231-F'!$G$33=\"\",\"\",'TEX-208 or 231-F'!$G$33)","v":""},{"$f":"IF('TEX-208 or 231-F'!$B$25=\"\",\"\",'TEX-208 or 231-F'!$B$25)","v":"Tex-208-F"},{"$f":"IF('TEX-208 or 231-F'!$G$30=\"\",\"\",'TEX-208 or 231-F'!$G$30)","v":"Hveem Stability,(%)"},{"$f":"IF('TEX-208 or 231-F'!$B$30=\"\",\"\",'TEX-208 or 231-F'!$B$30)","v":"Specimen"},{"$f":"IF('TEX-208 or 231-F'!$B$33=\"\",\"\",'TEX-208 or 231-F'!$B$33)","v":3}]
[29,{"$f":"IF('TEX-208 or 231-F'!$H$33=\"\",\"\",'TEX-208 or 231-F'!$H$33)","v":""},{"$f":"IF('TEX-208 or 231-F'!$B$25=\"\",\"\",'TEX-208 or 231-F'!$B$25)","v":"Tex-208-F"},{"$f":"IF('TEX-208 or 231-F'!$H$30=\"\",\"\",'TEX-208 or 231-F'!$H$30)","v":"Hveem Remarks"},{"$f":"IF('TEX-208 or 231-F'!$B$30=\"\",\"\",'TEX-208 or 231-F'!$B$30)","v":"Specimen"},{"$f":"IF('TEX-208 or 231-F'!$B$33=\"\",\"\",'TEX-208 or 231-F'!$B$33)","v":3}]
[30,{"$f":"IF('TEX-208 or 231-F'!$C$34=\"\",\"\",'TEX-208 or 231-F'!$C$34)","v":""},{"$f":"IF('TEX-208 or 231-F'!$B$25=\"\",\"\",'TEX-208 or 231-F'!$B$25)","v":"Tex-208-F"},{"$f":"IF('TEX-208 or 231-F'!$C$30=\"\",\"\",'TEX-208 or 231-F'!$C$30)","v":"Specimen ID"},{"$f":"IF('TEX-208 or 231-F'!$B$30=\"\",\"\",'TEX-208 or 231-F'!$B$30)","v":"Specimen"},{"$f":"IF('TEX-208 or 231-F'!$B$34=\"\",\"\",'TEX-208 or 231-F'!$B$34)","v":4}]
[31,{"$f":"IF('TEX-208 or 231-F'!$D$34=\"\",\"\",'TEX-208 or 231-F'!$D$34)","v":""},{"$f":"IF('TEX-208 or 231-F'!$B$25=\"\",\"\",'TEX-208 or 231-F'!$B$25)","v":"Tex-208-F"},{"$f":"IF('TEX-208 or 231-F'!$D$30=\"\",\"\",'TEX-208 or 231-F'!$D$30)","v":"Specimen Height (in)"},{"$f":"IF('TEX-208 or 231-F'!$B$30=\"\",\"\",'TEX-208 or 231-F'!$B$30)","v":"Specimen"},{"$f":"IF('TEX-208 or 231-F'!$B$34=\"\",\"\",'TEX-208 or 231-F'!$B$34)","v":4}]
[32,{"$f":"IF('TEX-208 or 231-F'!$E$34=\"\",\"\",'TEX-208 or 231-F'!$E$34)","v":""},{"$f":"IF('TEX-208 or 231-F'!$B$25=\"\",\"\",'TEX-208 or 231-F'!$B$25)","v":"Tex-208-F"},{"$f":"IF('TEX-208 or 231-F'!$E$30=\"\",\"\",'TEX-208 or 231-F'!$E$30)","v":"Lateral Pressure (psi)"},{"$f":"IF('TEX-208 or 231-F'!$B$30=\"\",\"\",'TEX-208 or 231-F'!$B$30)","v":"Specimen"},{"$f":"IF('TEX-208 or 231-F'!$B$34=\"\",\"\",'TEX-208 or 231-F'!$B$34)","v":4}]
[33,{"$f":"IF('TEX-208 or 231-F'!$F$34=\"\",\"\",'TEX-208 or 231-F'!$F$34)","v":""},{"$f":"IF('TEX-208 or 231-F'!$B$25=\"\",\"\",'TEX-208 or 231-F'!$B$25)","v":"Tex-208-F"},{"$f":"IF('TEX-208 or 231-F'!$F$30=\"\",\"\",'TEX-208 or 231-F'!$F$30)","v":"Final Displacement (in)"},{"$f":"IF('TEX-208 or 231-F'!$B$30=\"\",\"\",'TEX-208 or 231-F'!$B$30)","v":"Specimen"},{"$f":"IF('TEX-208 or 231-F'!$B$34=\"\",\"\",'TEX-208 or 231-F'!$B$34)","v":4}]
[34,{"$f":"IF('TEX-208 or 231-F'!$G$34=\"\",\"\",'TEX-208 or 231-F'!$G$34)","v":""},{"$f":"IF('TEX-208 or 231-F'!$B$25=\"\",\"\",'TEX-208 or 231-F'!$B$25)","v":"Tex-208-F"},{"$f":"IF('TEX-208 or 231-F'!$G$30=\"\",\"\",'TEX-208 or 231-F'!$G$30)","v":"Hveem Stability,(%)"},{"$f":"IF('TEX-208 or 231-F'!$B$30=\"\",\"\",'TEX-208 or 231-F'!$B$30)","v":"Specimen"},{"$f":"IF('TEX-208 or 231-F'!$B$34=\"\",\"\",'TEX-208 or 231-F'!$B$34)","v":4}]
[35,{"$f":"IF('TEX-208 or 231-F'!$H$34=\"\",\"\",'TEX-208 or 231-F'!$H$34)","v":""},{"$f":"IF('TEX-208 or 231-F'!$B$25=\"\",\"\",'TEX-208 or 231-F'!$B$25)","v":"Tex-208-F"},{"$f":"IF('TEX-208 or 231-F'!$H$30=\"\",\"\",'TEX-208 or 231-F'!$H$30)","v":"Hveem Remarks"},{"$f":"IF('TEX-208 or 231-F'!$B$30=\"\",\"\",'TEX-208 or 231-F'!$B$30)","v":"Specimen"},{"$f":"IF('TEX-208 or 231-F'!$B$34=\"\",\"\",'TEX-208 or 231-F'!$B$34)","v":4}]
[36,{"$f":"IF('TEX-208 or 231-F'!$C$35=\"\",\"\",'TEX-208 or 231-F'!$C$35)","v":""},{"$f":"IF('TEX-208 or 231-F'!$B$25=\"\",\"\",'TEX-208 or 231-F'!$B$25)","v":"Tex-208-F"},{"$f":"IF('TEX-208 or 231-F'!$C$30=\"\",\"\",'TEX-208 or 231-F'!$C$30)","v":"Specimen ID"},{"$f":"IF('TEX-208 or 231-F'!$B$30=\"\",\"\",'TEX-208 or 231-F'!$B$30)","v":"Specimen"},{"$f":"IF('TEX-208 or 231-F'!$B$35=\"\",\"\",'TEX-208 or 231-F'!$B$35)","v":5}]
[37,{"$f":"IF('TEX-208 or 231-F'!$D$35=\"\",\"\",'TEX-208 or 231-F'!$D$35)","v":""},{"$f":"IF('TEX-208 or 231-F'!$B$25=\"\",\"\",'TEX-208 or 231-F'!$B$25)","v":"Tex-208-F"},{"$f":"IF('TEX-208 or 231-F'!$D$30=\"\",\"\",'TEX-208 or 231-F'!$D$30)","v":"Specimen Height (in)"},{"$f":"IF('TEX-208 or 231-F'!$B$30=\"\",\"\",'TEX-208 or 231-F'!$B$30)","v":"Specimen"},{"$f":"IF('TEX-208 or 231-F'!$B$35=\"\",\"\",'TEX-208 or 231-F'!$B$35)","v":5}]
[38,{"$f":"IF('TEX-208 or 231-F'!$E$35=\"\",\"\",'TEX-208 or 231-F'!$E$35)","v":""},{"$f":"IF('TEX-208 or 231-F'!$B$25=\"\",\"\",'TEX-208 or 231-F'!$B$25)","v":"Tex-208-F"},{"$f":"IF('TEX-208 or 231-F'!$E$30=\"\",\"\",'TEX-208 or 231-F'!$E$30)","v":"Lateral Pressure (psi)"},{"$f":"IF('TEX-208 or 231-F'!$B$30=\"\",\"\",'TEX-208 or 231-F'!$B$30)","v":"Specimen"},{"$f":"IF('TEX-208 or 231-F'!$B$35=\"\",\"\",'TEX-208 or 231-F'!$B$35)","v":5}]
[39,{"$f":"IF('TEX-208 or 231-F'!$F$35=\"\",\"\",'TEX-208 or 231-F'!$F$35)","v":""},{"$f":"IF('TEX-208 or 231-F'!$B$25=\"\",\"\",'TEX-208 or 231-F'!$B$25)","v":"Tex-208-F"},{"$f":"IF('TEX-208 or 231-F'!$F$30=\"\",\"\",'TEX-208 or 231-F'!$F$30)","v":"Final Displacement (in)"},{"$f":"IF('TEX-208 or 231-F'!$B$30=\"\",\"\",'TEX-208 or 231-F'!$B$30)","v":"Specimen"},{"$f":"IF('TEX-208 or 231-F'!$B$35=\"\",\"\",'TEX-208 or 231-F'!$B$35)","v":5}]
[40,{"$f":"IF('TEX-208 or 231-F'!$G$35=\"\",\"\",'TEX-208 or 231-F'!$G$35)","v":""},{"$f":"IF('TEX-208 or 231-F'!$B$25=\"\",\"\",'TEX-208 or 231-F'!$B$25)","v":"Tex-208-F"},{"$f":"IF('TEX-208 or 231-F'!$G$30=\"\",\"\",'TEX-208 or 231-F'!$G$30)","v":"Hveem Stability,(%)"},{"$f":"IF('TEX-208 or 231-F'!$B$30=\"\",\"\",'TEX-208 or 231-F'!$B$30)","v":"Specimen"},{"$f":"IF('TEX-208 or 231-F'!$B$35=\"\",\"\",'TEX-208 or 231-F'!$B$35)","v":5}]
[41,{"$f":"IF('TEX-208 or 231-F'!$H$35=\"\",\"\",'TEX-208 or 231-F'!$H$35)","v":""},{"$f":"IF('TEX-208 or 231-F'!$B$25=\"\",\"\",'TEX-208 or 231-F'!$B$25)","v":"Tex-208-F"},{"$f":"IF('TEX-208 or 231-F'!$H$30=\"\",\"\",'TEX-208 or 231-F'!$H$30)","v":"Hveem Remarks"},{"$f":"IF('TEX-208 or 231-F'!$B$30=\"\",\"\",'TEX-208 or 231-F'!$B$30)","v":"Specimen"},{"$f":"IF('TEX-208 or 231-F'!$B$35=\"\",\"\",'TEX-208 or 231-F'!$B$35)","v":5}]
[42,{"$f":"IF('TEX-208 or 231-F'!$G$40=\"\",\"\",'TEX-208 or 231-F'!$G$40)","v":""},{"$f":"IF('TEX-208 or 231-F'!$B$39=\"\",\"\",'TEX-208 or 231-F'!$B$39)","v":"Tex-231-F"},{"$f":"IF('TEX-208 or 231-F'!$C$40=\"\",\"\",'TEX-208 or 231-F'!$C$40)","v":"Average Permanent Strain, :"}]
[43,{"$f":"IF('TEX-208 or 231-F'!$G$41=\"\",\"\",'TEX-208 or 231-F'!$G$41)","v":""},{"$f":"IF('TEX-208 or 231-F'!$B$39=\"\",\"\",'TEX-208 or 231-F'!$B$39)","v":"Tex-231-F"},{"$f":"IF('TEX-208 or 231-F'!$C$41=\"\",\"\",'TEX-208 or 231-F'!$C$41)","v":"Average Creep Slope, :"}]
[44,{"$f":"IF('TEX-208 or 231-F'!$G$42=\"\",\"\",'TEX-208 or 231-F'!$G$42)","v":""},{"$f":"IF('TEX-208 or 231-F'!$B$39=\"\",\"\",'TEX-208 or 231-F'!$B$39)","v":"Tex-231-F"},{"$f":"IF('TEX-208 or 231-F'!$C$42=\"\",\"\",'TEX-208 or 231-F'!$C$42)","v":"Average Stiffness, :"}]
[45,{"$f":"IF('TEX-208 or 231-F'!$C$51=\"\",\"\",'TEX-208 or 231-F'!$C$51)","v":""},"Sampled By ",{"$f":"IF('TEX-208 or 231-F'!$B$51=\"\",\"\",'TEX-208 or 231-F'!$B$51)","v":"TX222"}]
[46,{"$f":"IF('TEX-208 or 231-F'!$F$51=\"\",\"\",'TEX-208 or 231-F'!$F$51)","v":""},"Sampled Date ",{"$f":"IF('TEX-208 or 231-F'!$B$51=\"\",\"\",'TEX-208 or 231-F'!$B$51)","v":"TX222"}]

{"sheet":"Sheet1","index":2,"n_rows":9,"n_cols":2,"rows_kept":9,"cut":false,"hidden":true,"merged":[]}
[]
["tbl id","tbl description"]
[1,"ONLY  TWO  SPECIMENS  RECEIVED"]
[2,"SPECIMEN  DAMAGED  DURING  TEST"]
[3,"SPECIMEN  DAMAGED  DURING  TRANSIT"]
[4,"SPECIMEN  EDGES  TOO  ROUGH  TO  TEST"]
[5,"STABILITY TOO  LOW  TO  CALCULATE"]
[101,"AVERAGE IS FOR ONLY ONE SPECIMEN"]
[102,"AVERAGE IS FOR ONLY TWO SPECIMENS"]

{"sheet":"spcyr","index":3,"n_rows":6,"n_cols":3,"rows_kept":6,"cut":false,"hidden":true,"merged":[]}
["spec1993","spec1995","spec2004"]
["A","A"]
["B","B"]
["C","C"]
["D","D"]
["F","F"]