{"text_format":"1","workbook":"xlsx","n_sheets":4,"sheets":["Tex-226-F","spcyr","RX","Compactor"],"not_rendered":{"charts":0,"images":1,"macros":1,"external_links":0,"defined_names":91,"comments":1,"pivot_tables":0},"unopened":[],"bounds":{"document_bytes":16777216,"sheet_cells":100000,"rows_first":2000,"rows_last":500,"rows_between":2000,"halvings":0,"cell_chars":16384,"cell_head_chars":4096},"cells_cut":0,"cells_raw":0,"read":"whole","date_system":"1900"}

{"sheet":"Tex-226-F","index":0,"n_rows":47,"n_cols":11,"rows_kept":47,"cut":false,"hidden":false,"merged":[[14,3,14,8],[19,7,19,8],[27,1,27,2],[28,1,28,2],[28,3,28,6],[21,1,21,2],[15,3,15,8],[20,6,20,7],[22,1,22,2],[23,1,23,2],[26,1,26,2],[24,1,24,2],[19,1,19,2],[19,3,19,4],[19,5,19,6],[25,1,25,2],[16,7,16,8],[16,3,16,4],[46,1,46,3],[42,6,42,8],[32,1,33,8],[40,2,40,4],[35,1,35,8],[34,1,34,8],[39,2,39,4],[42,1,42,3],[37,2,37,4],[38,2,38,4],[11,3,11,4],[12,3,12,4],[13,3,13,4],[0,0,0,1],[7,7,7,8],[10,7,10,8],[7,3,7,4],[8,3,8,4],[13,7,13,8],[8,7,8,8],[10,3,10,4],[9,7,9,8],[9,3,9,4],[12,7,12,8],[11,7,11,8]]}
["TxDOT Manuals >",null,null,"Tex-235-F"]
[null,"TEXAS DEPARTMENT OF TRANSPORTATION",null,null,null,null,null,null,null,null,33]
[null,null,null,null,null,null,null,null,null,null,1]
[null,null,null,null,null,null,null,null,null,null,"tx226.xlsm::45574.637454"]
[null,{"$f":"UPPER(\"Indirect Tensile Strength Test\")","v":"INDIRECT TENSILE STRENGTH TEST"}]
[null,"Tex-226-F"]
[null,null,null,null,null,null,null,null,{"$f":"\"TEX-226 :: File Version: \" & TEXT(MID(sn,SEARCH(\"::\",sn,1)+2,20),\"mm/dd/yy hh:mm:ss\")","v":"TEX-226 :: File Version: 10/09/24 15:17:56"}]
[null,null,"SAMPLE ID:",null,null,null,"SAMPLED DATE:"]
[null,null,"TEST NUMBER:",null,null,null,"LETTING DATE:"]
[null,null,"SAMPLE STATUS:",null,null,null,"CONTROLLING CSJ:"]
[null,null,"COUNTY:",null,null,null,"SPEC YEAR:"]
[null,null,"SAMPLED BY:",null,null,null,"SPEC ITEM:"]
[null,null,"SAMPLE LOCATION:",null,null,null,"SPECIAL PROVISION:"]
[null,null,"MATERIAL CODE:",null,null,null,"MIX TYPE:"]
[null,null,"MATERIAL NAME:"]
[null,null,"PRODUCER:"]
[null,null,"AREA ENGINEER:",null,null,null,"PROJECT MANAGER:"]
[]
[null,null,"COURSE\\LIFT:",null,"STATION:",null,null,"DIST. FROM CL:"]
[null,"TEST TYPE:",null,null,null,"GYRATORY COMPACTOR:"]
[]
[null,"Specimen:",null,1,2,3,4]
[null,"Specimen ID:"]
[null,"Density, %:",null,null,null,null,null,{"$f":"IF(AND(OR(TestType=\"Mix Design\",TestType=\"Production\"),OR(AND(E24<>\"\",OR(E24<92,E24>94)),AND(D24<>\"\",OR(D24<92,D24>94)),AND(F24<>\"\",OR(F24<92,F24>94)),AND(G24<>\"\",OR(G24<92,G24>94)))),\"<<Out of density tolerance\",\"\")","v":""}]
[null,"Height (in.):",null,null,null,null,null,{"$f":"IF(AND(OR(TestType=\"Mix Design\",TestType=\"Production\"),OR(AND(Compactor=\"SGC\",OR(AND(D25<>\"\",OR(D25<2.3,D25>2.5)),AND(E25<>\"\",OR(E25<2.3,E25>2.5)),AND(F25<>\"\",OR(F25<2.3,F25>2.5)),AND(G25<>\"\",OR(G25<2.3,G25>2.5)))),AND(Compactor=\"TGC\",OR(AND(D25<>\"\",OR(D25<1.94,D25>2.06)),AND(E25<>\"\",OR(E25<1.94,E25>2.06)),AND(F25<>\"\",OR(F25<1.94,F25>2.06)),AND(G25<>\"\",OR(G25<1.94, G25>2.06)))))),\"<<Out of specimen heigth tolerance\",\"\")","v":""}]
[null,"Load (lbs.):"]
[null,"Diameter (in):"]
[null,"Strength (psi.):",null,{"$f":"+IF(D25=\"\",\"\", ((2*D26)/(3.14*D25*D27)))","v":""},{"$f":"+IF(E25=\"\",\"\", ((2*E26)/(3.14*E25*E27)))","v":""},{"$f":"+IF(F25=\"\",\"\", ((2*F26)/(3.14*F25*F27)))","v":""},{"$f":"+IF(G25=\"\",\"\", ((2*G26)/(3.14*G25*G27)))","v":""}]
[null,"Average Strength, (psi):",null,{"$f":"IF(ISERROR(AVERAGE(D28:G28)),\"\",AVERAGE(D28:G28))","v":""},null,null,null,{"$f":"IF(AND(D29<>\"\",OR(D29<85,D29>200)),\"<<Out of specification\",\"\")","v":""}]
[]
[]
[null,"Remarks:",{"$f":"NOW()","v":"2024-10-09T15:17:56.710"}]
[]
[]
[]
[]
[]
[null,"Sample Method:","Sampled By:",null,null,"Sampled Date:"]
[null,"TX222"]
[null,"Test Method:","Tested By:",null,null,"Tested Date:"]
[null,"TX226"]
[null,"Test Stamp Code:",null,null,"Omit Test:","Completed Date:","Reviewed By:"]
[]
[null,"Locked By:","TxDOT:","District:","Area:"]
[]
[null,"Authorized By:",null,null,"Authorized Date:"]
[null,null,null,null,null,{"$f":"IF(OR(AuthorizedDate>42563,AuthorizedDate=\"\"),3,IF(AuthorizedDate>40338,2,1))","v":3}]

{"sheet":"spcyr","index":1,"n_rows":33,"n_cols":7,"rows_kept":33,"cut":false,"hidden":true,"merged":[]}
[null,null,null,"Spec2004","Spec2024"]
["spec1993","spec1995","spec2004","Version #2",null,null,"Compactor"]
[null,null,"CMHB C","ITEM340_A_Coarse_Base","ITEM341_B_Fine_Base",null,"SGC"]
[null,null,"CMHB F","ITEM340_B_Fine_Base","ITEM341_C_Coarse_Surface",null,"TGC"]
[null,null,"SMA C","ITEM340_C_Coarse_Surface","ITEM341_D_Fine_Surface"]
[null,null,"SMA D","ITEM340_D_Fine_Surface","ITEM341_F_Fine_Mixture"]
[null,null,"SMA F","ITEM340_F_Fine_Mixture","ITEM344_SP_B_Intermediate"]
[null,null,"SMAR C","ITEM341_A_Coarse_Base","ITEM344_SP_C_Surface"]
[null,null,"SMAR F","ITEM341_B_Fine_Base","ITEM344_SP_D_Fine_Surface"]
[null,null,"SP A","ITEM341_C_Coarse_Surface","ITEM346_SMA_C_Coarse"]
[null,null,"SP B","ITEM341_D_Fine_Surface","ITEM346_SMA_D_Medium"]
[null,null,"SP C","ITEM341_F_Fine_Mixture","ITEM346_SMA_F_Fine"]
[null,null,"SP D","ITEM344_SP_A_Base","ITEM346_SMAR_F_Fine"]
[null,null,"Type A","ITEM344_SP_B_Intermediate","ITEM347_TOM_C_Coarse"]
[null,null,"Type B","ITEM344_SP_C_Surface","ITEM347_TOM_F_Fine"]
[null,null,"Type C","ITEM344_SP_D_Fine_Surface","CAM"]
[null,null,"Type D","ITEM344_CMHB_C_Coarse_Surface"]
[null,null,"Type F","ITEM344_CMHB_F_Fine_Surface"]
[null,null,"CAM","ITEM346_SMA_C_Coarse"]
[null,null,null,"ITEM346_SMA_D_Medium"]
[null,null,null,"ITEM346_SMA_F_Fine"]
[null,null,null,"ITEM346_SMAR_C_Coarse"]
[null,null,null,"ITEM346_SMAR_F_Fine"]
[null,null,null,"ITEM347_TOM_C_Coarse"]
[null,null,null,"ITEM347_TOM_F_Fine"]
[null,null,null,"CAM"]
[null,null,null,"ITEM3076_B_Fine_Base"]
[null,null,null,"ITEM3076_C_Coarse_Surface"]
[null,null,null,"ITEM3076_D_Fine_Surface"]
[null,null,null,"ITEM3076_F_Fine_Mixture"]
[null,null,null,"ITEM3077_SP_B_Intermediate"]
[null,null,null,"ITEM3077_SP_C_Surface"]
[null,null,null,"ITEM3077_SP_D_Fine_Mixture"]

{"sheet":"RX","index":2,"n_rows":35,"n_cols":9,"rows_kept":35,"cut":false,"hidden":true,"merged":[]}
[33]
["Fld_nbr","Value","Desc_1","Desc_2","Desc_3","Desc_4","Desc_5","Desc_6","Desc_7"]
[1,{"$f":"IF('Tex-226-F'!$B$33=\"\",\"\",'Tex-226-F'!$B$33)","v":""},{"$f":"'Tex-226-F'!$B$32","v":"Remarks:"}]
[2,{"$f":"IF('Tex-226-F'!$D$19=\"\",\"\",'Tex-226-F'!$D$19)","v":""},{"$f":"IF('Tex-226-F'!$C$19=\"\",\"\",'Tex-226-F'!$C$19)","v":"COURSE\\LIFT:"}]
[3,{"$f":"IF('Tex-226-F'!$C$41=\"\",\"\",'Tex-226-F'!$C$41)","v":""},"Tested By ",{"$f":"IF('Tex-226-F'!$B$41=\"\",\"\",'Tex-226-F'!$B$41)","v":"TX226"}]
[4,{"$f":"IF('Tex-226-F'!$F$41=\"\",\"\",'Tex-226-F'!$F$41)","v":""},"Tested Date ",{"$f":"IF('Tex-226-F'!$B$41=\"\",\"\",'Tex-226-F'!$B$41)","v":"TX226"}]
[5,{"$f":"IF('Tex-226-F'!$D$23=\"\",\"\",'Tex-226-F'!$D$23)","v":""},{"$f":"IF('Tex-226-F'!$B$6=\"\",\"\",'Tex-226-F'!$B$6)","v":"Tex-226-F"},{"$f":"IF('Tex-226-F'!$B$23=\"\",\"\",'Tex-226-F'!$B$23)","v":"Specimen ID:"},{"$f":"IF('Tex-226-F'!$B$22=\"\",\"\",'Tex-226-F'!$B$22)","v":"Specimen:"},{"$f":"IF('Tex-226-F'!$D$22=\"\",\"\",'Tex-226-F'!$D$22)","v":1}]
[6,{"$f":"IF('Tex-226-F'!$E$23=\"\",\"\",'Tex-226-F'!$E$23)","v":""},{"$f":"IF('Tex-226-F'!$B$6=\"\",\"\",'Tex-226-F'!$B$6)","v":"Tex-226-F"},{"$f":"IF('Tex-226-F'!$B$23=\"\",\"\",'Tex-226-F'!$B$23)","v":"Specimen ID:"},{"$f":"IF('Tex-226-F'!$B$22=\"\",\"\",'Tex-226-F'!$B$22)","v":"Specimen:"},{"$f":"IF('Tex-226-F'!$E$22=\"\",\"\",'Tex-226-F'!$E$22)","v":2}]
[7,{"$f":"IF('Tex-226-F'!$F$23=\"\",\"\",'Tex-226-F'!$F$23)","v":""},{"$f":"IF('Tex-226-F'!$B$6=\"\",\"\",'Tex-226-F'!$B$6)","v":"Tex-226-F"},{"$f":"IF('Tex-226-F'!$B$23=\"\",\"\",'Tex-226-F'!$B$23)","v":"Specimen ID:"},{"$f":"IF('Tex-226-F'!$B$22=\"\",\"\",'Tex-226-F'!$B$22)","v":"Specimen:"},{"$f":"IF('Tex-226-F'!$F$22=\"\",\"\",'Tex-226-F'!$F$22)","v":3}]
[8,{"$f":"IF('Tex-226-F'!$G$23=\"\",\"\",'Tex-226-F'!$G$23)","v":""},{"$f":"IF('Tex-226-F'!$B$6=\"\",\"\",'Tex-226-F'!$B$6)","v":"Tex-226-F"},{"$f":"IF('Tex-226-F'!$B$23=\"\",\"\",'Tex-226-F'!$B$23)","v":"Specimen ID:"},{"$f":"IF('Tex-226-F'!$B$22=\"\",\"\",'Tex-226-F'!$B$22)","v":"Specimen:"},{"$f":"IF('Tex-226-F'!$G$22=\"\",\"\",'Tex-226-F'!$G$22)","v":4}]
[9,{"$f":"IF('Tex-226-F'!$D$24=\"\",\"\",'Tex-226-F'!$D$24)","v":""},{"$f":"IF('Tex-226-F'!$B$6=\"\",\"\",'Tex-226-F'!$B$6)","v":"Tex-226-F"},{"$f":"IF('Tex-226-F'!$B$24=\"\",\"\",'Tex-226-F'!$B$24)","v":"Density, %:"},{"$f":"IF('Tex-226-F'!$B$22=\"\",\"\",'Tex-226-F'!$B$22)","v":"Specimen:"},{"$f":"IF('Tex-226-F'!$D$22=\"\",\"\",'Tex-226-F'!$D$22)","v":1}]
[10,{"$f":"IF('Tex-226-F'!$E$24=\"\",\"\",'Tex-226-F'!$E$24)","v":""},{"$f":"IF('Tex-226-F'!$B$6=\"\",\"\",'Tex-226-F'!$B$6)","v":"Tex-226-F"},{"$f":"IF('Tex-226-F'!$B$24=\"\",\"\",'Tex-226-F'!$B$24)","v":"Density, %:"},{"$f":"IF('Tex-226-F'!$B$22=\"\",\"\",'Tex-226-F'!$B$22)","v":"Specimen:"},{"$f":"IF('Tex-226-F'!$E$22=\"\",\"\",'Tex-226-F'!$E$22)","v":2}]
[11,{"$f":"IF('Tex-226-F'!$F$24=\"\",\"\",'Tex-226-F'!$F$24)","v":""},{"$f":"IF('Tex-226-F'!$B$6=\"\",\"\",'Tex-226-F'!$B$6)","v":"Tex-226-F"},{"$f":"IF('Tex-226-F'!$B$24=\"\",\"\",'Tex-226-F'!$B$24)","v":"Density, %:"},{"$f":"IF('Tex-226-F'!$B$22=\"\",\"\",'Tex-226-F'!$B$22)","v":"Specimen:"},{"$f":"IF('Tex-226-F'!$F$22=\"\",\"\",'Tex-226-F'!$F$22)","v":3}]
[12,{"$f":"IF('Tex-226-F'!$G$24=\"\",\"\",'Tex-226-F'!$G$24)","v":""},{"$f":"IF('Tex-226-F'!$B$6=\"\",\"\",'Tex-226-F'!$B$6)","v":"Tex-226-F"},{"$f":"IF('Tex-226-F'!$B$24=\"\",\"\",'Tex-226-F'!$B$24)","v":"Density, %:"},{"$f":"IF('Tex-226-F'!$B$22=\"\",\"\",'Tex-226-F'!$B$22)","v":"Specimen:"},{"$f":"IF('Tex-226-F'!$G$22=\"\",\"\",'Tex-226-F'!$G$22)","v":4}]
[13,{"$f":"IF('Tex-226-F'!$D$25=\"\",\"\",'Tex-226-F'!$D$25)","v":""},{"$f":"IF('Tex-226-F'!$B$6=\"\",\"\",'Tex-226-F'!$B$6)","v":"Tex-226-F"},{"$f":"IF('Tex-226-F'!$B$25=\"\",\"\",'Tex-226-F'!$B$25)","v":"Height (in.):"},{"$f":"IF('Tex-226-F'!$B$22=\"\",\"\",'Tex-226-F'!$B$22)","v":"Specimen:"},{"$f":"IF('Tex-226-F'!$D$22=\"\",\"\",'Tex-226-F'!$D$22)","v":1}]
[14,{"$f":"IF('Tex-226-F'!$E$25=\"\",\"\",'Tex-226-F'!$E$25)","v":""},{"$f":"IF('Tex-226-F'!$B$6=\"\",\"\",'Tex-226-F'!$B$6)","v":"Tex-226-F"},{"$f":"IF('Tex-226-F'!$B$25=\"\",\"\",'Tex-226-F'!$B$25)","v":"Height (in.):"},{"$f":"IF('Tex-226-F'!$B$22=\"\",\"\",'Tex-226-F'!$B$22)","v":"Specimen:"},{"$f":"IF('Tex-226-F'!$E$22=\"\",\"\",'Tex-226-F'!$E$22)","v":2}]
[15,{"$f":"IF('Tex-226-F'!$F$25=\"\",\"\",'Tex-226-F'!$F$25)","v":""},{"$f":"IF('Tex-226-F'!$B$6=\"\",\"\",'Tex-226-F'!$B$6)","v":"Tex-226-F"},{"$f":"IF('Tex-226-F'!$B$25=\"\",\"\",'Tex-226-F'!$B$25)","v":"Height (in.):"},{"$f":"IF('Tex-226-F'!$B$22=\"\",\"\",'Tex-226-F'!$B$22)","v":"Specimen:"},{"$f":"IF('Tex-226-F'!$F$22=\"\",\"\",'Tex-226-F'!$F$22)","v":3}]
[16,{"$f":"IF('Tex-226-F'!$G$25=\"\",\"\",'Tex-226-F'!$G$25)","v":""},{"$f":"IF('Tex-226-F'!$B$6=\"\",\"\",'Tex-226-F'!$B$6)","v":"Tex-226-F"},{"$f":"IF('Tex-226-F'!$B$25=\"\",\"\",'Tex-226-F'!$B$25)","v":"Height (in.):"},{"$f":"IF('Tex-226-F'!$B$22=\"\",\"\",'Tex-226-F'!$B$22)","v":"Specimen:"},{"$f":"IF('Tex-226-F'!$G$22=\"\",\"\",'Tex-226-F'!$G$22)","v":4}]
[17,{"$f":"IF('Tex-226-F'!$D$26=\"\",\"\",'Tex-226-F'!$D$26)","v":""},{"$f":"IF('Tex-226-F'!$B$6=\"\",\"\",'Tex-226-F'!$B$6)","v":"Tex-226-F"},{"$f":"IF('Tex-226-F'!$B$26=\"\",\"\",'Tex-226-F'!$B$26)","v":"Load (lbs.):"},{"$f":"IF('Tex-226-F'!$B$22=\"\",\"\",'Tex-226-F'!$B$22)","v":"Specimen:"},{"$f":"IF('Tex-226-F'!$D$22=\"\",\"\",'Tex-226-F'!$D$22)","v":1}]
[18,{"$f":"IF('Tex-226-F'!$E$26=\"\",\"\",'Tex-226-F'!$E$26)","v":""},{"$f":"IF('Tex-226-F'!$B$6=\"\",\"\",'Tex-226-F'!$B$6)","v":"Tex-226-F"},{"$f":"IF('Tex-226-F'!$B$26=\"\",\"\",'Tex-226-F'!$B$26)","v":"Load (lbs.):"},{"$f":"IF('Tex-226-F'!$B$22=\"\",\"\",'Tex-226-F'!$B$22)","v":"Specimen:"},{"$f":"IF('Tex-226-F'!$E$22=\"\",\"\",'Tex-226-F'!$E$22)","v":2}]
[19,{"$f":"IF('Tex-226-F'!$F$26=\"\",\"\",'Tex-226-F'!$F$26)","v":""},{"$f":"IF('Tex-226-F'!$B$6=\"\",\"\",'Tex-226-F'!$B$6)","v":"Tex-226-F"},{"$f":"IF('Tex-226-F'!$B$26=\"\",\"\",'Tex-226-F'!$B$26)","v":"Load (lbs.):"},{"$f":"IF('Tex-226-F'!$B$22=\"\",\"\",'Tex-226-F'!$B$22)","v":"Specimen:"},{"$f":"IF('Tex-226-F'!$F$22=\"\",\"\",'Tex-226-F'!$F$22)","v":3}]
[20,{"$f":"IF('Tex-226-F'!$G$26=\"\",\"\",'Tex-226-F'!$G$26)","v":""},{"$f":"IF('Tex-226-F'!$B$6=\"\",\"\",'Tex-226-F'!$B$6)","v":"Tex-226-F"},{"$f":"IF('Tex-226-F'!$B$26=\"\",\"\",'Tex-226-F'!$B$26)","v":"Load (lbs.):"},{"$f":"IF('Tex-226-F'!$B$22=\"\",\"\",'Tex-226-F'!$B$22)","v":"Specimen:"},{"$f":"IF('Tex-226-F'!$G$22=\"\",\"\",'Tex-226-F'!$G$22)","v":4}]
[21,{"$f":"IF('Tex-226-F'!$D$27=\"\",\"\",'Tex-226-F'!$D$27)","v":""},{"$f":"IF('Tex-226-F'!$B$6=\"\",\"\",'Tex-226-F'!$B$6)","v":"Tex-226-F"},{"$f":"IF('Tex-226-F'!$B$27=\"\",\"\",'Tex-226-F'!$B$27)","v":"Diameter (in):"},{"$f":"IF('Tex-226-F'!$B$22=\"\",\"\",'Tex-226-F'!$B$22)","v":"Specimen:"},{"$f":"IF('Tex-226-F'!$D$22=\"\",\"\",'Tex-226-F'!$D$22)","v":1}]
[22,{"$f":"IF('Tex-226-F'!$E$27=\"\",\"\",'Tex-226-F'!$E$27)","v":""},{"$f":"IF('Tex-226-F'!$B$6=\"\",\"\",'Tex-226-F'!$B$6)","v":"Tex-226-F"},{"$f":"IF('Tex-226-F'!$B$27=\"\",\"\",'Tex-226-F'!$B$27)","v":"Diameter (in):"},{"$f":"IF('Tex-226-F'!$B$22=\"\",\"\",'Tex-226-F'!$B$22)","v":"Specimen:"},{"$f":"IF('Tex-226-F'!$E$22=\"\",\"\",'Tex-226-F'!$E$22)","v":2}]
[23,{"$f":"IF('Tex-226-F'!$F$27=\"\",\"\",'Tex-226-F'!$F$27)","v":""},{"$f":"IF('Tex-226-F'!$B$6=\"\",\"\",'Tex-226-F'!$B$6)","v":"Tex-226-F"},{"$f":"IF('Tex-226-F'!$B$27=\"\",\"\",'Tex-226-F'!$B$27)","v":"Diameter (in):"},{"$f":"IF('Tex-226-F'!$B$22=\"\",\"\",'Tex-226-F'!$B$22)","v":"Specimen:"},{"$f":"IF('Tex-226-F'!$F$22=\"\",\"\",'Tex-226-F'!$F$22)","v":3}]
[24,{"$f":"IF('Tex-226-F'!$G$27=\"\",\"\",'Tex-226-F'!$G$27)","v":""},{"$f":"IF('Tex-226-F'!$B$6=\"\",\"\",'Tex-226-F'!$B$6)","v":"Tex-226-F"},{"$f":"IF('Tex-226-F'!$B$27=\"\",\"\",'Tex-226-F'!$B$27)","v":"Diameter (in):"},{"$f":"IF('Tex-226-F'!$B$22=\"\",\"\",'Tex-226-F'!$B$22)","v":"Specimen:"},{"$f":"IF('Tex-226-F'!$G$22=\"\",\"\",'Tex-226-F'!$G$22)","v":4}]
[25,{"$f":"IF('Tex-226-F'!$D$28=\"\",\"\",'Tex-226-F'!$D$28)","v":""},{"$f":"IF('Tex-226-F'!$B$6=\"\",\"\",'Tex-226-F'!$B$6)","v":"Tex-226-F"},{"$f":"IF('Tex-226-F'!$B$28=\"\",\"\",'Tex-226-F'!$B$28)","v":"Strength (psi.):"},{"$f":"IF('Tex-226-F'!$B$22=\"\",\"\",'Tex-226-F'!$B$22)","v":"Specimen:"},{"$f":"IF('Tex-226-F'!$D$22=\"\",\"\",'Tex-226-F'!$D$22)","v":1}]
[26,{"$f":"IF('Tex-226-F'!$E$28=\"\",\"\",'Tex-226-F'!$E$28)","v":""},{"$f":"IF('Tex-226-F'!$B$6=\"\",\"\",'Tex-226-F'!$B$6)","v":"Tex-226-F"},{"$f":"IF('Tex-226-F'!$B$28=\"\",\"\",'Tex-226-F'!$B$28)","v":"Strength (psi.):"},{"$f":"IF('Tex-226-F'!$B$22=\"\",\"\",'Tex-226-F'!$B$22)","v":"Specimen:"},{"$f":"IF('Tex-226-F'!$E$22=\"\",\"\",'Tex-226-F'!$E$22)","v":2}]
[27,{"$f":"IF('Tex-226-F'!$F$28=\"\",\"\",'Tex-226-F'!$F$28)","v":""},{"$f":"IF('Tex-226-F'!$B$6=\"\",\"\",'Tex-226-F'!$B$6)","v":"Tex-226-F"},{"$f":"IF('Tex-226-F'!$B$28=\"\",\"\",'Tex-226-F'!$B$28)","v":"Strength (psi.):"},{"$f":"IF('Tex-226-F'!$B$22=\"\",\"\",'Tex-226-F'!$B$22)","v":"Specimen:"},{"$f":"IF('Tex-226-F'!$F$22=\"\",\"\",'Tex-226-F'!$F$22)","v":3}]
[28,{"$f":"IF('Tex-226-F'!$G$28=\"\",\"\",'Tex-226-F'!$G$28)","v":""},{"$f":"IF('Tex-226-F'!$B$6=\"\",\"\",'Tex-226-F'!$B$6)","v":"Tex-226-F"},{"$f":"IF('Tex-226-F'!$B$28=\"\",\"\",'Tex-226-F'!$B$28)","v":"Strength (psi.):"},{"$f":"IF('Tex-226-F'!$B$22=\"\",\"\",'Tex-226-F'!$B$22)","v":"Specimen:"},{"$f":"IF('Tex-226-F'!$G$22=\"\",\"\",'Tex-226-F'!$G$22)","v":4}]
[29,{"$f":"IF('Tex-226-F'!$D$29=\"\",\"\",'Tex-226-F'!$D$29)","v":""},{"$f":"IF('Tex-226-F'!$B$6=\"\",\"\",'Tex-226-F'!$B$6)","v":"Tex-226-F"},{"$f":"IF('Tex-226-F'!$B$29=\"\",\"\",'Tex-226-F'!$B$29)","v":"Average Strength, (psi):"}]
[30,{"$f":"IF('Tex-226-F'!$D$20=\"\",\"\",'Tex-226-F'!$D$20)","v":""},{"$f":"IF('Tex-226-F'!$B$6=\"\",\"\",'Tex-226-F'!$B$6)","v":"Tex-226-F"},{"$f":"IF('Tex-226-F'!$B$20=\"\",\"\",'Tex-226-F'!$B$20)","v":"TEST TYPE:"}]
[31,{"$f":"IF('Tex-226-F'!$H$20=\"\",\"\",'Tex-226-F'!$H$20)","v":""},{"$f":"IF('Tex-226-F'!$B$6=\"\",\"\",'Tex-226-F'!$B$6)","v":"Tex-226-F"},{"$f":"IF('Tex-226-F'!$F$20=\"\",\"\",'Tex-226-F'!$F$20)","v":"GYRATORY COMPACTOR:"}]
[32,{"$f":"IF('Tex-226-F'!$C$39=\"\",\"\",'Tex-226-F'!$C$39)","v":""},"Sampled By ",{"$f":"IF('Tex-226-F'!$B$39=\"\",\"\",'Tex-226-F'!$B$39)","v":"TX222"}]
[33,{"$f":"IF('Tex-226-F'!$F$39=\"\",\"\",'Tex-226-F'!$F$39)","v":""},"Sampled Date ",{"$f":"IF('Tex-226-F'!$B$39=\"\",\"\",'Tex-226-F'!$B$39)","v":"TX222"}]

{"sheet":"Compactor","index":3,"n_rows":4,"n_cols":4,"rows_kept":4,"cut":false,"hidden":true,"merged":[]}
[]
[null,"V1","V2","V3"]
[null,"TGC","TGC","SGC"]
[null,"SGC","SGC"]