{"text_format":"1","workbook":"xlsx","n_sheets":3,"sheets":["Tex-235-F","RX","spcyr"],"not_rendered":{"charts":0,"images":1,"macros":1,"external_links":0,"defined_names":69,"comments":1,"pivot_tables":0},"unopened":[],"bounds":{"document_bytes":16777216,"sheet_cells":100000,"rows_first":2000,"rows_last":500,"rows_between":2000,"halvings":0,"cell_chars":16384,"cell_head_chars":4096},"cells_cut":0,"cells_raw":0,"read":"whole","date_system":"1900"}

{"sheet":"Tex-235-F","index":0,"n_rows":43,"n_cols":11,"rows_kept":43,"cut":false,"hidden":false,"merged":[[0,0,0,1],[20,4,20,5],[20,6,20,7],[9,7,9,8],[9,3,9,4],[11,3,11,4],[12,3,12,4],[11,7,11,8],[16,3,16,4],[7,7,7,8],[10,7,10,8],[7,3,7,4],[8,3,8,4],[8,7,8,8],[10,3,10,4],[12,7,12,8],[43,1,43,3],[32,1,32,8],[23,2,23,3],[23,4,23,5],[24,6,24,7],[26,2,26,6],[24,2,24,3],[24,4,24,5],[39,6,39,8],[30,1,31,8],[37,2,37,4],[33,1,33,8],[39,1,39,3],[34,2,34,4],[35,2,35,4],[22,6,22,7],[36,2,36,4],[13,3,13,4],[15,3,15,8],[13,7,13,8],[16,7,16,8],[23,6,23,7],[14,3,14,8],[21,6,21,7],[21,2,21,3],[21,4,21,5],[22,2,22,3],[22,4,22,5]]}
["TxDOT Manuals >",null,null,"Tex-235-F"]
[null,"TEXAS DEPARTMENT OF TRANSPORTATION",null,null,null,null,null,null,null,null,17]
[null,null,null,null,null,null,null,null,null,null,1]
[null,null,null,null,null,null,null,null,null,null,"tx235.xlsm::45574.63919"]
[null,"Determining Draindown Characteristics in Bituminous Materials"]
[null,"Tex-235-F"]
[null,null,null,null,null,null,null,null,{"$f":"\"File Version: \" & TEXT(MID(sn,SEARCH(\"::\",sn,1)+2,20),\"mm/dd/yy hh:mm:ss\")","v":"File Version: 10/09/24 15:20:26"}]
[null,null,"SAMPLE ID:",null,null,null,"SAMPLED DATE:"]
[null,null,"TEST NUMBER:",null,null,null,"LETTING DATE:"]
[null,null,"SAMPLE STATUS:",null,null,null,"CONTROLLING CSJ:"]
[null,null,"COUNTY:",null,null,null,"SPEC YEAR:"]
[null,null,"SAMPLED BY:",null,null,null,"SPEC ITEM:"]
[null,null,"SAMPLE LOCATION:",null,null,null,"SPECIAL PROVISION:"]
[null,null,"MATERIAL CODE:",null,null,null,"MIX TYPE:"]
[null,null,"MATERIAL NAME:"]
[null,null,"PRODUCER:"]
[null,null,"AREA ENGINEER:",null,null,null,"PROJECT MANAGER:"]
[]
[null,null,"COURSE\\LIFT:",null,"STATION:",null,null,"DIST. FROM CL:"]
[]
[null,null,null,null,"Sample 1",null,"Sample 2"]
[null,null,"Initial Sample Weight (g):"]
[null,null,"Initial Weight Plate (g):"]
[null,null,"Final Weight Plate (g):"]
[null,null,"Percent of Draindown, (%):",null,{"$f":"IF(ISERROR((E24-E23)/E22*100),\"\",(E24-E23)/E22*100)","v":""},null,{"$f":"IF(ISERROR((G24-G23)/G22*100),\"\",(G24-G23)/G22*100)","v":""}]
[]
[null,null,"Average Percent of Draindown for Two Samples, (%):",null,null,null,null,{"$f":"IF(G25=\"\",E25,AVERAGE(E25:G25))","v":""}]
[]
[]
[null,"Remarks:",{"$f":"NOW()","v":"2024-10-09T15:20:26.520"}]
[]
[]
[]
[]
[null,"Sample Method:","Sampled By:",null,null,"Sampled Date:"]
[null,"TX222"]
[null,"Test Method:","Tested By:",null,null,"Tested Date:"]
[null,"TX235"]
[null,"Test Stamp Code:",null,null,"Omit Test:","Completed Date:","Reviewed By:"]
[]
[null,"Locked By:","TxDOT:","District:","Area:"]
[]
[null,"Authorized By:",null,null,"Authorized Date:"]

{"sheet":"RX","index":1,"n_rows":17,"n_cols":9,"rows_kept":17,"cut":false,"hidden":true,"merged":[]}
[15]
["Fld_nbr","Value","Desc_1","Desc_2","Desc_3","Desc_4","Desc_5","Desc_6","Desc_7"]
[1,{"$f":"IF('Tex-235-F'!$B$31=\"\",\"\",'Tex-235-F'!$B$31)","v":""},{"$f":"'Tex-235-F'!$B$30","v":"Remarks:"}]
[2,{"$f":"IF('Tex-235-F'!$D$19=\"\",\"\",'Tex-235-F'!$D$19)","v":""},{"$f":"IF('Tex-235-F'!$C$19=\"\",\"\",'Tex-235-F'!$C$19)","v":"COURSE\\LIFT:"}]
[3,{"$f":"IF('Tex-235-F'!$C$38=\"\",\"\",'Tex-235-F'!$C$38)","v":""},"Tested By ",{"$f":"IF('Tex-235-F'!$B$38=\"\",\"\",'Tex-235-F'!$B$38)","v":"TX235"}]
[4,{"$f":"IF('Tex-235-F'!$F$38=\"\",\"\",'Tex-235-F'!$F$38)","v":""},"Tested Date ",{"$f":"IF('Tex-235-F'!$B$38=\"\",\"\",'Tex-235-F'!$B$38)","v":"TX235"}]
[5,{"$f":"IF('Tex-235-F'!$E$22=\"\",\"\",'Tex-235-F'!$E$22)","v":""},{"$f":"IF('Tex-235-F'!$B$6=\"\",\"\",'Tex-235-F'!$B$6)","v":"Tex-235-F"},{"$f":"IF('Tex-235-F'!$C$22=\"\",\"\",'Tex-235-F'!$C$22)","v":"Initial Sample Weight (g):"},{"$f":"IF('Tex-235-F'!$E$21=\"\",\"\",'Tex-235-F'!$E$21)","v":"Sample 1"}]
[6,{"$f":"IF('Tex-235-F'!$G$22=\"\",\"\",'Tex-235-F'!$G$22)","v":""},{"$f":"IF('Tex-235-F'!$B$6=\"\",\"\",'Tex-235-F'!$B$6)","v":"Tex-235-F"},{"$f":"IF('Tex-235-F'!$C$22=\"\",\"\",'Tex-235-F'!$C$22)","v":"Initial Sample Weight (g):"},{"$f":"IF('Tex-235-F'!$G$21=\"\",\"\",'Tex-235-F'!$G$21)","v":"Sample 2"}]
[7,{"$f":"IF('Tex-235-F'!$E$23=\"\",\"\",'Tex-235-F'!$E$23)","v":""},{"$f":"IF('Tex-235-F'!$B$6=\"\",\"\",'Tex-235-F'!$B$6)","v":"Tex-235-F"},{"$f":"IF('Tex-235-F'!$C$23=\"\",\"\",'Tex-235-F'!$C$23)","v":"Initial Weight Plate (g):"},{"$f":"IF('Tex-235-F'!$E$21=\"\",\"\",'Tex-235-F'!$E$21)","v":"Sample 1"}]
[8,{"$f":"IF('Tex-235-F'!$G$23=\"\",\"\",'Tex-235-F'!$G$23)","v":""},{"$f":"IF('Tex-235-F'!$B$6=\"\",\"\",'Tex-235-F'!$B$6)","v":"Tex-235-F"},{"$f":"IF('Tex-235-F'!$C$23=\"\",\"\",'Tex-235-F'!$C$23)","v":"Initial Weight Plate (g):"},{"$f":"IF('Tex-235-F'!$G$21=\"\",\"\",'Tex-235-F'!$G$21)","v":"Sample 2"}]
[9,{"$f":"IF('Tex-235-F'!$E$24=\"\",\"\",'Tex-235-F'!$E$24)","v":""},{"$f":"IF('Tex-235-F'!$B$6=\"\",\"\",'Tex-235-F'!$B$6)","v":"Tex-235-F"},{"$f":"IF('Tex-235-F'!$C$24=\"\",\"\",'Tex-235-F'!$C$24)","v":"Final Weight Plate (g):"},{"$f":"IF('Tex-235-F'!$E$21=\"\",\"\",'Tex-235-F'!$E$21)","v":"Sample 1"}]
[10,{"$f":"IF('Tex-235-F'!$G$24=\"\",\"\",'Tex-235-F'!$G$24)","v":""},{"$f":"IF('Tex-235-F'!$B$6=\"\",\"\",'Tex-235-F'!$B$6)","v":"Tex-235-F"},{"$f":"IF('Tex-235-F'!$C$24=\"\",\"\",'Tex-235-F'!$C$24)","v":"Final Weight Plate (g):"},{"$f":"IF('Tex-235-F'!$G$21=\"\",\"\",'Tex-235-F'!$G$21)","v":"Sample 2"}]
[11,{"$f":"IF('Tex-235-F'!$E$25=\"\",\"\",'Tex-235-F'!$E$25)","v":""},{"$f":"IF('Tex-235-F'!$B$6=\"\",\"\",'Tex-235-F'!$B$6)","v":"Tex-235-F"},{"$f":"IF('Tex-235-F'!$C$25=\"\",\"\",'Tex-235-F'!$C$25)","v":"Percent of Draindown, (%):"},{"$f":"IF('Tex-235-F'!$E$21=\"\",\"\",'Tex-235-F'!$E$21)","v":"Sample 1"}]
[12,{"$f":"IF('Tex-235-F'!$G$25=\"\",\"\",'Tex-235-F'!$G$25)","v":""},{"$f":"IF('Tex-235-F'!$B$6=\"\",\"\",'Tex-235-F'!$B$6)","v":"Tex-235-F"},{"$f":"IF('Tex-235-F'!$C$25=\"\",\"\",'Tex-235-F'!$C$25)","v":"Percent of Draindown, (%):"},{"$f":"IF('Tex-235-F'!$G$21=\"\",\"\",'Tex-235-F'!$G$21)","v":"Sample 2"}]
[13,{"$f":"IF('Tex-235-F'!$H$27=\"\",\"\",'Tex-235-F'!$H$27)","v":""},{"$f":"IF('Tex-235-F'!$B$6=\"\",\"\",'Tex-235-F'!$B$6)","v":"Tex-235-F"},{"$f":"IF('Tex-235-F'!$C$27=\"\",\"\",'Tex-235-F'!$C$27)","v":"Average Percent of Draindown for Two Samples, (%):"}]
[14,{"$f":"IF('Tex-235-F'!$C$36=\"\",\"\",'Tex-235-F'!$C$36)","v":""},"Sampled By ",{"$f":"IF('Tex-235-F'!$B$36=\"\",\"\",'Tex-235-F'!$B$36)","v":"TX222"}]
[15,{"$f":"IF('Tex-235-F'!$F$36=\"\",\"\",'Tex-235-F'!$F$36)","v":""},"Sampled Date ",{"$f":"IF('Tex-235-F'!$B$36=\"\",\"\",'Tex-235-F'!$B$36)","v":"TX222"}]

{"sheet":"spcyr","index":2,"n_rows":14,"n_cols":5,"rows_kept":14,"cut":false,"hidden":true,"merged":[]}
["spec1993","spec1995","spec2004","spec2014","spec2024"]
[null,null,"PFC","PFC","PFC_C"]
[null,null,"PFC_AR","PFC_AR","PFC_F"]
[null,null,"SMA_C","SMA_C","SMA_C"]
[null,null,"SMA_D","SMA_D","SMA_D"]
[null,null,"SMA_F","SMA_F","SMA_F"]
[null,null,"SMAR_C","SMAR_C","SMAR_F"]
[null,null,"SMAR_F","SMAR_F","TOM_C"]
[null,null,null,null,"TOM_F"]
[null,null,null,null,"TBPFC_C"]
[null,null,null,null,"TBPFC_F"]
[null,null,null,null,"TBFC_A"]
[null,null,null,null,"TBFC_B"]
[null,null,null,null,"TBFC_C"]