{"text_format":"1","workbook":"xlsx","n_sheets":6,"sheets":["Tx236","RX","Summary","Sheet1","Data","Revisions"],"not_rendered":{"charts":0,"images":1,"macros":1,"external_links":1,"defined_names":494,"comments":1,"pivot_tables":0},"unopened":[],"bounds":{"document_bytes":16777216,"sheet_cells":100000,"rows_first":2000,"rows_last":500,"rows_between":2000,"halvings":0,"cell_chars":16384,"cell_head_chars":4096},"cells_cut":0,"cells_raw":0,"read":"whole","date_system":"1900"}

{"sheet":"Tx236","index":0,"n_rows":121,"n_cols":15,"rows_kept":121,"cut":false,"hidden":false,"merged":[[94,1,94,3],[94,8,94,9],[94,10,94,13],[94,4,94,7],[91,10,91,13],[92,1,92,2],[92,3,92,13],[91,4,91,5],[91,8,91,9],[91,1,91,2],[91,6,91,7],[93,1,93,13],[88,1,88,12],[90,4,90,5],[90,6,90,7],[90,8,90,9],[90,10,90,13],[89,1,89,13],[90,1,90,2],[0,0,0,1],[12,7,12,8],[11,3,11,4],[12,3,12,4],[11,7,11,8],[8,7,8,8],[9,7,9,8],[7,7,7,8],[10,7,10,8],[7,3,7,4],[8,3,8,4],[10,3,10,4],[9,3,9,4],[118,1,118,3],[114,6,114,8],[97,1,98,8],[107,2,107,4],[114,1,114,3],[99,1,99,8],[106,2,106,4],[100,1,100,8],[111,2,111,4],[109,2,109,4],[102,2,102,4],[103,2,103,4],[105,2,105,4],[86,10,86,12],[68,3,70,3],[68,4,69,4],[68,5,69,5],[84,10,85,12],[68,8,69,8],[68,10,70,10],[84,8,84,9],[84,6,84,7],[83,1,83,12],[68,2,70,2],[84,1,84,3],[84,4,84,5],[68,1,70,1],[13,3,13,4],[16,3,16,4],[53,9,56,10],[66,2,67,9],[13,7,13,8],[16,7,16,8],[41,1,41,2],[27,3,27,4],[27,5,27,10],[22,10,23,10],[21,1,21,2],[42,1,42,2],[22,5,23,5],[23,4,25,4],[22,8,23,8],[45,1,45,7],[46,7,50,7],[40,1,40,2],[68,6,69,6],[68,7,69,7],[65,1,65,10],[8,10,10,10],[14,3,14,8],[15,3,15,8],[23,3,25,3],[86,1,86,3],[68,9,69,9],[85,1,85,3],[20,1,20,9],[22,9,23,9],[22,7,23,7],[52,2,52,6],[22,6,23,6],[49,9,52,10],[43,1,43,2],[39,1,39,2],[22,1,22,2]]}
["TxDOT Manuals >",null,null,"Tex-236"]
[null,"TEXAS DEPARTMENT OF TRANSPORTATION",null,null,null,null,null,null,null,null,260]
[null,null,null,null,null,null,null,null,null,null,3]
[null,null,null,null,null,null,null,null,null,null,"tx236.xlsm::45574.639884"]
[null,"ASPHALT CONTENT AND COMBINED AGGREGATE GRADATION CORRECTION FACTORS"]
[null,"Tex-236-F"]
[null,null,null,null,null,null,null,null,{"$f":"\"TX236 :: File Version: \" & TEXT(MID(sn,SEARCH(\"::\",sn,1)+2,20),\"mm/dd/yy hh:mm:ss\")","v":"TX236 :: File Version: 10/09/24 15:21:26"}]
[null,null,"SAMPLE ID:",null,null,null,"SAMPLED DATE:"]
[null,null,"TEST NUMBER:",null,null,null,"LETTING DATE:",null,null,null,"Correction Factor Test Date"]
[null,null,"SAMPLE STATUS:",null,null,null,"CONTROLLING CSJ:"]
[null,null,"COUNTY:",null,null,null,"SPEC YEAR:"]
[null,null,"SAMPLED BY:",null,null,null,"SPEC ITEM:",null,null,null,null,null,null,null,{"$f":"K12","v":0}]
[null,null,"SAMPLE LOCATION:",null,null,null,"SPECIAL PROVISION:",null,null,null,{"$f":"IF(LEFT(Grade,4)=\"SS30\",IF(TestDt=0,\"\",IF(ISBLANK(AuthorizedDate),IF((TodaysDate-TestDt)>365,\"Correction factors too old\",\"\"),IF((AuthorizedDate-TestDt)>365,\"Correction factors too old\",\"\"))),\"\")","v":""}]
[null,null,"MATERIAL CODE:",null,null,null,"MIX TYPE:",null,null,null,"Fiber Content:"]
[null,null,"MATERIAL NAME:"]
[null,null,"PRODUCER:"]
[null,null,"AREA ENGINEER:",null,null,null,"PROJECT MANAGER:"]
[]
[null,null,"COURSE\\LIFT:",null,"STATION:",null,null,"DIST. FROM CL:"]
[]
[null,"SIEVE ANALYSIS WORKSHEET FOR CALIBRATION SAMPLES"]
[null,"Original Sample Weight:"]
[null,"Dry Weight after Washing:",null,null,null,"Ignited Sample 1","Ignited Sample 2",{"$f":"IF(version>=5,\"Ignited Sample 1\",\"Ignited Sample 3\")","v":"Ignited Sample 1"},{"$f":"IF(version>=5,\"Ignited Sample 2\",\"Ignited Sample 4\")","v":"Ignited Sample 2"},"Ignited Sample 5","Ignited     Sample 6"]
[null,null,null,{"$f":"IF(version>=5,\"Blank Sample\",IF(version<2,\"Combined Gradation Mix Design JMF 1\",\"Blank  Sample 1\"))","v":"Blank Sample"},{"$f":"IF(version<2,\"\",\"Blank  Sample 2\")","v":"Blank  Sample 2"}]
[]
[null,"Cumulative?",null,null,null,{"$f":"IF(version>2, \"@OAC-0.5%AC\",\"\")","v":"@OAC-0.5%AC"},{"$f":"IF(version>2, \"@OAC-0.5%AC\",\"\")","v":"@OAC-0.5%AC"},{"$f":"IF(version>2, \"@OAC\",\"\")","v":"@OAC"},{"$f":"IF(version>2, \"@OAC\",\"\")","v":"@OAC"},{"$f":"IF(version>2, \"@OAC+0.5%AC\",\"\")","v":"@OAC+0.5%AC"},{"$f":"IF(version>2, \"@OAC+0.5%AC\",\"\")","v":"@OAC+0.5%AC"}]
[]
[null,{"$f":"IF(version>2,\"\", \"Sieve Size\")","v":""},{"$f":"IF(version>2, \"Sieve Size\",\"\")","v":"Sieve Size"},{"$f":"IF(version>2, IF(Cumulative=\"\",\"Individual\",\"Cumulative\")&\" Weight Retained\",\"Percent Passing\")","v":"Individual Weight Retained"},null,{"$f":"IF(Cumulative=\"\",\"Individual\",\"Cumulative\") & \" Weight Retained\"","v":"Individual Weight Retained"}]
[null,null,{"$f":"IF(version>2,IF(ISERROR(T(INDEX(INDIRECT(Grade),1,2))),\"\",T(INDEX(INDIRECT(Grade),1,2))),\"\")","v":""}]
[null,null,{"$f":"IF(version>2,IF(ISERROR(T(INDEX(INDIRECT(Grade),2,2))),\"\",T(INDEX(INDIRECT(Grade),2,2))),\"\")","v":""}]
[null,null,{"$f":"IF(version>2,IF(ISERROR(T(INDEX(INDIRECT(Grade),3,2))),\"\",T(INDEX(INDIRECT(Grade),3,2))),\"\")","v":""}]
[null,null,{"$f":"IF(version>2,IF(ISERROR(T(INDEX(INDIRECT(Grade),4,2))),\"\",T(INDEX(INDIRECT(Grade),4,2))),\"\")","v":""}]
[null,null,{"$f":"IF(version>2,IF(ISERROR(T(INDEX(INDIRECT(Grade),5,2))),\"\",T(INDEX(INDIRECT(Grade),5,2))),\"\")","v":""}]
[null,null,{"$f":"IF(version>2,IF(ISERROR(T(INDEX(INDIRECT(Grade),6,2))),\"\",T(INDEX(INDIRECT(Grade),6,2))),\"\")","v":""}]
[null,null,{"$f":"IF(version>2,IF(ISERROR(T(INDEX(INDIRECT(Grade),7,2))),\"\",T(INDEX(INDIRECT(Grade),7,2))),\"\")","v":""}]
[null,null,{"$f":"IF(version>2,IF(ISERROR(T(INDEX(INDIRECT(Grade),8,2))),\"\",T(INDEX(INDIRECT(Grade),8,2))),\"\")","v":""}]
[null,null,{"$f":"IF(version>2,IF(ISERROR(T(INDEX(INDIRECT(Grade),9,2))),\"\",T(INDEX(INDIRECT(Grade),9,2))),\"\")","v":""}]
[null,null,{"$f":"IF(version>2,IF(ISERROR(T(INDEX(INDIRECT(Grade),10,2))),\"\",T(INDEX(INDIRECT(Grade),10,2))),\"\")","v":""}]
[null,null,{"$f":"IF(version>2,IF(ISERROR(T(INDEX(INDIRECT(Grade),11,2))),\"\",T(INDEX(INDIRECT(Grade),11,2))),\"\")","v":""}]
[null,"PAN"]
[null,"Sieving Loss(+) or Gain(-):",null,{"$f":"IF(AND(WeightBlank1<>\"\",DryWeightBlank1<>\"\"),DryWeightBlank1-IF(Cumulative=\"Yes\",prepan1, SUM(D29:D40)),\"\")","v":""},{"$f":"IF(AND(WeightBlank2<>\"\",DryWeightBlank2<>\"\"),DryWeightBlank2-IF(Cumulative=\"Yes\",prepan2, SUM(E29:E40)),\"\")","v":""},{"$f":"IF(WeightIgnited1<>\"\",WeightIgnited1-IF(Cumulative=\"Yes\",F40, SUM(F29:F40)),\"\")","v":""},{"$f":"IF(WeightIgnited2<>\"\",WeightIgnited2-IF(Cumulative=\"Yes\",G40, SUM(G29:G40)),\"\")","v":""},{"$f":"IF(WeightIgnited3<>\"\",WeightIgnited3-IF(Cumulative=\"Yes\",H40, SUM(H29:H40)),\"\")","v":""},{"$f":"IF(WeightIgnited4<>\"\",WeightIgnited4-IF(Cumulative=\"Yes\",I40, SUM(I29:I40)),\"\")","v":""},{"$f":"IF(WeightIgnited5<>\"\",WeightIgnited5-IF(Cumulative=\"Yes\",J40, SUM(J29:J40)),\"\")","v":""},{"$f":"IF(WeightIgnited6<>\"\",WeightIgnited6-IF(Cumulative=\"Yes\",K40, SUM(K29:K40)),\"\")","v":""},{"$f":"IF(version>2,IF(OR(ABS(sloss1)>DryWeightBlank1*0.002,ABS(sloss2)>DryWeightBlank2*0.002,ABS(sloss3)>WeightIgnited1*0.002,ABS(sloss4)>WeightIgnited2*0.002,ABS(sloss5)>WeightIgnited3*0.002,ABS(sloss6)>WeightIgnited4*0.002,ABS(sloss7)>WeightIgnited5*0.002,ABS(sloss8)>WeightIgnited6*0.002),\"<<Too High\",\"\"),\"\")","v":{"$error":"#VALUE!"}}]
[null,"Wash Loss(+):",null,{"$f":"IF(sloss1=\"\",\"\",WeightBlank1-DryWeightBlank1)","v":""},{"$f":"IF(sloss2=\"\",\"\",WeightBlank2-DryWeightBlank2)","v":""},{"$f":"IF(OR(wloss1<0, wloss2<0), \"<< ERROR, Wash Weight Greater Than Original Weight\", \"\")","v":""}]
[null,"Total Pan:",null,{"$f":"IF(sloss1=\"\",\"\",SUM(prepan1+sloss1+wloss1))","v":""},{"$f":"IF(sloss2=\"\",\"\",SUM(prepan2+sloss2+wloss2))","v":""},{"$f":"IF(sloss3=\"\",\"\",SUM(prepan3+sloss3))","v":""},{"$f":"IF(sloss4=\"\",\"\",SUM(prepan4+sloss4))","v":""},{"$f":"IF(sloss5=\"\",\"\",SUM(prepan5+sloss5))","v":""},{"$f":"IF(sloss6=\"\",\"\",SUM(prepan6+sloss6))","v":""},{"$f":"IF(sloss7=\"\",\"\",SUM(prepan7+sloss7))","v":""},{"$f":"IF(sloss8=\"\",\"\",SUM(prepan8+sloss8))","v":""}]
[null,"Total Weight:",null,{"$f":"IF(sloss1=\"\",\"\",IF(Cumulative=\"\",SUM(D29:D39,_pan1),_pan1))","v":""},{"$f":"IF(sloss2=\"\",\"\",IF(Cumulative=\"\",SUM(E29:E39,_pan2),_pan2))","v":""},{"$f":"IF(sloss3=\"\",\"\",IF(Cumulative=\"\",SUM(F29:F39,_pan3),_pan3))","v":""},{"$f":"IF(sloss4=\"\",\"\",IF(Cumulative=\"\",SUM(G29:G39,_pan4),_pan4))","v":""},{"$f":"IF(sloss5=\"\",\"\",IF(Cumulative=\"\",SUM(H29:H39,_pan5),_pan5))","v":""},{"$f":"IF(sloss6=\"\",\"\",IF(Cumulative=\"\",SUM(I29:I39,_pan6),_pan6))","v":""},{"$f":"IF(sloss7=\"\",\"\",IF(Cumulative=\"\",SUM(J29:J39,_pan7),_pan7))","v":""},{"$f":"IF(sloss8=\"\",\"\",IF(Cumulative=\"\",SUM(K29:K39,_pan8),_pan8))","v":""}]
[]
[null,"RECYCLED MATERIALS"]
[null,null,"Bin No.1","Bin No.2","Bin No.3","Bin No.4","Bin No.5","AVERAGE"]
[null,"Material ID:"]
[null,"Recycled Material Type:"]
[null,"Asphalt %:",null,null,null,null,null,null,null,"OAC- Optimum Asphalt Content from mixture design"]
[null,"Bin %:"]
[]
[null,"Sieve Size","PERCENT PASSING"]
[null,{"$f":"IF(version>2,IF(Sieve1=\"\",\"\",Sieve1),\"\")","v":""},null,null,null,null,null,{"$f":"IF(OR(C54=\"\",$C$51=\"\"),\"\",($C$51*C54+$D$51*D54+$E$51*E54+$F$51*F54+$G$51*G54)/SUM($C$51:$G$51))","v":""},"Yes","Summary worksheet includes a table of correction factors for this HMA mixture"]
[null,{"$f":"IF(version>2,IF(Sieve2=\"\",\"\",Sieve2),\"\")","v":""},null,null,null,null,null,{"$f":"IF(OR($C$51=\"\",C55=\"\"),\"\",($C$51*C55+$D$51*D55+$E$51*E55+$F$51*F55+$G$51*G55)/SUM($C$51:$G$51))","v":""}]
[null,{"$f":"IF(version>2,IF(Sieve3=\"\",\"\",Sieve3),\"\")","v":""},null,null,null,null,null,"","RAS"]
[null,{"$f":"IF(version>2,IF(Sieve4=\"\",\"\",Sieve4),\"\")","v":""},null,null,null,null,null,"","RAP"]
[null,{"$f":"IF(version>2,IF(Sieve5=\"\",\"\",Sieve5),\"\")","v":""},null,null,null,null,null,"","Unfractionated RAP"]
[null,{"$f":"IF(version>2,IF(Sieve6=\"\",\"\",Sieve6),\"\")","v":""},null,null,null,null,null,"","Fine Fractionated RAP"]
[null,{"$f":"IF(version>2,IF(Sieve7=\"\",\"\",Sieve7),\"\")","v":""},null,null,null,null,null,"","Coarse Fractionated RAP"]
[null,{"$f":"IF(version>2,IF(Sieve8=\"\",\"\",Sieve8),\"\")","v":""},null,null,null,null,null,""]
[null,{"$f":"IF(version>2,IF(Sieve9=\"\",\"\",Sieve9),\"\")","v":""},null,null,null,null,null,""]
[null,{"$f":"IF(version>2,IF(Sieve10=\"\",\"\",Sieve10),\"\")","v":""},null,null,null,null,null,""]
[null,{"$f":"IF(version>2,IF(Sieve11=\"\",\"\",Sieve11),\"\")","v":""},null,null,null,null,null,""]
[]
[null,"AGGREGATE GRADATION CORRECTION FACTOR CALCULATIONS"]
[null,null,{"$f":"IF(Percent_Retained=\"Yes\",\"Cumulative Percent Retained, %\",\"Total Percent Passing, %\")","v":"Total Percent Passing, %"}]
[]
[null,"Sieve Size","Combined Gradation","Meets Master Grading Limits","Ignited Sample 1","Ignited Sample 2",{"$f":"IF(version>=5,\"Ignited Sample 1\",\"Ignited Sample 3\")","v":"Ignited Sample 1"},{"$f":"IF(version>=5,\"Ignited Sample 2\",\"Ignited Sample 4\")","v":"Ignited Sample 2"},"Ignited Sample 5","Ignited Sample 6","Correction Factor"]
[]
[null,null,null,null,{"$f":"F26","v":"@OAC-0.5%AC"},"@OAC-0.5%AC","@OAC","@OAC","@OAC+0.5%AC","@OAC+0.5%AC"]
[null,{"$f":"IF(version>2,IF(Sieve1=\"\",\"\",Sieve1),IF(SSieve1=\"\",\"\",SSieve1))","v":""},{"$f":"IF(AND(Percent_Retained=\"Yes\",D29<>\"\",E29<>\"\"),Sheet1!H19,IF(version>=5,IF(OR(Sheet1!M19=\"\",D29=\"\"),\"\",Sheet1!M19),IF(version>2,IF(OR(Sheet1!M19=\"\",D29=\"\",E29=\"\"),\"\",Sheet1!M19),IF(version>1,IF(OR(D29=\"\",E29=\"\"),\"\",AVERAGE(D29:E29)),IF(D29=\"\",\"\",D29)))))","v":""},{"$f":"IF(AND(version>2,C72<>\"\"),IF(OR(AND(Percent_Retained=\"\",Spec1=\"No\"),AND(Percent_Retained=\"Yes\",RetSpec1=\"No\")),\"ý\",\"þ\"),\"\")","v":""},{"$f":"+IF(OR($F$22=\"\",F29=\"\"),\"\", IF(Percent_Retained=\"Yes\",Sheet1!B4,(100-Sheet1!B4)))","v":""},{"$f":"+IF(OR($G$22=\"\",G29=\"\"),\"\",IF(Percent_Retained=\"Yes\",Sheet1!D4,(100-Sheet1!D4)))","v":""},{"$f":"+IF(OR($H$22=\"\",H29=\"\"),\"\",IF(Percent_Retained=\"Yes\",Sheet1!F4,(100-Sheet1!F4)))","v":""},{"$f":"+IF(OR($I$22=\"\",I29=\"\"),\"\",IF(Percent_Retained=\"Yes\",Sheet1!H4,(100-Sheet1!H4)))","v":""},{"$f":"+IF(OR($J$22=\"\",J29=\"\"),\"\",IF(Percent_Retained=\"Yes\",Sheet1!J4,(100-Sheet1!J4)))","v":""},{"$f":"+IF(OR($K$22=\"\",K29=\"\"),\"\",IF(Percent_Retained=\"Yes\",Sheet1!L4,(100-Sheet1!L4)))","v":""},{"$f":"IF(ISERROR(IF(C72=\"\",\"\",IF(version>=5,(SUM(C72-(G72:H72))/2),(SUM(C72-(E72:J72))/6)))),\"\",IF(C72=\"\",\"\",IF(version>=5,(SUM(C72-(G72:H72))/2),(SUM(C72-(E72:J72))/6))))","v":""}]
[null,{"$f":"IF(version>2,IF(Sieve2=\"\",\"\",Sieve2),IF(SSieve2=\"\",\"\",SSieve2))","v":""},{"$f":"IF(AND(Percent_Retained=\"Yes\",D30<>\"\",E30<>\"\"),Sheet1!H20,IF(version>=5,IF(OR(Sheet1!M20=\"\",D30=\"\"),\"\",Sheet1!M20),IF(version>2,IF(OR(Sheet1!M20=\"\",D30=\"\",E30=\"\"),\"\",Sheet1!M20),IF(version>1,IF(OR(D30=\"\",E30=\"\"),\"\",AVERAGE(D30:E30)),IF(D30=\"\",\"\",D30)))))","v":""},{"$f":"IF(AND(version>2,C73<>\"\"),IF(OR(AND(Percent_Retained=\"\",Spec2=\"No\"),AND(Percent_Retained=\"Yes\",RetSpec2=\"No\")),\"ý\",\"þ\"),\"\")","v":""},{"$f":"+IF(OR($F$22=\"\",F30=\"\"),\"\", IF(Percent_Retained=\"Yes\",Sheet1!B5,(100-Sheet1!B5)))","v":""},{"$f":"+IF(OR($G$22=\"\",G30=\"\"),\"\",IF(Percent_Retained=\"Yes\",Sheet1!D5,(100-Sheet1!D5)))","v":""},{"$f":"+IF(OR($H$22=\"\",H30=\"\"),\"\",IF(Percent_Retained=\"Yes\",Sheet1!F5,(100-Sheet1!F5)))","v":""},{"$f":"+IF(OR($I$22=\"\",I30=\"\"),\"\",IF(Percent_Retained=\"Yes\",Sheet1!H5,(100-Sheet1!H5)))","v":""},{"$f":"+IF(OR($J$22=\"\",J30=\"\"),\"\",IF(Percent_Retained=\"Yes\",Sheet1!J5,(100-Sheet1!J5)))","v":""},{"$f":"+IF(OR($K$22=\"\",K30=\"\"),\"\",IF(Percent_Retained=\"Yes\",Sheet1!L5,(100-Sheet1!L5)))","v":""},{"$f":"IF(ISERROR(IF(C73=\"\",\"\",IF(version>=5,(SUM(C73-(G73:H73))/2),(SUM(C73-(E73:J73))/6)))),\"\",IF(C73=\"\",\"\",IF(version>=5,(SUM(C73-(G73:H73))/2),(SUM(C73-(E73:J73))/6))))","v":""}]
[null,{"$f":"IF(version>2,IF(Sieve3=\"\",\"\",Sieve3),IF(SSieve3=\"\",\"\",SSieve3))","v":""},{"$f":"IF(AND(Percent_Retained=\"Yes\",D31<>\"\",E31<>\"\"),Sheet1!H21,IF(version>=5,IF(OR(Sheet1!M21=\"\",D31=\"\"),\"\",Sheet1!M21),IF(version>2,IF(OR(Sheet1!M21=\"\",D31=\"\",E31=\"\"),\"\",Sheet1!M21),IF(version>1,IF(OR(D31=\"\",E31=\"\"),\"\",AVERAGE(D31:E31)),IF(D31=\"\",\"\",D31)))))","v":""},{"$f":"IF(AND(version>2,C74<>\"\"),IF(OR(AND(Percent_Retained=\"\",Spec3=\"No\"),AND(Percent_Retained=\"Yes\",RetSpec3=\"No\")),\"ý\",\"þ\"),\"\")","v":""},{"$f":"+IF(OR($F$22=\"\",F31=\"\"),\"\", IF(Percent_Retained=\"Yes\",Sheet1!B6,(100-Sheet1!B6)))","v":""},{"$f":"+IF(OR($G$22=\"\",G31=\"\"),\"\",IF(Percent_Retained=\"Yes\",Sheet1!D6,(100-Sheet1!D6)))","v":""},{"$f":"+IF(OR($H$22=\"\",H31=\"\"),\"\",IF(Percent_Retained=\"Yes\",Sheet1!F6,(100-Sheet1!F6)))","v":""},{"$f":"+IF(OR($I$22=\"\",I31=\"\"),\"\",IF(Percent_Retained=\"Yes\",Sheet1!H6,(100-Sheet1!H6)))","v":""},{"$f":"+IF(OR($J$22=\"\",J31=\"\"),\"\",IF(Percent_Retained=\"Yes\",Sheet1!J6,(100-Sheet1!J6)))","v":""},{"$f":"+IF(OR($K$22=\"\",K31=\"\"),\"\",IF(Percent_Retained=\"Yes\",Sheet1!L6,(100-Sheet1!L6)))","v":""},{"$f":"IF(ISERROR(IF(C74=\"\",\"\",IF(version>=5,(SUM(C74-(G74:H74))/2),(SUM(C74-(E74:J74))/6)))),\"\",IF(C74=\"\",\"\",IF(version>=5,(SUM(C74-(G74:H74))/2),(SUM(C74-(E74:J74))/6))))","v":""}]
[null,{"$f":"IF(version>2,IF(Sieve4=\"\",\"\",Sieve4),IF(SSieve4=\"\",\"\",SSieve4))","v":""},{"$f":"IF(AND(Percent_Retained=\"Yes\",D32<>\"\",E32<>\"\"),Sheet1!H22,IF(version>=5,IF(OR(Sheet1!M22=\"\",D32=\"\"),\"\",Sheet1!M22),IF(version>2,IF(OR(Sheet1!M22=\"\",D32=\"\",E32=\"\"),\"\",Sheet1!M22),IF(version>1,IF(OR(D32=\"\",E32=\"\"),\"\",AVERAGE(D32:E32)),IF(D32=\"\",\"\",D32)))))","v":""},{"$f":"IF(AND(version>2,C75<>\"\"),IF(OR(AND(Percent_Retained=\"\",Spec4=\"No\"),AND(Percent_Retained=\"Yes\",RetSpec4=\"No\")),\"ý\",\"þ\"),\"\")","v":""},{"$f":"+IF(OR($F$22=\"\",F32=\"\"),\"\", IF(Percent_Retained=\"Yes\",Sheet1!B7,(100-Sheet1!B7)))","v":""},{"$f":"+IF(OR($G$22=\"\",G32=\"\"),\"\",IF(Percent_Retained=\"Yes\",Sheet1!D7,(100-Sheet1!D7)))","v":""},{"$f":"+IF(OR($H$22=\"\",H32=\"\"),\"\",IF(Percent_Retained=\"Yes\",Sheet1!F7,(100-Sheet1!F7)))","v":""},{"$f":"+IF(OR($I$22=\"\",I32=\"\"),\"\",IF(Percent_Retained=\"Yes\",Sheet1!H7,(100-Sheet1!H7)))","v":""},{"$f":"+IF(OR($J$22=\"\",J32=\"\"),\"\",IF(Percent_Retained=\"Yes\",Sheet1!J7,(100-Sheet1!J7)))","v":""},{"$f":"+IF(OR($K$22=\"\",K32=\"\"),\"\",IF(Percent_Retained=\"Yes\",Sheet1!L7,(100-Sheet1!L7)))","v":""},{"$f":"IF(ISERROR(IF(C75=\"\",\"\",IF(version>=5,(SUM(C75-(G75:H75))/2),(SUM(C75-(E75:J75))/6)))),\"\",IF(C75=\"\",\"\",IF(version>=5,(SUM(C75-(G75:H75))/2),(SUM(C75-(E75:J75))/6))))","v":""}]
[null,{"$f":"IF(version>2,IF(Sieve5=\"\",\"\",Sieve5),IF(SSieve5=\"\",\"\",SSieve5))","v":""},{"$f":"IF(AND(Percent_Retained=\"Yes\",D33<>\"\",E33<>\"\"),Sheet1!H23,IF(version>=5,IF(OR(Sheet1!M23=\"\",D33=\"\"),\"\",Sheet1!M23),IF(version>2,IF(OR(Sheet1!M23=\"\",D33=\"\",E33=\"\"),\"\",Sheet1!M23),IF(version>1,IF(OR(D33=\"\",E33=\"\"),\"\",AVERAGE(D33:E33)),IF(D33=\"\",\"\",D33)))))","v":""},{"$f":"IF(AND(version>2,C76<>\"\"),IF(OR(AND(Percent_Retained=\"\",Spec5=\"No\"),AND(Percent_Retained=\"Yes\",RetSpec5=\"No\")),\"ý\",\"þ\"),\"\")","v":""},{"$f":"+IF(OR($F$22=\"\",F33=\"\"),\"\", IF(Percent_Retained=\"Yes\",Sheet1!B8,(100-Sheet1!B8)))","v":""},{"$f":"+IF(OR($G$22=\"\",G33=\"\"),\"\",IF(Percent_Retained=\"Yes\",Sheet1!D8,(100-Sheet1!D8)))","v":""},{"$f":"+IF(OR($H$22=\"\",H33=\"\"),\"\",IF(Percent_Retained=\"Yes\",Sheet1!F8,(100-Sheet1!F8)))","v":""},{"$f":"+IF(OR($I$22=\"\",I33=\"\"),\"\",IF(Percent_Retained=\"Yes\",Sheet1!H8,(100-Sheet1!H8)))","v":""},{"$f":"+IF(OR($J$22=\"\",J33=\"\"),\"\",IF(Percent_Retained=\"Yes\",Sheet1!J8,(100-Sheet1!J8)))","v":""},{"$f":"+IF(OR($K$22=\"\",K33=\"\"),\"\",IF(Percent_Retained=\"Yes\",Sheet1!L8,(100-Sheet1!L8)))","v":""},{"$f":"IF(ISERROR(IF(C76=\"\",\"\",IF(version>=5,(SUM(C76-(G76:H76))/2),(SUM(C76-(E76:J76))/6)))),\"\",IF(C76=\"\",\"\",IF(version>=5,(SUM(C76-(G76:H76))/2),(SUM(C76-(E76:J76))/6))))","v":""}]
[null,{"$f":"IF(version>2,IF(Sieve6=\"\",\"\",Sieve6),IF(SSieve6=\"\",\"\",SSieve6))","v":""},{"$f":"IF(AND(Percent_Retained=\"Yes\",D34<>\"\",E34<>\"\"),Sheet1!H24,IF(version>=5,IF(OR(Sheet1!M24=\"\",D34=\"\"),\"\",Sheet1!M24),IF(version>2,IF(OR(Sheet1!M24=\"\",D34=\"\",E34=\"\"),\"\",Sheet1!M24),IF(version>1,IF(OR(D34=\"\",E34=\"\"),\"\",AVERAGE(D34:E34)),IF(D34=\"\",\"\",D34)))))","v":""},{"$f":"IF(AND(version>2,C77<>\"\"),IF(OR(AND(Percent_Retained=\"\",Spec6=\"No\"),AND(Percent_Retained=\"Yes\",RetSpec6=\"No\")),\"ý\",\"þ\"),\"\")","v":""},{"$f":"+IF(OR($F$22=\"\",F34=\"\"),\"\", IF(Percent_Retained=\"Yes\",Sheet1!B9,(100-Sheet1!B9)))","v":""},{"$f":"+IF(OR($G$22=\"\",G34=\"\"),\"\",IF(Percent_Retained=\"Yes\",Sheet1!D9,(100-Sheet1!D9)))","v":""},{"$f":"+IF(OR($H$22=\"\",H34=\"\"),\"\",IF(Percent_Retained=\"Yes\",Sheet1!F9,(100-Sheet1!F9)))","v":""},{"$f":"+IF(OR($I$22=\"\",I34=\"\"),\"\",IF(Percent_Retained=\"Yes\",Sheet1!H9,(100-Sheet1!H9)))","v":""},{"$f":"+IF(OR($J$22=\"\",J34=\"\"),\"\",IF(Percent_Retained=\"Yes\",Sheet1!J9,(100-Sheet1!J9)))","v":""},{"$f":"+IF(OR($K$22=\"\",K34=\"\"),\"\",IF(Percent_Retained=\"Yes\",Sheet1!L9,(100-Sheet1!L9)))","v":""},{"$f":"IF(ISERROR(IF(C77=\"\",\"\",IF(version>=5,(SUM(C77-(G77:H77))/2),(SUM(C77-(E77:J77))/6)))),\"\",IF(C77=\"\",\"\",IF(version>=5,(SUM(C77-(G77:H77))/2),(SUM(C77-(E77:J77))/6))))","v":""}]
[null,{"$f":"IF(version>2,IF(Sieve7=\"\",\"\",Sieve7),IF(SSieve7=\"\",\"\",SSieve7))","v":""},{"$f":"IF(AND(Percent_Retained=\"Yes\",D35<>\"\",E35<>\"\"),Sheet1!H25,IF(version>=5,IF(OR(Sheet1!M25=\"\",D35=\"\"),\"\",Sheet1!M25),IF(version>2,IF(OR(Sheet1!M25=\"\",D35=\"\",E35=\"\"),\"\",Sheet1!M25),IF(version>1,IF(OR(D35=\"\",E35=\"\"),\"\",AVERAGE(D35:E35)),IF(D35=\"\",\"\",D35)))))","v":""},{"$f":"IF(AND(version>2,C78<>\"\"),IF(OR(AND(Percent_Retained=\"\",Spec7=\"No\"),AND(Percent_Retained=\"Yes\",RetSpec7=\"No\")),\"ý\",\"þ\"),\"\")","v":""},{"$f":"+IF(OR($F$22=\"\",F35=\"\"),\"\", IF(Percent_Retained=\"Yes\",Sheet1!B10,(100-Sheet1!B10)))","v":""},{"$f":"+IF(OR($G$22=\"\",G35=\"\"),\"\",IF(Percent_Retained=\"Yes\",Sheet1!D10,(100-Sheet1!D10)))","v":""},{"$f":"+IF(OR($H$22=\"\",H35=\"\"),\"\",IF(Percent_Retained=\"Yes\",Sheet1!F10,(100-Sheet1!F10)))","v":""},{"$f":"+IF(OR($I$22=\"\",I35=\"\"),\"\",IF(Percent_Retained=\"Yes\",Sheet1!H10,(100-Sheet1!H10)))","v":""},{"$f":"+IF(OR($J$22=\"\",J35=\"\"),\"\",IF(Percent_Retained=\"Yes\",Sheet1!J10,(100-Sheet1!J10)))","v":""},{"$f":"+IF(OR($K$22=\"\",K35=\"\"),\"\",IF(Percent_Retained=\"Yes\",Sheet1!L10,(100-Sheet1!L10)))","v":""},{"$f":"IF(ISERROR(IF(C78=\"\",\"\",IF(version>=5,(SUM(C78-(G78:H78))/2),(SUM(C78-(E78:J78))/6)))),\"\",IF(C78=\"\",\"\",IF(version>=5,(SUM(C78-(G78:H78))/2),(SUM(C78-(E78:J78))/6))))","v":""}]
[null,{"$f":"IF(version>2,IF(Sieve8=\"\",\"\",Sieve8),IF(SSieve8=\"\",\"\",SSieve8))","v":""},{"$f":"IF(AND(Percent_Retained=\"Yes\",D36<>\"\",E36<>\"\"),Sheet1!H26,IF(version>=5,IF(OR(Sheet1!M26=\"\",D36=\"\"),\"\",Sheet1!M26),IF(version>2,IF(OR(Sheet1!M26=\"\",D36=\"\",E36=\"\"),\"\",Sheet1!M26),IF(version>1,IF(OR(D36=\"\",E36=\"\"),\"\",AVERAGE(D36:E36)),IF(D36=\"\",\"\",D36)))))","v":""},{"$f":"IF(AND(version>2,C79<>\"\"),IF(OR(AND(Percent_Retained=\"\",Spec8=\"No\"),AND(Percent_Retained=\"Yes\",RetSpec8=\"No\")),\"ý\",\"þ\"),\"\")","v":""},{"$f":"+IF(OR($F$22=\"\",F36=\"\"),\"\", IF(Percent_Retained=\"Yes\",Sheet1!B11,(100-Sheet1!B11)))","v":""},{"$f":"+IF(OR($G$22=\"\",G36=\"\"),\"\",IF(Percent_Retained=\"Yes\",Sheet1!D11,(100-Sheet1!D11)))","v":""},{"$f":"+IF(OR($H$22=\"\",H36=\"\"),\"\",IF(Percent_Retained=\"Yes\",Sheet1!F11,(100-Sheet1!F11)))","v":""},{"$f":"+IF(OR($I$22=\"\",I36=\"\"),\"\",IF(Percent_Retained=\"Yes\",Sheet1!H11,(100-Sheet1!H11)))","v":""},{"$f":"+IF(OR($J$22=\"\",J36=\"\"),\"\",IF(Percent_Retained=\"Yes\",Sheet1!J11,(100-Sheet1!J11)))","v":""},{"$f":"+IF(OR($K$22=\"\",K36=\"\"),\"\",IF(Percent_Retained=\"Yes\",Sheet1!L11,(100-Sheet1!L11)))","v":""},{"$f":"IF(ISERROR(IF(C79=\"\",\"\",IF(version>=5,(SUM(C79-(G79:H79))/2),(SUM(C79-(E79:J79))/6)))),\"\",IF(C79=\"\",\"\",IF(version>=5,(SUM(C79-(G79:H79))/2),(SUM(C79-(E79:J79))/6))))","v":""}]
[null,{"$f":"IF(version>2,IF(Sieve9=\"\",\"\",Sieve9),IF(SSieve9=\"\",\"\",SSieve9))","v":""},{"$f":"IF(AND(Percent_Retained=\"Yes\",D37<>\"\",E37<>\"\"),Sheet1!H27,IF(version>=5,IF(OR(Sheet1!M27=\"\",D37=\"\"),\"\",Sheet1!M27),IF(version>2,IF(OR(Sheet1!M27=\"\",D37=\"\",E37=\"\"),\"\",Sheet1!M27),IF(version>1,IF(OR(D37=\"\",E37=\"\"),\"\",AVERAGE(D37:E37)),IF(D37=\"\",\"\",D37)))))","v":""},{"$f":"IF(AND(version>2,C80<>\"\"),IF(OR(AND(Percent_Retained=\"\",Spec9=\"No\"),AND(Percent_Retained=\"Yes\",RetSpec9=\"No\")),\"ý\",\"þ\"),\"\")","v":""},{"$f":"+IF(OR($F$22=\"\",F37=\"\"),\"\", IF(Percent_Retained=\"Yes\",Sheet1!B12,(100-Sheet1!B12)))","v":""},{"$f":"+IF(OR($G$22=\"\",G37=\"\"),\"\",IF(Percent_Retained=\"Yes\",Sheet1!D12,(100-Sheet1!D12)))","v":""},{"$f":"+IF(OR($H$22=\"\",H37=\"\"),\"\",IF(Percent_Retained=\"Yes\",Sheet1!F12,(100-Sheet1!F12)))","v":""},{"$f":"+IF(OR($I$22=\"\",I37=\"\"),\"\",IF(Percent_Retained=\"Yes\",Sheet1!H12,(100-Sheet1!H12)))","v":""},{"$f":"+IF(OR($J$22=\"\",J37=\"\"),\"\",IF(Percent_Retained=\"Yes\",Sheet1!J12,(100-Sheet1!J12)))","v":""},{"$f":"+IF(OR($K$22=\"\",K37=\"\"),\"\",IF(Percent_Retained=\"Yes\",Sheet1!L12,(100-Sheet1!L12)))","v":""},{"$f":"IF(ISERROR(IF(C80=\"\",\"\",IF(version>=5,(SUM(C80-(G80:H80))/2),(SUM(C80-(E80:J80))/6)))),\"\",IF(C80=\"\",\"\",IF(version>=5,(SUM(C80-(G80:H80))/2),(SUM(C80-(E80:J80))/6))))","v":""}]
[null,{"$f":"IF(version>2,IF(Sieve10=\"\",\"\",Sieve10),IF(SSieve10=\"\",\"\",SSieve10))","v":""},{"$f":"IF(AND(Percent_Retained=\"Yes\",D38<>\"\",E38<>\"\"),Sheet1!H28,IF(version>=5,IF(OR(Sheet1!M28=\"\",D38=\"\"),\"\",Sheet1!M28),IF(version>2,IF(OR(Sheet1!M28=\"\",D38=\"\",E38=\"\"),\"\",Sheet1!M28),IF(version>1,IF(OR(D38=\"\",E38=\"\"),\"\",AVERAGE(D38:E38)),IF(D38=\"\",\"\",D38)))))","v":""},{"$f":"IF(AND(version>2,C81<>\"\"),IF(OR(AND(Percent_Retained=\"\",Spec10=\"No\"),AND(Percent_Retained=\"Yes\",RetSpec10=\"No\")),\"ý\",\"þ\"),\"\")","v":""},{"$f":"+IF(OR($F$22=\"\",F38=\"\"),\"\", IF(Percent_Retained=\"Yes\",Sheet1!B13,(100-Sheet1!B13)))","v":""},{"$f":"+IF(OR($G$22=\"\",G38=\"\"),\"\",IF(Percent_Retained=\"Yes\",Sheet1!D13,(100-Sheet1!D13)))","v":""},{"$f":"+IF(OR($H$22=\"\",H38=\"\"),\"\",IF(Percent_Retained=\"Yes\",Sheet1!F13,(100-Sheet1!F13)))","v":""},{"$f":"+IF(OR($I$22=\"\",I38=\"\"),\"\",IF(Percent_Retained=\"Yes\",Sheet1!H13,(100-Sheet1!H13)))","v":""},{"$f":"+IF(OR($J$22=\"\",J38=\"\"),\"\",IF(Percent_Retained=\"Yes\",Sheet1!J13,(100-Sheet1!J13)))","v":""},{"$f":"+IF(OR($K$22=\"\",K38=\"\"),\"\",IF(Percent_Retained=\"Yes\",Sheet1!L13,(100-Sheet1!L13)))","v":""},{"$f":"IF(ISERROR(IF(C81=\"\",\"\",IF(version>=5,(SUM(C81-(G81:H81))/2),(SUM(C81-(E81:J81))/6)))),\"\",IF(C81=\"\",\"\",IF(version>=5,(SUM(C81-(G81:H81))/2),(SUM(C81-(E81:J81))/6))))","v":""}]
[null,{"$f":"IF(version>2,IF(Sieve11=\"\",\"\",Sieve11),IF(SSieve11=\"\",\"\",SSieve11))","v":""},{"$f":"IF(AND(Percent_Retained=\"Yes\",D39<>\"\",E39<>\"\"),Sheet1!H29,IF(version>=5,IF(OR(Sheet1!M29=\"\",D39=\"\"),\"\",Sheet1!M29),IF(version>2,IF(OR(Sheet1!M29=\"\",D39=\"\",E39=\"\"),\"\",Sheet1!M29),IF(version>1,IF(OR(D39=\"\",E39=\"\"),\"\",AVERAGE(D39:E39)),IF(D39=\"\",\"\",D39)))))","v":""},{"$f":"IF(AND(version>2,C82<>\"\"),IF(OR(AND(Percent_Retained=\"\",Spec11=\"No\"),AND(Percent_Retained=\"Yes\",RetSpec11=\"No\")),\"ý\",\"þ\"),\"\")","v":""},{"$f":"+IF(OR($F$22=\"\",F39=\"\"),\"\", IF(Percent_Retained=\"Yes\",Sheet1!B14,(100-Sheet1!B14)))","v":""},{"$f":"+IF(OR($G$22=\"\",G39=\"\"),\"\",IF(Percent_Retained=\"Yes\",Sheet1!D14,(100-Sheet1!D14)))","v":""},{"$f":"+IF(OR($H$22=\"\",H39=\"\"),\"\",IF(Percent_Retained=\"Yes\",Sheet1!F14,(100-Sheet1!F14)))","v":""},{"$f":"+IF(OR($I$22=\"\",I39=\"\"),\"\",IF(Percent_Retained=\"Yes\",Sheet1!H14,(100-Sheet1!H14)))","v":""},{"$f":"+IF(OR($J$22=\"\",J39=\"\"),\"\",IF(Percent_Retained=\"Yes\",Sheet1!J14,(100-Sheet1!J14)))","v":""},{"$f":"+IF(OR($K$22=\"\",K39=\"\"),\"\",IF(Percent_Retained=\"Yes\",Sheet1!L14,(100-Sheet1!L14)))","v":""},{"$f":"IF(ISERROR(IF(C82=\"\",\"\",IF(version>=5,(SUM(C82-(G82:H82))/2),(SUM(C82-(E82:J82))/6)))),\"\",IF(C82=\"\",\"\",IF(version>=5,(SUM(C82-(G82:H82))/2),(SUM(C82-(E82:J82))/6))))","v":""}]
[]
[null,"ASPHALT CONTENT CORRECTION FACTOR CALCULATIONS"]
[null,{"$f":"IF(Field106<>\"\",IF(IF(version>=5,OR(Field103<>OAC,Field104<>OAC),OR(Field101<>OAC-0.5,Field102<>OAC-0.5, Field103<>OAC,Field104<>OAC, Field105<>OAC+0.5,Field106<>OAC+0.5)),\"Does not comply with Tex-236-F\",\"\"),\"\")","v":""},null,null,{"$f":"F26","v":"@OAC-0.5%AC"},null,{"$f":"H26","v":"@OAC"},null,{"$f":"J26","v":"@OAC+0.5%AC"},null,"AVG Difference Target-Measured"]
[null,"Target AC %"]
[null,"Measured AC %",null,null,null,null,null,null,null,null,{"$f":"IF(version>=5,IF(G86=\"\",\"\", (((G86-G87)+(H86-H87))/2)),IF(E86=\"\",\"\", (((E86-E87)+(F86-F87)+(G86-G87)+(H86-H87)+(I86-I87)+(J86-J87))/6)))","v":""}]
[null,null,null,null,{"$f":"AVERAGE(G86:H86)","v":{"$error":"#DIV/0!"}},{"$f":"OAC-0.5","v":{"$error":"#DIV/0!"}},{"$f":"OAC+0.5","v":{"$error":"#DIV/0!"}}]
[null,"ASPHALT CONTENT VERIFICATION"]
[null,"Rice Specimen"]
[null,"Asphalt Specific Gravity",null,null,"Rice#1 @OAC",null,"Rice#2 @OAC",null,"Rice#3 @OAC",null,"Average Rice"]
[null,{"$f":"IF(version>=6,\"Target AC % @OAC\",\"Laboratory AC % @OAC\")","v":"Target AC % @OAC"},null,{"$f":"IF(Field103<>\"\",Field103,IF(Field104<>\"\",Field104,\"\"))","v":""},null,null,null,null,null,null,{"$f":"IF(version>=5,IFERROR(AVERAGE(E92:J92),\"\"),\"\")","v":""}]
[null,"Effective Specific Gravity",null,{"$f":"IF(version>=5,IFERROR((100-D$92)/((100/K$92)-(D$92/D$91)),\"\"),\"\")","v":""}]
[null,"Production Test Specimen"]
[null,"Maximum Specific Gravity",null,null,null,null,null,null,"Back Calculated AC %",null,{"$f":"IF(version>=5,IFERROR(((($D$93*100)/$E$95)-100)/(($D$93/$D$91)-1),\"\"),\"\")","v":""}]
[]
[null,"Remarks:",{"$f":"NOW()","v":"2025-03-03T10:37:29.700"}]
[]
[]
[]
[]
[]
[null,"Sample Method:","Sampled By:",null,null,"Sampled Date:"]
[null,"TX221"]
[]
[null,"TX222"]
[null,"Test Method:","Tested By:",null,null,"Tested Date:"]
[null,"TX236"]
[]
[null,"TX236PI"]
[]
[null,"TX236PII"]
[]
[null,"Test Stamp Code:",null,null,"Omit Test:","Completed Date:","Reviewed By:"]
[]
[null,"Locked By:","TxDOT:","District:","Area:"]
[null,"","","",""]
[null,"Authorized By:",null,null,"Authorized Date:"]
[null,null,null,null,null,{"$f":"IF(OR(AuthorizedDate=\"\",AuthorizedDate>43888),7,IF(AuthorizedDate>43787,6,IF(AuthorizedDate>43700,5,IF(AuthorizedDate>42198,4,IF(AuthorizedDate>39872.9,3,IF(AuthorizedDate>39599.9,2,1))))))","v":7}]
[]
[null,null,null,null,{"$f":"AuthorizedDate","v":0}]

{"sheet":"RX","index":1,"n_rows":319,"n_cols":9,"rows_kept":319,"cut":false,"hidden":true,"merged":[]}
[{"$f":"COUNT(A3:A5000)","v":317}]
["Fld_nbr","Value","Desc_1","Desc_2","Desc_3","Desc_4","Desc_5","Desc_6","Desc_7"]
[1,{"$f":"IF('Tx236'!$B$98=\"\",\"\",'Tx236'!$B$98)","v":""},{"$f":"'Tx236'!$B$97","v":"Remarks:"}]
[2,{"$f":"IF('Tx236'!$D$19=\"\",\"\",'Tx236'!$D$19)","v":""},{"$f":"IF('Tx236'!$C$19=\"\",\"\",'Tx236'!$C$19)","v":"COURSE\\LIFT:"}]
[3,{"$f":"IF('Tx236'!$C$108=\"\",\"\",'Tx236'!$C$108)","v":""},"Tested By ",{"$f":"IF('Tx236'!$B$108=\"\",\"\",'Tx236'!$B$108)","v":"TX236"}]
[4,{"$f":"IF('Tx236'!$F$108=\"\",\"\",'Tx236'!$F$108)","v":""},"Tested Date ",{"$f":"IF('Tx236'!$B$108=\"\",\"\",'Tx236'!$B$108)","v":"TX236"}]
[5,{"$f":"IF('Tx236'!$F$22=\"\",\"\",'Tx236'!$F$22)","v":""},{"$f":"IF('Tx236'!$B$21=\"\",\"\",'Tx236'!$B$21)","v":"SIEVE ANALYSIS WORKSHEET FOR CALIBRATION SAMPLES"},{"$f":"IF('Tx236'!$B$22=\"\",\"\",'Tx236'!$B$22)","v":"Original Sample Weight:"},{"$f":"IF('Tx236'!F23=\"\",\"\",'Tx236'!F23)","v":"Ignited Sample 1"}]
[6,{"$f":"IF('Tx236'!$G$22=\"\",\"\",'Tx236'!$G$22)","v":""},{"$f":"IF('Tx236'!$B$21=\"\",\"\",'Tx236'!$B$21)","v":"SIEVE ANALYSIS WORKSHEET FOR CALIBRATION SAMPLES"},{"$f":"IF('Tx236'!$B$22=\"\",\"\",'Tx236'!$B$22)","v":"Original Sample Weight:"},{"$f":"IF('Tx236'!G23=\"\",\"\",'Tx236'!G23)","v":"Ignited Sample 2"}]
[7,{"$f":"IF('Tx236'!$H$22=\"\",\"\",'Tx236'!$H$22)","v":""},{"$f":"IF('Tx236'!$B$21=\"\",\"\",'Tx236'!$B$21)","v":"SIEVE ANALYSIS WORKSHEET FOR CALIBRATION SAMPLES"},{"$f":"IF('Tx236'!$B$22=\"\",\"\",'Tx236'!$B$22)","v":"Original Sample Weight:"},{"$f":"IF('Tx236'!H23=\"\",\"\",'Tx236'!H23)","v":"Ignited Sample 1"}]
[8,{"$f":"IF('Tx236'!$I$22=\"\",\"\",'Tx236'!$I$22)","v":""},{"$f":"IF('Tx236'!$B$21=\"\",\"\",'Tx236'!$B$21)","v":"SIEVE ANALYSIS WORKSHEET FOR CALIBRATION SAMPLES"},{"$f":"IF('Tx236'!$B$22=\"\",\"\",'Tx236'!$B$22)","v":"Original Sample Weight:"},{"$f":"IF('Tx236'!I23=\"\",\"\",'Tx236'!I23)","v":"Ignited Sample 2"}]
[9,{"$f":"IF('Tx236'!$J$22=\"\",\"\",'Tx236'!$J$22)","v":""},{"$f":"IF('Tx236'!$B$21=\"\",\"\",'Tx236'!$B$21)","v":"SIEVE ANALYSIS WORKSHEET FOR CALIBRATION SAMPLES"},{"$f":"IF('Tx236'!$B$22=\"\",\"\",'Tx236'!$B$22)","v":"Original Sample Weight:"},{"$f":"IF('Tx236'!J23=\"\",\"\",'Tx236'!J23)","v":"Ignited Sample 5"}]
[10,{"$f":"IF('Tx236'!$K$22=\"\",\"\",'Tx236'!$K$22)","v":""},{"$f":"IF('Tx236'!$B$21=\"\",\"\",'Tx236'!$B$21)","v":"SIEVE ANALYSIS WORKSHEET FOR CALIBRATION SAMPLES"},{"$f":"IF('Tx236'!$B$22=\"\",\"\",'Tx236'!$B$22)","v":"Original Sample Weight:"},{"$f":"IF('Tx236'!K23=\"\",\"\",'Tx236'!K23)","v":"Ignited     Sample 6"}]
[11,{"$f":"IF('Tx236'!$D$29=\"\",\"\",'Tx236'!$D$29)","v":""},{"$f":"IF('Tx236'!$B$21=\"\",\"\",'Tx236'!$B$21)","v":"SIEVE ANALYSIS WORKSHEET FOR CALIBRATION SAMPLES"},{"$f":"IF('Tx236'!$B$69=\"\",\"\",'Tx236'!$B$69)","v":"Sieve Size"},{"$f":"IF('Tx236'!$B$72=\"\",\"\",'Tx236'!$B$72)","v":""},{"$f":"IF('Tx236'!$D$24=\"\",\"\",'Tx236'!$D$24)","v":"Blank Sample"},{"$f":"IF('Tx236'!$D$28=\"\",\"\",'Tx236'!$D$28)","v":"Individual Weight Retained"}]
[12,{"$f":"IF('Tx236'!$F$29=\"\",\"\",'Tx236'!$F$29)","v":""},{"$f":"IF('Tx236'!$B$21=\"\",\"\",'Tx236'!$B$21)","v":"SIEVE ANALYSIS WORKSHEET FOR CALIBRATION SAMPLES"},{"$f":"IF('Tx236'!$B$69=\"\",\"\",'Tx236'!$B$69)","v":"Sieve Size"},{"$f":"IF('Tx236'!$B$72=\"\",\"\",'Tx236'!$B$72)","v":""},{"$f":"IF('Tx236'!$F$23=\"\",\"\",'Tx236'!$F$23)","v":"Ignited Sample 1"},{"$f":"IF('Tx236'!$F$28=\"\",\"\",'Tx236'!$F$28)","v":"Individual Weight Retained"}]
[13,{"$f":"IF('Tx236'!$G$29=\"\",\"\",'Tx236'!$G$29)","v":""},{"$f":"IF('Tx236'!$B$21=\"\",\"\",'Tx236'!$B$21)","v":"SIEVE ANALYSIS WORKSHEET FOR CALIBRATION SAMPLES"},{"$f":"IF('Tx236'!$B$69=\"\",\"\",'Tx236'!$B$69)","v":"Sieve Size"},{"$f":"IF('Tx236'!$B$72=\"\",\"\",'Tx236'!$B$72)","v":""},{"$f":"IF('Tx236'!$G$23=\"\",\"\",'Tx236'!$G$23)","v":"Ignited Sample 2"},{"$f":"IF('Tx236'!$F$28=\"\",\"\",'Tx236'!$F$28)","v":"Individual Weight Retained"}]
[14,{"$f":"IF('Tx236'!$H$29=\"\",\"\",'Tx236'!$H$29)","v":""},{"$f":"IF('Tx236'!$B$21=\"\",\"\",'Tx236'!$B$21)","v":"SIEVE ANALYSIS WORKSHEET FOR CALIBRATION SAMPLES"},{"$f":"IF('Tx236'!$B$69=\"\",\"\",'Tx236'!$B$69)","v":"Sieve Size"},{"$f":"IF('Tx236'!$B$72=\"\",\"\",'Tx236'!$B$72)","v":""},{"$f":"IF('Tx236'!$H$23=\"\",\"\",'Tx236'!$H$23)","v":"Ignited Sample 1"},{"$f":"IF('Tx236'!$F$28=\"\",\"\",'Tx236'!$F$28)","v":"Individual Weight Retained"}]
[15,{"$f":"IF('Tx236'!$I$29=\"\",\"\",'Tx236'!$I$29)","v":""},{"$f":"IF('Tx236'!$B$21=\"\",\"\",'Tx236'!$B$21)","v":"SIEVE ANALYSIS WORKSHEET FOR CALIBRATION SAMPLES"},{"$f":"IF('Tx236'!$B$69=\"\",\"\",'Tx236'!$B$69)","v":"Sieve Size"},{"$f":"IF('Tx236'!$B$72=\"\",\"\",'Tx236'!$B$72)","v":""},{"$f":"IF('Tx236'!$I$23=\"\",\"\",'Tx236'!$I$23)","v":"Ignited Sample 2"},{"$f":"IF('Tx236'!$F$28=\"\",\"\",'Tx236'!$F$28)","v":"Individual Weight Retained"}]
[16,{"$f":"IF('Tx236'!$J$29=\"\",\"\",'Tx236'!$J$29)","v":""},{"$f":"IF('Tx236'!$B$21=\"\",\"\",'Tx236'!$B$21)","v":"SIEVE ANALYSIS WORKSHEET FOR CALIBRATION SAMPLES"},{"$f":"IF('Tx236'!$B$69=\"\",\"\",'Tx236'!$B$69)","v":"Sieve Size"},{"$f":"IF('Tx236'!$B$72=\"\",\"\",'Tx236'!$B$72)","v":""},{"$f":"IF('Tx236'!$J$23=\"\",\"\",'Tx236'!$J$23)","v":"Ignited Sample 5"},{"$f":"IF('Tx236'!$F$28=\"\",\"\",'Tx236'!$F$28)","v":"Individual Weight Retained"}]
[17,{"$f":"IF('Tx236'!$K$29=\"\",\"\",'Tx236'!$K$29)","v":""},{"$f":"IF('Tx236'!$B$21=\"\",\"\",'Tx236'!$B$21)","v":"SIEVE ANALYSIS WORKSHEET FOR CALIBRATION SAMPLES"},{"$f":"IF('Tx236'!$B$69=\"\",\"\",'Tx236'!$B$69)","v":"Sieve Size"},{"$f":"IF('Tx236'!$B$72=\"\",\"\",'Tx236'!$B$72)","v":""},{"$f":"IF('Tx236'!$K$23=\"\",\"\",'Tx236'!$K$23)","v":"Ignited     Sample 6"},{"$f":"IF('Tx236'!$F$28=\"\",\"\",'Tx236'!$F$28)","v":"Individual Weight Retained"}]
[18,{"$f":"IF('Tx236'!$D$30=\"\",\"\",'Tx236'!$D$30)","v":""},{"$f":"IF('Tx236'!$B$21=\"\",\"\",'Tx236'!$B$21)","v":"SIEVE ANALYSIS WORKSHEET FOR CALIBRATION SAMPLES"},{"$f":"IF('Tx236'!$B$69=\"\",\"\",'Tx236'!$B$69)","v":"Sieve Size"},{"$f":"IF('Tx236'!$B$73=\"\",\"\",'Tx236'!$B$73)","v":""},{"$f":"IF('Tx236'!$D$24=\"\",\"\",'Tx236'!$D$24)","v":"Blank Sample"},{"$f":"IF('Tx236'!$D$28=\"\",\"\",'Tx236'!$D$28)","v":"Individual Weight Retained"}]
[19,{"$f":"IF('Tx236'!$F$30=\"\",\"\",'Tx236'!$F$30)","v":""},{"$f":"IF('Tx236'!$B$21=\"\",\"\",'Tx236'!$B$21)","v":"SIEVE ANALYSIS WORKSHEET FOR CALIBRATION SAMPLES"},{"$f":"IF('Tx236'!$B$69=\"\",\"\",'Tx236'!$B$69)","v":"Sieve Size"},{"$f":"IF('Tx236'!$B$73=\"\",\"\",'Tx236'!$B$73)","v":""},{"$f":"IF('Tx236'!$F$23=\"\",\"\",'Tx236'!$F$23)","v":"Ignited Sample 1"},{"$f":"IF('Tx236'!$F$28=\"\",\"\",'Tx236'!$F$28)","v":"Individual Weight Retained"}]
[20,{"$f":"IF('Tx236'!$G$30=\"\",\"\",'Tx236'!$G$30)","v":""},{"$f":"IF('Tx236'!$B$21=\"\",\"\",'Tx236'!$B$21)","v":"SIEVE ANALYSIS WORKSHEET FOR CALIBRATION SAMPLES"},{"$f":"IF('Tx236'!$B$69=\"\",\"\",'Tx236'!$B$69)","v":"Sieve Size"},{"$f":"IF('Tx236'!$B$73=\"\",\"\",'Tx236'!$B$73)","v":""},{"$f":"IF('Tx236'!$G$23=\"\",\"\",'Tx236'!$G$23)","v":"Ignited Sample 2"},{"$f":"IF('Tx236'!$F$28=\"\",\"\",'Tx236'!$F$28)","v":"Individual Weight Retained"}]
[21,{"$f":"IF('Tx236'!$H$30=\"\",\"\",'Tx236'!$H$30)","v":""},{"$f":"IF('Tx236'!$B$21=\"\",\"\",'Tx236'!$B$21)","v":"SIEVE ANALYSIS WORKSHEET FOR CALIBRATION SAMPLES"},{"$f":"IF('Tx236'!$B$69=\"\",\"\",'Tx236'!$B$69)","v":"Sieve Size"},{"$f":"IF('Tx236'!$B$73=\"\",\"\",'Tx236'!$B$73)","v":""},{"$f":"IF('Tx236'!$H$23=\"\",\"\",'Tx236'!$H$23)","v":"Ignited Sample 1"},{"$f":"IF('Tx236'!$F$28=\"\",\"\",'Tx236'!$F$28)","v":"Individual Weight Retained"}]
[22,{"$f":"IF('Tx236'!$I$30=\"\",\"\",'Tx236'!$I$30)","v":""},{"$f":"IF('Tx236'!$B$21=\"\",\"\",'Tx236'!$B$21)","v":"SIEVE ANALYSIS WORKSHEET FOR CALIBRATION SAMPLES"},{"$f":"IF('Tx236'!$B$69=\"\",\"\",'Tx236'!$B$69)","v":"Sieve Size"},{"$f":"IF('Tx236'!$B$73=\"\",\"\",'Tx236'!$B$73)","v":""},{"$f":"IF('Tx236'!$I$23=\"\",\"\",'Tx236'!$I$23)","v":"Ignited Sample 2"},{"$f":"IF('Tx236'!$F$28=\"\",\"\",'Tx236'!$F$28)","v":"Individual Weight Retained"}]
[23,{"$f":"IF('Tx236'!$J$30=\"\",\"\",'Tx236'!$J$30)","v":""},{"$f":"IF('Tx236'!$B$21=\"\",\"\",'Tx236'!$B$21)","v":"SIEVE ANALYSIS WORKSHEET FOR CALIBRATION SAMPLES"},{"$f":"IF('Tx236'!$B$69=\"\",\"\",'Tx236'!$B$69)","v":"Sieve Size"},{"$f":"IF('Tx236'!$B$73=\"\",\"\",'Tx236'!$B$73)","v":""},{"$f":"IF('Tx236'!$J$23=\"\",\"\",'Tx236'!$J$23)","v":"Ignited Sample 5"},{"$f":"IF('Tx236'!$F$28=\"\",\"\",'Tx236'!$F$28)","v":"Individual Weight Retained"}]
[24,{"$f":"IF('Tx236'!$K$30=\"\",\"\",'Tx236'!$K$30)","v":""},{"$f":"IF('Tx236'!$B$21=\"\",\"\",'Tx236'!$B$21)","v":"SIEVE ANALYSIS WORKSHEET FOR CALIBRATION SAMPLES"},{"$f":"IF('Tx236'!$B$69=\"\",\"\",'Tx236'!$B$69)","v":"Sieve Size"},{"$f":"IF('Tx236'!$B$73=\"\",\"\",'Tx236'!$B$73)","v":""},{"$f":"IF('Tx236'!$K$23=\"\",\"\",'Tx236'!$K$23)","v":"Ignited     Sample 6"},{"$f":"IF('Tx236'!$F$28=\"\",\"\",'Tx236'!$F$28)","v":"Individual Weight Retained"}]
[25,{"$f":"IF('Tx236'!$D$31=\"\",\"\",'Tx236'!$D$31)","v":""},{"$f":"IF('Tx236'!$B$21=\"\",\"\",'Tx236'!$B$21)","v":"SIEVE ANALYSIS WORKSHEET FOR CALIBRATION SAMPLES"},{"$f":"IF('Tx236'!$B$69=\"\",\"\",'Tx236'!$B$69)","v":"Sieve Size"},{"$f":"IF('Tx236'!$B$74=\"\",\"\",'Tx236'!$B$74)","v":""},{"$f":"IF('Tx236'!$D$24=\"\",\"\",'Tx236'!$D$24)","v":"Blank Sample"},{"$f":"IF('Tx236'!$D$28=\"\",\"\",'Tx236'!$D$28)","v":"Individual Weight Retained"}]
[26,{"$f":"IF('Tx236'!$F$31=\"\",\"\",'Tx236'!$F$31)","v":""},{"$f":"IF('Tx236'!$B$21=\"\",\"\",'Tx236'!$B$21)","v":"SIEVE ANALYSIS WORKSHEET FOR CALIBRATION SAMPLES"},{"$f":"IF('Tx236'!$B$69=\"\",\"\",'Tx236'!$B$69)","v":"Sieve Size"},{"$f":"IF('Tx236'!$B$74=\"\",\"\",'Tx236'!$B$74)","v":""},{"$f":"IF('Tx236'!$F$23=\"\",\"\",'Tx236'!$F$23)","v":"Ignited Sample 1"},{"$f":"IF('Tx236'!$F$28=\"\",\"\",'Tx236'!$F$28)","v":"Individual Weight Retained"}]
[27,{"$f":"IF('Tx236'!$G$31=\"\",\"\",'Tx236'!$G$31)","v":""},{"$f":"IF('Tx236'!$B$21=\"\",\"\",'Tx236'!$B$21)","v":"SIEVE ANALYSIS WORKSHEET FOR CALIBRATION SAMPLES"},{"$f":"IF('Tx236'!$B$69=\"\",\"\",'Tx236'!$B$69)","v":"Sieve Size"},{"$f":"IF('Tx236'!$B$74=\"\",\"\",'Tx236'!$B$74)","v":""},{"$f":"IF('Tx236'!$G$23=\"\",\"\",'Tx236'!$G$23)","v":"Ignited Sample 2"},{"$f":"IF('Tx236'!$F$28=\"\",\"\",'Tx236'!$F$28)","v":"Individual Weight Retained"}]
[28,{"$f":"IF('Tx236'!$H$31=\"\",\"\",'Tx236'!$H$31)","v":""},{"$f":"IF('Tx236'!$B$21=\"\",\"\",'Tx236'!$B$21)","v":"SIEVE ANALYSIS WORKSHEET FOR CALIBRATION SAMPLES"},{"$f":"IF('Tx236'!$B$69=\"\",\"\",'Tx236'!$B$69)","v":"Sieve Size"},{"$f":"IF('Tx236'!$B$74=\"\",\"\",'Tx236'!$B$74)","v":""},{"$f":"IF('Tx236'!$H$23=\"\",\"\",'Tx236'!$H$23)","v":"Ignited Sample 1"},{"$f":"IF('Tx236'!$F$28=\"\",\"\",'Tx236'!$F$28)","v":"Individual Weight Retained"}]
[29,{"$f":"IF('Tx236'!$I$31=\"\",\"\",'Tx236'!$I$31)","v":""},{"$f":"IF('Tx236'!$B$21=\"\",\"\",'Tx236'!$B$21)","v":"SIEVE ANALYSIS WORKSHEET FOR CALIBRATION SAMPLES"},{"$f":"IF('Tx236'!$B$69=\"\",\"\",'Tx236'!$B$69)","v":"Sieve Size"},{"$f":"IF('Tx236'!$B$74=\"\",\"\",'Tx236'!$B$74)","v":""},{"$f":"IF('Tx236'!$I$23=\"\",\"\",'Tx236'!$I$23)","v":"Ignited Sample 2"},{"$f":"IF('Tx236'!$F$28=\"\",\"\",'Tx236'!$F$28)","v":"Individual Weight Retained"}]
[30,{"$f":"IF('Tx236'!$J$31=\"\",\"\",'Tx236'!$J$31)","v":""},{"$f":"IF('Tx236'!$B$21=\"\",\"\",'Tx236'!$B$21)","v":"SIEVE ANALYSIS WORKSHEET FOR CALIBRATION SAMPLES"},{"$f":"IF('Tx236'!$B$69=\"\",\"\",'Tx236'!$B$69)","v":"Sieve Size"},{"$f":"IF('Tx236'!$B$74=\"\",\"\",'Tx236'!$B$74)","v":""},{"$f":"IF('Tx236'!$J$23=\"\",\"\",'Tx236'!$J$23)","v":"Ignited Sample 5"},{"$f":"IF('Tx236'!$F$28=\"\",\"\",'Tx236'!$F$28)","v":"Individual Weight Retained"}]
[31,{"$f":"IF('Tx236'!$K$31=\"\",\"\",'Tx236'!$K$31)","v":""},{"$f":"IF('Tx236'!$B$21=\"\",\"\",'Tx236'!$B$21)","v":"SIEVE ANALYSIS WORKSHEET FOR CALIBRATION SAMPLES"},{"$f":"IF('Tx236'!$B$69=\"\",\"\",'Tx236'!$B$69)","v":"Sieve Size"},{"$f":"IF('Tx236'!$B$74=\"\",\"\",'Tx236'!$B$74)","v":""},{"$f":"IF('Tx236'!$K$23=\"\",\"\",'Tx236'!$K$23)","v":"Ignited     Sample 6"},{"$f":"IF('Tx236'!$F$28=\"\",\"\",'Tx236'!$F$28)","v":"Individual Weight Retained"}]
[32,{"$f":"IF('Tx236'!$D$32=\"\",\"\",'Tx236'!$D$32)","v":""},{"$f":"IF('Tx236'!$B$21=\"\",\"\",'Tx236'!$B$21)","v":"SIEVE ANALYSIS WORKSHEET FOR CALIBRATION SAMPLES"},{"$f":"IF('Tx236'!$B$69=\"\",\"\",'Tx236'!$B$69)","v":"Sieve Size"},{"$f":"IF('Tx236'!$B$75=\"\",\"\",'Tx236'!$B$75)","v":""},{"$f":"IF('Tx236'!$D$24=\"\",\"\",'Tx236'!$D$24)","v":"Blank Sample"},{"$f":"IF('Tx236'!$D$28=\"\",\"\",'Tx236'!$D$28)","v":"Individual Weight Retained"}]
[33,{"$f":"IF('Tx236'!$F$32=\"\",\"\",'Tx236'!$F$32)","v":""},{"$f":"IF('Tx236'!$B$21=\"\",\"\",'Tx236'!$B$21)","v":"SIEVE ANALYSIS WORKSHEET FOR CALIBRATION SAMPLES"},{"$f":"IF('Tx236'!$B$69=\"\",\"\",'Tx236'!$B$69)","v":"Sieve Size"},{"$f":"IF('Tx236'!$B$75=\"\",\"\",'Tx236'!$B$75)","v":""},{"$f":"IF('Tx236'!$F$23=\"\",\"\",'Tx236'!$F$23)","v":"Ignited Sample 1"},{"$f":"IF('Tx236'!$F$28=\"\",\"\",'Tx236'!$F$28)","v":"Individual Weight Retained"}]
[34,{"$f":"IF('Tx236'!$G$32=\"\",\"\",'Tx236'!$G$32)","v":""},{"$f":"IF('Tx236'!$B$21=\"\",\"\",'Tx236'!$B$21)","v":"SIEVE ANALYSIS WORKSHEET FOR CALIBRATION SAMPLES"},{"$f":"IF('Tx236'!$B$69=\"\",\"\",'Tx236'!$B$69)","v":"Sieve Size"},{"$f":"IF('Tx236'!$B$75=\"\",\"\",'Tx236'!$B$75)","v":""},{"$f":"IF('Tx236'!$G$23=\"\",\"\",'Tx236'!$G$23)","v":"Ignited Sample 2"},{"$f":"IF('Tx236'!$F$28=\"\",\"\",'Tx236'!$F$28)","v":"Individual Weight Retained"}]
[35,{"$f":"IF('Tx236'!$H$32=\"\",\"\",'Tx236'!$H$32)","v":""},{"$f":"IF('Tx236'!$B$21=\"\",\"\",'Tx236'!$B$21)","v":"SIEVE ANALYSIS WORKSHEET FOR CALIBRATION SAMPLES"},{"$f":"IF('Tx236'!$B$69=\"\",\"\",'Tx236'!$B$69)","v":"Sieve Size"},{"$f":"IF('Tx236'!$B$75=\"\",\"\",'Tx236'!$B$75)","v":""},{"$f":"IF('Tx236'!$H$23=\"\",\"\",'Tx236'!$H$23)","v":"Ignited Sample 1"},{"$f":"IF('Tx236'!$F$28=\"\",\"\",'Tx236'!$F$28)","v":"Individual Weight Retained"}]
[36,{"$f":"IF('Tx236'!$I$32=\"\",\"\",'Tx236'!$I$32)","v":""},{"$f":"IF('Tx236'!$B$21=\"\",\"\",'Tx236'!$B$21)","v":"SIEVE ANALYSIS WORKSHEET FOR CALIBRATION SAMPLES"},{"$f":"IF('Tx236'!$B$69=\"\",\"\",'Tx236'!$B$69)","v":"Sieve Size"},{"$f":"IF('Tx236'!$B$75=\"\",\"\",'Tx236'!$B$75)","v":""},{"$f":"IF('Tx236'!$I$23=\"\",\"\",'Tx236'!$I$23)","v":"Ignited Sample 2"},{"$f":"IF('Tx236'!$F$28=\"\",\"\",'Tx236'!$F$28)","v":"Individual Weight Retained"}]
[37,{"$f":"IF('Tx236'!$J$32=\"\",\"\",'Tx236'!$J$32)","v":""},{"$f":"IF('Tx236'!$B$21=\"\",\"\",'Tx236'!$B$21)","v":"SIEVE ANALYSIS WORKSHEET FOR CALIBRATION SAMPLES"},{"$f":"IF('Tx236'!$B$69=\"\",\"\",'Tx236'!$B$69)","v":"Sieve Size"},{"$f":"IF('Tx236'!$B$75=\"\",\"\",'Tx236'!$B$75)","v":""},{"$f":"IF('Tx236'!$J$23=\"\",\"\",'Tx236'!$J$23)","v":"Ignited Sample 5"},{"$f":"IF('Tx236'!$F$28=\"\",\"\",'Tx236'!$F$28)","v":"Individual Weight Retained"}]
[38,{"$f":"IF('Tx236'!$K$32=\"\",\"\",'Tx236'!$K$32)","v":""},{"$f":"IF('Tx236'!$B$21=\"\",\"\",'Tx236'!$B$21)","v":"SIEVE ANALYSIS WORKSHEET FOR CALIBRATION SAMPLES"},{"$f":"IF('Tx236'!$B$69=\"\",\"\",'Tx236'!$B$69)","v":"Sieve Size"},{"$f":"IF('Tx236'!$B$75=\"\",\"\",'Tx236'!$B$75)","v":""},{"$f":"IF('Tx236'!$K$23=\"\",\"\",'Tx236'!$K$23)","v":"Ignited     Sample 6"},{"$f":"IF('Tx236'!$F$28=\"\",\"\",'Tx236'!$F$28)","v":"Individual Weight Retained"}]
[39,{"$f":"IF('Tx236'!$D$33=\"\",\"\",'Tx236'!$D$33)","v":""},{"$f":"IF('Tx236'!$B$21=\"\",\"\",'Tx236'!$B$21)","v":"SIEVE ANALYSIS WORKSHEET FOR CALIBRATION SAMPLES"},{"$f":"IF('Tx236'!$B$69=\"\",\"\",'Tx236'!$B$69)","v":"Sieve Size"},{"$f":"IF('Tx236'!$B$76=\"\",\"\",'Tx236'!$B$76)","v":""},{"$f":"IF('Tx236'!$D$24=\"\",\"\",'Tx236'!$D$24)","v":"Blank Sample"},{"$f":"IF('Tx236'!$D$28=\"\",\"\",'Tx236'!$D$28)","v":"Individual Weight Retained"}]
[40,{"$f":"IF('Tx236'!$F$33=\"\",\"\",'Tx236'!$F$33)","v":""},{"$f":"IF('Tx236'!$B$21=\"\",\"\",'Tx236'!$B$21)","v":"SIEVE ANALYSIS WORKSHEET FOR CALIBRATION SAMPLES"},{"$f":"IF('Tx236'!$B$69=\"\",\"\",'Tx236'!$B$69)","v":"Sieve Size"},{"$f":"IF('Tx236'!$B$76=\"\",\"\",'Tx236'!$B$76)","v":""},{"$f":"IF('Tx236'!$F$23=\"\",\"\",'Tx236'!$F$23)","v":"Ignited Sample 1"},{"$f":"IF('Tx236'!$F$28=\"\",\"\",'Tx236'!$F$28)","v":"Individual Weight Retained"}]
[41,{"$f":"IF('Tx236'!$G$33=\"\",\"\",'Tx236'!$G$33)","v":""},{"$f":"IF('Tx236'!$B$21=\"\",\"\",'Tx236'!$B$21)","v":"SIEVE ANALYSIS WORKSHEET FOR CALIBRATION SAMPLES"},{"$f":"IF('Tx236'!$B$69=\"\",\"\",'Tx236'!$B$69)","v":"Sieve Size"},{"$f":"IF('Tx236'!$B$76=\"\",\"\",'Tx236'!$B$76)","v":""},{"$f":"IF('Tx236'!$G$23=\"\",\"\",'Tx236'!$G$23)","v":"Ignited Sample 2"},{"$f":"IF('Tx236'!$F$28=\"\",\"\",'Tx236'!$F$28)","v":"Individual Weight Retained"}]
[42,{"$f":"IF('Tx236'!$H$33=\"\",\"\",'Tx236'!$H$33)","v":""},{"$f":"IF('Tx236'!$B$21=\"\",\"\",'Tx236'!$B$21)","v":"SIEVE ANALYSIS WORKSHEET FOR CALIBRATION SAMPLES"},{"$f":"IF('Tx236'!$B$69=\"\",\"\",'Tx236'!$B$69)","v":"Sieve Size"},{"$f":"IF('Tx236'!$B$76=\"\",\"\",'Tx236'!$B$76)","v":""},{"$f":"IF('Tx236'!$H$23=\"\",\"\",'Tx236'!$H$23)","v":"Ignited Sample 1"},{"$f":"IF('Tx236'!$F$28=\"\",\"\",'Tx236'!$F$28)","v":"Individual Weight Retained"}]
[43,{"$f":"IF('Tx236'!$I$33=\"\",\"\",'Tx236'!$I$33)","v":""},{"$f":"IF('Tx236'!$B$21=\"\",\"\",'Tx236'!$B$21)","v":"SIEVE ANALYSIS WORKSHEET FOR CALIBRATION SAMPLES"},{"$f":"IF('Tx236'!$B$69=\"\",\"\",'Tx236'!$B$69)","v":"Sieve Size"},{"$f":"IF('Tx236'!$B$76=\"\",\"\",'Tx236'!$B$76)","v":""},{"$f":"IF('Tx236'!$I$23=\"\",\"\",'Tx236'!$I$23)","v":"Ignited Sample 2"},{"$f":"IF('Tx236'!$F$28=\"\",\"\",'Tx236'!$F$28)","v":"Individual Weight Retained"}]
[44,{"$f":"IF('Tx236'!$J$33=\"\",\"\",'Tx236'!$J$33)","v":""},{"$f":"IF('Tx236'!$B$21=\"\",\"\",'Tx236'!$B$21)","v":"SIEVE ANALYSIS WORKSHEET FOR CALIBRATION SAMPLES"},{"$f":"IF('Tx236'!$B$69=\"\",\"\",'Tx236'!$B$69)","v":"Sieve Size"},{"$f":"IF('Tx236'!$B$76=\"\",\"\",'Tx236'!$B$76)","v":""},{"$f":"IF('Tx236'!$J$23=\"\",\"\",'Tx236'!$J$23)","v":"Ignited Sample 5"},{"$f":"IF('Tx236'!$F$28=\"\",\"\",'Tx236'!$F$28)","v":"Individual Weight Retained"}]
[45,{"$f":"IF('Tx236'!$K$33=\"\",\"\",'Tx236'!$K$33)","v":""},{"$f":"IF('Tx236'!$B$21=\"\",\"\",'Tx236'!$B$21)","v":"SIEVE ANALYSIS WORKSHEET FOR CALIBRATION SAMPLES"},{"$f":"IF('Tx236'!$B$69=\"\",\"\",'Tx236'!$B$69)","v":"Sieve Size"},{"$f":"IF('Tx236'!$B$76=\"\",\"\",'Tx236'!$B$76)","v":""},{"$f":"IF('Tx236'!$K$23=\"\",\"\",'Tx236'!$K$23)","v":"Ignited     Sample 6"},{"$f":"IF('Tx236'!$F$28=\"\",\"\",'Tx236'!$F$28)","v":"Individual Weight Retained"}]
[46,{"$f":"IF('Tx236'!$D$34=\"\",\"\",'Tx236'!$D$34)","v":""},{"$f":"IF('Tx236'!$B$21=\"\",\"\",'Tx236'!$B$21)","v":"SIEVE ANALYSIS WORKSHEET FOR CALIBRATION SAMPLES"},{"$f":"IF('Tx236'!$B$69=\"\",\"\",'Tx236'!$B$69)","v":"Sieve Size"},{"$f":"IF('Tx236'!$B$77=\"\",\"\",'Tx236'!$B$77)","v":""},{"$f":"IF('Tx236'!$D$24=\"\",\"\",'Tx236'!$D$24)","v":"Blank Sample"},{"$f":"IF('Tx236'!$D$28=\"\",\"\",'Tx236'!$D$28)","v":"Individual Weight Retained"}]
[47,{"$f":"IF('Tx236'!$F$34=\"\",\"\",'Tx236'!$F$34)","v":""},{"$f":"IF('Tx236'!$B$21=\"\",\"\",'Tx236'!$B$21)","v":"SIEVE ANALYSIS WORKSHEET FOR CALIBRATION SAMPLES"},{"$f":"IF('Tx236'!$B$69=\"\",\"\",'Tx236'!$B$69)","v":"Sieve Size"},{"$f":"IF('Tx236'!$B$77=\"\",\"\",'Tx236'!$B$77)","v":""},{"$f":"IF('Tx236'!$F$23=\"\",\"\",'Tx236'!$F$23)","v":"Ignited Sample 1"},{"$f":"IF('Tx236'!$F$28=\"\",\"\",'Tx236'!$F$28)","v":"Individual Weight Retained"}]
[48,{"$f":"IF('Tx236'!$G$34=\"\",\"\",'Tx236'!$G$34)","v":""},{"$f":"IF('Tx236'!$B$21=\"\",\"\",'Tx236'!$B$21)","v":"SIEVE ANALYSIS WORKSHEET FOR CALIBRATION SAMPLES"},{"$f":"IF('Tx236'!$B$69=\"\",\"\",'Tx236'!$B$69)","v":"Sieve Size"},{"$f":"IF('Tx236'!$B$77=\"\",\"\",'Tx236'!$B$77)","v":""},{"$f":"IF('Tx236'!$G$23=\"\",\"\",'Tx236'!$G$23)","v":"Ignited Sample 2"},{"$f":"IF('Tx236'!$F$28=\"\",\"\",'Tx236'!$F$28)","v":"Individual Weight Retained"}]
[49,{"$f":"IF('Tx236'!$H$34=\"\",\"\",'Tx236'!$H$34)","v":""},{"$f":"IF('Tx236'!$B$21=\"\",\"\",'Tx236'!$B$21)","v":"SIEVE ANALYSIS WORKSHEET FOR CALIBRATION SAMPLES"},{"$f":"IF('Tx236'!$B$69=\"\",\"\",'Tx236'!$B$69)","v":"Sieve Size"},{"$f":"IF('Tx236'!$B$77=\"\",\"\",'Tx236'!$B$77)","v":""},{"$f":"IF('Tx236'!$H$23=\"\",\"\",'Tx236'!$H$23)","v":"Ignited Sample 1"},{"$f":"IF('Tx236'!$F$28=\"\",\"\",'Tx236'!$F$28)","v":"Individual Weight Retained"}]
[50,{"$f":"IF('Tx236'!$I$34=\"\",\"\",'Tx236'!$I$34)","v":""},{"$f":"IF('Tx236'!$B$21=\"\",\"\",'Tx236'!$B$21)","v":"SIEVE ANALYSIS WORKSHEET FOR CALIBRATION SAMPLES"},{"$f":"IF('Tx236'!$B$69=\"\",\"\",'Tx236'!$B$69)","v":"Sieve Size"},{"$f":"IF('Tx236'!$B$77=\"\",\"\",'Tx236'!$B$77)","v":""},{"$f":"IF('Tx236'!$I$23=\"\",\"\",'Tx236'!$I$23)","v":"Ignited Sample 2"},{"$f":"IF('Tx236'!$F$28=\"\",\"\",'Tx236'!$F$28)","v":"Individual Weight Retained"}]
[51,{"$f":"IF('Tx236'!$J$34=\"\",\"\",'Tx236'!$J$34)","v":""},{"$f":"IF('Tx236'!$B$21=\"\",\"\",'Tx236'!$B$21)","v":"SIEVE ANALYSIS WORKSHEET FOR CALIBRATION SAMPLES"},{"$f":"IF('Tx236'!$B$69=\"\",\"\",'Tx236'!$B$69)","v":"Sieve Size"},{"$f":"IF('Tx236'!$B$77=\"\",\"\",'Tx236'!$B$77)","v":""},{"$f":"IF('Tx236'!$J$23=\"\",\"\",'Tx236'!$J$23)","v":"Ignited Sample 5"},{"$f":"IF('Tx236'!$F$28=\"\",\"\",'Tx236'!$F$28)","v":"Individual Weight Retained"}]
[52,{"$f":"IF('Tx236'!$K$34=\"\",\"\",'Tx236'!$K$34)","v":""},{"$f":"IF('Tx236'!$B$21=\"\",\"\",'Tx236'!$B$21)","v":"SIEVE ANALYSIS WORKSHEET FOR CALIBRATION SAMPLES"},{"$f":"IF('Tx236'!$B$69=\"\",\"\",'Tx236'!$B$69)","v":"Sieve Size"},{"$f":"IF('Tx236'!$B$77=\"\",\"\",'Tx236'!$B$77)","v":""},{"$f":"IF('Tx236'!$K$23=\"\",\"\",'Tx236'!$K$23)","v":"Ignited     Sample 6"},{"$f":"IF('Tx236'!$F$28=\"\",\"\",'Tx236'!$F$28)","v":"Individual Weight Retained"}]
[53,{"$f":"IF('Tx236'!$D$35=\"\",\"\",'Tx236'!$D$35)","v":""},{"$f":"IF('Tx236'!$B$21=\"\",\"\",'Tx236'!$B$21)","v":"SIEVE ANALYSIS WORKSHEET FOR CALIBRATION SAMPLES"},{"$f":"IF('Tx236'!$B$69=\"\",\"\",'Tx236'!$B$69)","v":"Sieve Size"},{"$f":"IF('Tx236'!$B$78=\"\",\"\",'Tx236'!$B$78)","v":""},{"$f":"IF('Tx236'!$D$24=\"\",\"\",'Tx236'!$D$24)","v":"Blank Sample"},{"$f":"IF('Tx236'!$D$28=\"\",\"\",'Tx236'!$D$28)","v":"Individual Weight Retained"}]
[54,{"$f":"IF('Tx236'!$F$35=\"\",\"\",'Tx236'!$F$35)","v":""},{"$f":"IF('Tx236'!$B$21=\"\",\"\",'Tx236'!$B$21)","v":"SIEVE ANALYSIS WORKSHEET FOR CALIBRATION SAMPLES"},{"$f":"IF('Tx236'!$B$69=\"\",\"\",'Tx236'!$B$69)","v":"Sieve Size"},{"$f":"IF('Tx236'!$B$78=\"\",\"\",'Tx236'!$B$78)","v":""},{"$f":"IF('Tx236'!$F$23=\"\",\"\",'Tx236'!$F$23)","v":"Ignited Sample 1"},{"$f":"IF('Tx236'!$F$28=\"\",\"\",'Tx236'!$F$28)","v":"Individual Weight Retained"}]
[55,{"$f":"IF('Tx236'!$G$35=\"\",\"\",'Tx236'!$G$35)","v":""},{"$f":"IF('Tx236'!$B$21=\"\",\"\",'Tx236'!$B$21)","v":"SIEVE ANALYSIS WORKSHEET FOR CALIBRATION SAMPLES"},{"$f":"IF('Tx236'!$B$69=\"\",\"\",'Tx236'!$B$69)","v":"Sieve Size"},{"$f":"IF('Tx236'!$B$78=\"\",\"\",'Tx236'!$B$78)","v":""},{"$f":"IF('Tx236'!$G$23=\"\",\"\",'Tx236'!$G$23)","v":"Ignited Sample 2"},{"$f":"IF('Tx236'!$F$28=\"\",\"\",'Tx236'!$F$28)","v":"Individual Weight Retained"}]
[56,{"$f":"IF('Tx236'!$H$35=\"\",\"\",'Tx236'!$H$35)","v":""},{"$f":"IF('Tx236'!$B$21=\"\",\"\",'Tx236'!$B$21)","v":"SIEVE ANALYSIS WORKSHEET FOR CALIBRATION SAMPLES"},{"$f":"IF('Tx236'!$B$69=\"\",\"\",'Tx236'!$B$69)","v":"Sieve Size"},{"$f":"IF('Tx236'!$B$78=\"\",\"\",'Tx236'!$B$78)","v":""},{"$f":"IF('Tx236'!$H$23=\"\",\"\",'Tx236'!$H$23)","v":"Ignited Sample 1"},{"$f":"IF('Tx236'!$F$28=\"\",\"\",'Tx236'!$F$28)","v":"Individual Weight Retained"}]
[57,{"$f":"IF('Tx236'!$I$35=\"\",\"\",'Tx236'!$I$35)","v":""},{"$f":"IF('Tx236'!$B$21=\"\",\"\",'Tx236'!$B$21)","v":"SIEVE ANALYSIS WORKSHEET FOR CALIBRATION SAMPLES"},{"$f":"IF('Tx236'!$B$69=\"\",\"\",'Tx236'!$B$69)","v":"Sieve Size"},{"$f":"IF('Tx236'!$B$78=\"\",\"\",'Tx236'!$B$78)","v":""},{"$f":"IF('Tx236'!$I$23=\"\",\"\",'Tx236'!$I$23)","v":"Ignited Sample 2"},{"$f":"IF('Tx236'!$F$28=\"\",\"\",'Tx236'!$F$28)","v":"Individual Weight Retained"}]
[58,{"$f":"IF('Tx236'!$J$35=\"\",\"\",'Tx236'!$J$35)","v":""},{"$f":"IF('Tx236'!$B$21=\"\",\"\",'Tx236'!$B$21)","v":"SIEVE ANALYSIS WORKSHEET FOR CALIBRATION SAMPLES"},{"$f":"IF('Tx236'!$B$69=\"\",\"\",'Tx236'!$B$69)","v":"Sieve Size"},{"$f":"IF('Tx236'!$B$78=\"\",\"\",'Tx236'!$B$78)","v":""},{"$f":"IF('Tx236'!$J$23=\"\",\"\",'Tx236'!$J$23)","v":"Ignited Sample 5"},{"$f":"IF('Tx236'!$F$28=\"\",\"\",'Tx236'!$F$28)","v":"Individual Weight Retained"}]
[59,{"$f":"IF('Tx236'!$K$35=\"\",\"\",'Tx236'!$K$35)","v":""},{"$f":"IF('Tx236'!$B$21=\"\",\"\",'Tx236'!$B$21)","v":"SIEVE ANALYSIS WORKSHEET FOR CALIBRATION SAMPLES"},{"$f":"IF('Tx236'!$B$69=\"\",\"\",'Tx236'!$B$69)","v":"Sieve Size"},{"$f":"IF('Tx236'!$B$78=\"\",\"\",'Tx236'!$B$78)","v":""},{"$f":"IF('Tx236'!$K$23=\"\",\"\",'Tx236'!$K$23)","v":"Ignited     Sample 6"},{"$f":"IF('Tx236'!$F$28=\"\",\"\",'Tx236'!$F$28)","v":"Individual Weight Retained"}]
[60,{"$f":"IF('Tx236'!$D$36=\"\",\"\",'Tx236'!$D$36)","v":""},{"$f":"IF('Tx236'!$B$21=\"\",\"\",'Tx236'!$B$21)","v":"SIEVE ANALYSIS WORKSHEET FOR CALIBRATION SAMPLES"},{"$f":"IF('Tx236'!$B$69=\"\",\"\",'Tx236'!$B$69)","v":"Sieve Size"},{"$f":"IF('Tx236'!$B$79=\"\",\"\",'Tx236'!$B$79)","v":""},{"$f":"IF('Tx236'!$D$24=\"\",\"\",'Tx236'!$D$24)","v":"Blank Sample"},{"$f":"IF('Tx236'!$D$28=\"\",\"\",'Tx236'!$D$28)","v":"Individual Weight Retained"}]
[61,{"$f":"IF('Tx236'!$F$36=\"\",\"\",'Tx236'!$F$36)","v":""},{"$f":"IF('Tx236'!$B$21=\"\",\"\",'Tx236'!$B$21)","v":"SIEVE ANALYSIS WORKSHEET FOR CALIBRATION SAMPLES"},{"$f":"IF('Tx236'!$B$69=\"\",\"\",'Tx236'!$B$69)","v":"Sieve Size"},{"$f":"IF('Tx236'!$B$79=\"\",\"\",'Tx236'!$B$79)","v":""},{"$f":"IF('Tx236'!$F$23=\"\",\"\",'Tx236'!$F$23)","v":"Ignited Sample 1"},{"$f":"IF('Tx236'!$F$28=\"\",\"\",'Tx236'!$F$28)","v":"Individual Weight Retained"}]
[62,{"$f":"IF('Tx236'!$G$36=\"\",\"\",'Tx236'!$G$36)","v":""},{"$f":"IF('Tx236'!$B$21=\"\",\"\",'Tx236'!$B$21)","v":"SIEVE ANALYSIS WORKSHEET FOR CALIBRATION SAMPLES"},{"$f":"IF('Tx236'!$B$69=\"\",\"\",'Tx236'!$B$69)","v":"Sieve Size"},{"$f":"IF('Tx236'!$B$79=\"\",\"\",'Tx236'!$B$79)","v":""},{"$f":"IF('Tx236'!$G$23=\"\",\"\",'Tx236'!$G$23)","v":"Ignited Sample 2"},{"$f":"IF('Tx236'!$F$28=\"\",\"\",'Tx236'!$F$28)","v":"Individual Weight Retained"}]
[63,{"$f":"IF('Tx236'!$H$36=\"\",\"\",'Tx236'!$H$36)","v":""},{"$f":"IF('Tx236'!$B$21=\"\",\"\",'Tx236'!$B$21)","v":"SIEVE ANALYSIS WORKSHEET FOR CALIBRATION SAMPLES"},{"$f":"IF('Tx236'!$B$69=\"\",\"\",'Tx236'!$B$69)","v":"Sieve Size"},{"$f":"IF('Tx236'!$B$79=\"\",\"\",'Tx236'!$B$79)","v":""},{"$f":"IF('Tx236'!$H$23=\"\",\"\",'Tx236'!$H$23)","v":"Ignited Sample 1"},{"$f":"IF('Tx236'!$F$28=\"\",\"\",'Tx236'!$F$28)","v":"Individual Weight Retained"}]
[64,{"$f":"IF('Tx236'!$I$36=\"\",\"\",'Tx236'!$I$36)","v":""},{"$f":"IF('Tx236'!$B$21=\"\",\"\",'Tx236'!$B$21)","v":"SIEVE ANALYSIS WORKSHEET FOR CALIBRATION SAMPLES"},{"$f":"IF('Tx236'!$B$69=\"\",\"\",'Tx236'!$B$69)","v":"Sieve Size"},{"$f":"IF('Tx236'!$B$79=\"\",\"\",'Tx236'!$B$79)","v":""},{"$f":"IF('Tx236'!$I$23=\"\",\"\",'Tx236'!$I$23)","v":"Ignited Sample 2"},{"$f":"IF('Tx236'!$F$28=\"\",\"\",'Tx236'!$F$28)","v":"Individual Weight Retained"}]
[65,{"$f":"IF('Tx236'!$J$36=\"\",\"\",'Tx236'!$J$36)","v":""},{"$f":"IF('Tx236'!$B$21=\"\",\"\",'Tx236'!$B$21)","v":"SIEVE ANALYSIS WORKSHEET FOR CALIBRATION SAMPLES"},{"$f":"IF('Tx236'!$B$69=\"\",\"\",'Tx236'!$B$69)","v":"Sieve Size"},{"$f":"IF('Tx236'!$B$79=\"\",\"\",'Tx236'!$B$79)","v":""},{"$f":"IF('Tx236'!$J$23=\"\",\"\",'Tx236'!$J$23)","v":"Ignited Sample 5"},{"$f":"IF('Tx236'!$F$28=\"\",\"\",'Tx236'!$F$28)","v":"Individual Weight Retained"}]
[66,{"$f":"IF('Tx236'!$K$36=\"\",\"\",'Tx236'!$K$36)","v":""},{"$f":"IF('Tx236'!$B$21=\"\",\"\",'Tx236'!$B$21)","v":"SIEVE ANALYSIS WORKSHEET FOR CALIBRATION SAMPLES"},{"$f":"IF('Tx236'!$B$69=\"\",\"\",'Tx236'!$B$69)","v":"Sieve Size"},{"$f":"IF('Tx236'!$B$79=\"\",\"\",'Tx236'!$B$79)","v":""},{"$f":"IF('Tx236'!$K$23=\"\",\"\",'Tx236'!$K$23)","v":"Ignited     Sample 6"},{"$f":"IF('Tx236'!$F$28=\"\",\"\",'Tx236'!$F$28)","v":"Individual Weight Retained"}]
[67,{"$f":"IF('Tx236'!$D$37=\"\",\"\",'Tx236'!$D$37)","v":""},{"$f":"IF('Tx236'!$B$21=\"\",\"\",'Tx236'!$B$21)","v":"SIEVE ANALYSIS WORKSHEET FOR CALIBRATION SAMPLES"},{"$f":"IF('Tx236'!$B$69=\"\",\"\",'Tx236'!$B$69)","v":"Sieve Size"},{"$f":"IF('Tx236'!$B$80=\"\",\"\",'Tx236'!$B$80)","v":""},{"$f":"IF('Tx236'!$D$24=\"\",\"\",'Tx236'!$D$24)","v":"Blank Sample"},{"$f":"IF('Tx236'!$D$28=\"\",\"\",'Tx236'!$D$28)","v":"Individual Weight Retained"}]
[68,{"$f":"IF('Tx236'!$F$37=\"\",\"\",'Tx236'!$F$37)","v":""},{"$f":"IF('Tx236'!$B$21=\"\",\"\",'Tx236'!$B$21)","v":"SIEVE ANALYSIS WORKSHEET FOR CALIBRATION SAMPLES"},{"$f":"IF('Tx236'!$B$69=\"\",\"\",'Tx236'!$B$69)","v":"Sieve Size"},{"$f":"IF('Tx236'!$B$80=\"\",\"\",'Tx236'!$B$80)","v":""},{"$f":"IF('Tx236'!$F$23=\"\",\"\",'Tx236'!$F$23)","v":"Ignited Sample 1"},{"$f":"IF('Tx236'!$F$28=\"\",\"\",'Tx236'!$F$28)","v":"Individual Weight Retained"}]
[69,{"$f":"IF('Tx236'!$G$37=\"\",\"\",'Tx236'!$G$37)","v":""},{"$f":"IF('Tx236'!$B$21=\"\",\"\",'Tx236'!$B$21)","v":"SIEVE ANALYSIS WORKSHEET FOR CALIBRATION SAMPLES"},{"$f":"IF('Tx236'!$B$69=\"\",\"\",'Tx236'!$B$69)","v":"Sieve Size"},{"$f":"IF('Tx236'!$B$80=\"\",\"\",'Tx236'!$B$80)","v":""},{"$f":"IF('Tx236'!$G$23=\"\",\"\",'Tx236'!$G$23)","v":"Ignited Sample 2"},{"$f":"IF('Tx236'!$F$28=\"\",\"\",'Tx236'!$F$28)","v":"Individual Weight Retained"}]
[70,{"$f":"IF('Tx236'!$H$37=\"\",\"\",'Tx236'!$H$37)","v":""},{"$f":"IF('Tx236'!$B$21=\"\",\"\",'Tx236'!$B$21)","v":"SIEVE ANALYSIS WORKSHEET FOR CALIBRATION SAMPLES"},{"$f":"IF('Tx236'!$B$69=\"\",\"\",'Tx236'!$B$69)","v":"Sieve Size"},{"$f":"IF('Tx236'!$B$80=\"\",\"\",'Tx236'!$B$80)","v":""},{"$f":"IF('Tx236'!$H$23=\"\",\"\",'Tx236'!$H$23)","v":"Ignited Sample 1"},{"$f":"IF('Tx236'!$F$28=\"\",\"\",'Tx236'!$F$28)","v":"Individual Weight Retained"}]
[71,{"$f":"IF('Tx236'!$I$37=\"\",\"\",'Tx236'!$I$37)","v":""},{"$f":"IF('Tx236'!$B$21=\"\",\"\",'Tx236'!$B$21)","v":"SIEVE ANALYSIS WORKSHEET FOR CALIBRATION SAMPLES"},{"$f":"IF('Tx236'!$B$69=\"\",\"\",'Tx236'!$B$69)","v":"Sieve Size"},{"$f":"IF('Tx236'!$B$80=\"\",\"\",'Tx236'!$B$80)","v":""},{"$f":"IF('Tx236'!$I$23=\"\",\"\",'Tx236'!$I$23)","v":"Ignited Sample 2"},{"$f":"IF('Tx236'!$F$28=\"\",\"\",'Tx236'!$F$28)","v":"Individual Weight Retained"}]
[72,{"$f":"IF('Tx236'!$J$37=\"\",\"\",'Tx236'!$J$37)","v":""},{"$f":"IF('Tx236'!$B$21=\"\",\"\",'Tx236'!$B$21)","v":"SIEVE ANALYSIS WORKSHEET FOR CALIBRATION SAMPLES"},{"$f":"IF('Tx236'!$B$69=\"\",\"\",'Tx236'!$B$69)","v":"Sieve Size"},{"$f":"IF('Tx236'!$B$80=\"\",\"\",'Tx236'!$B$80)","v":""},{"$f":"IF('Tx236'!$J$23=\"\",\"\",'Tx236'!$J$23)","v":"Ignited Sample 5"},{"$f":"IF('Tx236'!$F$28=\"\",\"\",'Tx236'!$F$28)","v":"Individual Weight Retained"}]
[73,{"$f":"IF('Tx236'!$K$37=\"\",\"\",'Tx236'!$K$37)","v":""},{"$f":"IF('Tx236'!$B$21=\"\",\"\",'Tx236'!$B$21)","v":"SIEVE ANALYSIS WORKSHEET FOR CALIBRATION SAMPLES"},{"$f":"IF('Tx236'!$B$69=\"\",\"\",'Tx236'!$B$69)","v":"Sieve Size"},{"$f":"IF('Tx236'!$B$80=\"\",\"\",'Tx236'!$B$80)","v":""},{"$f":"IF('Tx236'!$K$23=\"\",\"\",'Tx236'!$K$23)","v":"Ignited     Sample 6"},{"$f":"IF('Tx236'!$F$28=\"\",\"\",'Tx236'!$F$28)","v":"Individual Weight Retained"}]
[74,{"$f":"IF('Tx236'!$D$38=\"\",\"\",'Tx236'!$D$38)","v":""},{"$f":"IF('Tx236'!$B$21=\"\",\"\",'Tx236'!$B$21)","v":"SIEVE ANALYSIS WORKSHEET FOR CALIBRATION SAMPLES"},{"$f":"IF('Tx236'!$B$69=\"\",\"\",'Tx236'!$B$69)","v":"Sieve Size"},{"$f":"IF('Tx236'!$B$81=\"\",\"\",'Tx236'!$B$81)","v":""},{"$f":"IF('Tx236'!$D$24=\"\",\"\",'Tx236'!$D$24)","v":"Blank Sample"},{"$f":"IF('Tx236'!$D$28=\"\",\"\",'Tx236'!$D$28)","v":"Individual Weight Retained"}]
[75,{"$f":"IF('Tx236'!$F$38=\"\",\"\",'Tx236'!$F$38)","v":""},{"$f":"IF('Tx236'!$B$21=\"\",\"\",'Tx236'!$B$21)","v":"SIEVE ANALYSIS WORKSHEET FOR CALIBRATION SAMPLES"},{"$f":"IF('Tx236'!$B$69=\"\",\"\",'Tx236'!$B$69)","v":"Sieve Size"},{"$f":"IF('Tx236'!$B$81=\"\",\"\",'Tx236'!$B$81)","v":""},{"$f":"IF('Tx236'!$F$23=\"\",\"\",'Tx236'!$F$23)","v":"Ignited Sample 1"},{"$f":"IF('Tx236'!$F$28=\"\",\"\",'Tx236'!$F$28)","v":"Individual Weight Retained"}]
[76,{"$f":"IF('Tx236'!$G$38=\"\",\"\",'Tx236'!$G$38)","v":""},{"$f":"IF('Tx236'!$B$21=\"\",\"\",'Tx236'!$B$21)","v":"SIEVE ANALYSIS WORKSHEET FOR CALIBRATION SAMPLES"},{"$f":"IF('Tx236'!$B$69=\"\",\"\",'Tx236'!$B$69)","v":"Sieve Size"},{"$f":"IF('Tx236'!$B$81=\"\",\"\",'Tx236'!$B$81)","v":""},{"$f":"IF('Tx236'!$G$23=\"\",\"\",'Tx236'!$G$23)","v":"Ignited Sample 2"},{"$f":"IF('Tx236'!$F$28=\"\",\"\",'Tx236'!$F$28)","v":"Individual Weight Retained"}]
[77,{"$f":"IF('Tx236'!$H$38=\"\",\"\",'Tx236'!$H$38)","v":""},{"$f":"IF('Tx236'!$B$21=\"\",\"\",'Tx236'!$B$21)","v":"SIEVE ANALYSIS WORKSHEET FOR CALIBRATION SAMPLES"},{"$f":"IF('Tx236'!$B$69=\"\",\"\",'Tx236'!$B$69)","v":"Sieve Size"},{"$f":"IF('Tx236'!$B$81=\"\",\"\",'Tx236'!$B$81)","v":""},{"$f":"IF('Tx236'!$H$23=\"\",\"\",'Tx236'!$H$23)","v":"Ignited Sample 1"},{"$f":"IF('Tx236'!$F$28=\"\",\"\",'Tx236'!$F$28)","v":"Individual Weight Retained"}]
[78,{"$f":"IF('Tx236'!$I$38=\"\",\"\",'Tx236'!$I$38)","v":""},{"$f":"IF('Tx236'!$B$21=\"\",\"\",'Tx236'!$B$21)","v":"SIEVE ANALYSIS WORKSHEET FOR CALIBRATION SAMPLES"},{"$f":"IF('Tx236'!$B$69=\"\",\"\",'Tx236'!$B$69)","v":"Sieve Size"},{"$f":"IF('Tx236'!$B$81=\"\",\"\",'Tx236'!$B$81)","v":""},{"$f":"IF('Tx236'!$I$23=\"\",\"\",'Tx236'!$I$23)","v":"Ignited Sample 2"},{"$f":"IF('Tx236'!$F$28=\"\",\"\",'Tx236'!$F$28)","v":"Individual Weight Retained"}]
[79,{"$f":"IF('Tx236'!$J$38=\"\",\"\",'Tx236'!$J$38)","v":""},{"$f":"IF('Tx236'!$B$21=\"\",\"\",'Tx236'!$B$21)","v":"SIEVE ANALYSIS WORKSHEET FOR CALIBRATION SAMPLES"},{"$f":"IF('Tx236'!$B$69=\"\",\"\",'Tx236'!$B$69)","v":"Sieve Size"},{"$f":"IF('Tx236'!$B$81=\"\",\"\",'Tx236'!$B$81)","v":""},{"$f":"IF('Tx236'!$J$23=\"\",\"\",'Tx236'!$J$23)","v":"Ignited Sample 5"},{"$f":"IF('Tx236'!$F$28=\"\",\"\",'Tx236'!$F$28)","v":"Individual Weight Retained"}]
[80,{"$f":"IF('Tx236'!$K$38=\"\",\"\",'Tx236'!$K$38)","v":""},{"$f":"IF('Tx236'!$B$21=\"\",\"\",'Tx236'!$B$21)","v":"SIEVE ANALYSIS WORKSHEET FOR CALIBRATION SAMPLES"},{"$f":"IF('Tx236'!$B$69=\"\",\"\",'Tx236'!$B$69)","v":"Sieve Size"},{"$f":"IF('Tx236'!$B$81=\"\",\"\",'Tx236'!$B$81)","v":""},{"$f":"IF('Tx236'!$K$23=\"\",\"\",'Tx236'!$K$23)","v":"Ignited     Sample 6"},{"$f":"IF('Tx236'!$F$28=\"\",\"\",'Tx236'!$F$28)","v":"Individual Weight Retained"}]
[81,{"$f":"IF('Tx236'!$D$39=\"\",\"\",'Tx236'!$D$39)","v":""},{"$f":"IF('Tx236'!$B$21=\"\",\"\",'Tx236'!$B$21)","v":"SIEVE ANALYSIS WORKSHEET FOR CALIBRATION SAMPLES"},{"$f":"IF('Tx236'!$B$69=\"\",\"\",'Tx236'!$B$69)","v":"Sieve Size"},{"$f":"IF('Tx236'!$B$82=\"\",\"\",'Tx236'!$B$82)","v":""},{"$f":"IF('Tx236'!$D$24=\"\",\"\",'Tx236'!$D$24)","v":"Blank Sample"},{"$f":"IF('Tx236'!$D$28=\"\",\"\",'Tx236'!$D$28)","v":"Individual Weight Retained"}]
[82,{"$f":"IF('Tx236'!$F$39=\"\",\"\",'Tx236'!$F$39)","v":""},{"$f":"IF('Tx236'!$B$21=\"\",\"\",'Tx236'!$B$21)","v":"SIEVE ANALYSIS WORKSHEET FOR CALIBRATION SAMPLES"},{"$f":"IF('Tx236'!$B$69=\"\",\"\",'Tx236'!$B$69)","v":"Sieve Size"},{"$f":"IF('Tx236'!$B$82=\"\",\"\",'Tx236'!$B$82)","v":""},{"$f":"IF('Tx236'!$F$23=\"\",\"\",'Tx236'!$F$23)","v":"Ignited Sample 1"},{"$f":"IF('Tx236'!$F$28=\"\",\"\",'Tx236'!$F$28)","v":"Individual Weight Retained"}]
[83,{"$f":"IF('Tx236'!$G$39=\"\",\"\",'Tx236'!$G$39)","v":""},{"$f":"IF('Tx236'!$B$21=\"\",\"\",'Tx236'!$B$21)","v":"SIEVE ANALYSIS WORKSHEET FOR CALIBRATION SAMPLES"},{"$f":"IF('Tx236'!$B$69=\"\",\"\",'Tx236'!$B$69)","v":"Sieve Size"},{"$f":"IF('Tx236'!$B$82=\"\",\"\",'Tx236'!$B$82)","v":""},{"$f":"IF('Tx236'!$G$23=\"\",\"\",'Tx236'!$G$23)","v":"Ignited Sample 2"},{"$f":"IF('Tx236'!$F$28=\"\",\"\",'Tx236'!$F$28)","v":"Individual Weight Retained"}]
[84,{"$f":"IF('Tx236'!$H$39=\"\",\"\",'Tx236'!$H$39)","v":""},{"$f":"IF('Tx236'!$B$21=\"\",\"\",'Tx236'!$B$21)","v":"SIEVE ANALYSIS WORKSHEET FOR CALIBRATION SAMPLES"},{"$f":"IF('Tx236'!$B$69=\"\",\"\",'Tx236'!$B$69)","v":"Sieve Size"},{"$f":"IF('Tx236'!$B$82=\"\",\"\",'Tx236'!$B$82)","v":""},{"$f":"IF('Tx236'!$H$23=\"\",\"\",'Tx236'!$H$23)","v":"Ignited Sample 1"},{"$f":"IF('Tx236'!$F$28=\"\",\"\",'Tx236'!$F$28)","v":"Individual Weight Retained"}]
[85,{"$f":"IF('Tx236'!$I$39=\"\",\"\",'Tx236'!$I$39)","v":""},{"$f":"IF('Tx236'!$B$21=\"\",\"\",'Tx236'!$B$21)","v":"SIEVE ANALYSIS WORKSHEET FOR CALIBRATION SAMPLES"},{"$f":"IF('Tx236'!$B$69=\"\",\"\",'Tx236'!$B$69)","v":"Sieve Size"},{"$f":"IF('Tx236'!$B$82=\"\",\"\",'Tx236'!$B$82)","v":""},{"$f":"IF('Tx236'!$I$23=\"\",\"\",'Tx236'!$I$23)","v":"Ignited Sample 2"},{"$f":"IF('Tx236'!$F$28=\"\",\"\",'Tx236'!$F$28)","v":"Individual Weight Retained"}]
[86,{"$f":"IF('Tx236'!$J$39=\"\",\"\",'Tx236'!$J$39)","v":""},{"$f":"IF('Tx236'!$B$21=\"\",\"\",'Tx236'!$B$21)","v":"SIEVE ANALYSIS WORKSHEET FOR CALIBRATION SAMPLES"},{"$f":"IF('Tx236'!$B$69=\"\",\"\",'Tx236'!$B$69)","v":"Sieve Size"},{"$f":"IF('Tx236'!$B$82=\"\",\"\",'Tx236'!$B$82)","v":""},{"$f":"IF('Tx236'!$J$23=\"\",\"\",'Tx236'!$J$23)","v":"Ignited Sample 5"},{"$f":"IF('Tx236'!$F$28=\"\",\"\",'Tx236'!$F$28)","v":"Individual Weight Retained"}]
[87,{"$f":"IF('Tx236'!$K$39=\"\",\"\",'Tx236'!$K$39)","v":""},{"$f":"IF('Tx236'!$B$21=\"\",\"\",'Tx236'!$B$21)","v":"SIEVE ANALYSIS WORKSHEET FOR CALIBRATION SAMPLES"},{"$f":"IF('Tx236'!$B$69=\"\",\"\",'Tx236'!$B$69)","v":"Sieve Size"},{"$f":"IF('Tx236'!$B$82=\"\",\"\",'Tx236'!$B$82)","v":""},{"$f":"IF('Tx236'!$K$23=\"\",\"\",'Tx236'!$K$23)","v":"Ignited     Sample 6"},{"$f":"IF('Tx236'!$F$28=\"\",\"\",'Tx236'!$F$28)","v":"Individual Weight Retained"}]
[88,{"$f":"IF('Tx236'!$F$40=\"\",\"\",'Tx236'!$F$40)","v":""},{"$f":"IF('Tx236'!$B$21=\"\",\"\",'Tx236'!$B$21)","v":"SIEVE ANALYSIS WORKSHEET FOR CALIBRATION SAMPLES"},{"$f":"IF('Tx236'!$B$69=\"\",\"\",'Tx236'!$B$69)","v":"Sieve Size"},{"$f":"IF('Tx236'!$B$40=\"\",\"\",'Tx236'!$B$40)","v":"PAN"},{"$f":"IF('Tx236'!$F$23=\"\",\"\",'Tx236'!$F$23)","v":"Ignited Sample 1"},{"$f":"IF('Tx236'!$F$28=\"\",\"\",'Tx236'!$F$28)","v":"Individual Weight Retained"}]
[89,{"$f":"IF('Tx236'!$G$40=\"\",\"\",'Tx236'!$G$40)","v":""},{"$f":"IF('Tx236'!$B$21=\"\",\"\",'Tx236'!$B$21)","v":"SIEVE ANALYSIS WORKSHEET FOR CALIBRATION SAMPLES"},{"$f":"IF('Tx236'!$B$69=\"\",\"\",'Tx236'!$B$69)","v":"Sieve Size"},{"$f":"IF('Tx236'!$B$40=\"\",\"\",'Tx236'!$B$40)","v":"PAN"},{"$f":"IF('Tx236'!$G$23=\"\",\"\",'Tx236'!$G$23)","v":"Ignited Sample 2"},{"$f":"IF('Tx236'!$F$28=\"\",\"\",'Tx236'!$F$28)","v":"Individual Weight Retained"}]
[90,{"$f":"IF('Tx236'!$H$40=\"\",\"\",'Tx236'!$H$40)","v":""},{"$f":"IF('Tx236'!$B$21=\"\",\"\",'Tx236'!$B$21)","v":"SIEVE ANALYSIS WORKSHEET FOR CALIBRATION SAMPLES"},{"$f":"IF('Tx236'!$B$69=\"\",\"\",'Tx236'!$B$69)","v":"Sieve Size"},{"$f":"IF('Tx236'!$B$40=\"\",\"\",'Tx236'!$B$40)","v":"PAN"},{"$f":"IF('Tx236'!$H$23=\"\",\"\",'Tx236'!$H$23)","v":"Ignited Sample 1"},{"$f":"IF('Tx236'!$F$28=\"\",\"\",'Tx236'!$F$28)","v":"Individual Weight Retained"}]
[91,{"$f":"IF('Tx236'!$I$40=\"\",\"\",'Tx236'!$I$40)","v":""},{"$f":"IF('Tx236'!$B$21=\"\",\"\",'Tx236'!$B$21)","v":"SIEVE ANALYSIS WORKSHEET FOR CALIBRATION SAMPLES"},{"$f":"IF('Tx236'!$B$69=\"\",\"\",'Tx236'!$B$69)","v":"Sieve Size"},{"$f":"IF('Tx236'!$B$40=\"\",\"\",'Tx236'!$B$40)","v":"PAN"},{"$f":"IF('Tx236'!$I$23=\"\",\"\",'Tx236'!$I$23)","v":"Ignited Sample 2"},{"$f":"IF('Tx236'!$F$28=\"\",\"\",'Tx236'!$F$28)","v":"Individual Weight Retained"}]
[92,{"$f":"IF('Tx236'!$J$40=\"\",\"\",'Tx236'!$J$40)","v":""},{"$f":"IF('Tx236'!$B$21=\"\",\"\",'Tx236'!$B$21)","v":"SIEVE ANALYSIS WORKSHEET FOR CALIBRATION SAMPLES"},{"$f":"IF('Tx236'!$B$69=\"\",\"\",'Tx236'!$B$69)","v":"Sieve Size"},{"$f":"IF('Tx236'!$B$40=\"\",\"\",'Tx236'!$B$40)","v":"PAN"},{"$f":"IF('Tx236'!$J$23=\"\",\"\",'Tx236'!$J$23)","v":"Ignited Sample 5"},{"$f":"IF('Tx236'!$F$28=\"\",\"\",'Tx236'!$F$28)","v":"Individual Weight Retained"}]
[93,{"$f":"IF('Tx236'!$K$40=\"\",\"\",'Tx236'!$K$40)","v":""},{"$f":"IF('Tx236'!$B$21=\"\",\"\",'Tx236'!$B$21)","v":"SIEVE ANALYSIS WORKSHEET FOR CALIBRATION SAMPLES"},{"$f":"IF('Tx236'!$B$69=\"\",\"\",'Tx236'!$B$69)","v":"Sieve Size"},{"$f":"IF('Tx236'!$B$40=\"\",\"\",'Tx236'!$B$40)","v":"PAN"},{"$f":"IF('Tx236'!$K$23=\"\",\"\",'Tx236'!$K$23)","v":"Ignited     Sample 6"},{"$f":"IF('Tx236'!$F$28=\"\",\"\",'Tx236'!$F$28)","v":"Individual Weight Retained"}]
[94,{"$f":"IF('Tx236'!$C$72=\"\",\"\",'Tx236'!$C$72)","v":""},{"$f":"IF('Tx236'!$B$66=\"\",\"\",'Tx236'!$B$66)","v":"AGGREGATE GRADATION CORRECTION FACTOR CALCULATIONS"},{"$f":"IF('Tx236'!$B$69=\"\",\"\",'Tx236'!$B$69)","v":"Sieve Size"},{"$f":"IF('Tx236'!$B$72=\"\",\"\",'Tx236'!$B$72)","v":""},{"$f":"IF('Tx236'!$C$67=\"\",\"\",'Tx236'!$C$67)","v":"Total Percent Passing, %"},{"$f":"IF('Tx236'!$C$69=\"\",\"\",'Tx236'!$C$69)","v":"Combined Gradation"}]
[95,{"$f":"IF('Tx236'!$E$72=\"\",\"\",'Tx236'!$E$72)","v":""},{"$f":"IF('Tx236'!$B$66=\"\",\"\",'Tx236'!$B$66)","v":"AGGREGATE GRADATION CORRECTION FACTOR CALCULATIONS"},{"$f":"IF('Tx236'!$B$69=\"\",\"\",'Tx236'!$B$69)","v":"Sieve Size"},{"$f":"IF('Tx236'!$B$72=\"\",\"\",'Tx236'!$B$72)","v":""},{"$f":"IF('Tx236'!$C$67=\"\",\"\",'Tx236'!$C$67)","v":"Total Percent Passing, %"},{"$f":"IF('Tx236'!$E$69=\"\",\"\",'Tx236'!$E$69)","v":"Ignited Sample 1"}]
[96,{"$f":"IF('Tx236'!$F$72=\"\",\"\",'Tx236'!$F$72)","v":""},{"$f":"IF('Tx236'!$B$66=\"\",\"\",'Tx236'!$B$66)","v":"AGGREGATE GRADATION CORRECTION FACTOR CALCULATIONS"},{"$f":"IF('Tx236'!$B$69=\"\",\"\",'Tx236'!$B$69)","v":"Sieve Size"},{"$f":"IF('Tx236'!$B$72=\"\",\"\",'Tx236'!$B$72)","v":""},{"$f":"IF('Tx236'!$C$67=\"\",\"\",'Tx236'!$C$67)","v":"Total Percent Passing, %"},{"$f":"IF('Tx236'!$F$69=\"\",\"\",'Tx236'!$F$69)","v":"Ignited Sample 2"}]
[97,{"$f":"IF('Tx236'!$G$72=\"\",\"\",'Tx236'!$G$72)","v":""},{"$f":"IF('Tx236'!$B$66=\"\",\"\",'Tx236'!$B$66)","v":"AGGREGATE GRADATION CORRECTION FACTOR CALCULATIONS"},{"$f":"IF('Tx236'!$B$69=\"\",\"\",'Tx236'!$B$69)","v":"Sieve Size"},{"$f":"IF('Tx236'!$B$72=\"\",\"\",'Tx236'!$B$72)","v":""},{"$f":"IF('Tx236'!$C$67=\"\",\"\",'Tx236'!$C$67)","v":"Total Percent Passing, %"},{"$f":"IF('Tx236'!$G$69=\"\",\"\",'Tx236'!$G$69)","v":"Ignited Sample 1"}]
[98,{"$f":"IF('Tx236'!$H$72=\"\",\"\",'Tx236'!$H$72)","v":""},{"$f":"IF('Tx236'!$B$66=\"\",\"\",'Tx236'!$B$66)","v":"AGGREGATE GRADATION CORRECTION FACTOR CALCULATIONS"},{"$f":"IF('Tx236'!$B$69=\"\",\"\",'Tx236'!$B$69)","v":"Sieve Size"},{"$f":"IF('Tx236'!$B$72=\"\",\"\",'Tx236'!$B$72)","v":""},{"$f":"IF('Tx236'!$C$67=\"\",\"\",'Tx236'!$C$67)","v":"Total Percent Passing, %"},{"$f":"IF('Tx236'!$H$69=\"\",\"\",'Tx236'!$H$69)","v":"Ignited Sample 2"}]
[99,{"$f":"IF('Tx236'!$I$72=\"\",\"\",'Tx236'!$I$72)","v":""},{"$f":"IF('Tx236'!$B$66=\"\",\"\",'Tx236'!$B$66)","v":"AGGREGATE GRADATION CORRECTION FACTOR CALCULATIONS"},{"$f":"IF('Tx236'!$B$69=\"\",\"\",'Tx236'!$B$69)","v":"Sieve Size"},{"$f":"IF('Tx236'!$B$72=\"\",\"\",'Tx236'!$B$72)","v":""},{"$f":"IF('Tx236'!$C$67=\"\",\"\",'Tx236'!$C$67)","v":"Total Percent Passing, %"},{"$f":"IF('Tx236'!$I$69=\"\",\"\",'Tx236'!$I$69)","v":"Ignited Sample 5"}]
[100,{"$f":"IF('Tx236'!$J$72=\"\",\"\",'Tx236'!$J$72)","v":""},{"$f":"IF('Tx236'!$B$66=\"\",\"\",'Tx236'!$B$66)","v":"AGGREGATE GRADATION CORRECTION FACTOR CALCULATIONS"},{"$f":"IF('Tx236'!$B$69=\"\",\"\",'Tx236'!$B$69)","v":"Sieve Size"},{"$f":"IF('Tx236'!$B$72=\"\",\"\",'Tx236'!$B$72)","v":""},{"$f":"IF('Tx236'!$C$67=\"\",\"\",'Tx236'!$C$67)","v":"Total Percent Passing, %"},{"$f":"IF('Tx236'!$J$69=\"\",\"\",'Tx236'!$J$69)","v":"Ignited Sample 6"}]
[101,{"$f":"IF('Tx236'!$K$72=\"\",\"\",'Tx236'!$K$72)","v":""},{"$f":"IF('Tx236'!$B$66=\"\",\"\",'Tx236'!$B$66)","v":"AGGREGATE GRADATION CORRECTION FACTOR CALCULATIONS"},{"$f":"IF('Tx236'!$B$69=\"\",\"\",'Tx236'!$B$69)","v":"Sieve Size"},{"$f":"IF('Tx236'!$B$72=\"\",\"\",'Tx236'!$B$72)","v":""},{"$f":"IF('Tx236'!$K$69=\"\",\"\",'Tx236'!$K$69)","v":"Correction Factor"}]
[102,{"$f":"IF('Tx236'!$C$73=\"\",\"\",'Tx236'!$C$73)","v":""},{"$f":"IF('Tx236'!$B$66=\"\",\"\",'Tx236'!$B$66)","v":"AGGREGATE GRADATION CORRECTION FACTOR CALCULATIONS"},{"$f":"IF('Tx236'!$B$69=\"\",\"\",'Tx236'!$B$69)","v":"Sieve Size"},{"$f":"IF('Tx236'!$B$73=\"\",\"\",'Tx236'!$B$73)","v":""},{"$f":"IF('Tx236'!$C$67=\"\",\"\",'Tx236'!$C$67)","v":"Total Percent Passing, %"},{"$f":"IF('Tx236'!$C$69=\"\",\"\",'Tx236'!$C$69)","v":"Combined Gradation"}]
[103,{"$f":"IF('Tx236'!$E$73=\"\",\"\",'Tx236'!$E$73)","v":""},{"$f":"IF('Tx236'!$B$66=\"\",\"\",'Tx236'!$B$66)","v":"AGGREGATE GRADATION CORRECTION FACTOR CALCULATIONS"},{"$f":"IF('Tx236'!$B$69=\"\",\"\",'Tx236'!$B$69)","v":"Sieve Size"},{"$f":"IF('Tx236'!$B$73=\"\",\"\",'Tx236'!$B$73)","v":""},{"$f":"IF('Tx236'!$C$67=\"\",\"\",'Tx236'!$C$67)","v":"Total Percent Passing, %"},{"$f":"IF('Tx236'!$E$69=\"\",\"\",'Tx236'!$E$69)","v":"Ignited Sample 1"}]
[104,{"$f":"IF('Tx236'!$F$73=\"\",\"\",'Tx236'!$F$73)","v":""},{"$f":"IF('Tx236'!$B$66=\"\",\"\",'Tx236'!$B$66)","v":"AGGREGATE GRADATION CORRECTION FACTOR CALCULATIONS"},{"$f":"IF('Tx236'!$B$69=\"\",\"\",'Tx236'!$B$69)","v":"Sieve Size"},{"$f":"IF('Tx236'!$B$73=\"\",\"\",'Tx236'!$B$73)","v":""},{"$f":"IF('Tx236'!$C$67=\"\",\"\",'Tx236'!$C$67)","v":"Total Percent Passing, %"},{"$f":"IF('Tx236'!$F$69=\"\",\"\",'Tx236'!$F$69)","v":"Ignited Sample 2"}]
[105,{"$f":"IF('Tx236'!$G$73=\"\",\"\",'Tx236'!$G$73)","v":""},{"$f":"IF('Tx236'!$B$66=\"\",\"\",'Tx236'!$B$66)","v":"AGGREGATE GRADATION CORRECTION FACTOR CALCULATIONS"},{"$f":"IF('Tx236'!$B$69=\"\",\"\",'Tx236'!$B$69)","v":"Sieve Size"},{"$f":"IF('Tx236'!$B$73=\"\",\"\",'Tx236'!$B$73)","v":""},{"$f":"IF('Tx236'!$C$67=\"\",\"\",'Tx236'!$C$67)","v":"Total Percent Passing, %"},{"$f":"IF('Tx236'!$G$69=\"\",\"\",'Tx236'!$G$69)","v":"Ignited Sample 1"}]
[106,{"$f":"IF('Tx236'!$H$73=\"\",\"\",'Tx236'!$H$73)","v":""},{"$f":"IF('Tx236'!$B$66=\"\",\"\",'Tx236'!$B$66)","v":"AGGREGATE GRADATION CORRECTION FACTOR CALCULATIONS"},{"$f":"IF('Tx236'!$B$69=\"\",\"\",'Tx236'!$B$69)","v":"Sieve Size"},{"$f":"IF('Tx236'!$B$73=\"\",\"\",'Tx236'!$B$73)","v":""},{"$f":"IF('Tx236'!$C$67=\"\",\"\",'Tx236'!$C$67)","v":"Total Percent Passing, %"},{"$f":"IF('Tx236'!$H$69=\"\",\"\",'Tx236'!$H$69)","v":"Ignited Sample 2"}]
[107,{"$f":"IF('Tx236'!$I$73=\"\",\"\",'Tx236'!$I$73)","v":""},{"$f":"IF('Tx236'!$B$66=\"\",\"\",'Tx236'!$B$66)","v":"AGGREGATE GRADATION CORRECTION FACTOR CALCULATIONS"},{"$f":"IF('Tx236'!$B$69=\"\",\"\",'Tx236'!$B$69)","v":"Sieve Size"},{"$f":"IF('Tx236'!$B$73=\"\",\"\",'Tx236'!$B$73)","v":""},{"$f":"IF('Tx236'!$C$67=\"\",\"\",'Tx236'!$C$67)","v":"Total Percent Passing, %"},{"$f":"IF('Tx236'!$I$69=\"\",\"\",'Tx236'!$I$69)","v":"Ignited Sample 5"}]
[108,{"$f":"IF('Tx236'!$J$73=\"\",\"\",'Tx236'!$J$73)","v":""},{"$f":"IF('Tx236'!$B$66=\"\",\"\",'Tx236'!$B$66)","v":"AGGREGATE GRADATION CORRECTION FACTOR CALCULATIONS"},{"$f":"IF('Tx236'!$B$69=\"\",\"\",'Tx236'!$B$69)","v":"Sieve Size"},{"$f":"IF('Tx236'!$B$73=\"\",\"\",'Tx236'!$B$73)","v":""},{"$f":"IF('Tx236'!$C$67=\"\",\"\",'Tx236'!$C$67)","v":"Total Percent Passing, %"},{"$f":"IF('Tx236'!$J$69=\"\",\"\",'Tx236'!$J$69)","v":"Ignited Sample 6"}]
[109,{"$f":"IF('Tx236'!$K$73=\"\",\"\",'Tx236'!$K$73)","v":""},{"$f":"IF('Tx236'!$B$66=\"\",\"\",'Tx236'!$B$66)","v":"AGGREGATE GRADATION CORRECTION FACTOR CALCULATIONS"},{"$f":"IF('Tx236'!$B$69=\"\",\"\",'Tx236'!$B$69)","v":"Sieve Size"},{"$f":"IF('Tx236'!$B$73=\"\",\"\",'Tx236'!$B$73)","v":""},{"$f":"IF('Tx236'!$K$69=\"\",\"\",'Tx236'!$K$69)","v":"Correction Factor"}]
[110,{"$f":"IF('Tx236'!$C$74=\"\",\"\",'Tx236'!$C$74)","v":""},{"$f":"IF('Tx236'!$B$66=\"\",\"\",'Tx236'!$B$66)","v":"AGGREGATE GRADATION CORRECTION FACTOR CALCULATIONS"},{"$f":"IF('Tx236'!$B$69=\"\",\"\",'Tx236'!$B$69)","v":"Sieve Size"},{"$f":"IF('Tx236'!$B$74=\"\",\"\",'Tx236'!$B$74)","v":""},{"$f":"IF('Tx236'!$C$67=\"\",\"\",'Tx236'!$C$67)","v":"Total Percent Passing, %"},{"$f":"IF('Tx236'!$C$69=\"\",\"\",'Tx236'!$C$69)","v":"Combined Gradation"}]
[111,{"$f":"IF('Tx236'!$E$74=\"\",\"\",'Tx236'!$E$74)","v":""},{"$f":"IF('Tx236'!$B$66=\"\",\"\",'Tx236'!$B$66)","v":"AGGREGATE GRADATION CORRECTION FACTOR CALCULATIONS"},{"$f":"IF('Tx236'!$B$69=\"\",\"\",'Tx236'!$B$69)","v":"Sieve Size"},{"$f":"IF('Tx236'!$B$74=\"\",\"\",'Tx236'!$B$74)","v":""},{"$f":"IF('Tx236'!$C$67=\"\",\"\",'Tx236'!$C$67)","v":"Total Percent Passing, %"},{"$f":"IF('Tx236'!$E$69=\"\",\"\",'Tx236'!$E$69)","v":"Ignited Sample 1"}]
[112,{"$f":"IF('Tx236'!$F$74=\"\",\"\",'Tx236'!$F$74)","v":""},{"$f":"IF('Tx236'!$B$66=\"\",\"\",'Tx236'!$B$66)","v":"AGGREGATE GRADATION CORRECTION FACTOR CALCULATIONS"},{"$f":"IF('Tx236'!$B$69=\"\",\"\",'Tx236'!$B$69)","v":"Sieve Size"},{"$f":"IF('Tx236'!$B$74=\"\",\"\",'Tx236'!$B$74)","v":""},{"$f":"IF('Tx236'!$C$67=\"\",\"\",'Tx236'!$C$67)","v":"Total Percent Passing, %"},{"$f":"IF('Tx236'!$F$69=\"\",\"\",'Tx236'!$F$69)","v":"Ignited Sample 2"}]
[113,{"$f":"IF('Tx236'!$G$74=\"\",\"\",'Tx236'!$G$74)","v":""},{"$f":"IF('Tx236'!$B$66=\"\",\"\",'Tx236'!$B$66)","v":"AGGREGATE GRADATION CORRECTION FACTOR CALCULATIONS"},{"$f":"IF('Tx236'!$B$69=\"\",\"\",'Tx236'!$B$69)","v":"Sieve Size"},{"$f":"IF('Tx236'!$B$74=\"\",\"\",'Tx236'!$B$74)","v":""},{"$f":"IF('Tx236'!$C$67=\"\",\"\",'Tx236'!$C$67)","v":"Total Percent Passing, %"},{"$f":"IF('Tx236'!$G$69=\"\",\"\",'Tx236'!$G$69)","v":"Ignited Sample 1"}]
[114,{"$f":"IF('Tx236'!$H$74=\"\",\"\",'Tx236'!$H$74)","v":""},{"$f":"IF('Tx236'!$B$66=\"\",\"\",'Tx236'!$B$66)","v":"AGGREGATE GRADATION CORRECTION FACTOR CALCULATIONS"},{"$f":"IF('Tx236'!$B$69=\"\",\"\",'Tx236'!$B$69)","v":"Sieve Size"},{"$f":"IF('Tx236'!$B$74=\"\",\"\",'Tx236'!$B$74)","v":""},{"$f":"IF('Tx236'!$C$67=\"\",\"\",'Tx236'!$C$67)","v":"Total Percent Passing, %"},{"$f":"IF('Tx236'!$H$69=\"\",\"\",'Tx236'!$H$69)","v":"Ignited Sample 2"}]
[115,{"$f":"IF('Tx236'!$I$74=\"\",\"\",'Tx236'!$I$74)","v":""},{"$f":"IF('Tx236'!$B$66=\"\",\"\",'Tx236'!$B$66)","v":"AGGREGATE GRADATION CORRECTION FACTOR CALCULATIONS"},{"$f":"IF('Tx236'!$B$69=\"\",\"\",'Tx236'!$B$69)","v":"Sieve Size"},{"$f":"IF('Tx236'!$B$74=\"\",\"\",'Tx236'!$B$74)","v":""},{"$f":"IF('Tx236'!$C$67=\"\",\"\",'Tx236'!$C$67)","v":"Total Percent Passing, %"},{"$f":"IF('Tx236'!$I$69=\"\",\"\",'Tx236'!$I$69)","v":"Ignited Sample 5"}]
[116,{"$f":"IF('Tx236'!$J$74=\"\",\"\",'Tx236'!$J$74)","v":""},{"$f":"IF('Tx236'!$B$66=\"\",\"\",'Tx236'!$B$66)","v":"AGGREGATE GRADATION CORRECTION FACTOR CALCULATIONS"},{"$f":"IF('Tx236'!$B$69=\"\",\"\",'Tx236'!$B$69)","v":"Sieve Size"},{"$f":"IF('Tx236'!$B$74=\"\",\"\",'Tx236'!$B$74)","v":""},{"$f":"IF('Tx236'!$C$67=\"\",\"\",'Tx236'!$C$67)","v":"Total Percent Passing, %"},{"$f":"IF('Tx236'!$J$69=\"\",\"\",'Tx236'!$J$69)","v":"Ignited Sample 6"}]
[117,{"$f":"IF('Tx236'!$K$74=\"\",\"\",'Tx236'!$K$74)","v":""},{"$f":"IF('Tx236'!$B$66=\"\",\"\",'Tx236'!$B$66)","v":"AGGREGATE GRADATION CORRECTION FACTOR CALCULATIONS"},{"$f":"IF('Tx236'!$B$69=\"\",\"\",'Tx236'!$B$69)","v":"Sieve Size"},{"$f":"IF('Tx236'!$B$74=\"\",\"\",'Tx236'!$B$74)","v":""},{"$f":"IF('Tx236'!$K$69=\"\",\"\",'Tx236'!$K$69)","v":"Correction Factor"}]
[118,{"$f":"IF('Tx236'!$C$75=\"\",\"\",'Tx236'!$C$75)","v":""},{"$f":"IF('Tx236'!$B$66=\"\",\"\",'Tx236'!$B$66)","v":"AGGREGATE GRADATION CORRECTION FACTOR CALCULATIONS"},{"$f":"IF('Tx236'!$B$69=\"\",\"\",'Tx236'!$B$69)","v":"Sieve Size"},{"$f":"IF('Tx236'!$B$75=\"\",\"\",'Tx236'!$B$75)","v":""},{"$f":"IF('Tx236'!$C$67=\"\",\"\",'Tx236'!$C$67)","v":"Total Percent Passing, %"},{"$f":"IF('Tx236'!$C$69=\"\",\"\",'Tx236'!$C$69)","v":"Combined Gradation"}]
[119,{"$f":"IF('Tx236'!$E$75=\"\",\"\",'Tx236'!$E$75)","v":""},{"$f":"IF('Tx236'!$B$66=\"\",\"\",'Tx236'!$B$66)","v":"AGGREGATE GRADATION CORRECTION FACTOR CALCULATIONS"},{"$f":"IF('Tx236'!$B$69=\"\",\"\",'Tx236'!$B$69)","v":"Sieve Size"},{"$f":"IF('Tx236'!$B$75=\"\",\"\",'Tx236'!$B$75)","v":""},{"$f":"IF('Tx236'!$C$67=\"\",\"\",'Tx236'!$C$67)","v":"Total Percent Passing, %"},{"$f":"IF('Tx236'!$E$69=\"\",\"\",'Tx236'!$E$69)","v":"Ignited Sample 1"}]
[120,{"$f":"IF('Tx236'!$F$75=\"\",\"\",'Tx236'!$F$75)","v":""},{"$f":"IF('Tx236'!$B$66=\"\",\"\",'Tx236'!$B$66)","v":"AGGREGATE GRADATION CORRECTION FACTOR CALCULATIONS"},{"$f":"IF('Tx236'!$B$69=\"\",\"\",'Tx236'!$B$69)","v":"Sieve Size"},{"$f":"IF('Tx236'!$B$75=\"\",\"\",'Tx236'!$B$75)","v":""},{"$f":"IF('Tx236'!$C$67=\"\",\"\",'Tx236'!$C$67)","v":"Total Percent Passing, %"},{"$f":"IF('Tx236'!$F$69=\"\",\"\",'Tx236'!$F$69)","v":"Ignited Sample 2"}]
[121,{"$f":"IF('Tx236'!$G$75=\"\",\"\",'Tx236'!$G$75)","v":""},{"$f":"IF('Tx236'!$B$66=\"\",\"\",'Tx236'!$B$66)","v":"AGGREGATE GRADATION CORRECTION FACTOR CALCULATIONS"},{"$f":"IF('Tx236'!$B$69=\"\",\"\",'Tx236'!$B$69)","v":"Sieve Size"},{"$f":"IF('Tx236'!$B$75=\"\",\"\",'Tx236'!$B$75)","v":""},{"$f":"IF('Tx236'!$C$67=\"\",\"\",'Tx236'!$C$67)","v":"Total Percent Passing, %"},{"$f":"IF('Tx236'!$G$69=\"\",\"\",'Tx236'!$G$69)","v":"Ignited Sample 1"}]
[122,{"$f":"IF('Tx236'!$H$75=\"\",\"\",'Tx236'!$H$75)","v":""},{"$f":"IF('Tx236'!$B$66=\"\",\"\",'Tx236'!$B$66)","v":"AGGREGATE GRADATION CORRECTION FACTOR CALCULATIONS"},{"$f":"IF('Tx236'!$B$69=\"\",\"\",'Tx236'!$B$69)","v":"Sieve Size"},{"$f":"IF('Tx236'!$B$75=\"\",\"\",'Tx236'!$B$75)","v":""},{"$f":"IF('Tx236'!$C$67=\"\",\"\",'Tx236'!$C$67)","v":"Total Percent Passing, %"},{"$f":"IF('Tx236'!$H$69=\"\",\"\",'Tx236'!$H$69)","v":"Ignited Sample 2"}]
[123,{"$f":"IF('Tx236'!$I$75=\"\",\"\",'Tx236'!$I$75)","v":""},{"$f":"IF('Tx236'!$B$66=\"\",\"\",'Tx236'!$B$66)","v":"AGGREGATE GRADATION CORRECTION FACTOR CALCULATIONS"},{"$f":"IF('Tx236'!$B$69=\"\",\"\",'Tx236'!$B$69)","v":"Sieve Size"},{"$f":"IF('Tx236'!$B$75=\"\",\"\",'Tx236'!$B$75)","v":""},{"$f":"IF('Tx236'!$C$67=\"\",\"\",'Tx236'!$C$67)","v":"Total Percent Passing, %"},{"$f":"IF('Tx236'!$I$69=\"\",\"\",'Tx236'!$I$69)","v":"Ignited Sample 5"}]
[124,{"$f":"IF('Tx236'!$J$75=\"\",\"\",'Tx236'!$J$75)","v":""},{"$f":"IF('Tx236'!$B$66=\"\",\"\",'Tx236'!$B$66)","v":"AGGREGATE GRADATION CORRECTION FACTOR CALCULATIONS"},{"$f":"IF('Tx236'!$B$69=\"\",\"\",'Tx236'!$B$69)","v":"Sieve Size"},{"$f":"IF('Tx236'!$B$75=\"\",\"\",'Tx236'!$B$75)","v":""},{"$f":"IF('Tx236'!$C$67=\"\",\"\",'Tx236'!$C$67)","v":"Total Percent Passing, %"},{"$f":"IF('Tx236'!$J$69=\"\",\"\",'Tx236'!$J$69)","v":"Ignited Sample 6"}]
[125,{"$f":"IF('Tx236'!$K$75=\"\",\"\",'Tx236'!$K$75)","v":""},{"$f":"IF('Tx236'!$B$66=\"\",\"\",'Tx236'!$B$66)","v":"AGGREGATE GRADATION CORRECTION FACTOR CALCULATIONS"},{"$f":"IF('Tx236'!$B$69=\"\",\"\",'Tx236'!$B$69)","v":"Sieve Size"},{"$f":"IF('Tx236'!$B$75=\"\",\"\",'Tx236'!$B$75)","v":""},{"$f":"IF('Tx236'!$K$69=\"\",\"\",'Tx236'!$K$69)","v":"Correction Factor"}]
[126,{"$f":"IF('Tx236'!$C$76=\"\",\"\",'Tx236'!$C$76)","v":""},{"$f":"IF('Tx236'!$B$66=\"\",\"\",'Tx236'!$B$66)","v":"AGGREGATE GRADATION CORRECTION FACTOR CALCULATIONS"},{"$f":"IF('Tx236'!$B$69=\"\",\"\",'Tx236'!$B$69)","v":"Sieve Size"},{"$f":"IF('Tx236'!$B$76=\"\",\"\",'Tx236'!$B$76)","v":""},{"$f":"IF('Tx236'!$C$67=\"\",\"\",'Tx236'!$C$67)","v":"Total Percent Passing, %"},{"$f":"IF('Tx236'!$C$69=\"\",\"\",'Tx236'!$C$69)","v":"Combined Gradation"}]
[127,{"$f":"IF('Tx236'!$E$76=\"\",\"\",'Tx236'!$E$76)","v":""},{"$f":"IF('Tx236'!$B$66=\"\",\"\",'Tx236'!$B$66)","v":"AGGREGATE GRADATION CORRECTION FACTOR CALCULATIONS"},{"$f":"IF('Tx236'!$B$69=\"\",\"\",'Tx236'!$B$69)","v":"Sieve Size"},{"$f":"IF('Tx236'!$B$76=\"\",\"\",'Tx236'!$B$76)","v":""},{"$f":"IF('Tx236'!$C$67=\"\",\"\",'Tx236'!$C$67)","v":"Total Percent Passing, %"},{"$f":"IF('Tx236'!$E$69=\"\",\"\",'Tx236'!$E$69)","v":"Ignited Sample 1"}]
[128,{"$f":"IF('Tx236'!$F$76=\"\",\"\",'Tx236'!$F$76)","v":""},{"$f":"IF('Tx236'!$B$66=\"\",\"\",'Tx236'!$B$66)","v":"AGGREGATE GRADATION CORRECTION FACTOR CALCULATIONS"},{"$f":"IF('Tx236'!$B$69=\"\",\"\",'Tx236'!$B$69)","v":"Sieve Size"},{"$f":"IF('Tx236'!$B$76=\"\",\"\",'Tx236'!$B$76)","v":""},{"$f":"IF('Tx236'!$C$67=\"\",\"\",'Tx236'!$C$67)","v":"Total Percent Passing, %"},{"$f":"IF('Tx236'!$F$69=\"\",\"\",'Tx236'!$F$69)","v":"Ignited Sample 2"}]
[129,{"$f":"IF('Tx236'!$G$76=\"\",\"\",'Tx236'!$G$76)","v":""},{"$f":"IF('Tx236'!$B$66=\"\",\"\",'Tx236'!$B$66)","v":"AGGREGATE GRADATION CORRECTION FACTOR CALCULATIONS"},{"$f":"IF('Tx236'!$B$69=\"\",\"\",'Tx236'!$B$69)","v":"Sieve Size"},{"$f":"IF('Tx236'!$B$76=\"\",\"\",'Tx236'!$B$76)","v":""},{"$f":"IF('Tx236'!$C$67=\"\",\"\",'Tx236'!$C$67)","v":"Total Percent Passing, %"},{"$f":"IF('Tx236'!$G$69=\"\",\"\",'Tx236'!$G$69)","v":"Ignited Sample 1"}]
[130,{"$f":"IF('Tx236'!$H$76=\"\",\"\",'Tx236'!$H$76)","v":""},{"$f":"IF('Tx236'!$B$66=\"\",\"\",'Tx236'!$B$66)","v":"AGGREGATE GRADATION CORRECTION FACTOR CALCULATIONS"},{"$f":"IF('Tx236'!$B$69=\"\",\"\",'Tx236'!$B$69)","v":"Sieve Size"},{"$f":"IF('Tx236'!$B$76=\"\",\"\",'Tx236'!$B$76)","v":""},{"$f":"IF('Tx236'!$C$67=\"\",\"\",'Tx236'!$C$67)","v":"Total Percent Passing, %"},{"$f":"IF('Tx236'!$H$69=\"\",\"\",'Tx236'!$H$69)","v":"Ignited Sample 2"}]
[131,{"$f":"IF('Tx236'!$I$76=\"\",\"\",'Tx236'!$I$76)","v":""},{"$f":"IF('Tx236'!$B$66=\"\",\"\",'Tx236'!$B$66)","v":"AGGREGATE GRADATION CORRECTION FACTOR CALCULATIONS"},{"$f":"IF('Tx236'!$B$69=\"\",\"\",'Tx236'!$B$69)","v":"Sieve Size"},{"$f":"IF('Tx236'!$B$76=\"\",\"\",'Tx236'!$B$76)","v":""},{"$f":"IF('Tx236'!$C$67=\"\",\"\",'Tx236'!$C$67)","v":"Total Percent Passing, %"},{"$f":"IF('Tx236'!$I$69=\"\",\"\",'Tx236'!$I$69)","v":"Ignited Sample 5"}]
[132,{"$f":"IF('Tx236'!$J$76=\"\",\"\",'Tx236'!$J$76)","v":""},{"$f":"IF('Tx236'!$B$66=\"\",\"\",'Tx236'!$B$66)","v":"AGGREGATE GRADATION CORRECTION FACTOR CALCULATIONS"},{"$f":"IF('Tx236'!$B$69=\"\",\"\",'Tx236'!$B$69)","v":"Sieve Size"},{"$f":"IF('Tx236'!$B$76=\"\",\"\",'Tx236'!$B$76)","v":""},{"$f":"IF('Tx236'!$C$67=\"\",\"\",'Tx236'!$C$67)","v":"Total Percent Passing, %"},{"$f":"IF('Tx236'!$J$69=\"\",\"\",'Tx236'!$J$69)","v":"Ignited Sample 6"}]
[133,{"$f":"IF('Tx236'!$K$76=\"\",\"\",'Tx236'!$K$76)","v":""},{"$f":"IF('Tx236'!$B$66=\"\",\"\",'Tx236'!$B$66)","v":"AGGREGATE GRADATION CORRECTION FACTOR CALCULATIONS"},{"$f":"IF('Tx236'!$B$69=\"\",\"\",'Tx236'!$B$69)","v":"Sieve Size"},{"$f":"IF('Tx236'!$B$76=\"\",\"\",'Tx236'!$B$76)","v":""},{"$f":"IF('Tx236'!$K$69=\"\",\"\",'Tx236'!$K$69)","v":"Correction Factor"}]
[134,{"$f":"IF('Tx236'!$C$77=\"\",\"\",'Tx236'!$C$77)","v":""},{"$f":"IF('Tx236'!$B$66=\"\",\"\",'Tx236'!$B$66)","v":"AGGREGATE GRADATION CORRECTION FACTOR CALCULATIONS"},{"$f":"IF('Tx236'!$B$69=\"\",\"\",'Tx236'!$B$69)","v":"Sieve Size"},{"$f":"IF('Tx236'!$B$77=\"\",\"\",'Tx236'!$B$77)","v":""},{"$f":"IF('Tx236'!$C$67=\"\",\"\",'Tx236'!$C$67)","v":"Total Percent Passing, %"},{"$f":"IF('Tx236'!$C$69=\"\",\"\",'Tx236'!$C$69)","v":"Combined Gradation"}]
[135,{"$f":"IF('Tx236'!$E$77=\"\",\"\",'Tx236'!$E$77)","v":""},{"$f":"IF('Tx236'!$B$66=\"\",\"\",'Tx236'!$B$66)","v":"AGGREGATE GRADATION CORRECTION FACTOR CALCULATIONS"},{"$f":"IF('Tx236'!$B$69=\"\",\"\",'Tx236'!$B$69)","v":"Sieve Size"},{"$f":"IF('Tx236'!$B$77=\"\",\"\",'Tx236'!$B$77)","v":""},{"$f":"IF('Tx236'!$C$67=\"\",\"\",'Tx236'!$C$67)","v":"Total Percent Passing, %"},{"$f":"IF('Tx236'!$E$69=\"\",\"\",'Tx236'!$E$69)","v":"Ignited Sample 1"}]
[136,{"$f":"IF('Tx236'!$F$77=\"\",\"\",'Tx236'!$F$77)","v":""},{"$f":"IF('Tx236'!$B$66=\"\",\"\",'Tx236'!$B$66)","v":"AGGREGATE GRADATION CORRECTION FACTOR CALCULATIONS"},{"$f":"IF('Tx236'!$B$69=\"\",\"\",'Tx236'!$B$69)","v":"Sieve Size"},{"$f":"IF('Tx236'!$B$77=\"\",\"\",'Tx236'!$B$77)","v":""},{"$f":"IF('Tx236'!$C$67=\"\",\"\",'Tx236'!$C$67)","v":"Total Percent Passing, %"},{"$f":"IF('Tx236'!$F$69=\"\",\"\",'Tx236'!$F$69)","v":"Ignited Sample 2"}]
[137,{"$f":"IF('Tx236'!$G$77=\"\",\"\",'Tx236'!$G$77)","v":""},{"$f":"IF('Tx236'!$B$66=\"\",\"\",'Tx236'!$B$66)","v":"AGGREGATE GRADATION CORRECTION FACTOR CALCULATIONS"},{"$f":"IF('Tx236'!$B$69=\"\",\"\",'Tx236'!$B$69)","v":"Sieve Size"},{"$f":"IF('Tx236'!$B$77=\"\",\"\",'Tx236'!$B$77)","v":""},{"$f":"IF('Tx236'!$C$67=\"\",\"\",'Tx236'!$C$67)","v":"Total Percent Passing, %"},{"$f":"IF('Tx236'!$G$69=\"\",\"\",'Tx236'!$G$69)","v":"Ignited Sample 1"}]
[138,{"$f":"IF('Tx236'!$H$77=\"\",\"\",'Tx236'!$H$77)","v":""},{"$f":"IF('Tx236'!$B$66=\"\",\"\",'Tx236'!$B$66)","v":"AGGREGATE GRADATION CORRECTION FACTOR CALCULATIONS"},{"$f":"IF('Tx236'!$B$69=\"\",\"\",'Tx236'!$B$69)","v":"Sieve Size"},{"$f":"IF('Tx236'!$B$77=\"\",\"\",'Tx236'!$B$77)","v":""},{"$f":"IF('Tx236'!$C$67=\"\",\"\",'Tx236'!$C$67)","v":"Total Percent Passing, %"},{"$f":"IF('Tx236'!$H$69=\"\",\"\",'Tx236'!$H$69)","v":"Ignited Sample 2"}]
[139,{"$f":"IF('Tx236'!$I$77=\"\",\"\",'Tx236'!$I$77)","v":""},{"$f":"IF('Tx236'!$B$66=\"\",\"\",'Tx236'!$B$66)","v":"AGGREGATE GRADATION CORRECTION FACTOR CALCULATIONS"},{"$f":"IF('Tx236'!$B$69=\"\",\"\",'Tx236'!$B$69)","v":"Sieve Size"},{"$f":"IF('Tx236'!$B$77=\"\",\"\",'Tx236'!$B$77)","v":""},{"$f":"IF('Tx236'!$C$67=\"\",\"\",'Tx236'!$C$67)","v":"Total Percent Passing, %"},{"$f":"IF('Tx236'!$I$69=\"\",\"\",'Tx236'!$I$69)","v":"Ignited Sample 5"}]
[140,{"$f":"IF('Tx236'!$J$77=\"\",\"\",'Tx236'!$J$77)","v":""},{"$f":"IF('Tx236'!$B$66=\"\",\"\",'Tx236'!$B$66)","v":"AGGREGATE GRADATION CORRECTION FACTOR CALCULATIONS"},{"$f":"IF('Tx236'!$B$69=\"\",\"\",'Tx236'!$B$69)","v":"Sieve Size"},{"$f":"IF('Tx236'!$B$77=\"\",\"\",'Tx236'!$B$77)","v":""},{"$f":"IF('Tx236'!$C$67=\"\",\"\",'Tx236'!$C$67)","v":"Total Percent Passing, %"},{"$f":"IF('Tx236'!$J$69=\"\",\"\",'Tx236'!$J$69)","v":"Ignited Sample 6"}]
[141,{"$f":"IF('Tx236'!$K$77=\"\",\"\",'Tx236'!$K$77)","v":""},{"$f":"IF('Tx236'!$B$66=\"\",\"\",'Tx236'!$B$66)","v":"AGGREGATE GRADATION CORRECTION FACTOR CALCULATIONS"},{"$f":"IF('Tx236'!$B$69=\"\",\"\",'Tx236'!$B$69)","v":"Sieve Size"},{"$f":"IF('Tx236'!$B$77=\"\",\"\",'Tx236'!$B$77)","v":""},{"$f":"IF('Tx236'!$K$69=\"\",\"\",'Tx236'!$K$69)","v":"Correction Factor"}]
[142,{"$f":"IF('Tx236'!$C$78=\"\",\"\",'Tx236'!$C$78)","v":""},{"$f":"IF('Tx236'!$B$66=\"\",\"\",'Tx236'!$B$66)","v":"AGGREGATE GRADATION CORRECTION FACTOR CALCULATIONS"},{"$f":"IF('Tx236'!$B$69=\"\",\"\",'Tx236'!$B$69)","v":"Sieve Size"},{"$f":"IF('Tx236'!$B$78=\"\",\"\",'Tx236'!$B$78)","v":""},{"$f":"IF('Tx236'!$C$67=\"\",\"\",'Tx236'!$C$67)","v":"Total Percent Passing, %"},{"$f":"IF('Tx236'!$C$69=\"\",\"\",'Tx236'!$C$69)","v":"Combined Gradation"}]
[143,{"$f":"IF('Tx236'!$E$78=\"\",\"\",'Tx236'!$E$78)","v":""},{"$f":"IF('Tx236'!$B$66=\"\",\"\",'Tx236'!$B$66)","v":"AGGREGATE GRADATION CORRECTION FACTOR CALCULATIONS"},{"$f":"IF('Tx236'!$B$69=\"\",\"\",'Tx236'!$B$69)","v":"Sieve Size"},{"$f":"IF('Tx236'!$B$78=\"\",\"\",'Tx236'!$B$78)","v":""},{"$f":"IF('Tx236'!$C$67=\"\",\"\",'Tx236'!$C$67)","v":"Total Percent Passing, %"},{"$f":"IF('Tx236'!$E$69=\"\",\"\",'Tx236'!$E$69)","v":"Ignited Sample 1"}]
[144,{"$f":"IF('Tx236'!$F$78=\"\",\"\",'Tx236'!$F$78)","v":""},{"$f":"IF('Tx236'!$B$66=\"\",\"\",'Tx236'!$B$66)","v":"AGGREGATE GRADATION CORRECTION FACTOR CALCULATIONS"},{"$f":"IF('Tx236'!$B$69=\"\",\"\",'Tx236'!$B$69)","v":"Sieve Size"},{"$f":"IF('Tx236'!$B$78=\"\",\"\",'Tx236'!$B$78)","v":""},{"$f":"IF('Tx236'!$C$67=\"\",\"\",'Tx236'!$C$67)","v":"Total Percent Passing, %"},{"$f":"IF('Tx236'!$F$69=\"\",\"\",'Tx236'!$F$69)","v":"Ignited Sample 2"}]
[145,{"$f":"IF('Tx236'!$G$78=\"\",\"\",'Tx236'!$G$78)","v":""},{"$f":"IF('Tx236'!$B$66=\"\",\"\",'Tx236'!$B$66)","v":"AGGREGATE GRADATION CORRECTION FACTOR CALCULATIONS"},{"$f":"IF('Tx236'!$B$69=\"\",\"\",'Tx236'!$B$69)","v":"Sieve Size"},{"$f":"IF('Tx236'!$B$78=\"\",\"\",'Tx236'!$B$78)","v":""},{"$f":"IF('Tx236'!$C$67=\"\",\"\",'Tx236'!$C$67)","v":"Total Percent Passing, %"},{"$f":"IF('Tx236'!$G$69=\"\",\"\",'Tx236'!$G$69)","v":"Ignited Sample 1"}]
[146,{"$f":"IF('Tx236'!$H$78=\"\",\"\",'Tx236'!$H$78)","v":""},{"$f":"IF('Tx236'!$B$66=\"\",\"\",'Tx236'!$B$66)","v":"AGGREGATE GRADATION CORRECTION FACTOR CALCULATIONS"},{"$f":"IF('Tx236'!$B$69=\"\",\"\",'Tx236'!$B$69)","v":"Sieve Size"},{"$f":"IF('Tx236'!$B$78=\"\",\"\",'Tx236'!$B$78)","v":""},{"$f":"IF('Tx236'!$C$67=\"\",\"\",'Tx236'!$C$67)","v":"Total Percent Passing, %"},{"$f":"IF('Tx236'!$H$69=\"\",\"\",'Tx236'!$H$69)","v":"Ignited Sample 2"}]
[147,{"$f":"IF('Tx236'!$I$78=\"\",\"\",'Tx236'!$I$78)","v":""},{"$f":"IF('Tx236'!$B$66=\"\",\"\",'Tx236'!$B$66)","v":"AGGREGATE GRADATION CORRECTION FACTOR CALCULATIONS"},{"$f":"IF('Tx236'!$B$69=\"\",\"\",'Tx236'!$B$69)","v":"Sieve Size"},{"$f":"IF('Tx236'!$B$78=\"\",\"\",'Tx236'!$B$78)","v":""},{"$f":"IF('Tx236'!$C$67=\"\",\"\",'Tx236'!$C$67)","v":"Total Percent Passing, %"},{"$f":"IF('Tx236'!$I$69=\"\",\"\",'Tx236'!$I$69)","v":"Ignited Sample 5"}]
[148,{"$f":"IF('Tx236'!$J$78=\"\",\"\",'Tx236'!$J$78)","v":""},{"$f":"IF('Tx236'!$B$66=\"\",\"\",'Tx236'!$B$66)","v":"AGGREGATE GRADATION CORRECTION FACTOR CALCULATIONS"},{"$f":"IF('Tx236'!$B$69=\"\",\"\",'Tx236'!$B$69)","v":"Sieve Size"},{"$f":"IF('Tx236'!$B$78=\"\",\"\",'Tx236'!$B$78)","v":""},{"$f":"IF('Tx236'!$C$67=\"\",\"\",'Tx236'!$C$67)","v":"Total Percent Passing, %"},{"$f":"IF('Tx236'!$J$69=\"\",\"\",'Tx236'!$J$69)","v":"Ignited Sample 6"}]
[149,{"$f":"IF('Tx236'!$K$78=\"\",\"\",'Tx236'!$K$78)","v":""},{"$f":"IF('Tx236'!$B$66=\"\",\"\",'Tx236'!$B$66)","v":"AGGREGATE GRADATION CORRECTION FACTOR CALCULATIONS"},{"$f":"IF('Tx236'!$B$69=\"\",\"\",'Tx236'!$B$69)","v":"Sieve Size"},{"$f":"IF('Tx236'!$B$78=\"\",\"\",'Tx236'!$B$78)","v":""},{"$f":"IF('Tx236'!$K$69=\"\",\"\",'Tx236'!$K$69)","v":"Correction Factor"}]
[150,{"$f":"IF('Tx236'!$C$79=\"\",\"\",'Tx236'!$C$79)","v":""},{"$f":"IF('Tx236'!$B$66=\"\",\"\",'Tx236'!$B$66)","v":"AGGREGATE GRADATION CORRECTION FACTOR CALCULATIONS"},{"$f":"IF('Tx236'!$B$69=\"\",\"\",'Tx236'!$B$69)","v":"Sieve Size"},{"$f":"IF('Tx236'!$B$79=\"\",\"\",'Tx236'!$B$79)","v":""},{"$f":"IF('Tx236'!$C$67=\"\",\"\",'Tx236'!$C$67)","v":"Total Percent Passing, %"},{"$f":"IF('Tx236'!$C$69=\"\",\"\",'Tx236'!$C$69)","v":"Combined Gradation"}]
[151,{"$f":"IF('Tx236'!$E$79=\"\",\"\",'Tx236'!$E$79)","v":""},{"$f":"IF('Tx236'!$B$66=\"\",\"\",'Tx236'!$B$66)","v":"AGGREGATE GRADATION CORRECTION FACTOR CALCULATIONS"},{"$f":"IF('Tx236'!$B$69=\"\",\"\",'Tx236'!$B$69)","v":"Sieve Size"},{"$f":"IF('Tx236'!$B$79=\"\",\"\",'Tx236'!$B$79)","v":""},{"$f":"IF('Tx236'!$C$67=\"\",\"\",'Tx236'!$C$67)","v":"Total Percent Passing, %"},{"$f":"IF('Tx236'!$E$69=\"\",\"\",'Tx236'!$E$69)","v":"Ignited Sample 1"}]
[152,{"$f":"IF('Tx236'!$F$79=\"\",\"\",'Tx236'!$F$79)","v":""},{"$f":"IF('Tx236'!$B$66=\"\",\"\",'Tx236'!$B$66)","v":"AGGREGATE GRADATION CORRECTION FACTOR CALCULATIONS"},{"$f":"IF('Tx236'!$B$69=\"\",\"\",'Tx236'!$B$69)","v":"Sieve Size"},{"$f":"IF('Tx236'!$B$79=\"\",\"\",'Tx236'!$B$79)","v":""},{"$f":"IF('Tx236'!$C$67=\"\",\"\",'Tx236'!$C$67)","v":"Total Percent Passing, %"},{"$f":"IF('Tx236'!$F$69=\"\",\"\",'Tx236'!$F$69)","v":"Ignited Sample 2"}]
[153,{"$f":"IF('Tx236'!$G$79=\"\",\"\",'Tx236'!$G$79)","v":""},{"$f":"IF('Tx236'!$B$66=\"\",\"\",'Tx236'!$B$66)","v":"AGGREGATE GRADATION CORRECTION FACTOR CALCULATIONS"},{"$f":"IF('Tx236'!$B$69=\"\",\"\",'Tx236'!$B$69)","v":"Sieve Size"},{"$f":"IF('Tx236'!$B$79=\"\",\"\",'Tx236'!$B$79)","v":""},{"$f":"IF('Tx236'!$C$67=\"\",\"\",'Tx236'!$C$67)","v":"Total Percent Passing, %"},{"$f":"IF('Tx236'!$G$69=\"\",\"\",'Tx236'!$G$69)","v":"Ignited Sample 1"}]
[154,{"$f":"IF('Tx236'!$H$79=\"\",\"\",'Tx236'!$H$79)","v":""},{"$f":"IF('Tx236'!$B$66=\"\",\"\",'Tx236'!$B$66)","v":"AGGREGATE GRADATION CORRECTION FACTOR CALCULATIONS"},{"$f":"IF('Tx236'!$B$69=\"\",\"\",'Tx236'!$B$69)","v":"Sieve Size"},{"$f":"IF('Tx236'!$B$79=\"\",\"\",'Tx236'!$B$79)","v":""},{"$f":"IF('Tx236'!$C$67=\"\",\"\",'Tx236'!$C$67)","v":"Total Percent Passing, %"},{"$f":"IF('Tx236'!$H$69=\"\",\"\",'Tx236'!$H$69)","v":"Ignited Sample 2"}]
[155,{"$f":"IF('Tx236'!$I$79=\"\",\"\",'Tx236'!$I$79)","v":""},{"$f":"IF('Tx236'!$B$66=\"\",\"\",'Tx236'!$B$66)","v":"AGGREGATE GRADATION CORRECTION FACTOR CALCULATIONS"},{"$f":"IF('Tx236'!$B$69=\"\",\"\",'Tx236'!$B$69)","v":"Sieve Size"},{"$f":"IF('Tx236'!$B$79=\"\",\"\",'Tx236'!$B$79)","v":""},{"$f":"IF('Tx236'!$C$67=\"\",\"\",'Tx236'!$C$67)","v":"Total Percent Passing, %"},{"$f":"IF('Tx236'!$I$69=\"\",\"\",'Tx236'!$I$69)","v":"Ignited Sample 5"}]
[156,{"$f":"IF('Tx236'!$J$79=\"\",\"\",'Tx236'!$J$79)","v":""},{"$f":"IF('Tx236'!$B$66=\"\",\"\",'Tx236'!$B$66)","v":"AGGREGATE GRADATION CORRECTION FACTOR CALCULATIONS"},{"$f":"IF('Tx236'!$B$69=\"\",\"\",'Tx236'!$B$69)","v":"Sieve Size"},{"$f":"IF('Tx236'!$B$79=\"\",\"\",'Tx236'!$B$79)","v":""},{"$f":"IF('Tx236'!$C$67=\"\",\"\",'Tx236'!$C$67)","v":"Total Percent Passing, %"},{"$f":"IF('Tx236'!$J$69=\"\",\"\",'Tx236'!$J$69)","v":"Ignited Sample 6"}]
[157,{"$f":"IF('Tx236'!$K$79=\"\",\"\",'Tx236'!$K$79)","v":""},{"$f":"IF('Tx236'!$B$66=\"\",\"\",'Tx236'!$B$66)","v":"AGGREGATE GRADATION CORRECTION FACTOR CALCULATIONS"},{"$f":"IF('Tx236'!$B$69=\"\",\"\",'Tx236'!$B$69)","v":"Sieve Size"},{"$f":"IF('Tx236'!$B$79=\"\",\"\",'Tx236'!$B$79)","v":""},{"$f":"IF('Tx236'!$K$69=\"\",\"\",'Tx236'!$K$69)","v":"Correction Factor"}]
[158,{"$f":"IF('Tx236'!$C$80=\"\",\"\",'Tx236'!$C$80)","v":""},{"$f":"IF('Tx236'!$B$66=\"\",\"\",'Tx236'!$B$66)","v":"AGGREGATE GRADATION CORRECTION FACTOR CALCULATIONS"},{"$f":"IF('Tx236'!$B$69=\"\",\"\",'Tx236'!$B$69)","v":"Sieve Size"},{"$f":"IF('Tx236'!$B$80=\"\",\"\",'Tx236'!$B$80)","v":""},{"$f":"IF('Tx236'!$C$67=\"\",\"\",'Tx236'!$C$67)","v":"Total Percent Passing, %"},{"$f":"IF('Tx236'!$C$69=\"\",\"\",'Tx236'!$C$69)","v":"Combined Gradation"}]
[159,{"$f":"IF('Tx236'!$E$80=\"\",\"\",'Tx236'!$E$80)","v":""},{"$f":"IF('Tx236'!$B$66=\"\",\"\",'Tx236'!$B$66)","v":"AGGREGATE GRADATION CORRECTION FACTOR CALCULATIONS"},{"$f":"IF('Tx236'!$B$69=\"\",\"\",'Tx236'!$B$69)","v":"Sieve Size"},{"$f":"IF('Tx236'!$B$80=\"\",\"\",'Tx236'!$B$80)","v":""},{"$f":"IF('Tx236'!$C$67=\"\",\"\",'Tx236'!$C$67)","v":"Total Percent Passing, %"},{"$f":"IF('Tx236'!$E$69=\"\",\"\",'Tx236'!$E$69)","v":"Ignited Sample 1"}]
[160,{"$f":"IF('Tx236'!$F$80=\"\",\"\",'Tx236'!$F$80)","v":""},{"$f":"IF('Tx236'!$B$66=\"\",\"\",'Tx236'!$B$66)","v":"AGGREGATE GRADATION CORRECTION FACTOR CALCULATIONS"},{"$f":"IF('Tx236'!$B$69=\"\",\"\",'Tx236'!$B$69)","v":"Sieve Size"},{"$f":"IF('Tx236'!$B$80=\"\",\"\",'Tx236'!$B$80)","v":""},{"$f":"IF('Tx236'!$C$67=\"\",\"\",'Tx236'!$C$67)","v":"Total Percent Passing, %"},{"$f":"IF('Tx236'!$F$69=\"\",\"\",'Tx236'!$F$69)","v":"Ignited Sample 2"}]
[161,{"$f":"IF('Tx236'!$G$80=\"\",\"\",'Tx236'!$G$80)","v":""},{"$f":"IF('Tx236'!$B$66=\"\",\"\",'Tx236'!$B$66)","v":"AGGREGATE GRADATION CORRECTION FACTOR CALCULATIONS"},{"$f":"IF('Tx236'!$B$69=\"\",\"\",'Tx236'!$B$69)","v":"Sieve Size"},{"$f":"IF('Tx236'!$B$80=\"\",\"\",'Tx236'!$B$80)","v":""},{"$f":"IF('Tx236'!$C$67=\"\",\"\",'Tx236'!$C$67)","v":"Total Percent Passing, %"},{"$f":"IF('Tx236'!$G$69=\"\",\"\",'Tx236'!$G$69)","v":"Ignited Sample 1"}]
[162,{"$f":"IF('Tx236'!$H$80=\"\",\"\",'Tx236'!$H$80)","v":""},{"$f":"IF('Tx236'!$B$66=\"\",\"\",'Tx236'!$B$66)","v":"AGGREGATE GRADATION CORRECTION FACTOR CALCULATIONS"},{"$f":"IF('Tx236'!$B$69=\"\",\"\",'Tx236'!$B$69)","v":"Sieve Size"},{"$f":"IF('Tx236'!$B$80=\"\",\"\",'Tx236'!$B$80)","v":""},{"$f":"IF('Tx236'!$C$67=\"\",\"\",'Tx236'!$C$67)","v":"Total Percent Passing, %"},{"$f":"IF('Tx236'!$H$69=\"\",\"\",'Tx236'!$H$69)","v":"Ignited Sample 2"}]
[163,{"$f":"IF('Tx236'!$I$80=\"\",\"\",'Tx236'!$I$80)","v":""},{"$f":"IF('Tx236'!$B$66=\"\",\"\",'Tx236'!$B$66)","v":"AGGREGATE GRADATION CORRECTION FACTOR CALCULATIONS"},{"$f":"IF('Tx236'!$B$69=\"\",\"\",'Tx236'!$B$69)","v":"Sieve Size"},{"$f":"IF('Tx236'!$B$80=\"\",\"\",'Tx236'!$B$80)","v":""},{"$f":"IF('Tx236'!$C$67=\"\",\"\",'Tx236'!$C$67)","v":"Total Percent Passing, %"},{"$f":"IF('Tx236'!$I$69=\"\",\"\",'Tx236'!$I$69)","v":"Ignited Sample 5"}]
[164,{"$f":"IF('Tx236'!$J$80=\"\",\"\",'Tx236'!$J$80)","v":""},{"$f":"IF('Tx236'!$B$66=\"\",\"\",'Tx236'!$B$66)","v":"AGGREGATE GRADATION CORRECTION FACTOR CALCULATIONS"},{"$f":"IF('Tx236'!$B$69=\"\",\"\",'Tx236'!$B$69)","v":"Sieve Size"},{"$f":"IF('Tx236'!$B$80=\"\",\"\",'Tx236'!$B$80)","v":""},{"$f":"IF('Tx236'!$C$67=\"\",\"\",'Tx236'!$C$67)","v":"Total Percent Passing, %"},{"$f":"IF('Tx236'!$J$69=\"\",\"\",'Tx236'!$J$69)","v":"Ignited Sample 6"}]
[165,{"$f":"IF('Tx236'!$K$80=\"\",\"\",'Tx236'!$K$80)","v":""},{"$f":"IF('Tx236'!$B$66=\"\",\"\",'Tx236'!$B$66)","v":"AGGREGATE GRADATION CORRECTION FACTOR CALCULATIONS"},{"$f":"IF('Tx236'!$B$69=\"\",\"\",'Tx236'!$B$69)","v":"Sieve Size"},{"$f":"IF('Tx236'!$B$80=\"\",\"\",'Tx236'!$B$80)","v":""},{"$f":"IF('Tx236'!$K$69=\"\",\"\",'Tx236'!$K$69)","v":"Correction Factor"}]
[166,{"$f":"IF('Tx236'!$C$81=\"\",\"\",'Tx236'!$C$81)","v":""},{"$f":"IF('Tx236'!$B$66=\"\",\"\",'Tx236'!$B$66)","v":"AGGREGATE GRADATION CORRECTION FACTOR CALCULATIONS"},{"$f":"IF('Tx236'!$B$69=\"\",\"\",'Tx236'!$B$69)","v":"Sieve Size"},{"$f":"IF('Tx236'!$B$81=\"\",\"\",'Tx236'!$B$81)","v":""},{"$f":"IF('Tx236'!$C$67=\"\",\"\",'Tx236'!$C$67)","v":"Total Percent Passing, %"},{"$f":"IF('Tx236'!$C$69=\"\",\"\",'Tx236'!$C$69)","v":"Combined Gradation"}]
[167,{"$f":"IF('Tx236'!$E$81=\"\",\"\",'Tx236'!$E$81)","v":""},{"$f":"IF('Tx236'!$B$66=\"\",\"\",'Tx236'!$B$66)","v":"AGGREGATE GRADATION CORRECTION FACTOR CALCULATIONS"},{"$f":"IF('Tx236'!$B$69=\"\",\"\",'Tx236'!$B$69)","v":"Sieve Size"},{"$f":"IF('Tx236'!$B$81=\"\",\"\",'Tx236'!$B$81)","v":""},{"$f":"IF('Tx236'!$C$67=\"\",\"\",'Tx236'!$C$67)","v":"Total Percent Passing, %"},{"$f":"IF('Tx236'!$E$69=\"\",\"\",'Tx236'!$E$69)","v":"Ignited Sample 1"}]
[168,{"$f":"IF('Tx236'!$F$81=\"\",\"\",'Tx236'!$F$81)","v":""},{"$f":"IF('Tx236'!$B$66=\"\",\"\",'Tx236'!$B$66)","v":"AGGREGATE GRADATION CORRECTION FACTOR CALCULATIONS"},{"$f":"IF('Tx236'!$B$69=\"\",\"\",'Tx236'!$B$69)","v":"Sieve Size"},{"$f":"IF('Tx236'!$B$81=\"\",\"\",'Tx236'!$B$81)","v":""},{"$f":"IF('Tx236'!$C$67=\"\",\"\",'Tx236'!$C$67)","v":"Total Percent Passing, %"},{"$f":"IF('Tx236'!$F$69=\"\",\"\",'Tx236'!$F$69)","v":"Ignited Sample 2"}]
[169,{"$f":"IF('Tx236'!$G$81=\"\",\"\",'Tx236'!$G$81)","v":""},{"$f":"IF('Tx236'!$B$66=\"\",\"\",'Tx236'!$B$66)","v":"AGGREGATE GRADATION CORRECTION FACTOR CALCULATIONS"},{"$f":"IF('Tx236'!$B$69=\"\",\"\",'Tx236'!$B$69)","v":"Sieve Size"},{"$f":"IF('Tx236'!$B$81=\"\",\"\",'Tx236'!$B$81)","v":""},{"$f":"IF('Tx236'!$C$67=\"\",\"\",'Tx236'!$C$67)","v":"Total Percent Passing, %"},{"$f":"IF('Tx236'!$G$69=\"\",\"\",'Tx236'!$G$69)","v":"Ignited Sample 1"}]
[170,{"$f":"IF('Tx236'!$H$81=\"\",\"\",'Tx236'!$H$81)","v":""},{"$f":"IF('Tx236'!$B$66=\"\",\"\",'Tx236'!$B$66)","v":"AGGREGATE GRADATION CORRECTION FACTOR CALCULATIONS"},{"$f":"IF('Tx236'!$B$69=\"\",\"\",'Tx236'!$B$69)","v":"Sieve Size"},{"$f":"IF('Tx236'!$B$81=\"\",\"\",'Tx236'!$B$81)","v":""},{"$f":"IF('Tx236'!$C$67=\"\",\"\",'Tx236'!$C$67)","v":"Total Percent Passing, %"},{"$f":"IF('Tx236'!$H$69=\"\",\"\",'Tx236'!$H$69)","v":"Ignited Sample 2"}]
[171,{"$f":"IF('Tx236'!$I$81=\"\",\"\",'Tx236'!$I$81)","v":""},{"$f":"IF('Tx236'!$B$66=\"\",\"\",'Tx236'!$B$66)","v":"AGGREGATE GRADATION CORRECTION FACTOR CALCULATIONS"},{"$f":"IF('Tx236'!$B$69=\"\",\"\",'Tx236'!$B$69)","v":"Sieve Size"},{"$f":"IF('Tx236'!$B$81=\"\",\"\",'Tx236'!$B$81)","v":""},{"$f":"IF('Tx236'!$C$67=\"\",\"\",'Tx236'!$C$67)","v":"Total Percent Passing, %"},{"$f":"IF('Tx236'!$I$69=\"\",\"\",'Tx236'!$I$69)","v":"Ignited Sample 5"}]
[172,{"$f":"IF('Tx236'!$J$81=\"\",\"\",'Tx236'!$J$81)","v":""},{"$f":"IF('Tx236'!$B$66=\"\",\"\",'Tx236'!$B$66)","v":"AGGREGATE GRADATION CORRECTION FACTOR CALCULATIONS"},{"$f":"IF('Tx236'!$B$69=\"\",\"\",'Tx236'!$B$69)","v":"Sieve Size"},{"$f":"IF('Tx236'!$B$81=\"\",\"\",'Tx236'!$B$81)","v":""},{"$f":"IF('Tx236'!$C$67=\"\",\"\",'Tx236'!$C$67)","v":"Total Percent Passing, %"},{"$f":"IF('Tx236'!$J$69=\"\",\"\",'Tx236'!$J$69)","v":"Ignited Sample 6"}]
[173,{"$f":"IF('Tx236'!$K$81=\"\",\"\",'Tx236'!$K$81)","v":""},{"$f":"IF('Tx236'!$B$66=\"\",\"\",'Tx236'!$B$66)","v":"AGGREGATE GRADATION CORRECTION FACTOR CALCULATIONS"},{"$f":"IF('Tx236'!$B$69=\"\",\"\",'Tx236'!$B$69)","v":"Sieve Size"},{"$f":"IF('Tx236'!$B$81=\"\",\"\",'Tx236'!$B$81)","v":""},{"$f":"IF('Tx236'!$K$69=\"\",\"\",'Tx236'!$K$69)","v":"Correction Factor"}]
[174,{"$f":"IF('Tx236'!$C$82=\"\",\"\",'Tx236'!$C$82)","v":""},{"$f":"IF('Tx236'!$B$66=\"\",\"\",'Tx236'!$B$66)","v":"AGGREGATE GRADATION CORRECTION FACTOR CALCULATIONS"},{"$f":"IF('Tx236'!$B$69=\"\",\"\",'Tx236'!$B$69)","v":"Sieve Size"},{"$f":"IF('Tx236'!$B$82=\"\",\"\",'Tx236'!$B$82)","v":""},{"$f":"IF('Tx236'!$C$67=\"\",\"\",'Tx236'!$C$67)","v":"Total Percent Passing, %"},{"$f":"IF('Tx236'!$C$69=\"\",\"\",'Tx236'!$C$69)","v":"Combined Gradation"}]
[175,{"$f":"IF('Tx236'!$E$82=\"\",\"\",'Tx236'!$E$82)","v":""},{"$f":"IF('Tx236'!$B$66=\"\",\"\",'Tx236'!$B$66)","v":"AGGREGATE GRADATION CORRECTION FACTOR CALCULATIONS"},{"$f":"IF('Tx236'!$B$69=\"\",\"\",'Tx236'!$B$69)","v":"Sieve Size"},{"$f":"IF('Tx236'!$B$82=\"\",\"\",'Tx236'!$B$82)","v":""},{"$f":"IF('Tx236'!$C$67=\"\",\"\",'Tx236'!$C$67)","v":"Total Percent Passing, %"},{"$f":"IF('Tx236'!$E$69=\"\",\"\",'Tx236'!$E$69)","v":"Ignited Sample 1"}]
[176,{"$f":"IF('Tx236'!$F$82=\"\",\"\",'Tx236'!$F$82)","v":""},{"$f":"IF('Tx236'!$B$66=\"\",\"\",'Tx236'!$B$66)","v":"AGGREGATE GRADATION CORRECTION FACTOR CALCULATIONS"},{"$f":"IF('Tx236'!$B$69=\"\",\"\",'Tx236'!$B$69)","v":"Sieve Size"},{"$f":"IF('Tx236'!$B$82=\"\",\"\",'Tx236'!$B$82)","v":""},{"$f":"IF('Tx236'!$C$67=\"\",\"\",'Tx236'!$C$67)","v":"Total Percent Passing, %"},{"$f":"IF('Tx236'!$F$69=\"\",\"\",'Tx236'!$F$69)","v":"Ignited Sample 2"}]
[177,{"$f":"IF('Tx236'!$G$82=\"\",\"\",'Tx236'!$G$82)","v":""},{"$f":"IF('Tx236'!$B$66=\"\",\"\",'Tx236'!$B$66)","v":"AGGREGATE GRADATION CORRECTION FACTOR CALCULATIONS"},{"$f":"IF('Tx236'!$B$69=\"\",\"\",'Tx236'!$B$69)","v":"Sieve Size"},{"$f":"IF('Tx236'!$B$82=\"\",\"\",'Tx236'!$B$82)","v":""},{"$f":"IF('Tx236'!$C$67=\"\",\"\",'Tx236'!$C$67)","v":"Total Percent Passing, %"},{"$f":"IF('Tx236'!$G$69=\"\",\"\",'Tx236'!$G$69)","v":"Ignited Sample 1"}]
[178,{"$f":"IF('Tx236'!$H$82=\"\",\"\",'Tx236'!$H$82)","v":""},{"$f":"IF('Tx236'!$B$66=\"\",\"\",'Tx236'!$B$66)","v":"AGGREGATE GRADATION CORRECTION FACTOR CALCULATIONS"},{"$f":"IF('Tx236'!$B$69=\"\",\"\",'Tx236'!$B$69)","v":"Sieve Size"},{"$f":"IF('Tx236'!$B$82=\"\",\"\",'Tx236'!$B$82)","v":""},{"$f":"IF('Tx236'!$C$67=\"\",\"\",'Tx236'!$C$67)","v":"Total Percent Passing, %"},{"$f":"IF('Tx236'!$H$69=\"\",\"\",'Tx236'!$H$69)","v":"Ignited Sample 2"}]
[179,{"$f":"IF('Tx236'!$I$82=\"\",\"\",'Tx236'!$I$82)","v":""},{"$f":"IF('Tx236'!$B$66=\"\",\"\",'Tx236'!$B$66)","v":"AGGREGATE GRADATION CORRECTION FACTOR CALCULATIONS"},{"$f":"IF('Tx236'!$B$69=\"\",\"\",'Tx236'!$B$69)","v":"Sieve Size"},{"$f":"IF('Tx236'!$B$82=\"\",\"\",'Tx236'!$B$82)","v":""},{"$f":"IF('Tx236'!$C$67=\"\",\"\",'Tx236'!$C$67)","v":"Total Percent Passing, %"},{"$f":"IF('Tx236'!$I$69=\"\",\"\",'Tx236'!$I$69)","v":"Ignited Sample 5"}]
[180,{"$f":"IF('Tx236'!$J$82=\"\",\"\",'Tx236'!$J$82)","v":""},{"$f":"IF('Tx236'!$B$66=\"\",\"\",'Tx236'!$B$66)","v":"AGGREGATE GRADATION CORRECTION FACTOR CALCULATIONS"},{"$f":"IF('Tx236'!$B$69=\"\",\"\",'Tx236'!$B$69)","v":"Sieve Size"},{"$f":"IF('Tx236'!$B$82=\"\",\"\",'Tx236'!$B$82)","v":""},{"$f":"IF('Tx236'!$C$67=\"\",\"\",'Tx236'!$C$67)","v":"Total Percent Passing, %"},{"$f":"IF('Tx236'!$J$69=\"\",\"\",'Tx236'!$J$69)","v":"Ignited Sample 6"}]
[181,{"$f":"IF('Tx236'!$K$82=\"\",\"\",'Tx236'!$K$82)","v":""},{"$f":"IF('Tx236'!$B$66=\"\",\"\",'Tx236'!$B$66)","v":"AGGREGATE GRADATION CORRECTION FACTOR CALCULATIONS"},{"$f":"IF('Tx236'!$B$69=\"\",\"\",'Tx236'!$B$69)","v":"Sieve Size"},{"$f":"IF('Tx236'!$B$82=\"\",\"\",'Tx236'!$B$82)","v":""},{"$f":"IF('Tx236'!$K$69=\"\",\"\",'Tx236'!$K$69)","v":"Correction Factor"}]
[182,{"$f":"IF('Tx236'!$E$86=\"\",\"\",'Tx236'!$E$86)","v":""},{"$f":"IF('Tx236'!$B$66=\"\",\"\",'Tx236'!$B$66)","v":"AGGREGATE GRADATION CORRECTION FACTOR CALCULATIONS"},{"$f":"IF('Tx236'!$B$86=\"\",\"\",'Tx236'!$B$86)","v":"Target AC %"},{"$f":"IF('Tx236'!$C$67=\"\",\"\",'Tx236'!$C$67)","v":"Total Percent Passing, %"},{"$f":"IF('Tx236'!$E$69=\"\",\"\",'Tx236'!$E$69)","v":"Ignited Sample 1"}]
[183,{"$f":"IF('Tx236'!$F$86=\"\",\"\",'Tx236'!$F$86)","v":""},{"$f":"IF('Tx236'!$B$66=\"\",\"\",'Tx236'!$B$66)","v":"AGGREGATE GRADATION CORRECTION FACTOR CALCULATIONS"},{"$f":"IF('Tx236'!$B$86=\"\",\"\",'Tx236'!$B$86)","v":"Target AC %"},{"$f":"IF('Tx236'!$C$67=\"\",\"\",'Tx236'!$C$67)","v":"Total Percent Passing, %"},{"$f":"IF('Tx236'!$F$69=\"\",\"\",'Tx236'!$F$69)","v":"Ignited Sample 2"}]
[184,{"$f":"IF('Tx236'!$G$86=\"\",\"\",'Tx236'!$G$86)","v":""},{"$f":"IF('Tx236'!$B$66=\"\",\"\",'Tx236'!$B$66)","v":"AGGREGATE GRADATION CORRECTION FACTOR CALCULATIONS"},{"$f":"IF('Tx236'!$B$86=\"\",\"\",'Tx236'!$B$86)","v":"Target AC %"},{"$f":"IF('Tx236'!$C$67=\"\",\"\",'Tx236'!$C$67)","v":"Total Percent Passing, %"},{"$f":"IF('Tx236'!$G$69=\"\",\"\",'Tx236'!$G$69)","v":"Ignited Sample 1"}]
[185,{"$f":"IF('Tx236'!$H$86=\"\",\"\",'Tx236'!$H$86)","v":""},{"$f":"IF('Tx236'!$B$66=\"\",\"\",'Tx236'!$B$66)","v":"AGGREGATE GRADATION CORRECTION FACTOR CALCULATIONS"},{"$f":"IF('Tx236'!$B$86=\"\",\"\",'Tx236'!$B$86)","v":"Target AC %"},{"$f":"IF('Tx236'!$C$67=\"\",\"\",'Tx236'!$C$67)","v":"Total Percent Passing, %"},{"$f":"IF('Tx236'!$H$69=\"\",\"\",'Tx236'!$H$69)","v":"Ignited Sample 2"}]
[186,{"$f":"IF('Tx236'!$I$86=\"\",\"\",'Tx236'!$I$86)","v":""},{"$f":"IF('Tx236'!$B$66=\"\",\"\",'Tx236'!$B$66)","v":"AGGREGATE GRADATION CORRECTION FACTOR CALCULATIONS"},{"$f":"IF('Tx236'!$B$86=\"\",\"\",'Tx236'!$B$86)","v":"Target AC %"},{"$f":"IF('Tx236'!$C$67=\"\",\"\",'Tx236'!$C$67)","v":"Total Percent Passing, %"},{"$f":"IF('Tx236'!$I$69=\"\",\"\",'Tx236'!$I$69)","v":"Ignited Sample 5"}]
[187,{"$f":"IF('Tx236'!$J$86=\"\",\"\",'Tx236'!$J$86)","v":""},{"$f":"IF('Tx236'!$B$66=\"\",\"\",'Tx236'!$B$66)","v":"AGGREGATE GRADATION CORRECTION FACTOR CALCULATIONS"},{"$f":"IF('Tx236'!$B$86=\"\",\"\",'Tx236'!$B$86)","v":"Target AC %"},{"$f":"IF('Tx236'!$C$67=\"\",\"\",'Tx236'!$C$67)","v":"Total Percent Passing, %"},{"$f":"IF('Tx236'!$J$69=\"\",\"\",'Tx236'!$J$69)","v":"Ignited Sample 6"}]
[188,{"$f":"IF('Tx236'!$E$87=\"\",\"\",'Tx236'!$E$87)","v":""},{"$f":"IF('Tx236'!$B$66=\"\",\"\",'Tx236'!$B$66)","v":"AGGREGATE GRADATION CORRECTION FACTOR CALCULATIONS"},{"$f":"IF('Tx236'!$B$87=\"\",\"\",'Tx236'!$B$87)","v":"Measured AC %"},{"$f":"IF('Tx236'!$C$67=\"\",\"\",'Tx236'!$C$67)","v":"Total Percent Passing, %"},{"$f":"IF('Tx236'!$E$69=\"\",\"\",'Tx236'!$E$69)","v":"Ignited Sample 1"}]
[189,{"$f":"IF('Tx236'!$F$87=\"\",\"\",'Tx236'!$F$87)","v":""},{"$f":"IF('Tx236'!$B$66=\"\",\"\",'Tx236'!$B$66)","v":"AGGREGATE GRADATION CORRECTION FACTOR CALCULATIONS"},{"$f":"IF('Tx236'!$B$87=\"\",\"\",'Tx236'!$B$87)","v":"Measured AC %"},{"$f":"IF('Tx236'!$C$67=\"\",\"\",'Tx236'!$C$67)","v":"Total Percent Passing, %"},{"$f":"IF('Tx236'!$F$69=\"\",\"\",'Tx236'!$F$69)","v":"Ignited Sample 2"}]
[190,{"$f":"IF('Tx236'!$G$87=\"\",\"\",'Tx236'!$G$87)","v":""},{"$f":"IF('Tx236'!$B$66=\"\",\"\",'Tx236'!$B$66)","v":"AGGREGATE GRADATION CORRECTION FACTOR CALCULATIONS"},{"$f":"IF('Tx236'!$B$87=\"\",\"\",'Tx236'!$B$87)","v":"Measured AC %"},{"$f":"IF('Tx236'!$C$67=\"\",\"\",'Tx236'!$C$67)","v":"Total Percent Passing, %"},{"$f":"IF('Tx236'!$G$69=\"\",\"\",'Tx236'!$G$69)","v":"Ignited Sample 1"}]
[191,{"$f":"IF('Tx236'!$H$87=\"\",\"\",'Tx236'!$H$87)","v":""},{"$f":"IF('Tx236'!$B$66=\"\",\"\",'Tx236'!$B$66)","v":"AGGREGATE GRADATION CORRECTION FACTOR CALCULATIONS"},{"$f":"IF('Tx236'!$B$87=\"\",\"\",'Tx236'!$B$87)","v":"Measured AC %"},{"$f":"IF('Tx236'!$C$67=\"\",\"\",'Tx236'!$C$67)","v":"Total Percent Passing, %"},{"$f":"IF('Tx236'!$H$69=\"\",\"\",'Tx236'!$H$69)","v":"Ignited Sample 2"}]
[192,{"$f":"IF('Tx236'!$I$87=\"\",\"\",'Tx236'!$I$87)","v":""},{"$f":"IF('Tx236'!$B$66=\"\",\"\",'Tx236'!$B$66)","v":"AGGREGATE GRADATION CORRECTION FACTOR CALCULATIONS"},{"$f":"IF('Tx236'!$B$87=\"\",\"\",'Tx236'!$B$87)","v":"Measured AC %"},{"$f":"IF('Tx236'!$C$67=\"\",\"\",'Tx236'!$C$67)","v":"Total Percent Passing, %"},{"$f":"IF('Tx236'!$I$69=\"\",\"\",'Tx236'!$I$69)","v":"Ignited Sample 5"}]
[193,{"$f":"IF('Tx236'!$J$87=\"\",\"\",'Tx236'!$J$87)","v":""},{"$f":"IF('Tx236'!$B$66=\"\",\"\",'Tx236'!$B$66)","v":"AGGREGATE GRADATION CORRECTION FACTOR CALCULATIONS"},{"$f":"IF('Tx236'!$B$87=\"\",\"\",'Tx236'!$B$87)","v":"Measured AC %"},{"$f":"IF('Tx236'!$C$67=\"\",\"\",'Tx236'!$C$67)","v":"Total Percent Passing, %"},{"$f":"IF('Tx236'!$J$69=\"\",\"\",'Tx236'!$J$69)","v":"Ignited Sample 6"}]
[194,{"$f":"IF('Tx236'!$K$87=\"\",\"\",'Tx236'!$K$87)","v":""},{"$f":"IF('Tx236'!$B$66=\"\",\"\",'Tx236'!$B$66)","v":"AGGREGATE GRADATION CORRECTION FACTOR CALCULATIONS"},{"$f":"IF('Tx236'!$K$85=\"\",\"\",'Tx236'!$K$85)","v":"AVG Difference Target-Measured"}]
[195,{"$f":"IF('Tx236'!$E$29=\"\",\"\",'Tx236'!$E$29)","v":""},{"$f":"IF('Tx236'!$B$21=\"\",\"\",'Tx236'!$B$21)","v":"SIEVE ANALYSIS WORKSHEET FOR CALIBRATION SAMPLES"},{"$f":"IF('Tx236'!$B$69=\"\",\"\",'Tx236'!$B$69)","v":"Sieve Size"},{"$f":"IF('Tx236'!$B$72=\"\",\"\",'Tx236'!$B$72)","v":""},{"$f":"IF('Tx236'!$E$24=\"\",\"\",'Tx236'!$E$24)","v":"Blank  Sample 2"},{"$f":"IF('Tx236'!$E$24=\"\",\"\",'Tx236'!$D$28)","v":"Individual Weight Retained"}]
[196,{"$f":"IF('Tx236'!$E$30=\"\",\"\",'Tx236'!$E$30)","v":""},{"$f":"IF('Tx236'!$B$21=\"\",\"\",'Tx236'!$B$21)","v":"SIEVE ANALYSIS WORKSHEET FOR CALIBRATION SAMPLES"},{"$f":"IF('Tx236'!$B$69=\"\",\"\",'Tx236'!$B$69)","v":"Sieve Size"},{"$f":"IF('Tx236'!$B$73=\"\",\"\",'Tx236'!$B$73)","v":""},{"$f":"IF('Tx236'!$E$24=\"\",\"\",'Tx236'!$E$24)","v":"Blank  Sample 2"},{"$f":"IF('Tx236'!$E$24=\"\",\"\",'Tx236'!$D$28)","v":"Individual Weight Retained"}]
[197,{"$f":"IF('Tx236'!$E$31=\"\",\"\",'Tx236'!$E$31)","v":""},{"$f":"IF('Tx236'!$B$21=\"\",\"\",'Tx236'!$B$21)","v":"SIEVE ANALYSIS WORKSHEET FOR CALIBRATION SAMPLES"},{"$f":"IF('Tx236'!$B$69=\"\",\"\",'Tx236'!$B$69)","v":"Sieve Size"},{"$f":"IF('Tx236'!$B$74=\"\",\"\",'Tx236'!$B$74)","v":""},{"$f":"IF('Tx236'!$E$24=\"\",\"\",'Tx236'!$E$24)","v":"Blank  Sample 2"},{"$f":"IF('Tx236'!$E$24=\"\",\"\",'Tx236'!$D$28)","v":"Individual Weight Retained"}]
[198,{"$f":"IF('Tx236'!$E$32=\"\",\"\",'Tx236'!$E$32)","v":""},{"$f":"IF('Tx236'!$B$21=\"\",\"\",'Tx236'!$B$21)","v":"SIEVE ANALYSIS WORKSHEET FOR CALIBRATION SAMPLES"},{"$f":"IF('Tx236'!$B$69=\"\",\"\",'Tx236'!$B$69)","v":"Sieve Size"},{"$f":"IF('Tx236'!$B$75=\"\",\"\",'Tx236'!$B$75)","v":""},{"$f":"IF('Tx236'!$E$24=\"\",\"\",'Tx236'!$E$24)","v":"Blank  Sample 2"},{"$f":"IF('Tx236'!$E$24=\"\",\"\",'Tx236'!$D$28)","v":"Individual Weight Retained"}]
[199,{"$f":"IF('Tx236'!$E$33=\"\",\"\",'Tx236'!$E$33)","v":""},{"$f":"IF('Tx236'!$B$21=\"\",\"\",'Tx236'!$B$21)","v":"SIEVE ANALYSIS WORKSHEET FOR CALIBRATION SAMPLES"},{"$f":"IF('Tx236'!$B$69=\"\",\"\",'Tx236'!$B$69)","v":"Sieve Size"},{"$f":"IF('Tx236'!$B$76=\"\",\"\",'Tx236'!$B$76)","v":""},{"$f":"IF('Tx236'!$E$24=\"\",\"\",'Tx236'!$E$24)","v":"Blank  Sample 2"},{"$f":"IF('Tx236'!$E$24=\"\",\"\",'Tx236'!$D$28)","v":"Individual Weight Retained"}]
[200,{"$f":"IF('Tx236'!$E$34=\"\",\"\",'Tx236'!$E$34)","v":""},{"$f":"IF('Tx236'!$B$21=\"\",\"\",'Tx236'!$B$21)","v":"SIEVE ANALYSIS WORKSHEET FOR CALIBRATION SAMPLES"},{"$f":"IF('Tx236'!$B$69=\"\",\"\",'Tx236'!$B$69)","v":"Sieve Size"},{"$f":"IF('Tx236'!$B$77=\"\",\"\",'Tx236'!$B$77)","v":""},{"$f":"IF('Tx236'!$E$24=\"\",\"\",'Tx236'!$E$24)","v":"Blank  Sample 2"},{"$f":"IF('Tx236'!$E$24=\"\",\"\",'Tx236'!$D$28)","v":"Individual Weight Retained"}]
[201,{"$f":"IF('Tx236'!$E$35=\"\",\"\",'Tx236'!$E$35)","v":""},{"$f":"IF('Tx236'!$B$21=\"\",\"\",'Tx236'!$B$21)","v":"SIEVE ANALYSIS WORKSHEET FOR CALIBRATION SAMPLES"},{"$f":"IF('Tx236'!$B$69=\"\",\"\",'Tx236'!$B$69)","v":"Sieve Size"},{"$f":"IF('Tx236'!$B$78=\"\",\"\",'Tx236'!$B$78)","v":""},{"$f":"IF('Tx236'!$E$24=\"\",\"\",'Tx236'!$E$24)","v":"Blank  Sample 2"},{"$f":"IF('Tx236'!$E$24=\"\",\"\",'Tx236'!$D$28)","v":"Individual Weight Retained"}]
[202,{"$f":"IF('Tx236'!$E$36=\"\",\"\",'Tx236'!$E$36)","v":""},{"$f":"IF('Tx236'!$B$21=\"\",\"\",'Tx236'!$B$21)","v":"SIEVE ANALYSIS WORKSHEET FOR CALIBRATION SAMPLES"},{"$f":"IF('Tx236'!$B$69=\"\",\"\",'Tx236'!$B$69)","v":"Sieve Size"},{"$f":"IF('Tx236'!$B$79=\"\",\"\",'Tx236'!$B$79)","v":""},{"$f":"IF('Tx236'!$E$24=\"\",\"\",'Tx236'!$E$24)","v":"Blank  Sample 2"},{"$f":"IF('Tx236'!$E$24=\"\",\"\",'Tx236'!$D$28)","v":"Individual Weight Retained"}]
[203,{"$f":"IF('Tx236'!$E$37=\"\",\"\",'Tx236'!$E$37)","v":""},{"$f":"IF('Tx236'!$B$21=\"\",\"\",'Tx236'!$B$21)","v":"SIEVE ANALYSIS WORKSHEET FOR CALIBRATION SAMPLES"},{"$f":"IF('Tx236'!$B$69=\"\",\"\",'Tx236'!$B$69)","v":"Sieve Size"},{"$f":"IF('Tx236'!$B$80=\"\",\"\",'Tx236'!$B$80)","v":""},{"$f":"IF('Tx236'!$E$24=\"\",\"\",'Tx236'!$E$24)","v":"Blank  Sample 2"},{"$f":"IF('Tx236'!$E$24=\"\",\"\",'Tx236'!$D$28)","v":"Individual Weight Retained"}]
[204,{"$f":"IF('Tx236'!$E$38=\"\",\"\",'Tx236'!$E$38)","v":""},{"$f":"IF('Tx236'!$B$21=\"\",\"\",'Tx236'!$B$21)","v":"SIEVE ANALYSIS WORKSHEET FOR CALIBRATION SAMPLES"},{"$f":"IF('Tx236'!$B$69=\"\",\"\",'Tx236'!$B$69)","v":"Sieve Size"},{"$f":"IF('Tx236'!$B$81=\"\",\"\",'Tx236'!$B$81)","v":""},{"$f":"IF('Tx236'!$E$24=\"\",\"\",'Tx236'!$E$24)","v":"Blank  Sample 2"},{"$f":"IF('Tx236'!$E$24=\"\",\"\",'Tx236'!$D$28)","v":"Individual Weight Retained"}]
[205,{"$f":"IF('Tx236'!$E$39=\"\",\"\",'Tx236'!$E$39)","v":""},{"$f":"IF('Tx236'!$B$21=\"\",\"\",'Tx236'!$B$21)","v":"SIEVE ANALYSIS WORKSHEET FOR CALIBRATION SAMPLES"},{"$f":"IF('Tx236'!$B$69=\"\",\"\",'Tx236'!$B$69)","v":"Sieve Size"},{"$f":"IF('Tx236'!$B$82=\"\",\"\",'Tx236'!$B$82)","v":""},{"$f":"IF('Tx236'!$E$24=\"\",\"\",'Tx236'!$E$24)","v":"Blank  Sample 2"},{"$f":"IF('Tx236'!$E$24=\"\",\"\",'Tx236'!$D$28)","v":"Individual Weight Retained"}]
[206,{"$f":"IF('Tx236'!$D$29=\"\",\"\",'Tx236'!$D$29)","v":""},{"$f":"IF('Tx236'!$B$21=\"\",\"\",'Tx236'!$B$21)","v":"SIEVE ANALYSIS WORKSHEET FOR CALIBRATION SAMPLES"},{"$f":"IF('Tx236'!$B$69=\"\",\"\",'Tx236'!$B$69)","v":"Sieve Size"},{"$f":"IF('Tx236'!$B$72=\"\",\"\",'Tx236'!$B$72)","v":""},{"$f":"IF('Tx236'!$D$24=\"\",\"\",'Tx236'!$D$24)","v":"Blank Sample"},{"$f":"IF('Tx236'!$E$24=\"\",\"\",'Tx236'!$D$28)","v":"Individual Weight Retained"}]
[207,{"$f":"IF('Tx236'!$D$30=\"\",\"\",'Tx236'!$D$30)","v":""},{"$f":"IF('Tx236'!$B$21=\"\",\"\",'Tx236'!$B$21)","v":"SIEVE ANALYSIS WORKSHEET FOR CALIBRATION SAMPLES"},{"$f":"IF('Tx236'!$B$69=\"\",\"\",'Tx236'!$B$69)","v":"Sieve Size"},{"$f":"IF('Tx236'!$B$73=\"\",\"\",'Tx236'!$B$73)","v":""},{"$f":"IF('Tx236'!$D$24=\"\",\"\",'Tx236'!$D$24)","v":"Blank Sample"},{"$f":"IF('Tx236'!$E$24=\"\",\"\",'Tx236'!$D$28)","v":"Individual Weight Retained"}]
[208,{"$f":"IF('Tx236'!$D$31=\"\",\"\",'Tx236'!$D$31)","v":""},{"$f":"IF('Tx236'!$B$21=\"\",\"\",'Tx236'!$B$21)","v":"SIEVE ANALYSIS WORKSHEET FOR CALIBRATION SAMPLES"},{"$f":"IF('Tx236'!$B$69=\"\",\"\",'Tx236'!$B$69)","v":"Sieve Size"},{"$f":"IF('Tx236'!$B$74=\"\",\"\",'Tx236'!$B$74)","v":""},{"$f":"IF('Tx236'!$D$24=\"\",\"\",'Tx236'!$D$24)","v":"Blank Sample"},{"$f":"IF('Tx236'!$E$24=\"\",\"\",'Tx236'!$D$28)","v":"Individual Weight Retained"}]
[209,{"$f":"IF('Tx236'!$D$32=\"\",\"\",'Tx236'!$D$32)","v":""},{"$f":"IF('Tx236'!$B$21=\"\",\"\",'Tx236'!$B$21)","v":"SIEVE ANALYSIS WORKSHEET FOR CALIBRATION SAMPLES"},{"$f":"IF('Tx236'!$B$69=\"\",\"\",'Tx236'!$B$69)","v":"Sieve Size"},{"$f":"IF('Tx236'!$B$75=\"\",\"\",'Tx236'!$B$75)","v":""},{"$f":"IF('Tx236'!$D$24=\"\",\"\",'Tx236'!$D$24)","v":"Blank Sample"},{"$f":"IF('Tx236'!$E$24=\"\",\"\",'Tx236'!$D$28)","v":"Individual Weight Retained"}]
[210,{"$f":"IF('Tx236'!$D$33=\"\",\"\",'Tx236'!$D$33)","v":""},{"$f":"IF('Tx236'!$B$21=\"\",\"\",'Tx236'!$B$21)","v":"SIEVE ANALYSIS WORKSHEET FOR CALIBRATION SAMPLES"},{"$f":"IF('Tx236'!$B$69=\"\",\"\",'Tx236'!$B$69)","v":"Sieve Size"},{"$f":"IF('Tx236'!$B$76=\"\",\"\",'Tx236'!$B$76)","v":""},{"$f":"IF('Tx236'!$D$24=\"\",\"\",'Tx236'!$D$24)","v":"Blank Sample"},{"$f":"IF('Tx236'!$E$24=\"\",\"\",'Tx236'!$D$28)","v":"Individual Weight Retained"}]
[211,{"$f":"IF('Tx236'!$D$34=\"\",\"\",'Tx236'!$D$34)","v":""},{"$f":"IF('Tx236'!$B$21=\"\",\"\",'Tx236'!$B$21)","v":"SIEVE ANALYSIS WORKSHEET FOR CALIBRATION SAMPLES"},{"$f":"IF('Tx236'!$B$69=\"\",\"\",'Tx236'!$B$69)","v":"Sieve Size"},{"$f":"IF('Tx236'!$B$77=\"\",\"\",'Tx236'!$B$77)","v":""},{"$f":"IF('Tx236'!$D$24=\"\",\"\",'Tx236'!$D$24)","v":"Blank Sample"},{"$f":"IF('Tx236'!$E$24=\"\",\"\",'Tx236'!$D$28)","v":"Individual Weight Retained"}]
[212,{"$f":"IF('Tx236'!$D$35=\"\",\"\",'Tx236'!$D$35)","v":""},{"$f":"IF('Tx236'!$B$21=\"\",\"\",'Tx236'!$B$21)","v":"SIEVE ANALYSIS WORKSHEET FOR CALIBRATION SAMPLES"},{"$f":"IF('Tx236'!$B$69=\"\",\"\",'Tx236'!$B$69)","v":"Sieve Size"},{"$f":"IF('Tx236'!$B$78=\"\",\"\",'Tx236'!$B$78)","v":""},{"$f":"IF('Tx236'!$D$24=\"\",\"\",'Tx236'!$D$24)","v":"Blank Sample"},{"$f":"IF('Tx236'!$E$24=\"\",\"\",'Tx236'!$D$28)","v":"Individual Weight Retained"}]
[213,{"$f":"IF('Tx236'!$D$36=\"\",\"\",'Tx236'!$D$36)","v":""},{"$f":"IF('Tx236'!$B$21=\"\",\"\",'Tx236'!$B$21)","v":"SIEVE ANALYSIS WORKSHEET FOR CALIBRATION SAMPLES"},{"$f":"IF('Tx236'!$B$69=\"\",\"\",'Tx236'!$B$69)","v":"Sieve Size"},{"$f":"IF('Tx236'!$B$79=\"\",\"\",'Tx236'!$B$79)","v":""},{"$f":"IF('Tx236'!$D$24=\"\",\"\",'Tx236'!$D$24)","v":"Blank Sample"},{"$f":"IF('Tx236'!$E$24=\"\",\"\",'Tx236'!$D$28)","v":"Individual Weight Retained"}]
[214,{"$f":"IF('Tx236'!$D$37=\"\",\"\",'Tx236'!$D$37)","v":""},{"$f":"IF('Tx236'!$B$21=\"\",\"\",'Tx236'!$B$21)","v":"SIEVE ANALYSIS WORKSHEET FOR CALIBRATION SAMPLES"},{"$f":"IF('Tx236'!$B$69=\"\",\"\",'Tx236'!$B$69)","v":"Sieve Size"},{"$f":"IF('Tx236'!$B$80=\"\",\"\",'Tx236'!$B$80)","v":""},{"$f":"IF('Tx236'!$D$24=\"\",\"\",'Tx236'!$D$24)","v":"Blank Sample"},{"$f":"IF('Tx236'!$E$24=\"\",\"\",'Tx236'!$D$28)","v":"Individual Weight Retained"}]
[215,{"$f":"IF('Tx236'!$D$38=\"\",\"\",'Tx236'!$D$38)","v":""},{"$f":"IF('Tx236'!$B$21=\"\",\"\",'Tx236'!$B$21)","v":"SIEVE ANALYSIS WORKSHEET FOR CALIBRATION SAMPLES"},{"$f":"IF('Tx236'!$B$69=\"\",\"\",'Tx236'!$B$69)","v":"Sieve Size"},{"$f":"IF('Tx236'!$B$81=\"\",\"\",'Tx236'!$B$81)","v":""},{"$f":"IF('Tx236'!$D$24=\"\",\"\",'Tx236'!$D$24)","v":"Blank Sample"},{"$f":"IF('Tx236'!$E$24=\"\",\"\",'Tx236'!$D$28)","v":"Individual Weight Retained"}]
[216,{"$f":"IF('Tx236'!$D$39=\"\",\"\",'Tx236'!$D$39)","v":""},{"$f":"IF('Tx236'!$B$21=\"\",\"\",'Tx236'!$B$21)","v":"SIEVE ANALYSIS WORKSHEET FOR CALIBRATION SAMPLES"},{"$f":"IF('Tx236'!$B$69=\"\",\"\",'Tx236'!$B$69)","v":"Sieve Size"},{"$f":"IF('Tx236'!$B$82=\"\",\"\",'Tx236'!$B$82)","v":""},{"$f":"IF('Tx236'!$D$24=\"\",\"\",'Tx236'!$D$24)","v":"Blank Sample"},{"$f":"IF('Tx236'!$E$24=\"\",\"\",'Tx236'!$D$28)","v":"Individual Weight Retained"}]
[217,{"$f":"IF('Tx236'!$D$22=\"\",\"\",'Tx236'!$D$22)","v":""},{"$f":"IF('Tx236'!$B$21=\"\",\"\",'Tx236'!$B$21)","v":"SIEVE ANALYSIS WORKSHEET FOR CALIBRATION SAMPLES"},{"$f":"IF('Tx236'!$B$22=\"\",\"\",'Tx236'!$B$22)","v":"Original Sample Weight:"},{"$f":"IF('Tx236'!$D$24=\"\",\"\",'Tx236'!$D$24)","v":"Blank Sample"}]
[218,{"$f":"IF('Tx236'!$E$22=\"\",\"\",'Tx236'!$E$22)","v":""},{"$f":"IF('Tx236'!$B$21=\"\",\"\",'Tx236'!$B$21)","v":"SIEVE ANALYSIS WORKSHEET FOR CALIBRATION SAMPLES"},{"$f":"IF('Tx236'!$B$22=\"\",\"\",'Tx236'!$B$22)","v":"Original Sample Weight:"},{"$f":"IF('Tx236'!$E$24=\"\",\"\",'Tx236'!$E$24)","v":"Blank  Sample 2"}]
[219,{"$f":"IF('Tx236'!$D$40=\"\",\"\",'Tx236'!$D$40)","v":""},{"$f":"IF('Tx236'!$B$21=\"\",\"\",'Tx236'!$B$21)","v":"SIEVE ANALYSIS WORKSHEET FOR CALIBRATION SAMPLES"},{"$f":"IF('Tx236'!$B$69=\"\",\"\",'Tx236'!$B$69)","v":"Sieve Size"},{"$f":"IF('Tx236'!$B$40=\"\",\"\",'Tx236'!$B$40)","v":"PAN"},{"$f":"IF('Tx236'!$D$24=\"\",\"\",'Tx236'!$D$24)","v":"Blank Sample"},{"$f":"IF('Tx236'!$D$28=\"\",\"\",'Tx236'!$D$28)","v":"Individual Weight Retained"}]
[220,{"$f":"IF('Tx236'!$E$40=\"\",\"\",'Tx236'!$E$40)","v":""},{"$f":"IF('Tx236'!$B$21=\"\",\"\",'Tx236'!$B$21)","v":"SIEVE ANALYSIS WORKSHEET FOR CALIBRATION SAMPLES"},{"$f":"IF('Tx236'!$B$69=\"\",\"\",'Tx236'!$B$69)","v":"Sieve Size"},{"$f":"IF('Tx236'!$B$40=\"\",\"\",'Tx236'!$B$40)","v":"PAN"},{"$f":"IF('Tx236'!$E$24=\"\",\"\",'Tx236'!$E$24)","v":"Blank  Sample 2"},{"$f":"IF('Tx236'!$D$28=\"\",\"\",'Tx236'!$D$28)","v":"Individual Weight Retained"}]
[221,{"$f":"IF('Tx236'!$C$48=\"\",\"\",'Tx236'!$C$48)","v":""},{"$f":"IF('Tx236'!$B$46=\"\",\"\",'Tx236'!$B$46)","v":"RECYCLED MATERIALS"},{"$f":"IF('Tx236'!$B$48=\"\",\"\",'Tx236'!$B$48)","v":"Material ID:"},{"$f":"IF('Tx236'!$C$47=\"\",\"\",'Tx236'!$C$47)","v":"Bin No.1"}]
[222,{"$f":"IF('Tx236'!$D$48=\"\",\"\",'Tx236'!$D$48)","v":""},{"$f":"IF('Tx236'!$B$46=\"\",\"\",'Tx236'!$B$46)","v":"RECYCLED MATERIALS"},{"$f":"IF('Tx236'!$B$48=\"\",\"\",'Tx236'!$B$48)","v":"Material ID:"},{"$f":"IF('Tx236'!$D$47=\"\",\"\",'Tx236'!$D$47)","v":"Bin No.2"}]
[223,{"$f":"IF('Tx236'!$E$48=\"\",\"\",'Tx236'!$E$48)","v":""},{"$f":"IF('Tx236'!$B$46=\"\",\"\",'Tx236'!$B$46)","v":"RECYCLED MATERIALS"},{"$f":"IF('Tx236'!$B$48=\"\",\"\",'Tx236'!$B$48)","v":"Material ID:"},{"$f":"IF('Tx236'!$E$47=\"\",\"\",'Tx236'!$E$47)","v":"Bin No.3"}]
[224,{"$f":"IF('Tx236'!$F$48=\"\",\"\",'Tx236'!$F$48)","v":""},{"$f":"IF('Tx236'!$B$46=\"\",\"\",'Tx236'!$B$46)","v":"RECYCLED MATERIALS"},{"$f":"IF('Tx236'!$B$48=\"\",\"\",'Tx236'!$B$48)","v":"Material ID:"},{"$f":"IF('Tx236'!$F$47=\"\",\"\",'Tx236'!$F$47)","v":"Bin No.4"}]
[225,{"$f":"IF('Tx236'!$G$48=\"\",\"\",'Tx236'!$G$48)","v":""},{"$f":"IF('Tx236'!$B$46=\"\",\"\",'Tx236'!$B$46)","v":"RECYCLED MATERIALS"},{"$f":"IF('Tx236'!$B$48=\"\",\"\",'Tx236'!$B$48)","v":"Material ID:"},{"$f":"IF('Tx236'!$G$47=\"\",\"\",'Tx236'!$G$47)","v":"Bin No.5"}]
[226,{"$f":"IF('Tx236'!$C$49=\"\",\"\",'Tx236'!$C$49)","v":""},{"$f":"IF('Tx236'!$B$46=\"\",\"\",'Tx236'!$B$46)","v":"RECYCLED MATERIALS"},{"$f":"IF('Tx236'!$B$49=\"\",\"\",'Tx236'!$B$49)","v":"Recycled Material Type:"},{"$f":"IF('Tx236'!$C$47=\"\",\"\",'Tx236'!$C$47)","v":"Bin No.1"}]
[227,{"$f":"IF('Tx236'!$D$49=\"\",\"\",'Tx236'!$D$49)","v":""},{"$f":"IF('Tx236'!$B$46=\"\",\"\",'Tx236'!$B$46)","v":"RECYCLED MATERIALS"},{"$f":"IF('Tx236'!$B$49=\"\",\"\",'Tx236'!$B$49)","v":"Recycled Material Type:"},{"$f":"IF('Tx236'!$D$47=\"\",\"\",'Tx236'!$D$47)","v":"Bin No.2"}]
[228,{"$f":"IF('Tx236'!$E$49=\"\",\"\",'Tx236'!$E$49)","v":""},{"$f":"IF('Tx236'!$B$46=\"\",\"\",'Tx236'!$B$46)","v":"RECYCLED MATERIALS"},{"$f":"IF('Tx236'!$B$49=\"\",\"\",'Tx236'!$B$49)","v":"Recycled Material Type:"},{"$f":"IF('Tx236'!$E$47=\"\",\"\",'Tx236'!$E$47)","v":"Bin No.3"}]
[229,{"$f":"IF('Tx236'!$F$49=\"\",\"\",'Tx236'!$F$49)","v":""},{"$f":"IF('Tx236'!$B$46=\"\",\"\",'Tx236'!$B$46)","v":"RECYCLED MATERIALS"},{"$f":"IF('Tx236'!$B$49=\"\",\"\",'Tx236'!$B$49)","v":"Recycled Material Type:"},{"$f":"IF('Tx236'!$F$47=\"\",\"\",'Tx236'!$F$47)","v":"Bin No.4"}]
[230,{"$f":"IF('Tx236'!$G$49=\"\",\"\",'Tx236'!$G$49)","v":""},{"$f":"IF('Tx236'!$B$46=\"\",\"\",'Tx236'!$B$46)","v":"RECYCLED MATERIALS"},{"$f":"IF('Tx236'!$B$49=\"\",\"\",'Tx236'!$B$49)","v":"Recycled Material Type:"},{"$f":"IF('Tx236'!$G$47=\"\",\"\",'Tx236'!$G$47)","v":"Bin No.5"}]
[231,{"$f":"IF('Tx236'!$C$50=\"\",\"\",'Tx236'!$C$50)","v":""},{"$f":"IF('Tx236'!$B$46=\"\",\"\",'Tx236'!$B$46)","v":"RECYCLED MATERIALS"},{"$f":"IF('Tx236'!$B$50=\"\",\"\",'Tx236'!$B$50)","v":"Asphalt %:"},{"$f":"IF('Tx236'!$C$47=\"\",\"\",'Tx236'!$C$47)","v":"Bin No.1"}]
[232,{"$f":"IF('Tx236'!$D$50=\"\",\"\",'Tx236'!$D$50)","v":""},{"$f":"IF('Tx236'!$B$46=\"\",\"\",'Tx236'!$B$46)","v":"RECYCLED MATERIALS"},{"$f":"IF('Tx236'!$B$50=\"\",\"\",'Tx236'!$B$50)","v":"Asphalt %:"},{"$f":"IF('Tx236'!$D$47=\"\",\"\",'Tx236'!$D$47)","v":"Bin No.2"}]
[233,{"$f":"IF('Tx236'!$E$50=\"\",\"\",'Tx236'!$E$50)","v":""},{"$f":"IF('Tx236'!$B$46=\"\",\"\",'Tx236'!$B$46)","v":"RECYCLED MATERIALS"},{"$f":"IF('Tx236'!$B$50=\"\",\"\",'Tx236'!$B$50)","v":"Asphalt %:"},{"$f":"IF('Tx236'!$E$47=\"\",\"\",'Tx236'!$E$47)","v":"Bin No.3"}]
[234,{"$f":"IF('Tx236'!$F$50=\"\",\"\",'Tx236'!$F$50)","v":""},{"$f":"IF('Tx236'!$B$46=\"\",\"\",'Tx236'!$B$46)","v":"RECYCLED MATERIALS"},{"$f":"IF('Tx236'!$B$50=\"\",\"\",'Tx236'!$B$50)","v":"Asphalt %:"},{"$f":"IF('Tx236'!$F$47=\"\",\"\",'Tx236'!$F$47)","v":"Bin No.4"}]
[235,{"$f":"IF('Tx236'!$G$50=\"\",\"\",'Tx236'!$G$50)","v":""},{"$f":"IF('Tx236'!$B$46=\"\",\"\",'Tx236'!$B$46)","v":"RECYCLED MATERIALS"},{"$f":"IF('Tx236'!$B$50=\"\",\"\",'Tx236'!$B$50)","v":"Asphalt %:"},{"$f":"IF('Tx236'!$G$47=\"\",\"\",'Tx236'!$G$47)","v":"Bin No.5"}]
[236,{"$f":"IF('Tx236'!$C$51=\"\",\"\",'Tx236'!$C$51)","v":""},{"$f":"IF('Tx236'!$B$46=\"\",\"\",'Tx236'!$B$46)","v":"RECYCLED MATERIALS"},{"$f":"IF('Tx236'!$B$51=\"\",\"\",'Tx236'!$B$51)","v":"Bin %:"},{"$f":"IF('Tx236'!$C$47=\"\",\"\",'Tx236'!$C$47)","v":"Bin No.1"}]
[237,{"$f":"IF('Tx236'!$D$51=\"\",\"\",'Tx236'!$D$51)","v":""},{"$f":"IF('Tx236'!$B$46=\"\",\"\",'Tx236'!$B$46)","v":"RECYCLED MATERIALS"},{"$f":"IF('Tx236'!$B$51=\"\",\"\",'Tx236'!$B$51)","v":"Bin %:"},{"$f":"IF('Tx236'!$D$47=\"\",\"\",'Tx236'!$D$47)","v":"Bin No.2"}]
[238,{"$f":"IF('Tx236'!$E$51=\"\",\"\",'Tx236'!$E$51)","v":""},{"$f":"IF('Tx236'!$B$46=\"\",\"\",'Tx236'!$B$46)","v":"RECYCLED MATERIALS"},{"$f":"IF('Tx236'!$B$51=\"\",\"\",'Tx236'!$B$51)","v":"Bin %:"},{"$f":"IF('Tx236'!$E$47=\"\",\"\",'Tx236'!$E$47)","v":"Bin No.3"}]
[239,{"$f":"IF('Tx236'!$F$51=\"\",\"\",'Tx236'!$F$51)","v":""},{"$f":"IF('Tx236'!$B$46=\"\",\"\",'Tx236'!$B$46)","v":"RECYCLED MATERIALS"},{"$f":"IF('Tx236'!$B$51=\"\",\"\",'Tx236'!$B$51)","v":"Bin %:"},{"$f":"IF('Tx236'!$F$47=\"\",\"\",'Tx236'!$F$47)","v":"Bin No.4"}]
[240,{"$f":"IF('Tx236'!$G$51=\"\",\"\",'Tx236'!$G$51)","v":""},{"$f":"IF('Tx236'!$B$46=\"\",\"\",'Tx236'!$B$46)","v":"RECYCLED MATERIALS"},{"$f":"IF('Tx236'!$B$51=\"\",\"\",'Tx236'!$B$51)","v":"Bin %:"},{"$f":"IF('Tx236'!$G$47=\"\",\"\",'Tx236'!$G$47)","v":"Bin No.5"}]
[241,{"$f":"IF('Tx236'!$C$54=\"\",\"\",'Tx236'!$C$54)","v":""},{"$f":"IF('Tx236'!$B$46=\"\",\"\",'Tx236'!$B$46)","v":"RECYCLED MATERIALS"},{"$f":"IF('Tx236'!$B$53=\"\",\"\",'Tx236'!$B$53)","v":"Sieve Size"},{"$f":"IF('Tx236'!$B$54=\"\",\"\",'Tx236'!$B$54)","v":""},{"$f":"IF('Tx236'!$C$53=\"\",\"\",'Tx236'!$C$53)","v":"PERCENT PASSING"},{"$f":"IF('Tx236'!$C$47=\"\",\"\",'Tx236'!$C$47)","v":"Bin No.1"}]
[242,{"$f":"IF('Tx236'!$D$54=\"\",\"\",'Tx236'!$D$54)","v":""},{"$f":"IF('Tx236'!$B$46=\"\",\"\",'Tx236'!$B$46)","v":"RECYCLED MATERIALS"},{"$f":"IF('Tx236'!$B$53=\"\",\"\",'Tx236'!$B$53)","v":"Sieve Size"},{"$f":"IF('Tx236'!$B$54=\"\",\"\",'Tx236'!$B$54)","v":""},{"$f":"IF('Tx236'!$C$53=\"\",\"\",'Tx236'!$C$53)","v":"PERCENT PASSING"},{"$f":"IF('Tx236'!$D$47=\"\",\"\",'Tx236'!$D$47)","v":"Bin No.2"}]
[243,{"$f":"IF('Tx236'!$E$54=\"\",\"\",'Tx236'!$E$54)","v":""},{"$f":"IF('Tx236'!$B$46=\"\",\"\",'Tx236'!$B$46)","v":"RECYCLED MATERIALS"},{"$f":"IF('Tx236'!$B$53=\"\",\"\",'Tx236'!$B$53)","v":"Sieve Size"},{"$f":"IF('Tx236'!$B$54=\"\",\"\",'Tx236'!$B$54)","v":""},{"$f":"IF('Tx236'!$C$53=\"\",\"\",'Tx236'!$C$53)","v":"PERCENT PASSING"},{"$f":"IF('Tx236'!$E$47=\"\",\"\",'Tx236'!$E$47)","v":"Bin No.3"}]
[244,{"$f":"IF('Tx236'!$F$54=\"\",\"\",'Tx236'!$F$54)","v":""},{"$f":"IF('Tx236'!$B$46=\"\",\"\",'Tx236'!$B$46)","v":"RECYCLED MATERIALS"},{"$f":"IF('Tx236'!$B$53=\"\",\"\",'Tx236'!$B$53)","v":"Sieve Size"},{"$f":"IF('Tx236'!$B$54=\"\",\"\",'Tx236'!$B$54)","v":""},{"$f":"IF('Tx236'!$C$53=\"\",\"\",'Tx236'!$C$53)","v":"PERCENT PASSING"},{"$f":"IF('Tx236'!$F$47=\"\",\"\",'Tx236'!$F$47)","v":"Bin No.4"}]
[245,{"$f":"IF('Tx236'!$G$54=\"\",\"\",'Tx236'!$G$54)","v":""},{"$f":"IF('Tx236'!$B$46=\"\",\"\",'Tx236'!$B$46)","v":"RECYCLED MATERIALS"},{"$f":"IF('Tx236'!$B$53=\"\",\"\",'Tx236'!$B$53)","v":"Sieve Size"},{"$f":"IF('Tx236'!$B$54=\"\",\"\",'Tx236'!$B$54)","v":""},{"$f":"IF('Tx236'!$C$53=\"\",\"\",'Tx236'!$C$53)","v":"PERCENT PASSING"},{"$f":"IF('Tx236'!$G$47=\"\",\"\",'Tx236'!$G$47)","v":"Bin No.5"}]
[246,{"$f":"IF('Tx236'!$C$55=\"\",\"\",'Tx236'!$C$55)","v":""},{"$f":"IF('Tx236'!$B$46=\"\",\"\",'Tx236'!$B$46)","v":"RECYCLED MATERIALS"},{"$f":"IF('Tx236'!$B$53=\"\",\"\",'Tx236'!$B$53)","v":"Sieve Size"},{"$f":"IF('Tx236'!$B$55=\"\",\"\",'Tx236'!$B$55)","v":""},{"$f":"IF('Tx236'!$C$53=\"\",\"\",'Tx236'!$C$53)","v":"PERCENT PASSING"},{"$f":"IF('Tx236'!$C$47=\"\",\"\",'Tx236'!$C$47)","v":"Bin No.1"}]
[247,{"$f":"IF('Tx236'!$D$55=\"\",\"\",'Tx236'!$D$55)","v":""},{"$f":"IF('Tx236'!$B$46=\"\",\"\",'Tx236'!$B$46)","v":"RECYCLED MATERIALS"},{"$f":"IF('Tx236'!$B$53=\"\",\"\",'Tx236'!$B$53)","v":"Sieve Size"},{"$f":"IF('Tx236'!$B$55=\"\",\"\",'Tx236'!$B$55)","v":""},{"$f":"IF('Tx236'!$C$53=\"\",\"\",'Tx236'!$C$53)","v":"PERCENT PASSING"},{"$f":"IF('Tx236'!$D$47=\"\",\"\",'Tx236'!$D$47)","v":"Bin No.2"}]
[248,{"$f":"IF('Tx236'!$E$55=\"\",\"\",'Tx236'!$E$55)","v":""},{"$f":"IF('Tx236'!$B$46=\"\",\"\",'Tx236'!$B$46)","v":"RECYCLED MATERIALS"},{"$f":"IF('Tx236'!$B$53=\"\",\"\",'Tx236'!$B$53)","v":"Sieve Size"},{"$f":"IF('Tx236'!$B$55=\"\",\"\",'Tx236'!$B$55)","v":""},{"$f":"IF('Tx236'!$C$53=\"\",\"\",'Tx236'!$C$53)","v":"PERCENT PASSING"},{"$f":"IF('Tx236'!$E$47=\"\",\"\",'Tx236'!$E$47)","v":"Bin No.3"}]
[249,{"$f":"IF('Tx236'!$F$55=\"\",\"\",'Tx236'!$F$55)","v":""},{"$f":"IF('Tx236'!$B$46=\"\",\"\",'Tx236'!$B$46)","v":"RECYCLED MATERIALS"},{"$f":"IF('Tx236'!$B$53=\"\",\"\",'Tx236'!$B$53)","v":"Sieve Size"},{"$f":"IF('Tx236'!$B$55=\"\",\"\",'Tx236'!$B$55)","v":""},{"$f":"IF('Tx236'!$C$53=\"\",\"\",'Tx236'!$C$53)","v":"PERCENT PASSING"},{"$f":"IF('Tx236'!$F$47=\"\",\"\",'Tx236'!$F$47)","v":"Bin No.4"}]
[250,{"$f":"IF('Tx236'!$G$55=\"\",\"\",'Tx236'!$G$55)","v":""},{"$f":"IF('Tx236'!$B$46=\"\",\"\",'Tx236'!$B$46)","v":"RECYCLED MATERIALS"},{"$f":"IF('Tx236'!$B$53=\"\",\"\",'Tx236'!$B$53)","v":"Sieve Size"},{"$f":"IF('Tx236'!$B$55=\"\",\"\",'Tx236'!$B$55)","v":""},{"$f":"IF('Tx236'!$C$53=\"\",\"\",'Tx236'!$C$53)","v":"PERCENT PASSING"},{"$f":"IF('Tx236'!$G$47=\"\",\"\",'Tx236'!$G$47)","v":"Bin No.5"}]
[251,{"$f":"IF('Tx236'!$C$56=\"\",\"\",'Tx236'!$C$56)","v":""},{"$f":"IF('Tx236'!$B$46=\"\",\"\",'Tx236'!$B$46)","v":"RECYCLED MATERIALS"},{"$f":"IF('Tx236'!$B$53=\"\",\"\",'Tx236'!$B$53)","v":"Sieve Size"},{"$f":"IF('Tx236'!$B$56=\"\",\"\",'Tx236'!$B$56)","v":""},{"$f":"IF('Tx236'!$C$53=\"\",\"\",'Tx236'!$C$53)","v":"PERCENT PASSING"},{"$f":"IF('Tx236'!$C$47=\"\",\"\",'Tx236'!$C$47)","v":"Bin No.1"}]
[252,{"$f":"IF('Tx236'!$D$56=\"\",\"\",'Tx236'!$D$56)","v":""},{"$f":"IF('Tx236'!$B$46=\"\",\"\",'Tx236'!$B$46)","v":"RECYCLED MATERIALS"},{"$f":"IF('Tx236'!$B$53=\"\",\"\",'Tx236'!$B$53)","v":"Sieve Size"},{"$f":"IF('Tx236'!$B$56=\"\",\"\",'Tx236'!$B$56)","v":""},{"$f":"IF('Tx236'!$C$53=\"\",\"\",'Tx236'!$C$53)","v":"PERCENT PASSING"},{"$f":"IF('Tx236'!$D$47=\"\",\"\",'Tx236'!$D$47)","v":"Bin No.2"}]
[253,{"$f":"IF('Tx236'!$E$56=\"\",\"\",'Tx236'!$E$56)","v":""},{"$f":"IF('Tx236'!$B$46=\"\",\"\",'Tx236'!$B$46)","v":"RECYCLED MATERIALS"},{"$f":"IF('Tx236'!$B$53=\"\",\"\",'Tx236'!$B$53)","v":"Sieve Size"},{"$f":"IF('Tx236'!$B$56=\"\",\"\",'Tx236'!$B$56)","v":""},{"$f":"IF('Tx236'!$C$53=\"\",\"\",'Tx236'!$C$53)","v":"PERCENT PASSING"},{"$f":"IF('Tx236'!$E$47=\"\",\"\",'Tx236'!$E$47)","v":"Bin No.3"}]
[254,{"$f":"IF('Tx236'!$F$56=\"\",\"\",'Tx236'!$F$56)","v":""},{"$f":"IF('Tx236'!$B$46=\"\",\"\",'Tx236'!$B$46)","v":"RECYCLED MATERIALS"},{"$f":"IF('Tx236'!$B$53=\"\",\"\",'Tx236'!$B$53)","v":"Sieve Size"},{"$f":"IF('Tx236'!$B$56=\"\",\"\",'Tx236'!$B$56)","v":""},{"$f":"IF('Tx236'!$C$53=\"\",\"\",'Tx236'!$C$53)","v":"PERCENT PASSING"},{"$f":"IF('Tx236'!$F$47=\"\",\"\",'Tx236'!$F$47)","v":"Bin No.4"}]
[255,{"$f":"IF('Tx236'!$G$56=\"\",\"\",'Tx236'!$G$56)","v":""},{"$f":"IF('Tx236'!$B$46=\"\",\"\",'Tx236'!$B$46)","v":"RECYCLED MATERIALS"},{"$f":"IF('Tx236'!$B$53=\"\",\"\",'Tx236'!$B$53)","v":"Sieve Size"},{"$f":"IF('Tx236'!$B$56=\"\",\"\",'Tx236'!$B$56)","v":""},{"$f":"IF('Tx236'!$C$53=\"\",\"\",'Tx236'!$C$53)","v":"PERCENT PASSING"},{"$f":"IF('Tx236'!$G$47=\"\",\"\",'Tx236'!$G$47)","v":"Bin No.5"}]
[256,{"$f":"IF('Tx236'!$C$57=\"\",\"\",'Tx236'!$C$57)","v":""},{"$f":"IF('Tx236'!$B$46=\"\",\"\",'Tx236'!$B$46)","v":"RECYCLED MATERIALS"},{"$f":"IF('Tx236'!$B$53=\"\",\"\",'Tx236'!$B$53)","v":"Sieve Size"},{"$f":"IF('Tx236'!$B$57=\"\",\"\",'Tx236'!$B$57)","v":""},{"$f":"IF('Tx236'!$C$53=\"\",\"\",'Tx236'!$C$53)","v":"PERCENT PASSING"},{"$f":"IF('Tx236'!$C$47=\"\",\"\",'Tx236'!$C$47)","v":"Bin No.1"}]
[257,{"$f":"IF('Tx236'!$D$57=\"\",\"\",'Tx236'!$D$57)","v":""},{"$f":"IF('Tx236'!$B$46=\"\",\"\",'Tx236'!$B$46)","v":"RECYCLED MATERIALS"},{"$f":"IF('Tx236'!$B$53=\"\",\"\",'Tx236'!$B$53)","v":"Sieve Size"},{"$f":"IF('Tx236'!$B$57=\"\",\"\",'Tx236'!$B$57)","v":""},{"$f":"IF('Tx236'!$C$53=\"\",\"\",'Tx236'!$C$53)","v":"PERCENT PASSING"},{"$f":"IF('Tx236'!$D$47=\"\",\"\",'Tx236'!$D$47)","v":"Bin No.2"}]
[258,{"$f":"IF('Tx236'!$E$57=\"\",\"\",'Tx236'!$E$57)","v":""},{"$f":"IF('Tx236'!$B$46=\"\",\"\",'Tx236'!$B$46)","v":"RECYCLED MATERIALS"},{"$f":"IF('Tx236'!$B$53=\"\",\"\",'Tx236'!$B$53)","v":"Sieve Size"},{"$f":"IF('Tx236'!$B$57=\"\",\"\",'Tx236'!$B$57)","v":""},{"$f":"IF('Tx236'!$C$53=\"\",\"\",'Tx236'!$C$53)","v":"PERCENT PASSING"},{"$f":"IF('Tx236'!$E$47=\"\",\"\",'Tx236'!$E$47)","v":"Bin No.3"}]
[259,{"$f":"IF('Tx236'!$F$57=\"\",\"\",'Tx236'!$F$57)","v":""},{"$f":"IF('Tx236'!$B$46=\"\",\"\",'Tx236'!$B$46)","v":"RECYCLED MATERIALS"},{"$f":"IF('Tx236'!$B$53=\"\",\"\",'Tx236'!$B$53)","v":"Sieve Size"},{"$f":"IF('Tx236'!$B$57=\"\",\"\",'Tx236'!$B$57)","v":""},{"$f":"IF('Tx236'!$C$53=\"\",\"\",'Tx236'!$C$53)","v":"PERCENT PASSING"},{"$f":"IF('Tx236'!$F$47=\"\",\"\",'Tx236'!$F$47)","v":"Bin No.4"}]
[260,{"$f":"IF('Tx236'!$G$57=\"\",\"\",'Tx236'!$G$57)","v":""},{"$f":"IF('Tx236'!$B$46=\"\",\"\",'Tx236'!$B$46)","v":"RECYCLED MATERIALS"},{"$f":"IF('Tx236'!$B$53=\"\",\"\",'Tx236'!$B$53)","v":"Sieve Size"},{"$f":"IF('Tx236'!$B$57=\"\",\"\",'Tx236'!$B$57)","v":""},{"$f":"IF('Tx236'!$C$53=\"\",\"\",'Tx236'!$C$53)","v":"PERCENT PASSING"},{"$f":"IF('Tx236'!$G$47=\"\",\"\",'Tx236'!$G$47)","v":"Bin No.5"}]
[261,{"$f":"IF('Tx236'!$C$58=\"\",\"\",'Tx236'!$C$58)","v":""},{"$f":"IF('Tx236'!$B$46=\"\",\"\",'Tx236'!$B$46)","v":"RECYCLED MATERIALS"},{"$f":"IF('Tx236'!$B$53=\"\",\"\",'Tx236'!$B$53)","v":"Sieve Size"},{"$f":"IF('Tx236'!$B$58=\"\",\"\",'Tx236'!$B$58)","v":""},{"$f":"IF('Tx236'!$C$53=\"\",\"\",'Tx236'!$C$53)","v":"PERCENT PASSING"},{"$f":"IF('Tx236'!$C$47=\"\",\"\",'Tx236'!$C$47)","v":"Bin No.1"}]
[262,{"$f":"IF('Tx236'!$D$58=\"\",\"\",'Tx236'!$D$58)","v":""},{"$f":"IF('Tx236'!$B$46=\"\",\"\",'Tx236'!$B$46)","v":"RECYCLED MATERIALS"},{"$f":"IF('Tx236'!$B$53=\"\",\"\",'Tx236'!$B$53)","v":"Sieve Size"},{"$f":"IF('Tx236'!$B$58=\"\",\"\",'Tx236'!$B$58)","v":""},{"$f":"IF('Tx236'!$C$53=\"\",\"\",'Tx236'!$C$53)","v":"PERCENT PASSING"},{"$f":"IF('Tx236'!$D$47=\"\",\"\",'Tx236'!$D$47)","v":"Bin No.2"}]
[263,{"$f":"IF('Tx236'!$E$58=\"\",\"\",'Tx236'!$E$58)","v":""},{"$f":"IF('Tx236'!$B$46=\"\",\"\",'Tx236'!$B$46)","v":"RECYCLED MATERIALS"},{"$f":"IF('Tx236'!$B$53=\"\",\"\",'Tx236'!$B$53)","v":"Sieve Size"},{"$f":"IF('Tx236'!$B$58=\"\",\"\",'Tx236'!$B$58)","v":""},{"$f":"IF('Tx236'!$C$53=\"\",\"\",'Tx236'!$C$53)","v":"PERCENT PASSING"},{"$f":"IF('Tx236'!$E$47=\"\",\"\",'Tx236'!$E$47)","v":"Bin No.3"}]
[264,{"$f":"IF('Tx236'!$F$58=\"\",\"\",'Tx236'!$F$58)","v":""},{"$f":"IF('Tx236'!$B$46=\"\",\"\",'Tx236'!$B$46)","v":"RECYCLED MATERIALS"},{"$f":"IF('Tx236'!$B$53=\"\",\"\",'Tx236'!$B$53)","v":"Sieve Size"},{"$f":"IF('Tx236'!$B$58=\"\",\"\",'Tx236'!$B$58)","v":""},{"$f":"IF('Tx236'!$C$53=\"\",\"\",'Tx236'!$C$53)","v":"PERCENT PASSING"},{"$f":"IF('Tx236'!$F$47=\"\",\"\",'Tx236'!$F$47)","v":"Bin No.4"}]
[265,{"$f":"IF('Tx236'!$G$58=\"\",\"\",'Tx236'!$G$58)","v":""},{"$f":"IF('Tx236'!$B$46=\"\",\"\",'Tx236'!$B$46)","v":"RECYCLED MATERIALS"},{"$f":"IF('Tx236'!$B$53=\"\",\"\",'Tx236'!$B$53)","v":"Sieve Size"},{"$f":"IF('Tx236'!$B$58=\"\",\"\",'Tx236'!$B$58)","v":""},{"$f":"IF('Tx236'!$C$53=\"\",\"\",'Tx236'!$C$53)","v":"PERCENT PASSING"},{"$f":"IF('Tx236'!$G$47=\"\",\"\",'Tx236'!$G$47)","v":"Bin No.5"}]
[266,{"$f":"IF('Tx236'!$C$59=\"\",\"\",'Tx236'!$C$59)","v":""},{"$f":"IF('Tx236'!$B$46=\"\",\"\",'Tx236'!$B$46)","v":"RECYCLED MATERIALS"},{"$f":"IF('Tx236'!$B$53=\"\",\"\",'Tx236'!$B$53)","v":"Sieve Size"},{"$f":"IF('Tx236'!$B$59=\"\",\"\",'Tx236'!$B$59)","v":""},{"$f":"IF('Tx236'!$C$53=\"\",\"\",'Tx236'!$C$53)","v":"PERCENT PASSING"},{"$f":"IF('Tx236'!$C$47=\"\",\"\",'Tx236'!$C$47)","v":"Bin No.1"}]
[267,{"$f":"IF('Tx236'!$D$59=\"\",\"\",'Tx236'!$D$59)","v":""},{"$f":"IF('Tx236'!$B$46=\"\",\"\",'Tx236'!$B$46)","v":"RECYCLED MATERIALS"},{"$f":"IF('Tx236'!$B$53=\"\",\"\",'Tx236'!$B$53)","v":"Sieve Size"},{"$f":"IF('Tx236'!$B$59=\"\",\"\",'Tx236'!$B$59)","v":""},{"$f":"IF('Tx236'!$C$53=\"\",\"\",'Tx236'!$C$53)","v":"PERCENT PASSING"},{"$f":"IF('Tx236'!$D$47=\"\",\"\",'Tx236'!$D$47)","v":"Bin No.2"}]
[268,{"$f":"IF('Tx236'!$E$59=\"\",\"\",'Tx236'!$E$59)","v":""},{"$f":"IF('Tx236'!$B$46=\"\",\"\",'Tx236'!$B$46)","v":"RECYCLED MATERIALS"},{"$f":"IF('Tx236'!$B$53=\"\",\"\",'Tx236'!$B$53)","v":"Sieve Size"},{"$f":"IF('Tx236'!$B$59=\"\",\"\",'Tx236'!$B$59)","v":""},{"$f":"IF('Tx236'!$C$53=\"\",\"\",'Tx236'!$C$53)","v":"PERCENT PASSING"},{"$f":"IF('Tx236'!$E$47=\"\",\"\",'Tx236'!$E$47)","v":"Bin No.3"}]
[269,{"$f":"IF('Tx236'!$F$59=\"\",\"\",'Tx236'!$F$59)","v":""},{"$f":"IF('Tx236'!$B$46=\"\",\"\",'Tx236'!$B$46)","v":"RECYCLED MATERIALS"},{"$f":"IF('Tx236'!$B$53=\"\",\"\",'Tx236'!$B$53)","v":"Sieve Size"},{"$f":"IF('Tx236'!$B$59=\"\",\"\",'Tx236'!$B$59)","v":""},{"$f":"IF('Tx236'!$C$53=\"\",\"\",'Tx236'!$C$53)","v":"PERCENT PASSING"},{"$f":"IF('Tx236'!$F$47=\"\",\"\",'Tx236'!$F$47)","v":"Bin No.4"}]
[270,{"$f":"IF('Tx236'!$G$59=\"\",\"\",'Tx236'!$G$59)","v":""},{"$f":"IF('Tx236'!$B$46=\"\",\"\",'Tx236'!$B$46)","v":"RECYCLED MATERIALS"},{"$f":"IF('Tx236'!$B$53=\"\",\"\",'Tx236'!$B$53)","v":"Sieve Size"},{"$f":"IF('Tx236'!$B$59=\"\",\"\",'Tx236'!$B$59)","v":""},{"$f":"IF('Tx236'!$C$53=\"\",\"\",'Tx236'!$C$53)","v":"PERCENT PASSING"},{"$f":"IF('Tx236'!$G$47=\"\",\"\",'Tx236'!$G$47)","v":"Bin No.5"}]
[271,{"$f":"IF('Tx236'!$C$60=\"\",\"\",'Tx236'!$C$60)","v":""},{"$f":"IF('Tx236'!$B$46=\"\",\"\",'Tx236'!$B$46)","v":"RECYCLED MATERIALS"},{"$f":"IF('Tx236'!$B$53=\"\",\"\",'Tx236'!$B$53)","v":"Sieve Size"},{"$f":"IF('Tx236'!$B$60=\"\",\"\",'Tx236'!$B$60)","v":""},{"$f":"IF('Tx236'!$C$53=\"\",\"\",'Tx236'!$C$53)","v":"PERCENT PASSING"},{"$f":"IF('Tx236'!$C$47=\"\",\"\",'Tx236'!$C$47)","v":"Bin No.1"}]
[272,{"$f":"IF('Tx236'!$D$60=\"\",\"\",'Tx236'!$D$60)","v":""},{"$f":"IF('Tx236'!$B$46=\"\",\"\",'Tx236'!$B$46)","v":"RECYCLED MATERIALS"},{"$f":"IF('Tx236'!$B$53=\"\",\"\",'Tx236'!$B$53)","v":"Sieve Size"},{"$f":"IF('Tx236'!$B$60=\"\",\"\",'Tx236'!$B$60)","v":""},{"$f":"IF('Tx236'!$C$53=\"\",\"\",'Tx236'!$C$53)","v":"PERCENT PASSING"},{"$f":"IF('Tx236'!$D$47=\"\",\"\",'Tx236'!$D$47)","v":"Bin No.2"}]
[273,{"$f":"IF('Tx236'!$E$60=\"\",\"\",'Tx236'!$E$60)","v":""},{"$f":"IF('Tx236'!$B$46=\"\",\"\",'Tx236'!$B$46)","v":"RECYCLED MATERIALS"},{"$f":"IF('Tx236'!$B$53=\"\",\"\",'Tx236'!$B$53)","v":"Sieve Size"},{"$f":"IF('Tx236'!$B$60=\"\",\"\",'Tx236'!$B$60)","v":""},{"$f":"IF('Tx236'!$C$53=\"\",\"\",'Tx236'!$C$53)","v":"PERCENT PASSING"},{"$f":"IF('Tx236'!$E$47=\"\",\"\",'Tx236'!$E$47)","v":"Bin No.3"}]
[274,{"$f":"IF('Tx236'!$F$60=\"\",\"\",'Tx236'!$F$60)","v":""},{"$f":"IF('Tx236'!$B$46=\"\",\"\",'Tx236'!$B$46)","v":"RECYCLED MATERIALS"},{"$f":"IF('Tx236'!$B$53=\"\",\"\",'Tx236'!$B$53)","v":"Sieve Size"},{"$f":"IF('Tx236'!$B$60=\"\",\"\",'Tx236'!$B$60)","v":""},{"$f":"IF('Tx236'!$C$53=\"\",\"\",'Tx236'!$C$53)","v":"PERCENT PASSING"},{"$f":"IF('Tx236'!$F$47=\"\",\"\",'Tx236'!$F$47)","v":"Bin No.4"}]
[275,{"$f":"IF('Tx236'!$G$60=\"\",\"\",'Tx236'!$G$60)","v":""},{"$f":"IF('Tx236'!$B$46=\"\",\"\",'Tx236'!$B$46)","v":"RECYCLED MATERIALS"},{"$f":"IF('Tx236'!$B$53=\"\",\"\",'Tx236'!$B$53)","v":"Sieve Size"},{"$f":"IF('Tx236'!$B$60=\"\",\"\",'Tx236'!$B$60)","v":""},{"$f":"IF('Tx236'!$C$53=\"\",\"\",'Tx236'!$C$53)","v":"PERCENT PASSING"},{"$f":"IF('Tx236'!$G$47=\"\",\"\",'Tx236'!$G$47)","v":"Bin No.5"}]
[276,{"$f":"IF('Tx236'!$C$61=\"\",\"\",'Tx236'!$C$61)","v":""},{"$f":"IF('Tx236'!$B$46=\"\",\"\",'Tx236'!$B$46)","v":"RECYCLED MATERIALS"},{"$f":"IF('Tx236'!$B$53=\"\",\"\",'Tx236'!$B$53)","v":"Sieve Size"},{"$f":"IF('Tx236'!$B$61=\"\",\"\",'Tx236'!$B$61)","v":""},{"$f":"IF('Tx236'!$C$53=\"\",\"\",'Tx236'!$C$53)","v":"PERCENT PASSING"},{"$f":"IF('Tx236'!$C$47=\"\",\"\",'Tx236'!$C$47)","v":"Bin No.1"}]
[277,{"$f":"IF('Tx236'!$D$61=\"\",\"\",'Tx236'!$D$61)","v":""},{"$f":"IF('Tx236'!$B$46=\"\",\"\",'Tx236'!$B$46)","v":"RECYCLED MATERIALS"},{"$f":"IF('Tx236'!$B$53=\"\",\"\",'Tx236'!$B$53)","v":"Sieve Size"},{"$f":"IF('Tx236'!$B$61=\"\",\"\",'Tx236'!$B$61)","v":""},{"$f":"IF('Tx236'!$C$53=\"\",\"\",'Tx236'!$C$53)","v":"PERCENT PASSING"},{"$f":"IF('Tx236'!$D$47=\"\",\"\",'Tx236'!$D$47)","v":"Bin No.2"}]
[278,{"$f":"IF('Tx236'!$E$61=\"\",\"\",'Tx236'!$E$61)","v":""},{"$f":"IF('Tx236'!$B$46=\"\",\"\",'Tx236'!$B$46)","v":"RECYCLED MATERIALS"},{"$f":"IF('Tx236'!$B$53=\"\",\"\",'Tx236'!$B$53)","v":"Sieve Size"},{"$f":"IF('Tx236'!$B$61=\"\",\"\",'Tx236'!$B$61)","v":""},{"$f":"IF('Tx236'!$C$53=\"\",\"\",'Tx236'!$C$53)","v":"PERCENT PASSING"},{"$f":"IF('Tx236'!$E$47=\"\",\"\",'Tx236'!$E$47)","v":"Bin No.3"}]
[279,{"$f":"IF('Tx236'!$F$61=\"\",\"\",'Tx236'!$F$61)","v":""},{"$f":"IF('Tx236'!$B$46=\"\",\"\",'Tx236'!$B$46)","v":"RECYCLED MATERIALS"},{"$f":"IF('Tx236'!$B$53=\"\",\"\",'Tx236'!$B$53)","v":"Sieve Size"},{"$f":"IF('Tx236'!$B$61=\"\",\"\",'Tx236'!$B$61)","v":""},{"$f":"IF('Tx236'!$C$53=\"\",\"\",'Tx236'!$C$53)","v":"PERCENT PASSING"},{"$f":"IF('Tx236'!$F$47=\"\",\"\",'Tx236'!$F$47)","v":"Bin No.4"}]
[280,{"$f":"IF('Tx236'!$G$61=\"\",\"\",'Tx236'!$G$61)","v":""},{"$f":"IF('Tx236'!$B$46=\"\",\"\",'Tx236'!$B$46)","v":"RECYCLED MATERIALS"},{"$f":"IF('Tx236'!$B$53=\"\",\"\",'Tx236'!$B$53)","v":"Sieve Size"},{"$f":"IF('Tx236'!$B$61=\"\",\"\",'Tx236'!$B$61)","v":""},{"$f":"IF('Tx236'!$C$53=\"\",\"\",'Tx236'!$C$53)","v":"PERCENT PASSING"},{"$f":"IF('Tx236'!$G$47=\"\",\"\",'Tx236'!$G$47)","v":"Bin No.5"}]
[281,{"$f":"IF('Tx236'!$C$62=\"\",\"\",'Tx236'!$C$62)","v":""},{"$f":"IF('Tx236'!$B$46=\"\",\"\",'Tx236'!$B$46)","v":"RECYCLED MATERIALS"},{"$f":"IF('Tx236'!$B$53=\"\",\"\",'Tx236'!$B$53)","v":"Sieve Size"},{"$f":"IF('Tx236'!$B$62=\"\",\"\",'Tx236'!$B$62)","v":""},{"$f":"IF('Tx236'!$C$53=\"\",\"\",'Tx236'!$C$53)","v":"PERCENT PASSING"},{"$f":"IF('Tx236'!$C$47=\"\",\"\",'Tx236'!$C$47)","v":"Bin No.1"}]
[282,{"$f":"IF('Tx236'!$D$62=\"\",\"\",'Tx236'!$D$62)","v":""},{"$f":"IF('Tx236'!$B$46=\"\",\"\",'Tx236'!$B$46)","v":"RECYCLED MATERIALS"},{"$f":"IF('Tx236'!$B$53=\"\",\"\",'Tx236'!$B$53)","v":"Sieve Size"},{"$f":"IF('Tx236'!$B$62=\"\",\"\",'Tx236'!$B$62)","v":""},{"$f":"IF('Tx236'!$C$53=\"\",\"\",'Tx236'!$C$53)","v":"PERCENT PASSING"},{"$f":"IF('Tx236'!$D$47=\"\",\"\",'Tx236'!$D$47)","v":"Bin No.2"}]
[283,{"$f":"IF('Tx236'!$E$62=\"\",\"\",'Tx236'!$E$62)","v":""},{"$f":"IF('Tx236'!$B$46=\"\",\"\",'Tx236'!$B$46)","v":"RECYCLED MATERIALS"},{"$f":"IF('Tx236'!$B$53=\"\",\"\",'Tx236'!$B$53)","v":"Sieve Size"},{"$f":"IF('Tx236'!$B$62=\"\",\"\",'Tx236'!$B$62)","v":""},{"$f":"IF('Tx236'!$C$53=\"\",\"\",'Tx236'!$C$53)","v":"PERCENT PASSING"},{"$f":"IF('Tx236'!$E$47=\"\",\"\",'Tx236'!$E$47)","v":"Bin No.3"}]
[284,{"$f":"IF('Tx236'!$F$62=\"\",\"\",'Tx236'!$F$62)","v":""},{"$f":"IF('Tx236'!$B$46=\"\",\"\",'Tx236'!$B$46)","v":"RECYCLED MATERIALS"},{"$f":"IF('Tx236'!$B$53=\"\",\"\",'Tx236'!$B$53)","v":"Sieve Size"},{"$f":"IF('Tx236'!$B$62=\"\",\"\",'Tx236'!$B$62)","v":""},{"$f":"IF('Tx236'!$C$53=\"\",\"\",'Tx236'!$C$53)","v":"PERCENT PASSING"},{"$f":"IF('Tx236'!$F$47=\"\",\"\",'Tx236'!$F$47)","v":"Bin No.4"}]
[285,{"$f":"IF('Tx236'!$G$62=\"\",\"\",'Tx236'!$G$62)","v":""},{"$f":"IF('Tx236'!$B$46=\"\",\"\",'Tx236'!$B$46)","v":"RECYCLED MATERIALS"},{"$f":"IF('Tx236'!$B$53=\"\",\"\",'Tx236'!$B$53)","v":"Sieve Size"},{"$f":"IF('Tx236'!$B$62=\"\",\"\",'Tx236'!$B$62)","v":""},{"$f":"IF('Tx236'!$C$53=\"\",\"\",'Tx236'!$C$53)","v":"PERCENT PASSING"},{"$f":"IF('Tx236'!$G$47=\"\",\"\",'Tx236'!$G$47)","v":"Bin No.5"}]
[286,{"$f":"IF('Tx236'!$C$63=\"\",\"\",'Tx236'!$C$63)","v":""},{"$f":"IF('Tx236'!$B$46=\"\",\"\",'Tx236'!$B$46)","v":"RECYCLED MATERIALS"},{"$f":"IF('Tx236'!$B$53=\"\",\"\",'Tx236'!$B$53)","v":"Sieve Size"},{"$f":"IF('Tx236'!$B$63=\"\",\"\",'Tx236'!$B$63)","v":""},{"$f":"IF('Tx236'!$C$53=\"\",\"\",'Tx236'!$C$53)","v":"PERCENT PASSING"},{"$f":"IF('Tx236'!$C$47=\"\",\"\",'Tx236'!$C$47)","v":"Bin No.1"}]
[287,{"$f":"IF('Tx236'!$D$63=\"\",\"\",'Tx236'!$D$63)","v":""},{"$f":"IF('Tx236'!$B$46=\"\",\"\",'Tx236'!$B$46)","v":"RECYCLED MATERIALS"},{"$f":"IF('Tx236'!$B$53=\"\",\"\",'Tx236'!$B$53)","v":"Sieve Size"},{"$f":"IF('Tx236'!$B$63=\"\",\"\",'Tx236'!$B$63)","v":""},{"$f":"IF('Tx236'!$C$53=\"\",\"\",'Tx236'!$C$53)","v":"PERCENT PASSING"},{"$f":"IF('Tx236'!$D$47=\"\",\"\",'Tx236'!$D$47)","v":"Bin No.2"}]
[288,{"$f":"IF('Tx236'!$E$63=\"\",\"\",'Tx236'!$E$63)","v":""},{"$f":"IF('Tx236'!$B$46=\"\",\"\",'Tx236'!$B$46)","v":"RECYCLED MATERIALS"},{"$f":"IF('Tx236'!$B$53=\"\",\"\",'Tx236'!$B$53)","v":"Sieve Size"},{"$f":"IF('Tx236'!$B$63=\"\",\"\",'Tx236'!$B$63)","v":""},{"$f":"IF('Tx236'!$C$53=\"\",\"\",'Tx236'!$C$53)","v":"PERCENT PASSING"},{"$f":"IF('Tx236'!$E$47=\"\",\"\",'Tx236'!$E$47)","v":"Bin No.3"}]
[289,{"$f":"IF('Tx236'!$F$63=\"\",\"\",'Tx236'!$F$63)","v":""},{"$f":"IF('Tx236'!$B$46=\"\",\"\",'Tx236'!$B$46)","v":"RECYCLED MATERIALS"},{"$f":"IF('Tx236'!$B$53=\"\",\"\",'Tx236'!$B$53)","v":"Sieve Size"},{"$f":"IF('Tx236'!$B$63=\"\",\"\",'Tx236'!$B$63)","v":""},{"$f":"IF('Tx236'!$C$53=\"\",\"\",'Tx236'!$C$53)","v":"PERCENT PASSING"},{"$f":"IF('Tx236'!$F$47=\"\",\"\",'Tx236'!$F$47)","v":"Bin No.4"}]
[290,{"$f":"IF('Tx236'!$G$63=\"\",\"\",'Tx236'!$G$63)","v":""},{"$f":"IF('Tx236'!$B$46=\"\",\"\",'Tx236'!$B$46)","v":"RECYCLED MATERIALS"},{"$f":"IF('Tx236'!$B$53=\"\",\"\",'Tx236'!$B$53)","v":"Sieve Size"},{"$f":"IF('Tx236'!$B$63=\"\",\"\",'Tx236'!$B$63)","v":""},{"$f":"IF('Tx236'!$C$53=\"\",\"\",'Tx236'!$C$53)","v":"PERCENT PASSING"},{"$f":"IF('Tx236'!$G$47=\"\",\"\",'Tx236'!$G$47)","v":"Bin No.5"}]
[291,{"$f":"IF('Tx236'!$C$64=\"\",\"\",'Tx236'!$C$64)","v":""},{"$f":"IF('Tx236'!$B$46=\"\",\"\",'Tx236'!$B$46)","v":"RECYCLED MATERIALS"},{"$f":"IF('Tx236'!$B$53=\"\",\"\",'Tx236'!$B$53)","v":"Sieve Size"},{"$f":"IF('Tx236'!$B$64=\"\",\"\",'Tx236'!$B$64)","v":""},{"$f":"IF('Tx236'!$C$53=\"\",\"\",'Tx236'!$C$53)","v":"PERCENT PASSING"},{"$f":"IF('Tx236'!$C$47=\"\",\"\",'Tx236'!$C$47)","v":"Bin No.1"}]
[292,{"$f":"IF('Tx236'!$D$64=\"\",\"\",'Tx236'!$D$64)","v":""},{"$f":"IF('Tx236'!$B$46=\"\",\"\",'Tx236'!$B$46)","v":"RECYCLED MATERIALS"},{"$f":"IF('Tx236'!$B$53=\"\",\"\",'Tx236'!$B$53)","v":"Sieve Size"},{"$f":"IF('Tx236'!$B$64=\"\",\"\",'Tx236'!$B$64)","v":""},{"$f":"IF('Tx236'!$C$53=\"\",\"\",'Tx236'!$C$53)","v":"PERCENT PASSING"},{"$f":"IF('Tx236'!$D$47=\"\",\"\",'Tx236'!$D$47)","v":"Bin No.2"}]
[293,{"$f":"IF('Tx236'!$E$64=\"\",\"\",'Tx236'!$E$64)","v":""},{"$f":"IF('Tx236'!$B$46=\"\",\"\",'Tx236'!$B$46)","v":"RECYCLED MATERIALS"},{"$f":"IF('Tx236'!$B$53=\"\",\"\",'Tx236'!$B$53)","v":"Sieve Size"},{"$f":"IF('Tx236'!$B$64=\"\",\"\",'Tx236'!$B$64)","v":""},{"$f":"IF('Tx236'!$C$53=\"\",\"\",'Tx236'!$C$53)","v":"PERCENT PASSING"},{"$f":"IF('Tx236'!$E$47=\"\",\"\",'Tx236'!$E$47)","v":"Bin No.3"}]
[294,{"$f":"IF('Tx236'!$F$64=\"\",\"\",'Tx236'!$F$64)","v":""},{"$f":"IF('Tx236'!$B$46=\"\",\"\",'Tx236'!$B$46)","v":"RECYCLED MATERIALS"},{"$f":"IF('Tx236'!$B$53=\"\",\"\",'Tx236'!$B$53)","v":"Sieve Size"},{"$f":"IF('Tx236'!$B$64=\"\",\"\",'Tx236'!$B$64)","v":""},{"$f":"IF('Tx236'!$C$53=\"\",\"\",'Tx236'!$C$53)","v":"PERCENT PASSING"},{"$f":"IF('Tx236'!$F$47=\"\",\"\",'Tx236'!$F$47)","v":"Bin No.4"}]
[295,{"$f":"IF('Tx236'!$G$64=\"\",\"\",'Tx236'!$G$64)","v":""},{"$f":"IF('Tx236'!$B$46=\"\",\"\",'Tx236'!$B$46)","v":"RECYCLED MATERIALS"},{"$f":"IF('Tx236'!$B$53=\"\",\"\",'Tx236'!$B$53)","v":"Sieve Size"},{"$f":"IF('Tx236'!$B$64=\"\",\"\",'Tx236'!$B$64)","v":""},{"$f":"IF('Tx236'!$C$53=\"\",\"\",'Tx236'!$C$53)","v":"PERCENT PASSING"},{"$f":"IF('Tx236'!$G$47=\"\",\"\",'Tx236'!$G$47)","v":"Bin No.5"}]
[296,{"$f":"IF('Tx236'!$D$23=\"\",\"\",'Tx236'!$D$23)","v":""},{"$f":"IF('Tx236'!$B$21=\"\",\"\",'Tx236'!$B$21)","v":"SIEVE ANALYSIS WORKSHEET FOR CALIBRATION SAMPLES"},{"$f":"IF('Tx236'!$B$23=\"\",\"\",'Tx236'!$B$23)","v":"Dry Weight after Washing:"},{"$f":"IF('Tx236'!$D$24=\"\",\"\",'Tx236'!$D$24)","v":"Blank Sample"}]
[297,{"$f":"IF('Tx236'!$E$23=\"\",\"\",'Tx236'!$E$23)","v":""},{"$f":"IF('Tx236'!$B$21=\"\",\"\",'Tx236'!$B$21)","v":"SIEVE ANALYSIS WORKSHEET FOR CALIBRATION SAMPLES"},{"$f":"IF('Tx236'!$B$23=\"\",\"\",'Tx236'!$B$23)","v":"Dry Weight after Washing:"},{"$f":"IF('Tx236'!$E$24=\"\",\"\",'Tx236'!$E$24)","v":"Blank  Sample 2"}]
[298,{"$f":"IF('Tx236'!$K$15=\"\",\"\",'Tx236'!$K$15)","v":""},{"$f":"IF('Tx236'!$K$14=\"\",\"\",'Tx236'!$K$14)","v":"Fiber Content:"}]
[299,{"$f":"IF('Tx236'!$D$91=\"\",\"\",'Tx236'!$D$91)","v":""},{"$f":"IF('Tx236'!$B$89=\"\",\"\",'Tx236'!$B$89)","v":"ASPHALT CONTENT VERIFICATION"},{"$f":"IF('Tx236'!$B$90=\"\",\"\",'Tx236'!$B$90)","v":"Rice Specimen"},{"$f":"IF('Tx236'!$B$91=\"\",\"\",'Tx236'!$B$91)","v":"Asphalt Specific Gravity"}]
[300,{"$f":"IF('Tx236'!$D$92=\"\",\"\",'Tx236'!$D$92)","v":""},{"$f":"IF('Tx236'!$B$89=\"\",\"\",'Tx236'!$B$89)","v":"ASPHALT CONTENT VERIFICATION"},{"$f":"IF('Tx236'!$B$90=\"\",\"\",'Tx236'!$B$90)","v":"Rice Specimen"},{"$f":"IF('Tx236'!$B$92=\"\",\"\",'Tx236'!$B$92)","v":"Target AC % @OAC"}]
[301,{"$f":"IF('Tx236'!$E$92=\"\",\"\",'Tx236'!$E$92)","v":""},{"$f":"IF('Tx236'!$B$89=\"\",\"\",'Tx236'!$B$89)","v":"ASPHALT CONTENT VERIFICATION"},{"$f":"IF('Tx236'!$B$90=\"\",\"\",'Tx236'!$B$90)","v":"Rice Specimen"},{"$f":"IF('Tx236'!$E$91=\"\",\"\",'Tx236'!$E$91)","v":"Rice#1 @OAC"}]
[302,{"$f":"IF('Tx236'!$G$92=\"\",\"\",'Tx236'!$G$92)","v":""},{"$f":"IF('Tx236'!$B$89=\"\",\"\",'Tx236'!$B$89)","v":"ASPHALT CONTENT VERIFICATION"},{"$f":"IF('Tx236'!$B$90=\"\",\"\",'Tx236'!$B$90)","v":"Rice Specimen"},{"$f":"IF('Tx236'!$G$91=\"\",\"\",'Tx236'!$G$91)","v":"Rice#2 @OAC"}]
[303,{"$f":"IF('Tx236'!$I$92=\"\",\"\",'Tx236'!$I$92)","v":""},{"$f":"IF('Tx236'!$B$89=\"\",\"\",'Tx236'!$B$89)","v":"ASPHALT CONTENT VERIFICATION"},{"$f":"IF('Tx236'!$B$90=\"\",\"\",'Tx236'!$B$90)","v":"Rice Specimen"},{"$f":"IF('Tx236'!$I$91=\"\",\"\",'Tx236'!$I$91)","v":"Rice#3 @OAC"}]
[304,{"$f":"IF('Tx236'!$K$92=\"\",\"\",'Tx236'!$K$92)","v":""},{"$f":"IF('Tx236'!$B$89=\"\",\"\",'Tx236'!$B$89)","v":"ASPHALT CONTENT VERIFICATION"},{"$f":"IF('Tx236'!$B$90=\"\",\"\",'Tx236'!$B$90)","v":"Rice Specimen"},{"$f":"IF('Tx236'!$K$91=\"\",\"\",'Tx236'!$K$91)","v":"Average Rice"}]
[305,{"$f":"IF('Tx236'!$D$93=\"\",\"\",'Tx236'!$D$93)","v":""},{"$f":"IF('Tx236'!$B$89=\"\",\"\",'Tx236'!$B$89)","v":"ASPHALT CONTENT VERIFICATION"},{"$f":"IF('Tx236'!$B$90=\"\",\"\",'Tx236'!$B$90)","v":"Rice Specimen"},{"$f":"IF('Tx236'!$B$93=\"\",\"\",'Tx236'!$B$93)","v":"Effective Specific Gravity"}]
[306,{"$f":"IF('Tx236'!$E$95=\"\",\"\",'Tx236'!$E$95)","v":""},{"$f":"IF('Tx236'!$B$89=\"\",\"\",'Tx236'!$B$89)","v":"ASPHALT CONTENT VERIFICATION"},{"$f":"IF('Tx236'!$B$94=\"\",\"\",'Tx236'!$B$94)","v":"Production Test Specimen"},{"$f":"IF('Tx236'!$B$95=\"\",\"\",'Tx236'!$B$95)","v":"Maximum Specific Gravity"}]
[307,{"$f":"IF('Tx236'!$K$95=\"\",\"\",'Tx236'!$K$95)","v":""},{"$f":"IF('Tx236'!$B$89=\"\",\"\",'Tx236'!$B$89)","v":"ASPHALT CONTENT VERIFICATION"},{"$f":"IF('Tx236'!$B$94=\"\",\"\",'Tx236'!$B$94)","v":"Production Test Specimen"},{"$f":"IF('Tx236'!$I$95=\"\",\"\",'Tx236'!$I$95)","v":"Back Calculated AC %"}]
[308,{"$f":"IF('Tx236'!$C$110=\"\",\"\",'Tx236'!$C$110)","v":""},"Tested By ",{"$f":"IF('Tx236'!$B$110=\"\",\"\",'Tx236'!$B$110)","v":"TX236PI"}]
[309,{"$f":"IF('Tx236'!$F$110=\"\",\"\",'Tx236'!$F$110)","v":""},"Tested Date ",{"$f":"IF('Tx236'!$B$110=\"\",\"\",'Tx236'!$B$110)","v":"TX236PI"}]
[310,{"$f":"IF('Tx236'!$C$112=\"\",\"\",'Tx236'!$C$112)","v":""},"Tested By ",{"$f":"IF('Tx236'!$B$112=\"\",\"\",'Tx236'!$B$112)","v":"TX236PII"}]
[311,{"$f":"IF('Tx236'!$F$112=\"\",\"\",'Tx236'!$F$112)","v":""},"Tested Date ",{"$f":"IF('Tx236'!$B$112=\"\",\"\",'Tx236'!$B$112)","v":"TX236PII"}]
[312,{"$f":"IF('Tx236'!$K$12=\"\",\"\",'Tx236'!$K$12)","v":""},{"$f":"IF('Tx236'!$K$9=\"\",\"\",'Tx236'!$K$9)","v":"Correction Factor Test Date"}]
[313,{"$f":"IF(Field226=\"\",\"\",Field226)","v":""},"Summary","Remarks"]
[314,{"$f":"IF('Tx236'!$C$104=\"\",\"\",'Tx236'!$C$104)","v":""},"Sampled By ",{"$f":"IF('Tx236'!$B$104=\"\",\"\",'Tx236'!$B$104)","v":"TX221"}]
[315,{"$f":"IF('Tx236'!$F$104=\"\",\"\",'Tx236'!$F$104)","v":""},"Sampled Date ",{"$f":"IF('Tx236'!$B$104=\"\",\"\",'Tx236'!$B$104)","v":"TX221"}]
[316,{"$f":"IF('Tx236'!$C$106=\"\",\"\",'Tx236'!$C$106)","v":""},"Sampled By ",{"$f":"IF('Tx236'!$B$106=\"\",\"\",'Tx236'!$B$106)","v":"TX222"}]
[317,{"$f":"IF('Tx236'!$F$106=\"\",\"\",'Tx236'!$F$106)","v":""},"Sampled Date ",{"$f":"IF('Tx236'!$B$106=\"\",\"\",'Tx236'!$B$106)","v":"TX222"}]

{"sheet":"Summary","index":2,"n_rows":60,"n_cols":11,"rows_kept":60,"cut":false,"hidden":false,"merged":[[60,1,61,6],[22,4,22,5],[35,4,36,4],[35,5,36,5],[38,0,38,9],[40,1,42,1],[55,1,55,2],[40,9,42,9],[55,9,56,10],[56,1,56,2],[57,1,57,2],[39,2,39,8],[40,2,42,2],[40,7,41,7],[40,8,41,8],[55,3,55,4],[11,7,11,8],[16,3,16,8],[17,7,17,8],[17,3,17,4],[55,5,55,6],[55,7,55,8],[21,3,21,6],[40,3,41,3],[40,4,41,4],[40,5,41,5],[40,6,41,6],[57,9,57,10],[54,1,54,10],[8,3,8,4],[9,3,9,4],[10,3,10,4],[11,3,11,4],[12,7,12,8],[13,7,13,8],[14,7,14,8],[15,3,15,8],[12,3,12,4],[13,3,13,4],[14,3,14,4],[8,7,8,8],[9,7,9,8],[10,7,10,8]]}
[null,"TEXAS DEPARTMENT OF TRANSPORTATION",null,null,null,null,null,null,null,null,209]
[]
[null,"SUMMARY SHEET"]
[]
[null,"TEX-236-F"]
[]
[null,"Print Copy"]
[]
[null,null,"SAMPLE ID:",{"$f":"IF(SampleId=\"\",\"\",SampleId)","v":""},null,null,"SAMPLED DATE:",{"$f":"IF(SampledDate=\"\",\"\",SampledDate)","v":""}]
[null,null,"TEST NUMBER:",{"$f":"IF(TestNumber=\"\",\"\",TestNumber)","v":""},null,null,"LETTING DATE:",{"$f":"IF(LettingDate=\"\",\"\",LettingDate)","v":""}]
[null,null,"SAMPLE STATUS:",{"$f":"IF(Status=\"\",\"\",Status)","v":""},null,null,"CONTROLLING CSJ:",{"$f":"IF(CCSJ=\"\",\"\",CCSJ)","v":""}]
[null,null,"COUNTY:",{"$f":"IF(County=\"\",\"\",County)","v":""},null,null,"SPEC YEAR:",{"$f":"IF(SpecYear=\"\",\"\",SpecYear)","v":""}]
[null,null,"SAMPLED BY:",{"$f":"IF(SampledBy=\"\",\"\",SampledBy)","v":""},null,null,"SPEC ITEM:",{"$f":"IF(SpecItem=\"\",\"\",SpecItem)","v":""}]
[null,null,"SAMPLE LOCATION:",{"$f":"IF(SampleLocation=\"\",\"\",SampleLocation)","v":""},null,null,"SPECIAL PROVISION:",{"$f":"IF(SpecialProvision=\"\",\"\",SpecialProvision)","v":""}]
[null,null,"MATERIAL CODE:",{"$f":"IF(Material=\"\",\"\",Material)","v":""},null,null,"MIX TYPE:",{"$f":"IF(Grade=\"\",\"\",Grade)","v":""}]
[null,null,"MATERIAL NAME:",{"$f":"IF(matl_nm=\"\",\"\",matl_nm)","v":""}]
[null,null,"PRODUCER:",{"$f":"IF(Producer=\"\",\"\",Producer)","v":""}]
[null,null,"AREA ENGINEER:",{"$f":"IF(AreaEngineer=\"\",\"\",AreaEngineer)","v":""},null,null,"PROJECT MANAGER:",{"$f":"IF(ProjectManager=\"\",\"\",ProjectManager)","v":""}]
[]
[null,null,"COURSE\\LIFT:",{"$f":"IF(CourseLift=\"\",\"\",CourseLift)","v":""},"STATION:",{"$f":"IF(Station=\"\",\"\",Station)","v":""},null,"DIST. FROM CL:",{"$f":"IF(DistFromCL=\"\",\"\",DistFromCL)","v":""}]
[]
[null,null,null,"CORRECTION FACTORS"]
[null,null,null,null,"Aggregate Gradation "]
[null,null,null,null,{"$f":"IF(version>2,IF(Sieve1=\"\",\"\",Sieve1),IF(SSieve1=\"\",\"\",SSieve1))","v":""},{"$f":"IF(Factor1=\"\",\"\",Factor1)","v":""}]
[null,null,null,null,{"$f":"IF(version>2,IF(Sieve2=\"\",\"\",Sieve2),IF(SSieve2=\"\",\"\",SSieve2))","v":""},{"$f":"IF(Factor2=\"\",\"\",Factor2)","v":""}]
[null,null,null,null,{"$f":"IF(version>2,IF(Sieve3=\"\",\"\",Sieve3),IF(SSieve3=\"\",\"\",SSieve3))","v":""},{"$f":"IF(Factor3=\"\",\"\",Factor3)","v":""}]
[null,null,null,null,{"$f":"IF(version>2,IF(Sieve4=\"\",\"\",Sieve4),IF(SSieve4=\"\",\"\",SSieve4))","v":""},{"$f":"IF(Factor4=\"\",\"\",Factor4)","v":""}]
[null,null,null,null,{"$f":"IF(version>2,IF(Sieve5=\"\",\"\",Sieve5),IF(SSieve5=\"\",\"\",SSieve5))","v":""},{"$f":"IF(Factor5=\"\",\"\",Factor5)","v":""}]
[null,null,null,null,{"$f":"IF(version>2,IF(Sieve6=\"\",\"\",Sieve6),IF(SSieve6=\"\",\"\",SSieve6))","v":""},{"$f":"IF(Factor6=\"\",\"\",Factor6)","v":""}]
[null,null,null,null,{"$f":"IF(version>2,IF(Sieve7=\"\",\"\",Sieve7),IF(SSieve7=\"\",\"\",SSieve7))","v":""},{"$f":"IF(Factor7=\"\",\"\",Factor7)","v":""}]
[null,null,null,null,{"$f":"IF(version>2,IF(Sieve8=\"\",\"\",Sieve8),IF(SSieve8=\"\",\"\",SSieve8))","v":""},{"$f":"IF(Factor8=\"\",\"\",Factor8)","v":""}]
[null,null,null,null,{"$f":"IF(version>2,IF(Sieve9=\"\",\"\",Sieve9),IF(SSieve9=\"\",\"\",SSieve9))","v":""},{"$f":"IF(Factor9=\"\",\"\",Factor9)","v":""}]
[null,null,null,null,{"$f":"IF(version>2,IF(Sieve10=\"\",\"\",Sieve10),IF(SSieve10=\"\",\"\",SSieve10))","v":""},{"$f":"IF(Factor10=\"\",\"\",Factor10)","v":""}]
[null,null,null,null,{"$f":"IF(version>2,IF(Sieve11=\"\",\"\",Sieve11),IF(SSieve11=\"\",\"\",SSieve11))","v":""},{"$f":"IF(Factor11=\"\",\"\",Factor11)","v":""}]
[]
[null,null,null,null,"Asphalt Content ",{"$f":"IF(ACFactor=\"\",\"\",ACFactor)","v":""}]
[]
[]
["AGGREGATE GRADATION CORRECTION FACTOR CALCULATIONS"]
[null,null,{"$f":"IF(Grade=\"Microsurfacing\",\"Cumulative Percent Retained, %\",\"Total Percent Passing, %\")","v":"Total Percent Passing, %"}]
[null,"Sieve Size","Combined Gradation","Ignited Sample 1","Ignited Sample 2",{"$f":"IF(version>=5,\"Ignited Sample 1\",\"Ignited Sample 3\")","v":"Ignited Sample 1"},{"$f":"IF(version>=5,\"Ignited Sample 2\",\"Ignited Sample 4\")","v":"Ignited Sample 2"},"Ignited Sample 5","Ignited Sample 6","Correction Factor"]
[]
[null,null,null,{"$f":"'Tx236'!F26","v":"@OAC-0.5%AC"},{"$f":"'Tx236'!G26","v":"@OAC-0.5%AC"},{"$f":"'Tx236'!H26","v":"@OAC"},{"$f":"'Tx236'!I26","v":"@OAC"},{"$f":"'Tx236'!J26","v":"@OAC+0.5%AC"},{"$f":"'Tx236'!K26","v":"@OAC+0.5%AC"}]
[null,{"$f":"IF(version>2,IF(Sieve1=\"\",\"\",Sieve1),IF(SSieve1=\"\",\"\",SSieve1))","v":""},{"$f":"IF('Tx236'!C72=\"\",\"\",'Tx236'!C72)","v":""},{"$f":"IF('Tx236'!E72=\"\",\"\",'Tx236'!E72)","v":""},{"$f":"IF('Tx236'!F72=\"\",\"\",'Tx236'!F72)","v":""},{"$f":"IF('Tx236'!G72=\"\",\"\",'Tx236'!G72)","v":""},{"$f":"IF('Tx236'!H72=\"\",\"\",'Tx236'!H72)","v":""},{"$f":"IF('Tx236'!I72=\"\",\"\",'Tx236'!I72)","v":""},{"$f":"IF('Tx236'!J72=\"\",\"\",'Tx236'!J72)","v":""},{"$f":"IF(Factor1=\"\",\"\",Factor1)","v":""}]
[null,{"$f":"IF(version>2,IF(Sieve2=\"\",\"\",Sieve2),IF(SSieve2=\"\",\"\",SSieve2))","v":""},{"$f":"IF('Tx236'!C73=\"\",\"\",'Tx236'!C73)","v":""},{"$f":"IF('Tx236'!E73=\"\",\"\",'Tx236'!E73)","v":""},{"$f":"IF('Tx236'!F73=\"\",\"\",'Tx236'!F73)","v":""},{"$f":"IF('Tx236'!G73=\"\",\"\",'Tx236'!G73)","v":""},{"$f":"IF('Tx236'!H73=\"\",\"\",'Tx236'!H73)","v":""},{"$f":"IF('Tx236'!I73=\"\",\"\",'Tx236'!I73)","v":""},{"$f":"IF('Tx236'!J73=\"\",\"\",'Tx236'!J73)","v":""},{"$f":"IF(Factor2=\"\",\"\",Factor2)","v":""}]
[null,{"$f":"IF(version>2,IF(Sieve3=\"\",\"\",Sieve3),IF(SSieve3=\"\",\"\",SSieve3))","v":""},{"$f":"IF('Tx236'!C74=\"\",\"\",'Tx236'!C74)","v":""},{"$f":"IF('Tx236'!E74=\"\",\"\",'Tx236'!E74)","v":""},{"$f":"IF('Tx236'!F74=\"\",\"\",'Tx236'!F74)","v":""},{"$f":"IF('Tx236'!G74=\"\",\"\",'Tx236'!G74)","v":""},{"$f":"IF('Tx236'!H74=\"\",\"\",'Tx236'!H74)","v":""},{"$f":"IF('Tx236'!I74=\"\",\"\",'Tx236'!I74)","v":""},{"$f":"IF('Tx236'!J74=\"\",\"\",'Tx236'!J74)","v":""},{"$f":"IF(Factor3=\"\",\"\",Factor3)","v":""}]
[null,{"$f":"IF(version>2,IF(Sieve4=\"\",\"\",Sieve4),IF(SSieve4=\"\",\"\",SSieve4))","v":""},{"$f":"IF('Tx236'!C75=\"\",\"\",'Tx236'!C75)","v":""},{"$f":"IF('Tx236'!E75=\"\",\"\",'Tx236'!E75)","v":""},{"$f":"IF('Tx236'!F75=\"\",\"\",'Tx236'!F75)","v":""},{"$f":"IF('Tx236'!G75=\"\",\"\",'Tx236'!G75)","v":""},{"$f":"IF('Tx236'!H75=\"\",\"\",'Tx236'!H75)","v":""},{"$f":"IF('Tx236'!I75=\"\",\"\",'Tx236'!I75)","v":""},{"$f":"IF('Tx236'!J75=\"\",\"\",'Tx236'!J75)","v":""},{"$f":"IF(Factor4=\"\",\"\",Factor4)","v":""}]
[null,{"$f":"IF(version>2,IF(Sieve5=\"\",\"\",Sieve5),IF(SSieve5=\"\",\"\",SSieve5))","v":""},{"$f":"IF('Tx236'!C76=\"\",\"\",'Tx236'!C76)","v":""},{"$f":"IF('Tx236'!E76=\"\",\"\",'Tx236'!E76)","v":""},{"$f":"IF('Tx236'!F76=\"\",\"\",'Tx236'!F76)","v":""},{"$f":"IF('Tx236'!G76=\"\",\"\",'Tx236'!G76)","v":""},{"$f":"IF('Tx236'!H76=\"\",\"\",'Tx236'!H76)","v":""},{"$f":"IF('Tx236'!I76=\"\",\"\",'Tx236'!I76)","v":""},{"$f":"IF('Tx236'!J76=\"\",\"\",'Tx236'!J76)","v":""},{"$f":"IF(Factor5=\"\",\"\",Factor5)","v":""}]
[null,{"$f":"IF(version>2,IF(Sieve6=\"\",\"\",Sieve6),IF(SSieve6=\"\",\"\",SSieve6))","v":""},{"$f":"IF('Tx236'!C77=\"\",\"\",'Tx236'!C77)","v":""},{"$f":"IF('Tx236'!E77=\"\",\"\",'Tx236'!E77)","v":""},{"$f":"IF('Tx236'!F77=\"\",\"\",'Tx236'!F77)","v":""},{"$f":"IF('Tx236'!G77=\"\",\"\",'Tx236'!G77)","v":""},{"$f":"IF('Tx236'!H77=\"\",\"\",'Tx236'!H77)","v":""},{"$f":"IF('Tx236'!I77=\"\",\"\",'Tx236'!I77)","v":""},{"$f":"IF('Tx236'!J77=\"\",\"\",'Tx236'!J77)","v":""},{"$f":"IF(Factor6=\"\",\"\",Factor6)","v":""}]
[null,{"$f":"IF(version>2,IF(Sieve7=\"\",\"\",Sieve7),IF(SSieve7=\"\",\"\",SSieve7))","v":""},{"$f":"IF('Tx236'!C78=\"\",\"\",'Tx236'!C78)","v":""},{"$f":"IF('Tx236'!E78=\"\",\"\",'Tx236'!E78)","v":""},{"$f":"IF('Tx236'!F78=\"\",\"\",'Tx236'!F78)","v":""},{"$f":"IF('Tx236'!G78=\"\",\"\",'Tx236'!G78)","v":""},{"$f":"IF('Tx236'!H78=\"\",\"\",'Tx236'!H78)","v":""},{"$f":"IF('Tx236'!I78=\"\",\"\",'Tx236'!I78)","v":""},{"$f":"IF('Tx236'!J78=\"\",\"\",'Tx236'!J78)","v":""},{"$f":"IF(Factor7=\"\",\"\",Factor7)","v":""}]
[null,{"$f":"IF(version>2,IF(Sieve8=\"\",\"\",Sieve8),IF(SSieve8=\"\",\"\",SSieve8))","v":""},{"$f":"IF('Tx236'!C79=\"\",\"\",'Tx236'!C79)","v":""},{"$f":"IF('Tx236'!E79=\"\",\"\",'Tx236'!E79)","v":""},{"$f":"IF('Tx236'!F79=\"\",\"\",'Tx236'!F79)","v":""},{"$f":"IF('Tx236'!G79=\"\",\"\",'Tx236'!G79)","v":""},{"$f":"IF('Tx236'!H79=\"\",\"\",'Tx236'!H79)","v":""},{"$f":"IF('Tx236'!I79=\"\",\"\",'Tx236'!I79)","v":""},{"$f":"IF('Tx236'!J79=\"\",\"\",'Tx236'!J79)","v":""},{"$f":"IF(Factor8=\"\",\"\",Factor8)","v":""}]
[null,{"$f":"IF(version>2,IF(Sieve9=\"\",\"\",Sieve9),IF(SSieve9=\"\",\"\",SSieve9))","v":""},{"$f":"IF('Tx236'!C80=\"\",\"\",'Tx236'!C80)","v":""},{"$f":"IF('Tx236'!E80=\"\",\"\",'Tx236'!E80)","v":""},{"$f":"IF('Tx236'!F80=\"\",\"\",'Tx236'!F80)","v":""},{"$f":"IF('Tx236'!G80=\"\",\"\",'Tx236'!G80)","v":""},{"$f":"IF('Tx236'!H80=\"\",\"\",'Tx236'!H80)","v":""},{"$f":"IF('Tx236'!I80=\"\",\"\",'Tx236'!I80)","v":""},{"$f":"IF('Tx236'!J80=\"\",\"\",'Tx236'!J80)","v":""},{"$f":"IF(Factor9=\"\",\"\",Factor9)","v":""}]
[null,{"$f":"IF(version>2,IF(Sieve10=\"\",\"\",Sieve10),IF(SSieve10=\"\",\"\",SSieve10))","v":""},{"$f":"IF('Tx236'!C81=\"\",\"\",'Tx236'!C81)","v":""},{"$f":"IF('Tx236'!E81=\"\",\"\",'Tx236'!E81)","v":""},{"$f":"IF('Tx236'!F81=\"\",\"\",'Tx236'!F81)","v":""},{"$f":"IF('Tx236'!G81=\"\",\"\",'Tx236'!G81)","v":""},{"$f":"IF('Tx236'!H81=\"\",\"\",'Tx236'!H81)","v":""},{"$f":"IF('Tx236'!I81=\"\",\"\",'Tx236'!I81)","v":""},{"$f":"IF('Tx236'!J81=\"\",\"\",'Tx236'!J81)","v":""},{"$f":"IF(Factor10=\"\",\"\",Factor10)","v":""}]
[null,{"$f":"IF(version>2,IF(Sieve11=\"\",\"\",Sieve11),IF(SSieve11=\"\",\"\",SSieve11))","v":""},{"$f":"IF('Tx236'!C82=\"\",\"\",'Tx236'!C82)","v":""},{"$f":"IF('Tx236'!E82=\"\",\"\",'Tx236'!E82)","v":""},{"$f":"IF('Tx236'!F82=\"\",\"\",'Tx236'!F82)","v":""},{"$f":"IF('Tx236'!G82=\"\",\"\",'Tx236'!G82)","v":""},{"$f":"IF('Tx236'!H82=\"\",\"\",'Tx236'!H82)","v":""},{"$f":"IF('Tx236'!I82=\"\",\"\",'Tx236'!I82)","v":""},{"$f":"IF('Tx236'!J82=\"\",\"\",'Tx236'!J82)","v":""},{"$f":"IF(Factor11=\"\",\"\",Factor11)","v":""}]
[null,"ASPHALT CONTENT CORRECTION FACTOR CALCULATIONS"]
[null,{"$f":"IF(Field106<>\"\",IF(IF(version>=5,OR( Field103<>OAC,Field104<>OAC),OR(Field101<>OAC-0.5,Field102<>OAC-0.5, Field103<>OAC,Field104<>OAC, Field105<>OAC+0.5,Field106<>OAC+0.5)),\"Does not comply with Tex-236-F\",\"\"),\"\")","v":""},null,{"$f":"'Tx236'!F26","v":"@OAC-0.5%AC"},null,{"$f":"'Tx236'!H26","v":"@OAC"},null,{"$f":"'Tx236'!J26","v":"@OAC+0.5%AC"},null,"AVG Difference Target-Measured"]
[null,"Target AC %",null,{"$f":"IF('Tx236'!E86=\"\",\"\",'Tx236'!E86)","v":""},{"$f":"IF('Tx236'!F86=\"\",\"\",'Tx236'!F86)","v":""},{"$f":"IF('Tx236'!G86=\"\",\"\",'Tx236'!G86)","v":""},{"$f":"IF('Tx236'!H86=\"\",\"\",'Tx236'!H86)","v":""},{"$f":"IF('Tx236'!I86=\"\",\"\",'Tx236'!I86)","v":""},{"$f":"IF('Tx236'!J86=\"\",\"\",'Tx236'!J86)","v":""}]
[null,"Measured AC %",null,{"$f":"IF('Tx236'!E87=\"\",\"\",'Tx236'!E87)","v":""},{"$f":"IF('Tx236'!F87=\"\",\"\",'Tx236'!F87)","v":""},{"$f":"IF('Tx236'!G87=\"\",\"\",'Tx236'!G87)","v":""},{"$f":"IF('Tx236'!H87=\"\",\"\",'Tx236'!H87)","v":""},{"$f":"IF('Tx236'!I87=\"\",\"\",'Tx236'!I87)","v":""},{"$f":"IF('Tx236'!J87=\"\",\"\",'Tx236'!J87)","v":""},{"$f":"IF(ACFactor=\"\",\"\",ACFactor)","v":""}]
[]
[null,"Remarks:"]

{"sheet":"Sheet1","index":3,"n_rows":30,"n_cols":14,"rows_kept":30,"cut":false,"hidden":true,"merged":[[0,6,1,7],[0,8,1,9],[0,10,1,11],[16,0,16,2],[16,3,16,5],[0,0,1,1],[0,2,1,3],[0,4,1,5]]}
[{"$f":"'Tx236'!F23","v":"Ignited Sample 1"},null,{"$f":"'Tx236'!G23","v":"Ignited Sample 2"},null,{"$f":"'Tx236'!H23","v":"Ignited Sample 1"},null,{"$f":"'Tx236'!I23","v":"Ignited Sample 2"},null,{"$f":"'Tx236'!J23","v":"Ignited Sample 5"},null,{"$f":"'Tx236'!K23","v":"Ignited     Sample 6"}]
[]
["Individual","Cumulative","Individual","Cumulative","Individual","Cumulative","Individual","Cumulative","Individual","Cumulative","Individual","Cumulative"]
[{"$f":"+IF(OR(WeightIgnited1=\"\",Cumulative=\"Yes\"),\"\",('Tx236'!F29/WeightIgnited1)*100)","v":""},{"$f":"IF(WeightIgnited1=\"\",\"\",IF(Cumulative=\"\",A4,('Tx236'!F29/WeightIgnited1)*100))","v":""},{"$f":"+IF(OR(WeightIgnited2=\"\",Cumulative=\"Yes\"),\"\",('Tx236'!G29/WeightIgnited2)*100)","v":""},{"$f":"IF(WeightIgnited2=\"\",\"\",IF(Cumulative=\"\",C4,('Tx236'!G29/WeightIgnited2)*100))","v":""},{"$f":"+IF(OR(WeightIgnited3=\"\",Cumulative=\"Yes\"),\"\",('Tx236'!H29/WeightIgnited3)*100)","v":""},{"$f":"IF(WeightIgnited3=\"\",\"\",IF(Cumulative=\"\",E4,('Tx236'!H29/WeightIgnited3)*100))","v":""},{"$f":"+IF(OR(WeightIgnited4=\"\",Cumulative=\"Yes\"),\"\",('Tx236'!I29/WeightIgnited4)*100)","v":""},{"$f":"IF(WeightIgnited4=\"\",\"\",IF(Cumulative=\"\",G4,('Tx236'!I29/WeightIgnited4)*100))","v":""},{"$f":"+IF(OR(WeightIgnited5=\"\",Cumulative=\"Yes\"),\"\",('Tx236'!J29/WeightIgnited5)*100)","v":""},{"$f":"IF(WeightIgnited5=\"\",\"\",IF(Cumulative=\"\",I4,('Tx236'!J29/WeightIgnited5)*100))","v":""},{"$f":"+IF(OR(WeightIgnited6=\"\",Cumulative=\"Yes\"),\"\",('Tx236'!K29/WeightIgnited6)*100)","v":""},{"$f":"IF(WeightIgnited6=\"\",\"\",IF(Cumulative=\"\",K4,('Tx236'!K29/WeightIgnited6)*100))","v":""}]
[{"$f":"+IF(OR(WeightIgnited1=\"\",Cumulative=\"Yes\"),\"\",('Tx236'!F30/WeightIgnited1)*100)","v":""},{"$f":"IF(WeightIgnited1=\"\",\"\",IF(Cumulative=\"\",(A5+B4),('Tx236'!F30/WeightIgnited1)*100))","v":""},{"$f":"+IF(OR(WeightIgnited2=\"\",Cumulative=\"Yes\"),\"\",('Tx236'!G30/WeightIgnited2)*100)","v":""},{"$f":"IF(WeightIgnited2=\"\",\"\",IF(Cumulative=\"\",(C5+D4),('Tx236'!G30/WeightIgnited2)*100))","v":""},{"$f":"+IF(OR(WeightIgnited3=\"\",Cumulative=\"Yes\"),\"\",('Tx236'!H30/WeightIgnited3)*100)","v":""},{"$f":"IF(WeightIgnited3=\"\",\"\",IF(Cumulative=\"\",(E5+F4),('Tx236'!H30/WeightIgnited3)*100))","v":""},{"$f":"+IF(OR(WeightIgnited4=\"\",Cumulative=\"Yes\"),\"\",('Tx236'!I30/WeightIgnited4)*100)","v":""},{"$f":"IF(WeightIgnited4=\"\",\"\",IF(Cumulative=\"\",(G5+H4),('Tx236'!I30/WeightIgnited4)*100))","v":""},{"$f":"+IF(OR(WeightIgnited5=\"\",Cumulative=\"Yes\"),\"\",('Tx236'!J30/WeightIgnited5)*100)","v":""},{"$f":"IF(WeightIgnited5=\"\",\"\",IF(Cumulative=\"\",(I5+J4),('Tx236'!J30/WeightIgnited5)*100))","v":""},{"$f":"+IF(OR(WeightIgnited6=\"\",Cumulative=\"Yes\"),\"\",('Tx236'!K30/WeightIgnited6)*100)","v":""},{"$f":"IF(WeightIgnited6=\"\",\"\",IF(Cumulative=\"\",(K5+L4),('Tx236'!K30/WeightIgnited6)*100))","v":""}]
[{"$f":"+IF(OR(WeightIgnited1=\"\",Cumulative=\"Yes\"),\"\",('Tx236'!F31/WeightIgnited1)*100)","v":""},{"$f":"IF(WeightIgnited1=\"\",\"\",IF(Cumulative=\"\",(A6+B5),('Tx236'!F31/WeightIgnited1)*100))","v":""},{"$f":"+IF(OR(WeightIgnited2=\"\",Cumulative=\"Yes\"),\"\",('Tx236'!G31/WeightIgnited2)*100)","v":""},{"$f":"IF(WeightIgnited2=\"\",\"\",IF(Cumulative=\"\",(C6+D5),('Tx236'!G31/WeightIgnited2)*100))","v":""},{"$f":"+IF(OR(WeightIgnited3=\"\",Cumulative=\"Yes\"),\"\",('Tx236'!H31/WeightIgnited3)*100)","v":""},{"$f":"IF(WeightIgnited3=\"\",\"\",IF(Cumulative=\"\",(E6+F5),('Tx236'!H31/WeightIgnited3)*100))","v":""},{"$f":"+IF(OR(WeightIgnited4=\"\",Cumulative=\"Yes\"),\"\",('Tx236'!I31/WeightIgnited4)*100)","v":""},{"$f":"IF(WeightIgnited4=\"\",\"\",IF(Cumulative=\"\",(G6+H5),('Tx236'!I31/WeightIgnited4)*100))","v":""},{"$f":"+IF(OR(WeightIgnited5=\"\",Cumulative=\"Yes\"),\"\",('Tx236'!J31/WeightIgnited5)*100)","v":""},{"$f":"IF(WeightIgnited5=\"\",\"\",IF(Cumulative=\"\",(I6+J5),('Tx236'!J31/WeightIgnited5)*100))","v":""},{"$f":"+IF(OR(WeightIgnited6=\"\",Cumulative=\"Yes\"),\"\",('Tx236'!K31/WeightIgnited6)*100)","v":""},{"$f":"IF(WeightIgnited6=\"\",\"\",IF(Cumulative=\"\",(K6+L5),('Tx236'!K31/WeightIgnited6)*100))","v":""}]
[{"$f":"+IF(OR(WeightIgnited1=\"\",Cumulative=\"Yes\"),\"\",('Tx236'!F32/WeightIgnited1)*100)","v":""},{"$f":"IF(WeightIgnited1=\"\",\"\",IF(Cumulative=\"\",(A7+B6),('Tx236'!F32/WeightIgnited1)*100))","v":""},{"$f":"+IF(OR(WeightIgnited2=\"\",Cumulative=\"Yes\"),\"\",('Tx236'!G32/WeightIgnited2)*100)","v":""},{"$f":"IF(WeightIgnited2=\"\",\"\",IF(Cumulative=\"\",(C7+D6),('Tx236'!G32/WeightIgnited2)*100))","v":""},{"$f":"+IF(OR(WeightIgnited3=\"\",Cumulative=\"Yes\"),\"\",('Tx236'!H32/WeightIgnited3)*100)","v":""},{"$f":"IF(WeightIgnited3=\"\",\"\",IF(Cumulative=\"\",(E7+F6),('Tx236'!H32/WeightIgnited3)*100))","v":""},{"$f":"+IF(OR(WeightIgnited4=\"\",Cumulative=\"Yes\"),\"\",('Tx236'!I32/WeightIgnited4)*100)","v":""},{"$f":"IF(WeightIgnited4=\"\",\"\",IF(Cumulative=\"\",(G7+H6),('Tx236'!I32/WeightIgnited4)*100))","v":""},{"$f":"+IF(OR(WeightIgnited5=\"\",Cumulative=\"Yes\"),\"\",('Tx236'!J32/WeightIgnited5)*100)","v":""},{"$f":"IF(WeightIgnited5=\"\",\"\",IF(Cumulative=\"\",(I7+J6),('Tx236'!J32/WeightIgnited5)*100))","v":""},{"$f":"+IF(OR(WeightIgnited6=\"\",Cumulative=\"Yes\"),\"\",('Tx236'!K32/WeightIgnited6)*100)","v":""},{"$f":"IF(WeightIgnited6=\"\",\"\",IF(Cumulative=\"\",(K7+L6),('Tx236'!K32/WeightIgnited6)*100))","v":""}]
[{"$f":"+IF(OR(WeightIgnited1=\"\",Cumulative=\"Yes\"),\"\",('Tx236'!F33/WeightIgnited1)*100)","v":""},{"$f":"IF(WeightIgnited1=\"\",\"\",IF(Cumulative=\"\",(A8+B7),('Tx236'!F33/WeightIgnited1)*100))","v":""},{"$f":"+IF(OR(WeightIgnited2=\"\",Cumulative=\"Yes\"),\"\",('Tx236'!G33/WeightIgnited2)*100)","v":""},{"$f":"IF(WeightIgnited2=\"\",\"\",IF(Cumulative=\"\",(C8+D7),('Tx236'!G33/WeightIgnited2)*100))","v":""},{"$f":"+IF(OR(WeightIgnited3=\"\",Cumulative=\"Yes\"),\"\",('Tx236'!H33/WeightIgnited3)*100)","v":""},{"$f":"IF(WeightIgnited3=\"\",\"\",IF(Cumulative=\"\",(E8+F7),('Tx236'!H33/WeightIgnited3)*100))","v":""},{"$f":"+IF(OR(WeightIgnited4=\"\",Cumulative=\"Yes\"),\"\",('Tx236'!I33/WeightIgnited4)*100)","v":""},{"$f":"IF(WeightIgnited4=\"\",\"\",IF(Cumulative=\"\",(G8+H7),('Tx236'!I33/WeightIgnited4)*100))","v":""},{"$f":"+IF(OR(WeightIgnited5=\"\",Cumulative=\"Yes\"),\"\",('Tx236'!J33/WeightIgnited5)*100)","v":""},{"$f":"IF(WeightIgnited5=\"\",\"\",IF(Cumulative=\"\",(I8+J7),('Tx236'!J33/WeightIgnited5)*100))","v":""},{"$f":"+IF(OR(WeightIgnited6=\"\",Cumulative=\"Yes\"),\"\",('Tx236'!K33/WeightIgnited6)*100)","v":""},{"$f":"IF(WeightIgnited6=\"\",\"\",IF(Cumulative=\"\",(K8+L7),('Tx236'!K33/WeightIgnited6)*100))","v":""}]
[{"$f":"+IF(OR(WeightIgnited1=\"\",Cumulative=\"Yes\"),\"\",('Tx236'!F34/WeightIgnited1)*100)","v":""},{"$f":"IF(WeightIgnited1=\"\",\"\",IF(Cumulative=\"\",(A9+B8),('Tx236'!F34/WeightIgnited1)*100))","v":""},{"$f":"+IF(OR(WeightIgnited2=\"\",Cumulative=\"Yes\"),\"\",('Tx236'!G34/WeightIgnited2)*100)","v":""},{"$f":"IF(WeightIgnited2=\"\",\"\",IF(Cumulative=\"\",(C9+D8),('Tx236'!G34/WeightIgnited2)*100))","v":""},{"$f":"+IF(OR(WeightIgnited3=\"\",Cumulative=\"Yes\"),\"\",('Tx236'!H34/WeightIgnited3)*100)","v":""},{"$f":"IF(WeightIgnited3=\"\",\"\",IF(Cumulative=\"\",(E9+F8),('Tx236'!H34/WeightIgnited3)*100))","v":""},{"$f":"+IF(OR(WeightIgnited4=\"\",Cumulative=\"Yes\"),\"\",('Tx236'!I34/WeightIgnited4)*100)","v":""},{"$f":"IF(WeightIgnited4=\"\",\"\",IF(Cumulative=\"\",(G9+H8),('Tx236'!I34/WeightIgnited4)*100))","v":""},{"$f":"+IF(OR(WeightIgnited5=\"\",Cumulative=\"Yes\"),\"\",('Tx236'!J34/WeightIgnited5)*100)","v":""},{"$f":"IF(WeightIgnited5=\"\",\"\",IF(Cumulative=\"\",(I9+J8),('Tx236'!J34/WeightIgnited5)*100))","v":""},{"$f":"+IF(OR(WeightIgnited6=\"\",Cumulative=\"Yes\"),\"\",('Tx236'!K34/WeightIgnited6)*100)","v":""},{"$f":"IF(WeightIgnited6=\"\",\"\",IF(Cumulative=\"\",(K9+L8),('Tx236'!K34/WeightIgnited6)*100))","v":""}]
[{"$f":"+IF(OR(WeightIgnited1=\"\",Cumulative=\"Yes\"),\"\",('Tx236'!F35/WeightIgnited1)*100)","v":""},{"$f":"IF(WeightIgnited1=\"\",\"\",IF(Cumulative=\"\",(A10+B9),('Tx236'!F35/WeightIgnited1)*100))","v":""},{"$f":"+IF(OR(WeightIgnited2=\"\",Cumulative=\"Yes\"),\"\",('Tx236'!G35/WeightIgnited2)*100)","v":""},{"$f":"IF(WeightIgnited2=\"\",\"\",IF(Cumulative=\"\",(C10+D9),('Tx236'!G35/WeightIgnited2)*100))","v":""},{"$f":"+IF(OR(WeightIgnited3=\"\",Cumulative=\"Yes\"),\"\",('Tx236'!H35/WeightIgnited3)*100)","v":""},{"$f":"IF(WeightIgnited3=\"\",\"\",IF(Cumulative=\"\",(E10+F9),('Tx236'!H35/WeightIgnited3)*100))","v":""},{"$f":"+IF(OR(WeightIgnited4=\"\",Cumulative=\"Yes\"),\"\",('Tx236'!I35/WeightIgnited4)*100)","v":""},{"$f":"IF(WeightIgnited4=\"\",\"\",IF(Cumulative=\"\",(G10+H9),('Tx236'!I35/WeightIgnited4)*100))","v":""},{"$f":"+IF(OR(WeightIgnited5=\"\",Cumulative=\"Yes\"),\"\",('Tx236'!J35/WeightIgnited5)*100)","v":""},{"$f":"IF(WeightIgnited5=\"\",\"\",IF(Cumulative=\"\",(I10+J9),('Tx236'!J35/WeightIgnited5)*100))","v":""},{"$f":"+IF(OR(WeightIgnited6=\"\",Cumulative=\"Yes\"),\"\",('Tx236'!K35/WeightIgnited6)*100)","v":""},{"$f":"IF(WeightIgnited6=\"\",\"\",IF(Cumulative=\"\",(K10+L9),('Tx236'!K35/WeightIgnited6)*100))","v":""}]
[{"$f":"+IF(OR(WeightIgnited1=\"\",Cumulative=\"Yes\"),\"\",('Tx236'!F36/WeightIgnited1)*100)","v":""},{"$f":"IF(WeightIgnited1=\"\",\"\",IF(Cumulative=\"\",(A11+B10),('Tx236'!F36/WeightIgnited1)*100))","v":""},{"$f":"+IF(OR(WeightIgnited2=\"\",Cumulative=\"Yes\"),\"\",('Tx236'!G36/WeightIgnited2)*100)","v":""},{"$f":"IF(WeightIgnited2=\"\",\"\",IF(Cumulative=\"\",(C11+D10),('Tx236'!G36/WeightIgnited2)*100))","v":""},{"$f":"+IF(OR(WeightIgnited3=\"\",Cumulative=\"Yes\"),\"\",('Tx236'!H36/WeightIgnited3)*100)","v":""},{"$f":"IF(WeightIgnited3=\"\",\"\",IF(Cumulative=\"\",(E11+F10),('Tx236'!H36/WeightIgnited3)*100))","v":""},{"$f":"+IF(OR(WeightIgnited4=\"\",Cumulative=\"Yes\"),\"\",('Tx236'!I36/WeightIgnited4)*100)","v":""},{"$f":"IF(WeightIgnited4=\"\",\"\",IF(Cumulative=\"\",(G11+H10),('Tx236'!I36/WeightIgnited4)*100))","v":""},{"$f":"+IF(OR(WeightIgnited5=\"\",Cumulative=\"Yes\"),\"\",('Tx236'!J36/WeightIgnited5)*100)","v":""},{"$f":"IF(WeightIgnited5=\"\",\"\",IF(Cumulative=\"\",(I11+J10),('Tx236'!J36/WeightIgnited5)*100))","v":""},{"$f":"+IF(OR(WeightIgnited6=\"\",Cumulative=\"Yes\"),\"\",('Tx236'!K36/WeightIgnited6)*100)","v":""},{"$f":"IF(WeightIgnited6=\"\",\"\",IF(Cumulative=\"\",(K11+L10),('Tx236'!K36/WeightIgnited6)*100))","v":""}]
[{"$f":"+IF(OR(WeightIgnited1=\"\",Cumulative=\"Yes\"),\"\",('Tx236'!F37/WeightIgnited1)*100)","v":""},{"$f":"IF(WeightIgnited1=\"\",\"\",IF(Cumulative=\"\",(A12+B11),('Tx236'!F37/WeightIgnited1)*100))","v":""},{"$f":"+IF(OR(WeightIgnited2=\"\",Cumulative=\"Yes\"),\"\",('Tx236'!G37/WeightIgnited2)*100)","v":""},{"$f":"IF(WeightIgnited2=\"\",\"\",IF(Cumulative=\"\",(C12+D11),('Tx236'!G37/WeightIgnited2)*100))","v":""},{"$f":"+IF(OR(WeightIgnited3=\"\",Cumulative=\"Yes\"),\"\",('Tx236'!H37/WeightIgnited3)*100)","v":""},{"$f":"IF(WeightIgnited3=\"\",\"\",IF(Cumulative=\"\",(E12+F11),('Tx236'!H37/WeightIgnited3)*100))","v":""},{"$f":"+IF(OR(WeightIgnited4=\"\",Cumulative=\"Yes\"),\"\",('Tx236'!I37/WeightIgnited4)*100)","v":""},{"$f":"IF(WeightIgnited4=\"\",\"\",IF(Cumulative=\"\",(G12+H11),('Tx236'!I37/WeightIgnited4)*100))","v":""},{"$f":"+IF(OR(WeightIgnited5=\"\",Cumulative=\"Yes\"),\"\",('Tx236'!J37/WeightIgnited5)*100)","v":""},{"$f":"IF(WeightIgnited5=\"\",\"\",IF(Cumulative=\"\",(I12+J11),('Tx236'!J37/WeightIgnited5)*100))","v":""},{"$f":"+IF(OR(WeightIgnited6=\"\",Cumulative=\"Yes\"),\"\",('Tx236'!K37/WeightIgnited6)*100)","v":""},{"$f":"IF(WeightIgnited6=\"\",\"\",IF(Cumulative=\"\",(K12+L11),('Tx236'!K37/WeightIgnited6)*100))","v":""}]
[{"$f":"+IF(OR(WeightIgnited1=\"\",Cumulative=\"Yes\"),\"\",('Tx236'!F38/WeightIgnited1)*100)","v":""},{"$f":"IF(WeightIgnited1=\"\",\"\",IF(Cumulative=\"\",(A13+B12),('Tx236'!F38/WeightIgnited1)*100))","v":""},{"$f":"+IF(OR(WeightIgnited2=\"\",Cumulative=\"Yes\"),\"\",('Tx236'!G38/WeightIgnited2)*100)","v":""},{"$f":"IF(WeightIgnited2=\"\",\"\",IF(Cumulative=\"\",(C13+D12),('Tx236'!G38/WeightIgnited2)*100))","v":""},{"$f":"+IF(OR(WeightIgnited3=\"\",Cumulative=\"Yes\"),\"\",('Tx236'!H38/WeightIgnited3)*100)","v":""},{"$f":"IF(WeightIgnited3=\"\",\"\",IF(Cumulative=\"\",(E13+F12),('Tx236'!H38/WeightIgnited3)*100))","v":""},{"$f":"+IF(OR(WeightIgnited4=\"\",Cumulative=\"Yes\"),\"\",('Tx236'!I38/WeightIgnited4)*100)","v":""},{"$f":"IF(WeightIgnited4=\"\",\"\",IF(Cumulative=\"\",(G13+H12),('Tx236'!I38/WeightIgnited4)*100))","v":""},{"$f":"+IF(OR(WeightIgnited5=\"\",Cumulative=\"Yes\"),\"\",('Tx236'!J38/WeightIgnited5)*100)","v":""},{"$f":"IF(WeightIgnited5=\"\",\"\",IF(Cumulative=\"\",(I13+J12),('Tx236'!J38/WeightIgnited5)*100))","v":""},{"$f":"+IF(OR(WeightIgnited6=\"\",Cumulative=\"Yes\"),\"\",('Tx236'!K38/WeightIgnited6)*100)","v":""},{"$f":"IF(WeightIgnited6=\"\",\"\",IF(Cumulative=\"\",(K13+L12),('Tx236'!K38/WeightIgnited6)*100))","v":""}]
[{"$f":"+IF(OR(WeightIgnited1=\"\",Cumulative=\"Yes\"),\"\",('Tx236'!F39/WeightIgnited1)*100)","v":""},{"$f":"IF(WeightIgnited1=\"\",\"\",IF(Cumulative=\"\",(A14+B13),('Tx236'!F39/WeightIgnited1)*100))","v":""},{"$f":"+IF(OR(WeightIgnited2=\"\",Cumulative=\"Yes\"),\"\",('Tx236'!G39/WeightIgnited2)*100)","v":""},{"$f":"IF(WeightIgnited2=\"\",\"\",IF(Cumulative=\"\",(C14+D13),('Tx236'!G39/WeightIgnited2)*100))","v":""},{"$f":"+IF(OR(WeightIgnited3=\"\",Cumulative=\"Yes\"),\"\",('Tx236'!H39/WeightIgnited3)*100)","v":""},{"$f":"IF(WeightIgnited3=\"\",\"\",IF(Cumulative=\"\",(E14+F13),('Tx236'!H39/WeightIgnited3)*100))","v":""},{"$f":"+IF(OR(WeightIgnited4=\"\",Cumulative=\"Yes\"),\"\",('Tx236'!I39/WeightIgnited4)*100)","v":""},{"$f":"IF(WeightIgnited4=\"\",\"\",IF(Cumulative=\"\",(G14+H13),('Tx236'!I39/WeightIgnited4)*100))","v":""},{"$f":"+IF(OR(WeightIgnited5=\"\",Cumulative=\"Yes\"),\"\",('Tx236'!J39/WeightIgnited5)*100)","v":""},{"$f":"IF(WeightIgnited5=\"\",\"\",IF(Cumulative=\"\",(I14+J13),('Tx236'!J39/WeightIgnited5)*100))","v":""},{"$f":"+IF(OR(WeightIgnited6=\"\",Cumulative=\"Yes\"),\"\",('Tx236'!K39/WeightIgnited6)*100)","v":""},{"$f":"IF(WeightIgnited6=\"\",\"\",IF(Cumulative=\"\",(K14+L13),('Tx236'!K39/WeightIgnited6)*100))","v":""}]
[{"$f":"+IF(OR(WeightIgnited1=\"\",Cumulative=\"Yes\"),\"\",('Tx236'!F40/WeightIgnited1)*100)","v":""},{"$f":"IF(WeightIgnited1=\"\",\"\",IF(Cumulative=\"\",(A15+B14),('Tx236'!F40/WeightIgnited1)*100))","v":""},{"$f":"+IF(OR(WeightIgnited2=\"\",Cumulative=\"Yes\"),\"\",('Tx236'!G40/WeightIgnited2)*100)","v":""},{"$f":"IF(WeightIgnited2=\"\",\"\",IF(Cumulative=\"\",(C15+D14),('Tx236'!G40/WeightIgnited2)*100))","v":""},{"$f":"+IF(OR(WeightIgnited3=\"\",Cumulative=\"Yes\"),\"\",('Tx236'!H40/WeightIgnited3)*100)","v":""},{"$f":"IF(WeightIgnited3=\"\",\"\",IF(Cumulative=\"\",(E15+F14),('Tx236'!H40/WeightIgnited3)*100))","v":""},{"$f":"+IF(OR(WeightIgnited4=\"\",Cumulative=\"Yes\"),\"\",('Tx236'!I40/WeightIgnited4)*100)","v":""},{"$f":"IF(WeightIgnited4=\"\",\"\",IF(Cumulative=\"\",(G15+H14),('Tx236'!I40/WeightIgnited4)*100))","v":""},{"$f":"+IF(OR(WeightIgnited5=\"\",Cumulative=\"Yes\"),\"\",('Tx236'!J40/WeightIgnited5)*100)","v":""},{"$f":"IF(WeightIgnited5=\"\",\"\",IF(Cumulative=\"\",(I15+J14),('Tx236'!J40/WeightIgnited5)*100))","v":""},{"$f":"+IF(OR(WeightIgnited6=\"\",Cumulative=\"Yes\"),\"\",('Tx236'!K40/WeightIgnited6)*100)","v":""},{"$f":"IF(WeightIgnited6=\"\",\"\",IF(Cumulative=\"\",(K15+L14),('Tx236'!K40/WeightIgnited6)*100))","v":""}]
[]
[{"$f":"'Tx236'!D24","v":"Blank Sample"},null,null,{"$f":"'Tx236'!E24","v":"Blank  Sample 2"},null,null,"Blank","Microsufacing","Within",null,"Recycled","Blank","Combined","Within"]
["%Individual","%Cumulative","%Passing","%Individual","%Cumulative","%Passing","Average","Average","Spec",null,{"$f":"(SUM('Tx236'!C51:G51))/100","v":0},{"$f":"(100-SUM('Tx236'!C51:G51))/100","v":1},{"$f":"SUM(K18:L18)","v":1},"Spec"]
[{"$f":"+IF(OR(WeightBlank1=\"\",Cumulative=\"Yes\"),\"\",('Tx236'!D29/WeightBlank1)*100)","v":""},{"$f":"IF(A19=\"\",IF(WeightBlank1=\"\",\"\",('Tx236'!D29/WeightBlank1*100)),A19)","v":""},{"$f":"IF(B19=\"\",\"\",100-B19)","v":""},{"$f":"+IF(OR(WeightBlank2=\"\",Cumulative=\"Yes\"),\"\",('Tx236'!E29/WeightBlank2)*100)","v":""},{"$f":"IF(version>3,IF(D19=\"\",IF(WeightBlank2=\"\",\"\",('Tx236'!E29/WeightBlank2*100)),D19),IF(D19=\"\",IF(WeightBlank2=\"\",\"\",('Tx236'!D29/WeightBlank2*100)),D19))","v":""},{"$f":"IF(E19=\"\",\"\",100-E19)","v":""},{"$f":"IF(IF(version>=5,C19=\"\",OR(F19=\"\",C19=\"\")),\"\",AVERAGE(F19,C19))","v":""},{"$f":"IF(IF(version>=5,B19=\"\",OR(B19=\"\",E19=\"\")),\"\",IF(Percent_Retained=\"Yes\",AVERAGE(B19,E19),\"\"))","v":""},{"$f":"IF(ISERROR(T(INDEX(INDIRECT(Grade),1,2))),\"\",IF(OR(H19<(INDEX(INDIRECT(Grade),1,5)),H19>(INDEX(INDIRECT(Grade),1,6))),\"No\",\"Yes\"))","v":""},null,{"$f":"IF('Tx236'!H54=\"\",\"\",$K$18*'Tx236'!H54)","v":""},{"$f":"IF(G19=\"\",\"\",L$18*G19)","v":""},{"$f":"IF(L19=\"\",\"\",SUM(K19:L19))","v":""},{"$f":"IF(ISERROR(T(INDEX(INDIRECT(Grade),1,2))),\"\",IF(OR(M19<(INDEX(INDIRECT(Grade),1,5)),M19>(INDEX(INDIRECT(Grade),1,6))),\"No\",\"Yes\"))","v":""}]
[{"$f":"+IF(IF(version>=5,OR('Tx236'!$D$22=\"\",Cumulative=\"Yes\"),OR('Tx236'!$D$22=\"\",'Tx236'!$E$22=\"\",Cumulative=\"Yes\")),\"\",('Tx236'!D30/WeightBlank1)*100)","v":""},{"$f":"IF(A20=\"\",IF(WeightBlank1=\"\",\"\",('Tx236'!D30/WeightBlank1*100)),A20+B19)","v":""},{"$f":"IF(B20=\"\",\"\",100-B20)","v":""},{"$f":"+IF(OR(WeightBlank2=\"\",Cumulative=\"Yes\"),\"\",('Tx236'!E30/WeightBlank2)*100)","v":""},{"$f":"IF(version>3,IF(D20=\"\",IF(WeightBlank2=\"\",\"\",('Tx236'!E30/WeightBlank2*100)),D20+E19),IF(D20=\"\",IF(WeightBlank2=\"\",\"\",('Tx236'!D30/WeightBlank2*100)),D20+E19))","v":""},{"$f":"IF(E20=\"\",\"\",100-E20)","v":""},"","",{"$f":"IF(ISERROR(T(INDEX(INDIRECT(Grade),2,2))),\"\",IF(OR(H20<(INDEX(INDIRECT(Grade),2,5)),H20>(INDEX(INDIRECT(Grade),2,6))),\"No\",\"Yes\"))","v":""},null,{"$f":"IF('Tx236'!H55=\"\",\"\",$K$18*'Tx236'!H55)","v":""},"",{"$f":"IF(L20=\"\",\"\",SUM(K20:L20))","v":""},{"$f":"IF(ISERROR(T(INDEX(INDIRECT(Grade),2,2))),\"\",IF(OR(M20<(INDEX(INDIRECT(Grade),2,5)),M20>(INDEX(INDIRECT(Grade),2,6))),\"No\",\"Yes\"))","v":""}]
[{"$f":"+IF(IF(version>=5,OR('Tx236'!$D$22=\"\",Cumulative=\"Yes\"),OR('Tx236'!$D$22=\"\",'Tx236'!$E$22=\"\",Cumulative=\"Yes\")),\"\",('Tx236'!D31/WeightBlank1)*100)","v":""},{"$f":"IF(A21=\"\",IF(WeightBlank1=\"\",\"\",('Tx236'!D31/WeightBlank1*100)),A21+B20)","v":""},{"$f":"IF(B21=\"\",\"\",100-B21)","v":""},{"$f":"+IF(OR(WeightBlank2=\"\",Cumulative=\"Yes\"),\"\",('Tx236'!E31/WeightBlank2)*100)","v":""},{"$f":"IF(version>3,IF(D21=\"\",IF(WeightBlank2=\"\",\"\",('Tx236'!E31/WeightBlank2*100)),D21+E20),IF(D21=\"\",IF(WeightBlank2=\"\",\"\",('Tx236'!D31/WeightBlank2*100)),D21+E20))","v":""},{"$f":"IF(E21=\"\",\"\",100-E21)","v":""},"","",{"$f":"IF(ISERROR(T(INDEX(INDIRECT(Grade),3,2))),\"\",IF(OR(H21<(INDEX(INDIRECT(Grade),3,5)),H21>(INDEX(INDIRECT(Grade),3,6))),\"No\",\"Yes\"))","v":""},null,{"$f":"IF('Tx236'!H56=\"\",\"\",$K$18*'Tx236'!H56)","v":""},"","",{"$f":"IF(ISERROR(T(INDEX(INDIRECT(Grade),3,2))),\"\",IF(OR(M21<(INDEX(INDIRECT(Grade),3,5)),M21>(INDEX(INDIRECT(Grade),3,6))),\"No\",\"Yes\"))","v":""}]
[{"$f":"+IF(IF(version>=5,OR('Tx236'!$D$22=\"\",Cumulative=\"Yes\"),OR('Tx236'!$D$22=\"\",'Tx236'!$E$22=\"\",Cumulative=\"Yes\")),\"\",('Tx236'!D32/WeightBlank1)*100)","v":""},{"$f":"IF(A22=\"\",IF(WeightBlank1=\"\",\"\",('Tx236'!D32/WeightBlank1*100)),A22+B21)","v":""},"",{"$f":"+IF(OR(WeightBlank2=\"\",Cumulative=\"Yes\"),\"\",('Tx236'!E32/WeightBlank2)*100)","v":""},{"$f":"IF(version>3,IF(D22=\"\",IF(WeightBlank2=\"\",\"\",('Tx236'!E32/WeightBlank2*100)),D22+E21),IF(D22=\"\",IF(WeightBlank2=\"\",\"\",('Tx236'!D32/WeightBlank2*100)),D22+E21))","v":""},"","","",{"$f":"IF(ISERROR(T(INDEX(INDIRECT(Grade),4,2))),\"\",IF(OR(H22<(INDEX(INDIRECT(Grade),4,5)),H22>(INDEX(INDIRECT(Grade),4,6))),\"No\",\"Yes\"))","v":""},null,{"$f":"IF('Tx236'!H57=\"\",\"\",$K$18*'Tx236'!H57)","v":""},"","",{"$f":"IF(ISERROR(T(INDEX(INDIRECT(Grade),4,2))),\"\",IF(OR(M22<(INDEX(INDIRECT(Grade),4,5)),M22>(INDEX(INDIRECT(Grade),4,6))),\"No\",\"Yes\"))","v":""}]
[{"$f":"+IF(IF(version>=5,OR('Tx236'!$D$22=\"\",Cumulative=\"Yes\"),OR('Tx236'!$D$22=\"\",'Tx236'!$E$22=\"\",Cumulative=\"Yes\")),\"\",('Tx236'!D33/WeightBlank1)*100)","v":""},{"$f":"IF(A23=\"\",IF(WeightBlank1=\"\",\"\",('Tx236'!D33/WeightBlank1*100)),A23+B22)","v":""},"",{"$f":"+IF(OR(WeightBlank2=\"\",Cumulative=\"Yes\"),\"\",('Tx236'!E33/WeightBlank2)*100)","v":""},{"$f":"IF(version>3,IF(D23=\"\",IF(WeightBlank2=\"\",\"\",('Tx236'!E33/WeightBlank2*100)),D23+E22),IF(D23=\"\",IF(WeightBlank2=\"\",\"\",('Tx236'!D33/WeightBlank2*100)),D23+E22))","v":""},"","","",{"$f":"IF(ISERROR(T(INDEX(INDIRECT(Grade),5,2))),\"\",IF(OR(H23<(INDEX(INDIRECT(Grade),5,5)),H23>(INDEX(INDIRECT(Grade),5,6))),\"No\",\"Yes\"))","v":""},null,{"$f":"IF('Tx236'!H58=\"\",\"\",$K$18*'Tx236'!H58)","v":""},"","",{"$f":"IF(ISERROR(T(INDEX(INDIRECT(Grade),5,2))),\"\",IF(OR(M23<(INDEX(INDIRECT(Grade),5,5)),M23>(INDEX(INDIRECT(Grade),5,6))),\"No\",\"Yes\"))","v":""}]
[{"$f":"+IF(IF(version>=5,OR('Tx236'!$D$22=\"\",Cumulative=\"Yes\"),OR('Tx236'!$D$22=\"\",'Tx236'!$E$22=\"\",Cumulative=\"Yes\")),\"\",('Tx236'!D34/WeightBlank1)*100)","v":""},{"$f":"IF(A24=\"\",IF(WeightBlank1=\"\",\"\",('Tx236'!D34/WeightBlank1*100)),A24+B23)","v":""},"",{"$f":"+IF(OR(WeightBlank2=\"\",Cumulative=\"Yes\"),\"\",('Tx236'!E34/WeightBlank2)*100)","v":""},{"$f":"IF(version>3,IF(D24=\"\",IF(WeightBlank2=\"\",\"\",('Tx236'!E34/WeightBlank2*100)),D24+E23),IF(D24=\"\",IF(WeightBlank2=\"\",\"\",('Tx236'!D34/WeightBlank2*100)),D24+E23))","v":""},"","","",{"$f":"IF(ISERROR(T(INDEX(INDIRECT(Grade),6,2))),\"\",IF(OR(H24<(INDEX(INDIRECT(Grade),6,5)),H24>(INDEX(INDIRECT(Grade),6,6))),\"No\",\"Yes\"))","v":""},null,{"$f":"IF('Tx236'!H59=\"\",\"\",$K$18*'Tx236'!H59)","v":""},"","",{"$f":"IF(ISERROR(T(INDEX(INDIRECT(Grade),6,2))),\"\",IF(OR(M24<(INDEX(INDIRECT(Grade),6,5)),M24>(INDEX(INDIRECT(Grade),6,6))),\"No\",\"Yes\"))","v":""}]
[{"$f":"+IF(IF(version>=5,OR('Tx236'!$D$22=\"\",Cumulative=\"Yes\"),OR('Tx236'!$D$22=\"\",'Tx236'!$E$22=\"\",Cumulative=\"Yes\")),\"\",('Tx236'!D35/WeightBlank1)*100)","v":""},{"$f":"IF(A25=\"\",IF(WeightBlank1=\"\",\"\",('Tx236'!D35/WeightBlank1*100)),A25+B24)","v":""},"",{"$f":"+IF(OR(WeightBlank2=\"\",Cumulative=\"Yes\"),\"\",('Tx236'!E35/WeightBlank2)*100)","v":""},{"$f":"IF(version>3,IF(D25=\"\",IF(WeightBlank2=\"\",\"\",('Tx236'!E35/WeightBlank2*100)),D25+E24),IF(D25=\"\",IF(WeightBlank2=\"\",\"\",('Tx236'!D35/WeightBlank2*100)),D25+E24))","v":""},"","","",{"$f":"IF(ISERROR(T(INDEX(INDIRECT(Grade),7,2))),\"\",IF(OR(H25<(INDEX(INDIRECT(Grade),7,5)),H25>(INDEX(INDIRECT(Grade),7,6))),\"No\",\"Yes\"))","v":""},null,{"$f":"IF('Tx236'!H60=\"\",\"\",$K$18*'Tx236'!H60)","v":""},"","",{"$f":"IF(ISERROR(T(INDEX(INDIRECT(Grade),7,2))),\"\",IF(OR(M25<(INDEX(INDIRECT(Grade),7,5)),M25>(INDEX(INDIRECT(Grade),7,6))),\"No\",\"Yes\"))","v":""}]
[{"$f":"+IF(IF(version>=5,OR('Tx236'!$D$22=\"\",Cumulative=\"Yes\"),OR('Tx236'!$D$22=\"\",'Tx236'!$E$22=\"\",Cumulative=\"Yes\")),\"\",('Tx236'!D36/WeightBlank1)*100)","v":""},{"$f":"IF(A26=\"\",IF(WeightBlank1=\"\",\"\",('Tx236'!D36/WeightBlank1*100)),A26+B25)","v":""},"",{"$f":"+IF(OR(WeightBlank2=\"\",Cumulative=\"Yes\"),\"\",('Tx236'!E36/WeightBlank2)*100)","v":""},{"$f":"IF(version>3,IF(D26=\"\",IF(WeightBlank2=\"\",\"\",('Tx236'!E36/WeightBlank2*100)),D26+E25),IF(D26=\"\",IF(WeightBlank2=\"\",\"\",('Tx236'!D36/WeightBlank2*100)),D26+E25))","v":""},"","","",{"$f":"IF(ISERROR(T(INDEX(INDIRECT(Grade),8,2))),\"\",IF(OR(H26<(INDEX(INDIRECT(Grade),8,5)),H26>(INDEX(INDIRECT(Grade),8,6))),\"No\",\"Yes\"))","v":""},null,{"$f":"IF('Tx236'!H61=\"\",\"\",$K$18*'Tx236'!H61)","v":""},"","",{"$f":"IF(ISERROR(T(INDEX(INDIRECT(Grade),8,2))),\"\",IF(OR(M26<(INDEX(INDIRECT(Grade),8,5)),M26>(INDEX(INDIRECT(Grade),8,6))),\"No\",\"Yes\"))","v":""}]
[{"$f":"+IF(IF(version>=5,OR('Tx236'!$D$22=\"\",Cumulative=\"Yes\"),OR('Tx236'!$D$22=\"\",'Tx236'!$E$22=\"\",Cumulative=\"Yes\")),\"\",('Tx236'!D37/WeightBlank1)*100)","v":""},{"$f":"IF(A27=\"\",IF(WeightBlank1=\"\",\"\",('Tx236'!D37/WeightBlank1*100)),A27+B26)","v":""},"",{"$f":"+IF(OR(WeightBlank2=\"\",Cumulative=\"Yes\"),\"\",('Tx236'!E37/WeightBlank2)*100)","v":""},{"$f":"IF(version>3,IF(D27=\"\",IF(WeightBlank2=\"\",\"\",('Tx236'!E37/WeightBlank2*100)),D27+E26),IF(D27=\"\",IF(WeightBlank2=\"\",\"\",('Tx236'!D37/WeightBlank2*100)),D27+E26))","v":""},"","","",{"$f":"IF(ISERROR(T(INDEX(INDIRECT(Grade),9,2))),\"\",IF(OR(H27<(INDEX(INDIRECT(Grade),9,5)),H27>(INDEX(INDIRECT(Grade),9,6))),\"No\",\"Yes\"))","v":""},null,{"$f":"IF('Tx236'!H62=\"\",\"\",$K$18*'Tx236'!H62)","v":""},"","",{"$f":"IF(ISERROR(T(INDEX(INDIRECT(Grade),9,2))),\"\",IF(OR(M27<(INDEX(INDIRECT(Grade),9,5)),M27>(INDEX(INDIRECT(Grade),9,6))),\"No\",\"Yes\"))","v":""}]
[{"$f":"+IF(IF(version>=5,OR('Tx236'!$D$22=\"\",Cumulative=\"Yes\"),OR('Tx236'!$D$22=\"\",'Tx236'!$E$22=\"\",Cumulative=\"Yes\")),\"\",('Tx236'!D38/WeightBlank1)*100)","v":""},{"$f":"IF(A28=\"\",IF(WeightBlank1=\"\",\"\",('Tx236'!D38/WeightBlank1*100)),A28+B27)","v":""},"",{"$f":"+IF(OR(WeightBlank2=\"\",Cumulative=\"Yes\"),\"\",('Tx236'!E38/WeightBlank2)*100)","v":""},{"$f":"IF(version>3,IF(D28=\"\",IF(WeightBlank2=\"\",\"\",('Tx236'!E38/WeightBlank2*100)),D28+E27),IF(D28=\"\",IF(WeightBlank2=\"\",\"\",('Tx236'!D38/WeightBlank2*100)),D28+E27))","v":""},"","","",{"$f":"IF(ISERROR(T(INDEX(INDIRECT(Grade),10,2))),\"\",IF(OR(H28<(INDEX(INDIRECT(Grade),10,5)),H28>(INDEX(INDIRECT(Grade),10,6))),\"No\",\"Yes\"))","v":""},null,{"$f":"IF('Tx236'!H63=\"\",\"\",$K$18*'Tx236'!H63)","v":""},"","",{"$f":"IF(ISERROR(T(INDEX(INDIRECT(Grade),10,2))),\"\",IF(OR(M28<(INDEX(INDIRECT(Grade),10,5)),M28>(INDEX(INDIRECT(Grade),10,6))),\"No\",\"Yes\"))","v":""}]
[{"$f":"+IF(IF(version>=5,OR('Tx236'!$D$22=\"\",Cumulative=\"Yes\"),OR('Tx236'!$D$22=\"\",'Tx236'!$E$22=\"\",Cumulative=\"Yes\")),\"\",('Tx236'!D39/WeightBlank1)*100)","v":""},{"$f":"IF(A29=\"\",IF(WeightBlank1=\"\",\"\",('Tx236'!D39/WeightBlank1*100)),A29+B28)","v":""},"",{"$f":"+IF(OR(WeightBlank2=\"\",Cumulative=\"Yes\"),\"\",('Tx236'!E39/WeightBlank2)*100)","v":""},{"$f":"IF(version>3,IF(D29=\"\",IF(WeightBlank2=\"\",\"\",('Tx236'!E39/WeightBlank2*100)),D29+E28),IF(D29=\"\",IF(WeightBlank2=\"\",\"\",('Tx236'!D39/WeightBlank2*100)),D29+E28))","v":""},"","","",{"$f":"IF(ISERROR(T(INDEX(INDIRECT(Grade),11,2))),\"\",IF(OR(H29<(INDEX(INDIRECT(Grade),11,5)),H29>(INDEX(INDIRECT(Grade),11,6))),\"No\",\"Yes\"))","v":""},null,{"$f":"IF('Tx236'!H64=\"\",\"\",$K$18*'Tx236'!H64)","v":""},"","",{"$f":"IF(ISERROR(T(INDEX(INDIRECT(Grade),11,2))),\"\",IF(OR(M29<(INDEX(INDIRECT(Grade),11,5)),M29>(INDEX(INDIRECT(Grade),11,6))),\"No\",\"Yes\"))","v":""}]
[{"$f":"+IF(IF(version>=5,OR('Tx236'!$D$22=\"\",Cumulative=\"Yes\"),OR('Tx236'!$D$22=\"\",'Tx236'!$E$22=\"\",Cumulative=\"Yes\")),\"\",('Tx236'!D40/WeightBlank1)*100)","v":""},{"$f":"IF(A30=\"\",IF(WeightBlank1=\"\",\"\",('Tx236'!D40/WeightBlank1*100)),A30+B29)","v":""},"",{"$f":"+IF(OR(WeightBlank2=\"\",Cumulative=\"Yes\"),\"\",('Tx236'!E40/WeightBlank2)*100)","v":""},{"$f":"IF(version>3,IF(D30=\"\",IF(WeightBlank2=\"\",\"\",('Tx236'!E40/WeightBlank2*100)),D30+E29),IF(D30=\"\",IF(WeightBlank2=\"\",\"\",('Tx236'!D40/WeightBlank2*100)),D30+E29))","v":""},"","","",{"$f":"IF(ISERROR(T(INDEX(INDIRECT(Grade),12,2))),\"\",IF(OR(H30<(INDEX(INDIRECT(Grade),12,5)),H30>(INDEX(INDIRECT(Grade),12,6))),\"No\",\"Yes\"))","v":""}]

{"sheet":"Data","index":4,"n_rows":406,"n_cols":20,"rows_kept":406,"cut":false,"hidden":true,"merged":[[405,6,414,6],[405,8,414,8],[405,9,414,9],[386,6,395,6],[386,8,395,8],[386,9,395,9],[396,6,404,6],[396,8,404,8],[396,9,404,9],[292,6,297,6],[292,8,297,8],[292,9,297,9],[298,6,303,6],[298,8,303,8],[298,9,303,9],[304,6,310,6],[304,8,310,8],[304,9,310,9],[325,9,329,9],[325,8,329,8],[325,6,329,6],[330,9,335,9],[330,8,335,8],[330,6,335,6],[311,6,316,6],[311,8,316,8],[311,9,316,9],[317,6,324,6],[317,8,324,8],[317,9,324,9],[273,6,280,6],[273,8,280,8],[273,9,280,9],[281,6,285,6],[281,8,285,8],[281,9,285,9],[286,6,291,6],[286,8,291,8],[286,9,291,9],[120,9,127,9],[128,9,135,9],[136,9,142,9],[74,9,82,9],[83,9,91,9],[92,9,100,9],[101,9,110,9],[201,9,209,9],[172,9,181,9],[182,9,188,9],[189,9,194,9],[195,9,200,9],[143,9,148,9],[149,9,154,9],[155,9,162,9],[163,9,171,9],[39,9,46,9],[47,9,55,9],[56,9,63,9],[64,9,73,9],[2,9,11,9],[12,9,20,9],[21,9,29,9],[30,9,38,9],[111,9,119,9],[163,6,171,6],[172,6,181,6],[149,6,154,6],[2,8,11,8],[12,8,20,8],[21,8,29,8],[30,8,38,8],[47,8,55,8],[128,6,135,6],[136,6,142,6],[92,6,100,6],[101,6,110,6],[111,6,119,6],[120,6,127,6],[2,6,11,6],[12,6,20,6],[21,6,29,6],[64,6,73,6],[74,6,82,6],[83,6,91,6],[30,6,38,6],[39,6,46,6],[47,6,55,6],[56,6,63,6],[155,8,162,8],[163,8,171,8],[172,8,181,8],[0,10,0,11],[201,6,209,6],[182,8,188,8],[189,8,194,8],[195,8,200,8],[201,8,209,8],[39,8,46,8],[111,8,119,8],[120,8,127,8],[128,8,135,8],[136,8,142,8],[143,8,148,8],[149,8,154,8],[56,8,63,8],[64,8,73,8],[74,8,82,8],[83,8,91,8],[92,8,100,8],[101,8,110,8],[143,6,148,6],[155,6,162,6],[257,6,264,6],[257,8,264,8],[257,9,264,9],[265,6,272,6],[265,8,272,8],[265,9,272,9],[182,6,188,6],[189,6,194,6],[195,6,200,6],[210,6,219,6],[210,8,219,8],[210,9,219,9],[220,6,229,6],[220,8,229,8],[220,9,229,9],[249,6,256,6],[249,8,256,8],[249,9,256,9],[230,6,239,6],[230,8,239,8],[230,9,239,9],[240,6,248,6],[240,8,248,8],[240,9,248,9],[336,6,342,6],[336,8,342,8],[336,9,342,9],[343,9,350,9],[343,8,350,8],[343,6,350,6],[377,6,385,6],[377,8,385,8],[377,9,385,9],[351,6,356,6],[351,8,356,8],[351,9,356,9],[357,6,366,6],[357,8,366,8],[357,9,366,9],[367,6,376,6],[367,8,376,8],[367,9,376,9]]}
[null,null,null,null,null,null,null,2004,"Recycled","Gradation Requirements in","Washed Sieve",null,null,null,null,null,"English","Metric","Selection","size"]
["Sieve Size",null,"MixType","MixType2014","MixType2024",null,"Grade","Sieve Size","Material?","%Passing or %Retained","Min","Max",null,null,null,null,"3\"","75 mm","3\"",75]
["--",null,"CMHB_C","DG_A","DG_A",null,"CMHB C","1\"","Yes","%Passing",100,100,null,"Recycled Material?",null,null,"2.5\"","63 mm","2.5\"",63]
["1 1/2\"",null,"CMHB_F","DG_B","DG_B",null,null,"3/4\"",null,null,98,100,null,{"$f":"IF(ISERROR(INDEX(INDIRECT(Grade),1,3)),\"\",IF(INDEX(INDIRECT(Grade),1,3)=\"No\",\"\",\"Yes\"))","v":""},null,null,"2.12\"","53 mm","2.12\"",53]
["1\"",null,"SMA_C","DG_C","DG_C",null,null,"1/2\"",null,null,72,85,null,null,null,null,"2\"","50 mm","2\"",50]
["7/8\"",null,"SMA_D","DG_D","DG_D",null,null,"3/8\"",null,null,50,70,null,"% Retained?",null,null,"1-3/4\"","45 mm","1-3/4\"",45]
["3/4\"",null,"SMA_F","DG_F","DG_F",null,null,"No. 4",null,null,30,45,null,{"$f":"IF(ISERROR(INDEX(INDIRECT(Grade),1,4)),\"\",IF(INDEX(INDIRECT(Grade),1,4)=\"%Passing\",\"\",\"Yes\"))","v":""},null,null,"1-1/2\"","37.5 mm","1-1/2\"",37.5]
["5/8\"",null,"SMAR_C","PFC_C","PFC_C",null,null,"No. 8",null,null,17,27,null,null,null,null,"1-1/4\"","31.5 mm","1-1/4\"",31.5]
["1/2\"",null,"SMAR_F","PFC_F","PFC_F",null,null,"No. 16",null,null,5,27,null,null,null,null,"1\"","25 mm","1\"",25]
["3/8\"",null,"SP_A","PFCR_C","SP_B_Intermediate",null,null,"No. 30",null,null,5,27,null,null,null,null,"7/8\"","22.4 mm","7/8\"",22.4]
["No. 4",null,"SP_B","PFCR_F","SP_C_Surface",null,null,"No. 50",null,null,5,27,null,null,null,null,"3/4\"","19 mm","3/4\"",19]
["No. 8",null,"SP_C","Superpave_A","SP_D_Fine",null,null,"No. 200",null,null,5,9,null,null,null,null,"5/8\"","16 mm","5/8\"",16]
["No. 10",null,"SP_D","Superpave_B","SMA_C",null,"CMHB F","3/4\"","Yes","%Passing",100,100,null,null,null,null,"1/2\"","12.5 mm","1/2\"",12.5]
["No. 16",null,"Type_A","Superpave_C","SMA_D",null,null,"1/2\"",null,null,98,100,null,null,null,null,"7/16\"","11.2 mm","7/16\"",11.2]
["No. 30",null,"Type_B","Superpave_D","SMA_Fine",null,null,"3/8\"",null,null,85,100,null,null,null,null,"3/8\"","9.5 mm","3/8\"",9.5]
["No. 40",null,"Type_C","SMA_C","SMAR_F",null,null,"No. 4",null,null,40,60,null,null,null,null,"5/16\"","8 mm","5/16\"",8]
["No. 50",null,"Type_D","SMA_D","TOM_C",null,null,"No. 8",null,null,17,27,null,null,null,null,"1/4\"","6.3 mm","1/4\"",6.3]
["No. 80",null,"Type_F","SMA_Fine","TOM_F",null,null,"No. 16",null,null,5,27,null,null,null,null,"No. 4","4.75 mm","No. 4",4.75]
["No. 100",null,"PFC_PG_76","SMAR_C","TB_PFC_C",null,null,"No. 30",null,null,5,27,null,null,null,null,"No. 6","3.35 mm","No. 6",3.35]
["No. 200",null,"PFC_A_R","SMAR_F","TB_PFC_F",null,null,"No. 50",null,null,5,27,null,null,null,null,"No. 8","2.36 mm","No. 8",2.36]
["Pan",null,"UTBWC_A","TOM_C","TBFC_A",null,null,"No. 200",null,null,5,9,null,null,null,null,"No. 10","2 mm","No. 10",2]
[null,null,"UTBWC_B","TOM_F","TBFC_B",null,"SMA C","3/4\"","Yes","%Passing",100,100,null,null,null,null,"No. 14","1.4 mm","No. 14",1.4]
[null,null,"UTBWC_C","TB_PFC_C","TBFC_C",null,null,"1/2\"",null,null,80,90,null,null,null,null,"No. 16","1.18 mm","No. 16",1.18]
[null,null,"CAM","TB_PFC_F","CAM",null,null,"3/8\"",null,null,25,60,null,null,null,null,"No. 20","850 µm","No. 20",0.85]
[null,null,"TOM","TB_PFCR_C","Microsurfacing",null,null,"No. 4",null,null,20,28,null,null,null,null,"No. 30","600 µm","No. 30",0.6]
[null,null,"TOM_C","TBWC_A","Other",null,null,"No. 8",null,null,14,20,null,null,null,null,"No. 40","425 µm","No. 40",0.42499999999999999]
[null,null,"TOM_F","TBWC_B",null,null,null,"No. 16",null,null,8,20,null,null,null,null,"No. 50","300 µm","No. 50",0.3]
[null,null,"TBPFC_PG76","TBWC_C",null,null,null,"No. 30",null,null,8,20]
[null,null,"TBPFC_AR","CAM",null,null,null,"No. 50",null,null,8,20]
[null,null,"Microsurfacing","Microsurfacing",null,null,null,"No. 200",null,null,8,12]
[null,null,"SS3270_SP_A","CMHB_C",null,null,"SMA D","3/4\"","Yes","%Passing",100,100]
[null,null,"SS3270_SP_B","CMHB_F",null,null,null,"1/2\"",null,null,85,99]
[null,null,"SS3270_SP_C","SS3077_SP_B",null,null,null,"3/8\"",null,null,50,75]
[null,null,"SS3270_SP_D","SS3077_SP_C",null,null,null,"No. 4",null,null,20,32]
[null,null,"SS3271_SMA_F","SS3077_SP_D",null,null,null,"No. 8",null,null,16,28]
[null,null,"SS3269_PFC_F","SS3074_BMD_SP_C",null,null,null,"No. 16",null,null,8,28]
[null,null,"SS3269_PFC_C","SS3074_BMD_SP_D",null,null,null,"No. 30",null,null,8,28]
[null,null,"SS3269_PFCR_F",null,null,null,null,"No. 50",null,null,8,28]
[null,null,"SS3269_PFCR_C",null,null,null,null,"No. 200",null,null,8,12]
[null,null,"SS3268_TYPE_F",null,null,null,"SMA F","1/2\"","Yes","%Passing",100,100]
[null,null,null,null,null,null,null,"3/8\"",null,null,70,90]
[null,null,null,null,null,null,null,"No. 4",null,null,30,50]
[null,null,null,null,null,null,null,"No. 8",null,null,20,30]
[null,null,null,null,null,null,null,"No. 16",null,null,8,30]
[null,null,null,null,null,null,null,"No. 30",null,null,8,30]
[null,null,null,null,null,null,null,"No. 50",null,null,8,30]
[null,null,null,null,null,null,null,"No. 200",null,null,8,14]
[null,null,null,null,null,null,"SMAR C","3/4\"","Yes","%Passing",100,100]
[null,null,null,null,null,null,null,"1/2\"",null,null,72,85]
[null,null,null,null,null,null,null,"3/8\"",null,null,50,70]
[null,null,null,null,null,null,null,"No. 4",null,null,30,45]
[null,null,null,null,null,null,null,"No. 8",null,null,17,27]
[null,null,null,null,null,null,null,"No. 16",null,null,12,22]
[null,null,null,null,null,null,null,"No. 30",null,null,8,20]
[null,null,null,null,null,null,null,"No. 50",null,null,6,15]
[null,null,null,null,null,null,null,"No. 200",null,null,5,9]
[null,null,null,null,null,null,"SMAR F","1/2\"","Yes","%Passing",100,100]
[null,null,null,null,null,null,null,"3/8\"",null,null,95,100]
[null,null,null,null,null,null,null,"No. 4",null,null,40,50]
[null,null,null,null,null,null,null,"No. 8",null,null,17,27]
[null,null,null,null,null,null,null,"No. 16",null,null,12,22]
[null,null,null,null,null,null,null,"No. 30",null,null,8,20]
[null,null,null,null,null,null,null,"No. 50",null,null,6,15]
[null,null,null,null,null,null,null,"No. 200",null,null,5,9]
[null,null,null,null,null,null,"SP A","2\"","Yes","%Passing",100,100]
[null,null,null,null,null,null,null,"1-1/2\"",null,null,98,100]
[null,null,null,null,null,null,null,"1\"",null,null,90,100]
[null,null,null,null,null,null,null,"3/4\"",null,null,19,90]
[null,null,null,null,null,null,null,"No. 4",null,null,19,90]
[null,null,null,null,null,null,null,"No. 8",null,null,19,45]
[null,null,null,null,null,null,null,"No. 16",null,null,1,45]
[null,null,null,null,null,null,null,"No. 30",null,null,1,45]
[null,null,null,null,null,null,null,"No. 50",null,null,1,45]
[null,null,null,null,null,null,null,"No. 200",null,null,1,7]
[null,null,null,null,null,null,"SP B","1-1/2\"","Yes","%Passing",100,100]
[null,null,null,null,null,null,null,"1\"",null,null,98,100]
[null,null,null,null,null,null,null,"3/4\"",null,null,90,100]
[null,null,null,null,null,null,null,"1/2\"",null,null,23,90]
[null,null,null,null,null,null,null,"No. 8",null,null,23,49]
[null,null,null,null,null,null,null,"No. 16",null,null,2,49]
[null,null,null,null,null,null,null,"No. 30",null,null,2,49]
[null,null,null,null,null,null,null,"No. 50",null,null,2,49]
[null,null,null,null,null,null,null,"No. 200",null,null,2,8]
[null,null,null,null,null,null,"SP C","1\"","Yes","%Passing",100,100]
[null,null,null,null,null,null,null,"3/4\"",null,null,98,100]
[null,null,null,null,null,null,null,"1/2\"",null,null,90,100]
[null,null,null,null,null,null,null,"3/8\"",null,null,28,90]
[null,null,null,null,null,null,null,"No. 8",null,null,28,58]
[null,null,null,null,null,null,null,"No. 16",null,null,2,58]
[null,null,null,null,null,null,null,"No. 30",null,null,2,58]
[null,null,null,null,null,null,null,"No. 50",null,null,2,58]
[null,null,null,null,null,null,null,"No. 200",null,null,2,10]
[null,null,null,null,null,null,"SP D","3/4\"","Yes","%Passing",100,100]
[null,null,null,null,null,null,null,"1/2\"",null,null,98,100]
[null,null,null,null,null,null,null,"3/8\"",null,null,90,100]
[null,null,null,null,null,null,null,"No. 4",null,null,32,90]
[null,null,null,null,null,null,null,"No. 8",null,null,32,67]
[null,null,null,null,null,null,null,"No. 16",null,null,2,67]
[null,null,null,null,null,null,null,"No. 30",null,null,2,67]
[null,null,null,null,null,null,null,"No. 50",null,null,2,67]
[null,null,null,null,null,null,null,"No. 200",null,null,2,10]
[null,null,null,null,null,null,"Type A","2\"","Yes","%Passing",100,100]
[null,null,null,null,null,null,null,"1-1/2\"",null,null,98,100]
[null,null,null,null,null,null,null,"1\"",null,null,78,94]
[null,null,null,null,null,null,null,"3/4\"",null,null,64,85]
[null,null,null,null,null,null,null,"1/2\"",null,null,50,70]
[null,null,null,null,null,null,null,"No. 4",null,null,30,50]
[null,null,null,null,null,null,null,"No. 8",null,null,22,36]
[null,null,null,null,null,null,null,"No. 30",null,null,8,23]
[null,null,null,null,null,null,null,"No. 50",null,null,3,19]
[null,null,null,null,null,null,null,"No. 200",null,null,2,7]
[null,null,null,null,null,null,"Type B","1-1/2\"","Yes","%Passing",100,100]
[null,null,null,null,null,null,null,"1\"",null,null,98,100]
[null,null,null,null,null,null,null,"3/4\"",null,null,84,98]
[null,null,null,null,null,null,null,"3/8\"",null,null,60,80]
[null,null,null,null,null,null,null,"No. 4",null,null,40,60]
[null,null,null,null,null,null,null,"No. 8",null,null,29,43]
[null,null,null,null,null,null,null,"No. 30",null,null,13,28]
[null,null,null,null,null,null,null,"No. 50",null,null,6,20]
[null,null,null,null,null,null,null,"No. 200",null,null,2,7]
[null,null,null,null,null,null,"Type C","1\"","Yes","%Passing",100,100]
[null,null,null,null,null,null,null,"3/4\"",null,null,95,100]
[null,null,null,null,null,null,null,"3/8\"",null,null,70,85]
[null,null,null,null,null,null,null,"No. 4",null,null,43,63]
[null,null,null,null,null,null,null,"No. 8",null,null,32,44]
[null,null,null,null,null,null,null,"No. 30",null,null,14,28]
[null,null,null,null,null,null,null,"No. 50",null,null,7,21]
[null,null,null,null,null,null,null,"No. 200",null,null,2,7]
[null,null,null,null,null,null,"Type D","3/4\"","Yes","%Passing",100,100]
[null,null,null,null,null,null,null,"1/2\"",null,null,98,100]
[null,null,null,null,null,null,null,"3/8\"",null,null,85,100]
[null,null,null,null,null,null,null,"No. 4",null,null,50,70]
[null,null,null,null,null,null,null,"No. 8",null,null,35,46]
[null,null,null,null,null,null,null,"No. 30",null,null,15,29]
[null,null,null,null,null,null,null,"No. 50",null,null,7,20]
[null,null,null,null,null,null,null,"No. 200",null,null,2,7]
[null,null,null,null,null,null,"Type F","1/2\"","Yes","%Passing",100,100]
[null,null,null,null,null,null,null,"3/8\"",null,null,98,100]
[null,null,null,null,null,null,null,"No. 4",null,null,80,86]
[null,null,null,null,null,null,null,"No. 8",null,null,38,48]
[null,null,null,null,null,null,null,"No. 30",null,null,12,27]
[null,null,null,null,null,null,null,"No. 50",null,null,6,19]
[null,null,null,null,null,null,null,"No. 200",null,null,2,7]
[null,null,null,null,null,null,"PFC PG 76","3/4\"","No","%Passing",100,100]
[null,null,null,null,null,null,null,"1/2\"",null,null,80,100]
[null,null,null,null,null,null,null,"3/8\"",null,null,35,60]
[null,null,null,null,null,null,null,"#4",null,null,1,20]
[null,null,null,null,null,null,null,"#8",null,null,1,10]
[null,null,null,null,null,null,null,"#200",null,null,1,4]
[null,null,null,null,null,null,"PFC A R","3/4\"","No","%Passing",100,100]
[null,null,null,null,null,null,null,"1/2\"",null,null,95,100]
[null,null,null,null,null,null,null,"3/8\"",null,null,50,80]
[null,null,null,null,null,null,null,"#4",null,null,0,8]
[null,null,null,null,null,null,null,"#8",null,null,0,4]
[null,null,null,null,null,null,null,"#200",null,null,0,4]
[null,null,null,null,null,null,"UTBWC A","3/8\"","No","%Passing",100,100]
[null,null,null,null,null,null,null,"#4",null,null,35,55]
[null,null,null,null,null,null,null,"#8",null,null,19,30]
[null,null,null,null,null,null,null,"#16",null,null,14,25]
[null,null,null,null,null,null,null,"#30",null,null,10,18]
[null,null,null,null,null,null,null,"#50",null,null,7,14]
[null,null,null,null,null,null,null,"#100",null,null,5,10]
[null,null,null,null,null,null,null,"#200",null,null,4,6]
[null,null,null,null,null,null,"UTBWC B","1/2\"","No","%Passing",100,100]
[null,null,null,null,null,null,null,"3/8\"",null,null,75,100]
[null,null,null,null,null,null,null,"#4",null,null,22,36]
[null,null,null,null,null,null,null,"#8",null,null,19,30]
[null,null,null,null,null,null,null,"#16",null,null,14,24]
[null,null,null,null,null,null,null,"#30",null,null,10,18]
[null,null,null,null,null,null,null,"#50",null,null,7,14]
[null,null,null,null,null,null,null,"#100",null,null,5,10]
[null,null,null,null,null,null,null,"#200",null,null,4,6]
[null,null,null,null,null,null,"UTBWC C","3/4\"","No","%Passing",100,100]
[null,null,null,null,null,null,null,"1/2\"",null,null,75,100]
[null,null,null,null,null,null,null,"3/8\"",null,null,55,80]
[null,null,null,null,null,null,null,"#4",null,null,22,36]
[null,null,null,null,null,null,null,"#8",null,null,19,30]
[null,null,null,null,null,null,null,"#16",null,null,14,24]
[null,null,null,null,null,null,null,"#30",null,null,10,18]
[null,null,null,null,null,null,null,"#50",null,null,7,14]
[null,null,null,null,null,null,null,"#100",null,null,5,10]
[null,null,null,null,null,null,null,"#200",null,null,4,6]
[null,null,null,null,null,"SS3146","CAM","3/8\"","No","%Passing",98,100]
[null,null,null,null,null,null,null,"#4",null,null,70,90]
[null,null,null,null,null,null,null,"#8",null,null,40,65]
[null,null,null,null,null,null,null,"#16",null,null,20,45]
[null,null,null,null,null,null,null,"#30",null,null,10,30]
[null,null,null,null,null,null,null,"#50",null,null,10,20]
[null,null,null,null,null,null,null,"#200",null,null,2,10]
[null,null,null,null,null,"TB_PFC_C","TBPFC PG76","3/4\"","No","%Passing",100,100]
[null,null,null,null,null,null,null,"1/2\"",null,null,80,100]
[null,null,null,null,null,null,null,"3/8\"",null,null,35,60]
[null,null,null,null,null,null,null,"#4",null,null,1,20]
[null,null,null,null,null,null,null,"#8",null,null,1,10]
[null,null,null,null,null,null,null,"#200",null,null,1,4]
[null,null,null,null,null,null,"TBPFC AR","3/4\"","No","%Passing",100,100]
[null,null,null,null,null,null,null,"1/2\"",null,null,95,100]
[null,null,null,null,null,null,null,"3/8\"",null,null,50,80]
[null,null,null,null,null,null,null,"#4",null,null,0,8]
[null,null,null,null,null,null,null,"#8",null,null,0,4]
[null,null,null,null,null,null,null,"#200",null,null,0,4]
[null,null,null,null,null,null,"Microsurfacing","1/2\"","No","%Retained",0,0]
[null,null,null,null,null,null,null,"3/8\"",null,null,0,1]
[null,null,null,null,null,null,null,"#4",null,null,6,14]
[null,null,null,null,null,null,null,"#8",null,null,35,55]
[null,null,null,null,null,null,null,"#16",null,null,54,75]
[null,null,null,null,null,null,null,"#30",null,null,65,85]
[null,null,null,null,null,null,null,"#50",null,null,75,90]
[null,null,null,null,null,null,null,"#100",null,null,82,93]
[null,null,null,null,null,null,null,"#200",null,null,85,95]
[null,null,null,null,null,"Superpave_A","SS 3270\nSP A","2\"","Yes","%Passing",100,100]
[null,null,null,null,null,null,null,"1-1/2\"",null,null,98,100]
[null,null,null,null,null,null,null,"1\"",null,null,90,100]
[null,null,null,null,null,null,null,"3/4\"",null,null,19,90]
[null,null,null,null,null,null,null,"No. 4",null,null,19,90]
[null,null,null,null,null,null,null,"No. 8",null,null,19,45]
[null,null,null,null,null,null,null,"No. 16",null,null,1,45]
[null,null,null,null,null,null,null,"No. 30",null,null,1,45]
[null,null,null,null,null,null,null,"No. 50",null,null,1,45]
[null,null,null,null,null,null,null,"No. 200",null,null,1,7]
[null,null,null,null,null,"Superpave_B","SS 3270\nSP B","1-1/2\"","Yes","%Passing",100,100]
[null,null,null,null,null,null,null,"1\"",null,null,98,100]
[null,null,null,null,null,null,null,"3/4\"",null,null,90,100]
[null,null,null,null,null,null,null,"1/2\"",null,null,23,90]
[null,null,null,null,null,null,null,"No. 4",null,null,23,90]
[null,null,null,null,null,null,null,"No. 8",null,null,23,49]
[null,null,null,null,null,null,null,"No. 16",null,null,2,49]
[null,null,null,null,null,null,null,"No. 30",null,null,2,49]
[null,null,null,null,null,null,null,"No. 50",null,null,2,49]
[null,null,null,null,null,null,null,"No. 200",null,null,2,8]
[null,null,null,null,null,"Superpave_C","SS 3270\nSP C","1\"","Yes","%Passing",100,100]
[null,null,null,null,null,null,null,"3/4\"",null,null,98,100]
[null,null,null,null,null,null,null,"1/2\"",null,null,90,100]
[null,null,null,null,null,null,null,"3/8\"",null,null,28,90]
[null,null,null,null,null,null,null,"No. 4",null,null,28,90]
[null,null,null,null,null,null,null,"No. 8",null,null,28,58]
[null,null,null,null,null,null,null,"No. 16",null,null,2,58]
[null,null,null,null,null,null,null,"No. 30",null,null,2,58]
[null,null,null,null,null,null,null,"No. 50",null,null,2,58]
[null,null,null,null,null,null,null,"No. 200",null,null,2,10]
[null,null,null,null,null,"Superpave_D","SS 3270\nSP D","3/4\"","Yes","%Passing",100,100]
[null,null,null,null,null,null,null,"1/2\"",null,null,98,100]
[null,null,null,null,null,null,null,"3/8\"",null,null,90,100]
[null,null,null,null,null,null,null,"No. 4",null,null,32,90]
[null,null,null,null,null,null,null,"No. 8",null,null,32,67]
[null,null,null,null,null,null,null,"No. 16",null,null,2,67]
[null,null,null,null,null,null,null,"No. 30",null,null,2,67]
[null,null,null,null,null,null,null,"No. 50",null,null,2,67]
[null,null,null,null,null,null,null,"No. 200",null,null,2,10]
[null,null,null,null,null,"SS3239","TOM","1/2\"","No","%Passing",100,100]
[null,null,null,null,null,null,null,"3/8\"",null,null,85,100]
[null,null,null,null,null,null,null,"No. 4",null,null,40,60]
[null,null,null,null,null,null,null,"No. 8",null,null,17,27]
[null,null,null,null,null,null,null,"No. 16",null,null,5,27]
[null,null,null,null,null,null,null,"No. 30",null,null,5,27]
[null,null,null,null,null,null,null,"No. 50",null,null,5,27]
[null,null,null,null,null,null,null,"No. 200",null,null,5,9]
[null,null,null,null,null,"Item 347","TOM-C","1/2\"","No","%Passing",100,100]
[null,null,null,null,null,"SS3288",null,"3/8\"",null,null,95,100]
[null,null,null,null,null,null,null,"No. 4",null,null,40,60]
[null,null,null,null,null,null,null,"No. 8",null,null,17,27]
[null,null,null,null,null,null,null,"No. 16",null,null,5,27]
[null,null,null,null,null,null,null,"No. 30",null,null,5,27]
[null,null,null,null,null,null,null,"No. 50",null,null,5,27]
[null,null,null,null,null,null,null,"No. 200",null,null,5,9]
[null,null,null,null,null,"Item 347","TOM-F","1/2\"","No","%Passing",100,100]
[null,null,null,null,null,"SS3288",null,"3/8\"",null,null,98,100]
[null,null,null,null,null,null,null,"No. 4",null,null,70,95]
[null,null,null,null,null,null,null,"No. 8",null,null,40,65]
[null,null,null,null,null,null,null,"No. 16",null,null,20,45]
[null,null,null,null,null,null,null,"No. 30",null,null,10,35]
[null,null,null,null,null,null,null,"No. 50",null,null,10,20]
[null,null,null,null,null,null,null,"No. 200",null,null,2,12]
[null,null,null,null,null,null,"SS 3271\nSMA F","1/2\"","Yes","%Passing",100,100]
[null,null,null,null,null,null,null,"3/8\"",null,null,70,100]
[null,null,null,null,null,null,null,"No. 4",null,null,30,60]
[null,null,null,null,null,null,null,"No. 8",null,null,20,40]
[null,null,null,null,null,null,null,"No. 16",null,null,6,30]
[null,null,null,null,null,null,null,"No. 30",null,null,6,30]
[null,null,null,null,null,null,null,"No. 50",null,null,6,30]
[null,null,null,null,null,null,null,"No. 200",null,null,6,12]
[null,null,null,null,null,null,"SS 3269\nPFC F","1/2\"","Yes","%Passing",100,100]
[null,null,null,null,null,null,null,"3/8\"",null,null,95,100]
[null,null,null,null,null,null,null,"#4",null,null,20,55]
[null,null,null,null,null,null,null,"#8",null,null,1,10]
[null,null,null,null,null,null,null,"#200",null,null,1,4]
[null,null,null,null,null,null,"SS 3269\nPFC C","3/4\"","Yes","%Passing",100,100]
[null,null,null,null,null,null,null,"1/2\"",null,null,80,100]
[null,null,null,null,null,null,null,"3/8\"",null,null,35,60]
[null,null,null,null,null,null,null,"#4",null,null,1,20]
[null,null,null,null,null,null,null,"#8",null,null,1,10]
[null,null,null,null,null,null,null,"#200",null,null,1,4]
[null,null,null,null,null,null,"SS 3269\nPFCR F","3/4\"","Yes","%Passing",100,100]
[null,null,null,null,null,null,null,"1/2\"",null,null,95,100]
[null,null,null,null,null,null,null,"3/8\"",null,null,50,80]
[null,null,null,null,null,null,null,"#4",null,null,0,8]
[null,null,null,null,null,null,null,"#8",null,null,0,4]
[null,null,null,null,null,null,null,"#200",null,null,0,4]
[null,null,null,null,null,null,"SS 3269\nPFCR C","3/4\"","Yes","%Passing",100,100]
[null,null,null,null,null,null,null,"1/2\"",null,null,80,100]
[null,null,null,null,null,null,null,"3/8\"",null,null,35,60]
[null,null,null,null,null,null,null,"#4",null,null,1,20]
[null,null,null,null,null,null,null,"#8",null,null,0,10]
[null,null,null,null,null,null,null,"#200",null,null,0,4]
[null,null,null,null,null,"SS3268","SS 3268\nTYPE F","1/2\"","Yes","%Passing",100,100]
[null,null,null,null,null,"DG_F",null,"3/8\"",null,null,98,100]
[null,null,null,null,null,null,null,"No. 4",null,null,70,90]
[null,null,null,null,null,null,null,"No. 8",null,null,38,48]
[null,null,null,null,null,null,null,"No. 30",null,null,12,27]
[null,null,null,null,null,null,null,"No. 50",null,null,6,19]
[null,null,null,null,null,null,null,"No. 200",null,null,2,7]
[null,null,null,null,null,2014,"PFCR C","3/4\"","Yes","%Passing",100,100]
[null,null,null,null,null,null,null,"1/2\"",null,null,80,100]
[null,null,null,null,null,null,null,"3/8\"",null,null,35,60]
[null,null,null,null,null,null,null,"#4",null,null,0,20]
[null,null,null,null,null,null,null,"#8",null,null,0,10]
[null,null,null,null,null,null,null,"#200",null,null,0,4]
[null,null,null,null,null,"SMA_Fine","SMA Fine","1/2\"","Yes","%Passing",100,100]
[null,null,null,null,null,null,null,"3/8\"",null,null,70,100]
[null,null,null,null,null,null,null,"No. 4",null,null,30,60]
[null,null,null,null,null,null,null,"No. 8",null,null,20,40]
[null,null,null,null,null,null,null,"No. 16",null,null,6,30]
[null,null,null,null,null,null,null,"No. 30",null,null,6,30]
[null,null,null,null,null,null,null,"No. 50",null,null,6,30]
[null,null,null,null,null,null,null,"No. 200",null,null,4,12]
[null,null,null,null,null,null,"TB_PFC_F","1/2\"","No","%Passing",100,100]
[null,null,null,null,null,null,null,"3/8\"",null,null,95,100]
[null,null,null,null,null,null,null,"#4",null,null,20,55]
[null,null,null,null,null,null,null,"#8",null,null,1,10]
[null,null,null,null,null,null,null,"#200",null,null,1,4]
[null,null,null,null,null,null,"TBWC_A","3/8\"","No","%Passing",100,100]
[null,null,null,null,null,null,null,"#4",null,null,35,55]
[null,null,null,null,null,null,null,"#8",null,null,19,30]
[null,null,null,null,null,null,null,"#16",null,null,14,25]
[null,null,null,null,null,null,null,"#50",null,null,7,14]
[null,null,null,null,null,null,null,"#200",null,null,4,6]
[null,null,null,null,null,null,"TBWC_B","1/2\"","No","%Passing",100,100]
[null,null,null,null,null,null,null,"3/8\"",null,null,75,100]
[null,null,null,null,null,null,null,"#4",null,null,22,36]
[null,null,null,null,null,null,null,"#8",null,null,19,30]
[null,null,null,null,null,null,null,"#16",null,null,14,24]
[null,null,null,null,null,null,null,"#50",null,null,7,14]
[null,null,null,null,null,null,null,"#200",null,null,4,6]
[null,null,null,null,null,null,"TBWC_C","3/4\"","No","%Passing",100,100]
[null,null,null,null,null,null,null,"1/2\"",null,null,75,100]
[null,null,null,null,null,null,null,"3/8\"",null,null,55,80]
[null,null,null,null,null,null,null,"#4",null,null,22,36]
[null,null,null,null,null,null,null,"#8",null,null,19,30]
[null,null,null,null,null,null,null,"#16",null,null,14,24]
[null,null,null,null,null,null,null,"#50",null,null,7,14]
[null,null,null,null,null,null,null,"#200",null,null,4,6]
[null,null,null,null,null,null,"TB_PFCR_C","3/4\"","No","%Passing",100,100]
[null,null,null,null,null,null,null,"1/2\"",null,null,80,100]
[null,null,null,null,null,null,null,"3/8\"",null,null,35,60]
[null,null,null,null,null,null,null,"#4",null,null,0,20]
[null,null,null,null,null,null,null,"#8",null,null,0,10]
[null,null,null,null,null,null,null,"#200",null,null,0,4]
[null,null,null,null,null,null,"SS 3077\nSP B","1-1/2\"","Yes","%Passing",100,100]
[null,null,null,null,null,null,null,"1\"",null,null,98,100]
[null,null,null,null,null,null,null,"3/4\"",null,null,90,100]
[null,null,null,null,null,null,null,"1/2\"",null,null,23,90]
[null,null,null,null,null,null,null,"No. 4",null,null,23,90]
[null,null,null,null,null,null,null,"No. 8",null,null,23,34.6]
[null,null,null,null,null,null,null,"No. 16",null,null,2,28.3]
[null,null,null,null,null,null,null,"No. 30",null,null,2,20.7]
[null,null,null,null,null,null,null,"No. 50",null,null,2,13.7]
[null,null,null,null,null,null,null,"No. 200",null,null,2,8]
[null,null,null,null,null,null,"SS 3077\nSP C","1\"","Yes","%Passing",100,100]
[null,null,null,null,null,null,null,"3/4\"",null,null,98,100]
[null,null,null,null,null,null,null,"1/2\"",null,null,90,100]
[null,null,null,null,null,null,null,"3/8\"",null,null,28,90]
[null,null,null,null,null,null,null,"No. 4",null,null,28,90]
[null,null,null,null,null,null,null,"No. 8",null,null,28,37]
[null,null,null,null,null,null,null,"No. 16",null,null,2,31.6]
[null,null,null,null,null,null,null,"No. 30",null,null,2,23.1]
[null,null,null,null,null,null,null,"No. 50",null,null,2,15.5]
[null,null,null,null,null,null,null,"No. 200",null,null,2,10]
[null,null,null,null,null,null,"SS 3077\nSP D","3/4\"","Yes","%Passing",100,100]
[null,null,null,null,null,null,null,"1/2\"",null,null,98,100]
[null,null,null,null,null,null,null,"3/8\"",null,null,90,100]
[null,null,null,null,null,null,null,"No. 4",null,null,32,90]
[null,null,null,null,null,null,null,"No. 8",null,null,32,40]
[null,null,null,null,null,null,null,"No. 16",null,null,2,37.6]
[null,null,null,null,null,null,null,"No. 30",null,null,2,27.5]
[null,null,null,null,null,null,null,"No. 50",null,null,2,18.7]
[null,null,null,null,null,null,null,"No. 200",null,null,2,10]
[null,null,null,null,null,null,"SS 3074 BMD\nSP C","1\"","Yes","%Passing",100,100]
[null,null,null,null,null,null,null,"3/4\"",null,null,98,100]
[null,null,null,null,null,null,null,"1/2\"",null,null,90,100]
[null,null,null,null,null,null,null,"3/8\"",null,null,28,90]
[null,null,null,null,null,null,null,"No. 4",null,null,28,90]
[null,null,null,null,null,null,null,"No. 8",null,null,28,58]
[null,null,null,null,null,null,null,"No. 16",null,null,2,58]
[null,null,null,null,null,null,null,"No. 30",null,null,2,58]
[null,null,null,null,null,null,null,"No. 50",null,null,2,58]
[null,null,null,null,null,null,null,"No. 200",null,null,2,10]
[null,null,null,null,null,null,"SS 3074 BMD\nSP D","3/4\"","Yes","%Passing",100,100]
[null,null,null,null,null,null,null,"1/2\"",null,null,98,100]
[null,null,null,null,null,null,null,"3/8\"",null,null,90,100]
[null,null,null,null,null,null,null,"No. 4",null,null,32,90]
[null,null,null,null,null,null,null,"No. 8",null,null,32,67]
[null,null,null,null,null,null,null,"No. 16",null,null,2,67]
[null,null,null,null,null,null,null,"No. 30",null,null,2,67]
[null,null,null,null,null,null,null,"No. 50",null,null,2,67]
[null,null,null,null,null,null,null,"No. 200",null,null,2,10]
[null,null,null,null,null,null,"Other",null,"75 mm"]

{"sheet":"Revisions","index":5,"n_rows":53,"n_cols":11,"rows_kept":53,"cut":false,"hidden":true,"merged":[[52,1,52,9],[9,0,10,0],[9,10,10,10],[3,0,4,0],[3,1,3,9],[3,10,4,10],[4,1,4,9],[7,10,8,10],[8,1,8,9],[7,0,8,0],[7,1,7,9],[5,0,6,0],[5,1,5,9],[5,10,6,10],[6,1,6,9],[9,1,9,9],[10,1,10,9],[0,1,0,9],[1,0,2,0],[1,1,1,9],[1,10,2,10],[2,1,2,9],[11,10,33,10],[23,1,23,9],[17,1,17,9],[12,1,13,9],[16,1,16,9],[14,1,15,9],[11,1,11,9],[26,1,26,9],[31,1,31,9],[33,1,33,9],[27,1,27,9],[20,1,20,9],[29,1,29,9],[34,0,35,0],[40,1,40,9],[18,1,18,9],[30,1,30,9],[32,1,32,9],[36,0,44,0],[28,1,28,9],[24,1,24,9],[25,1,25,9],[21,1,22,9],[19,1,19,9],[41,1,41,9],[42,1,42,9],[43,1,43,9],[44,1,44,9],[11,0,33,0],[36,10,44,10],[34,10,35,10],[35,1,35,9],[36,1,36,9],[39,1,39,9],[37,1,37,9],[38,1,38,9],[34,1,34,9],[45,0,50,0],[51,1,51,9],[46,10,51,10],[46,1,46,9],[47,1,47,9],[48,1,48,9],[49,1,49,9],[50,1,50,9],[45,1,45,9]]}
["DATE","CHANGES",null,null,null,null,null,null,null,null,"BY"]
["2014-10-21","Tx236 Worksheet",null,null,null,null,null,null,null,null,"Gisel Carrasco"]
[null,"Added Mix Types to gradation sheet and to drop down. They include SS3288 (TOM-C and TOM-F)."]
["2013-06-11","Tx236 Worksheet",null,null,null,null,null,null,null,null,"Travis Patton"]
[null,"Added Mix Types to gradation sheet and to drop down. They include SS3269 (PFC_F, PFC_C, PFCR_F, PFCR_C), SS3271 (SMA_F), SS3268 (TYPE_F)."]
["2013-06-07","Tx236 Worksheet",null,null,null,null,null,null,null,null,"Gisel Carrasco"]
[null,"Add TOM mix"]
["2013-05-14","Tx236 Worksheet",null,null,null,null,null,null,null,null,"Travis Patton"]
[null,"Added Mix Types to gradation sheet and to drop down. They include SS3270 (SP_A, SP_B, SP_C, and SP_D)."]
["2009-07-16","Tx236 Worksheet",null,null,null,null,null,null,null,null,"Gisel Carrasco"]
[null,"Add a \"Washed Sample Weight\" cells for each blank sample (D24 & E 24). Mark the results in the \"Combined Gradation\" that are outside of the master gradation. Mark the asphalt contents when they aren't in increments of 0.5%. "]
["2008-02-27","Tx236 Worksheet",null,null,null,null,null,null,null,null,"Gisel Carrasco"]
[null,"Add more options to cell H15 (Mix Type): PFC_AR, PFC_PG76, UTBWC_A, UTBWC_B, UTBWC_C, TBPFC_AR, TBPFC_PG76 & Microsurfacing"]
[]
[null,"Add version 3 if authorized after 3/1/2009 (cell F96). Keep version 2 from 6/1/2008 to 3/1/2009, use version 1 before 6/1/2008"]
[]
[null,"Use cumulative % Retained for Microsurfacing mixtures"]
[null,"Add sieve sizes according to mix type"]
[null,"Add cumulative option for blank and ignited samples"]
[null,"Change from percent passing to cumulative or individual weight retained for blank samples"]
[null,"Add the \"Recycled Materials\" table to enter the gradation of recycled materials in percent passing"]
[null,"Calculate the combined gradation of the ‘blank’ samples and recycled materials, when applicable (Correction Factor Calculations Table)"]
[]
[null,"Summary Worksheet"]
[null,"Add worksheet with correction factors information only (print copy)"]
[null,"Sheet1 Worksheet"]
[null,"Add equations to change individual or cumulative percents to percent passing for blank samples"]
[null,"Use cumulative % Retained for Microsurfacing mixtures"]
[null,"Revisions Worksheet"]
[null,"Add worksheet to track changes to template"]
[null,"Data Worksheet"]
[null,"Add sieves for new mix types"]
[null,"Include gradation requirements (% Passing or %Retained) for each mix type"]
[null,"Include recycled materials requirement for each mix type"]
["2008-03-25","Sheet1 Worksheet",null,null,null,null,null,null,null,null,"Brett Haggerty"]
[null,"Modified the calculations for 2nd blank sample % passing bands, to reference the correct column in the Tx236 worksheet (E Column)"]
["2019-08-16","Tx236 Worksheet",null,null,null,null,null,null,null,null,"Syeda Rahman"]
[null,"Reduced number of blanks and burns "]
[null,"Added asphalt content verification table"]
[null,"Summary Worksheet"]
[null,"Reduced number of burns to OAC only"]
[null,"Sheet1 Worksheet"]
[null,"Made changes related to the above fixes"]
[null,"RX Worksheet"]
[null,"Added new fields (rows, no numbers) for the asphalt content verification table"]
["2019-12-10","Tx236 Worksheet"]
[null,"Added parts to the test method",null,null,null,null,null,null,null,null,"Syeda Rahman"]
[null,"Changed Laboratory AC % @OAC to Target AC% @OAC in AC verification table"]
[null,"Added Correction Factor Test Date field on Tx236 sheet and enforced input to this field"]
[null,"Flagged correction factors when they are older than 12 months"]
[null,"Added special spec items 3076 and 3077"]
["2020-02-26","Added special spec item 3074, balanced mix design"]
["2025-03-03","Added \"Other\" to the Mix Type list and Custom Gradation form to allow inputs for ATB and other customized gradations",null,null,null,null,null,null,null,null,"Syeda Rahman"]