{"text_format":"1","workbook":"xlsx","n_sheets":4,"sheets":["Tex-242-F","spcyr","RX","Revisions"],"not_rendered":{"charts":0,"images":1,"macros":1,"external_links":0,"defined_names":83,"comments":1,"pivot_tables":0},"unopened":[],"bounds":{"document_bytes":16777216,"sheet_cells":100000,"rows_first":2000,"rows_last":500,"rows_between":2000,"halvings":0,"cell_chars":16384,"cell_head_chars":4096},"cells_cut":0,"cells_raw":0,"read":"whole","date_system":"1900"}

{"sheet":"Tex-242-F","index":0,"n_rows":50,"n_cols":11,"rows_kept":50,"cut":false,"hidden":false,"merged":[[50,1,50,3],[46,6,46,8],[35,1,36,8],[44,2,44,4],[12,7,12,8],[12,3,12,4],[43,2,43,4],[37,1,37,8],[46,1,46,3],[13,3,13,4],[16,3,16,4],[22,1,22,3],[24,1,24,3],[25,1,25,3],[38,1,38,8],[20,4,20,6],[0,0,0,1],[11,3,11,4],[7,7,7,8],[10,7,10,8],[7,3,7,4],[8,3,8,4],[8,7,8,8],[10,3,10,4],[9,7,9,8],[9,3,9,4],[27,1,27,3],[26,1,26,3],[11,7,11,8],[15,3,15,8],[13,7,13,8],[16,7,16,8],[14,3,14,8],[40,2,40,4],[41,2,41,4],[28,1,28,3],[30,1,30,3],[32,1,32,3]]}
["TxDOT Manuals >",null,null,"Tex-242-F"]
[null,"TEXAS DEPARTMENT OF TRANSPORTATION",null,null,null,null,null,null,null,null,33]
[null,null,null,null,null,null,null,null,null,null,1]
[null,null,null,null,null,null,null,null,null,null,"tx242.xlsm::45574.640532"]
[null,"HAMBURG WHEEL-TRACKING TEST"]
[null,"Tex-242-F"]
[null,null,null,null,null,null,null,null,{"$f":"\"File Version: \" & TEXT(MID(sn,SEARCH(\"::\",sn,1)+2,20),\"mm/dd/yy hh:mm:ss\")","v":"File Version: 10/09/24 15:22:22"}]
[null,null,"SAMPLE ID:",null,null,null,"SAMPLED DATE:"]
[null,null,"TEST NUMBER:",null,null,null,"LETTING DATE:"]
[null,null,"SAMPLE STATUS:",null,null,null,"CONTROLLING CSJ:"]
[null,null,"COUNTY:",null,null,null,"SPEC YEAR:"]
[null,null,"SAMPLED BY:",null,null,null,"SPEC ITEM:"]
[null,null,"SAMPLE LOCATION:",null,null,null,"SPECIAL PROVISION:"]
[null,null,"MATERIAL CODE:",null,null,null,"MIX TYPE:"]
[null,null,"MATERIAL NAME:"]
[null,null,"PRODUCER:"]
[null,null,"AREA ENGINEER:",null,null,null,"PROJECT MANAGER:"]
[]
[null,null,"COURSE\\LIFT:",null,"STATION:",null,null,"DIST. FROM CL:"]
[]
[null,null,null,null,"SET"]
[null,null,null,null,1,2,3]
[null,"Specimen Type:"]
[]
[null,"Rut Depth at 5,000 Passes (mm):"]
[null,"Rut Depth at 10,000 Passes (mm):"]
[null,"Rut Depth at 15,000 Passes (mm):"]
[null,"Rut Depth at 20,000 Passes (mm):"]
[null,{"$f":"\"Rut Depth at Failure (mm):\"","v":"Rut Depth at Failure (mm):"}]
[]
[null,"Number of Passes at Failure:"]
[]
[null,"Temperature:"]
[]
[null,"Remarks:",{"$f":"NOW()","v":"2024-10-09T15:22:22.760"}]
[]
[]
[]
[]
[]
[null,"Sample Method:","Sampled By:",null,null,"Sampled Date:"]
[null,"TX222"]
[]
[null,"Test Method:","Tested By:",null,null,"Tested Date:"]
[null,"TX242"]
[null,"Test Stamp Code:",null,null,"Omit Test:","Completed Date:","Reviewed By:"]
[]
[null,"Locked By:","TxDOT:","District:","Area:"]
[]
[null,"Authorized By:",null,null,"Authorized Date:"]

{"sheet":"spcyr","index":1,"n_rows":29,"n_cols":3,"rows_kept":29,"cut":false,"hidden":true,"merged":[]}
["spec2024","spec2014","spec2004"]
["DG_B","DG_A","DG_A"]
["DG_C","DG_B","DG_B"]
["DG_D","DG_C","DG_C"]
["DG_F","DG_D","DG_D"]
["PFC_C","DG_F","DG_F"]
["PFC_F","PFC_C","PFC_C"]
["SP-B","PFC_F","PFC_F"]
["SP-C","PFCR_C","PFCR_C"]
["SP-D","PFCR_F","PFCR_F"]
["SMA-C","SP-A","SP-A"]
["SMA-D","SP-B","SP-B"]
["SMA-F","SP-C","SP-C"]
["SMAR-F","SP-D","SP-D"]
["TOM_C","SMA-C","CMHB-C"]
["TOM_F","SMA-D","CMHB-F"]
["TBPFC_C","SMA-F","SMA-C"]
["TBPFC_F","SMAR-C","SMA-D"]
["TBFC_A","SMAR-F","SMA-F"]
["TBFC_B","TOM_C","SMAR-C"]
["TBFC_C","TOM_F","SMAR-F"]
[null,"TBPFC_C","TOM_C"]
[null,"TBPFC_F","TOM_F"]
[null,"TBPFCR_C","TBPFC_C"]
[null,"TBWC_A","TBPFC_F"]
[null,"TBWC_B","TBPFCR_C"]
[null,"TBWC_C","TBWC_A"]
[null,null,"TBWC_B"]
[null,null,"TBWC_C"]

{"sheet":"RX","index":2,"n_rows":30,"n_cols":9,"rows_kept":30,"cut":false,"hidden":true,"merged":[]}
[28]
["Fld_nbr","Value","Desc_1","Desc_2","Desc_3","Desc_4","Desc_5","Desc_6","Desc_7"]
[1,{"$f":"IF('Tex-242-F'!$B$36=\"\",\"\",'Tex-242-F'!$B$36)","v":""},{"$f":"'Tex-242-F'!$B$35","v":"Remarks:"}]
[2,{"$f":"IF('Tex-242-F'!$D$19=\"\",\"\",'Tex-242-F'!$D$19)","v":""},{"$f":"IF('Tex-242-F'!$C$19=\"\",\"\",'Tex-242-F'!$C$19)","v":"COURSE\\LIFT:"}]
[3,{"$f":"IF('Tex-242-F'!$C$45=\"\",\"\",'Tex-242-F'!$C$45)","v":""},"Tested By ",{"$f":"IF('Tex-242-F'!$B$45=\"\",\"\",'Tex-242-F'!$B$45)","v":"TX242"}]
[4,{"$f":"IF('Tex-242-F'!$F$45=\"\",\"\",'Tex-242-F'!$F$45)","v":""},"Tested Date ",{"$f":"IF('Tex-242-F'!$B$45=\"\",\"\",'Tex-242-F'!$B$45)","v":"TX242"}]
[5,{"$f":"IF('Tex-242-F'!$E$23=\"\",\"\",'Tex-242-F'!$E$23)","v":""},{"$f":"IF('Tex-242-F'!$B$6=\"\",\"\",'Tex-242-F'!$B$6)","v":"Tex-242-F"},{"$f":"IF('Tex-242-F'!$B$23=\"\",\"\",'Tex-242-F'!$B$23)","v":"Specimen Type:"},{"$f":"IF('Tex-242-F'!$E$21=\"\",\"\",'Tex-242-F'!$E$21)","v":"SET"},{"$f":"IF('Tex-242-F'!$E$22=\"\",\"\",'Tex-242-F'!$E$22)","v":1}]
[6,{"$f":"IF('Tex-242-F'!$F$23=\"\",\"\",'Tex-242-F'!$F$23)","v":""},{"$f":"IF('Tex-242-F'!$B$6=\"\",\"\",'Tex-242-F'!$B$6)","v":"Tex-242-F"},{"$f":"IF('Tex-242-F'!$B$23=\"\",\"\",'Tex-242-F'!$B$23)","v":"Specimen Type:"},{"$f":"IF('Tex-242-F'!$E$21=\"\",\"\",'Tex-242-F'!$E$21)","v":"SET"},{"$f":"IF('Tex-242-F'!$F$22=\"\",\"\",'Tex-242-F'!$F$22)","v":2}]
[7,{"$f":"IF('Tex-242-F'!$G$23=\"\",\"\",'Tex-242-F'!$G$23)","v":""},{"$f":"IF('Tex-242-F'!$B$6=\"\",\"\",'Tex-242-F'!$B$6)","v":"Tex-242-F"},{"$f":"IF('Tex-242-F'!$B$23=\"\",\"\",'Tex-242-F'!$B$23)","v":"Specimen Type:"},{"$f":"IF('Tex-242-F'!$E$21=\"\",\"\",'Tex-242-F'!$E$21)","v":"SET"},{"$f":"IF('Tex-242-F'!$G$22=\"\",\"\",'Tex-242-F'!$G$22)","v":3}]
[8,{"$f":"IF('Tex-242-F'!$E$29=\"\",\"\",'Tex-242-F'!$E$29)","v":""},{"$f":"IF('Tex-242-F'!$B$6=\"\",\"\",'Tex-242-F'!$B$6)","v":"Tex-242-F"},{"$f":"IF('Tex-242-F'!$B$29=\"\",\"\",'Tex-242-F'!$B$29)","v":"Rut Depth at Failure (mm):"},{"$f":"IF('Tex-242-F'!$E$21=\"\",\"\",'Tex-242-F'!$E$21)","v":"SET"},{"$f":"IF('Tex-242-F'!$E$22=\"\",\"\",'Tex-242-F'!$E$22)","v":1}]
[9,{"$f":"IF('Tex-242-F'!$F$29=\"\",\"\",'Tex-242-F'!$F$29)","v":""},{"$f":"IF('Tex-242-F'!$B$6=\"\",\"\",'Tex-242-F'!$B$6)","v":"Tex-242-F"},{"$f":"IF('Tex-242-F'!$B$29=\"\",\"\",'Tex-242-F'!$B$29)","v":"Rut Depth at Failure (mm):"},{"$f":"IF('Tex-242-F'!$E$21=\"\",\"\",'Tex-242-F'!$E$21)","v":"SET"},{"$f":"IF('Tex-242-F'!$F$22=\"\",\"\",'Tex-242-F'!$F$22)","v":2}]
[10,{"$f":"IF('Tex-242-F'!$G$29=\"\",\"\",'Tex-242-F'!$G$29)","v":""},{"$f":"IF('Tex-242-F'!$B$6=\"\",\"\",'Tex-242-F'!$B$6)","v":"Tex-242-F"},{"$f":"IF('Tex-242-F'!$B$29=\"\",\"\",'Tex-242-F'!$B$29)","v":"Rut Depth at Failure (mm):"},{"$f":"IF('Tex-242-F'!$E$21=\"\",\"\",'Tex-242-F'!$E$21)","v":"SET"},{"$f":"IF('Tex-242-F'!$G$22=\"\",\"\",'Tex-242-F'!$G$22)","v":3}]
[11,{"$f":"IF('Tex-242-F'!$E$31=\"\",\"\",'Tex-242-F'!$E$31)","v":""},{"$f":"IF('Tex-242-F'!$B$6=\"\",\"\",'Tex-242-F'!$B$6)","v":"Tex-242-F"},{"$f":"IF('Tex-242-F'!$B$31=\"\",\"\",'Tex-242-F'!$B$31)","v":"Number of Passes at Failure:"},{"$f":"IF('Tex-242-F'!$E$21=\"\",\"\",'Tex-242-F'!$E$21)","v":"SET"},{"$f":"IF('Tex-242-F'!$E$22=\"\",\"\",'Tex-242-F'!$E$22)","v":1}]
[12,{"$f":"IF('Tex-242-F'!$F$31=\"\",\"\",'Tex-242-F'!$F$31)","v":""},{"$f":"IF('Tex-242-F'!$B$6=\"\",\"\",'Tex-242-F'!$B$6)","v":"Tex-242-F"},{"$f":"IF('Tex-242-F'!$B$31=\"\",\"\",'Tex-242-F'!$B$31)","v":"Number of Passes at Failure:"},{"$f":"IF('Tex-242-F'!$E$21=\"\",\"\",'Tex-242-F'!$E$21)","v":"SET"},{"$f":"IF('Tex-242-F'!$F$22=\"\",\"\",'Tex-242-F'!$F$22)","v":2}]
[13,{"$f":"IF('Tex-242-F'!$G$31=\"\",\"\",'Tex-242-F'!$G$31)","v":""},{"$f":"IF('Tex-242-F'!$B$6=\"\",\"\",'Tex-242-F'!$B$6)","v":"Tex-242-F"},{"$f":"IF('Tex-242-F'!$B$31=\"\",\"\",'Tex-242-F'!$B$31)","v":"Number of Passes at Failure:"},{"$f":"IF('Tex-242-F'!$E$21=\"\",\"\",'Tex-242-F'!$E$21)","v":"SET"},{"$f":"IF('Tex-242-F'!$G$22=\"\",\"\",'Tex-242-F'!$G$22)","v":3}]
[14,{"$f":"IF('Tex-242-F'!$E$33=\"\",\"\",'Tex-242-F'!$E$33)","v":""},{"$f":"IF('Tex-242-F'!$B$6=\"\",\"\",'Tex-242-F'!$B$6)","v":"Tex-242-F"},{"$f":"IF('Tex-242-F'!$B$33=\"\",\"\",'Tex-242-F'!$B$33)","v":"Temperature:"}]
[15,{"$f":"IF('Tex-242-F'!$E$25=\"\",\"\",'Tex-242-F'!$E$25)","v":""},{"$f":"IF('Tex-242-F'!$B$6=\"\",\"\",'Tex-242-F'!$B$6)","v":"Tex-242-F"},{"$f":"IF('Tex-242-F'!$B$23=\"\",\"\",'Tex-242-F'!$B$23)","v":"Specimen Type:"},{"$f":"IF('Tex-242-F'!$E$21=\"\",\"\",'Tex-242-F'!$E$21)","v":"SET"},{"$f":"IF('Tex-242-F'!$E$22=\"\",\"\",'Tex-242-F'!$E$22)","v":1},{"$f":"IF('Tex-242-F'!$B$25=\"\",\"\",'Tex-242-F'!$B$25)","v":"Rut Depth at 5,000 Passes (mm):"}]
[16,{"$f":"IF('Tex-242-F'!$E$26=\"\",\"\",'Tex-242-F'!$E$26)","v":""},{"$f":"IF('Tex-242-F'!$B$6=\"\",\"\",'Tex-242-F'!$B$6)","v":"Tex-242-F"},{"$f":"IF('Tex-242-F'!$B$23=\"\",\"\",'Tex-242-F'!$B$23)","v":"Specimen Type:"},{"$f":"IF('Tex-242-F'!$E$21=\"\",\"\",'Tex-242-F'!$E$21)","v":"SET"},{"$f":"IF('Tex-242-F'!$E$22=\"\",\"\",'Tex-242-F'!$E$22)","v":1},{"$f":"IF('Tex-242-F'!$B$26=\"\",\"\",'Tex-242-F'!$B$26)","v":"Rut Depth at 10,000 Passes (mm):"}]
[17,{"$f":"IF('Tex-242-F'!$E$27=\"\",\"\",'Tex-242-F'!$E$27)","v":""},{"$f":"IF('Tex-242-F'!$B$6=\"\",\"\",'Tex-242-F'!$B$6)","v":"Tex-242-F"},{"$f":"IF('Tex-242-F'!$B$23=\"\",\"\",'Tex-242-F'!$B$23)","v":"Specimen Type:"},{"$f":"IF('Tex-242-F'!$E$21=\"\",\"\",'Tex-242-F'!$E$21)","v":"SET"},{"$f":"IF('Tex-242-F'!$E$22=\"\",\"\",'Tex-242-F'!$E$22)","v":1},{"$f":"IF('Tex-242-F'!$B$27=\"\",\"\",'Tex-242-F'!$B$27)","v":"Rut Depth at 15,000 Passes (mm):"}]
[18,{"$f":"IF('Tex-242-F'!$E$28=\"\",\"\",'Tex-242-F'!$E$28)","v":""},{"$f":"IF('Tex-242-F'!$B$6=\"\",\"\",'Tex-242-F'!$B$6)","v":"Tex-242-F"},{"$f":"IF('Tex-242-F'!$B$23=\"\",\"\",'Tex-242-F'!$B$23)","v":"Specimen Type:"},{"$f":"IF('Tex-242-F'!$E$21=\"\",\"\",'Tex-242-F'!$E$21)","v":"SET"},{"$f":"IF('Tex-242-F'!$E$22=\"\",\"\",'Tex-242-F'!$E$22)","v":1},{"$f":"IF('Tex-242-F'!$B$28=\"\",\"\",'Tex-242-F'!$B$28)","v":"Rut Depth at 20,000 Passes (mm):"}]
[19,{"$f":"IF('Tex-242-F'!$F$25=\"\",\"\",'Tex-242-F'!$F$25)","v":""},{"$f":"IF('Tex-242-F'!$B$6=\"\",\"\",'Tex-242-F'!$B$6)","v":"Tex-242-F"},{"$f":"IF('Tex-242-F'!$B$23=\"\",\"\",'Tex-242-F'!$B$23)","v":"Specimen Type:"},{"$f":"IF('Tex-242-F'!$E$21=\"\",\"\",'Tex-242-F'!$E$21)","v":"SET"},{"$f":"IF('Tex-242-F'!$F$22=\"\",\"\",'Tex-242-F'!$F$22)","v":2},{"$f":"IF('Tex-242-F'!$B$25=\"\",\"\",'Tex-242-F'!$B$25)","v":"Rut Depth at 5,000 Passes (mm):"}]
[20,{"$f":"IF('Tex-242-F'!$F$26=\"\",\"\",'Tex-242-F'!$F$26)","v":""},{"$f":"IF('Tex-242-F'!$B$6=\"\",\"\",'Tex-242-F'!$B$6)","v":"Tex-242-F"},{"$f":"IF('Tex-242-F'!$B$23=\"\",\"\",'Tex-242-F'!$B$23)","v":"Specimen Type:"},{"$f":"IF('Tex-242-F'!$E$21=\"\",\"\",'Tex-242-F'!$E$21)","v":"SET"},{"$f":"IF('Tex-242-F'!$F$22=\"\",\"\",'Tex-242-F'!$F$22)","v":2},{"$f":"IF('Tex-242-F'!$B$26=\"\",\"\",'Tex-242-F'!$B$26)","v":"Rut Depth at 10,000 Passes (mm):"}]
[21,{"$f":"IF('Tex-242-F'!$F$27=\"\",\"\",'Tex-242-F'!$F$27)","v":""},{"$f":"IF('Tex-242-F'!$B$6=\"\",\"\",'Tex-242-F'!$B$6)","v":"Tex-242-F"},{"$f":"IF('Tex-242-F'!$B$23=\"\",\"\",'Tex-242-F'!$B$23)","v":"Specimen Type:"},{"$f":"IF('Tex-242-F'!$E$21=\"\",\"\",'Tex-242-F'!$E$21)","v":"SET"},{"$f":"IF('Tex-242-F'!$F$22=\"\",\"\",'Tex-242-F'!$F$22)","v":2},{"$f":"IF('Tex-242-F'!$B$27=\"\",\"\",'Tex-242-F'!$B$27)","v":"Rut Depth at 15,000 Passes (mm):"}]
[22,{"$f":"IF('Tex-242-F'!$F$28=\"\",\"\",'Tex-242-F'!$F$28)","v":""},{"$f":"IF('Tex-242-F'!$B$6=\"\",\"\",'Tex-242-F'!$B$6)","v":"Tex-242-F"},{"$f":"IF('Tex-242-F'!$B$23=\"\",\"\",'Tex-242-F'!$B$23)","v":"Specimen Type:"},{"$f":"IF('Tex-242-F'!$E$21=\"\",\"\",'Tex-242-F'!$E$21)","v":"SET"},{"$f":"IF('Tex-242-F'!$F$22=\"\",\"\",'Tex-242-F'!$F$22)","v":2},{"$f":"IF('Tex-242-F'!$B$28=\"\",\"\",'Tex-242-F'!$B$28)","v":"Rut Depth at 20,000 Passes (mm):"}]
[23,{"$f":"IF('Tex-242-F'!$G$25=\"\",\"\",'Tex-242-F'!$G$25)","v":""},{"$f":"IF('Tex-242-F'!$B$6=\"\",\"\",'Tex-242-F'!$B$6)","v":"Tex-242-F"},{"$f":"IF('Tex-242-F'!$B$23=\"\",\"\",'Tex-242-F'!$B$23)","v":"Specimen Type:"},{"$f":"IF('Tex-242-F'!$E$21=\"\",\"\",'Tex-242-F'!$E$21)","v":"SET"},{"$f":"IF('Tex-242-F'!$G$22=\"\",\"\",'Tex-242-F'!$G$22)","v":3},{"$f":"IF('Tex-242-F'!$B$25=\"\",\"\",'Tex-242-F'!$B$25)","v":"Rut Depth at 5,000 Passes (mm):"}]
[24,{"$f":"IF('Tex-242-F'!$G$26=\"\",\"\",'Tex-242-F'!$G$26)","v":""},{"$f":"IF('Tex-242-F'!$B$6=\"\",\"\",'Tex-242-F'!$B$6)","v":"Tex-242-F"},{"$f":"IF('Tex-242-F'!$B$23=\"\",\"\",'Tex-242-F'!$B$23)","v":"Specimen Type:"},{"$f":"IF('Tex-242-F'!$E$21=\"\",\"\",'Tex-242-F'!$E$21)","v":"SET"},{"$f":"IF('Tex-242-F'!$G$22=\"\",\"\",'Tex-242-F'!$G$22)","v":3},{"$f":"IF('Tex-242-F'!$B$26=\"\",\"\",'Tex-242-F'!$B$26)","v":"Rut Depth at 10,000 Passes (mm):"}]
[25,{"$f":"IF('Tex-242-F'!$G$27=\"\",\"\",'Tex-242-F'!$G$27)","v":""},{"$f":"IF('Tex-242-F'!$B$6=\"\",\"\",'Tex-242-F'!$B$6)","v":"Tex-242-F"},{"$f":"IF('Tex-242-F'!$B$23=\"\",\"\",'Tex-242-F'!$B$23)","v":"Specimen Type:"},{"$f":"IF('Tex-242-F'!$E$21=\"\",\"\",'Tex-242-F'!$E$21)","v":"SET"},{"$f":"IF('Tex-242-F'!$G$22=\"\",\"\",'Tex-242-F'!$G$22)","v":3},{"$f":"IF('Tex-242-F'!$B$27=\"\",\"\",'Tex-242-F'!$B$27)","v":"Rut Depth at 15,000 Passes (mm):"}]
[26,{"$f":"IF('Tex-242-F'!$G$28=\"\",\"\",'Tex-242-F'!$G$28)","v":""},{"$f":"IF('Tex-242-F'!$B$6=\"\",\"\",'Tex-242-F'!$B$6)","v":"Tex-242-F"},{"$f":"IF('Tex-242-F'!$B$23=\"\",\"\",'Tex-242-F'!$B$23)","v":"Specimen Type:"},{"$f":"IF('Tex-242-F'!$E$21=\"\",\"\",'Tex-242-F'!$E$21)","v":"SET"},{"$f":"IF('Tex-242-F'!$G$22=\"\",\"\",'Tex-242-F'!$G$22)","v":3},{"$f":"IF('Tex-242-F'!$B$28=\"\",\"\",'Tex-242-F'!$B$28)","v":"Rut Depth at 20,000 Passes (mm):"}]
[27,{"$f":"IF('Tex-242-F'!$C$42=\"\",\"\",'Tex-242-F'!$C$42)","v":""},"Sampled By ",{"$f":"IF('Tex-242-F'!$B$42=\"\",\"\",'Tex-242-F'!$B$42)","v":"TX222"}]
[28,{"$f":"IF('Tex-242-F'!$F$42=\"\",\"\",'Tex-242-F'!$F$42)","v":""},"Sampled Date ",{"$f":"IF('Tex-242-F'!$B$42=\"\",\"\",'Tex-242-F'!$B$42)","v":"TX222"}]

{"sheet":"Revisions","index":3,"n_rows":3,"n_cols":4,"rows_kept":3,"cut":false,"hidden":true,"merged":[]}
["Date","Changes","By","Comments"]
["2005-05-25","Unprotect field 10","Joe Liu"]
["2009-05-06","Add in fields 20 to 31, these will be modeled to collect the rut depth at various locations during the HWT test","Brett Haggerty"]