{"text_format":"1","workbook":"xlsx","n_sheets":3,"sheets":["Tex-244-F","RX","Lists"],"not_rendered":{"charts":0,"images":1,"macros":1,"external_links":0,"defined_names":86,"comments":1,"pivot_tables":0},"unopened":[],"bounds":{"document_bytes":16777216,"sheet_cells":100000,"rows_first":2000,"rows_last":500,"rows_between":2000,"halvings":0,"cell_chars":16384,"cell_head_chars":4096},"cells_cut":0,"cells_raw":0,"read":"whole","date_system":"1900"}

{"sheet":"Tex-244-F","index":0,"n_rows":57,"n_cols":11,"rows_kept":57,"cut":false,"hidden":false,"merged":[[56,1,56,3],[52,6,52,8],[45,1,46,8],[50,2,50,4],[12,7,12,8],[52,1,52,3],[12,3,12,4],[38,1,38,3],[40,1,40,4],[40,5,40,8],[41,1,41,2],[41,3,41,4],[41,5,41,6],[41,7,41,8],[42,1,42,2],[25,1,25,4],[11,7,11,8],[49,2,49,4],[20,5,20,6],[23,1,23,4],[29,1,29,4],[31,1,31,4],[20,1,20,3],[20,7,20,8],[48,1,48,8],[47,1,47,8],[33,1,33,4],[35,1,35,4],[42,3,42,4],[42,5,42,6],[42,7,42,8],[27,1,27,4],[0,0,0,1],[13,7,13,8],[16,7,16,8],[14,3,14,8],[13,3,13,4],[16,3,16,4],[7,7,7,8],[10,7,10,8],[7,3,7,4],[8,3,8,4],[8,7,8,8],[10,3,10,4],[9,7,9,8],[9,3,9,4],[15,3,15,8],[11,3,11,4]]}
["TxDOT Manuals >",null,null,"Tex-244-F"]
[null,"TEXAS DEPARTMENT OF TRANSPORTATION",null,null,null,null,null,null,null,"UPLC-",36]
[null,null,null,null,null,null,null,null,null,"DLT-",1]
[null,null,null,null,null,null,null,null,null,"SN-","tx244-4.xlsm::45574.641597"]
[null,"THERMAL PROFILE OF HOT MIX ASPHALT"]
[null,"Tex-244-F"]
[null,null,null,null,null,null,null,null,{"$f":"\"TX244 :: File Version: \" & TEXT(MID(sn,SEARCH(\"::\",sn,1)+2,20),\"mm/dd/yy hh:mm:ss\")","v":"TX244 :: File Version: 10/09/24 15:23:54"}]
[null,null,"SAMPLE ID:",null,null,null,"SAMPLED DATE:"]
[null,null,"TEST NUMBER:",null,null,null,"LETTING DATE:"]
[null,null,"SAMPLE STATUS:",null,null,null,"CONTROLLING CSJ:"]
[null,null,"COUNTY:",null,null,null,"SPEC YEAR:"]
[null,null,"SAMPLED BY:",null,null,null,"SPEC ITEM:"]
[null,null,"SAMPLE LOCATION:",null,null,null,"SPECIAL PROVISION:"]
[null,null,"MATERIAL CODE:",null,null,null,"GRADE:"]
[null,null,"MATERIAL NAME:"]
[null,null,"PRODUCER:"]
[null,null,"AREA ENGINEER:",null,null,null,"PROJECT MANAGER:"]
[]
[null,null,"COURSE\\LIFT:",null,"STATION:",null,null,"DIST. FROM CL:"]
[]
[null,"LOT NUMBER:",null,null,null,"EQUIPMENT USED: "]
[]
[null,null,null,null,null,1,2,3,4]
[null,"SUBLOT NUMBER:"]
[]
[null,"Starting Station:"]
[]
[null,"Ending Station:"]
[]
[null,"Maximum Baseline Temperature, °F:"]
[]
[null,"Lowest Allowable Profile Temperature, °F:",null,null,null,{"$f":"IF(F30=\"\",\"\", F30-25)","v":""},{"$f":"IF(G30=\"\",\"\", G30-25)","v":""},{"$f":"IF(H30=\"\",\"\", H30-25)","v":""},{"$f":"IF(I30=\"\",\"\", I30-25)","v":""}]
[]
[null,"Minimum Profile Temperature, °F:"]
[]
[null,"Temperature Differential, °F:",null,null,null,{"$f":"+IF(OR(F30=\"\",F34=\"\"),\"\", ABS(F30-F34))","v":""},{"$f":"+IF(OR(G30=\"\",G34=\"\"),\"\", ABS(G30-G34))","v":""},{"$f":"+IF(OR(H30=\"\",H34=\"\"),\"\", ABS(H30-H34))","v":""},{"$f":"+IF(OR(I30=\"\",I34=\"\"),\"\", ABS(I30-I34))","v":""}]
[null,null,null,null,null,{"$f":"IF(F36=\"\",\"\",IF(F36>50,\"Severe Seg\",IF(F36>25,\"Moderate Seg\",\"\")))","v":""},{"$f":"IF(G36=\"\",\"\",IF(G36>50,\"Severe Seg\",IF(G36>25,\"Moderate Seg\",\"\")))","v":""},{"$f":"IF(H36=\"\",\"\",IF(H36>50,\"Severe Seg\",IF(H36>25,\"Moderate Seg\",\"\")))","v":""},{"$f":"IF(I36=\"\",\"\",IF(I36>50,\"Severe Seg\",IF(I36>25,\"Moderate Seg\",\"\")))","v":""}]
[]
[null,"Number of Profiles:"]
[]
[null,"Moderate \n25.0°F < differential <= 50.0°F",null,null,null,"Severe \ndifferential > 50.0°F"]
[null,"Number",null,"Percent",null,"Number",null,"Percent"]
[]
[]
[null,"Remarks:",{"$f":"NOW()","v":"2024-10-09T15:23:54.260"}]
[]
[]
[]
[]
[null,"Test Method:","Tested By:",null,null,"Tested Date:"]
[null,"TX244"]
[null,"Test Stamp Code:",null,null,"Omit Test:","Completed Date:","Reviewed By:"]
[]
[null,"Locked By:","TxDOT:","District:","Area:"]
[]
[null,"Authorized By:",null,null,"Authorized Date:"]
[null,null,null,null,null,{"$f":"IF(OR(ISBLANK(AuthorizedDate),AuthorizedDate>42752),1,0)","v":1}]

{"sheet":"RX","index":1,"n_rows":41,"n_cols":9,"rows_kept":41,"cut":false,"hidden":true,"merged":[]}
[31]
["Fld_nbr","Value","Desc_1","Desc_2","Desc_3","Desc_4","Desc_5","Desc_6","Desc_7"]
[1,{"$f":"IF('Tex-244-F'!$B$46=\"\",\"\",'Tex-244-F'!$B$46)","v":""},{"$f":"'Tex-244-F'!$B$45","v":"Remarks:"}]
[2,{"$f":"IF('Tex-244-F'!$D$19=\"\",\"\",'Tex-244-F'!$D$19)","v":""},{"$f":"IF('Tex-244-F'!$C$19=\"\",\"\",'Tex-244-F'!$C$19)","v":"COURSE\\LIFT:"}]
[3,{"$f":"IF('Tex-244-F'!$C$51=\"\",\"\",'Tex-244-F'!$C$51)","v":""},"Tested By ",{"$f":"IF('Tex-244-F'!$B$51=\"\",\"\",'Tex-244-F'!$B$51)","v":"TX244"}]
[4,{"$f":"IF('Tex-244-F'!$F$51=\"\",\"\",'Tex-244-F'!$F$51)","v":""},"Tested Date ",{"$f":"IF('Tex-244-F'!$B$51=\"\",\"\",'Tex-244-F'!$B$51)","v":"TX244"}]
[5,{"$f":"IF('Tex-244-F'!E21=\"\",\"\",'Tex-244-F'!E21)","v":""},{"$f":"IF('Tex-244-F'!$B$6=\"\",\"\",'Tex-244-F'!$B$6)","v":"Tex-244-F"},{"$f":"IF('Tex-244-F'!$B$21=\"\",\"\",'Tex-244-F'!$B$21)","v":"LOT NUMBER:"}]
[6,{"$f":"IF('Tex-244-F'!$F$24=\"\",\"\",'Tex-244-F'!$F$24)","v":""},{"$f":"IF('Tex-244-F'!$B$6=\"\",\"\",'Tex-244-F'!$B$6)","v":"Tex-244-F"},{"$f":"IF('Tex-244-F'!$B$24=\"\",\"\",'Tex-244-F'!$B$24)","v":"SUBLOT NUMBER:"},{"$f":"IF('Tex-244-F'!$F$23=\"\",\"\",'Tex-244-F'!$F$23)","v":1}]
[7,{"$f":"IF('Tex-244-F'!$G$24=\"\",\"\",'Tex-244-F'!$G$24)","v":""},{"$f":"IF('Tex-244-F'!$B$6=\"\",\"\",'Tex-244-F'!$B$6)","v":"Tex-244-F"},{"$f":"IF('Tex-244-F'!$B$24=\"\",\"\",'Tex-244-F'!$B$24)","v":"SUBLOT NUMBER:"},{"$f":"IF('Tex-244-F'!$G$23=\"\",\"\",'Tex-244-F'!$G$23)","v":2}]
[8,{"$f":"IF('Tex-244-F'!$H$24=\"\",\"\",'Tex-244-F'!$H$24)","v":""},{"$f":"IF('Tex-244-F'!$B$6=\"\",\"\",'Tex-244-F'!$B$6)","v":"Tex-244-F"},{"$f":"IF('Tex-244-F'!$B$24=\"\",\"\",'Tex-244-F'!$B$24)","v":"SUBLOT NUMBER:"},{"$f":"IF('Tex-244-F'!$H$23=\"\",\"\",'Tex-244-F'!$H$23)","v":3}]
[9,{"$f":"IF('Tex-244-F'!$I$24=\"\",\"\",'Tex-244-F'!$I$24)","v":""},{"$f":"IF('Tex-244-F'!$B$6=\"\",\"\",'Tex-244-F'!$B$6)","v":"Tex-244-F"},{"$f":"IF('Tex-244-F'!$B$24=\"\",\"\",'Tex-244-F'!$B$24)","v":"SUBLOT NUMBER:"},{"$f":"IF('Tex-244-F'!$I$23=\"\",\"\",'Tex-244-F'!$I$23)","v":4}]
[10,{"$f":"IF('Tex-244-F'!$F$30=\"\",\"\",'Tex-244-F'!$F$30)","v":""},{"$f":"IF('Tex-244-F'!$B$6=\"\",\"\",'Tex-244-F'!$B$6)","v":"Tex-244-F"},{"$f":"IF('Tex-244-F'!$B$30=\"\",\"\",'Tex-244-F'!$B$30)","v":"Maximum Baseline Temperature, °F:"},{"$f":"IF('Tex-244-F'!$B$24=\"\",\"\",'Tex-244-F'!$B$24)","v":"SUBLOT NUMBER:"},{"$f":"IF('Tex-244-F'!$F$23=\"\",\"\",'Tex-244-F'!$F$23)","v":1}]
[11,{"$f":"IF('Tex-244-F'!$G$30=\"\",\"\",'Tex-244-F'!$G$30)","v":""},{"$f":"IF('Tex-244-F'!$B$6=\"\",\"\",'Tex-244-F'!$B$6)","v":"Tex-244-F"},{"$f":"IF('Tex-244-F'!$B$30=\"\",\"\",'Tex-244-F'!$B$30)","v":"Maximum Baseline Temperature, °F:"},{"$f":"IF('Tex-244-F'!$B$24=\"\",\"\",'Tex-244-F'!$B$24)","v":"SUBLOT NUMBER:"},{"$f":"IF('Tex-244-F'!$G$23=\"\",\"\",'Tex-244-F'!$G$23)","v":2}]
[12,{"$f":"IF('Tex-244-F'!$H$30=\"\",\"\",'Tex-244-F'!$H$30)","v":""},{"$f":"IF('Tex-244-F'!$B$6=\"\",\"\",'Tex-244-F'!$B$6)","v":"Tex-244-F"},{"$f":"IF('Tex-244-F'!$B$30=\"\",\"\",'Tex-244-F'!$B$30)","v":"Maximum Baseline Temperature, °F:"},{"$f":"IF('Tex-244-F'!$B$24=\"\",\"\",'Tex-244-F'!$B$24)","v":"SUBLOT NUMBER:"},{"$f":"IF('Tex-244-F'!$H$23=\"\",\"\",'Tex-244-F'!$H$23)","v":3}]
[13,{"$f":"IF('Tex-244-F'!$I$30=\"\",\"\",'Tex-244-F'!$I$30)","v":""},{"$f":"IF('Tex-244-F'!$B$6=\"\",\"\",'Tex-244-F'!$B$6)","v":"Tex-244-F"},{"$f":"IF('Tex-244-F'!$B$30=\"\",\"\",'Tex-244-F'!$B$30)","v":"Maximum Baseline Temperature, °F:"},{"$f":"IF('Tex-244-F'!$B$24=\"\",\"\",'Tex-244-F'!$B$24)","v":"SUBLOT NUMBER:"},{"$f":"IF('Tex-244-F'!$I$23=\"\",\"\",'Tex-244-F'!$I$23)","v":4}]
[14,{"$f":"IF('Tex-244-F'!$F$32=\"\",\"\",'Tex-244-F'!$F$32)","v":""},{"$f":"IF('Tex-244-F'!$B$6=\"\",\"\",'Tex-244-F'!$B$6)","v":"Tex-244-F"},{"$f":"IF('Tex-244-F'!$B$32=\"\",\"\",'Tex-244-F'!$B$32)","v":"Lowest Allowable Profile Temperature, °F:"},{"$f":"IF('Tex-244-F'!$B$24=\"\",\"\",'Tex-244-F'!$B$24)","v":"SUBLOT NUMBER:"},{"$f":"IF('Tex-244-F'!$F$23=\"\",\"\",'Tex-244-F'!$F$23)","v":1}]
[15,{"$f":"IF('Tex-244-F'!$G$32=\"\",\"\",'Tex-244-F'!$G$32)","v":""},{"$f":"IF('Tex-244-F'!$B$6=\"\",\"\",'Tex-244-F'!$B$6)","v":"Tex-244-F"},{"$f":"IF('Tex-244-F'!$B$32=\"\",\"\",'Tex-244-F'!$B$32)","v":"Lowest Allowable Profile Temperature, °F:"},{"$f":"IF('Tex-244-F'!$B$24=\"\",\"\",'Tex-244-F'!$B$24)","v":"SUBLOT NUMBER:"},{"$f":"IF('Tex-244-F'!$G$23=\"\",\"\",'Tex-244-F'!$G$23)","v":2}]
[16,{"$f":"IF('Tex-244-F'!$H$32=\"\",\"\",'Tex-244-F'!$H$32)","v":""},{"$f":"IF('Tex-244-F'!$B$6=\"\",\"\",'Tex-244-F'!$B$6)","v":"Tex-244-F"},{"$f":"IF('Tex-244-F'!$B$32=\"\",\"\",'Tex-244-F'!$B$32)","v":"Lowest Allowable Profile Temperature, °F:"},{"$f":"IF('Tex-244-F'!$B$24=\"\",\"\",'Tex-244-F'!$B$24)","v":"SUBLOT NUMBER:"},{"$f":"IF('Tex-244-F'!$H$23=\"\",\"\",'Tex-244-F'!$H$23)","v":3}]
[17,{"$f":"IF('Tex-244-F'!$I$32=\"\",\"\",'Tex-244-F'!$I$32)","v":""},{"$f":"IF('Tex-244-F'!$B$6=\"\",\"\",'Tex-244-F'!$B$6)","v":"Tex-244-F"},{"$f":"IF('Tex-244-F'!$B$32=\"\",\"\",'Tex-244-F'!$B$32)","v":"Lowest Allowable Profile Temperature, °F:"},{"$f":"IF('Tex-244-F'!$B$24=\"\",\"\",'Tex-244-F'!$B$24)","v":"SUBLOT NUMBER:"},{"$f":"IF('Tex-244-F'!$I$23=\"\",\"\",'Tex-244-F'!$I$23)","v":4}]
[18,{"$f":"IF('Tex-244-F'!$F$34=\"\",\"\",'Tex-244-F'!$F$34)","v":""},{"$f":"IF('Tex-244-F'!$B$6=\"\",\"\",'Tex-244-F'!$B$6)","v":"Tex-244-F"},{"$f":"IF('Tex-244-F'!$B$34=\"\",\"\",'Tex-244-F'!$B$34)","v":"Minimum Profile Temperature, °F:"},{"$f":"IF('Tex-244-F'!$B$24=\"\",\"\",'Tex-244-F'!$B$24)","v":"SUBLOT NUMBER:"},{"$f":"IF('Tex-244-F'!$F$23=\"\",\"\",'Tex-244-F'!$F$23)","v":1}]
[19,{"$f":"IF('Tex-244-F'!$G$34=\"\",\"\",'Tex-244-F'!$G$34)","v":""},{"$f":"IF('Tex-244-F'!$B$6=\"\",\"\",'Tex-244-F'!$B$6)","v":"Tex-244-F"},{"$f":"IF('Tex-244-F'!$B$34=\"\",\"\",'Tex-244-F'!$B$34)","v":"Minimum Profile Temperature, °F:"},{"$f":"IF('Tex-244-F'!$B$24=\"\",\"\",'Tex-244-F'!$B$24)","v":"SUBLOT NUMBER:"},{"$f":"IF('Tex-244-F'!$G$23=\"\",\"\",'Tex-244-F'!$G$23)","v":2}]
[20,{"$f":"IF('Tex-244-F'!$H$34=\"\",\"\",'Tex-244-F'!$H$34)","v":""},{"$f":"IF('Tex-244-F'!$B$6=\"\",\"\",'Tex-244-F'!$B$6)","v":"Tex-244-F"},{"$f":"IF('Tex-244-F'!$B$34=\"\",\"\",'Tex-244-F'!$B$34)","v":"Minimum Profile Temperature, °F:"},{"$f":"IF('Tex-244-F'!$B$24=\"\",\"\",'Tex-244-F'!$B$24)","v":"SUBLOT NUMBER:"},{"$f":"IF('Tex-244-F'!$H$23=\"\",\"\",'Tex-244-F'!$H$23)","v":3}]
[21,{"$f":"IF('Tex-244-F'!$I$34=\"\",\"\",'Tex-244-F'!$I$34)","v":""},{"$f":"IF('Tex-244-F'!$B$6=\"\",\"\",'Tex-244-F'!$B$6)","v":"Tex-244-F"},{"$f":"IF('Tex-244-F'!$B$34=\"\",\"\",'Tex-244-F'!$B$34)","v":"Minimum Profile Temperature, °F:"},{"$f":"IF('Tex-244-F'!$B$24=\"\",\"\",'Tex-244-F'!$B$24)","v":"SUBLOT NUMBER:"},{"$f":"IF('Tex-244-F'!$I$23=\"\",\"\",'Tex-244-F'!$I$23)","v":4}]
[22,{"$f":"IF('Tex-244-F'!$F$36=\"\",\"\",'Tex-244-F'!$F$36)","v":""},{"$f":"IF('Tex-244-F'!$B$6=\"\",\"\",'Tex-244-F'!$B$6)","v":"Tex-244-F"},{"$f":"IF('Tex-244-F'!$B$36=\"\",\"\",'Tex-244-F'!$B$36)","v":"Temperature Differential, °F:"},{"$f":"IF('Tex-244-F'!$B$24=\"\",\"\",'Tex-244-F'!$B$24)","v":"SUBLOT NUMBER:"},{"$f":"IF('Tex-244-F'!$F$23=\"\",\"\",'Tex-244-F'!$F$23)","v":1}]
[23,{"$f":"IF('Tex-244-F'!$G$36=\"\",\"\",'Tex-244-F'!$G$36)","v":""},{"$f":"IF('Tex-244-F'!$B$6=\"\",\"\",'Tex-244-F'!$B$6)","v":"Tex-244-F"},{"$f":"IF('Tex-244-F'!$B$36=\"\",\"\",'Tex-244-F'!$B$36)","v":"Temperature Differential, °F:"},{"$f":"IF('Tex-244-F'!$B$24=\"\",\"\",'Tex-244-F'!$B$24)","v":"SUBLOT NUMBER:"},{"$f":"IF('Tex-244-F'!$G$23=\"\",\"\",'Tex-244-F'!$G$23)","v":2}]
[24,{"$f":"IF('Tex-244-F'!$H$36=\"\",\"\",'Tex-244-F'!$H$36)","v":""},{"$f":"IF('Tex-244-F'!$B$6=\"\",\"\",'Tex-244-F'!$B$6)","v":"Tex-244-F"},{"$f":"IF('Tex-244-F'!$B$36=\"\",\"\",'Tex-244-F'!$B$36)","v":"Temperature Differential, °F:"},{"$f":"IF('Tex-244-F'!$B$24=\"\",\"\",'Tex-244-F'!$B$24)","v":"SUBLOT NUMBER:"},{"$f":"IF('Tex-244-F'!$H$23=\"\",\"\",'Tex-244-F'!$H$23)","v":3}]
[25,{"$f":"IF('Tex-244-F'!$I$36=\"\",\"\",'Tex-244-F'!$I$36)","v":""},{"$f":"IF('Tex-244-F'!$B$6=\"\",\"\",'Tex-244-F'!$B$6)","v":"Tex-244-F"},{"$f":"IF('Tex-244-F'!$B$36=\"\",\"\",'Tex-244-F'!$B$36)","v":"Temperature Differential, °F:"},{"$f":"IF('Tex-244-F'!$B$24=\"\",\"\",'Tex-244-F'!$B$24)","v":"SUBLOT NUMBER:"},{"$f":"IF('Tex-244-F'!$I$23=\"\",\"\",'Tex-244-F'!$I$23)","v":4}]
[26,{"$f":"IF('Tex-244-F'!H21=\"\",\"\",'Tex-244-F'!H21)","v":""},{"$f":"IF('Tex-244-F'!$B$6=\"\",\"\",'Tex-244-F'!$B$6)","v":"Tex-244-F"},{"$f":"IF('Tex-244-F'!$F$21=\"\",\"\",'Tex-244-F'!$F$21)","v":"EQUIPMENT USED: "}]
[27,{"$f":"IF('Tex-244-F'!E39=\"\",\"\",'Tex-244-F'!E39)","v":""},{"$f":"IF('Tex-244-F'!$B$6=\"\",\"\",'Tex-244-F'!$B$6)","v":"Tex-244-F"},{"$f":"IF('Tex-244-F'!$B$39=\"\",\"\",'Tex-244-F'!$B$39)","v":"Number of Profiles:"}]
[28,{"$f":"IF('Tex-244-F'!B43=\"\",\"\",'Tex-244-F'!B43)","v":""},{"$f":"IF('Tex-244-F'!$B$6=\"\",\"\",'Tex-244-F'!$B$6)","v":"Tex-244-F"},{"$f":"IF('Tex-244-F'!$B$41=\"\",\"\",'Tex-244-F'!$B$41)","v":"Moderate \n25.0°F < differential <= 50.0°F"},{"$f":"IF('Tex-244-F'!$B$42=\"\",\"\",'Tex-244-F'!$B$42)","v":"Number"}]
[29,{"$f":"IF('Tex-244-F'!D43=\"\",\"\",'Tex-244-F'!D43)","v":""},{"$f":"IF('Tex-244-F'!$B$6=\"\",\"\",'Tex-244-F'!$B$6)","v":"Tex-244-F"},{"$f":"IF('Tex-244-F'!$B$41=\"\",\"\",'Tex-244-F'!$B$41)","v":"Moderate \n25.0°F < differential <= 50.0°F"},{"$f":"IF('Tex-244-F'!$D$42=\"\",\"\",'Tex-244-F'!$D$42)","v":"Percent"}]
[30,{"$f":"IF('Tex-244-F'!F43=\"\",\"\",'Tex-244-F'!F43)","v":""},{"$f":"IF('Tex-244-F'!$B$6=\"\",\"\",'Tex-244-F'!$B$6)","v":"Tex-244-F"},{"$f":"IF('Tex-244-F'!$F$41=\"\",\"\",'Tex-244-F'!$F$41)","v":"Severe \ndifferential > 50.0°F"},{"$f":"IF('Tex-244-F'!$F$42=\"\",\"\",'Tex-244-F'!$F$42)","v":"Number"}]
[31,{"$f":"IF('Tex-244-F'!H43=\"\",\"\",'Tex-244-F'!H43)","v":""},{"$f":"IF('Tex-244-F'!$B$6=\"\",\"\",'Tex-244-F'!$B$6)","v":"Tex-244-F"},{"$f":"IF('Tex-244-F'!$F$41=\"\",\"\",'Tex-244-F'!$F$41)","v":"Severe \ndifferential > 50.0°F"},{"$f":"IF('Tex-244-F'!$H$42=\"\",\"\",'Tex-244-F'!$H$42)","v":"Percent"}]
[32,{"$f":"IF(Field29=\"\",\"\",Field29)","v":""},{"$f":"IF('Tex-244-F'!$B$6=\"\",\"\",'Tex-244-F'!$B$6)","v":"Tex-244-F"},"Starting Station:",1]
[33,{"$f":"IF(Field30=\"\",\"\",Field30)","v":""},{"$f":"IF('Tex-244-F'!$B$6=\"\",\"\",'Tex-244-F'!$B$6)","v":"Tex-244-F"},"Starting Station:",2]
[34,{"$f":"IF(Field31=\"\",\"\",Field31)","v":""},{"$f":"IF('Tex-244-F'!$B$6=\"\",\"\",'Tex-244-F'!$B$6)","v":"Tex-244-F"},"Starting Station:",3]
[35,{"$f":"IF(Field32=\"\",\"\",Field32)","v":""},{"$f":"IF('Tex-244-F'!$B$6=\"\",\"\",'Tex-244-F'!$B$6)","v":"Tex-244-F"},"Starting Station:",4]
[36,{"$f":"IF(Field33=\"\",\"\",Field33)","v":""},{"$f":"IF('Tex-244-F'!$B$6=\"\",\"\",'Tex-244-F'!$B$6)","v":"Tex-244-F"},"Ending Station:",1]
[37,{"$f":"IF(Field34=\"\",\"\",Field34)","v":""},{"$f":"IF('Tex-244-F'!$B$6=\"\",\"\",'Tex-244-F'!$B$6)","v":"Tex-244-F"},"Ending Station:",2]
[38,{"$f":"IF(Field35=\"\",\"\",Field35)","v":""},{"$f":"IF('Tex-244-F'!$B$6=\"\",\"\",'Tex-244-F'!$B$6)","v":"Tex-244-F"},"Ending Station:",3]
[39,{"$f":"IF(Field36=\"\",\"\",Field36)","v":""},{"$f":"IF('Tex-244-F'!$B$6=\"\",\"\",'Tex-244-F'!$B$6)","v":"Tex-244-F"},"Ending Station:",4]

{"sheet":"Lists","index":2,"n_rows":4,"n_cols":6,"rows_kept":4,"cut":false,"hidden":true,"merged":[]}
[null,"Equipment1993","Equipment1995","Equipment2004","Equipment2014","Equipment2024"]
[null,"Infrared Thermometer","Infrared Thermometer","Infrared Thermometer","Thermal Camera","Thermal Camera"]
[null,"Thermal Camera","Thermal Camera","Thermal Camera","Thermal Imaging System","Thermal Imaging System"]
[null,"Pave-IR System","Pave-IR System","Pave-IR System"]