{"text_format":"1","workbook":"xlsx","n_sheets":3,"sheets":["Tex-246-F Part I","RX","Mix Type"],"not_rendered":{"charts":0,"images":1,"macros":1,"external_links":0,"defined_names":77,"comments":1,"pivot_tables":0},"unopened":[],"bounds":{"document_bytes":16777216,"sheet_cells":100000,"rows_first":2000,"rows_last":500,"rows_between":2000,"halvings":0,"cell_chars":16384,"cell_head_chars":4096},"cells_cut":0,"cells_raw":0,"read":"whole","date_system":"1900"}

{"sheet":"Tex-246-F Part I","index":0,"n_rows":47,"n_cols":17,"rows_kept":47,"cut":false,"hidden":false,"merged":[[40,2,40,4],[22,6,23,7],[13,3,13,4],[15,3,15,8],[13,7,13,8],[16,7,16,8],[16,3,16,4],[27,6,27,7],[28,3,28,5],[28,6,28,7],[14,3,14,8],[22,3,23,5],[22,2,23,2],[39,1,39,8],[33,3,33,5],[33,6,33,7],[9,3,9,4],[7,7,7,8],[10,7,10,8],[7,3,7,4],[8,3,8,4],[8,7,8,8],[10,3,10,4],[0,0,0,1],[47,1,47,3],[43,6,43,8],[36,1,37,8],[41,2,41,4],[12,7,12,8],[11,3,11,4],[12,3,12,4],[11,7,11,8],[20,1,20,2],[24,6,24,7],[25,3,25,5],[25,6,25,7],[26,3,26,5],[43,1,43,3],[9,7,9,8],[31,3,31,5],[31,6,31,7],[32,3,32,5],[32,6,32,7],[38,1,38,8],[29,3,29,5],[26,6,26,7],[24,3,24,5],[29,6,29,7],[30,3,30,5],[30,6,30,7],[27,3,27,5]]}
["TxDOT Manuals >",null,null,"Tex-246-F"]
[null,"TEXAS DEPARTMENT OF TRANSPORTATION",null,null,null,null,null,null,null,null,30]
[null,null,null,null,null,null,null,null,null,null,1]
[null,null,null,null,null,null,null,null,null,null,"tx246.xlsm::45574.649086"]
[null,"TIME OF WATER FLOW OF COMPACTED HOT MIX ASPHALT PAVEMENT"]
[null,"Tex-246-F"]
[null,null,null,null,null,null,null,null,{"$f":"\"File Version: \" & TEXT(MID(sn,SEARCH(\"::\",sn,1)+2,20),\"mm/dd/yy hh:mm:ss\")","v":"File Version: 10/09/24 15:34:41"}]
[null,null,"SAMPLE ID:"," ",null,null,"SAMPLED DATE:"]
[null,null,"TEST NUMBER:",null,null,null,"LETTING DATE:"]
[null,null,"SAMPLE STATUS:",null,null,null,"CONTROLLING CSJ:"]
[null,null,"COUNTY:",null,null,null,"SPEC YEAR:"]
[null,null,"SAMPLED BY:",null,null,null,"SPEC ITEM:"]
[null,null,"SAMPLE LOCATION:",null,null,null,"SPECIAL PROVISION:"]
[null,null,"MATERIAL CODE:",null,null,null,"MIX TYPE:"]
[null,null,"MATERIAL NAME:"]
[null,null,"PRODUCER:"]
[null,null,"AREA ENGINEER:",null,null,null,"PROJECT MANAGER:"]
[]
[null,null,"COURSE\\LIFT:",null,"STATION:",null,null,"DIST. FROM CL:"]
[]
[null,"NUMBER OF TESTS:"]
[null,null,null,null,null,null,null,null,null,null,null,null,null,null,null,null,3]
[null,null,"TEST","SITE LOCATION/IDENTIFICATION (STATION NO. OR MILE MARKER)",null,null,"TIME, SEC",null,null,null,null,null,null,null,null,null,4]
[]
[null,null,1,null,null,null,null,null,null,null,null,null,null,null,null,null,5]
[null,null,2,null,null,null,null,null,null,null,null,null,null,null,null,null,6]
[null,null,3,null,null,null,null,null,null,null,null,null,null,null,null,null,7]
[null,null,4,null,null,null,null,null,null,null,null,null,null,null,null,null,8]
[null,null,5,null,null,null,null,null,null,null,null,null,null,null,null,null,9]
[null,null,6,null,null,null,null,null,null,null,null,null,null,null,null,null,10]
[null,null,7]
[null,null,8]
[null,null,9]
[null,null,10]
[]
[null,"Remarks:",{"$f":"NOW()","v":"2024-10-09T15:34:41.540"}]
[]
[]
[]
[]
[null,"Test Method:","Tested By:",null,null,"Tested Date:"]
[null,"TX246"]
[null,"Test Stamp Code:",null,null,"Omit Test:","Completed Date:","Reviewed By:"]
[]
[null,"Locked By:","TxDOT:","District:","Area:"]
[]
[null,"Authorized By:",null,null,"Authorized Date:"]

{"sheet":"RX","index":1,"n_rows":27,"n_cols":9,"rows_kept":27,"cut":false,"hidden":true,"merged":[]}
[25]
["Fld_nbr","Value","Desc_1","Desc_2","Desc_3","Desc_4","Desc_5","Desc_6","Desc_7"]
[1,{"$f":"IF('Tex-246-F Part I'!$B$37=\"\",\"\",'Tex-246-F Part I'!$B$37)","v":""},{"$f":"'Tex-246-F Part I'!$B$36","v":"Remarks:"}]
[2,{"$f":"IF('Tex-246-F Part I'!$D$19=\"\",\"\",'Tex-246-F Part I'!$D$19)","v":""},{"$f":"IF('Tex-246-F Part I'!$C$19=\"\",\"\",'Tex-246-F Part I'!$C$19)","v":"COURSE\\LIFT:"}]
[3,{"$f":"IF('Tex-246-F Part I'!$C$42=\"\",\"\",'Tex-246-F Part I'!$C$42)","v":""},"Tested By ",{"$f":"IF('Tex-246-F Part I'!$B$42=\"\",\"\",'Tex-246-F Part I'!$B$42)","v":"TX246"}]
[4,{"$f":"IF('Tex-246-F Part I'!$F$42=\"\",\"\",'Tex-246-F Part I'!$F$42)","v":""},"Tested Date ",{"$f":"IF('Tex-246-F Part I'!$B$42=\"\",\"\",'Tex-246-F Part I'!$B$42)","v":"TX246"}]
[5,{"$f":"IF('Tex-246-F Part I'!$D$21=\"\",\"\",'Tex-246-F Part I'!$D$21)","v":""},{"$f":"IF('Tex-246-F Part I'!$B$6=\"\",\"\",'Tex-246-F Part I'!$B$6)","v":"Tex-246-F"},{"$f":"IF('Tex-246-F Part I'!$B$21=\"\",\"\",'Tex-246-F Part I'!$B$21)","v":"NUMBER OF TESTS:"}]
[6,{"$f":"IF('Tex-246-F Part I'!$D$25=\"\",\"\",'Tex-246-F Part I'!$D$25)","v":""},{"$f":"IF('Tex-246-F Part I'!$B$6=\"\",\"\",'Tex-246-F Part I'!$B$6)","v":"Tex-246-F"},{"$f":"IF('Tex-246-F Part I'!$D$23=\"\",\"\",'Tex-246-F Part I'!$D$23)","v":"SITE LOCATION/IDENTIFICATION (STATION NO. OR MILE MARKER)"},{"$f":"IF('Tex-246-F Part I'!$C$23=\"\",\"\",'Tex-246-F Part I'!$C$23)","v":"TEST"},{"$f":"IF('Tex-246-F Part I'!$C$25=\"\",\"\",'Tex-246-F Part I'!$C$25)","v":1}]
[7,{"$f":"IF('Tex-246-F Part I'!$G$25=\"\",\"\",'Tex-246-F Part I'!$G$25)","v":""},{"$f":"IF('Tex-246-F Part I'!$B$6=\"\",\"\",'Tex-246-F Part I'!$B$6)","v":"Tex-246-F"},{"$f":"IF('Tex-246-F Part I'!$G$23=\"\",\"\",'Tex-246-F Part I'!$G$23)","v":"TIME, SEC"},{"$f":"IF('Tex-246-F Part I'!$C$23=\"\",\"\",'Tex-246-F Part I'!$C$23)","v":"TEST"},{"$f":"IF('Tex-246-F Part I'!$C$25=\"\",\"\",'Tex-246-F Part I'!$C$25)","v":1}]
[8,{"$f":"IF('Tex-246-F Part I'!$D$26=\"\",\"\",'Tex-246-F Part I'!$D$26)","v":""},{"$f":"IF('Tex-246-F Part I'!$B$6=\"\",\"\",'Tex-246-F Part I'!$B$6)","v":"Tex-246-F"},{"$f":"IF('Tex-246-F Part I'!$D$23=\"\",\"\",'Tex-246-F Part I'!$D$23)","v":"SITE LOCATION/IDENTIFICATION (STATION NO. OR MILE MARKER)"},{"$f":"IF('Tex-246-F Part I'!$C$23=\"\",\"\",'Tex-246-F Part I'!$C$23)","v":"TEST"},{"$f":"IF('Tex-246-F Part I'!$C$26=\"\",\"\",'Tex-246-F Part I'!$C$26)","v":2}]
[9,{"$f":"IF('Tex-246-F Part I'!$G$26=\"\",\"\",'Tex-246-F Part I'!$G$26)","v":""},{"$f":"IF('Tex-246-F Part I'!$B$6=\"\",\"\",'Tex-246-F Part I'!$B$6)","v":"Tex-246-F"},{"$f":"IF('Tex-246-F Part I'!$G$23=\"\",\"\",'Tex-246-F Part I'!$G$23)","v":"TIME, SEC"},{"$f":"IF('Tex-246-F Part I'!$C$23=\"\",\"\",'Tex-246-F Part I'!$C$23)","v":"TEST"},{"$f":"IF('Tex-246-F Part I'!$C$26=\"\",\"\",'Tex-246-F Part I'!$C$26)","v":2}]
[10,{"$f":"IF('Tex-246-F Part I'!$D$27=\"\",\"\",'Tex-246-F Part I'!$D$27)","v":""},{"$f":"IF('Tex-246-F Part I'!$B$6=\"\",\"\",'Tex-246-F Part I'!$B$6)","v":"Tex-246-F"},{"$f":"IF('Tex-246-F Part I'!$D$23=\"\",\"\",'Tex-246-F Part I'!$D$23)","v":"SITE LOCATION/IDENTIFICATION (STATION NO. OR MILE MARKER)"},{"$f":"IF('Tex-246-F Part I'!$C$23=\"\",\"\",'Tex-246-F Part I'!$C$23)","v":"TEST"},{"$f":"IF('Tex-246-F Part I'!$C$27=\"\",\"\",'Tex-246-F Part I'!$C$27)","v":3}]
[11,{"$f":"IF('Tex-246-F Part I'!$G$27=\"\",\"\",'Tex-246-F Part I'!$G$27)","v":""},{"$f":"IF('Tex-246-F Part I'!$B$6=\"\",\"\",'Tex-246-F Part I'!$B$6)","v":"Tex-246-F"},{"$f":"IF('Tex-246-F Part I'!$G$23=\"\",\"\",'Tex-246-F Part I'!$G$23)","v":"TIME, SEC"},{"$f":"IF('Tex-246-F Part I'!$C$23=\"\",\"\",'Tex-246-F Part I'!$C$23)","v":"TEST"},{"$f":"IF('Tex-246-F Part I'!$C$27=\"\",\"\",'Tex-246-F Part I'!$C$27)","v":3}]
[12,{"$f":"IF('Tex-246-F Part I'!$D$28=\"\",\"\",'Tex-246-F Part I'!$D$28)","v":""},{"$f":"IF('Tex-246-F Part I'!$B$6=\"\",\"\",'Tex-246-F Part I'!$B$6)","v":"Tex-246-F"},{"$f":"IF('Tex-246-F Part I'!$D$23=\"\",\"\",'Tex-246-F Part I'!$D$23)","v":"SITE LOCATION/IDENTIFICATION (STATION NO. OR MILE MARKER)"},{"$f":"IF('Tex-246-F Part I'!$C$23=\"\",\"\",'Tex-246-F Part I'!$C$23)","v":"TEST"},{"$f":"IF('Tex-246-F Part I'!$C$28=\"\",\"\",'Tex-246-F Part I'!$C$28)","v":4}]
[13,{"$f":"IF('Tex-246-F Part I'!$G$28=\"\",\"\",'Tex-246-F Part I'!$G$28)","v":""},{"$f":"IF('Tex-246-F Part I'!$B$6=\"\",\"\",'Tex-246-F Part I'!$B$6)","v":"Tex-246-F"},{"$f":"IF('Tex-246-F Part I'!$G$23=\"\",\"\",'Tex-246-F Part I'!$G$23)","v":"TIME, SEC"},{"$f":"IF('Tex-246-F Part I'!$C$23=\"\",\"\",'Tex-246-F Part I'!$C$23)","v":"TEST"},{"$f":"IF('Tex-246-F Part I'!$C$28=\"\",\"\",'Tex-246-F Part I'!$C$28)","v":4}]
[14,{"$f":"IF('Tex-246-F Part I'!$D$29=\"\",\"\",'Tex-246-F Part I'!$D$29)","v":""},{"$f":"IF('Tex-246-F Part I'!$B$6=\"\",\"\",'Tex-246-F Part I'!$B$6)","v":"Tex-246-F"},{"$f":"IF('Tex-246-F Part I'!$D$23=\"\",\"\",'Tex-246-F Part I'!$D$23)","v":"SITE LOCATION/IDENTIFICATION (STATION NO. OR MILE MARKER)"},{"$f":"IF('Tex-246-F Part I'!$C$23=\"\",\"\",'Tex-246-F Part I'!$C$23)","v":"TEST"},{"$f":"IF('Tex-246-F Part I'!$C$29=\"\",\"\",'Tex-246-F Part I'!$C$29)","v":5}]
[15,{"$f":"IF('Tex-246-F Part I'!$G$29=\"\",\"\",'Tex-246-F Part I'!$G$29)","v":""},{"$f":"IF('Tex-246-F Part I'!$B$6=\"\",\"\",'Tex-246-F Part I'!$B$6)","v":"Tex-246-F"},{"$f":"IF('Tex-246-F Part I'!$G$23=\"\",\"\",'Tex-246-F Part I'!$G$23)","v":"TIME, SEC"},{"$f":"IF('Tex-246-F Part I'!$C$23=\"\",\"\",'Tex-246-F Part I'!$C$23)","v":"TEST"},{"$f":"IF('Tex-246-F Part I'!$C$29=\"\",\"\",'Tex-246-F Part I'!$C$29)","v":5}]
[16,{"$f":"IF('Tex-246-F Part I'!$D$30=\"\",\"\",'Tex-246-F Part I'!$D$30)","v":""},{"$f":"IF('Tex-246-F Part I'!$B$6=\"\",\"\",'Tex-246-F Part I'!$B$6)","v":"Tex-246-F"},{"$f":"IF('Tex-246-F Part I'!$D$23=\"\",\"\",'Tex-246-F Part I'!$D$23)","v":"SITE LOCATION/IDENTIFICATION (STATION NO. OR MILE MARKER)"},{"$f":"IF('Tex-246-F Part I'!$C$23=\"\",\"\",'Tex-246-F Part I'!$C$23)","v":"TEST"},{"$f":"IF('Tex-246-F Part I'!$C$30=\"\",\"\",'Tex-246-F Part I'!$C$30)","v":6}]
[17,{"$f":"IF('Tex-246-F Part I'!$G$30=\"\",\"\",'Tex-246-F Part I'!$G$30)","v":""},{"$f":"IF('Tex-246-F Part I'!$B$6=\"\",\"\",'Tex-246-F Part I'!$B$6)","v":"Tex-246-F"},{"$f":"IF('Tex-246-F Part I'!$G$23=\"\",\"\",'Tex-246-F Part I'!$G$23)","v":"TIME, SEC"},{"$f":"IF('Tex-246-F Part I'!$C$23=\"\",\"\",'Tex-246-F Part I'!$C$23)","v":"TEST"},{"$f":"IF('Tex-246-F Part I'!$C$30=\"\",\"\",'Tex-246-F Part I'!$C$30)","v":6}]
[18,{"$f":"IF('Tex-246-F Part I'!$D$31=\"\",\"\",'Tex-246-F Part I'!$D$31)","v":""},{"$f":"IF('Tex-246-F Part I'!$B$6=\"\",\"\",'Tex-246-F Part I'!$B$6)","v":"Tex-246-F"},{"$f":"IF('Tex-246-F Part I'!$D$23=\"\",\"\",'Tex-246-F Part I'!$D$23)","v":"SITE LOCATION/IDENTIFICATION (STATION NO. OR MILE MARKER)"},{"$f":"IF('Tex-246-F Part I'!$C$23=\"\",\"\",'Tex-246-F Part I'!$C$23)","v":"TEST"},{"$f":"IF('Tex-246-F Part I'!$C$31=\"\",\"\",'Tex-246-F Part I'!$C$31)","v":7}]
[19,{"$f":"IF('Tex-246-F Part I'!$G$31=\"\",\"\",'Tex-246-F Part I'!$G$31)","v":""},{"$f":"IF('Tex-246-F Part I'!$B$6=\"\",\"\",'Tex-246-F Part I'!$B$6)","v":"Tex-246-F"},{"$f":"IF('Tex-246-F Part I'!$G$23=\"\",\"\",'Tex-246-F Part I'!$G$23)","v":"TIME, SEC"},{"$f":"IF('Tex-246-F Part I'!$C$23=\"\",\"\",'Tex-246-F Part I'!$C$23)","v":"TEST"},{"$f":"IF('Tex-246-F Part I'!$C$31=\"\",\"\",'Tex-246-F Part I'!$C$31)","v":7}]
[20,{"$f":"IF('Tex-246-F Part I'!$D$32=\"\",\"\",'Tex-246-F Part I'!$D$32)","v":""},{"$f":"IF('Tex-246-F Part I'!$B$6=\"\",\"\",'Tex-246-F Part I'!$B$6)","v":"Tex-246-F"},{"$f":"IF('Tex-246-F Part I'!$D$23=\"\",\"\",'Tex-246-F Part I'!$D$23)","v":"SITE LOCATION/IDENTIFICATION (STATION NO. OR MILE MARKER)"},{"$f":"IF('Tex-246-F Part I'!$C$23=\"\",\"\",'Tex-246-F Part I'!$C$23)","v":"TEST"},{"$f":"IF('Tex-246-F Part I'!$C$32=\"\",\"\",'Tex-246-F Part I'!$C$32)","v":8}]
[21,{"$f":"IF('Tex-246-F Part I'!$G$32=\"\",\"\",'Tex-246-F Part I'!$G$32)","v":""},{"$f":"IF('Tex-246-F Part I'!$B$6=\"\",\"\",'Tex-246-F Part I'!$B$6)","v":"Tex-246-F"},{"$f":"IF('Tex-246-F Part I'!$G$23=\"\",\"\",'Tex-246-F Part I'!$G$23)","v":"TIME, SEC"},{"$f":"IF('Tex-246-F Part I'!$C$23=\"\",\"\",'Tex-246-F Part I'!$C$23)","v":"TEST"},{"$f":"IF('Tex-246-F Part I'!$C$32=\"\",\"\",'Tex-246-F Part I'!$C$32)","v":8}]
[22,{"$f":"IF('Tex-246-F Part I'!$D$33=\"\",\"\",'Tex-246-F Part I'!$D$33)","v":""},{"$f":"IF('Tex-246-F Part I'!$B$6=\"\",\"\",'Tex-246-F Part I'!$B$6)","v":"Tex-246-F"},{"$f":"IF('Tex-246-F Part I'!$D$23=\"\",\"\",'Tex-246-F Part I'!$D$23)","v":"SITE LOCATION/IDENTIFICATION (STATION NO. OR MILE MARKER)"},{"$f":"IF('Tex-246-F Part I'!$C$23=\"\",\"\",'Tex-246-F Part I'!$C$23)","v":"TEST"},{"$f":"IF('Tex-246-F Part I'!$C$33=\"\",\"\",'Tex-246-F Part I'!$C$33)","v":9}]
[23,{"$f":"IF('Tex-246-F Part I'!$G$33=\"\",\"\",'Tex-246-F Part I'!$G$33)","v":""},{"$f":"IF('Tex-246-F Part I'!$B$6=\"\",\"\",'Tex-246-F Part I'!$B$6)","v":"Tex-246-F"},{"$f":"IF('Tex-246-F Part I'!$G$23=\"\",\"\",'Tex-246-F Part I'!$G$23)","v":"TIME, SEC"},{"$f":"IF('Tex-246-F Part I'!$C$23=\"\",\"\",'Tex-246-F Part I'!$C$23)","v":"TEST"},{"$f":"IF('Tex-246-F Part I'!$C$33=\"\",\"\",'Tex-246-F Part I'!$C$33)","v":9}]
[24,{"$f":"IF('Tex-246-F Part I'!$D$34=\"\",\"\",'Tex-246-F Part I'!$D$34)","v":""},{"$f":"IF('Tex-246-F Part I'!$B$6=\"\",\"\",'Tex-246-F Part I'!$B$6)","v":"Tex-246-F"},{"$f":"IF('Tex-246-F Part I'!$D$23=\"\",\"\",'Tex-246-F Part I'!$D$23)","v":"SITE LOCATION/IDENTIFICATION (STATION NO. OR MILE MARKER)"},{"$f":"IF('Tex-246-F Part I'!$C$23=\"\",\"\",'Tex-246-F Part I'!$C$23)","v":"TEST"},{"$f":"IF('Tex-246-F Part I'!$C$34=\"\",\"\",'Tex-246-F Part I'!$C$34)","v":10}]
[25,{"$f":"IF('Tex-246-F Part I'!$G$34=\"\",\"\",'Tex-246-F Part I'!$G$34)","v":""},{"$f":"IF('Tex-246-F Part I'!$B$6=\"\",\"\",'Tex-246-F Part I'!$B$6)","v":"Tex-246-F"},{"$f":"IF('Tex-246-F Part I'!$G$23=\"\",\"\",'Tex-246-F Part I'!$G$23)","v":"TIME, SEC"},{"$f":"IF('Tex-246-F Part I'!$C$23=\"\",\"\",'Tex-246-F Part I'!$C$23)","v":"TEST"},{"$f":"IF('Tex-246-F Part I'!$C$34=\"\",\"\",'Tex-246-F Part I'!$C$34)","v":10}]

{"sheet":"Mix Type","index":2,"n_rows":19,"n_cols":3,"rows_kept":19,"cut":false,"hidden":true,"merged":[]}
["Spec2004","Spec2014","Spec2024"]
["ITEM341_A_Coarse_Base","ITEM341_A_Coarse_Base","ITEM342_PFC_C"]
["ITEM341_B_Fine_Base","ITEM341_B_Fine_Base","ITEM342_PFC_F"]
["ITEM341_C_Coarse_Surface","ITEM341_C_Coarse_Surface","ITEM347_TOM_C"]
["ITEM341_D_Fine_Surface","ITEM341_D_Fine_Surface","ITEM347_TOM_F"]
["ITEM341_F_Fine_Mixture","ITEM341_F_Fine_Mixture","ITEM348_PFC_C"]
["ITEM344_SP_A_Base","ITEM344_SP_A_Base","ITEM348_PFC_F"]
["ITEM344_SP_B_Intermediate","ITEM344_SP_B_Intermediate","ITEM348_TBFC_A"]
["ITEM344_SP_C_Surface","ITEM344_SP_C_Surface","ITEM348_TBFC_B"]
["ITEM344_SP_D_Fine_Mixture","ITEM344_SP_D_Fine_Mixture","ITEM348_TBFC_C"]
["ITEM344_CMHB_C_Coarse_Surface","ITEM344_CMHB_C_Coarse_Surface"]
["ITEM344_CMHB_F_Fine_Surface","ITEM344_CMHB_F_Fine_Surface"]
["ITEM346_SMA_C_Coarse","ITEM346_SMA_C_Coarse"]
["ITEM346_SMA_D_Medium","ITEM346_SMA_D_Medium"]
["ITEM346_SMA_F_Fine","ITEM346_SMA_F_Fine"]
["ITEM346_SMAR_C_Coarse","ITEM346_SMAR_C_Coarse"]
["ITEM346_SMAR_F_Fine","ITEM346_SMAR_F_Fine"]
["ITEM342_PFC_PG_76_Mixtures","ITEM342_PFC_PG_76_Mixtures"]
["ITEM342_PFC_A_R_Mixtures","ITEM342_PFC_A_R_Mixtures"]