{"text_format":"1","workbook":"xlsx","n_sheets":4,"sheets":["Tex-248-F","RX","Revisions","MixTypes"],"not_rendered":{"charts":0,"images":1,"macros":1,"external_links":0,"defined_names":90,"comments":1,"pivot_tables":0},"unopened":[],"bounds":{"document_bytes":16777216,"sheet_cells":100000,"rows_first":2000,"rows_last":500,"rows_between":2000,"halvings":0,"cell_chars":16384,"cell_head_chars":4096},"cells_cut":0,"cells_raw":0,"read":"whole","date_system":"1900"}

{"sheet":"Tex-248-F","index":0,"n_rows":44,"n_cols":15,"rows_kept":44,"cut":false,"hidden":false,"merged":[[7,7,7,9],[8,7,8,9],[9,7,9,9],[10,7,10,9],[11,7,11,9],[12,1,12,3],[13,1,13,3],[14,1,14,3],[15,1,15,3],[16,1,16,3],[7,1,7,3],[8,1,8,3],[9,1,9,3],[10,1,10,3],[11,1,11,3],[16,4,16,6],[11,10,11,12],[10,4,10,6],[16,10,16,12],[23,12,23,14],[13,7,13,9],[16,7,16,9],[12,7,12,9],[15,4,15,12],[13,10,13,12],[18,8,18,9],[18,10,18,12],[20,9,22,9],[20,10,22,10],[20,11,22,11],[20,12,22,14],[9,10,9,12],[9,4,9,6],[13,4,13,6],[0,0,0,1],[37,8,37,12],[29,1,30,12],[35,2,35,6],[12,10,12,12],[11,4,11,6],[12,4,12,6],[7,10,7,12],[10,10,10,12],[7,4,7,6],[8,4,8,6],[8,10,8,12],[14,4,14,12],[41,1,41,5],[18,3,18,4],[18,6,18,7],[37,1,37,5],[39,2,39,3],[39,4,39,5],[20,2,22,2],[20,3,22,3],[20,4,22,4],[20,5,22,5],[20,6,22,6],[20,7,22,7],[32,2,32,6],[33,2,33,6],[24,12,24,14],[25,12,25,14],[20,1,21,1],[26,1,26,2],[34,2,34,6],[20,8,22,8]]}
["TxDOT Manuals >",null,null,"Tex-248-F"]
[null,"TEXAS DEPARTMENT OF TRANSPORTATION",null,null,null,null,null,null,null,null,null,null,null,null,39]
[null,null,null,null,null,null,null,null,null,null,null,null,null,null,1]
[null,null,null,null,null,null,null,null,null,null,null,null,null,null,"tx248.xlsm::45574.649861"]
[null,"OVERLAY TEST"]
[null,"Tex-248-F"]
[null,null,null,null,null,null,null,null,null,null,null,null,{"$f":"\"TX248 - File Version: \" & TEXT(MID(sn,SEARCH(\"::\",sn,1)+2,20),\"mm/dd/yy hh:mm:ss\")","v":"TX248 - File Version: 10/09/24 15:35:48"}]
[null,"SAMPLE ID:",null,null,null,null,null,"SAMPLED DATE:"]
[null,"TEST NUMBER:",null,null,null,null,null,"LETTING DATE:"]
[null,"SAMPLE STATUS:",null,null,null,null,null,"CONTROLLING CSJ:"]
[null,"COUNTY:",null,null,null,null,null,"SPEC YEAR:"]
[null,"SAMPLED BY:",null,null,null,null,null,"SPEC ITEM:"]
[null,"SAMPLE LOCATION:",null,null,null,null,null,"SPECIAL PROVISION:"]
[null,"MATERIAL CODE:",null,null,null,null,null,"MIX TYPE:"]
[null,"MATERIAL NAME:"]
[null,"PRODUCER:"]
[null,"AREA ENGINEER:",null,null,null,null,null,"PROJECT MANAGER:"]
[]
[null,null,"COURSE\\LIFT:",null,null,"STATION:",null,null,"DIST. FROM CL:"]
[]
[null,"Test","Sample ID","Specimen Density","Starting Load","Final Load","% Decline in Load","# Cycles to Failure","Critical Fracture Energy","Crack Progression Rate","# Observed Cracks","Equipment ID","Comments"]
[]
[]
[null,1,null,null,null,null,{"$f":"IF(ISERROR(((E24-F24)/E24*100)),\"\",((E24-F24)/E24*100))","v":""}]
[null,2,null,null,null,null,{"$f":"IF(ISERROR(((E25-F25)/E25*100)),\"\",((E25-F25)/E25*100))","v":""}]
[null,3,null,null,null,null,{"$f":"IF(ISERROR(((E26-F26)/E26*100)),\"\",((E26-F26)/E26*100))","v":""}]
[null,"AVERAGE: ",null,{"$f":"IF(ISERROR(AVERAGE(D24:D26)),\"\",AVERAGE(D24:D26))","v":""},"","","",{"$f":"IF(ISERROR(AVERAGE(H24:H26)),\"\",AVERAGE(H24:H26))","v":""},"","",""]
[]
[null,"Remarks:",{"$f":"NOW()","v":"2024-10-09T15:35:48.660"}]
[]
[]
[]
[null,"Sample Method:","Sampled By:",null,null,null,null,"Sampled Date:"]
[null,"TX222"]
[null,"Test Method:","Tested By:",null,null,null,null,"Tested Date:"]
[null,"TX248"]
[null,"Test Stamp Code:",null,null,null,null,"Omit Test:","Completed Date:","Reviewed By:"]
[]
[null,"Locked By:","TxDOT:",null,"District:",null,"Area:"]
[]
[null,"Authorized By:",null,null,null,null,"Authorized Date:"]
[null,null,null,null,null,null,null,{"$f":"IF(OR(AuthorizedDate=\"\",AuthorizedDate>44000),2,1)","v":2}]
[]
[null,null,null,null,null,null,{"$f":"AuthorizedDate","v":0}]

{"sheet":"RX","index":1,"n_rows":49,"n_cols":9,"rows_kept":49,"cut":false,"hidden":true,"merged":[]}
[47]
["Fld_nbr","Value","Desc_1","Desc_2","Desc_3","Desc_4","Desc_5","Desc_6","Desc_7"]
[1,{"$f":"IF('Tex-248-F'!$B$30=\"\",\"\",'Tex-248-F'!$B$30)","v":""},{"$f":"'Tex-248-F'!$B$29","v":"Remarks:"}]
[2,{"$f":"IF('Tex-248-F'!$D$19=\"\",\"\",'Tex-248-F'!$D$19)","v":""},{"$f":"IF('Tex-248-F'!$C$19=\"\",\"\",'Tex-248-F'!$C$19)","v":"COURSE\\LIFT:"}]
[3,{"$f":"IF('Tex-248-F'!$C$36=\"\",\"\",'Tex-248-F'!$C$36)","v":""},"Tested By ",{"$f":"IF('Tex-248-F'!$B$36=\"\",\"\",'Tex-248-F'!$B$36)","v":"TX248"}]
[4,{"$f":"IF('Tex-248-F'!$H$36=\"\",\"\",'Tex-248-F'!$H$36)","v":""},"Tested Date ",{"$f":"IF('Tex-248-F'!$B$36=\"\",\"\",'Tex-248-F'!$B$36)","v":"TX248"}]
[5,{"$f":"IF('Tex-248-F'!$C$24=\"\",\"\",'Tex-248-F'!$C$24)","v":""},{"$f":"IF('Tex-248-F'!$B$6=\"\",\"\",'Tex-248-F'!$B$6)","v":"Tex-248-F"},{"$f":"IF('Tex-248-F'!$C$21=\"\",\"\",'Tex-248-F'!$C$21)","v":"Sample ID"},{"$f":"IF('Tex-248-F'!$B$21=\"\",\"\",'Tex-248-F'!$B$21)","v":"Test"},{"$f":"IF('Tex-248-F'!$B$24=\"\",\"\",'Tex-248-F'!$B$24)","v":1}]
[6,{"$f":"IF('Tex-248-F'!$C$25=\"\",\"\",'Tex-248-F'!$C$25)","v":""},{"$f":"IF('Tex-248-F'!$B$6=\"\",\"\",'Tex-248-F'!$B$6)","v":"Tex-248-F"},{"$f":"IF('Tex-248-F'!$C$21=\"\",\"\",'Tex-248-F'!$C$21)","v":"Sample ID"},{"$f":"IF('Tex-248-F'!$B$21=\"\",\"\",'Tex-248-F'!$B$21)","v":"Test"},{"$f":"IF('Tex-248-F'!$B$25=\"\",\"\",'Tex-248-F'!$B$25)","v":2}]
[7,{"$f":"IF('Tex-248-F'!$C$26=\"\",\"\",'Tex-248-F'!$C$26)","v":""},{"$f":"IF('Tex-248-F'!$B$6=\"\",\"\",'Tex-248-F'!$B$6)","v":"Tex-248-F"},{"$f":"IF('Tex-248-F'!$C$21=\"\",\"\",'Tex-248-F'!$C$21)","v":"Sample ID"},{"$f":"IF('Tex-248-F'!$B$21=\"\",\"\",'Tex-248-F'!$B$21)","v":"Test"},{"$f":"IF('Tex-248-F'!$B$26=\"\",\"\",'Tex-248-F'!$B$26)","v":3}]
[8,{"$f":"IF('Tex-248-F'!$E$24=\"\",\"\",'Tex-248-F'!$E$24)","v":""},{"$f":"IF('Tex-248-F'!$B$6=\"\",\"\",'Tex-248-F'!$B$6)","v":"Tex-248-F"},{"$f":"IF('Tex-248-F'!$E$21=\"\",\"\",'Tex-248-F'!$E$21)","v":"Starting Load"},{"$f":"IF('Tex-248-F'!$B$21=\"\",\"\",'Tex-248-F'!$B$21)","v":"Test"},{"$f":"IF('Tex-248-F'!$B$24=\"\",\"\",'Tex-248-F'!$B$24)","v":1}]
[9,{"$f":"IF('Tex-248-F'!$E$25=\"\",\"\",'Tex-248-F'!$E$25)","v":""},{"$f":"IF('Tex-248-F'!$B$6=\"\",\"\",'Tex-248-F'!$B$6)","v":"Tex-248-F"},{"$f":"IF('Tex-248-F'!$E$21=\"\",\"\",'Tex-248-F'!$E$21)","v":"Starting Load"},{"$f":"IF('Tex-248-F'!$B$21=\"\",\"\",'Tex-248-F'!$B$21)","v":"Test"},{"$f":"IF('Tex-248-F'!$B$25=\"\",\"\",'Tex-248-F'!$B$25)","v":2}]
[10,{"$f":"IF('Tex-248-F'!$E$26=\"\",\"\",'Tex-248-F'!$E$26)","v":""},{"$f":"IF('Tex-248-F'!$B$6=\"\",\"\",'Tex-248-F'!$B$6)","v":"Tex-248-F"},{"$f":"IF('Tex-248-F'!$E$21=\"\",\"\",'Tex-248-F'!$E$21)","v":"Starting Load"},{"$f":"IF('Tex-248-F'!$B$21=\"\",\"\",'Tex-248-F'!$B$21)","v":"Test"},{"$f":"IF('Tex-248-F'!$B$26=\"\",\"\",'Tex-248-F'!$B$26)","v":3}]
[11,{"$f":"IF('Tex-248-F'!$F$24=\"\",\"\",'Tex-248-F'!$F$24)","v":""},{"$f":"IF('Tex-248-F'!$B$6=\"\",\"\",'Tex-248-F'!$B$6)","v":"Tex-248-F"},{"$f":"IF('Tex-248-F'!$F$21=\"\",\"\",'Tex-248-F'!$F$21)","v":"Final Load"},{"$f":"IF('Tex-248-F'!$B$21=\"\",\"\",'Tex-248-F'!$B$21)","v":"Test"},{"$f":"IF('Tex-248-F'!$B$24=\"\",\"\",'Tex-248-F'!$B$24)","v":1}]
[12,{"$f":"IF('Tex-248-F'!$F$25=\"\",\"\",'Tex-248-F'!$F$25)","v":""},{"$f":"IF('Tex-248-F'!$B$6=\"\",\"\",'Tex-248-F'!$B$6)","v":"Tex-248-F"},{"$f":"IF('Tex-248-F'!$F$21=\"\",\"\",'Tex-248-F'!$F$21)","v":"Final Load"},{"$f":"IF('Tex-248-F'!$B$21=\"\",\"\",'Tex-248-F'!$B$21)","v":"Test"},{"$f":"IF('Tex-248-F'!$B$25=\"\",\"\",'Tex-248-F'!$B$25)","v":2}]
[13,{"$f":"IF('Tex-248-F'!$F$26=\"\",\"\",'Tex-248-F'!$F$26)","v":""},{"$f":"IF('Tex-248-F'!$B$6=\"\",\"\",'Tex-248-F'!$B$6)","v":"Tex-248-F"},{"$f":"IF('Tex-248-F'!$F$21=\"\",\"\",'Tex-248-F'!$F$21)","v":"Final Load"},{"$f":"IF('Tex-248-F'!$B$21=\"\",\"\",'Tex-248-F'!$B$21)","v":"Test"},{"$f":"IF('Tex-248-F'!$B$26=\"\",\"\",'Tex-248-F'!$B$26)","v":3}]
[14,{"$f":"IF('Tex-248-F'!$G$24=\"\",\"\",'Tex-248-F'!$G$24)","v":""},{"$f":"IF('Tex-248-F'!$B$6=\"\",\"\",'Tex-248-F'!$B$6)","v":"Tex-248-F"},{"$f":"IF('Tex-248-F'!$G$21=\"\",\"\",'Tex-248-F'!$G$21)","v":"% Decline in Load"},{"$f":"IF('Tex-248-F'!$B$21=\"\",\"\",'Tex-248-F'!$B$21)","v":"Test"},{"$f":"IF('Tex-248-F'!$B$24=\"\",\"\",'Tex-248-F'!$B$24)","v":1}]
[15,{"$f":"IF('Tex-248-F'!$G$25=\"\",\"\",'Tex-248-F'!$G$25)","v":""},{"$f":"IF('Tex-248-F'!$B$6=\"\",\"\",'Tex-248-F'!$B$6)","v":"Tex-248-F"},{"$f":"IF('Tex-248-F'!$G$21=\"\",\"\",'Tex-248-F'!$G$21)","v":"% Decline in Load"},{"$f":"IF('Tex-248-F'!$B$21=\"\",\"\",'Tex-248-F'!$B$21)","v":"Test"},{"$f":"IF('Tex-248-F'!$B$25=\"\",\"\",'Tex-248-F'!$B$25)","v":2}]
[16,{"$f":"IF('Tex-248-F'!$G$26=\"\",\"\",'Tex-248-F'!$G$26)","v":""},{"$f":"IF('Tex-248-F'!$B$6=\"\",\"\",'Tex-248-F'!$B$6)","v":"Tex-248-F"},{"$f":"IF('Tex-248-F'!$G$21=\"\",\"\",'Tex-248-F'!$G$21)","v":"% Decline in Load"},{"$f":"IF('Tex-248-F'!$B$21=\"\",\"\",'Tex-248-F'!$B$21)","v":"Test"},{"$f":"IF('Tex-248-F'!$B$26=\"\",\"\",'Tex-248-F'!$B$26)","v":3}]
[17,{"$f":"IF('Tex-248-F'!$H$24=\"\",\"\",'Tex-248-F'!$H$24)","v":""},{"$f":"IF('Tex-248-F'!$B$6=\"\",\"\",'Tex-248-F'!$B$6)","v":"Tex-248-F"},{"$f":"IF('Tex-248-F'!$H$21=\"\",\"\",'Tex-248-F'!$H$21)","v":"# Cycles to Failure"},{"$f":"IF('Tex-248-F'!$B$21=\"\",\"\",'Tex-248-F'!$B$21)","v":"Test"},{"$f":"IF('Tex-248-F'!$B$24=\"\",\"\",'Tex-248-F'!$B$24)","v":1}]
[18,{"$f":"IF('Tex-248-F'!$H$25=\"\",\"\",'Tex-248-F'!$H$25)","v":""},{"$f":"IF('Tex-248-F'!$B$6=\"\",\"\",'Tex-248-F'!$B$6)","v":"Tex-248-F"},{"$f":"IF('Tex-248-F'!$H$21=\"\",\"\",'Tex-248-F'!$H$21)","v":"# Cycles to Failure"},{"$f":"IF('Tex-248-F'!$B$21=\"\",\"\",'Tex-248-F'!$B$21)","v":"Test"},{"$f":"IF('Tex-248-F'!$B$25=\"\",\"\",'Tex-248-F'!$B$25)","v":2}]
[19,{"$f":"IF('Tex-248-F'!$H$26=\"\",\"\",'Tex-248-F'!$H$26)","v":""},{"$f":"IF('Tex-248-F'!$B$6=\"\",\"\",'Tex-248-F'!$B$6)","v":"Tex-248-F"},{"$f":"IF('Tex-248-F'!$H$21=\"\",\"\",'Tex-248-F'!$H$21)","v":"# Cycles to Failure"},{"$f":"IF('Tex-248-F'!$B$21=\"\",\"\",'Tex-248-F'!$B$21)","v":"Test"},{"$f":"IF('Tex-248-F'!$B$26=\"\",\"\",'Tex-248-F'!$B$26)","v":3}]
[20,{"$f":"IF('Tex-248-F'!$L$24=\"\",\"\",'Tex-248-F'!$L$24)","v":""},{"$f":"IF('Tex-248-F'!$B$6=\"\",\"\",'Tex-248-F'!$B$6)","v":"Tex-248-F"},{"$f":"IF('Tex-248-F'!$L$21=\"\",\"\",'Tex-248-F'!$L$21)","v":"Equipment ID"},{"$f":"IF('Tex-248-F'!$B$21=\"\",\"\",'Tex-248-F'!$B$21)","v":"Test"},{"$f":"IF('Tex-248-F'!$B$24=\"\",\"\",'Tex-248-F'!$B$24)","v":1}]
[21,{"$f":"IF('Tex-248-F'!$L$25=\"\",\"\",'Tex-248-F'!$L$25)","v":""},{"$f":"IF('Tex-248-F'!$B$6=\"\",\"\",'Tex-248-F'!$B$6)","v":"Tex-248-F"},{"$f":"IF('Tex-248-F'!$L$21=\"\",\"\",'Tex-248-F'!$L$21)","v":"Equipment ID"},{"$f":"IF('Tex-248-F'!$B$21=\"\",\"\",'Tex-248-F'!$B$21)","v":"Test"},{"$f":"IF('Tex-248-F'!$B$25=\"\",\"\",'Tex-248-F'!$B$25)","v":2}]
[22,{"$f":"IF('Tex-248-F'!$L$26=\"\",\"\",'Tex-248-F'!$L$26)","v":""},{"$f":"IF('Tex-248-F'!$B$6=\"\",\"\",'Tex-248-F'!$B$6)","v":"Tex-248-F"},{"$f":"IF('Tex-248-F'!$L$21=\"\",\"\",'Tex-248-F'!$L$21)","v":"Equipment ID"},{"$f":"IF('Tex-248-F'!$B$21=\"\",\"\",'Tex-248-F'!$B$21)","v":"Test"},{"$f":"IF('Tex-248-F'!$B$26=\"\",\"\",'Tex-248-F'!$B$26)","v":3}]
[23,{"$f":"IF('Tex-248-F'!$M$24=\"\",\"\",'Tex-248-F'!$M$24)","v":""},{"$f":"IF('Tex-248-F'!$B$6=\"\",\"\",'Tex-248-F'!$B$6)","v":"Tex-248-F"},{"$f":"IF('Tex-248-F'!$M$21=\"\",\"\",'Tex-248-F'!$M$21)","v":"Comments"},{"$f":"IF('Tex-248-F'!$B$21=\"\",\"\",'Tex-248-F'!$B$21)","v":"Test"},{"$f":"IF('Tex-248-F'!$B$24=\"\",\"\",'Tex-248-F'!$B$24)","v":1}]
[24,{"$f":"IF('Tex-248-F'!$M$25=\"\",\"\",'Tex-248-F'!$M$25)","v":""},{"$f":"IF('Tex-248-F'!$B$6=\"\",\"\",'Tex-248-F'!$B$6)","v":"Tex-248-F"},{"$f":"IF('Tex-248-F'!$M$21=\"\",\"\",'Tex-248-F'!$M$21)","v":"Comments"},{"$f":"IF('Tex-248-F'!$B$21=\"\",\"\",'Tex-248-F'!$B$21)","v":"Test"},{"$f":"IF('Tex-248-F'!$B$25=\"\",\"\",'Tex-248-F'!$B$25)","v":2}]
[25,{"$f":"IF('Tex-248-F'!$M$26=\"\",\"\",'Tex-248-F'!$M$26)","v":""},{"$f":"IF('Tex-248-F'!$B$6=\"\",\"\",'Tex-248-F'!$B$6)","v":"Tex-248-F"},{"$f":"IF('Tex-248-F'!$M$21=\"\",\"\",'Tex-248-F'!$M$21)","v":"Comments"},{"$f":"IF('Tex-248-F'!$B$21=\"\",\"\",'Tex-248-F'!$B$21)","v":"Test"},{"$f":"IF('Tex-248-F'!$B$26=\"\",\"\",'Tex-248-F'!$B$26)","v":3}]
[26,{"$f":"IF('Tex-248-F'!$D$24=\"\",\"\",'Tex-248-F'!$D$24)","v":""},{"$f":"IF( 'Tex-248-F'!$B$6=\"\",\"\", 'Tex-248-F'!$B$6)","v":"Tex-248-F"},{"$f":"IF('Tex-248-F'!$D$21=\"\",\"\",'Tex-248-F'!$D$21)","v":"Specimen Density"},{"$f":"IF('Tex-248-F'!$B$21=\"\",\"\",'Tex-248-F'!$B$21)","v":"Test"},{"$f":"IF('Tex-248-F'!$B$24=\"\",\"\",'Tex-248-F'!$B$24)","v":1}]
[27,{"$f":"IF('Tex-248-F'!$D$25=\"\",\"\",'Tex-248-F'!$D$25)","v":""},{"$f":"IF( 'Tex-248-F'!$B$6=\"\",\"\", 'Tex-248-F'!$B$6)","v":"Tex-248-F"},{"$f":"IF('Tex-248-F'!$D$21=\"\",\"\",'Tex-248-F'!$D$21)","v":"Specimen Density"},{"$f":"IF('Tex-248-F'!$B$21=\"\",\"\",'Tex-248-F'!$B$21)","v":"Test"},{"$f":"IF('Tex-248-F'!$B$25=\"\",\"\",'Tex-248-F'!$B$25)","v":2}]
[28,{"$f":"IF('Tex-248-F'!$D$26=\"\",\"\",'Tex-248-F'!$D$26)","v":""},{"$f":"IF( 'Tex-248-F'!$B$6=\"\",\"\", 'Tex-248-F'!$B$6)","v":"Tex-248-F"},{"$f":"IF('Tex-248-F'!$D$21=\"\",\"\",'Tex-248-F'!$D$21)","v":"Specimen Density"},{"$f":"IF('Tex-248-F'!$B$21=\"\",\"\",'Tex-248-F'!$B$21)","v":"Test"},{"$f":"IF('Tex-248-F'!$B$26=\"\",\"\",'Tex-248-F'!$B$26)","v":3}]
[29,{"$f":"IF('Tex-248-F'!$K$24=\"\",\"\",'Tex-248-F'!$K$24)","v":""},{"$f":"IF( 'Tex-248-F'!$B$6=\"\",\"\", 'Tex-248-F'!$B$6)","v":"Tex-248-F"},{"$f":"IF('Tex-248-F'!$K$21=\"\",\"\",'Tex-248-F'!$K$21)","v":"# Observed Cracks"},{"$f":"IF('Tex-248-F'!$B$21=\"\",\"\",'Tex-248-F'!$B$21)","v":"Test"},{"$f":"IF('Tex-248-F'!$B$24=\"\",\"\",'Tex-248-F'!$B$24)","v":1}]
[30,{"$f":"IF('Tex-248-F'!$K$25=\"\",\"\",'Tex-248-F'!$K$25)","v":""},{"$f":"IF( 'Tex-248-F'!$B$6=\"\",\"\", 'Tex-248-F'!$B$6)","v":"Tex-248-F"},{"$f":"IF('Tex-248-F'!$K$21=\"\",\"\",'Tex-248-F'!$K$21)","v":"# Observed Cracks"},{"$f":"IF('Tex-248-F'!$B$21=\"\",\"\",'Tex-248-F'!$B$21)","v":"Test"},{"$f":"IF('Tex-248-F'!$B$25=\"\",\"\",'Tex-248-F'!$B$25)","v":2}]
[31,{"$f":"IF('Tex-248-F'!$K$26=\"\",\"\",'Tex-248-F'!$K$26)","v":""},{"$f":"IF( 'Tex-248-F'!$B$6=\"\",\"\", 'Tex-248-F'!$B$6)","v":"Tex-248-F"},{"$f":"IF('Tex-248-F'!$K$21=\"\",\"\",'Tex-248-F'!$K$21)","v":"# Observed Cracks"},{"$f":"IF('Tex-248-F'!$B$21=\"\",\"\",'Tex-248-F'!$B$21)","v":"Test"},{"$f":"IF('Tex-248-F'!$B$26=\"\",\"\",'Tex-248-F'!$B$26)","v":3}]
[32,{"$f":"IF('Tex-248-F'!$D$27=\"\",\"\",'Tex-248-F'!$D$27)","v":""},{"$f":"IF( 'Tex-248-F'!$B$6=\"\",\"\", 'Tex-248-F'!$B$6)","v":"Tex-248-F"},{"$f":"IF('Tex-248-F'!$D$21=\"\",\"\",'Tex-248-F'!$D$21)","v":"Specimen Density"},{"$f":"IF('Tex-248-F'!$B$27=\"\",\"\",'Tex-248-F'!$B$27)","v":"AVERAGE: "}]
[33,{"$f":"IF('Tex-248-F'!$E$27=\"\",\"\",'Tex-248-F'!$E$27)","v":""},{"$f":"IF( 'Tex-248-F'!$B$6=\"\",\"\", 'Tex-248-F'!$B$6)","v":"Tex-248-F"},{"$f":"IF('Tex-248-F'!$E$21=\"\",\"\",'Tex-248-F'!$E$21)","v":"Starting Load"},{"$f":"IF('Tex-248-F'!$B$27=\"\",\"\",'Tex-248-F'!$B$27)","v":"AVERAGE: "}]
[34,{"$f":"IF('Tex-248-F'!$F$27=\"\",\"\",'Tex-248-F'!$F$27)","v":""},{"$f":"IF( 'Tex-248-F'!$B$6=\"\",\"\", 'Tex-248-F'!$B$6)","v":"Tex-248-F"},{"$f":"IF('Tex-248-F'!$F$21=\"\",\"\",'Tex-248-F'!$F$21)","v":"Final Load"},{"$f":"IF('Tex-248-F'!$B$27=\"\",\"\",'Tex-248-F'!$B$27)","v":"AVERAGE: "}]
[35,{"$f":"IF('Tex-248-F'!$G$27=\"\",\"\",'Tex-248-F'!$G$27)","v":""},{"$f":"IF( 'Tex-248-F'!$B$6=\"\",\"\", 'Tex-248-F'!$B$6)","v":"Tex-248-F"},{"$f":"IF('Tex-248-F'!$G$21=\"\",\"\",'Tex-248-F'!$G$21)","v":"% Decline in Load"},{"$f":"IF('Tex-248-F'!$B$27=\"\",\"\",'Tex-248-F'!$B$27)","v":"AVERAGE: "}]
[36,{"$f":"IF('Tex-248-F'!$H$27=\"\",\"\",'Tex-248-F'!$H$27)","v":""},{"$f":"IF( 'Tex-248-F'!$B$6=\"\",\"\", 'Tex-248-F'!$B$6)","v":"Tex-248-F"},{"$f":"IF('Tex-248-F'!$H$21=\"\",\"\",'Tex-248-F'!$H$21)","v":"# Cycles to Failure"},{"$f":"IF('Tex-248-F'!$B$27=\"\",\"\",'Tex-248-F'!$B$27)","v":"AVERAGE: "}]
[37,{"$f":"IF('Tex-248-F'!$K$27=\"\",\"\",'Tex-248-F'!$K$27)","v":""},{"$f":"IF( 'Tex-248-F'!$B$6=\"\",\"\", 'Tex-248-F'!$B$6)","v":"Tex-248-F"},{"$f":"IF('Tex-248-F'!$K$21=\"\",\"\",'Tex-248-F'!$K$21)","v":"# Observed Cracks"},{"$f":"IF('Tex-248-F'!$B$27=\"\",\"\",'Tex-248-F'!$B$27)","v":"AVERAGE: "}]
[38,{"$f":"IF('Tex-248-F'!$I$24=\"\",\"\",'Tex-248-F'!$I$24)","v":""},{"$f":"IF('Tex-248-F'!$B$6=\"\",\"\",'Tex-248-F'!$B$6)","v":"Tex-248-F"},{"$f":"IF('Tex-248-F'!$I$21=\"\",\"\",'Tex-248-F'!$I$21)","v":"Critical Fracture Energy"},{"$f":"IF('Tex-248-F'!$B$21=\"\",\"\",'Tex-248-F'!$B$21)","v":"Test"},{"$f":"IF('Tex-248-F'!$B$24=\"\",\"\",'Tex-248-F'!$B$24)","v":1}]
[39,{"$f":"IF('Tex-248-F'!$I$25=\"\",\"\",'Tex-248-F'!$I$25)","v":""},{"$f":"IF('Tex-248-F'!$B$6=\"\",\"\",'Tex-248-F'!$B$6)","v":"Tex-248-F"},{"$f":"IF('Tex-248-F'!$I$21=\"\",\"\",'Tex-248-F'!$I$21)","v":"Critical Fracture Energy"},{"$f":"IF('Tex-248-F'!$B$21=\"\",\"\",'Tex-248-F'!$B$21)","v":"Test"},{"$f":"IF('Tex-248-F'!$B$25=\"\",\"\",'Tex-248-F'!$B$25)","v":2}]
[40,{"$f":"IF('Tex-248-F'!$I$26=\"\",\"\",'Tex-248-F'!$I$26)","v":""},{"$f":"IF('Tex-248-F'!$B$6=\"\",\"\",'Tex-248-F'!$B$6)","v":"Tex-248-F"},{"$f":"IF('Tex-248-F'!$I$21=\"\",\"\",'Tex-248-F'!$I$21)","v":"Critical Fracture Energy"},{"$f":"IF('Tex-248-F'!$B$21=\"\",\"\",'Tex-248-F'!$B$21)","v":"Test"},{"$f":"IF('Tex-248-F'!$B$26=\"\",\"\",'Tex-248-F'!$B$26)","v":3}]
[41,{"$f":"IF('Tex-248-F'!$J$24=\"\",\"\",'Tex-248-F'!$J$24)","v":""},{"$f":"IF('Tex-248-F'!$B$6=\"\",\"\",'Tex-248-F'!$B$6)","v":"Tex-248-F"},{"$f":"IF('Tex-248-F'!$J$21=\"\",\"\",'Tex-248-F'!$J$21)","v":"Crack Progression Rate"},{"$f":"IF('Tex-248-F'!$B$21=\"\",\"\",'Tex-248-F'!$B$21)","v":"Test"},{"$f":"IF('Tex-248-F'!$B$24=\"\",\"\",'Tex-248-F'!$B$24)","v":1}]
[42,{"$f":"IF('Tex-248-F'!$J$25=\"\",\"\",'Tex-248-F'!$J$25)","v":""},{"$f":"IF('Tex-248-F'!$B$6=\"\",\"\",'Tex-248-F'!$B$6)","v":"Tex-248-F"},{"$f":"IF('Tex-248-F'!$J$21=\"\",\"\",'Tex-248-F'!$J$21)","v":"Crack Progression Rate"},{"$f":"IF('Tex-248-F'!$B$21=\"\",\"\",'Tex-248-F'!$B$21)","v":"Test"},{"$f":"IF('Tex-248-F'!$B$25=\"\",\"\",'Tex-248-F'!$B$25)","v":2}]
[43,{"$f":"IF('Tex-248-F'!$J$26=\"\",\"\",'Tex-248-F'!$J$26)","v":""},{"$f":"IF('Tex-248-F'!$B$6=\"\",\"\",'Tex-248-F'!$B$6)","v":"Tex-248-F"},{"$f":"IF('Tex-248-F'!$J$21=\"\",\"\",'Tex-248-F'!$J$21)","v":"Crack Progression Rate"},{"$f":"IF('Tex-248-F'!$B$21=\"\",\"\",'Tex-248-F'!$B$21)","v":"Test"},{"$f":"IF('Tex-248-F'!$B$26=\"\",\"\",'Tex-248-F'!$B$26)","v":3}]
[44,{"$f":"IF('Tex-248-F'!$I$27=\"\",\"\",'Tex-248-F'!$I$27)","v":""},{"$f":"IF( 'Tex-248-F'!$B$6=\"\",\"\", 'Tex-248-F'!$B$6)","v":"Tex-248-F"},{"$f":"IF('Tex-248-F'!$I$21=\"\",\"\",'Tex-248-F'!$I$21)","v":"Critical Fracture Energy"},{"$f":"IF('Tex-248-F'!$B$27=\"\",\"\",'Tex-248-F'!$B$27)","v":"AVERAGE: "}]
[45,{"$f":"IF('Tex-248-F'!$J$27=\"\",\"\",'Tex-248-F'!$J$27)","v":""},{"$f":"IF( 'Tex-248-F'!$B$6=\"\",\"\", 'Tex-248-F'!$B$6)","v":"Tex-248-F"},{"$f":"IF('Tex-248-F'!$J$21=\"\",\"\",'Tex-248-F'!$J$21)","v":"Crack Progression Rate"},{"$f":"IF('Tex-248-F'!$B$27=\"\",\"\",'Tex-248-F'!$B$27)","v":"AVERAGE: "}]
[46,{"$f":"IF('Tex-248-F'!$C$34=\"\",\"\",'Tex-248-F'!$C$34)","v":""},"Sampled By ",{"$f":"IF('Tex-248-F'!$B$34=\"\",\"\",'Tex-248-F'!$B$34)","v":"TX222"}]
[47,{"$f":"IF('Tex-248-F'!$H$34=\"\",\"\",'Tex-248-F'!$H$34)","v":""},"Sampled Date ",{"$f":"IF('Tex-248-F'!$B$34=\"\",\"\",'Tex-248-F'!$B$34)","v":"TX222"}]

{"sheet":"Revisions","index":2,"n_rows":10,"n_cols":4,"rows_kept":10,"cut":false,"hidden":true,"merged":[[1,0,6,0],[1,2,6,2],[1,3,6,3],[7,2,8,2],[7,0,8,0],[7,3,8,3]]}
["Date","Changes","By","Comments"]
["2014-06-13","Add 2014 spec year","Andre Smit"]
[null,"Add specimen density column"]
[null,"Add new mix types for 2014 spec"]
[null,"Add # observed cracks column"]
[null,"Update RX sheet"]
[null,"Add lift types"]
["2020-03-04","Add columns for critical fracture energy and crack progression rate","Syeda Rahman"]
[null,"Add special spec items 3074, 3076, and 3077"]
["2024-08-02","Add 2024 spec items","Syeda Rahman"]

{"sheet":"MixTypes","index":3,"n_rows":34,"n_cols":3,"rows_kept":34,"cut":false,"hidden":true,"merged":[]}
[]
["Spec2004","Spec2014","Spec2024"]
["341-DG-A","341-DG-A","342-PFC-C"]
["341-DG-B","341-DG-B","342-PFC-F"]
["341-DG-C","341-DG-C","346-SMA-C"]
["341-DG-D","341-DG-D","346-SMA-D"]
["341-DG-F","341-DG-F","346-SMA-F"]
["342-PFC-C","342-PFC-C","346-SMAR-F"]
["342-PFC-F","342-PFC-F","347-TOM-C"]
["342-PFCR-C","342-PFCR-C","347-TOM-F"]
["342-PFCR-F","342-PFCR-F","348-PFC-C"]
["344-SP-A","344-SP-A","348-PFC-F"]
["344-SP-B","344-SP-B","348-TBFC-A"]
["344-SP-C","344-SP-C","348-TBFC-B"]
["344-SP-D","344-SP-D","348-TBFC-C"]
["346-SMA-C","346-SMA-C","SS-CAM"]
["346-SMA-D","346-SMA-D"]
["346-SMA-F","346-SMA-F"]
["346-SMAR-C","346-SMAR-C"]
["346-SMAR-F","346-SMAR-F"]
["347-TOM-C","347-TOM-C"]
["347-TOM-F","347-TOM-F"]
["348-PFC-C","348-PFC-C"]
["348-PFC-F","348-PFC-F"]
["348-PFCR-C","348-PFCR-C"]
["348-TBWC-A","348-TBWC-A"]
["348-TBWC-B","348-TBWC-B"]
["348-TBWC-C","348-TBWC-C"]
["SS-CAM","SS-CAM"]
["SS-3077-SP-B","SS-3077-SP-B"]
["SS-3077-SP-C","SS-3077-SP-C"]
["SS-3077-SP-D","SS-3077-SP-D"]
["SS-3074-BMD-SP-D","SS-3074-BMD-SP-D"]
["SS-3074-BMD-SP-C","SS-3074-BMD-SP-C"]