{"text_format":"1","workbook":"xlsx","n_sheets":4,"sheets":["Tex-250-F","spcyr","RX","Revisions"],"not_rendered":{"charts":0,"images":1,"macros":1,"external_links":0,"defined_names":81,"comments":1,"pivot_tables":0},"unopened":[],"bounds":{"document_bytes":16777216,"sheet_cells":100000,"rows_first":2000,"rows_last":500,"rows_between":2000,"halvings":0,"cell_chars":16384,"cell_head_chars":4096},"cells_cut":0,"cells_raw":0,"read":"whole","date_system":"1900"}

{"sheet":"Tex-250-F","index":0,"n_rows":45,"n_cols":11,"rows_kept":45,"cut":false,"hidden":false,"merged":[[14,3,14,8],[19,7,19,8],[28,1,28,2],[30,1,30,2],[30,3,30,6],[21,1,21,2],[15,3,15,8],[20,6,20,7],[22,1,22,2],[23,1,23,2],[24,1,24,2],[19,1,19,2],[19,3,19,4],[19,5,19,6],[25,1,25,2],[16,7,16,8],[16,3,16,4],[44,1,44,3],[40,6,40,8],[34,1,35,8],[38,2,38,4],[37,2,37,4],[40,1,40,3],[29,1,29,2],[29,3,29,6],[27,1,27,2],[26,1,26,2],[11,3,11,4],[12,3,12,4],[13,3,13,4],[0,0,0,1],[7,7,7,8],[10,7,10,8],[7,3,7,4],[8,3,8,4],[13,7,13,8],[8,7,8,8],[10,3,10,4],[9,7,9,8],[9,3,9,4],[12,7,12,8],[11,7,11,8]]}
["TxDOT Manuals >",null,null,"Tex-250-F"]
[null,"TEXAS DEPARTMENT OF TRANSPORTATION",null,null,null,null,null,null,null,null,33]
[null,null,null,null,null,null,null,null,null,null,1]
[null,null,null,null,null,null,null,null,null,null,"tx250.xlsm::45574.651956"]
[null,{"$f":"UPPER(\"Ideal Cracking Test\")","v":"IDEAL CRACKING TEST"}]
[null,"Tex-250-F"]
[null,null,null,null,null,null,null,null,{"$f":"\"Tex-250-F :: File Version: \" & TEXT(MID(sn,SEARCH(\"::\",sn,1)+2,20),\"mm/dd/yy hh:mm:ss\")","v":"Tex-250-F :: File Version: 10/09/24 15:38:49"}]
[null,null,"SAMPLE ID:",null,null,null,"SAMPLED DATE:"]
[null,null,"TEST NUMBER:",null,null,null,"LETTING DATE:"]
[null,null,"SAMPLE STATUS:",null,null,null,"CONTROLLING CSJ:"]
[null,null,"COUNTY:",null,null,null,"SPEC YEAR:"]
[null,null,"SAMPLED BY:",null,null,null,"SPEC ITEM:"]
[null,null,"SAMPLE LOCATION:",null,null,null,"SPECIAL PROVISION:"]
[null,null,"MATERIAL CODE:",null,null,null,"MIX TYPE:"]
[null,null,"MATERIAL NAME:"]
[null,null,"PRODUCER:"]
[null,null,"AREA ENGINEER:",null,null,null,"PROJECT MANAGER:"]
[]
[null,null,"COURSE\\LIFT:",null,"STATION:",null,null,"DIST. FROM CL:"]
[null,"TEST TYPE:",null,null,null,"GYRATORY COMPACTOR:"]
[]
[null,"Specimen:",null,1,2,3,4]
[null,"Specimen ID:"]
[null,"Density, %:",null,null,null,null,null,{"$f":"IF(AND(OR(TestType=\"Mix Design\",TestType=\"Production\"),OR(AND(E24<>\"\",OR(E24<92.5,E24>94.5)),AND(D24<>\"\",OR(D24<92.5,D24>93.5)),AND(F24<>\"\",OR(F24<92.5,F24>93.5)),AND(G24<>\"\",OR(G24<92.5,G24>93.5)))),\"<<Out of density tolerance\",\"\")","v":""}]
[null,"Thickness (in):",null,null,null,null,null,{"$f":"IF(AND(OR(TestType=\"Mix Design\",TestType=\"Production\"),OR(AND(D25<>\"\",OR(D25<2.3,D25>2.5)),AND(E25<>\"\",OR(E25<2.3,E25>2.5)),AND(F25<>\"\",OR(F25<2.3,F25>2.5)),AND(G25<>\"\",OR(G25<2.3,G25>2.5)))),\"<<Out of specimen thickness tolerance\",IF(AND(TestType=\"Road Cores\",OR(AND(D25<>\"\",D25<1.5),AND(E25<>\"\",E25<1.5),AND(F25<>\"\",F25<1.5),AND(G25<>\"\",G25<1.5))),\"<<Out of specimen thickness tolerance\",\"\"))","v":""}]
[null,"Diameter (in):",null,null,null,null,null,{"$f":"IF(OR(AND(D26<>\"\",OR(D26<5.8,D26>6)),AND(E26<>\"\",OR(E26<5.8,E26>6)),AND(F25<>\"\",OR(F25<5.8,F25>6)),AND(G25<>\"\",OR(G25<5.8,G25>6))),\"<<Out of specimen diameter tolerance\",\"\")","v":""}]
[null,"Load (lb):"]
[null,"Cracking Tolerance Index:"]
[null,"Strength (psi):",null,{"$f":"IF(OR(D25=\"\",D26=\"\"),\"\", ((2*D27)/(3.14*D25*D26)))","v":""},{"$f":"IF(OR(E25=\"\",E26=\"\"),\"\", ((2*E27)/(3.14*E25*E26)))","v":""},"",""]
[null,"Average Cracking Tolerance Index:",null,{"$f":"IF(ISERROR(AVERAGE(D28:G28)),\"\",AVERAGE(D28:G28))","v":""}]
[null,"Average Strength, (psi):",null,{"$f":"IF(ISERROR(AVERAGE(D29:G29)),\"\",AVERAGE(D29:G29))","v":""},null,null,null,{"$f":"IF(AND(D31<>\"\",OR(D31<85,D31>200)),\"<<Out of specification\",\"\")","v":""}]
[]
[]
[null,"Remarks:",{"$f":"NOW()","v":"2024-10-09T15:38:49.350"}]
[]
[]
[]
[null,"Test Method:","Tested By:",null,null,"Tested Date:"]
[null,"TX250"]
[null,"Test Stamp Code:",null,null,"Omit Test:","Completed Date:","Reviewed By:"]
[]
[null,"Locked By:","TxDOT:","District:","Area:"]
[]
[null,"Authorized By:",null,null,"Authorized Date:"]
[null,null,null,null,null,1]

{"sheet":"spcyr","index":1,"n_rows":24,"n_cols":6,"rows_kept":24,"cut":false,"hidden":true,"merged":[]}
[null,null,"Spec2014","Spec2014",null,"Compactor"]
[null,null,"341-DG-B","340-DG-A",null,"SGC"]
[null,null,"341-DG-C","340-DG-B"]
[null,null,"341-DG-D","340-DG-C"]
[null,null,"341-DG-F","340-DG-D"]
[null,null,"344-SP-B","340-DG-F"]
[null,null,"344-SP-C","341-DG-A"]
[null,null,"344-SP-D","341-DG-B"]
[null,null,"346-SMA-C","341-DG-C"]
[null,null,"346-SMA-D","341-DG-D"]
[null,null,"346-SMA-F","341-DG-F"]
[null,null,"346-SMAR-F","344-SP-A"]
[null,null,"CAM","344-SP-B"]
[null,null,null,"344-SP-C"]
[null,null,null,"344-SP-D"]
[null,null,null,"346-SMA-C"]
[null,null,null,"346-SMA-D"]
[null,null,null,"346-SMA-F"]
[null,null,null,"346-SMAR-C"]
[null,null,null,"346-SMAR-F"]
[null,null,null,"SS-3077-SP-B"]
[null,null,null,"SS-3077-SP-C"]
[null,null,null,"SS-3077-SP-D"]
[null,null,null,"CAM"]

{"sheet":"RX","index":2,"n_rows":38,"n_cols":9,"rows_kept":38,"cut":false,"hidden":true,"merged":[]}
[{"$f":"COUNT(A3:A500)","v":36}]
["Fld_nbr","Value","Desc_1","Desc_2","Desc_3","Desc_4","Desc_5","Desc_6","Desc_7"]
[1,{"$f":"IF('Tex-250-F'!$B$35=\"\",\"\",'Tex-250-F'!$B$35)","v":""},{"$f":"'Tex-250-F'!$B$34","v":"Remarks:"}]
[2,{"$f":"IF('Tex-250-F'!$D$19=\"\",\"\",'Tex-250-F'!$D$19)","v":""},{"$f":"IF('Tex-250-F'!$C$19=\"\",\"\",'Tex-250-F'!$C$19)","v":"COURSE\\LIFT:"}]
[3,{"$f":"IF('Tex-250-F'!$C$39=\"\",\"\",'Tex-250-F'!$C$39)","v":""},"Tested By ",{"$f":"IF('Tex-250-F'!$B$39=\"\",\"\",'Tex-250-F'!$B$39)","v":"TX250"}]
[4,{"$f":"IF('Tex-250-F'!$F$39=\"\",\"\",'Tex-250-F'!$F$39)","v":""},"Tested Date ",{"$f":"IF('Tex-250-F'!$B$39=\"\",\"\",'Tex-250-F'!$B$39)","v":"TX250"}]
[5,{"$f":"IF('Tex-250-F'!$D$23=\"\",\"\",'Tex-250-F'!$D$23)","v":""},{"$f":"IF('Tex-250-F'!$B$6=\"\",\"\",'Tex-250-F'!$B$6)","v":"Tex-250-F"},{"$f":"IF('Tex-250-F'!$B$23=\"\",\"\",'Tex-250-F'!$B$23)","v":"Specimen ID:"},{"$f":"IF('Tex-250-F'!$B$22=\"\",\"\",'Tex-250-F'!$B$22)","v":"Specimen:"},{"$f":"IF('Tex-250-F'!$D$22=\"\",\"\",'Tex-250-F'!$D$22)","v":1}]
[6,{"$f":"IF('Tex-250-F'!$E$23=\"\",\"\",'Tex-250-F'!$E$23)","v":""},{"$f":"IF('Tex-250-F'!$B$6=\"\",\"\",'Tex-250-F'!$B$6)","v":"Tex-250-F"},{"$f":"IF('Tex-250-F'!$B$23=\"\",\"\",'Tex-250-F'!$B$23)","v":"Specimen ID:"},{"$f":"IF('Tex-250-F'!$B$22=\"\",\"\",'Tex-250-F'!$B$22)","v":"Specimen:"},{"$f":"IF('Tex-250-F'!$E$22=\"\",\"\",'Tex-250-F'!$E$22)","v":2}]
[7,{"$f":"IF('Tex-250-F'!$F$23=\"\",\"\",'Tex-250-F'!$F$23)","v":""},{"$f":"IF('Tex-250-F'!$B$6=\"\",\"\",'Tex-250-F'!$B$6)","v":"Tex-250-F"},{"$f":"IF('Tex-250-F'!$B$23=\"\",\"\",'Tex-250-F'!$B$23)","v":"Specimen ID:"},{"$f":"IF('Tex-250-F'!$B$22=\"\",\"\",'Tex-250-F'!$B$22)","v":"Specimen:"},{"$f":"IF('Tex-250-F'!$F$22=\"\",\"\",'Tex-250-F'!$F$22)","v":3}]
[8,{"$f":"IF('Tex-250-F'!$G$23=\"\",\"\",'Tex-250-F'!$G$23)","v":""},{"$f":"IF('Tex-250-F'!$B$6=\"\",\"\",'Tex-250-F'!$B$6)","v":"Tex-250-F"},{"$f":"IF('Tex-250-F'!$B$23=\"\",\"\",'Tex-250-F'!$B$23)","v":"Specimen ID:"},{"$f":"IF('Tex-250-F'!$B$22=\"\",\"\",'Tex-250-F'!$B$22)","v":"Specimen:"},{"$f":"IF('Tex-250-F'!$G$22=\"\",\"\",'Tex-250-F'!$G$22)","v":4}]
[9,{"$f":"IF('Tex-250-F'!$D$24=\"\",\"\",'Tex-250-F'!$D$24)","v":""},{"$f":"IF('Tex-250-F'!$B$6=\"\",\"\",'Tex-250-F'!$B$6)","v":"Tex-250-F"},{"$f":"IF('Tex-250-F'!$B$24=\"\",\"\",'Tex-250-F'!$B$24)","v":"Density, %:"},{"$f":"IF('Tex-250-F'!$B$22=\"\",\"\",'Tex-250-F'!$B$22)","v":"Specimen:"},{"$f":"IF('Tex-250-F'!$D$22=\"\",\"\",'Tex-250-F'!$D$22)","v":1}]
[10,{"$f":"IF('Tex-250-F'!$E$24=\"\",\"\",'Tex-250-F'!$E$24)","v":""},{"$f":"IF('Tex-250-F'!$B$6=\"\",\"\",'Tex-250-F'!$B$6)","v":"Tex-250-F"},{"$f":"IF('Tex-250-F'!$B$24=\"\",\"\",'Tex-250-F'!$B$24)","v":"Density, %:"},{"$f":"IF('Tex-250-F'!$B$22=\"\",\"\",'Tex-250-F'!$B$22)","v":"Specimen:"},{"$f":"IF('Tex-250-F'!$E$22=\"\",\"\",'Tex-250-F'!$E$22)","v":2}]
[11,{"$f":"IF('Tex-250-F'!$F$24=\"\",\"\",'Tex-250-F'!$F$24)","v":""},{"$f":"IF('Tex-250-F'!$B$6=\"\",\"\",'Tex-250-F'!$B$6)","v":"Tex-250-F"},{"$f":"IF('Tex-250-F'!$B$24=\"\",\"\",'Tex-250-F'!$B$24)","v":"Density, %:"},{"$f":"IF('Tex-250-F'!$B$22=\"\",\"\",'Tex-250-F'!$B$22)","v":"Specimen:"},{"$f":"IF('Tex-250-F'!$F$22=\"\",\"\",'Tex-250-F'!$F$22)","v":3}]
[12,{"$f":"IF('Tex-250-F'!$G$24=\"\",\"\",'Tex-250-F'!$G$24)","v":""},{"$f":"IF('Tex-250-F'!$B$6=\"\",\"\",'Tex-250-F'!$B$6)","v":"Tex-250-F"},{"$f":"IF('Tex-250-F'!$B$24=\"\",\"\",'Tex-250-F'!$B$24)","v":"Density, %:"},{"$f":"IF('Tex-250-F'!$B$22=\"\",\"\",'Tex-250-F'!$B$22)","v":"Specimen:"},{"$f":"IF('Tex-250-F'!$G$22=\"\",\"\",'Tex-250-F'!$G$22)","v":4}]
[13,{"$f":"IF('Tex-250-F'!$D$25=\"\",\"\",'Tex-250-F'!$D$25)","v":""},{"$f":"IF('Tex-250-F'!$B$6=\"\",\"\",'Tex-250-F'!$B$6)","v":"Tex-250-F"},{"$f":"IF('Tex-250-F'!$B$25=\"\",\"\",'Tex-250-F'!$B$25)","v":"Thickness (in):"},{"$f":"IF('Tex-250-F'!$B$22=\"\",\"\",'Tex-250-F'!$B$22)","v":"Specimen:"},{"$f":"IF('Tex-250-F'!$D$22=\"\",\"\",'Tex-250-F'!$D$22)","v":1}]
[14,{"$f":"IF('Tex-250-F'!$E$25=\"\",\"\",'Tex-250-F'!$E$25)","v":""},{"$f":"IF('Tex-250-F'!$B$6=\"\",\"\",'Tex-250-F'!$B$6)","v":"Tex-250-F"},{"$f":"IF('Tex-250-F'!$B$25=\"\",\"\",'Tex-250-F'!$B$25)","v":"Thickness (in):"},{"$f":"IF('Tex-250-F'!$B$22=\"\",\"\",'Tex-250-F'!$B$22)","v":"Specimen:"},{"$f":"IF('Tex-250-F'!$E$22=\"\",\"\",'Tex-250-F'!$E$22)","v":2}]
[15,{"$f":"IF('Tex-250-F'!$F$25=\"\",\"\",'Tex-250-F'!$F$25)","v":""},{"$f":"IF('Tex-250-F'!$B$6=\"\",\"\",'Tex-250-F'!$B$6)","v":"Tex-250-F"},{"$f":"IF('Tex-250-F'!$B$25=\"\",\"\",'Tex-250-F'!$B$25)","v":"Thickness (in):"},{"$f":"IF('Tex-250-F'!$B$22=\"\",\"\",'Tex-250-F'!$B$22)","v":"Specimen:"},{"$f":"IF('Tex-250-F'!$F$22=\"\",\"\",'Tex-250-F'!$F$22)","v":3}]
[16,{"$f":"IF('Tex-250-F'!$G$25=\"\",\"\",'Tex-250-F'!$G$25)","v":""},{"$f":"IF('Tex-250-F'!$B$6=\"\",\"\",'Tex-250-F'!$B$6)","v":"Tex-250-F"},{"$f":"IF('Tex-250-F'!$B$25=\"\",\"\",'Tex-250-F'!$B$25)","v":"Thickness (in):"},{"$f":"IF('Tex-250-F'!$B$22=\"\",\"\",'Tex-250-F'!$B$22)","v":"Specimen:"},{"$f":"IF('Tex-250-F'!$G$22=\"\",\"\",'Tex-250-F'!$G$22)","v":4}]
[17,{"$f":"IF('Tex-250-F'!$D$26=\"\",\"\",'Tex-250-F'!$D$26)","v":""},{"$f":"IF('Tex-250-F'!$B$6=\"\",\"\",'Tex-250-F'!$B$6)","v":"Tex-250-F"},{"$f":"IF('Tex-250-F'!$B$26=\"\",\"\",'Tex-250-F'!$B$26)","v":"Diameter (in):"},{"$f":"IF('Tex-250-F'!$B$22=\"\",\"\",'Tex-250-F'!$B$22)","v":"Specimen:"},{"$f":"IF('Tex-250-F'!$D$22=\"\",\"\",'Tex-250-F'!$D$22)","v":1}]
[18,{"$f":"IF('Tex-250-F'!$E$26=\"\",\"\",'Tex-250-F'!$E$26)","v":""},{"$f":"IF('Tex-250-F'!$B$6=\"\",\"\",'Tex-250-F'!$B$6)","v":"Tex-250-F"},{"$f":"IF('Tex-250-F'!$B$26=\"\",\"\",'Tex-250-F'!$B$26)","v":"Diameter (in):"},{"$f":"IF('Tex-250-F'!$B$22=\"\",\"\",'Tex-250-F'!$B$22)","v":"Specimen:"},{"$f":"IF('Tex-250-F'!$E$22=\"\",\"\",'Tex-250-F'!$E$22)","v":2}]
[19,{"$f":"IF('Tex-250-F'!$F$26=\"\",\"\",'Tex-250-F'!$F$26)","v":""},{"$f":"IF('Tex-250-F'!$B$6=\"\",\"\",'Tex-250-F'!$B$6)","v":"Tex-250-F"},{"$f":"IF('Tex-250-F'!$B$26=\"\",\"\",'Tex-250-F'!$B$26)","v":"Diameter (in):"},{"$f":"IF('Tex-250-F'!$B$22=\"\",\"\",'Tex-250-F'!$B$22)","v":"Specimen:"},{"$f":"IF('Tex-250-F'!$F$22=\"\",\"\",'Tex-250-F'!$F$22)","v":3}]
[20,{"$f":"IF('Tex-250-F'!$G$26=\"\",\"\",'Tex-250-F'!$G$26)","v":""},{"$f":"IF('Tex-250-F'!$B$6=\"\",\"\",'Tex-250-F'!$B$6)","v":"Tex-250-F"},{"$f":"IF('Tex-250-F'!$B$26=\"\",\"\",'Tex-250-F'!$B$26)","v":"Diameter (in):"},{"$f":"IF('Tex-250-F'!$B$22=\"\",\"\",'Tex-250-F'!$B$22)","v":"Specimen:"},{"$f":"IF('Tex-250-F'!$G$22=\"\",\"\",'Tex-250-F'!$G$22)","v":4}]
[21,{"$f":"IF('Tex-250-F'!$D$27=\"\",\"\",'Tex-250-F'!$D$27)","v":""},{"$f":"IF('Tex-250-F'!$B$6=\"\",\"\",'Tex-250-F'!$B$6)","v":"Tex-250-F"},{"$f":"IF('Tex-250-F'!$B$27=\"\",\"\",'Tex-250-F'!$B$27)","v":"Load (lb):"},{"$f":"IF('Tex-250-F'!$B$22=\"\",\"\",'Tex-250-F'!$B$22)","v":"Specimen:"},{"$f":"IF('Tex-250-F'!$D$22=\"\",\"\",'Tex-250-F'!$D$22)","v":1}]
[22,{"$f":"IF('Tex-250-F'!$E$27=\"\",\"\",'Tex-250-F'!$E$27)","v":""},{"$f":"IF('Tex-250-F'!$B$6=\"\",\"\",'Tex-250-F'!$B$6)","v":"Tex-250-F"},{"$f":"IF('Tex-250-F'!$B$27=\"\",\"\",'Tex-250-F'!$B$27)","v":"Load (lb):"},{"$f":"IF('Tex-250-F'!$B$22=\"\",\"\",'Tex-250-F'!$B$22)","v":"Specimen:"},{"$f":"IF('Tex-250-F'!$E$22=\"\",\"\",'Tex-250-F'!$E$22)","v":2}]
[23,{"$f":"IF('Tex-250-F'!$F$27=\"\",\"\",'Tex-250-F'!$F$27)","v":""},{"$f":"IF('Tex-250-F'!$B$6=\"\",\"\",'Tex-250-F'!$B$6)","v":"Tex-250-F"},{"$f":"IF('Tex-250-F'!$B$27=\"\",\"\",'Tex-250-F'!$B$27)","v":"Load (lb):"},{"$f":"IF('Tex-250-F'!$B$22=\"\",\"\",'Tex-250-F'!$B$22)","v":"Specimen:"},{"$f":"IF('Tex-250-F'!$F$22=\"\",\"\",'Tex-250-F'!$F$22)","v":3}]
[24,{"$f":"IF('Tex-250-F'!$G$27=\"\",\"\",'Tex-250-F'!$G$27)","v":""},{"$f":"IF('Tex-250-F'!$B$6=\"\",\"\",'Tex-250-F'!$B$6)","v":"Tex-250-F"},{"$f":"IF('Tex-250-F'!$B$27=\"\",\"\",'Tex-250-F'!$B$27)","v":"Load (lb):"},{"$f":"IF('Tex-250-F'!$B$22=\"\",\"\",'Tex-250-F'!$B$22)","v":"Specimen:"},{"$f":"IF('Tex-250-F'!$G$22=\"\",\"\",'Tex-250-F'!$G$22)","v":4}]
[25,{"$f":"IF('Tex-250-F'!$D$28=\"\",\"\",'Tex-250-F'!$D$28)","v":""},{"$f":"IF('Tex-250-F'!$B$6=\"\",\"\",'Tex-250-F'!$B$6)","v":"Tex-250-F"},{"$f":"IF('Tex-250-F'!$B$28=\"\",\"\",'Tex-250-F'!$B$28)","v":"Cracking Tolerance Index:"},{"$f":"IF('Tex-250-F'!$B$22=\"\",\"\",'Tex-250-F'!$B$22)","v":"Specimen:"},{"$f":"IF('Tex-250-F'!$D$22=\"\",\"\",'Tex-250-F'!$D$22)","v":1}]
[26,{"$f":"IF('Tex-250-F'!$E$28=\"\",\"\",'Tex-250-F'!$E$28)","v":""},{"$f":"IF('Tex-250-F'!$B$6=\"\",\"\",'Tex-250-F'!$B$6)","v":"Tex-250-F"},{"$f":"IF('Tex-250-F'!$B$28=\"\",\"\",'Tex-250-F'!$B$28)","v":"Cracking Tolerance Index:"},{"$f":"IF('Tex-250-F'!$B$22=\"\",\"\",'Tex-250-F'!$B$22)","v":"Specimen:"},{"$f":"IF('Tex-250-F'!$E$22=\"\",\"\",'Tex-250-F'!$E$22)","v":2}]
[27,{"$f":"IF('Tex-250-F'!$F$28=\"\",\"\",'Tex-250-F'!$F$28)","v":""},{"$f":"IF('Tex-250-F'!$B$6=\"\",\"\",'Tex-250-F'!$B$6)","v":"Tex-250-F"},{"$f":"IF('Tex-250-F'!$B$28=\"\",\"\",'Tex-250-F'!$B$28)","v":"Cracking Tolerance Index:"},{"$f":"IF('Tex-250-F'!$B$22=\"\",\"\",'Tex-250-F'!$B$22)","v":"Specimen:"},{"$f":"IF('Tex-250-F'!$F$22=\"\",\"\",'Tex-250-F'!$F$22)","v":3}]
[28,{"$f":"IF('Tex-250-F'!$G$28=\"\",\"\",'Tex-250-F'!$G$28)","v":""},{"$f":"IF('Tex-250-F'!$B$6=\"\",\"\",'Tex-250-F'!$B$6)","v":"Tex-250-F"},{"$f":"IF('Tex-250-F'!$B$28=\"\",\"\",'Tex-250-F'!$B$28)","v":"Cracking Tolerance Index:"},{"$f":"IF('Tex-250-F'!$B$22=\"\",\"\",'Tex-250-F'!$B$22)","v":"Specimen:"},{"$f":"IF('Tex-250-F'!$G$22=\"\",\"\",'Tex-250-F'!$G$22)","v":4}]
[29,{"$f":"IF('Tex-250-F'!$D$30=\"\",\"\",'Tex-250-F'!$D$30)","v":""},{"$f":"IF('Tex-250-F'!$B$6=\"\",\"\",'Tex-250-F'!$B$6)","v":"Tex-250-F"},{"$f":"IF('Tex-250-F'!$B$30=\"\",\"\",'Tex-250-F'!$B$30)","v":"Average Cracking Tolerance Index:"}]
[30,{"$f":"IF('Tex-250-F'!$D$29=\"\",\"\",'Tex-250-F'!$D$29)","v":""},{"$f":"IF('Tex-250-F'!$B$6=\"\",\"\",'Tex-250-F'!$B$6)","v":"Tex-250-F"},{"$f":"IF('Tex-250-F'!$B$29=\"\",\"\",'Tex-250-F'!$B$29)","v":"Strength (psi):"},{"$f":"IF('Tex-250-F'!$B$22=\"\",\"\",'Tex-250-F'!$B$22)","v":"Specimen:"},{"$f":"IF('Tex-250-F'!$D$22=\"\",\"\",'Tex-250-F'!$D$22)","v":1}]
[31,{"$f":"IF('Tex-250-F'!$E$29=\"\",\"\",'Tex-250-F'!$E$29)","v":""},{"$f":"IF('Tex-250-F'!$B$6=\"\",\"\",'Tex-250-F'!$B$6)","v":"Tex-250-F"},{"$f":"IF('Tex-250-F'!$B$29=\"\",\"\",'Tex-250-F'!$B$29)","v":"Strength (psi):"},{"$f":"IF('Tex-250-F'!$B$22=\"\",\"\",'Tex-250-F'!$B$22)","v":"Specimen:"},{"$f":"IF('Tex-250-F'!$E$22=\"\",\"\",'Tex-250-F'!$E$22)","v":2}]
[32,{"$f":"IF('Tex-250-F'!$F$29=\"\",\"\",'Tex-250-F'!$F$29)","v":""},{"$f":"IF('Tex-250-F'!$B$6=\"\",\"\",'Tex-250-F'!$B$6)","v":"Tex-250-F"},{"$f":"IF('Tex-250-F'!$B$29=\"\",\"\",'Tex-250-F'!$B$29)","v":"Strength (psi):"},{"$f":"IF('Tex-250-F'!$B$22=\"\",\"\",'Tex-250-F'!$B$22)","v":"Specimen:"},{"$f":"IF('Tex-250-F'!$F$22=\"\",\"\",'Tex-250-F'!$F$22)","v":3}]
[33,{"$f":"IF('Tex-250-F'!$G$29=\"\",\"\",'Tex-250-F'!$G$29)","v":""},{"$f":"IF('Tex-250-F'!$B$6=\"\",\"\",'Tex-250-F'!$B$6)","v":"Tex-250-F"},{"$f":"IF('Tex-250-F'!$B$29=\"\",\"\",'Tex-250-F'!$B$29)","v":"Strength (psi):"},{"$f":"IF('Tex-250-F'!$B$22=\"\",\"\",'Tex-250-F'!$B$22)","v":"Specimen:"},{"$f":"IF('Tex-250-F'!$G$22=\"\",\"\",'Tex-250-F'!$G$22)","v":4}]
[34,{"$f":"IF('Tex-250-F'!$D$31=\"\",\"\",'Tex-250-F'!$D$31)","v":""},{"$f":"IF('Tex-250-F'!$B$6=\"\",\"\",'Tex-250-F'!$B$6)","v":"Tex-250-F"},{"$f":"IF('Tex-250-F'!$B$31=\"\",\"\",'Tex-250-F'!$B$31)","v":"Average Strength, (psi):"}]
[35,{"$f":"IF('Tex-250-F'!$D$20=\"\",\"\",'Tex-250-F'!$D$20)","v":""},{"$f":"IF('Tex-250-F'!$B$6=\"\",\"\",'Tex-250-F'!$B$6)","v":"Tex-250-F"},{"$f":"IF('Tex-250-F'!$B$20=\"\",\"\",'Tex-250-F'!$B$20)","v":"TEST TYPE:"}]
[36,{"$f":"IF('Tex-250-F'!$H$20=\"\",\"\",'Tex-250-F'!$H$20)","v":""},{"$f":"IF('Tex-250-F'!$B$6=\"\",\"\",'Tex-250-F'!$B$6)","v":"Tex-250-F"},{"$f":"IF('Tex-250-F'!$F$20=\"\",\"\",'Tex-250-F'!$F$20)","v":"GYRATORY COMPACTOR:"}]

{"sheet":"Revisions","index":3,"n_rows":2,"n_cols":9,"rows_kept":2,"cut":false,"hidden":true,"merged":[[4,1,4,7],[0,1,0,7],[0,8,0,9],[1,1,1,7],[2,1,2,7],[3,1,3,7],[1,8,1,9],[2,8,2,9],[3,8,3,9],[4,8,4,9],[5,8,5,9],[6,8,6,9],[7,8,7,9],[8,8,8,9],[9,8,9,9],[5,1,5,7],[6,1,6,7],[7,1,7,7],[8,1,8,7],[9,1,9,7]]}
["Date","Description",null,null,null,null,null,null,"Performed by"]
["2024-08-02","Added 2024 spec items",null,null,null,null,null,null,"Syeda Rahman"]