{"text_format":"1","workbook":"xlsx","n_sheets":4,"sheets":["Tex-280-F","RX","Revisions","GRADATIONS"],"not_rendered":{"charts":0,"images":1,"macros":1,"external_links":0,"defined_names":119,"comments":1,"pivot_tables":0},"unopened":[],"bounds":{"document_bytes":16777216,"sheet_cells":100000,"rows_first":2000,"rows_last":500,"rows_between":2000,"halvings":0,"cell_chars":16384,"cell_head_chars":4096},"cells_cut":0,"cells_raw":0,"read":"whole","date_system":"1900"}

{"sheet":"Tex-280-F","index":0,"n_rows":69,"n_cols":11,"rows_kept":69,"cut":false,"hidden":false,"merged":[[69,1,69,3],[22,2,23,2],[15,3,15,8],[12,3,12,4],[13,3,13,4],[13,7,13,8],[65,1,65,3],[65,6,65,8],[16,3,16,4],[57,1,57,8],[32,1,32,8],[33,2,33,5],[62,2,62,4],[63,2,63,4],[33,1,34,1],[55,1,56,8],[22,6,23,6],[22,4,23,4],[33,6,33,8],[44,6,44,8],[8,3,8,4],[8,7,8,8],[22,5,23,5],[11,7,11,8],[9,7,9,8],[10,7,10,8],[9,3,9,4],[14,3,14,8],[22,7,23,7],[16,7,16,8],[12,7,12,8],[43,1,43,8],[0,0,0,1],[7,3,7,4],[11,3,11,4],[10,3,10,4],[7,7,7,8],[60,2,60,4],[61,2,61,4],[44,1,45,1],[44,2,44,5],[41,3,41,4],[58,1,58,8],[52,3,52,4]]}
["TxDOT Manuals >"]
[null,"TEXAS DEPARTMENT OF TRANSPORTATION",null,null,null,null,null,null,null,null,58]
[null,null,null,null,null,null,null,null,null,null,2]
[null,null,null,null,null,null,null,null,null,null,"tx280.xlsm::45574.656262"]
[null,"FLAT, ELONGATED, OR FLAT & ELONGATED PARTICLES IN COARSE AGGREGATE"]
[null,"Tex-280-F"]
[null,null,null,null,null,null,null,null,{"$f":"\"File Version: \" & TEXT(MID(sn,SEARCH(\"::\",sn,1)+2,20),\"mm/dd/yy hh:mm:ss\")","v":"File Version: 10/09/24 15:45:01"}]
[null,null,"SAMPLE ID:",null,null,null,"SAMPLED DATE:"]
[null,null,"TEST NUMBER:",null,null,null,"LETTING DATE:"]
[null,null,"SAMPLE STATUS:",null,null,null,"CONTROLLING CSJ:"]
[null,null,"COUNTY:",null,null,null,"SPEC YEAR:"]
[null,null,"SAMPLED BY:",null,null,null,"SPEC ITEM:"]
[null,null,"SAMPLE LOCATION:",null,null,null,"SPECIAL PROVISION:"]
[null,null,"MATERIAL CODE:",null,null,null,"GRADE:"]
[null,null,"MATERIAL NAME:"]
[null,null,"PRODUCER:"]
[null,null,"AREA ENGINEER:",null,null,null,"PROJECT MANAGER:"]
[]
[null,null,"COURSE\\LIFT:",null,"STATION:",null,null,"DIST. FROM CL:"]
[]
[null,null,"Particle Size Analysis - Tex-110-E"]
[]
[null,null,"Sieve Size",null,{"$f":"IF(D23=\"Cumulative\",\"Individual\",\"Cumulative\") & \" Weight Retained\"","v":"Cumulative Weight Retained"},"Individual Percent Retained","New Total Percentage with 10% or Greater","Adjusted Percentage =100%"]
[null,null,null,{"$f":"IF(Field7=\"\",\"Individual\",Field7) & \" Weight Retained, (g):\"","v":"Individual Weight Retained, (g):"}]
[null,null,{"$f":"IF(INDEX(INDIRECT(\"grade1\"),1,IF(SpecYear=\"1995\",4,3))=0,\"\",INDEX(INDIRECT(\"grade1\"),1,IF(SpecYear=\"1995\",4,3)))","v":"7/8\""},null,{"$f":"IF($D25=\"\",0,$D25)","v":0},{"$f":"IF($D25=\"\",0,IF(RetainedMethod=\"Cumulative\",E25/Total*100,D25/Total*100))","v":0},{"$f":"IF(F25>=10,F25,0)","v":0},{"$f":"IF(G25>=10,(G25/NewTotal)*100,0)","v":0}]
[null,null,{"$f":"IF(INDEX(INDIRECT(\"grade1\"),2,IF(SpecYear=\"1995\",4,3))=0,\"\",INDEX(INDIRECT(\"grade1\"),2,IF(SpecYear=\"1995\",4,3)))","v":"5/8\""},null,{"$f":"IF(D26=\"\",0,IF(RetainedMethod=\"Cumulative\",($D26-$D25),SUM($D$25:$D26)))","v":0},{"$f":"IF($D26=\"\",0,IF(RetainedMethod=\"Cumulative\",E26/Total*100,D26/Total*100))","v":0},{"$f":"IF(F26>=10,F26,0)","v":0},{"$f":"IF(G26>=10,(G26/NewTotal)*100,0)","v":0}]
[null,null,{"$f":"IF(INDEX(INDIRECT(\"grade1\"),3,IF(SpecYear=\"1995\",4,3))=0,\"\",INDEX(INDIRECT(\"grade1\"),3,IF(SpecYear=\"1995\",4,3)))","v":"1/2\""},null,{"$f":"IF(D27=\"\",0,IF(RetainedMethod=\"Cumulative\",($D27-$D26),SUM($D$25:$D27)))","v":0},{"$f":"IF($D27=\"\",0,IF(RetainedMethod=\"Cumulative\",E27/Total*100,D27/Total*100))","v":0},{"$f":"IF(F27>=10,F27,0)","v":0},{"$f":"IF(G27>=10,(G27/NewTotal)*100,0)","v":0}]
[null,null,{"$f":"IF(INDEX(INDIRECT(\"grade1\"),4,IF(SpecYear=\"1995\",4,3))=0,\"\",INDEX(INDIRECT(\"grade1\"),4,IF(SpecYear=\"1995\",4,3)))","v":"3/8\""},null,{"$f":"IF(D28=\"\",0,IF(RetainedMethod=\"Cumulative\",($D28-$D27),SUM($D$25:$D28)))","v":0},{"$f":"IF($D28=\"\",0,IF(RetainedMethod=\"Cumulative\",E28/Total*100,D28/Total*100))","v":0},{"$f":"IF(F28>=10,F28,0)","v":0},{"$f":"IF(G28>=10,(G28/NewTotal)*100,0)","v":0}]
[null,null,{"$f":"IF(INDEX(INDIRECT(\"grade1\"),5,IF(SpecYear=\"1995\",4,3))=0,\"\",INDEX(INDIRECT(\"grade1\"),5,IF(SpecYear=\"1995\",4,3)))","v":"No. 4"},null,{"$f":"IF(D29=\"\",0,IF(RetainedMethod=\"Cumulative\",($D29-$D28),SUM($D$25:$D29)))","v":0},{"$f":"IF($D29=\"\",0,IF(RetainedMethod=\"Cumulative\",E29/Total*100,D29/Total*100))","v":0},{"$f":"IF(F29>=10,F29,0)","v":0},{"$f":"IF(G29>=10,(G29/NewTotal)*100,0)","v":0}]
[null,null,{"$f":"IF(RetainedMethod=\"cumulative\",\"Total:\",\"-\" & OFFSET(C30,-(COUNTBLANK(SieveSize)+1),0))","v":"-No. 4"}]
[null,null,"Total, (g):",{"$f":"IF(ISERROR(IF(RetainedMethod=\"Cumulative\",Pan,SUM(D25:D30))),\"\",IF(RetainedMethod=\"Cumulative\",Pan,SUM(D25:D30)))","v":0},null,"Total, (%):",{"$f":"SUM(G25:G29)","v":0}]
[]
[null,"3 to 1 RATIO"]
[null,"Sieve Size","ELONGATED / FLAT or BOTH",null,null,null,"NEITHER (passing)"]
[null,null,"count","(g)","(%)","Adjusted (%)","count","(g)","(%)"]
[null,{"$f":"IF(INDEX(INDIRECT(\"grade1\"),1,IF(SpecYear=\"1995\",4,3))=0,\"\",INDEX(INDIRECT(\"grade1\"),1,IF(SpecYear=\"1995\",4,3)))","v":"7/8\""},null,null,{"$f":"IF(SpecYear>=\"2004\",IF(ISERROR(C36/(+C36+G36)*100),0,C36/(+C36+G36)*100),IF(ISERROR(D36/(+D36+H36)*100),0,D36/(+D36+H36)*100))","v":0},{"$f":"IF(ISERROR(H25*E36/100),\"\",H25*E36/100)","v":0},null,null,{"$f":"IF(SpecYear>=\"2004\",IF(ISERROR(G36/(G36+C36)*100),0,G36/(G36+C36)*100),IF(ISERROR(H36/(H36+D36)*100),0,H36/(H36+D36)*100))","v":0}]
[null,{"$f":"IF(INDEX(INDIRECT(\"grade1\"),2,IF(SpecYear=\"1995\",4,3))=0,\"\",INDEX(INDIRECT(\"grade1\"),2,IF(SpecYear=\"1995\",4,3)))","v":"5/8\""},null,null,{"$f":"IF(SpecYear>=\"2004\",IF(ISERROR(C37/(+C37+G37)*100),0,C37/(+C37+G37)*100),IF(ISERROR(D37/(+D37+H37)*100),0,D37/(+D37+H37)*100))","v":0},{"$f":"IF(ISERROR(H26*E37/100),\"\",H26*E37/100)","v":0},null,null,{"$f":"IF(SpecYear>=\"2004\",IF(ISERROR(G37/(G37+C37)*100),0,G37/(G37+C37)*100),IF(ISERROR(H37/(H37+D37)*100),0,H37/(H37+D37)*100))","v":0}]
[null,{"$f":"IF(INDEX(INDIRECT(\"grade1\"),3,IF(SpecYear=\"1995\",4,3))=0,\"\",INDEX(INDIRECT(\"grade1\"),3,IF(SpecYear=\"1995\",4,3)))","v":"1/2\""},null,null,{"$f":"IF(SpecYear>=\"2004\",IF(ISERROR(C38/(+C38+G38)*100),0,C38/(+C38+G38)*100),IF(ISERROR(D38/(+D38+H38)*100),0,D38/(+D38+H38)*100))","v":0},{"$f":"IF(ISERROR(H27*E38/100),\"\",H27*E38/100)","v":0},null,null,{"$f":"IF(SpecYear>=\"2004\",IF(ISERROR(G38/(G38+C38)*100),0,G38/(G38+C38)*100),IF(ISERROR(H38/(H38+D38)*100),0,H38/(H38+D38)*100))","v":0}]
[null,{"$f":"IF(INDEX(INDIRECT(\"grade1\"),4,IF(SpecYear=\"1995\",4,3))=0,\"\",INDEX(INDIRECT(\"grade1\"),4,IF(SpecYear=\"1995\",4,3)))","v":"3/8\""},null,null,{"$f":"IF(SpecYear>=\"2004\",IF(ISERROR(C39/(+C39+G39)*100),0,C39/(+C39+G39)*100),IF(ISERROR(D39/(+D39+H39)*100),0,D39/(+D39+H39)*100))","v":0},{"$f":"IF(ISERROR(H28*E39/100),\"\",H28*E39/100)","v":0},null,null,{"$f":"IF(SpecYear>=\"2004\",IF(ISERROR(G39/(G39+C39)*100),0,G39/(G39+C39)*100),IF(ISERROR(H39/(H39+D39)*100),0,H39/(H39+D39)*100))","v":0}]
[null,{"$f":"IF(INDEX(INDIRECT(\"grade1\"),5,IF(SpecYear=\"1995\",4,3))=0,\"\",INDEX(INDIRECT(\"grade1\"),5,IF(SpecYear=\"1995\",4,3)))","v":"No. 4"},null,null,{"$f":"IF(SpecYear>=\"2004\",IF(ISERROR(C40/(+C40+G40)*100),0,C40/(+C40+G40)*100),IF(ISERROR(D40/(+D40+H40)*100),0,D40/(+D40+H40)*100))","v":0},{"$f":"IF(ISERROR(H29*E40/100),\"\",H29*E40/100)","v":0},null,null,{"$f":"IF(SpecYear>=\"2004\",IF(ISERROR(G40/(G40+C40)*100),0,G40/(G40+C40)*100),IF(ISERROR(H40/(H40+D40)*100),0,H40/(H40+D40)*100))","v":0}]
[]
[null,null,null,"Adjusted Total Failing, %",null,{"$f":"SUM(F36:F40)","v":0},"Clear green cells with text highlighted in red."]
[]
[null,"5 to 1 RATIO"]
[null,"Sieve Size","ELONGATED / FLAT or BOTH",null,null,null,"NEITHER (passing)"]
[null,null,"count","(g)","(%)","Adjusted (%)","count","(g)","(%)"]
[null,{"$f":"IF(INDEX(INDIRECT(\"grade1\"),1,IF(SpecYear=\"1995\",4,3))=0,\"\",INDEX(INDIRECT(\"grade1\"),1,IF(SpecYear=\"1995\",4,3)))","v":"7/8\""},null,null,{"$f":"IF(SpecYear>=\"2004\",IF(ISERROR(C47/(+C47+G47)*100),0,C47/(+C47+G47)*100),IF(ISERROR(D47/(+D47+H47)*100),0,D47/(+D47+H47)*100))","v":0},{"$f":"IF(ISERROR(H25*E47/100),\"\",H25*E47/100)","v":0},null,null,{"$f":"IF(SpecYear>=\"2004\",IF(ISERROR(G47/(G47+C47)*100),0,G47/(G47+C47)*100),IF(ISERROR(H47/(H47+D47)*100),0,H47/(H47+D47)*100))","v":0}]
[null,{"$f":"IF(INDEX(INDIRECT(\"grade1\"),2,IF(SpecYear=\"1995\",4,3))=0,\"\",INDEX(INDIRECT(\"grade1\"),2,IF(SpecYear=\"1995\",4,3)))","v":"5/8\""},null,null,{"$f":"IF(SpecYear>=\"2004\",IF(ISERROR(C48/(+C48+G48)*100),0,C48/(+C48+G48)*100),IF(ISERROR(D48/(+D48+H48)*100),0,D48/(+D48+H48)*100))","v":0},{"$f":"IF(ISERROR(H26*E48/100),\"\",H26*E48/100)","v":0},null,null,{"$f":"IF(SpecYear>=\"2004\",IF(ISERROR(G48/(G48+C48)*100),0,G48/(G48+C48)*100),IF(ISERROR(H48/(H48+D48)*100),0,H48/(H48+D48)*100))","v":0}]
[null,{"$f":"IF(INDEX(INDIRECT(\"grade1\"),3,IF(SpecYear=\"1995\",4,3))=0,\"\",INDEX(INDIRECT(\"grade1\"),3,IF(SpecYear=\"1995\",4,3)))","v":"1/2\""},null,null,{"$f":"IF(SpecYear>=\"2004\",IF(ISERROR(C49/(+C49+G49)*100),0,C49/(+C49+G49)*100),IF(ISERROR(D49/(+D49+H49)*100),0,D49/(+D49+H49)*100))","v":0},{"$f":"IF(ISERROR(H27*E49/100),\"\",H27*E49/100)","v":0},null,null,{"$f":"IF(SpecYear>=\"2004\",IF(ISERROR(G49/(G49+C49)*100),0,G49/(G49+C49)*100),IF(ISERROR(H49/(H49+D49)*100),0,H49/(H49+D49)*100))","v":0}]
[null,{"$f":"IF(INDEX(INDIRECT(\"grade1\"),4,IF(SpecYear=\"1995\",4,3))=0,\"\",INDEX(INDIRECT(\"grade1\"),4,IF(SpecYear=\"1995\",4,3)))","v":"3/8\""},null,null,{"$f":"IF(SpecYear>=\"2004\",IF(ISERROR(C50/(+C50+G50)*100),0,C50/(+C50+G50)*100),IF(ISERROR(D50/(+D50+H50)*100),0,D50/(+D50+H50)*100))","v":0},{"$f":"IF(ISERROR(H28*E50/100),\"\",H28*E50/100)","v":0},null,null,{"$f":"IF(SpecYear>=\"2004\",IF(ISERROR(G50/(G50+C50)*100),0,G50/(G50+C50)*100),IF(ISERROR(H50/(H50+D50)*100),0,H50/(H50+D50)*100))","v":0}]
[null,{"$f":"IF(INDEX(INDIRECT(\"grade1\"),5,IF(SpecYear=\"1995\",4,3))=0,\"\",INDEX(INDIRECT(\"grade1\"),5,IF(SpecYear=\"1995\",4,3)))","v":"No. 4"},null,null,{"$f":"IF(SpecYear>=\"2004\",IF(ISERROR(C51/(+C51+G51)*100),0,C51/(+C51+G51)*100),IF(ISERROR(D51/(+D51+H51)*100),0,D51/(+D51+H51)*100))","v":0},{"$f":"IF(ISERROR(H29*E51/100),\"\",H29*E51/100)","v":0},null,null,{"$f":"IF(SpecYear>=\"2004\",IF(ISERROR(G51/(G51+C51)*100),0,G51/(G51+C51)*100),IF(ISERROR(H51/(H51+D51)*100),0,H51/(H51+D51)*100))","v":0}]
[]
[null,null,null,"Adjusted Total Failing, %",null,{"$f":"SUM(F47:F51)","v":0},"Clear green cells with text highlighted in red."]
[]
[null,"Remarks:",{"$f":"NOW()","v":"2024-10-09T15:45:01.650"}]
[]
[]
[]
[]
[]
[null,"Sample Method:","Sampled By:",null,null,"Sampled Date:"]
[null,"TX221"]
[null,"Test Method:","Tested By:",null,null,"Tested Date:"]
[null,"TX280"]
[null,"Test Stamp Code:",null,null,"Omit Test:","Completed Date:","Reviewed By:"]
[]
[null,"Locked By:","TxDOT:","District:","Area:"]
[]
[null,"Authorized By:",null,null,"Authorized Date:"]

{"sheet":"RX","index":1,"n_rows":108,"n_cols":9,"rows_kept":108,"cut":false,"hidden":true,"merged":[]}
[106]
["Fld_nbr","Value","Desc_1","Desc_2","Desc_3","Desc_4","Desc_5","Desc_6","Desc_7"]
[1,{"$f":"IF('Tex-280-F'!$B$56=\"\",\"\",'Tex-280-F'!$B$56)","v":""},{"$f":"'Tex-280-F'!$B$55","v":"Remarks:"}]
[2,{"$f":"IF('Tex-280-F'!$D$19=\"\",\"\",'Tex-280-F'!$D$19)","v":""},{"$f":"IF('Tex-280-F'!$C$19=\"\",\"\",'Tex-280-F'!$C$19)","v":"COURSE\\LIFT:"}]
[3,{"$f":"IF('Tex-280-F'!$C$64=\"\",\"\",'Tex-280-F'!$C$64)","v":""},"Tested By ",{"$f":"IF('Tex-280-F'!$B$64=\"\",\"\",'Tex-280-F'!$B$64)","v":"TX280"}]
[4,{"$f":"IF('Tex-280-F'!$F$64=\"\",\"\",'Tex-280-F'!$F$64)","v":""},"Tested Date ",{"$f":"IF('Tex-280-F'!$B$64=\"\",\"\",'Tex-280-F'!$B$64)","v":"TX280"}]
[5,{"$f":"IF('Tex-280-F'!$D$25=\"\",\"\",'Tex-280-F'!$D$25)","v":""},{"$f":"IF('Tex-280-F'!$C$21=\"\",\"\",'Tex-280-F'!$C$21)","v":"Particle Size Analysis - Tex-110-E"},{"$f":"IF('Tex-280-F'!$C$23=\"\",\"\",'Tex-280-F'!$C$23)","v":"Sieve Size"},{"$f":"IF('Tex-280-F'!$C$25=\"\",\"\",'Tex-280-F'!$C$25)","v":"7/8\""},{"$f":"IF('Tex-280-F'!$D$24=\"\",\"\",'Tex-280-F'!$D$24)","v":"Individual Weight Retained, (g):"}]
[6,{"$f":"IF('Tex-280-F'!$E$25=\"\",\"\",'Tex-280-F'!$E$25)","v":0},{"$f":"IF('Tex-280-F'!$C$21=\"\",\"\",'Tex-280-F'!$C$21)","v":"Particle Size Analysis - Tex-110-E"},{"$f":"IF('Tex-280-F'!$C$23=\"\",\"\",'Tex-280-F'!$C$23)","v":"Sieve Size"},{"$f":"IF('Tex-280-F'!$C$25=\"\",\"\",'Tex-280-F'!$C$25)","v":"7/8\""},{"$f":"IF('Tex-280-F'!$E$23=\"\",\"\",'Tex-280-F'!$E$23)","v":"Cumulative Weight Retained"}]
[7,{"$f":"IF('Tex-280-F'!$F$25=\"\",\"\",'Tex-280-F'!$F$25)","v":0},{"$f":"IF('Tex-280-F'!$C$21=\"\",\"\",'Tex-280-F'!$C$21)","v":"Particle Size Analysis - Tex-110-E"},{"$f":"IF('Tex-280-F'!$C$23=\"\",\"\",'Tex-280-F'!$C$23)","v":"Sieve Size"},{"$f":"IF('Tex-280-F'!$C$25=\"\",\"\",'Tex-280-F'!$C$25)","v":"7/8\""},{"$f":"IF('Tex-280-F'!$F$23=\"\",\"\",'Tex-280-F'!$F$23)","v":"Individual Percent Retained"}]
[8,{"$f":"IF('Tex-280-F'!$G$25=\"\",\"\",'Tex-280-F'!$G$25)","v":0},{"$f":"IF('Tex-280-F'!$C$21=\"\",\"\",'Tex-280-F'!$C$21)","v":"Particle Size Analysis - Tex-110-E"},{"$f":"IF('Tex-280-F'!$C$23=\"\",\"\",'Tex-280-F'!$C$23)","v":"Sieve Size"},{"$f":"IF('Tex-280-F'!$C$25=\"\",\"\",'Tex-280-F'!$C$25)","v":"7/8\""},{"$f":"IF('Tex-280-F'!$G$23=\"\",\"\",'Tex-280-F'!$G$23)","v":"New Total Percentage with 10% or Greater"}]
[9,{"$f":"IF('Tex-280-F'!$H$25=\"\",\"\",'Tex-280-F'!$H$25)","v":0},{"$f":"IF('Tex-280-F'!$C$21=\"\",\"\",'Tex-280-F'!$C$21)","v":"Particle Size Analysis - Tex-110-E"},{"$f":"IF('Tex-280-F'!$C$23=\"\",\"\",'Tex-280-F'!$C$23)","v":"Sieve Size"},{"$f":"IF('Tex-280-F'!$C$25=\"\",\"\",'Tex-280-F'!$C$25)","v":"7/8\""},{"$f":"IF('Tex-280-F'!$H$23=\"\",\"\",'Tex-280-F'!$H$23)","v":"Adjusted Percentage =100%"}]
[10,{"$f":"IF('Tex-280-F'!$D$26=\"\",\"\",'Tex-280-F'!$D$26)","v":""},{"$f":"IF('Tex-280-F'!$C$21=\"\",\"\",'Tex-280-F'!$C$21)","v":"Particle Size Analysis - Tex-110-E"},{"$f":"IF('Tex-280-F'!$C$23=\"\",\"\",'Tex-280-F'!$C$23)","v":"Sieve Size"},{"$f":"IF('Tex-280-F'!$C$26=\"\",\"\",'Tex-280-F'!$C$26)","v":"5/8\""},{"$f":"IF('Tex-280-F'!$D$24=\"\",\"\",'Tex-280-F'!$D$24)","v":"Individual Weight Retained, (g):"}]
[11,{"$f":"IF('Tex-280-F'!$E$26=\"\",\"\",'Tex-280-F'!$E$26)","v":0},{"$f":"IF('Tex-280-F'!$C$21=\"\",\"\",'Tex-280-F'!$C$21)","v":"Particle Size Analysis - Tex-110-E"},{"$f":"IF('Tex-280-F'!$C$23=\"\",\"\",'Tex-280-F'!$C$23)","v":"Sieve Size"},{"$f":"IF('Tex-280-F'!$C$26=\"\",\"\",'Tex-280-F'!$C$26)","v":"5/8\""},{"$f":"IF('Tex-280-F'!$E$23=\"\",\"\",'Tex-280-F'!$E$23)","v":"Cumulative Weight Retained"}]
[12,{"$f":"IF('Tex-280-F'!$F$26=\"\",\"\",'Tex-280-F'!$F$26)","v":0},{"$f":"IF('Tex-280-F'!$C$21=\"\",\"\",'Tex-280-F'!$C$21)","v":"Particle Size Analysis - Tex-110-E"},{"$f":"IF('Tex-280-F'!$C$23=\"\",\"\",'Tex-280-F'!$C$23)","v":"Sieve Size"},{"$f":"IF('Tex-280-F'!$C$26=\"\",\"\",'Tex-280-F'!$C$26)","v":"5/8\""},{"$f":"IF('Tex-280-F'!$F$23=\"\",\"\",'Tex-280-F'!$F$23)","v":"Individual Percent Retained"}]
[13,{"$f":"IF('Tex-280-F'!$G$26=\"\",\"\",'Tex-280-F'!$G$26)","v":0},{"$f":"IF('Tex-280-F'!$C$21=\"\",\"\",'Tex-280-F'!$C$21)","v":"Particle Size Analysis - Tex-110-E"},{"$f":"IF('Tex-280-F'!$C$23=\"\",\"\",'Tex-280-F'!$C$23)","v":"Sieve Size"},{"$f":"IF('Tex-280-F'!$C$26=\"\",\"\",'Tex-280-F'!$C$26)","v":"5/8\""},{"$f":"IF('Tex-280-F'!$G$23=\"\",\"\",'Tex-280-F'!$G$23)","v":"New Total Percentage with 10% or Greater"}]
[14,{"$f":"IF('Tex-280-F'!$H$26=\"\",\"\",'Tex-280-F'!$H$26)","v":0},{"$f":"IF('Tex-280-F'!$C$21=\"\",\"\",'Tex-280-F'!$C$21)","v":"Particle Size Analysis - Tex-110-E"},{"$f":"IF('Tex-280-F'!$C$23=\"\",\"\",'Tex-280-F'!$C$23)","v":"Sieve Size"},{"$f":"IF('Tex-280-F'!$C$26=\"\",\"\",'Tex-280-F'!$C$26)","v":"5/8\""},{"$f":"IF('Tex-280-F'!$H$23=\"\",\"\",'Tex-280-F'!$H$23)","v":"Adjusted Percentage =100%"}]
[15,{"$f":"IF('Tex-280-F'!$D$27=\"\",\"\",'Tex-280-F'!$D$27)","v":""},{"$f":"IF('Tex-280-F'!$C$21=\"\",\"\",'Tex-280-F'!$C$21)","v":"Particle Size Analysis - Tex-110-E"},{"$f":"IF('Tex-280-F'!$C$23=\"\",\"\",'Tex-280-F'!$C$23)","v":"Sieve Size"},{"$f":"IF('Tex-280-F'!$C$27=\"\",\"\",'Tex-280-F'!$C$27)","v":"1/2\""},{"$f":"IF('Tex-280-F'!$D$24=\"\",\"\",'Tex-280-F'!$D$24)","v":"Individual Weight Retained, (g):"}]
[16,{"$f":"IF('Tex-280-F'!$E$27=\"\",\"\",'Tex-280-F'!$E$27)","v":0},{"$f":"IF('Tex-280-F'!$C$21=\"\",\"\",'Tex-280-F'!$C$21)","v":"Particle Size Analysis - Tex-110-E"},{"$f":"IF('Tex-280-F'!$C$23=\"\",\"\",'Tex-280-F'!$C$23)","v":"Sieve Size"},{"$f":"IF('Tex-280-F'!$C$27=\"\",\"\",'Tex-280-F'!$C$27)","v":"1/2\""},{"$f":"IF('Tex-280-F'!$E$23=\"\",\"\",'Tex-280-F'!$E$23)","v":"Cumulative Weight Retained"}]
[17,{"$f":"IF('Tex-280-F'!$F$27=\"\",\"\",'Tex-280-F'!$F$27)","v":0},{"$f":"IF('Tex-280-F'!$C$21=\"\",\"\",'Tex-280-F'!$C$21)","v":"Particle Size Analysis - Tex-110-E"},{"$f":"IF('Tex-280-F'!$C$23=\"\",\"\",'Tex-280-F'!$C$23)","v":"Sieve Size"},{"$f":"IF('Tex-280-F'!$C$27=\"\",\"\",'Tex-280-F'!$C$27)","v":"1/2\""},{"$f":"IF('Tex-280-F'!$F$23=\"\",\"\",'Tex-280-F'!$F$23)","v":"Individual Percent Retained"}]
[18,{"$f":"IF('Tex-280-F'!$G$27=\"\",\"\",'Tex-280-F'!$G$27)","v":0},{"$f":"IF('Tex-280-F'!$C$21=\"\",\"\",'Tex-280-F'!$C$21)","v":"Particle Size Analysis - Tex-110-E"},{"$f":"IF('Tex-280-F'!$C$23=\"\",\"\",'Tex-280-F'!$C$23)","v":"Sieve Size"},{"$f":"IF('Tex-280-F'!$C$27=\"\",\"\",'Tex-280-F'!$C$27)","v":"1/2\""},{"$f":"IF('Tex-280-F'!$G$23=\"\",\"\",'Tex-280-F'!$G$23)","v":"New Total Percentage with 10% or Greater"}]
[19,{"$f":"IF('Tex-280-F'!$H$27=\"\",\"\",'Tex-280-F'!$H$27)","v":0},{"$f":"IF('Tex-280-F'!$C$21=\"\",\"\",'Tex-280-F'!$C$21)","v":"Particle Size Analysis - Tex-110-E"},{"$f":"IF('Tex-280-F'!$C$23=\"\",\"\",'Tex-280-F'!$C$23)","v":"Sieve Size"},{"$f":"IF('Tex-280-F'!$C$27=\"\",\"\",'Tex-280-F'!$C$27)","v":"1/2\""},{"$f":"IF('Tex-280-F'!$H$23=\"\",\"\",'Tex-280-F'!$H$23)","v":"Adjusted Percentage =100%"}]
[20,{"$f":"IF('Tex-280-F'!$D$28=\"\",\"\",'Tex-280-F'!$D$28)","v":""},{"$f":"IF('Tex-280-F'!$C$21=\"\",\"\",'Tex-280-F'!$C$21)","v":"Particle Size Analysis - Tex-110-E"},{"$f":"IF('Tex-280-F'!$C$23=\"\",\"\",'Tex-280-F'!$C$23)","v":"Sieve Size"},{"$f":"IF('Tex-280-F'!$C$28=\"\",\"\",'Tex-280-F'!$C$28)","v":"3/8\""},{"$f":"IF('Tex-280-F'!$D$24=\"\",\"\",'Tex-280-F'!$D$24)","v":"Individual Weight Retained, (g):"}]
[21,{"$f":"IF('Tex-280-F'!$E$28=\"\",\"\",'Tex-280-F'!$E$28)","v":0},{"$f":"IF('Tex-280-F'!$C$21=\"\",\"\",'Tex-280-F'!$C$21)","v":"Particle Size Analysis - Tex-110-E"},{"$f":"IF('Tex-280-F'!$C$23=\"\",\"\",'Tex-280-F'!$C$23)","v":"Sieve Size"},{"$f":"IF('Tex-280-F'!$C$28=\"\",\"\",'Tex-280-F'!$C$28)","v":"3/8\""},{"$f":"IF('Tex-280-F'!$E$23=\"\",\"\",'Tex-280-F'!$E$23)","v":"Cumulative Weight Retained"}]
[22,{"$f":"IF('Tex-280-F'!$F$28=\"\",\"\",'Tex-280-F'!$F$28)","v":0},{"$f":"IF('Tex-280-F'!$C$21=\"\",\"\",'Tex-280-F'!$C$21)","v":"Particle Size Analysis - Tex-110-E"},{"$f":"IF('Tex-280-F'!$C$23=\"\",\"\",'Tex-280-F'!$C$23)","v":"Sieve Size"},{"$f":"IF('Tex-280-F'!$C$28=\"\",\"\",'Tex-280-F'!$C$28)","v":"3/8\""},{"$f":"IF('Tex-280-F'!$F$23=\"\",\"\",'Tex-280-F'!$F$23)","v":"Individual Percent Retained"}]
[23,{"$f":"IF('Tex-280-F'!$G$28=\"\",\"\",'Tex-280-F'!$G$28)","v":0},{"$f":"IF('Tex-280-F'!$C$21=\"\",\"\",'Tex-280-F'!$C$21)","v":"Particle Size Analysis - Tex-110-E"},{"$f":"IF('Tex-280-F'!$C$23=\"\",\"\",'Tex-280-F'!$C$23)","v":"Sieve Size"},{"$f":"IF('Tex-280-F'!$C$28=\"\",\"\",'Tex-280-F'!$C$28)","v":"3/8\""},{"$f":"IF('Tex-280-F'!$G$23=\"\",\"\",'Tex-280-F'!$G$23)","v":"New Total Percentage with 10% or Greater"}]
[24,{"$f":"IF('Tex-280-F'!$H$28=\"\",\"\",'Tex-280-F'!$H$28)","v":0},{"$f":"IF('Tex-280-F'!$C$21=\"\",\"\",'Tex-280-F'!$C$21)","v":"Particle Size Analysis - Tex-110-E"},{"$f":"IF('Tex-280-F'!$C$23=\"\",\"\",'Tex-280-F'!$C$23)","v":"Sieve Size"},{"$f":"IF('Tex-280-F'!$C$28=\"\",\"\",'Tex-280-F'!$C$28)","v":"3/8\""},{"$f":"IF('Tex-280-F'!$H$23=\"\",\"\",'Tex-280-F'!$H$23)","v":"Adjusted Percentage =100%"}]
[25,{"$f":"IF('Tex-280-F'!$D$29=\"\",\"\",'Tex-280-F'!$D$29)","v":""},{"$f":"IF('Tex-280-F'!$C$21=\"\",\"\",'Tex-280-F'!$C$21)","v":"Particle Size Analysis - Tex-110-E"},{"$f":"IF('Tex-280-F'!$C$23=\"\",\"\",'Tex-280-F'!$C$23)","v":"Sieve Size"},{"$f":"IF('Tex-280-F'!$C$29=\"\",\"\",'Tex-280-F'!$C$29)","v":"No. 4"},{"$f":"IF('Tex-280-F'!$D$24=\"\",\"\",'Tex-280-F'!$D$24)","v":"Individual Weight Retained, (g):"}]
[26,{"$f":"IF('Tex-280-F'!$E$29=\"\",\"\",'Tex-280-F'!$E$29)","v":0},{"$f":"IF('Tex-280-F'!$C$21=\"\",\"\",'Tex-280-F'!$C$21)","v":"Particle Size Analysis - Tex-110-E"},{"$f":"IF('Tex-280-F'!$C$23=\"\",\"\",'Tex-280-F'!$C$23)","v":"Sieve Size"},{"$f":"IF('Tex-280-F'!$C$29=\"\",\"\",'Tex-280-F'!$C$29)","v":"No. 4"},{"$f":"IF('Tex-280-F'!$E$23=\"\",\"\",'Tex-280-F'!$E$23)","v":"Cumulative Weight Retained"}]
[27,{"$f":"IF('Tex-280-F'!$F$29=\"\",\"\",'Tex-280-F'!$F$29)","v":0},{"$f":"IF('Tex-280-F'!$C$21=\"\",\"\",'Tex-280-F'!$C$21)","v":"Particle Size Analysis - Tex-110-E"},{"$f":"IF('Tex-280-F'!$C$23=\"\",\"\",'Tex-280-F'!$C$23)","v":"Sieve Size"},{"$f":"IF('Tex-280-F'!$C$29=\"\",\"\",'Tex-280-F'!$C$29)","v":"No. 4"},{"$f":"IF('Tex-280-F'!$F$23=\"\",\"\",'Tex-280-F'!$F$23)","v":"Individual Percent Retained"}]
[28,{"$f":"IF('Tex-280-F'!$G$29=\"\",\"\",'Tex-280-F'!$G$29)","v":0},{"$f":"IF('Tex-280-F'!$C$21=\"\",\"\",'Tex-280-F'!$C$21)","v":"Particle Size Analysis - Tex-110-E"},{"$f":"IF('Tex-280-F'!$C$23=\"\",\"\",'Tex-280-F'!$C$23)","v":"Sieve Size"},{"$f":"IF('Tex-280-F'!$C$29=\"\",\"\",'Tex-280-F'!$C$29)","v":"No. 4"},{"$f":"IF('Tex-280-F'!$G$23=\"\",\"\",'Tex-280-F'!$G$23)","v":"New Total Percentage with 10% or Greater"}]
[29,{"$f":"IF('Tex-280-F'!$H$29=\"\",\"\",'Tex-280-F'!$H$29)","v":0},{"$f":"IF('Tex-280-F'!$C$21=\"\",\"\",'Tex-280-F'!$C$21)","v":"Particle Size Analysis - Tex-110-E"},{"$f":"IF('Tex-280-F'!$C$23=\"\",\"\",'Tex-280-F'!$C$23)","v":"Sieve Size"},{"$f":"IF('Tex-280-F'!$C$29=\"\",\"\",'Tex-280-F'!$C$29)","v":"No. 4"},{"$f":"IF('Tex-280-F'!$H$23=\"\",\"\",'Tex-280-F'!$H$23)","v":"Adjusted Percentage =100%"}]
[30,{"$f":"IF('Tex-280-F'!$D$30=\"\",\"\",'Tex-280-F'!$D$30)","v":""},{"$f":"IF('Tex-280-F'!$C$21=\"\",\"\",'Tex-280-F'!$C$21)","v":"Particle Size Analysis - Tex-110-E"},{"$f":"IF('Tex-280-F'!$C$23=\"\",\"\",'Tex-280-F'!$C$23)","v":"Sieve Size"},{"$f":"IF('Tex-280-F'!$C$30=\"\",\"\",'Tex-280-F'!$C$30)","v":"-No. 4"},{"$f":"IF('Tex-280-F'!$D$24=\"\",\"\",'Tex-280-F'!$D$24)","v":"Individual Weight Retained, (g):"}]
[31,{"$f":"IF('Tex-280-F'!$D$31=\"\",\"\",'Tex-280-F'!$D$31)","v":0},{"$f":"IF('Tex-280-F'!$C$21=\"\",\"\",'Tex-280-F'!$C$21)","v":"Particle Size Analysis - Tex-110-E"},{"$f":"IF('Tex-280-F'!$C$23=\"\",\"\",'Tex-280-F'!$C$23)","v":"Sieve Size"},{"$f":"IF('Tex-280-F'!$C$31=\"\",\"\",'Tex-280-F'!$C$31)","v":"Total, (g):"},{"$f":"IF('Tex-280-F'!$D$24=\"\",\"\",'Tex-280-F'!$D$24)","v":"Individual Weight Retained, (g):"}]
[32,{"$f":"IF('Tex-280-F'!$G$31=\"\",\"\",'Tex-280-F'!$G$31)","v":0},{"$f":"IF('Tex-280-F'!$C$21=\"\",\"\",'Tex-280-F'!$C$21)","v":"Particle Size Analysis - Tex-110-E"},{"$f":"IF('Tex-280-F'!$F$31=\"\",\"\",'Tex-280-F'!$F$31)","v":"Total, (%):"}]
[33,{"$f":"IF('Tex-280-F'!$C$36=\"\",\"\",'Tex-280-F'!$C$36)","v":""},{"$f":"IF('Tex-280-F'!$B$33=\"\",\"\",'Tex-280-F'!$B$33)","v":"3 to 1 RATIO"},{"$f":"IF('Tex-280-F'!$B$34=\"\",\"\",'Tex-280-F'!$B$34)","v":"Sieve Size"},{"$f":"IF('Tex-280-F'!$B$36=\"\",\"\",'Tex-280-F'!$B$36)","v":"7/8\""},{"$f":"IF('Tex-280-F'!$C$34=\"\",\"\",'Tex-280-F'!$C$34)","v":"ELONGATED / FLAT or BOTH"},{"$f":"IF('Tex-280-F'!$C$35=\"\",\"\",'Tex-280-F'!$C$35)","v":"count"}]
[34,{"$f":"IF('Tex-280-F'!$D$36=\"\",\"\",'Tex-280-F'!$D$36)","v":""},{"$f":"IF('Tex-280-F'!$B$33=\"\",\"\",'Tex-280-F'!$B$33)","v":"3 to 1 RATIO"},{"$f":"IF('Tex-280-F'!$B$34=\"\",\"\",'Tex-280-F'!$B$34)","v":"Sieve Size"},{"$f":"IF('Tex-280-F'!$B$36=\"\",\"\",'Tex-280-F'!$B$36)","v":"7/8\""},{"$f":"IF('Tex-280-F'!$C$34=\"\",\"\",'Tex-280-F'!$C$34)","v":"ELONGATED / FLAT or BOTH"},{"$f":"IF('Tex-280-F'!$D$35=\"\",\"\",'Tex-280-F'!$D$35)","v":"(g)"}]
[35,{"$f":"IF('Tex-280-F'!$E$36=\"\",\"\",'Tex-280-F'!$E$36)","v":0},{"$f":"IF('Tex-280-F'!$B$33=\"\",\"\",'Tex-280-F'!$B$33)","v":"3 to 1 RATIO"},{"$f":"IF('Tex-280-F'!$B$34=\"\",\"\",'Tex-280-F'!$B$34)","v":"Sieve Size"},{"$f":"IF('Tex-280-F'!$B$36=\"\",\"\",'Tex-280-F'!$B$36)","v":"7/8\""},{"$f":"IF('Tex-280-F'!$C$34=\"\",\"\",'Tex-280-F'!$C$34)","v":"ELONGATED / FLAT or BOTH"},{"$f":"IF('Tex-280-F'!$E$35=\"\",\"\",'Tex-280-F'!$E$35)","v":"(%)"}]
[36,{"$f":"IF('Tex-280-F'!$F$36=\"\",\"\",'Tex-280-F'!$F$36)","v":0},{"$f":"IF('Tex-280-F'!$B$33=\"\",\"\",'Tex-280-F'!$B$33)","v":"3 to 1 RATIO"},{"$f":"IF('Tex-280-F'!$B$34=\"\",\"\",'Tex-280-F'!$B$34)","v":"Sieve Size"},{"$f":"IF('Tex-280-F'!$B$36=\"\",\"\",'Tex-280-F'!$B$36)","v":"7/8\""},{"$f":"IF('Tex-280-F'!$C$34=\"\",\"\",'Tex-280-F'!$C$34)","v":"ELONGATED / FLAT or BOTH"},{"$f":"IF('Tex-280-F'!$F$35=\"\",\"\",'Tex-280-F'!$F$35)","v":"Adjusted (%)"}]
[37,{"$f":"IF('Tex-280-F'!$G$36=\"\",\"\",'Tex-280-F'!$G$36)","v":""},{"$f":"IF('Tex-280-F'!$B$33=\"\",\"\",'Tex-280-F'!$B$33)","v":"3 to 1 RATIO"},{"$f":"IF('Tex-280-F'!$B$34=\"\",\"\",'Tex-280-F'!$B$34)","v":"Sieve Size"},{"$f":"IF('Tex-280-F'!$B$36=\"\",\"\",'Tex-280-F'!$B$36)","v":"7/8\""},{"$f":"IF('Tex-280-F'!$G$34=\"\",\"\",'Tex-280-F'!$G$34)","v":"NEITHER (passing)"},{"$f":"IF('Tex-280-F'!$G$35=\"\",\"\",'Tex-280-F'!$G$35)","v":"count"}]
[38,{"$f":"IF('Tex-280-F'!$H$36=\"\",\"\",'Tex-280-F'!$H$36)","v":""},{"$f":"IF('Tex-280-F'!$B$33=\"\",\"\",'Tex-280-F'!$B$33)","v":"3 to 1 RATIO"},{"$f":"IF('Tex-280-F'!$B$34=\"\",\"\",'Tex-280-F'!$B$34)","v":"Sieve Size"},{"$f":"IF('Tex-280-F'!$B$36=\"\",\"\",'Tex-280-F'!$B$36)","v":"7/8\""},{"$f":"IF('Tex-280-F'!$G$34=\"\",\"\",'Tex-280-F'!$G$34)","v":"NEITHER (passing)"},{"$f":"IF('Tex-280-F'!$H$35=\"\",\"\",'Tex-280-F'!$H$35)","v":"(g)"}]
[39,{"$f":"IF('Tex-280-F'!$I$36=\"\",\"\",'Tex-280-F'!$I$36)","v":0},{"$f":"IF('Tex-280-F'!$B$33=\"\",\"\",'Tex-280-F'!$B$33)","v":"3 to 1 RATIO"},{"$f":"IF('Tex-280-F'!$B$34=\"\",\"\",'Tex-280-F'!$B$34)","v":"Sieve Size"},{"$f":"IF('Tex-280-F'!$B$36=\"\",\"\",'Tex-280-F'!$B$36)","v":"7/8\""},{"$f":"IF('Tex-280-F'!$G$34=\"\",\"\",'Tex-280-F'!$G$34)","v":"NEITHER (passing)"},{"$f":"IF('Tex-280-F'!$I$35=\"\",\"\",'Tex-280-F'!$I$35)","v":"(%)"}]
[40,{"$f":"IF('Tex-280-F'!$C$37=\"\",\"\",'Tex-280-F'!$C$37)","v":""},{"$f":"IF('Tex-280-F'!$B$33=\"\",\"\",'Tex-280-F'!$B$33)","v":"3 to 1 RATIO"},{"$f":"IF('Tex-280-F'!$B$34=\"\",\"\",'Tex-280-F'!$B$34)","v":"Sieve Size"},{"$f":"IF('Tex-280-F'!$B$37=\"\",\"\",'Tex-280-F'!$B$37)","v":"5/8\""},{"$f":"IF('Tex-280-F'!$C$34=\"\",\"\",'Tex-280-F'!$C$34)","v":"ELONGATED / FLAT or BOTH"},{"$f":"IF('Tex-280-F'!$C$35=\"\",\"\",'Tex-280-F'!$C$35)","v":"count"}]
[41,{"$f":"IF('Tex-280-F'!$D$37=\"\",\"\",'Tex-280-F'!$D$37)","v":""},{"$f":"IF('Tex-280-F'!$B$33=\"\",\"\",'Tex-280-F'!$B$33)","v":"3 to 1 RATIO"},{"$f":"IF('Tex-280-F'!$B$34=\"\",\"\",'Tex-280-F'!$B$34)","v":"Sieve Size"},{"$f":"IF('Tex-280-F'!$B$37=\"\",\"\",'Tex-280-F'!$B$37)","v":"5/8\""},{"$f":"IF('Tex-280-F'!$C$34=\"\",\"\",'Tex-280-F'!$C$34)","v":"ELONGATED / FLAT or BOTH"},{"$f":"IF('Tex-280-F'!$D$35=\"\",\"\",'Tex-280-F'!$D$35)","v":"(g)"}]
[42,{"$f":"IF('Tex-280-F'!$E$37=\"\",\"\",'Tex-280-F'!$E$37)","v":0},{"$f":"IF('Tex-280-F'!$B$33=\"\",\"\",'Tex-280-F'!$B$33)","v":"3 to 1 RATIO"},{"$f":"IF('Tex-280-F'!$B$34=\"\",\"\",'Tex-280-F'!$B$34)","v":"Sieve Size"},{"$f":"IF('Tex-280-F'!$B$37=\"\",\"\",'Tex-280-F'!$B$37)","v":"5/8\""},{"$f":"IF('Tex-280-F'!$C$34=\"\",\"\",'Tex-280-F'!$C$34)","v":"ELONGATED / FLAT or BOTH"},{"$f":"IF('Tex-280-F'!$E$35=\"\",\"\",'Tex-280-F'!$E$35)","v":"(%)"}]
[43,{"$f":"IF('Tex-280-F'!$F$37=\"\",\"\",'Tex-280-F'!$F$37)","v":0},{"$f":"IF('Tex-280-F'!$B$33=\"\",\"\",'Tex-280-F'!$B$33)","v":"3 to 1 RATIO"},{"$f":"IF('Tex-280-F'!$B$34=\"\",\"\",'Tex-280-F'!$B$34)","v":"Sieve Size"},{"$f":"IF('Tex-280-F'!$B$37=\"\",\"\",'Tex-280-F'!$B$37)","v":"5/8\""},{"$f":"IF('Tex-280-F'!$C$34=\"\",\"\",'Tex-280-F'!$C$34)","v":"ELONGATED / FLAT or BOTH"},{"$f":"IF('Tex-280-F'!$F$35=\"\",\"\",'Tex-280-F'!$F$35)","v":"Adjusted (%)"}]
[44,{"$f":"IF('Tex-280-F'!$G$37=\"\",\"\",'Tex-280-F'!$G$37)","v":""},{"$f":"IF('Tex-280-F'!$B$33=\"\",\"\",'Tex-280-F'!$B$33)","v":"3 to 1 RATIO"},{"$f":"IF('Tex-280-F'!$B$34=\"\",\"\",'Tex-280-F'!$B$34)","v":"Sieve Size"},{"$f":"IF('Tex-280-F'!$B$37=\"\",\"\",'Tex-280-F'!$B$37)","v":"5/8\""},{"$f":"IF('Tex-280-F'!$G$34=\"\",\"\",'Tex-280-F'!$G$34)","v":"NEITHER (passing)"},{"$f":"IF('Tex-280-F'!$G$35=\"\",\"\",'Tex-280-F'!$G$35)","v":"count"}]
[45,{"$f":"IF('Tex-280-F'!$H$37=\"\",\"\",'Tex-280-F'!$H$37)","v":""},{"$f":"IF('Tex-280-F'!$B$33=\"\",\"\",'Tex-280-F'!$B$33)","v":"3 to 1 RATIO"},{"$f":"IF('Tex-280-F'!$B$34=\"\",\"\",'Tex-280-F'!$B$34)","v":"Sieve Size"},{"$f":"IF('Tex-280-F'!$B$37=\"\",\"\",'Tex-280-F'!$B$37)","v":"5/8\""},{"$f":"IF('Tex-280-F'!$G$34=\"\",\"\",'Tex-280-F'!$G$34)","v":"NEITHER (passing)"},{"$f":"IF('Tex-280-F'!$H$35=\"\",\"\",'Tex-280-F'!$H$35)","v":"(g)"}]
[46,{"$f":"IF('Tex-280-F'!$I$37=\"\",\"\",'Tex-280-F'!$I$37)","v":0},{"$f":"IF('Tex-280-F'!$B$33=\"\",\"\",'Tex-280-F'!$B$33)","v":"3 to 1 RATIO"},{"$f":"IF('Tex-280-F'!$B$34=\"\",\"\",'Tex-280-F'!$B$34)","v":"Sieve Size"},{"$f":"IF('Tex-280-F'!$B$37=\"\",\"\",'Tex-280-F'!$B$37)","v":"5/8\""},{"$f":"IF('Tex-280-F'!$G$34=\"\",\"\",'Tex-280-F'!$G$34)","v":"NEITHER (passing)"},{"$f":"IF('Tex-280-F'!$I$35=\"\",\"\",'Tex-280-F'!$I$35)","v":"(%)"}]
[47,{"$f":"IF('Tex-280-F'!$C$38=\"\",\"\",'Tex-280-F'!$C$38)","v":""},{"$f":"IF('Tex-280-F'!$B$33=\"\",\"\",'Tex-280-F'!$B$33)","v":"3 to 1 RATIO"},{"$f":"IF('Tex-280-F'!$B$34=\"\",\"\",'Tex-280-F'!$B$34)","v":"Sieve Size"},{"$f":"IF('Tex-280-F'!$B$38=\"\",\"\",'Tex-280-F'!$B$38)","v":"1/2\""},{"$f":"IF('Tex-280-F'!$C$34=\"\",\"\",'Tex-280-F'!$C$34)","v":"ELONGATED / FLAT or BOTH"},{"$f":"IF('Tex-280-F'!$C$35=\"\",\"\",'Tex-280-F'!$C$35)","v":"count"}]
[48,{"$f":"IF('Tex-280-F'!$D$38=\"\",\"\",'Tex-280-F'!$D$38)","v":""},{"$f":"IF('Tex-280-F'!$B$33=\"\",\"\",'Tex-280-F'!$B$33)","v":"3 to 1 RATIO"},{"$f":"IF('Tex-280-F'!$B$34=\"\",\"\",'Tex-280-F'!$B$34)","v":"Sieve Size"},{"$f":"IF('Tex-280-F'!$B$38=\"\",\"\",'Tex-280-F'!$B$38)","v":"1/2\""},{"$f":"IF('Tex-280-F'!$C$34=\"\",\"\",'Tex-280-F'!$C$34)","v":"ELONGATED / FLAT or BOTH"},{"$f":"IF('Tex-280-F'!$D$35=\"\",\"\",'Tex-280-F'!$D$35)","v":"(g)"}]
[49,{"$f":"IF('Tex-280-F'!$E$38=\"\",\"\",'Tex-280-F'!$E$38)","v":0},{"$f":"IF('Tex-280-F'!$B$33=\"\",\"\",'Tex-280-F'!$B$33)","v":"3 to 1 RATIO"},{"$f":"IF('Tex-280-F'!$B$34=\"\",\"\",'Tex-280-F'!$B$34)","v":"Sieve Size"},{"$f":"IF('Tex-280-F'!$B$38=\"\",\"\",'Tex-280-F'!$B$38)","v":"1/2\""},{"$f":"IF('Tex-280-F'!$C$34=\"\",\"\",'Tex-280-F'!$C$34)","v":"ELONGATED / FLAT or BOTH"},{"$f":"IF('Tex-280-F'!$E$35=\"\",\"\",'Tex-280-F'!$E$35)","v":"(%)"}]
[50,{"$f":"IF('Tex-280-F'!$F$38=\"\",\"\",'Tex-280-F'!$F$38)","v":0},{"$f":"IF('Tex-280-F'!$B$33=\"\",\"\",'Tex-280-F'!$B$33)","v":"3 to 1 RATIO"},{"$f":"IF('Tex-280-F'!$B$34=\"\",\"\",'Tex-280-F'!$B$34)","v":"Sieve Size"},{"$f":"IF('Tex-280-F'!$B$38=\"\",\"\",'Tex-280-F'!$B$38)","v":"1/2\""},{"$f":"IF('Tex-280-F'!$C$34=\"\",\"\",'Tex-280-F'!$C$34)","v":"ELONGATED / FLAT or BOTH"},{"$f":"IF('Tex-280-F'!$F$35=\"\",\"\",'Tex-280-F'!$F$35)","v":"Adjusted (%)"}]
[51,{"$f":"IF('Tex-280-F'!$G$38=\"\",\"\",'Tex-280-F'!$G$38)","v":""},{"$f":"IF('Tex-280-F'!$B$33=\"\",\"\",'Tex-280-F'!$B$33)","v":"3 to 1 RATIO"},{"$f":"IF('Tex-280-F'!$B$34=\"\",\"\",'Tex-280-F'!$B$34)","v":"Sieve Size"},{"$f":"IF('Tex-280-F'!$B$38=\"\",\"\",'Tex-280-F'!$B$38)","v":"1/2\""},{"$f":"IF('Tex-280-F'!$G$34=\"\",\"\",'Tex-280-F'!$G$34)","v":"NEITHER (passing)"},{"$f":"IF('Tex-280-F'!$G$35=\"\",\"\",'Tex-280-F'!$G$35)","v":"count"}]
[52,{"$f":"IF('Tex-280-F'!$H$38=\"\",\"\",'Tex-280-F'!$H$38)","v":""},{"$f":"IF('Tex-280-F'!$B$33=\"\",\"\",'Tex-280-F'!$B$33)","v":"3 to 1 RATIO"},{"$f":"IF('Tex-280-F'!$B$34=\"\",\"\",'Tex-280-F'!$B$34)","v":"Sieve Size"},{"$f":"IF('Tex-280-F'!$B$38=\"\",\"\",'Tex-280-F'!$B$38)","v":"1/2\""},{"$f":"IF('Tex-280-F'!$G$34=\"\",\"\",'Tex-280-F'!$G$34)","v":"NEITHER (passing)"},{"$f":"IF('Tex-280-F'!$H$35=\"\",\"\",'Tex-280-F'!$H$35)","v":"(g)"}]
[53,{"$f":"IF('Tex-280-F'!$I$38=\"\",\"\",'Tex-280-F'!$I$38)","v":0},{"$f":"IF('Tex-280-F'!$B$33=\"\",\"\",'Tex-280-F'!$B$33)","v":"3 to 1 RATIO"},{"$f":"IF('Tex-280-F'!$B$34=\"\",\"\",'Tex-280-F'!$B$34)","v":"Sieve Size"},{"$f":"IF('Tex-280-F'!$B$38=\"\",\"\",'Tex-280-F'!$B$38)","v":"1/2\""},{"$f":"IF('Tex-280-F'!$G$34=\"\",\"\",'Tex-280-F'!$G$34)","v":"NEITHER (passing)"},{"$f":"IF('Tex-280-F'!$I$35=\"\",\"\",'Tex-280-F'!$I$35)","v":"(%)"}]
[54,{"$f":"IF('Tex-280-F'!$C$39=\"\",\"\",'Tex-280-F'!$C$39)","v":""},{"$f":"IF('Tex-280-F'!$B$33=\"\",\"\",'Tex-280-F'!$B$33)","v":"3 to 1 RATIO"},{"$f":"IF('Tex-280-F'!$B$34=\"\",\"\",'Tex-280-F'!$B$34)","v":"Sieve Size"},{"$f":"IF('Tex-280-F'!$B$39=\"\",\"\",'Tex-280-F'!$B$39)","v":"3/8\""},{"$f":"IF('Tex-280-F'!$C$34=\"\",\"\",'Tex-280-F'!$C$34)","v":"ELONGATED / FLAT or BOTH"},{"$f":"IF('Tex-280-F'!$C$35=\"\",\"\",'Tex-280-F'!$C$35)","v":"count"}]
[55,{"$f":"IF('Tex-280-F'!$D$39=\"\",\"\",'Tex-280-F'!$D$39)","v":""},{"$f":"IF('Tex-280-F'!$B$33=\"\",\"\",'Tex-280-F'!$B$33)","v":"3 to 1 RATIO"},{"$f":"IF('Tex-280-F'!$B$34=\"\",\"\",'Tex-280-F'!$B$34)","v":"Sieve Size"},{"$f":"IF('Tex-280-F'!$B$39=\"\",\"\",'Tex-280-F'!$B$39)","v":"3/8\""},{"$f":"IF('Tex-280-F'!$C$34=\"\",\"\",'Tex-280-F'!$C$34)","v":"ELONGATED / FLAT or BOTH"},{"$f":"IF('Tex-280-F'!$D$35=\"\",\"\",'Tex-280-F'!$D$35)","v":"(g)"}]
[56,{"$f":"IF('Tex-280-F'!$E$39=\"\",\"\",'Tex-280-F'!$E$39)","v":0},{"$f":"IF('Tex-280-F'!$B$33=\"\",\"\",'Tex-280-F'!$B$33)","v":"3 to 1 RATIO"},{"$f":"IF('Tex-280-F'!$B$34=\"\",\"\",'Tex-280-F'!$B$34)","v":"Sieve Size"},{"$f":"IF('Tex-280-F'!$B$39=\"\",\"\",'Tex-280-F'!$B$39)","v":"3/8\""},{"$f":"IF('Tex-280-F'!$C$34=\"\",\"\",'Tex-280-F'!$C$34)","v":"ELONGATED / FLAT or BOTH"},{"$f":"IF('Tex-280-F'!$E$35=\"\",\"\",'Tex-280-F'!$E$35)","v":"(%)"}]
[57,{"$f":"IF('Tex-280-F'!$F$39=\"\",\"\",'Tex-280-F'!$F$39)","v":0},{"$f":"IF('Tex-280-F'!$B$33=\"\",\"\",'Tex-280-F'!$B$33)","v":"3 to 1 RATIO"},{"$f":"IF('Tex-280-F'!$B$34=\"\",\"\",'Tex-280-F'!$B$34)","v":"Sieve Size"},{"$f":"IF('Tex-280-F'!$B$39=\"\",\"\",'Tex-280-F'!$B$39)","v":"3/8\""},{"$f":"IF('Tex-280-F'!$C$34=\"\",\"\",'Tex-280-F'!$C$34)","v":"ELONGATED / FLAT or BOTH"},{"$f":"IF('Tex-280-F'!$F$35=\"\",\"\",'Tex-280-F'!$F$35)","v":"Adjusted (%)"}]
[58,{"$f":"IF('Tex-280-F'!$G$39=\"\",\"\",'Tex-280-F'!$G$39)","v":""},{"$f":"IF('Tex-280-F'!$B$33=\"\",\"\",'Tex-280-F'!$B$33)","v":"3 to 1 RATIO"},{"$f":"IF('Tex-280-F'!$B$34=\"\",\"\",'Tex-280-F'!$B$34)","v":"Sieve Size"},{"$f":"IF('Tex-280-F'!$B$39=\"\",\"\",'Tex-280-F'!$B$39)","v":"3/8\""},{"$f":"IF('Tex-280-F'!$G$34=\"\",\"\",'Tex-280-F'!$G$34)","v":"NEITHER (passing)"},{"$f":"IF('Tex-280-F'!$G$35=\"\",\"\",'Tex-280-F'!$G$35)","v":"count"}]
[59,{"$f":"IF('Tex-280-F'!$H$39=\"\",\"\",'Tex-280-F'!$H$39)","v":""},{"$f":"IF('Tex-280-F'!$B$33=\"\",\"\",'Tex-280-F'!$B$33)","v":"3 to 1 RATIO"},{"$f":"IF('Tex-280-F'!$B$34=\"\",\"\",'Tex-280-F'!$B$34)","v":"Sieve Size"},{"$f":"IF('Tex-280-F'!$B$39=\"\",\"\",'Tex-280-F'!$B$39)","v":"3/8\""},{"$f":"IF('Tex-280-F'!$G$34=\"\",\"\",'Tex-280-F'!$G$34)","v":"NEITHER (passing)"},{"$f":"IF('Tex-280-F'!$H$35=\"\",\"\",'Tex-280-F'!$H$35)","v":"(g)"}]
[60,{"$f":"IF('Tex-280-F'!$I$39=\"\",\"\",'Tex-280-F'!$I$39)","v":0},{"$f":"IF('Tex-280-F'!$B$33=\"\",\"\",'Tex-280-F'!$B$33)","v":"3 to 1 RATIO"},{"$f":"IF('Tex-280-F'!$B$34=\"\",\"\",'Tex-280-F'!$B$34)","v":"Sieve Size"},{"$f":"IF('Tex-280-F'!$B$39=\"\",\"\",'Tex-280-F'!$B$39)","v":"3/8\""},{"$f":"IF('Tex-280-F'!$G$34=\"\",\"\",'Tex-280-F'!$G$34)","v":"NEITHER (passing)"},{"$f":"IF('Tex-280-F'!$I$35=\"\",\"\",'Tex-280-F'!$I$35)","v":"(%)"}]
[61,{"$f":"IF('Tex-280-F'!$C$40=\"\",\"\",'Tex-280-F'!$C$40)","v":""},{"$f":"IF('Tex-280-F'!$B$33=\"\",\"\",'Tex-280-F'!$B$33)","v":"3 to 1 RATIO"},{"$f":"IF('Tex-280-F'!$B$34=\"\",\"\",'Tex-280-F'!$B$34)","v":"Sieve Size"},{"$f":"IF('Tex-280-F'!$B$40=\"\",\"\",'Tex-280-F'!$B$40)","v":"No. 4"},{"$f":"IF('Tex-280-F'!$C$34=\"\",\"\",'Tex-280-F'!$C$34)","v":"ELONGATED / FLAT or BOTH"},{"$f":"IF('Tex-280-F'!$C$35=\"\",\"\",'Tex-280-F'!$C$35)","v":"count"}]
[62,{"$f":"IF('Tex-280-F'!$D$40=\"\",\"\",'Tex-280-F'!$D$40)","v":""},{"$f":"IF('Tex-280-F'!$B$33=\"\",\"\",'Tex-280-F'!$B$33)","v":"3 to 1 RATIO"},{"$f":"IF('Tex-280-F'!$B$34=\"\",\"\",'Tex-280-F'!$B$34)","v":"Sieve Size"},{"$f":"IF('Tex-280-F'!$B$40=\"\",\"\",'Tex-280-F'!$B$40)","v":"No. 4"},{"$f":"IF('Tex-280-F'!$C$34=\"\",\"\",'Tex-280-F'!$C$34)","v":"ELONGATED / FLAT or BOTH"},{"$f":"IF('Tex-280-F'!$D$35=\"\",\"\",'Tex-280-F'!$D$35)","v":"(g)"}]
[63,{"$f":"IF('Tex-280-F'!$E$40=\"\",\"\",'Tex-280-F'!$E$40)","v":0},{"$f":"IF('Tex-280-F'!$B$33=\"\",\"\",'Tex-280-F'!$B$33)","v":"3 to 1 RATIO"},{"$f":"IF('Tex-280-F'!$B$34=\"\",\"\",'Tex-280-F'!$B$34)","v":"Sieve Size"},{"$f":"IF('Tex-280-F'!$B$40=\"\",\"\",'Tex-280-F'!$B$40)","v":"No. 4"},{"$f":"IF('Tex-280-F'!$C$34=\"\",\"\",'Tex-280-F'!$C$34)","v":"ELONGATED / FLAT or BOTH"},{"$f":"IF('Tex-280-F'!$E$35=\"\",\"\",'Tex-280-F'!$E$35)","v":"(%)"}]
[64,{"$f":"IF('Tex-280-F'!$F$40=\"\",\"\",'Tex-280-F'!$F$40)","v":0},{"$f":"IF('Tex-280-F'!$B$33=\"\",\"\",'Tex-280-F'!$B$33)","v":"3 to 1 RATIO"},{"$f":"IF('Tex-280-F'!$B$34=\"\",\"\",'Tex-280-F'!$B$34)","v":"Sieve Size"},{"$f":"IF('Tex-280-F'!$B$40=\"\",\"\",'Tex-280-F'!$B$40)","v":"No. 4"},{"$f":"IF('Tex-280-F'!$C$34=\"\",\"\",'Tex-280-F'!$C$34)","v":"ELONGATED / FLAT or BOTH"},{"$f":"IF('Tex-280-F'!$F$35=\"\",\"\",'Tex-280-F'!$F$35)","v":"Adjusted (%)"}]
[65,{"$f":"IF('Tex-280-F'!$G$40=\"\",\"\",'Tex-280-F'!$G$40)","v":""},{"$f":"IF('Tex-280-F'!$B$33=\"\",\"\",'Tex-280-F'!$B$33)","v":"3 to 1 RATIO"},{"$f":"IF('Tex-280-F'!$B$34=\"\",\"\",'Tex-280-F'!$B$34)","v":"Sieve Size"},{"$f":"IF('Tex-280-F'!$B$40=\"\",\"\",'Tex-280-F'!$B$40)","v":"No. 4"},{"$f":"IF('Tex-280-F'!$G$34=\"\",\"\",'Tex-280-F'!$G$34)","v":"NEITHER (passing)"},{"$f":"IF('Tex-280-F'!$G$35=\"\",\"\",'Tex-280-F'!$G$35)","v":"count"}]
[66,{"$f":"IF('Tex-280-F'!$H$40=\"\",\"\",'Tex-280-F'!$H$40)","v":""},{"$f":"IF('Tex-280-F'!$B$33=\"\",\"\",'Tex-280-F'!$B$33)","v":"3 to 1 RATIO"},{"$f":"IF('Tex-280-F'!$B$34=\"\",\"\",'Tex-280-F'!$B$34)","v":"Sieve Size"},{"$f":"IF('Tex-280-F'!$B$40=\"\",\"\",'Tex-280-F'!$B$40)","v":"No. 4"},{"$f":"IF('Tex-280-F'!$G$34=\"\",\"\",'Tex-280-F'!$G$34)","v":"NEITHER (passing)"},{"$f":"IF('Tex-280-F'!$H$35=\"\",\"\",'Tex-280-F'!$H$35)","v":"(g)"}]
[67,{"$f":"IF('Tex-280-F'!$I$40=\"\",\"\",'Tex-280-F'!$I$40)","v":0},{"$f":"IF('Tex-280-F'!$B$33=\"\",\"\",'Tex-280-F'!$B$33)","v":"3 to 1 RATIO"},{"$f":"IF('Tex-280-F'!$B$34=\"\",\"\",'Tex-280-F'!$B$34)","v":"Sieve Size"},{"$f":"IF('Tex-280-F'!$B$40=\"\",\"\",'Tex-280-F'!$B$40)","v":"No. 4"},{"$f":"IF('Tex-280-F'!$G$34=\"\",\"\",'Tex-280-F'!$G$34)","v":"NEITHER (passing)"},{"$f":"IF('Tex-280-F'!$I$35=\"\",\"\",'Tex-280-F'!$I$35)","v":"(%)"}]
[68,{"$f":"IF('Tex-280-F'!$F$42=\"\",\"\",'Tex-280-F'!$F$42)","v":0},{"$f":"IF('Tex-280-F'!$B$33=\"\",\"\",'Tex-280-F'!$B$33)","v":"3 to 1 RATIO"},{"$f":"IF('Tex-280-F'!$D$42=\"\",\"\",'Tex-280-F'!$D$42)","v":"Adjusted Total Failing, %"}]
[69,{"$f":"IF('Tex-280-F'!$C$47=\"\",\"\",'Tex-280-F'!$C$47)","v":""},{"$f":"IF('Tex-280-F'!$B$44=\"\",\"\",'Tex-280-F'!$B$44)","v":"5 to 1 RATIO"},{"$f":"IF('Tex-280-F'!$B$45=\"\",\"\",'Tex-280-F'!$B$45)","v":"Sieve Size"},{"$f":"IF('Tex-280-F'!$B$47=\"\",\"\",'Tex-280-F'!$B$47)","v":"7/8\""},{"$f":"IF('Tex-280-F'!$C$45=\"\",\"\",'Tex-280-F'!$C$45)","v":"ELONGATED / FLAT or BOTH"},{"$f":"IF('Tex-280-F'!$C$46=\"\",\"\",'Tex-280-F'!$C$46)","v":"count"}]
[70,{"$f":"IF('Tex-280-F'!$D$47=\"\",\"\",'Tex-280-F'!$D$47)","v":""},{"$f":"IF('Tex-280-F'!$B$44=\"\",\"\",'Tex-280-F'!$B$44)","v":"5 to 1 RATIO"},{"$f":"IF('Tex-280-F'!$B$45=\"\",\"\",'Tex-280-F'!$B$45)","v":"Sieve Size"},{"$f":"IF('Tex-280-F'!$B$47=\"\",\"\",'Tex-280-F'!$B$47)","v":"7/8\""},{"$f":"IF('Tex-280-F'!$C$45=\"\",\"\",'Tex-280-F'!$C$45)","v":"ELONGATED / FLAT or BOTH"},{"$f":"IF('Tex-280-F'!$D$46=\"\",\"\",'Tex-280-F'!$D$46)","v":"(g)"}]
[71,{"$f":"IF('Tex-280-F'!$E$47=\"\",\"\",'Tex-280-F'!$E$47)","v":0},{"$f":"IF('Tex-280-F'!$B$44=\"\",\"\",'Tex-280-F'!$B$44)","v":"5 to 1 RATIO"},{"$f":"IF('Tex-280-F'!$B$45=\"\",\"\",'Tex-280-F'!$B$45)","v":"Sieve Size"},{"$f":"IF('Tex-280-F'!$B$47=\"\",\"\",'Tex-280-F'!$B$47)","v":"7/8\""},{"$f":"IF('Tex-280-F'!$C$45=\"\",\"\",'Tex-280-F'!$C$45)","v":"ELONGATED / FLAT or BOTH"},{"$f":"IF('Tex-280-F'!$E$46=\"\",\"\",'Tex-280-F'!$E$46)","v":"(%)"}]
[72,{"$f":"IF('Tex-280-F'!$F$47=\"\",\"\",'Tex-280-F'!$F$47)","v":0},{"$f":"IF('Tex-280-F'!$B$44=\"\",\"\",'Tex-280-F'!$B$44)","v":"5 to 1 RATIO"},{"$f":"IF('Tex-280-F'!$B$45=\"\",\"\",'Tex-280-F'!$B$45)","v":"Sieve Size"},{"$f":"IF('Tex-280-F'!$B$47=\"\",\"\",'Tex-280-F'!$B$47)","v":"7/8\""},{"$f":"IF('Tex-280-F'!$C$45=\"\",\"\",'Tex-280-F'!$C$45)","v":"ELONGATED / FLAT or BOTH"},{"$f":"IF('Tex-280-F'!$F$46=\"\",\"\",'Tex-280-F'!$F$46)","v":"Adjusted (%)"}]
[73,{"$f":"IF('Tex-280-F'!$G$47=\"\",\"\",'Tex-280-F'!$G$47)","v":""},{"$f":"IF('Tex-280-F'!$B$44=\"\",\"\",'Tex-280-F'!$B$44)","v":"5 to 1 RATIO"},{"$f":"IF('Tex-280-F'!$B$45=\"\",\"\",'Tex-280-F'!$B$45)","v":"Sieve Size"},{"$f":"IF('Tex-280-F'!$B$47=\"\",\"\",'Tex-280-F'!$B$47)","v":"7/8\""},{"$f":"IF('Tex-280-F'!$G$45=\"\",\"\",'Tex-280-F'!$G$45)","v":"NEITHER (passing)"},{"$f":"IF('Tex-280-F'!$G$46=\"\",\"\",'Tex-280-F'!$G$46)","v":"count"}]
[74,{"$f":"IF('Tex-280-F'!$H$47=\"\",\"\",'Tex-280-F'!$H$47)","v":""},{"$f":"IF('Tex-280-F'!$B$44=\"\",\"\",'Tex-280-F'!$B$44)","v":"5 to 1 RATIO"},{"$f":"IF('Tex-280-F'!$B$45=\"\",\"\",'Tex-280-F'!$B$45)","v":"Sieve Size"},{"$f":"IF('Tex-280-F'!$B$47=\"\",\"\",'Tex-280-F'!$B$47)","v":"7/8\""},{"$f":"IF('Tex-280-F'!$G$45=\"\",\"\",'Tex-280-F'!$G$45)","v":"NEITHER (passing)"},{"$f":"IF('Tex-280-F'!$H$46=\"\",\"\",'Tex-280-F'!$H$46)","v":"(g)"}]
[75,{"$f":"IF('Tex-280-F'!$I$47=\"\",\"\",'Tex-280-F'!$I$47)","v":0},{"$f":"IF('Tex-280-F'!$B$44=\"\",\"\",'Tex-280-F'!$B$44)","v":"5 to 1 RATIO"},{"$f":"IF('Tex-280-F'!$B$45=\"\",\"\",'Tex-280-F'!$B$45)","v":"Sieve Size"},{"$f":"IF('Tex-280-F'!$B$47=\"\",\"\",'Tex-280-F'!$B$47)","v":"7/8\""},{"$f":"IF('Tex-280-F'!$G$45=\"\",\"\",'Tex-280-F'!$G$45)","v":"NEITHER (passing)"},{"$f":"IF('Tex-280-F'!$I$46=\"\",\"\",'Tex-280-F'!$I$46)","v":"(%)"}]
[76,{"$f":"IF('Tex-280-F'!$C$48=\"\",\"\",'Tex-280-F'!$C$48)","v":""},{"$f":"IF('Tex-280-F'!$B$44=\"\",\"\",'Tex-280-F'!$B$44)","v":"5 to 1 RATIO"},{"$f":"IF('Tex-280-F'!$B$45=\"\",\"\",'Tex-280-F'!$B$45)","v":"Sieve Size"},{"$f":"IF('Tex-280-F'!$B$48=\"\",\"\",'Tex-280-F'!$B$48)","v":"5/8\""},{"$f":"IF('Tex-280-F'!$C$45=\"\",\"\",'Tex-280-F'!$C$45)","v":"ELONGATED / FLAT or BOTH"},{"$f":"IF('Tex-280-F'!$C$46=\"\",\"\",'Tex-280-F'!$C$46)","v":"count"}]
[77,{"$f":"IF('Tex-280-F'!$D$48=\"\",\"\",'Tex-280-F'!$D$48)","v":""},{"$f":"IF('Tex-280-F'!$B$44=\"\",\"\",'Tex-280-F'!$B$44)","v":"5 to 1 RATIO"},{"$f":"IF('Tex-280-F'!$B$45=\"\",\"\",'Tex-280-F'!$B$45)","v":"Sieve Size"},{"$f":"IF('Tex-280-F'!$B$48=\"\",\"\",'Tex-280-F'!$B$48)","v":"5/8\""},{"$f":"IF('Tex-280-F'!$C$45=\"\",\"\",'Tex-280-F'!$C$45)","v":"ELONGATED / FLAT or BOTH"},{"$f":"IF('Tex-280-F'!$D$46=\"\",\"\",'Tex-280-F'!$D$46)","v":"(g)"}]
[78,{"$f":"IF('Tex-280-F'!$E$48=\"\",\"\",'Tex-280-F'!$E$48)","v":0},{"$f":"IF('Tex-280-F'!$B$44=\"\",\"\",'Tex-280-F'!$B$44)","v":"5 to 1 RATIO"},{"$f":"IF('Tex-280-F'!$B$45=\"\",\"\",'Tex-280-F'!$B$45)","v":"Sieve Size"},{"$f":"IF('Tex-280-F'!$B$48=\"\",\"\",'Tex-280-F'!$B$48)","v":"5/8\""},{"$f":"IF('Tex-280-F'!$C$45=\"\",\"\",'Tex-280-F'!$C$45)","v":"ELONGATED / FLAT or BOTH"},{"$f":"IF('Tex-280-F'!$E$46=\"\",\"\",'Tex-280-F'!$E$46)","v":"(%)"}]
[79,{"$f":"IF('Tex-280-F'!$F$48=\"\",\"\",'Tex-280-F'!$F$48)","v":0},{"$f":"IF('Tex-280-F'!$B$44=\"\",\"\",'Tex-280-F'!$B$44)","v":"5 to 1 RATIO"},{"$f":"IF('Tex-280-F'!$B$45=\"\",\"\",'Tex-280-F'!$B$45)","v":"Sieve Size"},{"$f":"IF('Tex-280-F'!$B$48=\"\",\"\",'Tex-280-F'!$B$48)","v":"5/8\""},{"$f":"IF('Tex-280-F'!$C$45=\"\",\"\",'Tex-280-F'!$C$45)","v":"ELONGATED / FLAT or BOTH"},{"$f":"IF('Tex-280-F'!$F$46=\"\",\"\",'Tex-280-F'!$F$46)","v":"Adjusted (%)"}]
[80,{"$f":"IF('Tex-280-F'!$G$48=\"\",\"\",'Tex-280-F'!$G$48)","v":""},{"$f":"IF('Tex-280-F'!$B$44=\"\",\"\",'Tex-280-F'!$B$44)","v":"5 to 1 RATIO"},{"$f":"IF('Tex-280-F'!$B$45=\"\",\"\",'Tex-280-F'!$B$45)","v":"Sieve Size"},{"$f":"IF('Tex-280-F'!$B$48=\"\",\"\",'Tex-280-F'!$B$48)","v":"5/8\""},{"$f":"IF('Tex-280-F'!$G$45=\"\",\"\",'Tex-280-F'!$G$45)","v":"NEITHER (passing)"},{"$f":"IF('Tex-280-F'!$G$46=\"\",\"\",'Tex-280-F'!$G$46)","v":"count"}]
[81,{"$f":"IF('Tex-280-F'!$H$48=\"\",\"\",'Tex-280-F'!$H$48)","v":""},{"$f":"IF('Tex-280-F'!$B$44=\"\",\"\",'Tex-280-F'!$B$44)","v":"5 to 1 RATIO"},{"$f":"IF('Tex-280-F'!$B$45=\"\",\"\",'Tex-280-F'!$B$45)","v":"Sieve Size"},{"$f":"IF('Tex-280-F'!$B$48=\"\",\"\",'Tex-280-F'!$B$48)","v":"5/8\""},{"$f":"IF('Tex-280-F'!$G$45=\"\",\"\",'Tex-280-F'!$G$45)","v":"NEITHER (passing)"},{"$f":"IF('Tex-280-F'!$H$46=\"\",\"\",'Tex-280-F'!$H$46)","v":"(g)"}]
[82,{"$f":"IF('Tex-280-F'!$I$48=\"\",\"\",'Tex-280-F'!$I$48)","v":0},{"$f":"IF('Tex-280-F'!$B$44=\"\",\"\",'Tex-280-F'!$B$44)","v":"5 to 1 RATIO"},{"$f":"IF('Tex-280-F'!$B$45=\"\",\"\",'Tex-280-F'!$B$45)","v":"Sieve Size"},{"$f":"IF('Tex-280-F'!$B$48=\"\",\"\",'Tex-280-F'!$B$48)","v":"5/8\""},{"$f":"IF('Tex-280-F'!$G$45=\"\",\"\",'Tex-280-F'!$G$45)","v":"NEITHER (passing)"},{"$f":"IF('Tex-280-F'!$I$46=\"\",\"\",'Tex-280-F'!$I$46)","v":"(%)"}]
[83,{"$f":"IF('Tex-280-F'!$C$49=\"\",\"\",'Tex-280-F'!$C$49)","v":""},{"$f":"IF('Tex-280-F'!$B$44=\"\",\"\",'Tex-280-F'!$B$44)","v":"5 to 1 RATIO"},{"$f":"IF('Tex-280-F'!$B$45=\"\",\"\",'Tex-280-F'!$B$45)","v":"Sieve Size"},{"$f":"IF('Tex-280-F'!$B$49=\"\",\"\",'Tex-280-F'!$B$49)","v":"1/2\""},{"$f":"IF('Tex-280-F'!$C$45=\"\",\"\",'Tex-280-F'!$C$45)","v":"ELONGATED / FLAT or BOTH"},{"$f":"IF('Tex-280-F'!$C$46=\"\",\"\",'Tex-280-F'!$C$46)","v":"count"}]
[84,{"$f":"IF('Tex-280-F'!$D$49=\"\",\"\",'Tex-280-F'!$D$49)","v":""},{"$f":"IF('Tex-280-F'!$B$44=\"\",\"\",'Tex-280-F'!$B$44)","v":"5 to 1 RATIO"},{"$f":"IF('Tex-280-F'!$B$45=\"\",\"\",'Tex-280-F'!$B$45)","v":"Sieve Size"},{"$f":"IF('Tex-280-F'!$B$49=\"\",\"\",'Tex-280-F'!$B$49)","v":"1/2\""},{"$f":"IF('Tex-280-F'!$C$45=\"\",\"\",'Tex-280-F'!$C$45)","v":"ELONGATED / FLAT or BOTH"},{"$f":"IF('Tex-280-F'!$D$46=\"\",\"\",'Tex-280-F'!$D$46)","v":"(g)"}]
[85,{"$f":"IF('Tex-280-F'!$E$49=\"\",\"\",'Tex-280-F'!$E$49)","v":0},{"$f":"IF('Tex-280-F'!$B$44=\"\",\"\",'Tex-280-F'!$B$44)","v":"5 to 1 RATIO"},{"$f":"IF('Tex-280-F'!$B$45=\"\",\"\",'Tex-280-F'!$B$45)","v":"Sieve Size"},{"$f":"IF('Tex-280-F'!$B$49=\"\",\"\",'Tex-280-F'!$B$49)","v":"1/2\""},{"$f":"IF('Tex-280-F'!$C$45=\"\",\"\",'Tex-280-F'!$C$45)","v":"ELONGATED / FLAT or BOTH"},{"$f":"IF('Tex-280-F'!$E$46=\"\",\"\",'Tex-280-F'!$E$46)","v":"(%)"}]
[86,{"$f":"IF('Tex-280-F'!$F$49=\"\",\"\",'Tex-280-F'!$F$49)","v":0},{"$f":"IF('Tex-280-F'!$B$44=\"\",\"\",'Tex-280-F'!$B$44)","v":"5 to 1 RATIO"},{"$f":"IF('Tex-280-F'!$B$45=\"\",\"\",'Tex-280-F'!$B$45)","v":"Sieve Size"},{"$f":"IF('Tex-280-F'!$B$49=\"\",\"\",'Tex-280-F'!$B$49)","v":"1/2\""},{"$f":"IF('Tex-280-F'!$C$45=\"\",\"\",'Tex-280-F'!$C$45)","v":"ELONGATED / FLAT or BOTH"},{"$f":"IF('Tex-280-F'!$F$46=\"\",\"\",'Tex-280-F'!$F$46)","v":"Adjusted (%)"}]
[87,{"$f":"IF('Tex-280-F'!$G$49=\"\",\"\",'Tex-280-F'!$G$49)","v":""},{"$f":"IF('Tex-280-F'!$B$44=\"\",\"\",'Tex-280-F'!$B$44)","v":"5 to 1 RATIO"},{"$f":"IF('Tex-280-F'!$B$45=\"\",\"\",'Tex-280-F'!$B$45)","v":"Sieve Size"},{"$f":"IF('Tex-280-F'!$B$49=\"\",\"\",'Tex-280-F'!$B$49)","v":"1/2\""},{"$f":"IF('Tex-280-F'!$G$45=\"\",\"\",'Tex-280-F'!$G$45)","v":"NEITHER (passing)"},{"$f":"IF('Tex-280-F'!$G$46=\"\",\"\",'Tex-280-F'!$G$46)","v":"count"}]
[88,{"$f":"IF('Tex-280-F'!$H$49=\"\",\"\",'Tex-280-F'!$H$49)","v":""},{"$f":"IF('Tex-280-F'!$B$44=\"\",\"\",'Tex-280-F'!$B$44)","v":"5 to 1 RATIO"},{"$f":"IF('Tex-280-F'!$B$45=\"\",\"\",'Tex-280-F'!$B$45)","v":"Sieve Size"},{"$f":"IF('Tex-280-F'!$B$49=\"\",\"\",'Tex-280-F'!$B$49)","v":"1/2\""},{"$f":"IF('Tex-280-F'!$G$45=\"\",\"\",'Tex-280-F'!$G$45)","v":"NEITHER (passing)"},{"$f":"IF('Tex-280-F'!$H$46=\"\",\"\",'Tex-280-F'!$H$46)","v":"(g)"}]
[89,{"$f":"IF('Tex-280-F'!$I$49=\"\",\"\",'Tex-280-F'!$I$49)","v":0},{"$f":"IF('Tex-280-F'!$B$44=\"\",\"\",'Tex-280-F'!$B$44)","v":"5 to 1 RATIO"},{"$f":"IF('Tex-280-F'!$B$45=\"\",\"\",'Tex-280-F'!$B$45)","v":"Sieve Size"},{"$f":"IF('Tex-280-F'!$B$49=\"\",\"\",'Tex-280-F'!$B$49)","v":"1/2\""},{"$f":"IF('Tex-280-F'!$G$45=\"\",\"\",'Tex-280-F'!$G$45)","v":"NEITHER (passing)"},{"$f":"IF('Tex-280-F'!$I$46=\"\",\"\",'Tex-280-F'!$I$46)","v":"(%)"}]
[90,{"$f":"IF('Tex-280-F'!$C$50=\"\",\"\",'Tex-280-F'!$C$50)","v":""},{"$f":"IF('Tex-280-F'!$B$44=\"\",\"\",'Tex-280-F'!$B$44)","v":"5 to 1 RATIO"},{"$f":"IF('Tex-280-F'!$B$45=\"\",\"\",'Tex-280-F'!$B$45)","v":"Sieve Size"},{"$f":"IF('Tex-280-F'!$B$50=\"\",\"\",'Tex-280-F'!$B$50)","v":"3/8\""},{"$f":"IF('Tex-280-F'!$C$45=\"\",\"\",'Tex-280-F'!$C$45)","v":"ELONGATED / FLAT or BOTH"},{"$f":"IF('Tex-280-F'!$C$46=\"\",\"\",'Tex-280-F'!$C$46)","v":"count"}]
[91,{"$f":"IF('Tex-280-F'!$D$50=\"\",\"\",'Tex-280-F'!$D$50)","v":""},{"$f":"IF('Tex-280-F'!$B$44=\"\",\"\",'Tex-280-F'!$B$44)","v":"5 to 1 RATIO"},{"$f":"IF('Tex-280-F'!$B$45=\"\",\"\",'Tex-280-F'!$B$45)","v":"Sieve Size"},{"$f":"IF('Tex-280-F'!$B$50=\"\",\"\",'Tex-280-F'!$B$50)","v":"3/8\""},{"$f":"IF('Tex-280-F'!$C$45=\"\",\"\",'Tex-280-F'!$C$45)","v":"ELONGATED / FLAT or BOTH"},{"$f":"IF('Tex-280-F'!$D$46=\"\",\"\",'Tex-280-F'!$D$46)","v":"(g)"}]
[92,{"$f":"IF('Tex-280-F'!$E$50=\"\",\"\",'Tex-280-F'!$E$50)","v":0},{"$f":"IF('Tex-280-F'!$B$44=\"\",\"\",'Tex-280-F'!$B$44)","v":"5 to 1 RATIO"},{"$f":"IF('Tex-280-F'!$B$45=\"\",\"\",'Tex-280-F'!$B$45)","v":"Sieve Size"},{"$f":"IF('Tex-280-F'!$B$50=\"\",\"\",'Tex-280-F'!$B$50)","v":"3/8\""},{"$f":"IF('Tex-280-F'!$C$45=\"\",\"\",'Tex-280-F'!$C$45)","v":"ELONGATED / FLAT or BOTH"},{"$f":"IF('Tex-280-F'!$E$46=\"\",\"\",'Tex-280-F'!$E$46)","v":"(%)"}]
[93,{"$f":"IF('Tex-280-F'!$F$50=\"\",\"\",'Tex-280-F'!$F$50)","v":0},{"$f":"IF('Tex-280-F'!$B$44=\"\",\"\",'Tex-280-F'!$B$44)","v":"5 to 1 RATIO"},{"$f":"IF('Tex-280-F'!$B$45=\"\",\"\",'Tex-280-F'!$B$45)","v":"Sieve Size"},{"$f":"IF('Tex-280-F'!$B$50=\"\",\"\",'Tex-280-F'!$B$50)","v":"3/8\""},{"$f":"IF('Tex-280-F'!$C$45=\"\",\"\",'Tex-280-F'!$C$45)","v":"ELONGATED / FLAT or BOTH"},{"$f":"IF('Tex-280-F'!$F$46=\"\",\"\",'Tex-280-F'!$F$46)","v":"Adjusted (%)"}]
[94,{"$f":"IF('Tex-280-F'!$G$50=\"\",\"\",'Tex-280-F'!$G$50)","v":""},{"$f":"IF('Tex-280-F'!$B$44=\"\",\"\",'Tex-280-F'!$B$44)","v":"5 to 1 RATIO"},{"$f":"IF('Tex-280-F'!$B$45=\"\",\"\",'Tex-280-F'!$B$45)","v":"Sieve Size"},{"$f":"IF('Tex-280-F'!$B$50=\"\",\"\",'Tex-280-F'!$B$50)","v":"3/8\""},{"$f":"IF('Tex-280-F'!$G$45=\"\",\"\",'Tex-280-F'!$G$45)","v":"NEITHER (passing)"},{"$f":"IF('Tex-280-F'!$G$46=\"\",\"\",'Tex-280-F'!$G$46)","v":"count"}]
[95,{"$f":"IF('Tex-280-F'!$H$50=\"\",\"\",'Tex-280-F'!$H$50)","v":""},{"$f":"IF('Tex-280-F'!$B$44=\"\",\"\",'Tex-280-F'!$B$44)","v":"5 to 1 RATIO"},{"$f":"IF('Tex-280-F'!$B$45=\"\",\"\",'Tex-280-F'!$B$45)","v":"Sieve Size"},{"$f":"IF('Tex-280-F'!$B$50=\"\",\"\",'Tex-280-F'!$B$50)","v":"3/8\""},{"$f":"IF('Tex-280-F'!$G$45=\"\",\"\",'Tex-280-F'!$G$45)","v":"NEITHER (passing)"},{"$f":"IF('Tex-280-F'!$H$46=\"\",\"\",'Tex-280-F'!$H$46)","v":"(g)"}]
[96,{"$f":"IF('Tex-280-F'!$I$50=\"\",\"\",'Tex-280-F'!$I$50)","v":0},{"$f":"IF('Tex-280-F'!$B$44=\"\",\"\",'Tex-280-F'!$B$44)","v":"5 to 1 RATIO"},{"$f":"IF('Tex-280-F'!$B$45=\"\",\"\",'Tex-280-F'!$B$45)","v":"Sieve Size"},{"$f":"IF('Tex-280-F'!$B$50=\"\",\"\",'Tex-280-F'!$B$50)","v":"3/8\""},{"$f":"IF('Tex-280-F'!$G$45=\"\",\"\",'Tex-280-F'!$G$45)","v":"NEITHER (passing)"},{"$f":"IF('Tex-280-F'!$I$46=\"\",\"\",'Tex-280-F'!$I$46)","v":"(%)"}]
[97,{"$f":"IF('Tex-280-F'!$C$51=\"\",\"\",'Tex-280-F'!$C$51)","v":""},{"$f":"IF('Tex-280-F'!$B$44=\"\",\"\",'Tex-280-F'!$B$44)","v":"5 to 1 RATIO"},{"$f":"IF('Tex-280-F'!$B$45=\"\",\"\",'Tex-280-F'!$B$45)","v":"Sieve Size"},{"$f":"IF('Tex-280-F'!$B$51=\"\",\"\",'Tex-280-F'!$B$51)","v":"No. 4"},{"$f":"IF('Tex-280-F'!$C$45=\"\",\"\",'Tex-280-F'!$C$45)","v":"ELONGATED / FLAT or BOTH"},{"$f":"IF('Tex-280-F'!$C$46=\"\",\"\",'Tex-280-F'!$C$46)","v":"count"}]
[98,{"$f":"IF('Tex-280-F'!$D$51=\"\",\"\",'Tex-280-F'!$D$51)","v":""},{"$f":"IF('Tex-280-F'!$B$44=\"\",\"\",'Tex-280-F'!$B$44)","v":"5 to 1 RATIO"},{"$f":"IF('Tex-280-F'!$B$45=\"\",\"\",'Tex-280-F'!$B$45)","v":"Sieve Size"},{"$f":"IF('Tex-280-F'!$B$51=\"\",\"\",'Tex-280-F'!$B$51)","v":"No. 4"},{"$f":"IF('Tex-280-F'!$C$45=\"\",\"\",'Tex-280-F'!$C$45)","v":"ELONGATED / FLAT or BOTH"},{"$f":"IF('Tex-280-F'!$D$46=\"\",\"\",'Tex-280-F'!$D$46)","v":"(g)"}]
[99,{"$f":"IF('Tex-280-F'!$E$51=\"\",\"\",'Tex-280-F'!$E$51)","v":0},{"$f":"IF('Tex-280-F'!$B$44=\"\",\"\",'Tex-280-F'!$B$44)","v":"5 to 1 RATIO"},{"$f":"IF('Tex-280-F'!$B$45=\"\",\"\",'Tex-280-F'!$B$45)","v":"Sieve Size"},{"$f":"IF('Tex-280-F'!$B$51=\"\",\"\",'Tex-280-F'!$B$51)","v":"No. 4"},{"$f":"IF('Tex-280-F'!$C$45=\"\",\"\",'Tex-280-F'!$C$45)","v":"ELONGATED / FLAT or BOTH"},{"$f":"IF('Tex-280-F'!$E$46=\"\",\"\",'Tex-280-F'!$E$46)","v":"(%)"}]
[100,{"$f":"IF('Tex-280-F'!$F$51=\"\",\"\",'Tex-280-F'!$F$51)","v":0},{"$f":"IF('Tex-280-F'!$B$44=\"\",\"\",'Tex-280-F'!$B$44)","v":"5 to 1 RATIO"},{"$f":"IF('Tex-280-F'!$B$45=\"\",\"\",'Tex-280-F'!$B$45)","v":"Sieve Size"},{"$f":"IF('Tex-280-F'!$B$51=\"\",\"\",'Tex-280-F'!$B$51)","v":"No. 4"},{"$f":"IF('Tex-280-F'!$C$45=\"\",\"\",'Tex-280-F'!$C$45)","v":"ELONGATED / FLAT or BOTH"},{"$f":"IF('Tex-280-F'!$F$46=\"\",\"\",'Tex-280-F'!$F$46)","v":"Adjusted (%)"}]
[101,{"$f":"IF('Tex-280-F'!$G$51=\"\",\"\",'Tex-280-F'!$G$51)","v":""},{"$f":"IF('Tex-280-F'!$B$44=\"\",\"\",'Tex-280-F'!$B$44)","v":"5 to 1 RATIO"},{"$f":"IF('Tex-280-F'!$B$45=\"\",\"\",'Tex-280-F'!$B$45)","v":"Sieve Size"},{"$f":"IF('Tex-280-F'!$B$51=\"\",\"\",'Tex-280-F'!$B$51)","v":"No. 4"},{"$f":"IF('Tex-280-F'!$G$45=\"\",\"\",'Tex-280-F'!$G$45)","v":"NEITHER (passing)"},{"$f":"IF('Tex-280-F'!$G$46=\"\",\"\",'Tex-280-F'!$G$46)","v":"count"}]
[102,{"$f":"IF('Tex-280-F'!$H$51=\"\",\"\",'Tex-280-F'!$H$51)","v":""},{"$f":"IF('Tex-280-F'!$B$44=\"\",\"\",'Tex-280-F'!$B$44)","v":"5 to 1 RATIO"},{"$f":"IF('Tex-280-F'!$B$45=\"\",\"\",'Tex-280-F'!$B$45)","v":"Sieve Size"},{"$f":"IF('Tex-280-F'!$B$51=\"\",\"\",'Tex-280-F'!$B$51)","v":"No. 4"},{"$f":"IF('Tex-280-F'!$G$45=\"\",\"\",'Tex-280-F'!$G$45)","v":"NEITHER (passing)"},{"$f":"IF('Tex-280-F'!$H$46=\"\",\"\",'Tex-280-F'!$H$46)","v":"(g)"}]
[103,{"$f":"IF('Tex-280-F'!$I$51=\"\",\"\",'Tex-280-F'!$I$51)","v":0},{"$f":"IF('Tex-280-F'!$B$44=\"\",\"\",'Tex-280-F'!$B$44)","v":"5 to 1 RATIO"},{"$f":"IF('Tex-280-F'!$B$45=\"\",\"\",'Tex-280-F'!$B$45)","v":"Sieve Size"},{"$f":"IF('Tex-280-F'!$B$51=\"\",\"\",'Tex-280-F'!$B$51)","v":"No. 4"},{"$f":"IF('Tex-280-F'!$G$45=\"\",\"\",'Tex-280-F'!$G$45)","v":"NEITHER (passing)"},{"$f":"IF('Tex-280-F'!$I$46=\"\",\"\",'Tex-280-F'!$I$46)","v":"(%)"}]
[104,{"$f":"IF('Tex-280-F'!$F$53=\"\",\"\",'Tex-280-F'!$F$53)","v":0},{"$f":"IF('Tex-280-F'!$B$44=\"\",\"\",'Tex-280-F'!$B$44)","v":"5 to 1 RATIO"},{"$f":"IF('Tex-280-F'!$D$53=\"\",\"\",'Tex-280-F'!$D$53)","v":"Adjusted Total Failing, %"}]
[105,{"$f":"IF('Tex-280-F'!$C$62=\"\",\"\",'Tex-280-F'!$C$62)","v":""},"Sampled By ",{"$f":"IF('Tex-280-F'!$B$62=\"\",\"\",'Tex-280-F'!$B$62)","v":"TX221"}]
[106,{"$f":"IF('Tex-280-F'!$F$62=\"\",\"\",'Tex-280-F'!$F$62)","v":""},"Sampled Date ",{"$f":"IF('Tex-280-F'!$B$62=\"\",\"\",'Tex-280-F'!$B$62)","v":"TX221"}]

{"sheet":"Revisions","index":2,"n_rows":4,"n_cols":4,"rows_kept":4,"cut":false,"hidden":true,"merged":[]}
["Date","Date","Changes","By"]
["2005-05-09",null,"Column E,I Formula change from F(ISERROR(D35/(+D35+H35)*100),0,D35/(+D35+H35)*100))  to  =IF(SpecYear=\"2004\",IF(ISERROR(C35/(+C35+G35)*100),0,C35/(+C35+G35)*100),IF(ISERROR(D35/(+D35+H35)*100),0,D35/(+D35+H35)*100))","Joe Liu"]
["2007-03-21",null,"adjust the conditional formatting in cells: C35:D39 & G35:H39 & C46:D50 & G46:H50 to account for the spec year.","Brett Haggerty"]
[null,"2024-08-06","Add 2024 spec","Syeda Rahman"]

{"sheet":"GRADATIONS","index":3,"n_rows":37,"n_cols":4,"rows_kept":37,"cut":false,"hidden":true,"merged":[[1,0,5,0]]}
["Grade","Diameter size mm","\"1993\" Sieve Size","\"1995\" Sieve Size"]
["GRADE 1",22.4,"7/8\"","22.4 mm"]
[null,16,"5/8\"","16 mm"]
[null,12.5,"1/2\"","12.5 mm"]
[null,9.5,"3/8\"","9.5 mm"]
[null,4.75,"No. 4","4.75 mm"]
[]
["Size","English","Metric","Selection"]
[152,"6\"","152 mm",{"$f":"IF(SpecYear=\"\",\"\",IF(SpecYear=\"1995\",C9,B9))","v":""}]
[76,"3\"","76 mm",""]
[63,"2-1/2\"","63 mm",""]
[50,"2\"","50 mm",""]
[45,"1-3/4\"","45 mm",""]
[37.5,"1-1/2\"","37.5 mm",""]
[31.5,"1-1/4\"","31.5 mm",""]
[25,"1\"","25 mm",""]
[22.4,"7/8\"","22.4 mm",""]
[19,"3/4\"","19 mm",""]
[16,"5/8\"","16 mm",""]
[12.5,"1/2\"","12.5 mm",""]
[11.2,"7/16\"","11.2 mm",""]
[9.5,"3/8\"","9.5 mm",""]
[8,"5/16\"","8 mm",""]
[6.3,"1/4\"","6.3 mm",""]
[4.75,"No. 4","4.75 mm",""]
[3.35,"No. 6","3.35 mm",""]
[2.36,"No. 8","2.36 mm",""]
[2,"No. 10","2 mm",""]
[1.4,"No. 14","1.4 mm",""]
[1.18,"No. 16","1.18 mm",""]
[0.85,"No. 20",".85 µm",""]
[0.6,"No. 30",".6 µm",""]
[0.42499999999999999,"No. 40",".425 µm",""]
[0.3,"No. 50",".3 µm",""]
[0.18,"No. 80",".18 µm",""]
[0.15,"No. 100",".15 µm",""]
[7.4999999999999997E-2,"No. 200",".075 µm",""]