{"text_format":"1","workbook":"xlsx","n_sheets":3,"sheets":["Tex-210,12,13,28,36-F","RX","spcyr"],"not_rendered":{"charts":0,"images":1,"macros":1,"external_links":0,"defined_names":139,"comments":1,"pivot_tables":0},"unopened":[],"bounds":{"document_bytes":16777216,"sheet_cells":100000,"rows_first":2000,"rows_last":500,"rows_between":2000,"halvings":0,"cell_chars":16384,"cell_head_chars":4096},"cells_cut":0,"cells_raw":0,"read":"whole","date_system":"1900"}

{"sheet":"Tex-210,12,13,28,36-F","index":0,"n_rows":99,"n_cols":11,"rows_kept":99,"cut":false,"hidden":false,"merged":[[93,2,93,4],[85,2,85,4],[78,2,78,4],[79,2,79,4],[0,0,0,1],[9,3,9,4],[7,3,7,4],[8,3,8,4],[69,1,69,3],[66,1,66,3],[62,1,62,3],[67,1,67,3],[64,1,64,3],[68,1,68,3],[65,1,65,3],[61,1,61,3],[16,3,16,4],[20,2,20,7],[49,3,49,5],[7,7,7,8],[8,7,8,8],[9,7,9,8],[15,3,15,8],[12,3,12,4],[10,3,10,4],[13,3,13,4],[10,7,10,8],[14,3,14,8],[11,7,11,8],[12,7,12,8],[13,7,13,8],[11,3,11,4],[39,2,39,5],[36,5,36,7],[48,3,48,5],[47,3,47,5],[37,5,37,7],[38,5,38,7],[45,3,45,5],[16,7,16,8],[99,1,99,3],[83,2,83,4],[87,2,87,4],[89,2,89,4],[91,2,91,4],[35,1,35,3],[55,3,55,6],[51,3,51,5],[53,3,53,5],[26,3,26,5],[27,3,27,5],[43,3,43,6],[38,1,38,3],[35,5,35,7],[42,3,42,6],[18,1,18,2],[28,3,28,5],[24,3,24,5],[25,3,25,5],[95,6,95,8],[95,1,95,3],[81,2,81,4],[57,1,57,3],[73,1,74,10],[75,1,75,10],[76,1,76,10],[80,2,80,4],[59,5,59,7],[60,5,60,7],[57,5,57,7],[58,5,58,7],[67,5,67,7],[60,1,60,3],[66,5,66,7],[22,4,22,5],[58,1,58,3],[61,5,61,7],[63,5,63,7],[65,5,65,7],[62,5,62,7],[59,1,59,3],[63,1,63,3],[30,3,30,5],[36,1,36,3],[37,1,37,3],[40,2,40,5],[39,6,39,7]]}
["TxDOT Manuals >",null,null,"Tex-210-F","Tex-212-F","Tex-213-F","Tex-236-F","Tex-228-F"]
[null,"TEXAS DEPARTMENT OF TRANSPORTATION",null,null,null,null,null,null,null,null,52]
[null,null,null,null,null,null,null,null,null,null,8]
[null,null,null,null,null,null,null,null,null,null,"tx2ac.xlsm::45574.595116"]
[null,"DETERMINATION OF MOISTURE, ASPHALT AND VOLATILE CONTENT"]
[null,"Tex-210, 12, 13, 28, 36-F"]
[null,null,null,null,null,null,null,null,{"$f":"\"File Version: \" & TEXT(MID(sn,SEARCH(\"::\",sn,1)+2,20),\"mm/dd/yy hh:mm:ss\")","v":"File Version: 10/09/24 14:16:58"}]
[null,null,"SAMPLE ID:",null,null,null,"SAMPLED DATE:"]
[null,null,"TEST NUMBER:",null,null,null,"LETTING DATE:"]
[null,null,"SAMPLE STATUS:",null,null,null,"CONTROLLING CSJ:"]
[null,null,"COUNTY:",null,null,null,"SPEC YEAR:"]
[null,null,"SAMPLED BY:",null,null,null,"SPEC ITEM:"]
[null,null,"SAMPLE LOCATION:",null,null,null,"SPECIAL PROVISION:"]
[null,null,"MATERIAL CODE:",null,null,null,"MIX TYPE:"]
[null,null,"MATERIAL NAME:"]
[null,null,"PRODUCER:",""]
[null,null,"AREA ENGINEER:",null,null,null,"PROJECT MANAGER:"]
[null,null,null,null,null," "]
[null,"COURSE\\LIFT:",null,null,"STATION:",null,"DIST. FROM CL:"]
[]
[null,null,"DETERMINATION OF MOISTURE CONTENT "]
[]
[null,null,null,"by:"]
[]
[null,null,null,{"$f":"IF(MoistureMethod=\"Tex-212-F: Part I\",\"Initial Weight of Pan & Sample (g):\",\"Still Number:\")","v":"Still Number:"}]
[null,null,null,{"$f":"IF(MoistureMethod=\"tex-212-f: Part I\",\"Pan Weight (g):\",\"Weight of Still & Sample (g):\")","v":"Weight of Still & Sample (g):"}]
[null,null,null,{"$f":"IF(MoistureMethod=\"tex-212-F: Part I\",\"Final Weight of Pan & Sample (g):\",\"Still Weight (g):\")","v":"Still Weight (g):"}]
[null,null,null,"Sample Weight (g):",null,null,{"$f":"IF(AND(G$26=\"\",G$27=\"\"),\"\",$G$26-$G$27)","v":""}]
[null,null,null,"Moisture Reading (mL):",null,null,null,"«– NOT VALID FOR PART I"]
[]
[null,null,null,"Moisture Content (%):",null,null,{"$f":"IF(ISERROR(IF(MoistureMethod=\"tex-212-f: Part I\",100*(($G$25-$G27)/($G$25-$G26)),100*($G$29/$G$28))),\"\",IF(MoistureMethod=\"tex-212-f: Part I\",100*(($G$25-$G27)/($G$25-$G26)),100*($G$29/$G$28)))","v":""}]
[]
[null,"DETERMINATION OF HYDROCARBON-VOLATILE CONTENT "]
[null,"Tex-213-F"]
[]
[null,"Still Number:",null,null,null,"Top Meniscus Reading (mL):"]
[null,"Weight of Still & Sample (g):",null,null,null,"Bottom Meniscus Reading (mL):"]
[null,"Still Weight (g):",null,null,null,"Volume of Volatiles (mL):",null,null,{"$f":"IF(OR(I36=\"\",I37=\"\"),\"\",I36-I37)","v":""}]
[null,"Sample Weight (g):",null,null,{"$f":"IF(OR(E37=\"\",E38=\"\"),\"\",E37-E38)","v":""},"Specific Gravity of Volatiles:"]
[]
[null,null,"Percent Hydrocarbon Volatiles (%):",null,null,null,{"$f":"IF(ISERROR(100*((I38*I39)/E39)),\"\",100*((I38*I39)/E39))","v":""}]
[]
[null,null,null,"DETERMINATION OF ASPHALT CONTENT "]
[null,null,"by:"]
[]
[null,null,null,"Asphalt Content (%):",null,null,null,{"$f":"\"«– NOT VALID FOR \" & ACMethod","v":"«– NOT VALID FOR "}]
[]
[null,null,null,"Gauge No.",null,null,null,{"$f":"\"«– Not valid for \" & ACMethod","v":"«– Not valid for "}]
[null,null,null,"Calibration Ref. Number:",null,null,null,{"$f":"\"«– Not valid for \" & ACMethod","v":"«– Not valid for "}]
[null,null,null,"Time:",null,null,null,{"$f":"\"«– Not valid for \" & ACMethod","v":"«– Not valid for "}]
[]
[null,null,null,"Asphalt Content, (%):",null,null,null,{"$f":"\"«– Not valid for \" & ACMethod","v":"«– Not valid for "}]
[]
[null,null,null,"Moisture Corrected Asphalt Content, (%):",null,null,{"$f":"IF(AND(ACNuclear=\"\",MoistureContent=\"\"),\"\",N(ACNuclear)-N(MoistureContent))","v":""}]
[]
[null,null,"by:",null,null,null,null,{"$f":"\"«– Not valid for \" & ACMethod","v":"«– Not valid for "}]
[]
[null,"Total Sample (g):",null,null,null,{"$f":"IF(ExtractedMethod=\"non-chlorinated centrifuge\",\"Buchner+Filter+Fines (g):\",\"Dish + Ash per 100mL (g):\")","v":"Dish + Ash per 100mL (g):"}]
[null,"Original Filter Paper (g):",null,null,null,{"$f":"IF(ExtractedMethod=\"non-chlorinated centrifuge\",\"Buchner + Filter (g):\",\"Dish (g):\")","v":"Dish (g):"}]
[null,"Final Filter Paper (g):",null,null,null,{"$f":"IF(ExtractedMethod=\"non-chlorinated centrifuge\",\"Fines per 200mL (g):\",\"Ash per 100mL (g):\")","v":"Ash per 100mL (g):"},null,null,{"$f":"IF(OR(I58=\"\",I59=\"\"),\"\",I58-I59)","v":""}]
[null,"Fines in Filter Paper (g):",null,null,{"$f":"IF(AND(E60=\"\",E59=\"\"),\"\",$E60-$E59)","v":""},"Total Solvent (mL):"]
[null,"Pan + Extracted Aggregate (g):",null,null,null,{"$f":"IF(ExtractedMethod=\"non-chlorinated centrifuge\",\"Total Fines (g):\",\"Total Ash (g):\")","v":"Total Ash (g):"},null,null,{"$f":"IF(ISERROR((I60*I61)/IF(ExtractedMethod=\"Non-Chlorinated Centrifuge\",200,100)),\"\",(I60*I61)/IF(ExtractedMethod=\"Non-Chlorinated Centrifuge\",200,100))","v":""}]
[null,"Pan (g):",null,null,null,"Filtering Aid (g):",null,null,null,{"$f":"\"«– Values not valid for \" & ACMethod","v":"«– Values not valid for "}]
[null,"Extracted Aggregate (g):",null,null,{"$f":"IF(AND(E62=\"\",E63=\"\"),\"\",$E62-$E63)","v":""},{"$f":"IF(ExtractedMethod=\"Vacuum\",\"Fines + Aggregate - Filter Aid (g):\",\"Fines + Aggregate + Ash (g):\")","v":"Fines + Aggregate + Ash (g):"},null,null,{"$f":"IF(ISERROR(+E61+E64+IF(ExtractedMethod=\"Vacuum\",-I63,I62)),\"\",+E61+E64+IF(ExtractedMethod=\"Vacuum\",-I63,I62))","v":""}]
[]
[null,"Total Loss (g):",null,null,{"$f":"IF(ISERROR(+E58-I64),\"\",+E58-I64)","v":""},"Total Loss (%):",null,null,{"$f":"IF(ISERROR(E66/E58*100),\"\",E66/E58*100)","v":""}]
[null,"Moisture Content (%):",null,null,{"$f":"+MoistureContent","v":""},"Hydrocarbon Volatiles (%):",null,null,{"$f":"VolatileValue","v":""}]
[null,"Retention Factor (%):",null,null,null,"Asphalt Content (%):",null,null,{"$f":"IF(ISERROR($I66-$E67-$I67+$E68),\"\",$I66-$E67-$I67+$E68)","v":""}]
[]
[null,"Percent of Dry Aggregate (%):",null,null,{"$f":"IF(ISERROR(I64/E58*100-E68),\"\",I64/E58*100-E68)","v":""}]
[null,null,null,"Total:",{"$f":"IF(OR(E67<>\"\",I67<>\"\",I68<>\"\",E70<>\"\"),SUM(E67,I67,I68,E70),\"\")","v":""}]
[]
[null,"Remarks:",{"$f":"NOW()","v":"2024-10-09T14:16:58.710"}]
[]
[]
[]
[]
[]
[null,"Sample Method:","Sampled By:",null,null,"Sampled Date:"]
[null,"TX222"]
[null,"Test Method:","Tested By:",null,null,"Tested Date:"]
[null,"TX210"]
[]
[null,"TX212"]
[]
[null,"TX212PII"]
[]
[null,"TX213"]
[]
[null,"TX228"]
[]
[null,"TX236"]
[]
[null,"TX236PI"]
[null,"Test Stamp Code:",null,null,"Omit Test:","Completed Date:","Reviewed By:"]
[]
[null,"Locked By:","TxDOT:","District:","Area:"]
[null,"","","",""]
[null,"Authorized By:",null,null,"Authorized Date:"]

{"sheet":"RX","index":1,"n_rows":63,"n_cols":9,"rows_kept":63,"cut":false,"hidden":false,"merged":[]}
[61]
["Fld_nbr","Value","Desc_1","Desc_2","Desc_3","Desc_4","Desc_5","Desc_6","Desc_7"]
[1,{"$f":"IF('Tex-210,12,13,28,36-F'!$B$74=\"\",\"\",'Tex-210,12,13,28,36-F'!$B$74)","v":""},{"$f":"IF('Tex-210,12,13,28,36-F'!$B$73=\"\",\"\",'Tex-210,12,13,28,36-F'!$B$73)","v":"Remarks:"}]
[2,{"$f":"IF('Tex-210,12,13,28,36-F'!$D$19=\"\",\"\",'Tex-210,12,13,28,36-F'!$D$19)","v":""},{"$f":"IF('Tex-210,12,13,28,36-F'!$B$19=\"\",\"\",'Tex-210,12,13,28,36-F'!$B$19)","v":"COURSE\\LIFT:"}]
[3,{"$f":"IF('Tex-210,12,13,28,36-F'!$C$82=\"\",\"\",'Tex-210,12,13,28,36-F'!$C$82)","v":""},"Tested By",{"$f":"IF('Tex-210,12,13,28,36-F'!$B$82=\"\",\"\",'Tex-210,12,13,28,36-F'!$B$82)","v":"TX210"}]
[4,{"$f":"IF('Tex-210,12,13,28,36-F'!$F$82=\"\",\"\",'Tex-210,12,13,28,36-F'!$F$82)","v":""},"Tested Date",{"$f":"IF('Tex-210,12,13,28,36-F'!$B$82=\"\",\"\",'Tex-210,12,13,28,36-F'!$B$82)","v":"TX210"}]
[5,{"$f":"IF('Tex-210,12,13,28,36-F'!$C$84=\"\",\"\",'Tex-210,12,13,28,36-F'!$C$84)","v":""},"Tested By",{"$f":"IF('Tex-210,12,13,28,36-F'!$B$84=\"\",\"\",'Tex-210,12,13,28,36-F'!$B$84)","v":"TX212"}]
[6,{"$f":"IF('Tex-210,12,13,28,36-F'!$F$84=\"\",\"\",'Tex-210,12,13,28,36-F'!$F$84)","v":""},"Tested Date",{"$f":"IF('Tex-210,12,13,28,36-F'!$B$84=\"\",\"\",'Tex-210,12,13,28,36-F'!$B$84)","v":"TX212"}]
[7,{"$f":"IF('Tex-210,12,13,28,36-F'!$C$88=\"\",\"\",'Tex-210,12,13,28,36-F'!$C$88)","v":""},"Tested By",{"$f":"IF('Tex-210,12,13,28,36-F'!$B$88=\"\",\"\",'Tex-210,12,13,28,36-F'!$B$88)","v":"TX213"}]
[8,{"$f":"IF('Tex-210,12,13,28,36-F'!$F$88=\"\",\"\",'Tex-210,12,13,28,36-F'!$F$88)","v":""},"Tested Date",{"$f":"IF('Tex-210,12,13,28,36-F'!$B$88=\"\",\"\",'Tex-210,12,13,28,36-F'!$B$88)","v":"TX213"}]
[9,{"$f":"IF('Tex-210,12,13,28,36-F'!$C$90=\"\",\"\",'Tex-210,12,13,28,36-F'!$C$90)","v":""},"Tested By",{"$f":"IF('Tex-210,12,13,28,36-F'!$B$90=\"\",\"\",'Tex-210,12,13,28,36-F'!$B$90)","v":"TX228"}]
[10,{"$f":"IF('Tex-210,12,13,28,36-F'!$F$90=\"\",\"\",'Tex-210,12,13,28,36-F'!$F$90)","v":""},"Tested Date",{"$f":"IF('Tex-210,12,13,28,36-F'!$B$90=\"\",\"\",'Tex-210,12,13,28,36-F'!$B$90)","v":"TX228"}]
[11,{"$f":"IF('Tex-210,12,13,28,36-F'!$C$92=\"\",\"\",'Tex-210,12,13,28,36-F'!$C$92)","v":""},"Tested By",{"$f":"IF('Tex-210,12,13,28,36-F'!$B$92=\"\",\"\",'Tex-210,12,13,28,36-F'!$B$92)","v":"TX236"}]
[12,{"$f":"IF('Tex-210,12,13,28,36-F'!$F$92=\"\",\"\",'Tex-210,12,13,28,36-F'!$F$92)","v":""},"Tested Date",{"$f":"IF('Tex-210,12,13,28,36-F'!$B$92=\"\",\"\",'Tex-210,12,13,28,36-F'!$B$92)","v":"TX236"}]
[13,{"$f":"IF('Tex-210,12,13,28,36-F'!$G$25=\"\",\"\",'Tex-210,12,13,28,36-F'!$G$25)","v":""},{"$f":"IF('Tex-210,12,13,28,36-F'!$E$23=\"\",\"\",'Tex-210,12,13,28,36-F'!$E$23)","v":""},{"$f":"IF('Tex-210,12,13,28,36-F'!$D$25=\"\",\"\",'Tex-210,12,13,28,36-F'!$D$25)","v":"Still Number:"}]
[14,{"$f":"IF('Tex-210,12,13,28,36-F'!$G$26=\"\",\"\",'Tex-210,12,13,28,36-F'!$G$26)","v":""},{"$f":"IF('Tex-210,12,13,28,36-F'!$E$23=\"\",\"\",'Tex-210,12,13,28,36-F'!$E$23)","v":""},{"$f":"IF('Tex-210,12,13,28,36-F'!$D$26=\"\",\"\",'Tex-210,12,13,28,36-F'!$D$26)","v":"Weight of Still & Sample (g):"}]
[15,{"$f":"IF('Tex-210,12,13,28,36-F'!$G$27=\"\",\"\",'Tex-210,12,13,28,36-F'!$G$27)","v":""},{"$f":"IF('Tex-210,12,13,28,36-F'!$E$23=\"\",\"\",'Tex-210,12,13,28,36-F'!$E$23)","v":""},{"$f":"IF('Tex-210,12,13,28,36-F'!$D$27=\"\",\"\",'Tex-210,12,13,28,36-F'!$D$27)","v":"Still Weight (g):"}]
[16,{"$f":"IF('Tex-210,12,13,28,36-F'!$G$28=\"\",\"\",'Tex-210,12,13,28,36-F'!$G$28)","v":""},{"$f":"IF('Tex-210,12,13,28,36-F'!$E$23=\"\",\"\",'Tex-210,12,13,28,36-F'!$E$23)","v":""},{"$f":"IF('Tex-210,12,13,28,36-F'!$D$28=\"\",\"\",'Tex-210,12,13,28,36-F'!$D$28)","v":"Sample Weight (g):"}]
[17,{"$f":"IF('Tex-210,12,13,28,36-F'!$G$29=\"\",\"\",'Tex-210,12,13,28,36-F'!$G$29)","v":""},{"$f":"IF('Tex-210,12,13,28,36-F'!$E$23=\"\",\"\",'Tex-210,12,13,28,36-F'!$E$23)","v":""},{"$f":"IF('Tex-210,12,13,28,36-F'!$D$29=\"\",\"\",'Tex-210,12,13,28,36-F'!$D$29)","v":"Moisture Reading (mL):"}]
[18,{"$f":"IF('Tex-210,12,13,28,36-F'!$G$31=\"\",\"\",'Tex-210,12,13,28,36-F'!$G$31)","v":""},{"$f":"IF('Tex-210,12,13,28,36-F'!$E$23=\"\",\"\",'Tex-210,12,13,28,36-F'!$E$23)","v":""},{"$f":"IF('Tex-210,12,13,28,36-F'!$D$31=\"\",\"\",'Tex-210,12,13,28,36-F'!$D$31)","v":"Moisture Content (%):"}]
[19,{"$f":"IF('Tex-210,12,13,28,36-F'!$E$36=\"\",\"\",'Tex-210,12,13,28,36-F'!$E$36)","v":""},{"$f":"IF('Tex-210,12,13,28,36-F'!$B$34=\"\",\"\",'Tex-210,12,13,28,36-F'!$B$34)","v":"Tex-213-F"},{"$f":"IF('Tex-210,12,13,28,36-F'!$B$36=\"\",\"\",'Tex-210,12,13,28,36-F'!$B$36)","v":"Still Number:"}]
[20,{"$f":"IF('Tex-210,12,13,28,36-F'!$E$37=\"\",\"\",'Tex-210,12,13,28,36-F'!$E$37)","v":""},{"$f":"IF('Tex-210,12,13,28,36-F'!$B$34=\"\",\"\",'Tex-210,12,13,28,36-F'!$B$34)","v":"Tex-213-F"},{"$f":"IF('Tex-210,12,13,28,36-F'!$B$37=\"\",\"\",'Tex-210,12,13,28,36-F'!$B$37)","v":"Weight of Still & Sample (g):"}]
[21,{"$f":"IF('Tex-210,12,13,28,36-F'!$E$38=\"\",\"\",'Tex-210,12,13,28,36-F'!$E$38)","v":""},{"$f":"IF('Tex-210,12,13,28,36-F'!$B$34=\"\",\"\",'Tex-210,12,13,28,36-F'!$B$34)","v":"Tex-213-F"},{"$f":"IF('Tex-210,12,13,28,36-F'!$B$38=\"\",\"\",'Tex-210,12,13,28,36-F'!$B$38)","v":"Still Weight (g):"}]
[22,{"$f":"IF('Tex-210,12,13,28,36-F'!$E$39=\"\",\"\",'Tex-210,12,13,28,36-F'!$E$39)","v":""},{"$f":"IF('Tex-210,12,13,28,36-F'!$B$34=\"\",\"\",'Tex-210,12,13,28,36-F'!$B$34)","v":"Tex-213-F"},{"$f":"IF('Tex-210,12,13,28,36-F'!$B$39=\"\",\"\",'Tex-210,12,13,28,36-F'!$B$39)","v":"Sample Weight (g):"}]
[23,{"$f":"IF('Tex-210,12,13,28,36-F'!$I$36=\"\",\"\",'Tex-210,12,13,28,36-F'!$I$36)","v":""},{"$f":"IF('Tex-210,12,13,28,36-F'!$B$34=\"\",\"\",'Tex-210,12,13,28,36-F'!$B$34)","v":"Tex-213-F"},{"$f":"IF('Tex-210,12,13,28,36-F'!$F$36=\"\",\"\",'Tex-210,12,13,28,36-F'!$F$36)","v":"Top Meniscus Reading (mL):"}]
[24,{"$f":"IF('Tex-210,12,13,28,36-F'!$I$37=\"\",\"\",'Tex-210,12,13,28,36-F'!$I$37)","v":""},{"$f":"IF('Tex-210,12,13,28,36-F'!$B$34=\"\",\"\",'Tex-210,12,13,28,36-F'!$B$34)","v":"Tex-213-F"},{"$f":"IF('Tex-210,12,13,28,36-F'!$F$37=\"\",\"\",'Tex-210,12,13,28,36-F'!$F$37)","v":"Bottom Meniscus Reading (mL):"}]
[25,{"$f":"IF('Tex-210,12,13,28,36-F'!$I$38=\"\",\"\",'Tex-210,12,13,28,36-F'!$I$38)","v":""},{"$f":"IF('Tex-210,12,13,28,36-F'!$B$34=\"\",\"\",'Tex-210,12,13,28,36-F'!$B$34)","v":"Tex-213-F"},{"$f":"IF('Tex-210,12,13,28,36-F'!$F$38=\"\",\"\",'Tex-210,12,13,28,36-F'!$F$38)","v":"Volume of Volatiles (mL):"}]
[26,{"$f":"IF('Tex-210,12,13,28,36-F'!$I$39=\"\",\"\",'Tex-210,12,13,28,36-F'!$I$39)","v":""},{"$f":"IF('Tex-210,12,13,28,36-F'!$B$34=\"\",\"\",'Tex-210,12,13,28,36-F'!$B$34)","v":"Tex-213-F"},{"$f":"IF('Tex-210,12,13,28,36-F'!$F$39=\"\",\"\",'Tex-210,12,13,28,36-F'!$F$39)","v":"Specific Gravity of Volatiles:"}]
[27,{"$f":"IF('Tex-210,12,13,28,36-F'!$G$41=\"\",\"\",'Tex-210,12,13,28,36-F'!$G$41)","v":""},{"$f":"IF('Tex-210,12,13,28,36-F'!$B$34=\"\",\"\",'Tex-210,12,13,28,36-F'!$B$34)","v":"Tex-213-F"},{"$f":"IF('Tex-210,12,13,28,36-F'!$C$41=\"\",\"\",'Tex-210,12,13,28,36-F'!$C$41)","v":"Percent Hydrocarbon Volatiles (%):"}]
[28,{"$f":"IF('Tex-210,12,13,28,36-F'!$G$46=\"\",\"\",'Tex-210,12,13,28,36-F'!$G$46)","v":""},{"$f":"IF('Tex-210,12,13,28,36-F'!$D$44=\"\",\"\",'Tex-210,12,13,28,36-F'!$D$44)","v":""},{"$f":"IF('Tex-210,12,13,28,36-F'!$D$46=\"\",\"\",'Tex-210,12,13,28,36-F'!$D$46)","v":"Asphalt Content (%):"}]
[29,{"$f":"IF('Tex-210,12,13,28,36-F'!$G$48=\"\",\"\",'Tex-210,12,13,28,36-F'!$G$48)","v":""},{"$f":"IF('Tex-210,12,13,28,36-F'!$D$44=\"\",\"\",'Tex-210,12,13,28,36-F'!$D$44)","v":""},{"$f":"IF('Tex-210,12,13,28,36-F'!$D$48=\"\",\"\",'Tex-210,12,13,28,36-F'!$D$48)","v":"Gauge No."}]
[30,{"$f":"IF('Tex-210,12,13,28,36-F'!$G$49=\"\",\"\",'Tex-210,12,13,28,36-F'!$G$49)","v":""},{"$f":"IF('Tex-210,12,13,28,36-F'!$D$44=\"\",\"\",'Tex-210,12,13,28,36-F'!$D$44)","v":""},{"$f":"IF('Tex-210,12,13,28,36-F'!$D$49=\"\",\"\",'Tex-210,12,13,28,36-F'!$D$49)","v":"Calibration Ref. Number:"}]
[31,{"$f":"IF('Tex-210,12,13,28,36-F'!$G$50=\"\",\"\",'Tex-210,12,13,28,36-F'!$G$50)","v":""},{"$f":"IF('Tex-210,12,13,28,36-F'!$D$44=\"\",\"\",'Tex-210,12,13,28,36-F'!$D$44)","v":""},{"$f":"IF('Tex-210,12,13,28,36-F'!$D$50=\"\",\"\",'Tex-210,12,13,28,36-F'!$D$50)","v":"Time:"}]
[32,{"$f":"IF('Tex-210,12,13,28,36-F'!$G$52=\"\",\"\",'Tex-210,12,13,28,36-F'!$G$52)","v":""},{"$f":"IF('Tex-210,12,13,28,36-F'!$D$44=\"\",\"\",'Tex-210,12,13,28,36-F'!$D$44)","v":""},{"$f":"IF('Tex-210,12,13,28,36-F'!$D$52=\"\",\"\",'Tex-210,12,13,28,36-F'!$D$52)","v":"Asphalt Content, (%):"}]
[33,{"$f":"IF('Tex-210,12,13,28,36-F'!$G$54=\"\",\"\",'Tex-210,12,13,28,36-F'!$G$54)","v":""},{"$f":"IF('Tex-210,12,13,28,36-F'!$D$44=\"\",\"\",'Tex-210,12,13,28,36-F'!$D$44)","v":""},{"$f":"IF('Tex-210,12,13,28,36-F'!$D$54=\"\",\"\",'Tex-210,12,13,28,36-F'!$D$54)","v":"Moisture Corrected Asphalt Content, (%):"}]
[34,{"$f":"IF('Tex-210,12,13,28,36-F'!$E$58=\"\",\"\",'Tex-210,12,13,28,36-F'!$E$58)","v":""},{"$f":"IF('Tex-210,12,13,28,36-F'!$D$56=\"\",\"\",'Tex-210,12,13,28,36-F'!$D$56)","v":""},{"$f":"IF('Tex-210,12,13,28,36-F'!$B$58=\"\",\"\",'Tex-210,12,13,28,36-F'!$B$58)","v":"Total Sample (g):"}]
[35,{"$f":"IF('Tex-210,12,13,28,36-F'!$E$59=\"\",\"\",'Tex-210,12,13,28,36-F'!$E$59)","v":""},{"$f":"IF('Tex-210,12,13,28,36-F'!$D$56=\"\",\"\",'Tex-210,12,13,28,36-F'!$D$56)","v":""},{"$f":"IF('Tex-210,12,13,28,36-F'!$B$59=\"\",\"\",'Tex-210,12,13,28,36-F'!$B$59)","v":"Original Filter Paper (g):"}]
[36,{"$f":"IF('Tex-210,12,13,28,36-F'!$E$60=\"\",\"\",'Tex-210,12,13,28,36-F'!$E$60)","v":""},{"$f":"IF('Tex-210,12,13,28,36-F'!$D$56=\"\",\"\",'Tex-210,12,13,28,36-F'!$D$56)","v":""},{"$f":"IF('Tex-210,12,13,28,36-F'!$B$60=\"\",\"\",'Tex-210,12,13,28,36-F'!$B$60)","v":"Final Filter Paper (g):"}]
[37,{"$f":"IF('Tex-210,12,13,28,36-F'!$E$61=\"\",\"\",'Tex-210,12,13,28,36-F'!$E$61)","v":""},{"$f":"IF('Tex-210,12,13,28,36-F'!$D$56=\"\",\"\",'Tex-210,12,13,28,36-F'!$D$56)","v":""},{"$f":"IF('Tex-210,12,13,28,36-F'!$B$61=\"\",\"\",'Tex-210,12,13,28,36-F'!$B$61)","v":"Fines in Filter Paper (g):"}]
[38,{"$f":"IF('Tex-210,12,13,28,36-F'!$E$62=\"\",\"\",'Tex-210,12,13,28,36-F'!$E$62)","v":""},{"$f":"IF('Tex-210,12,13,28,36-F'!$D$56=\"\",\"\",'Tex-210,12,13,28,36-F'!$D$56)","v":""},{"$f":"IF('Tex-210,12,13,28,36-F'!$B$62=\"\",\"\",'Tex-210,12,13,28,36-F'!$B$62)","v":"Pan + Extracted Aggregate (g):"}]
[39,{"$f":"IF('Tex-210,12,13,28,36-F'!$E$63=\"\",\"\",'Tex-210,12,13,28,36-F'!$E$63)","v":""},{"$f":"IF('Tex-210,12,13,28,36-F'!$D$56=\"\",\"\",'Tex-210,12,13,28,36-F'!$D$56)","v":""},{"$f":"IF('Tex-210,12,13,28,36-F'!$B$63=\"\",\"\",'Tex-210,12,13,28,36-F'!$B$63)","v":"Pan (g):"}]
[40,{"$f":"IF('Tex-210,12,13,28,36-F'!$E$64=\"\",\"\",'Tex-210,12,13,28,36-F'!$E$64)","v":""},{"$f":"IF('Tex-210,12,13,28,36-F'!$D$56=\"\",\"\",'Tex-210,12,13,28,36-F'!$D$56)","v":""},{"$f":"IF('Tex-210,12,13,28,36-F'!$B$64=\"\",\"\",'Tex-210,12,13,28,36-F'!$B$64)","v":"Extracted Aggregate (g):"}]
[41,{"$f":"IF('Tex-210,12,13,28,36-F'!$I$58=\"\",\"\",'Tex-210,12,13,28,36-F'!$I$58)","v":""},{"$f":"IF('Tex-210,12,13,28,36-F'!$D$56=\"\",\"\",'Tex-210,12,13,28,36-F'!$D$56)","v":""},{"$f":"IF('Tex-210,12,13,28,36-F'!$F$58=\"\",\"\",'Tex-210,12,13,28,36-F'!$F$58)","v":"Dish + Ash per 100mL (g):"}]
[42,{"$f":"IF('Tex-210,12,13,28,36-F'!$I$59=\"\",\"\",'Tex-210,12,13,28,36-F'!$I$59)","v":""},{"$f":"IF('Tex-210,12,13,28,36-F'!$D$56=\"\",\"\",'Tex-210,12,13,28,36-F'!$D$56)","v":""},{"$f":"IF('Tex-210,12,13,28,36-F'!$F$59=\"\",\"\",'Tex-210,12,13,28,36-F'!$F$59)","v":"Dish (g):"}]
[43,{"$f":"IF('Tex-210,12,13,28,36-F'!$I$60=\"\",\"\",'Tex-210,12,13,28,36-F'!$I$60)","v":""},{"$f":"IF('Tex-210,12,13,28,36-F'!$D$56=\"\",\"\",'Tex-210,12,13,28,36-F'!$D$56)","v":""},{"$f":"IF('Tex-210,12,13,28,36-F'!$F$60=\"\",\"\",'Tex-210,12,13,28,36-F'!$F$60)","v":"Ash per 100mL (g):"}]
[44,{"$f":"IF('Tex-210,12,13,28,36-F'!$I$61=\"\",\"\",'Tex-210,12,13,28,36-F'!$I$61)","v":""},{"$f":"IF('Tex-210,12,13,28,36-F'!$D$56=\"\",\"\",'Tex-210,12,13,28,36-F'!$D$56)","v":""},{"$f":"IF('Tex-210,12,13,28,36-F'!$F$61=\"\",\"\",'Tex-210,12,13,28,36-F'!$F$61)","v":"Total Solvent (mL):"}]
[45,{"$f":"IF('Tex-210,12,13,28,36-F'!$I$62=\"\",\"\",'Tex-210,12,13,28,36-F'!$I$62)","v":""},{"$f":"IF('Tex-210,12,13,28,36-F'!$D$56=\"\",\"\",'Tex-210,12,13,28,36-F'!$D$56)","v":""},{"$f":"IF('Tex-210,12,13,28,36-F'!$F$62=\"\",\"\",'Tex-210,12,13,28,36-F'!$F$62)","v":"Total Ash (g):"}]
[46,{"$f":"IF('Tex-210,12,13,28,36-F'!$I$63=\"\",\"\",'Tex-210,12,13,28,36-F'!$I$63)","v":""},{"$f":"IF('Tex-210,12,13,28,36-F'!$D$56=\"\",\"\",'Tex-210,12,13,28,36-F'!$D$56)","v":""},{"$f":"IF('Tex-210,12,13,28,36-F'!$F$63=\"\",\"\",'Tex-210,12,13,28,36-F'!$F$63)","v":"Filtering Aid (g):"}]
[47,{"$f":"IF('Tex-210,12,13,28,36-F'!$I$64=\"\",\"\",'Tex-210,12,13,28,36-F'!$I$64)","v":""},{"$f":"IF('Tex-210,12,13,28,36-F'!$D$56=\"\",\"\",'Tex-210,12,13,28,36-F'!$D$56)","v":""},{"$f":"IF('Tex-210,12,13,28,36-F'!$F$64=\"\",\"\",'Tex-210,12,13,28,36-F'!$F$64)","v":"Fines + Aggregate + Ash (g):"}]
[48,{"$f":"IF('Tex-210,12,13,28,36-F'!$E$66=\"\",\"\",'Tex-210,12,13,28,36-F'!$E$66)","v":""},{"$f":"IF('Tex-210,12,13,28,36-F'!$D$56=\"\",\"\",'Tex-210,12,13,28,36-F'!$D$56)","v":""},{"$f":"IF('Tex-210,12,13,28,36-F'!$B$66=\"\",\"\",'Tex-210,12,13,28,36-F'!$B$66)","v":"Total Loss (g):"}]
[49,{"$f":"IF('Tex-210,12,13,28,36-F'!$E$67=\"\",\"\",'Tex-210,12,13,28,36-F'!$E$67)","v":""},{"$f":"IF('Tex-210,12,13,28,36-F'!$D$56=\"\",\"\",'Tex-210,12,13,28,36-F'!$D$56)","v":""},{"$f":"IF('Tex-210,12,13,28,36-F'!$B$67=\"\",\"\",'Tex-210,12,13,28,36-F'!$B$67)","v":"Moisture Content (%):"}]
[50,{"$f":"IF('Tex-210,12,13,28,36-F'!$E$68=\"\",\"\",'Tex-210,12,13,28,36-F'!$E$68)","v":""},{"$f":"IF('Tex-210,12,13,28,36-F'!$D$56=\"\",\"\",'Tex-210,12,13,28,36-F'!$D$56)","v":""},{"$f":"IF('Tex-210,12,13,28,36-F'!$B$68=\"\",\"\",'Tex-210,12,13,28,36-F'!$B$68)","v":"Retention Factor (%):"}]
[51,{"$f":"IF('Tex-210,12,13,28,36-F'!$I$66=\"\",\"\",'Tex-210,12,13,28,36-F'!$I$66)","v":""},{"$f":"IF('Tex-210,12,13,28,36-F'!$D$56=\"\",\"\",'Tex-210,12,13,28,36-F'!$D$56)","v":""},{"$f":"IF('Tex-210,12,13,28,36-F'!$F$66=\"\",\"\",'Tex-210,12,13,28,36-F'!$F$66)","v":"Total Loss (%):"}]
[52,{"$f":"IF('Tex-210,12,13,28,36-F'!$I$67=\"\",\"\",'Tex-210,12,13,28,36-F'!$I$67)","v":""},{"$f":"IF('Tex-210,12,13,28,36-F'!$D$56=\"\",\"\",'Tex-210,12,13,28,36-F'!$D$56)","v":""},{"$f":"IF('Tex-210,12,13,28,36-F'!$F$67=\"\",\"\",'Tex-210,12,13,28,36-F'!$F$67)","v":"Hydrocarbon Volatiles (%):"}]
[53,{"$f":"IF('Tex-210,12,13,28,36-F'!$I$68=\"\",\"\",'Tex-210,12,13,28,36-F'!$I$68)","v":""},{"$f":"IF('Tex-210,12,13,28,36-F'!$D$56=\"\",\"\",'Tex-210,12,13,28,36-F'!$D$56)","v":""},{"$f":"IF('Tex-210,12,13,28,36-F'!$F$68=\"\",\"\",'Tex-210,12,13,28,36-F'!$F$68)","v":"Asphalt Content (%):"}]
[54,{"$f":"IF('Tex-210,12,13,28,36-F'!$E$70=\"\",\"\",'Tex-210,12,13,28,36-F'!$E$70)","v":""},{"$f":"IF('Tex-210,12,13,28,36-F'!$D$56=\"\",\"\",'Tex-210,12,13,28,36-F'!$D$56)","v":""},{"$f":"IF('Tex-210,12,13,28,36-F'!$B$70=\"\",\"\",'Tex-210,12,13,28,36-F'!$B$70)","v":"Percent of Dry Aggregate (%):"}]
[55,{"$f":"IF('Tex-210,12,13,28,36-F'!$E$71=\"\",\"\",'Tex-210,12,13,28,36-F'!$E$71)","v":""},{"$f":"IF('Tex-210,12,13,28,36-F'!$D$56=\"\",\"\",'Tex-210,12,13,28,36-F'!$D$56)","v":""},{"$f":"IF('Tex-210,12,13,28,36-F'!$D$71=\"\",\"\",'Tex-210,12,13,28,36-F'!$D$71)","v":"Total:"}]
[56,{"$f":"IF('Tex-210,12,13,28,36-F'!$C$80=\"\",\"\",'Tex-210,12,13,28,36-F'!$C$80)","v":""},"Sampled By",{"$f":"IF('Tex-210,12,13,28,36-F'!$B$80=\"\",\"\",'Tex-210,12,13,28,36-F'!$B$80)","v":"TX222"}]
[57,{"$f":"IF('Tex-210,12,13,28,36-F'!$F$80=\"\",\"\",'Tex-210,12,13,28,36-F'!$F$80)","v":""},"Sampled Date",{"$f":"IF('Tex-210,12,13,28,36-F'!$B$80=\"\",\"\",'Tex-210,12,13,28,36-F'!$B$80)","v":"TX222"}]
[58,{"$f":"IF('Tex-210,12,13,28,36-F'!$C$86=\"\",\"\",'Tex-210,12,13,28,36-F'!$C$86)","v":""},"Tested By",{"$f":"IF('Tex-210,12,13,28,36-F'!$B$86=\"\",\"\",'Tex-210,12,13,28,36-F'!$B$86)","v":"TX212PII"}]
[59,{"$f":"IF('Tex-210,12,13,28,36-F'!$F$86=\"\",\"\",'Tex-210,12,13,28,36-F'!$F$86)","v":""},"Tested Date",{"$f":"IF('Tex-210,12,13,28,36-F'!$B$86=\"\",\"\",'Tex-210,12,13,28,36-F'!$B$86)","v":"TX212PII"}]
[60,{"$f":"IF('Tex-210,12,13,28,36-F'!$C$94=\"\",\"\",'Tex-210,12,13,28,36-F'!$C$94)","v":""},"Tested By",{"$f":"IF('Tex-210,12,13,28,36-F'!$B$94=\"\",\"\",'Tex-210,12,13,28,36-F'!$B$94)","v":"TX236PI"}]
[61,{"$f":"IF('Tex-210,12,13,28,36-F'!$F$94=\"\",\"\",'Tex-210,12,13,28,36-F'!$F$94)","v":""},"Tested Date",{"$f":"IF('Tex-210,12,13,28,36-F'!$B$94=\"\",\"\",'Tex-210,12,13,28,36-F'!$B$94)","v":"TX236PI"}]

{"sheet":"spcyr","index":2,"n_rows":17,"n_cols":4,"rows_kept":17,"cut":false,"hidden":false,"merged":[]}
["spec1993","spec1995","spec2004","spec2024"]
[null,null,"A","B"]
[null,null,"B","C"]
[null,null,"C","D"]
[null,null,"D","F"]
[null,null,"F","SP-B"]
[null,null,"SP-A","SP-C"]
[null,null,"SP-B","SP-D"]
[null,null,"SP-C","SMA-C"]
[null,null,"SP-D","SMA-D"]
[null,null,"CMHB-C","SMA-F"]
[null,null,"CMHB-F","SMAR-F"]
[null,null,"SMA-C"]
[null,null,"SMA-D"]
[null,null,"SMA-F"]
[null,null,"SMAR-C"]
[null,null,"SMAR-F"]