{"text_format":"1","workbook":"xlsx","n_sheets":5,"sheets":["Tex-229-F","Power 45 Curve","RX","MDV","spcyr"],"not_rendered":{"charts":2,"images":1,"macros":1,"external_links":0,"defined_names":334,"comments":1,"pivot_tables":0},"unopened":[{"sheet":"Power 45 Curve","index":1,"reason":"not_a_worksheet"}],"bounds":{"document_bytes":16777216,"sheet_cells":100000,"rows_first":2000,"rows_last":500,"rows_between":2000,"halvings":0,"cell_chars":16384,"cell_head_chars":4096},"cells_cut":0,"cells_raw":0,"read":"whole","date_system":"1900"}

{"sheet":"Tex-229-F","index":0,"n_rows":83,"n_cols":27,"rows_kept":83,"cut":false,"hidden":false,"merged":[[69,1,69,27],[62,26,62,27],[39,20,39,22],[39,23,39,25],[55,18,55,25],[56,18,56,25],[52,18,52,25],[55,4,55,5],[56,4,56,5],[59,4,59,5],[56,1,56,3],[67,1,68,27],[50,18,50,25],[59,8,59,9],[57,18,57,25],[59,10,59,11],[59,12,59,13],[59,14,59,15],[55,10,55,11],[49,18,49,25],[46,6,48,7],[54,6,54,7],[62,12,62,13],[62,14,62,15],[13,1,13,5],[13,6,13,20],[15,16,15,20],[30,23,30,25],[30,20,30,22],[26,20,29,22],[14,6,14,20],[24,16,24,17],[26,16,29,18],[26,19,29,19],[24,18,24,24],[30,4,30,5],[24,10,24,15],[22,1,22,25],[30,13,30,15],[19,6,19,8],[30,1,30,3],[17,11,17,13],[15,6,15,10],[30,9,30,11],[17,6,17,8],[17,9,17,10],[17,17,17,20],[17,14,17,16],[53,8,53,9],[38,23,38,25],[38,20,38,22],[37,20,37,22],[37,23,37,25],[38,13,38,15],[37,13,37,15],[37,16,37,18],[26,23,29,25],[30,16,30,18],[32,16,32,18],[26,13,29,15],[33,20,33,22],[35,13,35,15],[34,13,34,15],[34,23,34,25],[46,14,49,15],[48,18,48,25],[45,10,45,14],[44,1,44,16],[45,15,45,16],[38,6,38,8],[38,9,38,11],[39,13,39,15],[46,4,48,5],[49,4,49,5],[37,4,37,5],[37,1,37,3],[35,1,35,3],[35,4,35,5],[36,1,36,3],[34,1,34,3],[33,4,33,5],[38,1,38,3],[38,16,38,18],[38,4,38,5],[33,1,33,3],[46,16,49,16],[59,18,59,25],[62,18,62,25],[60,18,60,25],[61,6,61,16],[62,6,62,7],[62,8,62,9],[59,6,59,7],[62,10,62,11],[35,9,35,11],[46,18,46,25],[47,18,47,25],[44,18,44,25],[45,18,45,25],[36,20,36,22],[33,23,33,25],[34,20,34,22],[35,20,35,22],[34,16,34,18],[35,16,35,18],[33,16,33,18],[34,4,34,5],[36,4,36,5],[34,9,34,11],[33,9,33,11],[37,9,37,11],[36,6,36,8],[35,6,35,8],[31,6,31,8],[33,6,33,8],[34,6,34,8],[36,9,36,11],[7,16,7,20],[8,16,8,20],[9,16,9,20],[10,16,10,20],[15,11,15,15],[9,6,9,10],[50,26,50,27],[9,1,9,5],[10,1,10,5],[11,1,11,5],[12,1,12,5],[14,1,14,5],[15,1,15,5],[17,1,17,5],[10,11,10,15],[11,11,11,15],[49,26,49,27],[43,26,43,27],[46,26,46,27],[47,26,47,27],[44,26,44,27],[45,26,45,27],[48,26,48,27],[31,9,31,11],[42,26,42,27],[26,4,29,5],[12,11,12,15],[0,11,0,12],[35,23,35,25],[31,23,31,25],[36,13,36,15],[36,23,36,25],[11,16,11,20],[10,6,10,10],[11,6,11,10],[12,6,12,10],[6,16,6,20],[32,23,32,25],[12,16,12,20],[6,11,6,15],[7,11,7,15],[8,11,8,15],[36,16,36,18],[31,20,31,22],[32,20,32,22],[31,16,31,18],[26,6,29,8],[30,6,30,8],[26,9,29,11],[32,13,32,15],[33,13,33,15],[0,0,0,3],[0,5,0,6],[8,6,8,10],[7,6,7,10],[6,1,6,5],[7,1,7,5],[8,1,8,5],[6,6,6,10],[0,9,0,10],[0,7,0,8],[31,13,31,15],[26,12,29,12],[26,1,29,3],[19,1,19,5],[31,4,31,5],[31,1,31,3],[9,11,9,15],[32,6,32,8],[32,9,32,11],[32,1,32,3],[32,4,32,5],[83,11,83,13],[73,15,73,17],[75,15,75,17],[79,11,79,13],[77,1,77,4],[77,5,77,14],[77,15,77,17],[79,14,79,16],[79,1,79,10],[79,17,79,26],[83,1,83,10],[73,1,73,4],[73,5,73,14],[50,12,50,13],[51,12,51,13],[58,18,58,25],[75,1,75,4],[75,5,75,14],[81,1,81,3],[81,4,81,6],[81,7,81,9],[81,10,81,12],[54,18,54,25],[54,14,54,15],[50,8,50,9],[51,8,51,9],[52,14,52,15],[52,12,52,13],[53,10,53,11],[53,12,53,13],[53,14,53,15],[51,18,51,25],[51,14,51,15],[54,12,54,13],[54,8,54,9],[52,8,52,9],[54,10,54,11],[50,10,50,11],[46,1,49,3],[52,1,52,3],[52,6,52,7],[63,23,63,25],[53,18,53,25],[61,18,61,25],[39,16,39,18],[45,8,45,9],[39,1,39,3],[43,1,43,16],[45,1,45,7],[43,18,43,25],[42,18,42,25],[41,18,41,27],[51,1,51,3],[51,4,51,5],[51,6,51,7],[46,8,49,9],[50,1,50,3],[50,4,50,5],[50,6,50,7],[49,6,49,7],[58,6,58,7],[53,1,53,3],[53,4,53,5],[54,1,54,3],[54,4,54,5],[70,1,70,27],[39,4,39,5],[39,6,39,8],[39,9,39,11],[51,26,51,27],[53,26,53,27],[52,26,52,27],[63,26,63,27],[60,26,60,27],[59,26,59,27],[54,26,54,27],[56,26,56,27],[58,26,58,27],[55,26,55,27],[57,26,57,27],[61,26,61,27],[50,14,50,15],[52,4,52,5],[46,12,49,13],[46,10,49,11],[58,12,58,13],[57,12,57,13],[58,1,58,3],[58,4,58,5],[64,4,64,5],[63,4,63,5],[61,4,61,5],[60,1,60,3],[60,4,60,5],[62,1,62,3],[62,4,62,5],[59,1,59,3],[58,8,58,9],[53,6,53,7],[52,10,52,11],[51,10,51,11],[37,6,37,8],[64,6,64,16],[63,1,63,3],[58,14,58,15],[55,12,55,13],[56,8,56,9],[58,10,58,11],[57,10,57,11],[57,14,57,15],[57,8,57,9],[56,12,56,13],[57,4,57,5],[57,6,57,7],[56,14,56,15],[55,14,55,15],[57,1,57,3],[55,1,55,3],[55,6,55,7],[55,8,55,9],[56,6,56,7],[56,10,56,11]]}
["TxDOT Manuals >",null,null,null,null,"Tex-210-F",null,"Tex-229-F",null,"Tex-236-F"]
[null,"TEXAS DEPARTMENT OF TRANSPORTATION",null,null,null,null,null,null,null,null,null,null,null,null,null,null,null,null,null,null,null,null,72]
[null,null,null,null,null,null,null,null,null,null,null,null,null,null,null,null,null,null,null,null,null,null,3]
[]
[null,"COMBINED GRADATION",null,null,null,null,null,null,null,null,null,null,null,null,null,null,null,null,null,null,null,null,"Tx2ExtGrd.xlsm::42072.434931"]
[null,null,null,null,null,null,null,null,null,null,null,null,null,null,null,null,null,null,null,null,{"$f":"\"File Version: \" & TEXT(MID(sn,SEARCH(\"::\",sn,1)+2,20),\"mm/dd/yy hh:mm:ss\")","v":"File Version: 03/09/15 10:26:18"}]
[null,"SAMPLE ID:",null,null,null,null,null,null,null,null,null,"SAMPLED DATE:"]
[null,"TEST NUMBER:",null,null,null,null,null,null,null,null,null,"LETTING DATE:"]
[null,"SAMPLE STATUS:",null,null,null,null,null,null,null,null,null,"CONTROLLING CSJ:"]
[null,"COUNTY:",null,null,null,null,null,null,null,null,null,"SPEC YEAR:"]
[null,"SAMPLED BY:",null,null,null,null,null,null,null,null,null,"SPEC ITEM:"]
[null,"SAMPLE LOCATION:",null,null,null,null,"",null,null,null,null,"SPECIAL PROVISION:"]
[null,"MATERIAL CODE:",null,null,null,null,null,null,null,null,null,"MIX TYPE:"]
[null,"MATERIAL NAME:"]
[null,"PRODUCER:"]
[null,"AREA ENGINEER:",null,null,null,null,null,null,null,null,null,"PROJECT MANAGER:"]
[]
[null,"COURSE\\LIFT:",null,null,null,null,null,null,null,"STATION:",null,"",null,null,"DIST. FROM CL:",null,null,""]
[]
[null,"Current JMF#:"]
[]
[]
[null,"COMBINED AGGREGATE GRADATION:Tex-229-F"]
[]
[null,null,null,null,null,null,null,null,null,"Method used to obtain aggregate:",null,null,null,null,null,null,"using:"]
[]
[null,"Sieve Size:",null,null,"Size (mm)",null,"Master Specification Tolerances %",null,null,"Design JMF 1 Cumulative Percent Passing",null,null,"In Tolerance","Current JMF CurrentJMF Design Tolerances %",null,null,"Current JMF 2 Cumulative Percent Passing",null,null,"In Tolerance","Sieve Size:",null,null,"Ignition Oven correlation Factor,%:"]
[]
[]
[]
[null,{"$f":"IF(ISERROR(INDEX(INDIRECT(Grade&specyear),1,IF(specyear = \"1995\",3,2))),\"\",INDEX(INDIRECT(Grade&specyear),1,IF(specyear = \"1995\",3,2)))","v":""},null,null,{"$f":"IF(ISERROR(INDEX(INDIRECT(Grade&specyear),1,4)),\"\",INDEX(INDIRECT(Grade&specyear),1,4))","v":""},null,{"$f":"IF(ISERROR(OR(INDEX(INDIRECT(Grade&specyear),1,5),INDEX(INDIRECT(Grade&specyear),1,6))),\"\",INDEX(INDIRECT(Grade&specyear),1,5) & \"-\" & INDEX(INDIRECT(Grade&specyear),1,6))","v":""},null,null,null,null,null,{"$f":"IF(MixDes1=\"\",\"\",IF(AND(MixDes1>=INDEX(INDIRECT(Grade&specyear),1,5),MixDes1<=INDEX(INDIRECT(Grade&specyear),1,6)),\"þ\",\"ý\"))","v":""},{"$f":"IF(MixDes1=\"\",\"\", IF(OR(INDEX(INDIRECT(Grade&specyear),1,5)>100-((100-MixDes1)-IF(SSize1>=2,5,3)),INDEX(INDIRECT(Grade&specyear),1,6)<100-((100-MixDes1)+IF(SSize1>=2,5,3))),\"O U T\",  IF(INDEX(INDIRECT(Grade&specyear),1,5)>100-((100-MixDes1)+IF(SSize1>=2,5,3)),INDEX(INDIRECT(Grade&specyear),1,5),100-((100-MixDes1)+IF(SSize1>=2,5,3))) & \"-\" & IF(INDEX(INDIRECT(Grade&specyear),1,6)<100-((100-MixDes1)-IF(SSize1>=2,5,3)),INDEX(INDIRECT(Grade&specyear),1,6),100-((100-MixDes1)-IF(SSize1>=2,5,3)))))","v":""},null,null,null,null,null,{"$f":"IF(JMFDes1=\"\",\"\",IF(AND(JMFDes1>=INDEX(INDIRECT(Grade&specyear),1,5),JMFDes1<=INDEX(INDIRECT(Grade&specyear),1,6),ABS((100-MixDes1)-(100-JMFDes1))<=IF(SSize1>=2,5,3)),\"þ\",\"ý\"))","v":""},{"$f":"IF(ISERROR(INDEX(INDIRECT(Grade&specyear),1,IF(specyear = \"1995\",3,2))),\"\",INDEX(INDIRECT(Grade&specyear),1,IF(specyear = \"1995\",3,2)))","v":""}]
[null,{"$f":"IF(ISERROR(INDEX(INDIRECT(Grade&specyear),2,IF(specyear = \"1995\",3,2))),\"\",INDEX(INDIRECT(Grade&specyear),2,IF(specyear = \"1995\",3,2)))","v":""},null,null,{"$f":"IF(ISERROR(INDEX(INDIRECT(Grade&specyear),2,4)),\"\",INDEX(INDIRECT(Grade&specyear),2,4))","v":""},null,{"$f":"IF(ISERROR(OR(INDEX(INDIRECT(Grade&specyear),2,5),INDEX(INDIRECT(Grade&specyear),2,6))),\"\",INDEX(INDIRECT(Grade&specyear),2,5) & \"-\" & INDEX(INDIRECT(Grade&specyear),2,6))","v":""},null,null,null,null,null,{"$f":"IF(Mixdes2=\"\",\"\",IF(AND(Mixdes2>=INDEX(INDIRECT(Grade&specyear),2,5),Mixdes2<=INDEX(INDIRECT(Grade&specyear),2,6)),\"þ\",\"ý\"))","v":""},{"$f":"IF(JMFDes1=\"\",\"\", IF(OR(INDEX(INDIRECT(Grade&specyear),2,5)>JMFDes1-((MixDes1-Mixdes2)-IF(SSize2>=2,5,3)),INDEX(INDIRECT(Grade&specyear),2,6)<JMFDes1-((MixDes1-Mixdes2)+IF(SSize2>=2,5,3))),\"O U T\",  IF(INDEX(INDIRECT(Grade&specyear),2,5)>JMFDes1-((MixDes1-Mixdes2)+IF(SSize2>=2,5,3)),INDEX(INDIRECT(Grade&specyear),2,5),JMFDes1-((MixDes1-Mixdes2)+IF(SSize2>=2,5,3))) & \"-\" & IF(INDEX(INDIRECT(Grade&specyear),2,6)<JMFDes1-((MixDes1-Mixdes2)-IF(SSize2>=2,5,3)),INDEX(INDIRECT(Grade&specyear),2,6),JMFDes1-((MixDes1-Mixdes2)-IF(SSize2>=2,5,3)))))","v":""},null,null,null,null,null,{"$f":"IF(JMFDes2=\"\",\"\",IF(AND(JMFDes2>=INDEX(INDIRECT(Grade&specyear),2,5),JMFDes2<=INDEX(INDIRECT(Grade&specyear),2,6),ABS((MixDes1-Mixdes2)-(JMFDes1-JMFDes2))<=IF(SSize2>=2,5,3)),\"þ\",\"ý\"))","v":""},{"$f":"IF(ISERROR(INDEX(INDIRECT(Grade&specyear),2,IF(specyear = \"1995\",3,2))),\"\",INDEX(INDIRECT(Grade&specyear),2,IF(specyear = \"1995\",3,2)))","v":""}]
[null,{"$f":"IF(ISERROR(INDEX(INDIRECT(Grade&specyear),3,IF(specyear = \"1995\",3,2))),\"\",INDEX(INDIRECT(Grade&specyear),3,IF(specyear = \"1995\",3,2)))","v":""},null,null,{"$f":"IF(ISERROR(INDEX(INDIRECT(Grade&specyear),3,4)),\"\",INDEX(INDIRECT(Grade&specyear),3,4))","v":""},null,{"$f":"IF(ISERROR(OR(INDEX(INDIRECT(Grade&specyear),3,5),INDEX(INDIRECT(Grade&specyear),3,6))),\"\",INDEX(INDIRECT(Grade&specyear),3,5) & \"-\" & INDEX(INDIRECT(Grade&specyear),3,6))","v":""},null,null,null,null,null,{"$f":"IF(MixDes3=\"\",\"\",IF(AND(MixDes3>=INDEX(INDIRECT(Grade&specyear),3,5),MixDes3<=INDEX(INDIRECT(Grade&specyear),3,6)),\"þ\",\"ý\"))","v":""},{"$f":"IF(JMFDes2=\"\",\"\", IF(OR(INDEX(INDIRECT(Grade&specyear),3,5)>JMFDes2-((Mixdes2-MixDes3)-IF(SSize3>=2,5,3)),INDEX(INDIRECT(Grade&specyear),3,6)<JMFDes2-((Mixdes2-MixDes3)+IF(SSize3>=2,5,3))),\"O U T\",  IF(INDEX(INDIRECT(Grade&specyear),3,5)>JMFDes2-((Mixdes2-MixDes3)+IF(SSize3>=2,5,3)),INDEX(INDIRECT(Grade&specyear),3,5),JMFDes2-((Mixdes2-MixDes3)+IF(SSize3>=2,5,3))) & \"-\" & IF(INDEX(INDIRECT(Grade&specyear),3,6)<JMFDes2-((Mixdes2-MixDes3)-IF(SSize3>=2,5,3)),INDEX(INDIRECT(Grade&specyear),3,6),JMFDes2-((Mixdes2-MixDes3)-IF(SSize3>=2,5,3)))))","v":""},null,null,null,null,null,{"$f":"IF(JMFDes3=\"\",\"\",IF(AND(JMFDes3>=INDEX(INDIRECT(Grade&specyear),3,5),JMFDes3<=INDEX(INDIRECT(Grade&specyear),3,6),ABS((Mixdes2-MixDes3)-(JMFDes2-JMFDes3))<=IF(SSize3>=2,5,3)),\"þ\",\"ý\"))","v":""},{"$f":"IF(ISERROR(INDEX(INDIRECT(Grade&specyear),3,IF(specyear = \"1995\",3,2))),\"\",INDEX(INDIRECT(Grade&specyear),3,IF(specyear = \"1995\",3,2)))","v":""}]
[null,{"$f":"IF(ISERROR(INDEX(INDIRECT(Grade&specyear),4,IF(specyear = \"1995\",3,2))),\"\",INDEX(INDIRECT(Grade&specyear),4,IF(specyear = \"1995\",3,2)))","v":""},null,null,{"$f":"IF(ISERROR(INDEX(INDIRECT(Grade&specyear),4,4)),\"\",INDEX(INDIRECT(Grade&specyear),4,4))","v":""},null,{"$f":"IF(ISERROR(OR(INDEX(INDIRECT(Grade&specyear),4,5),INDEX(INDIRECT(Grade&specyear),4,6))),\"\",INDEX(INDIRECT(Grade&specyear),4,5) & \"-\" & INDEX(INDIRECT(Grade&specyear),4,6))","v":""},null,null,null,null,null,{"$f":"IF(Mixdes4=\"\",\"\",IF(AND(Mixdes4>=INDEX(INDIRECT(Grade&specyear),4,5),Mixdes4<=INDEX(INDIRECT(Grade&specyear),4,6)),\"þ\",\"ý\"))","v":""},{"$f":"IF(JMFDes3=\"\",\"\", IF(OR(INDEX(INDIRECT(Grade&specyear),4,5)>JMFDes3-((MixDes3-Mixdes4)-IF(SSize4>=2,5,3)),INDEX(INDIRECT(Grade&specyear),4,6)<JMFDes3-((MixDes3-Mixdes4)+IF(SSize4>=2,5,3))),\"O U T\",  IF(INDEX(INDIRECT(Grade&specyear),4,5)>JMFDes3-((MixDes3-Mixdes4)+IF(SSize4>=2,5,3)),INDEX(INDIRECT(Grade&specyear),4,5),JMFDes3-((MixDes3-Mixdes4)+IF(SSize4>=2,5,3))) & \"-\" & IF(INDEX(INDIRECT(Grade&specyear),4,6)<JMFDes3-((MixDes3-Mixdes4)-IF(SSize4>=2,5,3)),INDEX(INDIRECT(Grade&specyear),4,6),JMFDes3-((MixDes3-Mixdes4)-IF(SSize4>=2,5,3)))))","v":""},null,null,null,null,null,{"$f":"IF(JMFDes4=\"\",\"\",IF(AND(JMFDes4>=INDEX(INDIRECT(Grade&specyear),4,5),JMFDes4<=INDEX(INDIRECT(Grade&specyear),4,6),ABS((MixDes3-Mixdes4)-(JMFDes3-JMFDes4))<=IF(SSize4>=2,5,3)),\"þ\",\"ý\"))","v":""},{"$f":"IF(ISERROR(INDEX(INDIRECT(Grade&specyear),4,IF(specyear = \"1995\",3,2))),\"\",INDEX(INDIRECT(Grade&specyear),4,IF(specyear = \"1995\",3,2)))","v":""}]
[null,{"$f":"IF(ISERROR(INDEX(INDIRECT(Grade&specyear),5,IF(specyear = \"1995\",3,2))),\"\",INDEX(INDIRECT(Grade&specyear),5,IF(specyear = \"1995\",3,2)))","v":""},null,null,{"$f":"IF(ISERROR(INDEX(INDIRECT(Grade&specyear),5,4)),\"\",INDEX(INDIRECT(Grade&specyear),5,4))","v":""},null,{"$f":"IF(ISERROR(OR(INDEX(INDIRECT(Grade&specyear),5,5),INDEX(INDIRECT(Grade&specyear),5,6))),\"\",INDEX(INDIRECT(Grade&specyear),5,5) & \"-\" & INDEX(INDIRECT(Grade&specyear),5,6))","v":""},null,null,null,null,null,{"$f":"IF(MixDes5=\"\",\"\",IF(AND(MixDes5>=INDEX(INDIRECT(Grade&specyear),5,5),MixDes5<=INDEX(INDIRECT(Grade&specyear),5,6)),\"þ\",\"ý\"))","v":""},{"$f":"IF(JMFDes4=\"\",\"\", IF(OR(INDEX(INDIRECT(Grade&specyear),5,5)>JMFDes4-((Mixdes4-MixDes5)-IF(SSize5>=2,5,3)),INDEX(INDIRECT(Grade&specyear),5,6)<JMFDes4-((Mixdes4-MixDes5)+IF(SSize5>=2,5,3))),\"O U T\",  IF(INDEX(INDIRECT(Grade&specyear),5,5)>JMFDes4-((Mixdes4-MixDes5)+IF(SSize5>=2,5,3)),INDEX(INDIRECT(Grade&specyear),5,5),JMFDes4-((Mixdes4-MixDes5)+IF(SSize5>=2,5,3))) & \"-\" & IF(INDEX(INDIRECT(Grade&specyear),5,6)<JMFDes4-((Mixdes4-MixDes5)-IF(SSize5>=2,5,3)),INDEX(INDIRECT(Grade&specyear),5,6),JMFDes4-((Mixdes4-MixDes5)-IF(SSize5>=2,5,3)))))","v":""},null,null,null,null,null,{"$f":"IF(JMFDes5=\"\",\"\",IF(AND(JMFDes5>=INDEX(INDIRECT(Grade&specyear),5,5),JMFDes5<=INDEX(INDIRECT(Grade&specyear),5,6),ABS((Mixdes4-MixDes5)-(JMFDes4-JMFDes5))<=IF(SSize5>=2,5,3)),\"þ\",\"ý\"))","v":""},{"$f":"IF(ISERROR(INDEX(INDIRECT(Grade&specyear),5,IF(specyear = \"1995\",3,2))),\"\",INDEX(INDIRECT(Grade&specyear),5,IF(specyear = \"1995\",3,2)))","v":""}]
[null,{"$f":"IF(ISERROR(INDEX(INDIRECT(Grade&specyear),6,IF(specyear = \"1995\",3,2))),\"\",INDEX(INDIRECT(Grade&specyear),6,IF(specyear = \"1995\",3,2)))","v":""},null,null,{"$f":"IF(ISERROR(INDEX(INDIRECT(Grade&specyear),6,4)),\"\",INDEX(INDIRECT(Grade&specyear),6,4))","v":""},null,{"$f":"IF(ISERROR(OR(INDEX(INDIRECT(Grade&specyear),6,5),INDEX(INDIRECT(Grade&specyear),6,6))),\"\",INDEX(INDIRECT(Grade&specyear),6,5) & \"-\" & INDEX(INDIRECT(Grade&specyear),6,6))","v":""},null,null,null,null,null,{"$f":"IF(MixDes6=\"\",\"\",IF(AND(MixDes6>=INDEX(INDIRECT(Grade&specyear),6,5),MixDes6<=INDEX(INDIRECT(Grade&specyear),6,6)),\"þ\",\"ý\"))","v":""},{"$f":"IF(JMFDes5=\"\",\"\", IF(OR(INDEX(INDIRECT(Grade&specyear),6,5)>JMFDes5-((MixDes5-MixDes6)-IF(SSize6>=2,5,3)),INDEX(INDIRECT(Grade&specyear),6,6)<JMFDes5-((MixDes5-MixDes6)+IF(SSize6>=2,5,3))),\"O U T\",  IF(INDEX(INDIRECT(Grade&specyear),6,5)>JMFDes5-((MixDes5-MixDes6)+IF(SSize6>=2,5,3)),INDEX(INDIRECT(Grade&specyear),6,5),JMFDes5-((MixDes5-MixDes6)+IF(SSize6>=2,5,3))) & \"-\" & IF(INDEX(INDIRECT(Grade&specyear),6,6)<JMFDes5-((MixDes5-MixDes6)-IF(SSize6>=2,5,3)),INDEX(INDIRECT(Grade&specyear),6,6),JMFDes5-((MixDes5-MixDes6)-IF(SSize6>=2,5,3)))))","v":""},null,null,null,null,null,{"$f":"IF(JMFDes6=\"\",\"\",IF(AND(JMFDes6>=INDEX(INDIRECT(Grade&specyear),6,5),JMFDes6<=INDEX(INDIRECT(Grade&specyear),6,6),ABS((MixDes5-MixDes6)-(JMFDes5-JMFDes6))<=IF(SSize6>=2,5,3)),\"þ\",\"ý\"))","v":""},{"$f":"IF(ISERROR(INDEX(INDIRECT(Grade&specyear),6,IF(specyear = \"1995\",3,2))),\"\",INDEX(INDIRECT(Grade&specyear),6,IF(specyear = \"1995\",3,2)))","v":""}]
[null,{"$f":"IF(ISERROR(INDEX(INDIRECT(Grade&specyear),7,IF(specyear = \"1995\",3,2))),\"\",INDEX(INDIRECT(Grade&specyear),7,IF(specyear = \"1995\",3,2)))","v":""},null,null,{"$f":"IF(ISERROR(INDEX(INDIRECT(Grade&specyear),7,4)),\"\",INDEX(INDIRECT(Grade&specyear),7,4))","v":""},null,{"$f":"IF(ISERROR(OR(INDEX(INDIRECT(Grade&specyear),7,5),INDEX(INDIRECT(Grade&specyear),7,6))),\"\",INDEX(INDIRECT(Grade&specyear),7,5) & \"-\" & INDEX(INDIRECT(Grade&specyear),7,6))","v":""},null,null,null,null,null,{"$f":"IF(MixDes7=\"\",\"\",IF(AND(MixDes7>=INDEX(INDIRECT(Grade&specyear),7,5),MixDes7<=INDEX(INDIRECT(Grade&specyear),7,6)),\"þ\",\"ý\"))","v":""},{"$f":"IF(JMFDes6=\"\",\"\", IF(OR(INDEX(INDIRECT(Grade&specyear),7,5)>JMFDes6-((MixDes6-MixDes7)-IF(SSize7>=2,5,3)),INDEX(INDIRECT(Grade&specyear),7,6)<JMFDes6-((MixDes6-MixDes7)+IF(SSize7>=2,5,3))),\"O U T\",  IF(INDEX(INDIRECT(Grade&specyear),7,5)>JMFDes6-((MixDes6-MixDes7)+IF(SSize7>=2,5,3)),INDEX(INDIRECT(Grade&specyear),7,5),JMFDes6-((MixDes6-MixDes7)+IF(SSize7>=2,5,3))) & \"-\" & IF(INDEX(INDIRECT(Grade&specyear),7,6)<JMFDes6-((MixDes6-MixDes7)-IF(SSize7>=2,5,3)),INDEX(INDIRECT(Grade&specyear),7,6),JMFDes6-((MixDes6-MixDes7)-IF(SSize7>=2,5,3)))))","v":""},null,null,null,null,null,{"$f":"IF(JMFDes7=\"\",\"\",IF(AND(JMFDes7>=INDEX(INDIRECT(Grade&specyear),7,5),JMFDes7<=INDEX(INDIRECT(Grade&specyear),7,6),ABS((MixDes6-MixDes7)-(JMFDes6-JMFDes7))<=IF(SSize7>=2,5,3)),\"þ\",\"ý\"))","v":""},{"$f":"IF(ISERROR(INDEX(INDIRECT(Grade&specyear),7,IF(specyear = \"1995\",3,2))),\"\",INDEX(INDIRECT(Grade&specyear),7,IF(specyear = \"1995\",3,2)))","v":""}]
[null,{"$f":"IF(ISERROR(INDEX(INDIRECT(Grade&specyear),8,IF(specyear = \"1995\",3,2))),\"\",INDEX(INDIRECT(Grade&specyear),8,IF(specyear = \"1995\",3,2)))","v":""},null,null,{"$f":"IF(ISERROR(INDEX(INDIRECT(Grade&specyear),8,4)),\"\",INDEX(INDIRECT(Grade&specyear),8,4))","v":""},null,{"$f":"IF(ISERROR(OR(INDEX(INDIRECT(Grade&specyear),8,5),INDEX(INDIRECT(Grade&specyear),8,6))),\"\",INDEX(INDIRECT(Grade&specyear),8,5) & \"-\" & INDEX(INDIRECT(Grade&specyear),8,6))","v":""},null,null,null,null,null,{"$f":"IF(MixDes8=\"\",\"\",IF(AND(MixDes8>=INDEX(INDIRECT(Grade&specyear),8,5),MixDes8<=INDEX(INDIRECT(Grade&specyear),8,6)),\"þ\",\"ý\"))","v":""},{"$f":"IF(JMFDes7=\"\",\"\", IF(OR(INDEX(INDIRECT(Grade&specyear),8,5)>JMFDes7-((MixDes7-MixDes8)-IF(SSize8>=2,5,3)),INDEX(INDIRECT(Grade&specyear),8,6)<JMFDes7-((MixDes7-MixDes8)+IF(SSize8>=2,5,3))),\"O U T\",  IF(INDEX(INDIRECT(Grade&specyear),8,5)>JMFDes7-((MixDes7-MixDes8)+IF(SSize8>=2,5,3)),INDEX(INDIRECT(Grade&specyear),8,5),JMFDes7-((MixDes7-MixDes8)+IF(SSize8>=2,5,3))) & \"-\" & IF(INDEX(INDIRECT(Grade&specyear),8,6)<JMFDes7-((MixDes7-MixDes8)-IF(SSize8>=2,5,3)),INDEX(INDIRECT(Grade&specyear),8,6),JMFDes7-((MixDes7-MixDes8)-IF(SSize8>=2,5,3)))))","v":""},null,null,null,null,null,{"$f":"IF(JMFDes8=\"\",\"\",IF(AND(JMFDes8>=INDEX(INDIRECT(Grade&specyear),8,5),JMFDes8<=INDEX(INDIRECT(Grade&specyear),8,6),ABS((MixDes7-MixDes8)-(JMFDes7-JMFDes8))<=IF(SSize8>=2,5,3)),\"þ\",\"ý\"))","v":""},{"$f":"IF(ISERROR(INDEX(INDIRECT(Grade&specyear),8,IF(specyear = \"1995\",3,2))),\"\",INDEX(INDIRECT(Grade&specyear),8,IF(specyear = \"1995\",3,2)))","v":""}]
[null,{"$f":"IF(ISERROR(INDEX(INDIRECT(Grade&specyear),9,IF(specyear = \"1995\",3,2))),\"\",INDEX(INDIRECT(Grade&specyear),9,IF(specyear = \"1995\",3,2)))","v":""},null,null,{"$f":"IF(ISERROR(INDEX(INDIRECT(Grade&specyear),9,4)),\"\",INDEX(INDIRECT(Grade&specyear),9,4))","v":""},null,{"$f":"IF(ISERROR(OR(INDEX(INDIRECT(Grade&specyear),9,5),INDEX(INDIRECT(Grade&specyear),9,6))),\"\",INDEX(INDIRECT(Grade&specyear),9,5) & \"-\" & INDEX(INDIRECT(Grade&specyear),9,6))","v":""},null,null,null,null,null,{"$f":"IF(MixDes9=\"\",\"\",IF(AND(MixDes9>=INDEX(INDIRECT(Grade&specyear),9,5),MixDes9<=INDEX(INDIRECT(Grade&specyear),9,6)),\"þ\",\"ý\"))","v":""},{"$f":"IF(JMFDes8=\"\",\"\", IF(OR(INDEX(INDIRECT(Grade&specyear),9,5)>JMFDes8-((MixDes8-MixDes9)-IF(SSize9>=2,5,3)),INDEX(INDIRECT(Grade&specyear),9,6)<JMFDes8-((MixDes8-MixDes9)+IF(SSize9>=2,5,3))),\"O U T\",  IF(INDEX(INDIRECT(Grade&specyear),9,5)>JMFDes8-((MixDes8-MixDes9)+IF(SSize9>=2,5,3)),INDEX(INDIRECT(Grade&specyear),9,5),JMFDes8-((MixDes8-MixDes9)+IF(SSize9>=2,5,3))) & \"-\" & IF(INDEX(INDIRECT(Grade&specyear),9,6)<JMFDes8-((MixDes8-MixDes9)-IF(SSize9>=2,5,3)),INDEX(INDIRECT(Grade&specyear),9,6),JMFDes8-((MixDes8-MixDes9)-IF(SSize9>=2,5,3)))))","v":""},null,null,null,null,null,{"$f":"IF(JMFDes9=\"\",\"\",IF(AND(JMFDes9>=INDEX(INDIRECT(Grade&specyear),9,5),JMFDes9<=INDEX(INDIRECT(Grade&specyear),9,6),ABS((MixDes8-MixDes9)-(JMFDes8-JMFDes9))<=IF(SSize9>=2,5,3)),\"þ\",\"ý\"))","v":""},{"$f":"IF(ISERROR(INDEX(INDIRECT(Grade&specyear),9,IF(specyear = \"1995\",3,2))),\"\",INDEX(INDIRECT(Grade&specyear),9,IF(specyear = \"1995\",3,2)))","v":""}]
[null,{"$f":"IF(ISERROR(INDEX(INDIRECT(Grade&specyear),10,IF(specyear = \"1995\",3,2))),\"\",INDEX(INDIRECT(Grade&specyear),10,IF(specyear = \"1995\",3,2)))","v":""},null,null,{"$f":"IF(ISERROR(INDEX(INDIRECT(Grade&specyear),10,4)),\"\",INDEX(INDIRECT(Grade&specyear),10,4))","v":""},null,{"$f":"IF(ISERROR(OR(INDEX(INDIRECT(Grade&specyear),10,5),INDEX(INDIRECT(Grade&specyear),10,6))),\"\",INDEX(INDIRECT(Grade&specyear),10,5) & \"-\" & INDEX(INDIRECT(Grade&specyear),10,6))","v":""},null,null,null,null,null,{"$f":"IF(MixDes10=\"\",\"\",IF(AND(MixDes10>=INDEX(INDIRECT(Grade&specyear),10,5),MixDes10<=INDEX(INDIRECT(Grade&specyear),10,6)),\"þ\",\"ý\"))","v":""},{"$f":"IF(JMFDes9=\"\",\"\", IF(OR(INDEX(INDIRECT(Grade&specyear),10,5)>JMFDes9-((MixDes9-MixDes10)-IF(ssize10>=2,5,3)),INDEX(INDIRECT(Grade&specyear),10,6)<JMFDes9-((MixDes9-MixDes10)+IF(ssize10>=2,5,3))),\"O U T\",  IF(INDEX(INDIRECT(Grade&specyear),10,5)>JMFDes9-((MixDes9-MixDes10)+IF(ssize10>=2,5,3)),INDEX(INDIRECT(Grade&specyear),10,5),JMFDes9-((MixDes9-MixDes10)+IF(ssize10>=2,5,3))) & \"-\" & IF(INDEX(INDIRECT(Grade&specyear),10,6)<JMFDes9-((MixDes9-MixDes10)-IF(ssize10>=2,5,3)),INDEX(INDIRECT(Grade&specyear),10,6),JMFDes9-((MixDes9-MixDes10)-IF(ssize10>=2,5,3)))))","v":""},null,null,null,null,null,{"$f":"IF(JMFDes10=\"\",\"\",IF(AND(JMFDes10>=INDEX(INDIRECT(Grade&specyear),10,5),JMFDes10<=INDEX(INDIRECT(Grade&specyear),10,6),ABS((MixDes9-MixDes10)-(JMFDes9-JMFDes10))<=IF(ssize10>=2,5,3)),\"þ\",\"ý\"))","v":""},{"$f":"IF(ISERROR(INDEX(INDIRECT(Grade&specyear),10,IF(specyear = \"1995\",3,2))),\"\",INDEX(INDIRECT(Grade&specyear),10,IF(specyear = \"1995\",3,2)))","v":""}]
[]
[null,null,null,null,null,null,null,null,null,null,null,null,null,null,null,null,null,null,{"$f":"\"Extraction Method: Tex-210-F by: \" & extractedmethod","v":"Extraction Method: Tex-210-F by: "}]
[null,null,null,null,null,null,null,null,null,null,null,null,null,null,null,null,null,null,"Total Sample (g):"]
[null,"GRADATION OF EXTRACTED AGGREGATE-Tex-229-F",null,null,null,null,null,null,null,null,null,null,null,null,null,null,null,null,"Original Filter Paper (g):"]
[null,{"$f":"\"GRADATION SAMPLE FROM \" & IF(ExtractAsphaltMethod = \"Belt Sample\", \"BELT SAMPLE\",IF(ExtractAsphaltMethod=\"Ignition Oven Method\",\"IGNITION OVEN\",\"\"))","v":"GRADATION SAMPLE FROM "},null,null,null,null,null,null,null,null,null,null,null,null,null,null,null,null,"Final Filter Paper (g):"]
[null,{"$f":"IF(ExtractAsphaltMethod=\"belt sample\",\"Belt Sample Original Dry Weight:\",IF(ExtractAsphaltMethod=\"Ignition Oven Method\",\"Ignited Sample Original Dry Weight:\",\"\"))","v":""},null,null,null,null,null,null,null,null,{"$f":"IF(ExtractAsphaltMethod=\"Extraction Method\",\"\",\"Dry Weight After Washing:\")","v":"Dry Weight After Washing:"},null,null,null,null,null,null,null,"Fines in Filter Paper (g):",null,null,null,null,null,null,null,{"$f":"IF(AND(AA45=\"\",AA44=\"\"),\"\",AA45-AA44)","v":""}]
[null,"Sieve Size:",null,null,{"$f":"IF(Field43=\"\",\"Individual\",Field43) & \" Weight Retained, (g)\"","v":"Individual Weight Retained, (g)"},null,{"$f":"G50 & \" Weight Retained, (g)\"","v":"Cumulative Weight Retained, (g)"},null,{"$f":"IF(AND(ExtractAsphaltMethod=\"Ignition Oven Method\",SUM(Correlations)<>0),\"*Adjusted\",\"\") & \" Individual Percent Retained\"","v":" Individual Percent Retained"},null,{"$f":"IF(AND(ExtractAsphaltMethod=\"Ignition Oven Method\",SUM(Correlations)<>0),\"*Adjusted\",\"\") & \" Cumulative Percent Retained\"","v":" Cumulative Percent Retained"},null,{"$f":"IF(AND(ExtractAsphaltMethod=\"Ignition Oven Method\",SUM(Correlations)<>0),\"*Adjusted\",\"\")  &  \" Cumulative Percent Passing\"","v":" Cumulative Percent Passing"},null,{"$f":"\"JMF \"& CurrentJMF & \" Individual Retained Limits, %\"","v":"JMF  Individual Retained Limits, %"},null,"In Tolerance",null,"Pan+Extracted Aggregate (g):"]
[null,null,null,null,null,null,null,null,null,null,null,null,null,null,null,null,null,null,"Pan (g):"]
[null,null,null,null,null,null,null,null,null,null,null,null,null,null,null,null,null,null,"Extracted Aggregate (g):",null,null,null,null,null,null,null,{"$f":"IF(AND(AA47=\"\",AA48=\"\"),\"\",AA47-AA48)","v":""}]
[null,null,null,null,null,null,{"$f":"IF(RetainedMethodTx1=\"Cumulative\",\"Individual\",\"Cumulative\")","v":"Cumulative"},null,null,null,null,null,null,null,null,null,null,null,{"$f":"IF(extractedmethod=\"non-chlorinated centrifuge\",\"Buchner+Filter+Fines (g):\",\"Dish + Ash per 100mL (g):\")","v":"Dish + Ash per 100mL (g):"}]
[null,{"$f":"sieve1","v":""},null,null,null,null,{"$f":"IF(E51=\"\",\"\",E51)","v":""},null,{"$f":"IF(ISERROR(100-M51),\"\",100-M51)","v":""},null,{"$f":"IF(ISERROR(I51),\"\",I51)","v":""},null,{"$f":"IF(E51=\"\",\"\",100-IF(RetainedMethodTx1=\"Cumulative\",E51/RetainedTotalTx1*100,G51/RetainedTotalTx1*100)-IF(ExtractAsphaltMethod=\"Ignition Oven Method\",Corr1,0))","v":""},null,{"$f":"IF(JMFDes1=\"\",\"\",TEXT(IF(100-JMFDes1-IF(SSize1>=2,5,3)<0,0,100-JMFDes1-IF(SSize1>=2,5,3)),\"##0.0\") & \"-\" & TEXT(IF(100-JMFDes1+IF(SSize1>=2,5,3)<0,0,100-JMFDes1+IF(SSize1>=2,5,3)),\"##0.0\"))","v":""},null,{"$f":"IF(JMFDes1=\"\",\"\",IF(ABS(100-JMFDes1-$I51)>IF(SSize2>=2,5,3),\"ý\",\"þ\"))","v":""},null,{"$f":"IF(extractedmethod=\"non-chlorinated centrifuge\",\"Buchner + Filter (g):\",\"Dish (g):\")","v":"Dish (g):"}]
[null,{"$f":"sieve2","v":""},null,null,null,null,{"$f":"IF(E52=\"\",\"\",IF(RetainedMethodTx1=\"Cumulative\",(E52-SUM(G$39:G51)),SUM(E$39:E52)))","v":""},null,{"$f":"IF(ISERROR(M51-M52),\"\",M51-M52)","v":""},null,{"$f":"IF(ISERROR(K51+I52),\"\",K51+I52)","v":""},null,{"$f":"IF(E52=\"\",\"\",100-IF(RetainedMethodTx1=\"Cumulative\",E52/RetainedTotalTx1*100,G52/RetainedTotalTx1*100)-IF(ExtractAsphaltMethod=\"Ignition Oven Method\",Corr2,0))","v":""},null,{"$f":"IF(JMFDes2=\"\",\"\", TEXT(IF(AND(JMFDes1-JMFDes2-IF(SSize2>=2,5,3)>=0,JMFDes1-JMFDes2-IF(SSize2>=2,5,3)<=100),JMFDes1-JMFDes2-IF(SSize2>=2,5,3), TEXT(IF(JMFDes1-JMFDes2-IF(SSize2>=2,5,3)>100,100,0),\"##0.0\")),\"##0.0\") & \"-\" & TEXT(IF(AND(JMFDes1-JMFDes2+IF(SSize2>=2,5,3)>=0,JMFDes1-JMFDes2+IF(SSize2>=2,5,3)<=100),JMFDes1-JMFDes2+IF(SSize2>=2,5,3), TEXT(IF(JMFDes1-JMFDes2+IF(SSize2>=2,5,3)>100,100,0),\"##0.0\")),\"##0.0\"))","v":""},null,{"$f":"IF(JMFDes2=\"\",\"\",IF(ABS(JMFDes1-JMFDes2-$I52)>IF(SSize2>=2,5,3),\"ý\",\"þ\"))","v":""},null,{"$f":"IF(extractedmethod=\"non-chlorinated centrifuge\",\"Fines per 200mL (g):\",\"Ash per 100mL (g):\")","v":"Ash per 100mL (g):"},null,null,null,null,null,null,null,{"$f":"IF(COUNTBLANK(AA50:AA51)=2,\"\",AA50-AA51)","v":""}]
[null,{"$f":"sieve3","v":""},null,null,null,null,{"$f":"IF(E53=\"\",\"\",IF(RetainedMethodTx1=\"Cumulative\",(E53-SUM(G$39:G52)),SUM(E$39:E53)))","v":""},null,{"$f":"IF(ISERROR(M52-M53),\"\",M52-M53)","v":""},null,{"$f":"IF(ISERROR(K52+I53),\"\",K52+I53)","v":""},null,{"$f":"IF(E53=\"\",\"\",100-IF(RetainedMethodTx1=\"Cumulative\",E53/RetainedTotalTx1*100,G53/RetainedTotalTx1*100)-IF(ExtractAsphaltMethod=\"Ignition Oven Method\",Corr3,0))","v":""},null,{"$f":"IF(JMFDes3=\"\",\"\", TEXT(IF(AND(JMFDes2-JMFDes3-IF(SSize3>=2,5,3)>=0,JMFDes2-JMFDes3-IF(SSize3>=2,5,3)<=100),JMFDes2-JMFDes3-IF(SSize3>=2,5,3), TEXT(IF(JMFDes2-JMFDes3-IF(SSize3>=2,5,3)>100,100,0),\"##0.0\")),\"##0.0\") & \"-\" & TEXT(IF(AND(JMFDes2-JMFDes3+IF(SSize3>=2,5,3)>=0,JMFDes2-JMFDes3+IF(SSize3>=2,5,3)<=100),JMFDes2-JMFDes3+IF(SSize3>=2,5,3), TEXT(IF(JMFDes2-JMFDes3+IF(SSize3>=2,5,3)>100,100,0),\"##0.0\")),\"##0.0\"))","v":""},null,{"$f":"IF(JMFDes3=\"\",\"\",IF(ABS(JMFDes2-JMFDes3-$I53)>IF(SSize3>=2,5,3),\"ý\",\"þ\"))","v":""},null,"Total Solvent (mL):"]
[null,{"$f":"sieve4","v":""},null,null,null,null,{"$f":"IF(E54=\"\",\"\",IF(RetainedMethodTx1=\"Cumulative\",(E54-SUM(G$39:G53)),SUM(E$39:E54)))","v":""},null,"",null,"",null,{"$f":"IF(E54=\"\",\"\",100-IF(RetainedMethodTx1=\"Cumulative\",E54/RetainedTotalTx1*100,G54/RetainedTotalTx1*100)-IF(ExtractAsphaltMethod=\"Ignition Oven Method\",Corr4,0))","v":""},null,{"$f":"IF(JMFDes4=\"\",\"\",TEXT(IF(AND(JMFDes3-JMFDes4-IF(SSize4>=2,5,3)>=0,JMFDes3-JMFDes4-IF(SSize4>=2,5,3)<=100),JMFDes3-JMFDes4-IF(SSize4>=2,5,3), TEXT(IF(JMFDes3-JMFDes4-IF(SSize4>=2,5,3)>100,100,0),\"##0.0\")),\"##0.0\") & \"-\" & TEXT(IF(AND(JMFDes3-JMFDes4+IF(SSize4>=2,5,3)>=0,JMFDes3-JMFDes4+IF(SSize4>=2,5,3)<=100),JMFDes3-JMFDes4+IF(SSize4>=2,5,3), TEXT(IF(JMFDes3-JMFDes4+IF(SSize4>=2,5,3)>100,100,0),\"##0.0\")),\"##0.0\"))","v":""},null,{"$f":"IF(JMFDes4=\"\",\"\",IF(ABS(JMFDes3-JMFDes4-$I54)>IF(SSize4>=2,5,3),\"ý\",\"þ\"))","v":""},null,{"$f":"IF(extractedmethod=\"non-chlorinated centrifuge\",\"Total Fines (g):\",\"Total Ash (g):\")","v":"Total Ash (g):"},null,null,null,null,null,null,null,{"$f":"IF(ISERROR((AA52*AA53)/IF(extractedmethod=\"Non-Chlorinated Centrifuge\",200,100)),\"\",(AA52*AA53)/IF(extractedmethod=\"Non-Chlorinated Centrifuge\",200,100))","v":""}]
[null,{"$f":"sieve5","v":""},null,null,null,null,{"$f":"IF(E55=\"\",\"\",IF(RetainedMethodTx1=\"Cumulative\",(E55-SUM(G$39:G54)),SUM(E$39:E55)))","v":""},null,"",null,"",null,{"$f":"IF(E55=\"\",\"\",100-IF(RetainedMethodTx1=\"Cumulative\",E55/RetainedTotalTx1*100,G55/RetainedTotalTx1*100)-IF(ExtractAsphaltMethod=\"Ignition Oven Method\",Corr5,0))","v":""},null,{"$f":"IF(JMFDes5=\"\",\"\", TEXT(IF(AND(JMFDes4-JMFDes5-IF(SSize5>=2,5,3)>=0,JMFDes4-JMFDes5-IF(SSize5>=2,5,3)<=100),JMFDes4-JMFDes5-IF(SSize5>=2,5,3), TEXT(IF(JMFDes4-JMFDes5-IF(SSize5>=2,5,3)>100,100,0),\"##0.0\")),\"##0.0\") & \"-\" & TEXT(IF(AND(JMFDes4-JMFDes5+IF(SSize5>=2,5,3)>=0,JMFDes4-JMFDes5+IF(SSize5>=2,5,3)<=100),JMFDes4-JMFDes5+IF(SSize5>=2,5,3), TEXT(IF(JMFDes4-JMFDes5+IF(SSize5>=2,5,3)>100,100,0),\"##0.0\")),\"##0.0\"))","v":""},null,{"$f":"IF(JMFDes5=\"\",\"\",IF(ABS(JMFDes4-JMFDes5-$I55)>IF(SSize5>=2,5,3),\"ý\",\"þ\"))","v":""},null,"Filtering Aid (g):"]
[null,{"$f":"sieve6","v":""},null,null,null,null,{"$f":"IF(E56=\"\",\"\",IF(RetainedMethodTx1=\"Cumulative\",(E56-SUM(G$39:G55)),SUM(E$39:E56)))","v":""},null,"",null,"",null,{"$f":"IF(E56=\"\",\"\",100-IF(RetainedMethodTx1=\"Cumulative\",E56/RetainedTotalTx1*100,G56/RetainedTotalTx1*100)-IF(ExtractAsphaltMethod=\"Ignition Oven Method\",Corr6,0))","v":""},null,{"$f":"IF(JMFDes6=\"\",\"\", TEXT(IF(AND(JMFDes5-JMFDes6-IF(SSize6>=2,5,3)>=0,JMFDes5-JMFDes6-IF(SSize6>=2,5,3)<=100),JMFDes5-JMFDes6-IF(SSize6>=2,5,3), TEXT(IF(JMFDes5-JMFDes6-IF(SSize6>=2,5,3)>100,100,0),\"##0.0\")),\"##0.0\") & \"-\" & TEXT(IF(AND(JMFDes5-JMFDes6+IF(SSize6>=2,5,3)>=0,JMFDes5-JMFDes6+IF(SSize6>=2,5,3)<=100),JMFDes5-JMFDes6+IF(SSize6>=2,5,3), TEXT(IF(JMFDes5-JMFDes6+IF(SSize6>=2,5,3)>100,100,0),\"##0.0\")),\"##0.0\"))","v":""},null,{"$f":"IF(JMFDes6=\"\",\"\",IF(ABS(JMFDes5-JMFDes6-$I56)>IF(SSize6>=2,5,3),\"ý\",\"þ\"))","v":""},null,{"$f":"IF(extractedmethod=\"Vacuum\",\"Fines+Aggregate-Filter Aid (g):\",\"Fines+Aggregate+Ash (g):\")","v":"Fines+Aggregate+Ash (g):"},null,null,null,null,null,null,null,{"$f":"IF(ISERROR(+AA46+AA49+IF(extractedmethod=\"Vacuum\",-AA55,AA54)),\"\",+AA46+AA49+IF(extractedmethod=\"Vacuum\",-AA55,AA54))","v":""}]
[null,{"$f":"sieve7","v":""},null,null,null,null,{"$f":"IF(E57=\"\",\"\",IF(RetainedMethodTx1=\"Cumulative\",(E57-SUM(G$39:G56)),SUM(E$39:E57)))","v":""},null,"",null,"",null,{"$f":"IF(E57=\"\",\"\",100-IF(RetainedMethodTx1=\"Cumulative\",E57/RetainedTotalTx1*100,G57/RetainedTotalTx1*100)-IF(ExtractAsphaltMethod=\"Ignition Oven Method\",Corr7,0))","v":""},null,{"$f":"IF(JMFDes7=\"\",\"\",TEXT(IF(AND(JMFDes6-JMFDes7-IF(SSize7>=2,5,3)>=0,JMFDes6-JMFDes7-IF(SSize7>=2,5,3)<=100),JMFDes6-JMFDes7-IF(SSize7>=2,5,3), TEXT(IF(JMFDes6-JMFDes7-IF(SSize7>=2,5,3)>100,100,0),\"##0.0\")),\"##0.0\") & \"-\" & TEXT(IF(AND(JMFDes6-JMFDes7+IF(SSize7>=2,5,3)>=0,JMFDes6-JMFDes7+IF(SSize7>=2,5,3)<=100),JMFDes6-JMFDes7+IF(SSize7>=2,5,3), TEXT(IF(JMFDes6-JMFDes7+IF(SSize7>=2,5,3)>100,100,0),\"##0.0\")),\"##0.0\"))","v":""},null,{"$f":"IF(JMFDes7=\"\",\"\",IF(ABS(JMFDes6-JMFDes7-$I57)>IF(SSize7>=2,5,3),\"ý\",\"þ\"))","v":""},null,"Total Loss (%):",null,null,null,null,null,null,null,{"$f":"IF(ISERROR(AA60/AA43*100),\"\",AA60/AA43*100)","v":""}]
[null,{"$f":"sieve8","v":""},null,null,null,null,{"$f":"IF(E58=\"\",\"\",IF(RetainedMethodTx1=\"Cumulative\",(E58-SUM(G$39:G57)),SUM(E$39:E58)))","v":""},null,"",null,"",null,{"$f":"IF(E58=\"\",\"\",100-IF(RetainedMethodTx1=\"Cumulative\",E58/RetainedTotalTx1*100,G58/RetainedTotalTx1*100)-IF(ExtractAsphaltMethod=\"Ignition Oven Method\",Corr8,0))","v":""},null,{"$f":"IF(JMFDes8=\"\",\"\", TEXT(IF(AND(JMFDes7-JMFDes8-IF(SSize8>=2,5,3)>=0,JMFDes7-JMFDes8-IF(SSize8>=2,5,3)<=100),JMFDes7-JMFDes8-IF(SSize8>=2,5,3), TEXT(IF(JMFDes7-JMFDes8-IF(SSize8>=2,5,3)>100,100,0),\"##0.0\")),\"##0.0\") & \"-\" & TEXT(IF(AND(JMFDes7-JMFDes8+IF(SSize8>=2,5,3)>=0,JMFDes7-JMFDes8+IF(SSize8>=2,5,3)<=100),JMFDes7-JMFDes8+IF(SSize8>=2,5,3), TEXT(IF(JMFDes7-JMFDes8+IF(SSize8>=2,5,3)>100,100,0),\"##0.0\")),\"##0.0\"))","v":""},null,{"$f":"IF(JMFDes8=\"\",\"\",IF(ABS(JMFDes7-JMFDes8-$I58)>IF(SSize8>=2,5,3),\"ý\",\"þ\"))","v":""},null,"Hydrocarbon Volatiles (%):"]
[null,{"$f":"sieve9","v":""},null,null,null,null,{"$f":"IF(E59=\"\",\"\",IF(RetainedMethodTx1=\"Cumulative\",(E59-SUM(G$39:G58)),SUM(E$39:E59)))","v":""},null,"",null,"",null,{"$f":"IF(E59=\"\",\"\",100-IF(RetainedMethodTx1=\"Cumulative\",E59/RetainedTotalTx1*100,G59/RetainedTotalTx1*100)-IF(ExtractAsphaltMethod=\"Ignition Oven Method\",Corr9,0))","v":""},null,{"$f":"IF(JMFDes9=\"\",\"\",TEXT(IF(AND(JMFDes8-JMFDes9-IF(SSize9>=2,5,3)>=0,JMFDes8-JMFDes9-IF(SSize9>=2,5,3)<=100),JMFDes8-JMFDes9-IF(SSize9>=2,5,3), TEXT(IF(JMFDes8-JMFDes9-IF(SSize9>=2,5,3)>100,100,0),\"##0.0\")),\"##0.0\") & \"-\" & TEXT(IF(AND(JMFDes8-JMFDes9+IF(SSize9>=2,5,3)>=0,JMFDes8-JMFDes9+IF(SSize9>=2,5,3)<=100),JMFDes8-JMFDes9+IF(SSize9>=2,5,3), TEXT(IF(JMFDes8-JMFDes9+IF(SSize9>=2,5,3)>100,100,0),\"##0.0\")),\"##0.0\"))","v":""},null,{"$f":"IF(JMFDes9=\"\",\"\",IF(ABS(JMFDes8-JMFDes9-$I59)>IF(SSize9>=2,5,3),\"ý\",\"þ\"))","v":""},null,"Asphalt Content (%):",null,null,null,null,null,null,null,{"$f":"IF(ISERROR(AA57-AA61-AA58+AA62),\"\",AA57-AA61-AA58+AA62)","v":""}]
[null,{"$f":"sieve10","v":""},null,null,null,null,{"$f":"IF(E60=\"\",\"\",IF(RetainedMethodTx1=\"Cumulative\",(E60-SUM(G$39:G59)),SUM(E$39:E60)))","v":""},null,{"$f":"IF(ISERROR(M59-M60),\"\",M59-M60)","v":""},null,{"$f":"IF(ISERROR(K59+I60),\"\",K59+I60)","v":""},null,{"$f":"IF(E60=\"\",\"\",100-IF(RetainedMethodTx1=\"Cumulative\",E60/RetainedTotalTx1*100,G60/RetainedTotalTx1*100)-IF(ExtractAsphaltMethod=\"Ignition Oven Method\",Corr10,0))","v":""},null,{"$f":"IF(JMFDes10=\"\",\"\",TEXT(IF(AND(JMFDes9-JMFDes10-IF(ssize10>=2,5,3)>=0,JMFDes9-JMFDes10-IF(ssize10>=2,5,3)<=100),JMFDes9-JMFDes10-IF(ssize10>=2,5,3), TEXT(IF(JMFDes9-JMFDes10-IF(ssize10>=2,5,3)>100,100,0),\"##0.0\")),\"##0.0\") & \"-\" & TEXT(IF(AND(JMFDes9-JMFDes10+IF(ssize10>=2,5,3)>=0,JMFDes9-JMFDes10+IF(ssize10>=2,5,3)<=100),JMFDes9-JMFDes10+IF(ssize10>=2,5,3), TEXT(IF(JMFDes9-JMFDes10+IF(ssize10>=2,5,3)>100,100,0),\"##0.0\")),\"##0.0\"))","v":""},null,{"$f":"IF(JMFDes10=\"\",\"\",IF(ABS(JMFDes9-JMFDes10-$I60)>IF(ssize10>=2,5,3),\"ý\",\"þ\"))","v":""},null,"Total Loss (g):",null,null,null,null,null,null,null,{"$f":"IF(ISERROR(+AA43-AA56),\"\",+AA43-AA56)","v":""}]
[null,{"$f":"IF(Grade=\"\",\"\",\"-\" & OFFSET(B61,-COUNTBLANK(B51:B60)-1,0))","v":""},null,null,null,null,null,null,"*Adjusted for ignition oven correlation.",null,null,null,null,null,null,null,null,null,"Moisture Content (%):"]
[null,null,null,null,{"$f":"IF(COUNTBLANK(E51:E61)=11,\"\",IF(ISERROR(IF(ODSWtx1<>\"\",ODSWtx1-IF(RetainedMethodTx1=\"Cumulative\",LARGE(E51:E61,1),SUM(E51:E61)),Teatx1-IF(RetainedMethodTx1=\"Cumulative\",LARGE(E51:E61,1),SUM(E51:E61)))),0,IF(ODSWtx1<>\"\",ODSWtx1-IF(RetainedMethodTx1=\"Cumulative\",LARGE(E51:E61,1),SUM(E51:E61)),Teatx1-IF(RetainedMethodTx1=\"Cumulative\",LARGE(E51:E61,1),SUM(E51:E61)))))","v":""},null,{"$f":" IF(ODSWtx1<>\"\",IF(DWAWtx1<>\"\",\"Wash Loss\"&IF(slosstx1>0,\"-\",\"+\"),\"\"),IF(extractedmethod=\"vacuum\",\"Fines-Filter Aid\"&IF(slosstx1>0,\"-\",\"+\"),IF(extractedmethod=\"Chlorinated Centrifuge\",\"Fines+Buchner Fines\"&IF(slosstx1>0,\"-\",\"+\"),IF(extractedmethod=\"non-chlorinated centrifuge\",\"Total Ash+Fines\"&IF(slosstx1>0,\"-\",\"+\"),\"\"))))&IF(slosstx1>0,\"Gain (g)\",\"Loss (g)\")","v":"Gain (g)"},null,null,null,null,null,null,null,null,null,null,null,"Ash Factor (%):"]
[null,{"$f":"\"Total \" & B61","v":"Total "},null,null,{"$f":"IF(ISERROR(IF(RetainedMethodTx1=\"cumulative\",LARGE(E51:E61,1),PrePanTx1)+LossTx1),\"\",IF(RetainedMethodTx1=\"cumulative\",LARGE(E51:E61,1),PrePanTx1)+LossTx1)","v":""},null,{"$f":"IF(E61=\"\",\"\",IF(RetainedMethodTx1=\"Cumulative\",(E63-SUM(G$51:G60)),SUM(E$51:E60,PanTx1)))","v":""},null,{"$f":"IF(ISERROR(OFFSET(M61,-COUNTBLANK(B51:B60)-1,0)-M63),\"\",OFFSET(M61,-COUNTBLANK(B51:B60)-1,0)-M63)","v":""},null,{"$f":"IF(ISERROR(OFFSET(K61,-COUNTBLANK(B51:B60)-1,0)+I63),\"\",OFFSET(K61,-COUNTBLANK(B51:B60)-1,0)+I63)","v":""},null,{"$f":"IF(ISERROR(100-IF(RetainedMethodTx1=\"Cumulative\",E63/RetainedTotalTx1*100,G63/RetainedTotalTx1*100)),\"\",100-IF(RetainedMethodTx1=\"Cumulative\",E63/RetainedTotalTx1*100,G63/RetainedTotalTx1*100))","v":""},null,{"$f":"IF(ISERROR(TEXT(LEFT(INDIRECT(\"CJMF\"&(10-COUNTBLANK(B51:B60))),FIND(\"-\",INDIRECT(\"CJMF\"&(10-COUNTBLANK(B51:B60))),1)-1),\"#0.0\") & \"-\" & TEXT(MID(INDIRECT(\"CJMF\"&(10-COUNTBLANK(B51:B60))),FIND(\"-\",INDIRECT(\"CJMF\"&(10-COUNTBLANK(B51:B60))),1)+1,10),\"#0.0\")),\"\",TEXT(LEFT(INDIRECT(\"CJMF\"&(10-COUNTBLANK(B51:B60))),FIND(\"-\",INDIRECT(\"CJMF\"&(10-COUNTBLANK(B51:B60))),1)-1),\"#0.0\") & \"-\" & TEXT(MID(INDIRECT(\"CJMF\"&(10-COUNTBLANK(B51:B60))),FIND(\"-\",INDIRECT(\"CJMF\"&(10-COUNTBLANK(B51:B60))),1)+1,10),\"#0.0\"))","v":""},null,{"$f":"IF(O63=\"\",\"\",IF(AND(I63>=VALUE(LEFT(INDIRECT(\"CJMF\"&(10-COUNTBLANK(B51:B60))),FIND(\"-\",INDIRECT(\"CJMF\"&(10-COUNTBLANK(B51:B60))),1)-1)),I63<=VALUE(MID(INDIRECT(\"CJMF\"&(10-COUNTBLANK(B51:B60))),FIND(\"-\",INDIRECT(\"CJMF\"&(10-COUNTBLANK(B51:B60))),1)+1,10))),\"þ\",\"ý\"))","v":""},null,"Percent of Dry Aggregate (%):",null,null,null,null,null,null,null,{"$f":"IF(ISERROR(AA56/AA43*100-AA62),\"\",AA56/AA43*100-AA62)","v":""}]
[null,"Total Weight:",null,null,{"$f":"IF(ISERROR(IF(RetainedMethodTx1=\"Cumulative\",PanTx1,SUM(E51:E59)+PanTx1)),\"\",IF(RetainedMethodTx1=\"Cumulative\",PanTx1,SUM(E51:E59)+PanTx1))","v":""},null,null,null,null,null,null,null,null,null,null,null,null,null,null,null,null,null,null,"Total:",null,null,{"$f":"IF(COUNTBLANK(AA58:AA63)=6,\"\",SUM(AA61,AA58,AA59,AA63))","v":""}]
[null,null,null,{"$f":"IF(ISERROR(IF(slosstx1=\"\",\"\",IF(ODSWtx1<>\"\",IF(ABS(slosstx1)>ODSWtx1*0.002,\"Too High >>\",\"\"),IF(ABS(slosstx1)>Teatx1*0.002,\"Too High >>\",\"\")))),\"\",IF(slosstx1=\"\",\"\",IF(ODSWtx1<>\"\",IF(ABS(slosstx1)>ODSWtx1*0.002,\"Too High >>\",\"\"),IF(ABS(slosstx1)>Teatx1*0.002,\"Too High >>\",\"\"))))","v":""},{"$f":"IF(DWAWtx1<>\"\",IF(RetainedMethodTx1=\"Cumulative\",IF(ISERROR(LARGE(E51:E61,1)),0,LARGE(E51:E61,1)),SUM(E51:E61))-DWAWtx1,IF(ODSWtx1<>\"\",IF(RetainedMethodTx1=\"Cumulative\",IF(ISERROR(LARGE(E51:E61,1)),0,LARGE(E51:E61,1)),SUM(E51:E61))-ODSWtx1,IF(EAtx1<>\"\",IF(RetainedMethodTx1=\"Cumulative\",IF(ISERROR(LARGE(E51:E61,1)),0,LARGE(E51:E61,1)),SUM(E51:E61))-EAtx1,\"\")))","v":""},null,{"$f":"\"Sieving \" & IF(slosstx1>0,\"Gain\",\"Loss\") & \" (g), from \"& IF(DWAWtx1<>\"\",\"'dry weight after washing'\",IF(ODSWtx1<>\"\",\"'original dry sample'\",IF(EAtx1<>\"\",\"'extracted aggregate'\",\"?\")))","v":"Sieving Gain (g), from ?"}]
[]
[null,"Remarks:",null,null,{"$f":"NOW()","v":"2015-06-23T14:54:18.700"}]
[]
[]
[]
[]
[]
[null,"Test Method",null,null,null,"Tested By:",null,null,null,null,null,null,null,null,null,"Tested Date:"]
[null,"TX210"]
[]
[null,"TX229"]
[]
[null,"TX236"]
[null,"Test Stamp Code:",null,null,null,null,null,null,null,null,null,"Omit Test:",null,null,"Completed Date:",null,null,"Reviewed By:"]
[]
[null,"Locked By:",null,null,"TxDOT:",null,null,"District:",null,null,"Area:"]
[]
[null,"Authorized By:",null,null,null,null,null,null,null,null,null,"Authorized Date:"]

{"sheet":"RX","index":2,"n_rows":190,"n_cols":9,"rows_kept":190,"cut":false,"hidden":true,"merged":[]}
[188]
["Fld_nbr","Value","Desc_1","Desc_2","Desc_3","Desc_4","Desc_5","Desc_6","Desc_7"]
[1,{"$f":"IF('Tex-229-F'!$B$68=\"\",\"\",'Tex-229-F'!$B$68)","v":""},{"$f":"'Tex-229-F'!$B$67","v":"Remarks:"}]
[2,{"$f":"IF('Tex-229-F'!$G$18=\"\",\"\",'Tex-229-F'!$G$18)","v":""},{"$f":"IF('Tex-229-F'!$B$18=\"\",\"\",'Tex-229-F'!$B$18)","v":"COURSE\\LIFT:"}]
[3,{"$f":"IF('Tex-229-F'!$F$74=\"\",\"\",'Tex-229-F'!$F$74)","v":""},"Tested By ",{"$f":"IF('Tex-229-F'!$B$74=\"\",\"\",'Tex-229-F'!$B$74)","v":"TX210"}]
[4,{"$f":"IF('Tex-229-F'!$P$74=\"\",\"\",'Tex-229-F'!$P$74)","v":""},"Tested Date ",{"$f":"IF('Tex-229-F'!$B$74=\"\",\"\",'Tex-229-F'!$B$74)","v":"TX210"}]
[5,{"$f":"IF('Tex-229-F'!$F$76=\"\",\"\",'Tex-229-F'!$F$76)","v":""},"Tested By ",{"$f":"IF('Tex-229-F'!$B$76=\"\",\"\",'Tex-229-F'!$B$76)","v":"TX229"}]
[6,{"$f":"IF('Tex-229-F'!$P$76=\"\",\"\",'Tex-229-F'!$P$76)","v":""},"Tested Date ",{"$f":"IF('Tex-229-F'!$B$76=\"\",\"\",'Tex-229-F'!$B$76)","v":"TX229"}]
[7,{"$f":"IF('Tex-229-F'!$F$78=\"\",\"\",'Tex-229-F'!$F$78)","v":""},"Tested By ",{"$f":"IF('Tex-229-F'!$B$78=\"\",\"\",'Tex-229-F'!$B$78)","v":"TX236"}]
[8,{"$f":"IF('Tex-229-F'!$P$78=\"\",\"\",'Tex-229-F'!$P$78)","v":""},"Tested Date ",{"$f":"IF('Tex-229-F'!$B$78=\"\",\"\",'Tex-229-F'!$B$78)","v":"TX236"}]
[9,{"$f":"IF('Tex-229-F'!$G$20=\"\",\"\",'Tex-229-F'!$G$20)","v":""},{"$f":"IF('Tex-229-F'!$B$5=\"\",\"\",'Tex-229-F'!$B$5)","v":"COMBINED GRADATION"},{"$f":"IF('Tex-229-F'!$B$20=\"\",\"\",'Tex-229-F'!$B$20)","v":"Current JMF#:"}]
[10,{"$f":"IF('Tex-229-F'!$K$25=\"\",\"\",'Tex-229-F'!$K$25)","v":""},{"$f":"IF('Tex-229-F'!$B$23=\"\",\"\",'Tex-229-F'!$B$23)","v":"COMBINED AGGREGATE GRADATION:Tex-229-F"},{"$f":"IF('Tex-229-F'!$J$25=\"\",\"\",'Tex-229-F'!$J$25)","v":"Method used to obtain aggregate:"}]
[11,{"$f":"IF('Tex-229-F'!$S$25=\"\",\"\",'Tex-229-F'!$S$25)","v":""},{"$f":"IF('Tex-229-F'!$B$23=\"\",\"\",'Tex-229-F'!$B$23)","v":"COMBINED AGGREGATE GRADATION:Tex-229-F"},{"$f":"IF('Tex-229-F'!$J$25=\"\",\"\",'Tex-229-F'!$J$25)","v":"Method used to obtain aggregate:"},{"$f":"IF('Tex-229-F'!$Q$25=\"\",\"\",'Tex-229-F'!$Q$25)","v":"using:"}]
[12,{"$f":"IF('Tex-229-F'!$G$31=\"\",\"\",'Tex-229-F'!$G$31)","v":""},{"$f":"IF('Tex-229-F'!$B$23=\"\",\"\",'Tex-229-F'!$B$23)","v":"COMBINED AGGREGATE GRADATION:Tex-229-F"},{"$f":"IF('Tex-229-F'!$B$27=\"\",\"\",'Tex-229-F'!$B$27)","v":"Sieve Size:"},{"$f":"IF('Tex-229-F'!$B$31=\"\",\"\",'Tex-229-F'!$B$31)","v":""},{"$f":"IF('Tex-229-F'!$G$27=\"\",\"\",'Tex-229-F'!$G$27)","v":"Master Specification Tolerances %"}]
[13,{"$f":"IF('Tex-229-F'!$J$31=\"\",\"\",'Tex-229-F'!$J$31)","v":""},{"$f":"IF('Tex-229-F'!$B$23=\"\",\"\",'Tex-229-F'!$B$23)","v":"COMBINED AGGREGATE GRADATION:Tex-229-F"},{"$f":"IF('Tex-229-F'!$B$27=\"\",\"\",'Tex-229-F'!$B$27)","v":"Sieve Size:"},{"$f":"IF('Tex-229-F'!$B$31=\"\",\"\",'Tex-229-F'!$B$31)","v":""},{"$f":"IF('Tex-229-F'!$J$27=\"\",\"\",'Tex-229-F'!$J$27)","v":"Design JMF 1 Cumulative Percent Passing"}]
[14,{"$f":"IF('Tex-229-F'!$M$31=\"\",\"\",'Tex-229-F'!$M$31)","v":""},{"$f":"IF('Tex-229-F'!$B$23=\"\",\"\",'Tex-229-F'!$B$23)","v":"COMBINED AGGREGATE GRADATION:Tex-229-F"},{"$f":"IF('Tex-229-F'!$B$27=\"\",\"\",'Tex-229-F'!$B$27)","v":"Sieve Size:"},{"$f":"IF('Tex-229-F'!$B$31=\"\",\"\",'Tex-229-F'!$B$31)","v":""},{"$f":"IF('Tex-229-F'!$M$27=\"\",\"\",'Tex-229-F'!$M$27)","v":"In Tolerance"}]
[15,{"$f":"IF('Tex-229-F'!$N$31=\"\",\"\",'Tex-229-F'!$N$31)","v":""},{"$f":"IF('Tex-229-F'!$B$23=\"\",\"\",'Tex-229-F'!$B$23)","v":"COMBINED AGGREGATE GRADATION:Tex-229-F"},{"$f":"IF('Tex-229-F'!$B$27=\"\",\"\",'Tex-229-F'!$B$27)","v":"Sieve Size:"},{"$f":"IF('Tex-229-F'!$B$31=\"\",\"\",'Tex-229-F'!$B$31)","v":""},{"$f":"IF('Tex-229-F'!$N$27=\"\",\"\",'Tex-229-F'!$N$27)","v":"Current JMF CurrentJMF Design Tolerances %"}]
[16,{"$f":"IF('Tex-229-F'!$Q$31=\"\",\"\",'Tex-229-F'!$Q$31)","v":""},{"$f":"IF('Tex-229-F'!$B$23=\"\",\"\",'Tex-229-F'!$B$23)","v":"COMBINED AGGREGATE GRADATION:Tex-229-F"},{"$f":"IF('Tex-229-F'!$B$27=\"\",\"\",'Tex-229-F'!$B$27)","v":"Sieve Size:"},{"$f":"IF('Tex-229-F'!$B$31=\"\",\"\",'Tex-229-F'!$B$31)","v":""},{"$f":"IF('Tex-229-F'!$Q$27=\"\",\"\",'Tex-229-F'!$Q$27)","v":"Current JMF 2 Cumulative Percent Passing"}]
[17,{"$f":"IF('Tex-229-F'!$T$31=\"\",\"\",'Tex-229-F'!$T$31)","v":""},{"$f":"IF('Tex-229-F'!$B$23=\"\",\"\",'Tex-229-F'!$B$23)","v":"COMBINED AGGREGATE GRADATION:Tex-229-F"},{"$f":"IF('Tex-229-F'!$B$27=\"\",\"\",'Tex-229-F'!$B$27)","v":"Sieve Size:"},{"$f":"IF('Tex-229-F'!$B$31=\"\",\"\",'Tex-229-F'!$B$31)","v":""},{"$f":"IF('Tex-229-F'!$T$27=\"\",\"\",'Tex-229-F'!$T$27)","v":"In Tolerance"}]
[18,{"$f":"IF('Tex-229-F'!$U$31=\"\",\"\",'Tex-229-F'!$U$31)","v":""},{"$f":"IF('Tex-229-F'!$B$23=\"\",\"\",'Tex-229-F'!$B$23)","v":"COMBINED AGGREGATE GRADATION:Tex-229-F"},{"$f":"IF('Tex-229-F'!$B$27=\"\",\"\",'Tex-229-F'!$B$27)","v":"Sieve Size:"},{"$f":"IF('Tex-229-F'!$B$31=\"\",\"\",'Tex-229-F'!$B$31)","v":""},{"$f":"IF('Tex-229-F'!$U$27=\"\",\"\",'Tex-229-F'!$U$27)","v":"Sieve Size:"}]
[19,{"$f":"IF('Tex-229-F'!$X$31=\"\",\"\",'Tex-229-F'!$X$31)","v":""},{"$f":"IF('Tex-229-F'!$B$23=\"\",\"\",'Tex-229-F'!$B$23)","v":"COMBINED AGGREGATE GRADATION:Tex-229-F"},{"$f":"IF('Tex-229-F'!$B$27=\"\",\"\",'Tex-229-F'!$B$27)","v":"Sieve Size:"},{"$f":"IF('Tex-229-F'!$B$31=\"\",\"\",'Tex-229-F'!$B$31)","v":""},{"$f":"IF('Tex-229-F'!$X$27=\"\",\"\",'Tex-229-F'!$X$27)","v":"Ignition Oven correlation Factor,%:"}]
[20,{"$f":"IF('Tex-229-F'!$G$32=\"\",\"\",'Tex-229-F'!$G$32)","v":""},{"$f":"IF('Tex-229-F'!$B$23=\"\",\"\",'Tex-229-F'!$B$23)","v":"COMBINED AGGREGATE GRADATION:Tex-229-F"},{"$f":"IF('Tex-229-F'!$B$27=\"\",\"\",'Tex-229-F'!$B$27)","v":"Sieve Size:"},{"$f":"IF('Tex-229-F'!$B$32=\"\",\"\",'Tex-229-F'!$B$32)","v":""},{"$f":"IF('Tex-229-F'!$G$27=\"\",\"\",'Tex-229-F'!$G$27)","v":"Master Specification Tolerances %"}]
[21,{"$f":"IF('Tex-229-F'!$J$32=\"\",\"\",'Tex-229-F'!$J$32)","v":""},{"$f":"IF('Tex-229-F'!$B$23=\"\",\"\",'Tex-229-F'!$B$23)","v":"COMBINED AGGREGATE GRADATION:Tex-229-F"},{"$f":"IF('Tex-229-F'!$B$27=\"\",\"\",'Tex-229-F'!$B$27)","v":"Sieve Size:"},{"$f":"IF('Tex-229-F'!$B$32=\"\",\"\",'Tex-229-F'!$B$32)","v":""},{"$f":"IF('Tex-229-F'!$J$27=\"\",\"\",'Tex-229-F'!$J$27)","v":"Design JMF 1 Cumulative Percent Passing"}]
[22,{"$f":"IF('Tex-229-F'!$M$32=\"\",\"\",'Tex-229-F'!$M$32)","v":""},{"$f":"IF('Tex-229-F'!$B$23=\"\",\"\",'Tex-229-F'!$B$23)","v":"COMBINED AGGREGATE GRADATION:Tex-229-F"},{"$f":"IF('Tex-229-F'!$B$27=\"\",\"\",'Tex-229-F'!$B$27)","v":"Sieve Size:"},{"$f":"IF('Tex-229-F'!$B$32=\"\",\"\",'Tex-229-F'!$B$32)","v":""},{"$f":"IF('Tex-229-F'!$M$27=\"\",\"\",'Tex-229-F'!$M$27)","v":"In Tolerance"}]
[23,{"$f":"IF('Tex-229-F'!$N$32=\"\",\"\",'Tex-229-F'!$N$32)","v":""},{"$f":"IF('Tex-229-F'!$B$23=\"\",\"\",'Tex-229-F'!$B$23)","v":"COMBINED AGGREGATE GRADATION:Tex-229-F"},{"$f":"IF('Tex-229-F'!$B$27=\"\",\"\",'Tex-229-F'!$B$27)","v":"Sieve Size:"},{"$f":"IF('Tex-229-F'!$B$32=\"\",\"\",'Tex-229-F'!$B$32)","v":""},{"$f":"IF('Tex-229-F'!$N$27=\"\",\"\",'Tex-229-F'!$N$27)","v":"Current JMF CurrentJMF Design Tolerances %"}]
[24,{"$f":"IF('Tex-229-F'!$Q$32=\"\",\"\",'Tex-229-F'!$Q$32)","v":""},{"$f":"IF('Tex-229-F'!$B$23=\"\",\"\",'Tex-229-F'!$B$23)","v":"COMBINED AGGREGATE GRADATION:Tex-229-F"},{"$f":"IF('Tex-229-F'!$B$27=\"\",\"\",'Tex-229-F'!$B$27)","v":"Sieve Size:"},{"$f":"IF('Tex-229-F'!$B$32=\"\",\"\",'Tex-229-F'!$B$32)","v":""},{"$f":"IF('Tex-229-F'!$Q$27=\"\",\"\",'Tex-229-F'!$Q$27)","v":"Current JMF 2 Cumulative Percent Passing"}]
[25,{"$f":"IF('Tex-229-F'!$T$32=\"\",\"\",'Tex-229-F'!$T$32)","v":""},{"$f":"IF('Tex-229-F'!$B$23=\"\",\"\",'Tex-229-F'!$B$23)","v":"COMBINED AGGREGATE GRADATION:Tex-229-F"},{"$f":"IF('Tex-229-F'!$B$27=\"\",\"\",'Tex-229-F'!$B$27)","v":"Sieve Size:"},{"$f":"IF('Tex-229-F'!$B$32=\"\",\"\",'Tex-229-F'!$B$32)","v":""},{"$f":"IF('Tex-229-F'!$T$27=\"\",\"\",'Tex-229-F'!$T$27)","v":"In Tolerance"}]
[26,{"$f":"IF('Tex-229-F'!$U$32=\"\",\"\",'Tex-229-F'!$U$32)","v":""},{"$f":"IF('Tex-229-F'!$B$23=\"\",\"\",'Tex-229-F'!$B$23)","v":"COMBINED AGGREGATE GRADATION:Tex-229-F"},{"$f":"IF('Tex-229-F'!$B$27=\"\",\"\",'Tex-229-F'!$B$27)","v":"Sieve Size:"},{"$f":"IF('Tex-229-F'!$B$32=\"\",\"\",'Tex-229-F'!$B$32)","v":""},{"$f":"IF('Tex-229-F'!$U$27=\"\",\"\",'Tex-229-F'!$U$27)","v":"Sieve Size:"}]
[27,{"$f":"IF('Tex-229-F'!$X$32=\"\",\"\",'Tex-229-F'!$X$32)","v":""},{"$f":"IF('Tex-229-F'!$B$23=\"\",\"\",'Tex-229-F'!$B$23)","v":"COMBINED AGGREGATE GRADATION:Tex-229-F"},{"$f":"IF('Tex-229-F'!$B$27=\"\",\"\",'Tex-229-F'!$B$27)","v":"Sieve Size:"},{"$f":"IF('Tex-229-F'!$B$32=\"\",\"\",'Tex-229-F'!$B$32)","v":""},{"$f":"IF('Tex-229-F'!$X$27=\"\",\"\",'Tex-229-F'!$X$27)","v":"Ignition Oven correlation Factor,%:"}]
[28,{"$f":"IF('Tex-229-F'!$G$33=\"\",\"\",'Tex-229-F'!$G$33)","v":""},{"$f":"IF('Tex-229-F'!$B$23=\"\",\"\",'Tex-229-F'!$B$23)","v":"COMBINED AGGREGATE GRADATION:Tex-229-F"},{"$f":"IF('Tex-229-F'!$B$27=\"\",\"\",'Tex-229-F'!$B$27)","v":"Sieve Size:"},{"$f":"IF('Tex-229-F'!$B$33=\"\",\"\",'Tex-229-F'!$B$33)","v":""},{"$f":"IF('Tex-229-F'!$G$27=\"\",\"\",'Tex-229-F'!$G$27)","v":"Master Specification Tolerances %"}]
[29,{"$f":"IF('Tex-229-F'!$J$33=\"\",\"\",'Tex-229-F'!$J$33)","v":""},{"$f":"IF('Tex-229-F'!$B$23=\"\",\"\",'Tex-229-F'!$B$23)","v":"COMBINED AGGREGATE GRADATION:Tex-229-F"},{"$f":"IF('Tex-229-F'!$B$27=\"\",\"\",'Tex-229-F'!$B$27)","v":"Sieve Size:"},{"$f":"IF('Tex-229-F'!$B$33=\"\",\"\",'Tex-229-F'!$B$33)","v":""},{"$f":"IF('Tex-229-F'!$J$27=\"\",\"\",'Tex-229-F'!$J$27)","v":"Design JMF 1 Cumulative Percent Passing"}]
[30,{"$f":"IF('Tex-229-F'!$M$33=\"\",\"\",'Tex-229-F'!$M$33)","v":""},{"$f":"IF('Tex-229-F'!$B$23=\"\",\"\",'Tex-229-F'!$B$23)","v":"COMBINED AGGREGATE GRADATION:Tex-229-F"},{"$f":"IF('Tex-229-F'!$B$27=\"\",\"\",'Tex-229-F'!$B$27)","v":"Sieve Size:"},{"$f":"IF('Tex-229-F'!$B$33=\"\",\"\",'Tex-229-F'!$B$33)","v":""},{"$f":"IF('Tex-229-F'!$M$27=\"\",\"\",'Tex-229-F'!$M$27)","v":"In Tolerance"}]
[31,{"$f":"IF('Tex-229-F'!$N$33=\"\",\"\",'Tex-229-F'!$N$33)","v":""},{"$f":"IF('Tex-229-F'!$B$23=\"\",\"\",'Tex-229-F'!$B$23)","v":"COMBINED AGGREGATE GRADATION:Tex-229-F"},{"$f":"IF('Tex-229-F'!$B$27=\"\",\"\",'Tex-229-F'!$B$27)","v":"Sieve Size:"},{"$f":"IF('Tex-229-F'!$B$33=\"\",\"\",'Tex-229-F'!$B$33)","v":""},{"$f":"IF('Tex-229-F'!$N$27=\"\",\"\",'Tex-229-F'!$N$27)","v":"Current JMF CurrentJMF Design Tolerances %"}]
[32,{"$f":"IF('Tex-229-F'!$Q$33=\"\",\"\",'Tex-229-F'!$Q$33)","v":""},{"$f":"IF('Tex-229-F'!$B$23=\"\",\"\",'Tex-229-F'!$B$23)","v":"COMBINED AGGREGATE GRADATION:Tex-229-F"},{"$f":"IF('Tex-229-F'!$B$27=\"\",\"\",'Tex-229-F'!$B$27)","v":"Sieve Size:"},{"$f":"IF('Tex-229-F'!$B$33=\"\",\"\",'Tex-229-F'!$B$33)","v":""},{"$f":"IF('Tex-229-F'!$Q$27=\"\",\"\",'Tex-229-F'!$Q$27)","v":"Current JMF 2 Cumulative Percent Passing"}]
[33,{"$f":"IF('Tex-229-F'!$T$33=\"\",\"\",'Tex-229-F'!$T$33)","v":""},{"$f":"IF('Tex-229-F'!$B$23=\"\",\"\",'Tex-229-F'!$B$23)","v":"COMBINED AGGREGATE GRADATION:Tex-229-F"},{"$f":"IF('Tex-229-F'!$B$27=\"\",\"\",'Tex-229-F'!$B$27)","v":"Sieve Size:"},{"$f":"IF('Tex-229-F'!$B$33=\"\",\"\",'Tex-229-F'!$B$33)","v":""},{"$f":"IF('Tex-229-F'!$T$27=\"\",\"\",'Tex-229-F'!$T$27)","v":"In Tolerance"}]
[34,{"$f":"IF('Tex-229-F'!$U$33=\"\",\"\",'Tex-229-F'!$U$33)","v":""},{"$f":"IF('Tex-229-F'!$B$23=\"\",\"\",'Tex-229-F'!$B$23)","v":"COMBINED AGGREGATE GRADATION:Tex-229-F"},{"$f":"IF('Tex-229-F'!$B$27=\"\",\"\",'Tex-229-F'!$B$27)","v":"Sieve Size:"},{"$f":"IF('Tex-229-F'!$B$33=\"\",\"\",'Tex-229-F'!$B$33)","v":""},{"$f":"IF('Tex-229-F'!$U$27=\"\",\"\",'Tex-229-F'!$U$27)","v":"Sieve Size:"}]
[35,{"$f":"IF('Tex-229-F'!$X$33=\"\",\"\",'Tex-229-F'!$X$33)","v":""},{"$f":"IF('Tex-229-F'!$B$23=\"\",\"\",'Tex-229-F'!$B$23)","v":"COMBINED AGGREGATE GRADATION:Tex-229-F"},{"$f":"IF('Tex-229-F'!$B$27=\"\",\"\",'Tex-229-F'!$B$27)","v":"Sieve Size:"},{"$f":"IF('Tex-229-F'!$B$33=\"\",\"\",'Tex-229-F'!$B$33)","v":""},{"$f":"IF('Tex-229-F'!$X$27=\"\",\"\",'Tex-229-F'!$X$27)","v":"Ignition Oven correlation Factor,%:"}]
[36,{"$f":"IF('Tex-229-F'!$G$34=\"\",\"\",'Tex-229-F'!$G$34)","v":""},{"$f":"IF('Tex-229-F'!$B$23=\"\",\"\",'Tex-229-F'!$B$23)","v":"COMBINED AGGREGATE GRADATION:Tex-229-F"},{"$f":"IF('Tex-229-F'!$B$27=\"\",\"\",'Tex-229-F'!$B$27)","v":"Sieve Size:"},{"$f":"IF('Tex-229-F'!$B$34=\"\",\"\",'Tex-229-F'!$B$34)","v":""},{"$f":"IF('Tex-229-F'!$G$27=\"\",\"\",'Tex-229-F'!$G$27)","v":"Master Specification Tolerances %"}]
[37,{"$f":"IF('Tex-229-F'!$J$34=\"\",\"\",'Tex-229-F'!$J$34)","v":""},{"$f":"IF('Tex-229-F'!$B$23=\"\",\"\",'Tex-229-F'!$B$23)","v":"COMBINED AGGREGATE GRADATION:Tex-229-F"},{"$f":"IF('Tex-229-F'!$B$27=\"\",\"\",'Tex-229-F'!$B$27)","v":"Sieve Size:"},{"$f":"IF('Tex-229-F'!$B$34=\"\",\"\",'Tex-229-F'!$B$34)","v":""},{"$f":"IF('Tex-229-F'!$J$27=\"\",\"\",'Tex-229-F'!$J$27)","v":"Design JMF 1 Cumulative Percent Passing"}]
[38,{"$f":"IF('Tex-229-F'!$M$34=\"\",\"\",'Tex-229-F'!$M$34)","v":""},{"$f":"IF('Tex-229-F'!$B$23=\"\",\"\",'Tex-229-F'!$B$23)","v":"COMBINED AGGREGATE GRADATION:Tex-229-F"},{"$f":"IF('Tex-229-F'!$B$27=\"\",\"\",'Tex-229-F'!$B$27)","v":"Sieve Size:"},{"$f":"IF('Tex-229-F'!$B$34=\"\",\"\",'Tex-229-F'!$B$34)","v":""},{"$f":"IF('Tex-229-F'!$M$27=\"\",\"\",'Tex-229-F'!$M$27)","v":"In Tolerance"}]
[39,{"$f":"IF('Tex-229-F'!$N$34=\"\",\"\",'Tex-229-F'!$N$34)","v":""},{"$f":"IF('Tex-229-F'!$B$23=\"\",\"\",'Tex-229-F'!$B$23)","v":"COMBINED AGGREGATE GRADATION:Tex-229-F"},{"$f":"IF('Tex-229-F'!$B$27=\"\",\"\",'Tex-229-F'!$B$27)","v":"Sieve Size:"},{"$f":"IF('Tex-229-F'!$B$34=\"\",\"\",'Tex-229-F'!$B$34)","v":""},{"$f":"IF('Tex-229-F'!$N$27=\"\",\"\",'Tex-229-F'!$N$27)","v":"Current JMF CurrentJMF Design Tolerances %"}]
[40,{"$f":"IF('Tex-229-F'!$Q$34=\"\",\"\",'Tex-229-F'!$Q$34)","v":""},{"$f":"IF('Tex-229-F'!$B$23=\"\",\"\",'Tex-229-F'!$B$23)","v":"COMBINED AGGREGATE GRADATION:Tex-229-F"},{"$f":"IF('Tex-229-F'!$B$27=\"\",\"\",'Tex-229-F'!$B$27)","v":"Sieve Size:"},{"$f":"IF('Tex-229-F'!$B$34=\"\",\"\",'Tex-229-F'!$B$34)","v":""},{"$f":"IF('Tex-229-F'!$Q$27=\"\",\"\",'Tex-229-F'!$Q$27)","v":"Current JMF 2 Cumulative Percent Passing"}]
[41,{"$f":"IF('Tex-229-F'!$T$34=\"\",\"\",'Tex-229-F'!$T$34)","v":""},{"$f":"IF('Tex-229-F'!$B$23=\"\",\"\",'Tex-229-F'!$B$23)","v":"COMBINED AGGREGATE GRADATION:Tex-229-F"},{"$f":"IF('Tex-229-F'!$B$27=\"\",\"\",'Tex-229-F'!$B$27)","v":"Sieve Size:"},{"$f":"IF('Tex-229-F'!$B$34=\"\",\"\",'Tex-229-F'!$B$34)","v":""},{"$f":"IF('Tex-229-F'!$T$27=\"\",\"\",'Tex-229-F'!$T$27)","v":"In Tolerance"}]
[42,{"$f":"IF('Tex-229-F'!$U$34=\"\",\"\",'Tex-229-F'!$U$34)","v":""},{"$f":"IF('Tex-229-F'!$B$23=\"\",\"\",'Tex-229-F'!$B$23)","v":"COMBINED AGGREGATE GRADATION:Tex-229-F"},{"$f":"IF('Tex-229-F'!$B$27=\"\",\"\",'Tex-229-F'!$B$27)","v":"Sieve Size:"},{"$f":"IF('Tex-229-F'!$B$34=\"\",\"\",'Tex-229-F'!$B$34)","v":""},{"$f":"IF('Tex-229-F'!$U$27=\"\",\"\",'Tex-229-F'!$U$27)","v":"Sieve Size:"}]
[43,{"$f":"IF('Tex-229-F'!$X$34=\"\",\"\",'Tex-229-F'!$X$34)","v":""},{"$f":"IF('Tex-229-F'!$B$23=\"\",\"\",'Tex-229-F'!$B$23)","v":"COMBINED AGGREGATE GRADATION:Tex-229-F"},{"$f":"IF('Tex-229-F'!$B$27=\"\",\"\",'Tex-229-F'!$B$27)","v":"Sieve Size:"},{"$f":"IF('Tex-229-F'!$B$34=\"\",\"\",'Tex-229-F'!$B$34)","v":""},{"$f":"IF('Tex-229-F'!$X$27=\"\",\"\",'Tex-229-F'!$X$27)","v":"Ignition Oven correlation Factor,%:"}]
[44,{"$f":"IF('Tex-229-F'!$G$35=\"\",\"\",'Tex-229-F'!$G$35)","v":""},{"$f":"IF('Tex-229-F'!$B$23=\"\",\"\",'Tex-229-F'!$B$23)","v":"COMBINED AGGREGATE GRADATION:Tex-229-F"},{"$f":"IF('Tex-229-F'!$B$27=\"\",\"\",'Tex-229-F'!$B$27)","v":"Sieve Size:"},{"$f":"IF('Tex-229-F'!$B$35=\"\",\"\",'Tex-229-F'!$B$35)","v":""},{"$f":"IF('Tex-229-F'!$G$27=\"\",\"\",'Tex-229-F'!$G$27)","v":"Master Specification Tolerances %"}]
[45,{"$f":"IF('Tex-229-F'!$J$35=\"\",\"\",'Tex-229-F'!$J$35)","v":""},{"$f":"IF('Tex-229-F'!$B$23=\"\",\"\",'Tex-229-F'!$B$23)","v":"COMBINED AGGREGATE GRADATION:Tex-229-F"},{"$f":"IF('Tex-229-F'!$B$27=\"\",\"\",'Tex-229-F'!$B$27)","v":"Sieve Size:"},{"$f":"IF('Tex-229-F'!$B$35=\"\",\"\",'Tex-229-F'!$B$35)","v":""},{"$f":"IF('Tex-229-F'!$J$27=\"\",\"\",'Tex-229-F'!$J$27)","v":"Design JMF 1 Cumulative Percent Passing"}]
[46,{"$f":"IF('Tex-229-F'!$M$35=\"\",\"\",'Tex-229-F'!$M$35)","v":""},{"$f":"IF('Tex-229-F'!$B$23=\"\",\"\",'Tex-229-F'!$B$23)","v":"COMBINED AGGREGATE GRADATION:Tex-229-F"},{"$f":"IF('Tex-229-F'!$B$27=\"\",\"\",'Tex-229-F'!$B$27)","v":"Sieve Size:"},{"$f":"IF('Tex-229-F'!$B$35=\"\",\"\",'Tex-229-F'!$B$35)","v":""},{"$f":"IF('Tex-229-F'!$M$27=\"\",\"\",'Tex-229-F'!$M$27)","v":"In Tolerance"}]
[47,{"$f":"IF('Tex-229-F'!$N$35=\"\",\"\",'Tex-229-F'!$N$35)","v":""},{"$f":"IF('Tex-229-F'!$B$23=\"\",\"\",'Tex-229-F'!$B$23)","v":"COMBINED AGGREGATE GRADATION:Tex-229-F"},{"$f":"IF('Tex-229-F'!$B$27=\"\",\"\",'Tex-229-F'!$B$27)","v":"Sieve Size:"},{"$f":"IF('Tex-229-F'!$B$35=\"\",\"\",'Tex-229-F'!$B$35)","v":""},{"$f":"IF('Tex-229-F'!$N$27=\"\",\"\",'Tex-229-F'!$N$27)","v":"Current JMF CurrentJMF Design Tolerances %"}]
[48,{"$f":"IF('Tex-229-F'!$Q$35=\"\",\"\",'Tex-229-F'!$Q$35)","v":""},{"$f":"IF('Tex-229-F'!$B$23=\"\",\"\",'Tex-229-F'!$B$23)","v":"COMBINED AGGREGATE GRADATION:Tex-229-F"},{"$f":"IF('Tex-229-F'!$B$27=\"\",\"\",'Tex-229-F'!$B$27)","v":"Sieve Size:"},{"$f":"IF('Tex-229-F'!$B$35=\"\",\"\",'Tex-229-F'!$B$35)","v":""},{"$f":"IF('Tex-229-F'!$Q$27=\"\",\"\",'Tex-229-F'!$Q$27)","v":"Current JMF 2 Cumulative Percent Passing"}]
[49,{"$f":"IF('Tex-229-F'!$T$35=\"\",\"\",'Tex-229-F'!$T$35)","v":""},{"$f":"IF('Tex-229-F'!$B$23=\"\",\"\",'Tex-229-F'!$B$23)","v":"COMBINED AGGREGATE GRADATION:Tex-229-F"},{"$f":"IF('Tex-229-F'!$B$27=\"\",\"\",'Tex-229-F'!$B$27)","v":"Sieve Size:"},{"$f":"IF('Tex-229-F'!$B$35=\"\",\"\",'Tex-229-F'!$B$35)","v":""},{"$f":"IF('Tex-229-F'!$T$27=\"\",\"\",'Tex-229-F'!$T$27)","v":"In Tolerance"}]
[50,{"$f":"IF('Tex-229-F'!$U$35=\"\",\"\",'Tex-229-F'!$U$35)","v":""},{"$f":"IF('Tex-229-F'!$B$23=\"\",\"\",'Tex-229-F'!$B$23)","v":"COMBINED AGGREGATE GRADATION:Tex-229-F"},{"$f":"IF('Tex-229-F'!$B$27=\"\",\"\",'Tex-229-F'!$B$27)","v":"Sieve Size:"},{"$f":"IF('Tex-229-F'!$B$35=\"\",\"\",'Tex-229-F'!$B$35)","v":""},{"$f":"IF('Tex-229-F'!$U$27=\"\",\"\",'Tex-229-F'!$U$27)","v":"Sieve Size:"}]
[51,{"$f":"IF('Tex-229-F'!$X$35=\"\",\"\",'Tex-229-F'!$X$35)","v":""},{"$f":"IF('Tex-229-F'!$B$23=\"\",\"\",'Tex-229-F'!$B$23)","v":"COMBINED AGGREGATE GRADATION:Tex-229-F"},{"$f":"IF('Tex-229-F'!$B$27=\"\",\"\",'Tex-229-F'!$B$27)","v":"Sieve Size:"},{"$f":"IF('Tex-229-F'!$B$35=\"\",\"\",'Tex-229-F'!$B$35)","v":""},{"$f":"IF('Tex-229-F'!$X$27=\"\",\"\",'Tex-229-F'!$X$27)","v":"Ignition Oven correlation Factor,%:"}]
[52,{"$f":"IF('Tex-229-F'!$G$36=\"\",\"\",'Tex-229-F'!$G$36)","v":""},{"$f":"IF('Tex-229-F'!$B$23=\"\",\"\",'Tex-229-F'!$B$23)","v":"COMBINED AGGREGATE GRADATION:Tex-229-F"},{"$f":"IF('Tex-229-F'!$B$27=\"\",\"\",'Tex-229-F'!$B$27)","v":"Sieve Size:"},{"$f":"IF('Tex-229-F'!$B$36=\"\",\"\",'Tex-229-F'!$B$36)","v":""},{"$f":"IF('Tex-229-F'!$G$27=\"\",\"\",'Tex-229-F'!$G$27)","v":"Master Specification Tolerances %"}]
[53,{"$f":"IF('Tex-229-F'!$J$36=\"\",\"\",'Tex-229-F'!$J$36)","v":""},{"$f":"IF('Tex-229-F'!$B$23=\"\",\"\",'Tex-229-F'!$B$23)","v":"COMBINED AGGREGATE GRADATION:Tex-229-F"},{"$f":"IF('Tex-229-F'!$B$27=\"\",\"\",'Tex-229-F'!$B$27)","v":"Sieve Size:"},{"$f":"IF('Tex-229-F'!$B$36=\"\",\"\",'Tex-229-F'!$B$36)","v":""},{"$f":"IF('Tex-229-F'!$J$27=\"\",\"\",'Tex-229-F'!$J$27)","v":"Design JMF 1 Cumulative Percent Passing"}]
[54,{"$f":"IF('Tex-229-F'!$M$36=\"\",\"\",'Tex-229-F'!$M$36)","v":""},{"$f":"IF('Tex-229-F'!$B$23=\"\",\"\",'Tex-229-F'!$B$23)","v":"COMBINED AGGREGATE GRADATION:Tex-229-F"},{"$f":"IF('Tex-229-F'!$B$27=\"\",\"\",'Tex-229-F'!$B$27)","v":"Sieve Size:"},{"$f":"IF('Tex-229-F'!$B$36=\"\",\"\",'Tex-229-F'!$B$36)","v":""},{"$f":"IF('Tex-229-F'!$M$27=\"\",\"\",'Tex-229-F'!$M$27)","v":"In Tolerance"}]
[55,{"$f":"IF('Tex-229-F'!$N$36=\"\",\"\",'Tex-229-F'!$N$36)","v":""},{"$f":"IF('Tex-229-F'!$B$23=\"\",\"\",'Tex-229-F'!$B$23)","v":"COMBINED AGGREGATE GRADATION:Tex-229-F"},{"$f":"IF('Tex-229-F'!$B$27=\"\",\"\",'Tex-229-F'!$B$27)","v":"Sieve Size:"},{"$f":"IF('Tex-229-F'!$B$36=\"\",\"\",'Tex-229-F'!$B$36)","v":""},{"$f":"IF('Tex-229-F'!$N$27=\"\",\"\",'Tex-229-F'!$N$27)","v":"Current JMF CurrentJMF Design Tolerances %"}]
[56,{"$f":"IF('Tex-229-F'!$Q$36=\"\",\"\",'Tex-229-F'!$Q$36)","v":""},{"$f":"IF('Tex-229-F'!$B$23=\"\",\"\",'Tex-229-F'!$B$23)","v":"COMBINED AGGREGATE GRADATION:Tex-229-F"},{"$f":"IF('Tex-229-F'!$B$27=\"\",\"\",'Tex-229-F'!$B$27)","v":"Sieve Size:"},{"$f":"IF('Tex-229-F'!$B$36=\"\",\"\",'Tex-229-F'!$B$36)","v":""},{"$f":"IF('Tex-229-F'!$Q$27=\"\",\"\",'Tex-229-F'!$Q$27)","v":"Current JMF 2 Cumulative Percent Passing"}]
[57,{"$f":"IF('Tex-229-F'!$T$36=\"\",\"\",'Tex-229-F'!$T$36)","v":""},{"$f":"IF('Tex-229-F'!$B$23=\"\",\"\",'Tex-229-F'!$B$23)","v":"COMBINED AGGREGATE GRADATION:Tex-229-F"},{"$f":"IF('Tex-229-F'!$B$27=\"\",\"\",'Tex-229-F'!$B$27)","v":"Sieve Size:"},{"$f":"IF('Tex-229-F'!$B$36=\"\",\"\",'Tex-229-F'!$B$36)","v":""},{"$f":"IF('Tex-229-F'!$T$27=\"\",\"\",'Tex-229-F'!$T$27)","v":"In Tolerance"}]
[58,{"$f":"IF('Tex-229-F'!$U$36=\"\",\"\",'Tex-229-F'!$U$36)","v":""},{"$f":"IF('Tex-229-F'!$B$23=\"\",\"\",'Tex-229-F'!$B$23)","v":"COMBINED AGGREGATE GRADATION:Tex-229-F"},{"$f":"IF('Tex-229-F'!$B$27=\"\",\"\",'Tex-229-F'!$B$27)","v":"Sieve Size:"},{"$f":"IF('Tex-229-F'!$B$36=\"\",\"\",'Tex-229-F'!$B$36)","v":""},{"$f":"IF('Tex-229-F'!$U$27=\"\",\"\",'Tex-229-F'!$U$27)","v":"Sieve Size:"}]
[59,{"$f":"IF('Tex-229-F'!$X$36=\"\",\"\",'Tex-229-F'!$X$36)","v":""},{"$f":"IF('Tex-229-F'!$B$23=\"\",\"\",'Tex-229-F'!$B$23)","v":"COMBINED AGGREGATE GRADATION:Tex-229-F"},{"$f":"IF('Tex-229-F'!$B$27=\"\",\"\",'Tex-229-F'!$B$27)","v":"Sieve Size:"},{"$f":"IF('Tex-229-F'!$B$36=\"\",\"\",'Tex-229-F'!$B$36)","v":""},{"$f":"IF('Tex-229-F'!$X$27=\"\",\"\",'Tex-229-F'!$X$27)","v":"Ignition Oven correlation Factor,%:"}]
[60,{"$f":"IF('Tex-229-F'!$G$37=\"\",\"\",'Tex-229-F'!$G$37)","v":""},{"$f":"IF('Tex-229-F'!$B$23=\"\",\"\",'Tex-229-F'!$B$23)","v":"COMBINED AGGREGATE GRADATION:Tex-229-F"},{"$f":"IF('Tex-229-F'!$B$27=\"\",\"\",'Tex-229-F'!$B$27)","v":"Sieve Size:"},{"$f":"IF('Tex-229-F'!$B$37=\"\",\"\",'Tex-229-F'!$B$37)","v":""},{"$f":"IF('Tex-229-F'!$G$27=\"\",\"\",'Tex-229-F'!$G$27)","v":"Master Specification Tolerances %"}]
[61,{"$f":"IF('Tex-229-F'!$J$37=\"\",\"\",'Tex-229-F'!$J$37)","v":""},{"$f":"IF('Tex-229-F'!$B$23=\"\",\"\",'Tex-229-F'!$B$23)","v":"COMBINED AGGREGATE GRADATION:Tex-229-F"},{"$f":"IF('Tex-229-F'!$B$27=\"\",\"\",'Tex-229-F'!$B$27)","v":"Sieve Size:"},{"$f":"IF('Tex-229-F'!$B$37=\"\",\"\",'Tex-229-F'!$B$37)","v":""},{"$f":"IF('Tex-229-F'!$J$27=\"\",\"\",'Tex-229-F'!$J$27)","v":"Design JMF 1 Cumulative Percent Passing"}]
[62,{"$f":"IF('Tex-229-F'!$M$37=\"\",\"\",'Tex-229-F'!$M$37)","v":""},{"$f":"IF('Tex-229-F'!$B$23=\"\",\"\",'Tex-229-F'!$B$23)","v":"COMBINED AGGREGATE GRADATION:Tex-229-F"},{"$f":"IF('Tex-229-F'!$B$27=\"\",\"\",'Tex-229-F'!$B$27)","v":"Sieve Size:"},{"$f":"IF('Tex-229-F'!$B$37=\"\",\"\",'Tex-229-F'!$B$37)","v":""},{"$f":"IF('Tex-229-F'!$M$27=\"\",\"\",'Tex-229-F'!$M$27)","v":"In Tolerance"}]
[63,{"$f":"IF('Tex-229-F'!$N$37=\"\",\"\",'Tex-229-F'!$N$37)","v":""},{"$f":"IF('Tex-229-F'!$B$23=\"\",\"\",'Tex-229-F'!$B$23)","v":"COMBINED AGGREGATE GRADATION:Tex-229-F"},{"$f":"IF('Tex-229-F'!$B$27=\"\",\"\",'Tex-229-F'!$B$27)","v":"Sieve Size:"},{"$f":"IF('Tex-229-F'!$B$37=\"\",\"\",'Tex-229-F'!$B$37)","v":""},{"$f":"IF('Tex-229-F'!$N$27=\"\",\"\",'Tex-229-F'!$N$27)","v":"Current JMF CurrentJMF Design Tolerances %"}]
[64,{"$f":"IF('Tex-229-F'!$Q$37=\"\",\"\",'Tex-229-F'!$Q$37)","v":""},{"$f":"IF('Tex-229-F'!$B$23=\"\",\"\",'Tex-229-F'!$B$23)","v":"COMBINED AGGREGATE GRADATION:Tex-229-F"},{"$f":"IF('Tex-229-F'!$B$27=\"\",\"\",'Tex-229-F'!$B$27)","v":"Sieve Size:"},{"$f":"IF('Tex-229-F'!$B$37=\"\",\"\",'Tex-229-F'!$B$37)","v":""},{"$f":"IF('Tex-229-F'!$Q$27=\"\",\"\",'Tex-229-F'!$Q$27)","v":"Current JMF 2 Cumulative Percent Passing"}]
[65,{"$f":"IF('Tex-229-F'!$T$37=\"\",\"\",'Tex-229-F'!$T$37)","v":""},{"$f":"IF('Tex-229-F'!$B$23=\"\",\"\",'Tex-229-F'!$B$23)","v":"COMBINED AGGREGATE GRADATION:Tex-229-F"},{"$f":"IF('Tex-229-F'!$B$27=\"\",\"\",'Tex-229-F'!$B$27)","v":"Sieve Size:"},{"$f":"IF('Tex-229-F'!$B$37=\"\",\"\",'Tex-229-F'!$B$37)","v":""},{"$f":"IF('Tex-229-F'!$T$27=\"\",\"\",'Tex-229-F'!$T$27)","v":"In Tolerance"}]
[66,{"$f":"IF('Tex-229-F'!$U$37=\"\",\"\",'Tex-229-F'!$U$37)","v":""},{"$f":"IF('Tex-229-F'!$B$23=\"\",\"\",'Tex-229-F'!$B$23)","v":"COMBINED AGGREGATE GRADATION:Tex-229-F"},{"$f":"IF('Tex-229-F'!$B$27=\"\",\"\",'Tex-229-F'!$B$27)","v":"Sieve Size:"},{"$f":"IF('Tex-229-F'!$B$37=\"\",\"\",'Tex-229-F'!$B$37)","v":""},{"$f":"IF('Tex-229-F'!$U$27=\"\",\"\",'Tex-229-F'!$U$27)","v":"Sieve Size:"}]
[67,{"$f":"IF('Tex-229-F'!$X$37=\"\",\"\",'Tex-229-F'!$X$37)","v":""},{"$f":"IF('Tex-229-F'!$B$23=\"\",\"\",'Tex-229-F'!$B$23)","v":"COMBINED AGGREGATE GRADATION:Tex-229-F"},{"$f":"IF('Tex-229-F'!$B$27=\"\",\"\",'Tex-229-F'!$B$27)","v":"Sieve Size:"},{"$f":"IF('Tex-229-F'!$B$37=\"\",\"\",'Tex-229-F'!$B$37)","v":""},{"$f":"IF('Tex-229-F'!$X$27=\"\",\"\",'Tex-229-F'!$X$27)","v":"Ignition Oven correlation Factor,%:"}]
[68,{"$f":"IF('Tex-229-F'!$G$38=\"\",\"\",'Tex-229-F'!$G$38)","v":""},{"$f":"IF('Tex-229-F'!$B$23=\"\",\"\",'Tex-229-F'!$B$23)","v":"COMBINED AGGREGATE GRADATION:Tex-229-F"},{"$f":"IF('Tex-229-F'!$B$27=\"\",\"\",'Tex-229-F'!$B$27)","v":"Sieve Size:"},{"$f":"IF('Tex-229-F'!$B$38=\"\",\"\",'Tex-229-F'!$B$38)","v":""},{"$f":"IF('Tex-229-F'!$G$27=\"\",\"\",'Tex-229-F'!$G$27)","v":"Master Specification Tolerances %"}]
[69,{"$f":"IF('Tex-229-F'!$J$38=\"\",\"\",'Tex-229-F'!$J$38)","v":""},{"$f":"IF('Tex-229-F'!$B$23=\"\",\"\",'Tex-229-F'!$B$23)","v":"COMBINED AGGREGATE GRADATION:Tex-229-F"},{"$f":"IF('Tex-229-F'!$B$27=\"\",\"\",'Tex-229-F'!$B$27)","v":"Sieve Size:"},{"$f":"IF('Tex-229-F'!$B$38=\"\",\"\",'Tex-229-F'!$B$38)","v":""},{"$f":"IF('Tex-229-F'!$J$27=\"\",\"\",'Tex-229-F'!$J$27)","v":"Design JMF 1 Cumulative Percent Passing"}]
[70,{"$f":"IF('Tex-229-F'!$M$38=\"\",\"\",'Tex-229-F'!$M$38)","v":""},{"$f":"IF('Tex-229-F'!$B$23=\"\",\"\",'Tex-229-F'!$B$23)","v":"COMBINED AGGREGATE GRADATION:Tex-229-F"},{"$f":"IF('Tex-229-F'!$B$27=\"\",\"\",'Tex-229-F'!$B$27)","v":"Sieve Size:"},{"$f":"IF('Tex-229-F'!$B$38=\"\",\"\",'Tex-229-F'!$B$38)","v":""},{"$f":"IF('Tex-229-F'!$M$27=\"\",\"\",'Tex-229-F'!$M$27)","v":"In Tolerance"}]
[71,{"$f":"IF('Tex-229-F'!$N$38=\"\",\"\",'Tex-229-F'!$N$38)","v":""},{"$f":"IF('Tex-229-F'!$B$23=\"\",\"\",'Tex-229-F'!$B$23)","v":"COMBINED AGGREGATE GRADATION:Tex-229-F"},{"$f":"IF('Tex-229-F'!$B$27=\"\",\"\",'Tex-229-F'!$B$27)","v":"Sieve Size:"},{"$f":"IF('Tex-229-F'!$B$38=\"\",\"\",'Tex-229-F'!$B$38)","v":""},{"$f":"IF('Tex-229-F'!$N$27=\"\",\"\",'Tex-229-F'!$N$27)","v":"Current JMF CurrentJMF Design Tolerances %"}]
[72,{"$f":"IF('Tex-229-F'!$Q$38=\"\",\"\",'Tex-229-F'!$Q$38)","v":""},{"$f":"IF('Tex-229-F'!$B$23=\"\",\"\",'Tex-229-F'!$B$23)","v":"COMBINED AGGREGATE GRADATION:Tex-229-F"},{"$f":"IF('Tex-229-F'!$B$27=\"\",\"\",'Tex-229-F'!$B$27)","v":"Sieve Size:"},{"$f":"IF('Tex-229-F'!$B$38=\"\",\"\",'Tex-229-F'!$B$38)","v":""},{"$f":"IF('Tex-229-F'!$Q$27=\"\",\"\",'Tex-229-F'!$Q$27)","v":"Current JMF 2 Cumulative Percent Passing"}]
[73,{"$f":"IF('Tex-229-F'!$T$38=\"\",\"\",'Tex-229-F'!$T$38)","v":""},{"$f":"IF('Tex-229-F'!$B$23=\"\",\"\",'Tex-229-F'!$B$23)","v":"COMBINED AGGREGATE GRADATION:Tex-229-F"},{"$f":"IF('Tex-229-F'!$B$27=\"\",\"\",'Tex-229-F'!$B$27)","v":"Sieve Size:"},{"$f":"IF('Tex-229-F'!$B$38=\"\",\"\",'Tex-229-F'!$B$38)","v":""},{"$f":"IF('Tex-229-F'!$T$27=\"\",\"\",'Tex-229-F'!$T$27)","v":"In Tolerance"}]
[74,{"$f":"IF('Tex-229-F'!$U$38=\"\",\"\",'Tex-229-F'!$U$38)","v":""},{"$f":"IF('Tex-229-F'!$B$23=\"\",\"\",'Tex-229-F'!$B$23)","v":"COMBINED AGGREGATE GRADATION:Tex-229-F"},{"$f":"IF('Tex-229-F'!$B$27=\"\",\"\",'Tex-229-F'!$B$27)","v":"Sieve Size:"},{"$f":"IF('Tex-229-F'!$B$38=\"\",\"\",'Tex-229-F'!$B$38)","v":""},{"$f":"IF('Tex-229-F'!$U$27=\"\",\"\",'Tex-229-F'!$U$27)","v":"Sieve Size:"}]
[75,{"$f":"IF('Tex-229-F'!$X$38=\"\",\"\",'Tex-229-F'!$X$38)","v":""},{"$f":"IF('Tex-229-F'!$B$23=\"\",\"\",'Tex-229-F'!$B$23)","v":"COMBINED AGGREGATE GRADATION:Tex-229-F"},{"$f":"IF('Tex-229-F'!$B$27=\"\",\"\",'Tex-229-F'!$B$27)","v":"Sieve Size:"},{"$f":"IF('Tex-229-F'!$B$38=\"\",\"\",'Tex-229-F'!$B$38)","v":""},{"$f":"IF('Tex-229-F'!$X$27=\"\",\"\",'Tex-229-F'!$X$27)","v":"Ignition Oven correlation Factor,%:"}]
[76,{"$f":"IF('Tex-229-F'!$G$39=\"\",\"\",'Tex-229-F'!$G$39)","v":""},{"$f":"IF('Tex-229-F'!$B$23=\"\",\"\",'Tex-229-F'!$B$23)","v":"COMBINED AGGREGATE GRADATION:Tex-229-F"},{"$f":"IF('Tex-229-F'!$B$27=\"\",\"\",'Tex-229-F'!$B$27)","v":"Sieve Size:"},{"$f":"IF('Tex-229-F'!$B$39=\"\",\"\",'Tex-229-F'!$B$39)","v":""},{"$f":"IF('Tex-229-F'!$G$27=\"\",\"\",'Tex-229-F'!$G$27)","v":"Master Specification Tolerances %"}]
[77,{"$f":"IF('Tex-229-F'!$J$39=\"\",\"\",'Tex-229-F'!$J$39)","v":""},{"$f":"IF('Tex-229-F'!$B$23=\"\",\"\",'Tex-229-F'!$B$23)","v":"COMBINED AGGREGATE GRADATION:Tex-229-F"},{"$f":"IF('Tex-229-F'!$B$27=\"\",\"\",'Tex-229-F'!$B$27)","v":"Sieve Size:"},{"$f":"IF('Tex-229-F'!$B$39=\"\",\"\",'Tex-229-F'!$B$39)","v":""},{"$f":"IF('Tex-229-F'!$J$27=\"\",\"\",'Tex-229-F'!$J$27)","v":"Design JMF 1 Cumulative Percent Passing"}]
[78,{"$f":"IF('Tex-229-F'!$M$39=\"\",\"\",'Tex-229-F'!$M$39)","v":""},{"$f":"IF('Tex-229-F'!$B$23=\"\",\"\",'Tex-229-F'!$B$23)","v":"COMBINED AGGREGATE GRADATION:Tex-229-F"},{"$f":"IF('Tex-229-F'!$B$27=\"\",\"\",'Tex-229-F'!$B$27)","v":"Sieve Size:"},{"$f":"IF('Tex-229-F'!$B$39=\"\",\"\",'Tex-229-F'!$B$39)","v":""},{"$f":"IF('Tex-229-F'!$M$27=\"\",\"\",'Tex-229-F'!$M$27)","v":"In Tolerance"}]
[79,{"$f":"IF('Tex-229-F'!$N$39=\"\",\"\",'Tex-229-F'!$N$39)","v":""},{"$f":"IF('Tex-229-F'!$B$23=\"\",\"\",'Tex-229-F'!$B$23)","v":"COMBINED AGGREGATE GRADATION:Tex-229-F"},{"$f":"IF('Tex-229-F'!$B$27=\"\",\"\",'Tex-229-F'!$B$27)","v":"Sieve Size:"},{"$f":"IF('Tex-229-F'!$B$39=\"\",\"\",'Tex-229-F'!$B$39)","v":""},{"$f":"IF('Tex-229-F'!$N$27=\"\",\"\",'Tex-229-F'!$N$27)","v":"Current JMF CurrentJMF Design Tolerances %"}]
[80,{"$f":"IF('Tex-229-F'!$Q$39=\"\",\"\",'Tex-229-F'!$Q$39)","v":""},{"$f":"IF('Tex-229-F'!$B$23=\"\",\"\",'Tex-229-F'!$B$23)","v":"COMBINED AGGREGATE GRADATION:Tex-229-F"},{"$f":"IF('Tex-229-F'!$B$27=\"\",\"\",'Tex-229-F'!$B$27)","v":"Sieve Size:"},{"$f":"IF('Tex-229-F'!$B$39=\"\",\"\",'Tex-229-F'!$B$39)","v":""},{"$f":"IF('Tex-229-F'!$Q$27=\"\",\"\",'Tex-229-F'!$Q$27)","v":"Current JMF 2 Cumulative Percent Passing"}]
[81,{"$f":"IF('Tex-229-F'!$T$39=\"\",\"\",'Tex-229-F'!$T$39)","v":""},{"$f":"IF('Tex-229-F'!$B$23=\"\",\"\",'Tex-229-F'!$B$23)","v":"COMBINED AGGREGATE GRADATION:Tex-229-F"},{"$f":"IF('Tex-229-F'!$B$27=\"\",\"\",'Tex-229-F'!$B$27)","v":"Sieve Size:"},{"$f":"IF('Tex-229-F'!$B$39=\"\",\"\",'Tex-229-F'!$B$39)","v":""},{"$f":"IF('Tex-229-F'!$T$27=\"\",\"\",'Tex-229-F'!$T$27)","v":"In Tolerance"}]
[82,{"$f":"IF('Tex-229-F'!$U$39=\"\",\"\",'Tex-229-F'!$U$39)","v":""},{"$f":"IF('Tex-229-F'!$B$23=\"\",\"\",'Tex-229-F'!$B$23)","v":"COMBINED AGGREGATE GRADATION:Tex-229-F"},{"$f":"IF('Tex-229-F'!$B$27=\"\",\"\",'Tex-229-F'!$B$27)","v":"Sieve Size:"},{"$f":"IF('Tex-229-F'!$B$39=\"\",\"\",'Tex-229-F'!$B$39)","v":""},{"$f":"IF('Tex-229-F'!$U$27=\"\",\"\",'Tex-229-F'!$U$27)","v":"Sieve Size:"}]
[83,{"$f":"IF('Tex-229-F'!$X$39=\"\",\"\",'Tex-229-F'!$X$39)","v":""},{"$f":"IF('Tex-229-F'!$B$23=\"\",\"\",'Tex-229-F'!$B$23)","v":"COMBINED AGGREGATE GRADATION:Tex-229-F"},{"$f":"IF('Tex-229-F'!$B$27=\"\",\"\",'Tex-229-F'!$B$27)","v":"Sieve Size:"},{"$f":"IF('Tex-229-F'!$B$39=\"\",\"\",'Tex-229-F'!$B$39)","v":""},{"$f":"IF('Tex-229-F'!$X$27=\"\",\"\",'Tex-229-F'!$X$27)","v":"Ignition Oven correlation Factor,%:"}]
[84,{"$f":"IF('Tex-229-F'!$G$40=\"\",\"\",'Tex-229-F'!$G$40)","v":""},{"$f":"IF('Tex-229-F'!$B$23=\"\",\"\",'Tex-229-F'!$B$23)","v":"COMBINED AGGREGATE GRADATION:Tex-229-F"},{"$f":"IF('Tex-229-F'!$B$27=\"\",\"\",'Tex-229-F'!$B$27)","v":"Sieve Size:"},{"$f":"IF('Tex-229-F'!$B$40=\"\",\"\",'Tex-229-F'!$B$40)","v":""},{"$f":"IF('Tex-229-F'!$G$27=\"\",\"\",'Tex-229-F'!$G$27)","v":"Master Specification Tolerances %"}]
[85,{"$f":"IF('Tex-229-F'!$J$40=\"\",\"\",'Tex-229-F'!$J$40)","v":""},{"$f":"IF('Tex-229-F'!$B$23=\"\",\"\",'Tex-229-F'!$B$23)","v":"COMBINED AGGREGATE GRADATION:Tex-229-F"},{"$f":"IF('Tex-229-F'!$B$27=\"\",\"\",'Tex-229-F'!$B$27)","v":"Sieve Size:"},{"$f":"IF('Tex-229-F'!$B$40=\"\",\"\",'Tex-229-F'!$B$40)","v":""},{"$f":"IF('Tex-229-F'!$J$27=\"\",\"\",'Tex-229-F'!$J$27)","v":"Design JMF 1 Cumulative Percent Passing"}]
[86,{"$f":"IF('Tex-229-F'!$M$40=\"\",\"\",'Tex-229-F'!$M$40)","v":""},{"$f":"IF('Tex-229-F'!$B$23=\"\",\"\",'Tex-229-F'!$B$23)","v":"COMBINED AGGREGATE GRADATION:Tex-229-F"},{"$f":"IF('Tex-229-F'!$B$27=\"\",\"\",'Tex-229-F'!$B$27)","v":"Sieve Size:"},{"$f":"IF('Tex-229-F'!$B$40=\"\",\"\",'Tex-229-F'!$B$40)","v":""},{"$f":"IF('Tex-229-F'!$M$27=\"\",\"\",'Tex-229-F'!$M$27)","v":"In Tolerance"}]
[87,{"$f":"IF('Tex-229-F'!$N$40=\"\",\"\",'Tex-229-F'!$N$40)","v":""},{"$f":"IF('Tex-229-F'!$B$23=\"\",\"\",'Tex-229-F'!$B$23)","v":"COMBINED AGGREGATE GRADATION:Tex-229-F"},{"$f":"IF('Tex-229-F'!$B$27=\"\",\"\",'Tex-229-F'!$B$27)","v":"Sieve Size:"},{"$f":"IF('Tex-229-F'!$B$40=\"\",\"\",'Tex-229-F'!$B$40)","v":""},{"$f":"IF('Tex-229-F'!$N$27=\"\",\"\",'Tex-229-F'!$N$27)","v":"Current JMF CurrentJMF Design Tolerances %"}]
[88,{"$f":"IF('Tex-229-F'!$Q$40=\"\",\"\",'Tex-229-F'!$Q$40)","v":""},{"$f":"IF('Tex-229-F'!$B$23=\"\",\"\",'Tex-229-F'!$B$23)","v":"COMBINED AGGREGATE GRADATION:Tex-229-F"},{"$f":"IF('Tex-229-F'!$B$27=\"\",\"\",'Tex-229-F'!$B$27)","v":"Sieve Size:"},{"$f":"IF('Tex-229-F'!$B$40=\"\",\"\",'Tex-229-F'!$B$40)","v":""},{"$f":"IF('Tex-229-F'!$Q$27=\"\",\"\",'Tex-229-F'!$Q$27)","v":"Current JMF 2 Cumulative Percent Passing"}]
[89,{"$f":"IF('Tex-229-F'!$T$40=\"\",\"\",'Tex-229-F'!$T$40)","v":""},{"$f":"IF('Tex-229-F'!$B$23=\"\",\"\",'Tex-229-F'!$B$23)","v":"COMBINED AGGREGATE GRADATION:Tex-229-F"},{"$f":"IF('Tex-229-F'!$B$27=\"\",\"\",'Tex-229-F'!$B$27)","v":"Sieve Size:"},{"$f":"IF('Tex-229-F'!$B$40=\"\",\"\",'Tex-229-F'!$B$40)","v":""},{"$f":"IF('Tex-229-F'!$T$27=\"\",\"\",'Tex-229-F'!$T$27)","v":"In Tolerance"}]
[90,{"$f":"IF('Tex-229-F'!$U$40=\"\",\"\",'Tex-229-F'!$U$40)","v":""},{"$f":"IF('Tex-229-F'!$B$23=\"\",\"\",'Tex-229-F'!$B$23)","v":"COMBINED AGGREGATE GRADATION:Tex-229-F"},{"$f":"IF('Tex-229-F'!$B$27=\"\",\"\",'Tex-229-F'!$B$27)","v":"Sieve Size:"},{"$f":"IF('Tex-229-F'!$B$40=\"\",\"\",'Tex-229-F'!$B$40)","v":""},{"$f":"IF('Tex-229-F'!$U$27=\"\",\"\",'Tex-229-F'!$U$27)","v":"Sieve Size:"}]
[91,{"$f":"IF('Tex-229-F'!$X$40=\"\",\"\",'Tex-229-F'!$X$40)","v":""},{"$f":"IF('Tex-229-F'!$B$23=\"\",\"\",'Tex-229-F'!$B$23)","v":"COMBINED AGGREGATE GRADATION:Tex-229-F"},{"$f":"IF('Tex-229-F'!$B$27=\"\",\"\",'Tex-229-F'!$B$27)","v":"Sieve Size:"},{"$f":"IF('Tex-229-F'!$B$40=\"\",\"\",'Tex-229-F'!$B$40)","v":""},{"$f":"IF('Tex-229-F'!$X$27=\"\",\"\",'Tex-229-F'!$X$27)","v":"Ignition Oven correlation Factor,%:"}]
[92,{"$f":"IF('Tex-229-F'!$AA$43=\"\",\"\",'Tex-229-F'!$AA$43)","v":""},{"$f":"IF('Tex-229-F'!$S$42=\"\",\"\",'Tex-229-F'!$S$42)","v":"Extraction Method: Tex-210-F by: "},{"$f":"IF('Tex-229-F'!$S$43=\"\",\"\",'Tex-229-F'!$S$43)","v":"Total Sample (g):"}]
[93,{"$f":"IF('Tex-229-F'!$AA$44=\"\",\"\",'Tex-229-F'!$AA$44)","v":""},{"$f":"IF('Tex-229-F'!$S$42=\"\",\"\",'Tex-229-F'!$S$42)","v":"Extraction Method: Tex-210-F by: "},{"$f":"IF('Tex-229-F'!$S$44=\"\",\"\",'Tex-229-F'!$S$44)","v":"Original Filter Paper (g):"}]
[94,{"$f":"IF('Tex-229-F'!$AA$45=\"\",\"\",'Tex-229-F'!$AA$45)","v":""},{"$f":"IF('Tex-229-F'!$S$42=\"\",\"\",'Tex-229-F'!$S$42)","v":"Extraction Method: Tex-210-F by: "},{"$f":"IF('Tex-229-F'!$S$45=\"\",\"\",'Tex-229-F'!$S$45)","v":"Final Filter Paper (g):"}]
[95,{"$f":"IF('Tex-229-F'!$AA$46=\"\",\"\",'Tex-229-F'!$AA$46)","v":""},{"$f":"IF('Tex-229-F'!$S$42=\"\",\"\",'Tex-229-F'!$S$42)","v":"Extraction Method: Tex-210-F by: "},{"$f":"IF('Tex-229-F'!$S$46=\"\",\"\",'Tex-229-F'!$S$46)","v":"Fines in Filter Paper (g):"}]
[96,{"$f":"IF('Tex-229-F'!$AA$47=\"\",\"\",'Tex-229-F'!$AA$47)","v":""},{"$f":"IF('Tex-229-F'!$S$42=\"\",\"\",'Tex-229-F'!$S$42)","v":"Extraction Method: Tex-210-F by: "},{"$f":"IF('Tex-229-F'!$S$47=\"\",\"\",'Tex-229-F'!$S$47)","v":"Pan+Extracted Aggregate (g):"}]
[97,{"$f":"IF('Tex-229-F'!$AA$48=\"\",\"\",'Tex-229-F'!$AA$48)","v":""},{"$f":"IF('Tex-229-F'!$S$42=\"\",\"\",'Tex-229-F'!$S$42)","v":"Extraction Method: Tex-210-F by: "},{"$f":"IF('Tex-229-F'!$S$48=\"\",\"\",'Tex-229-F'!$S$48)","v":"Pan (g):"}]
[98,{"$f":"IF('Tex-229-F'!$AA$49=\"\",\"\",'Tex-229-F'!$AA$49)","v":""},{"$f":"IF('Tex-229-F'!$S$42=\"\",\"\",'Tex-229-F'!$S$42)","v":"Extraction Method: Tex-210-F by: "},{"$f":"IF('Tex-229-F'!$S$49=\"\",\"\",'Tex-229-F'!$S$49)","v":"Extracted Aggregate (g):"}]
[99,{"$f":"IF('Tex-229-F'!$AA$50=\"\",\"\",'Tex-229-F'!$AA$50)","v":""},{"$f":"IF('Tex-229-F'!$S$42=\"\",\"\",'Tex-229-F'!$S$42)","v":"Extraction Method: Tex-210-F by: "},{"$f":"IF('Tex-229-F'!$S$50=\"\",\"\",'Tex-229-F'!$S$50)","v":"Dish + Ash per 100mL (g):"}]
[100,{"$f":"IF('Tex-229-F'!$AA$51=\"\",\"\",'Tex-229-F'!$AA$51)","v":""},{"$f":"IF('Tex-229-F'!$S$42=\"\",\"\",'Tex-229-F'!$S$42)","v":"Extraction Method: Tex-210-F by: "},{"$f":"IF('Tex-229-F'!$S$51=\"\",\"\",'Tex-229-F'!$S$51)","v":"Dish (g):"}]
[101,{"$f":"IF('Tex-229-F'!$AA$52=\"\",\"\",'Tex-229-F'!$AA$52)","v":""},{"$f":"IF('Tex-229-F'!$S$42=\"\",\"\",'Tex-229-F'!$S$42)","v":"Extraction Method: Tex-210-F by: "},{"$f":"IF('Tex-229-F'!$S$52=\"\",\"\",'Tex-229-F'!$S$52)","v":"Ash per 100mL (g):"}]
[102,{"$f":"IF('Tex-229-F'!$AA$53=\"\",\"\",'Tex-229-F'!$AA$53)","v":""},{"$f":"IF('Tex-229-F'!$S$42=\"\",\"\",'Tex-229-F'!$S$42)","v":"Extraction Method: Tex-210-F by: "},{"$f":"IF('Tex-229-F'!$S$53=\"\",\"\",'Tex-229-F'!$S$53)","v":"Total Solvent (mL):"}]
[103,{"$f":"IF('Tex-229-F'!$AA$54=\"\",\"\",'Tex-229-F'!$AA$54)","v":""},{"$f":"IF('Tex-229-F'!$S$42=\"\",\"\",'Tex-229-F'!$S$42)","v":"Extraction Method: Tex-210-F by: "},{"$f":"IF('Tex-229-F'!$S$54=\"\",\"\",'Tex-229-F'!$S$54)","v":"Total Ash (g):"}]
[104,{"$f":"IF('Tex-229-F'!$AA$55=\"\",\"\",'Tex-229-F'!$AA$55)","v":""},{"$f":"IF('Tex-229-F'!$S$42=\"\",\"\",'Tex-229-F'!$S$42)","v":"Extraction Method: Tex-210-F by: "},{"$f":"IF('Tex-229-F'!$S$55=\"\",\"\",'Tex-229-F'!$S$55)","v":"Filtering Aid (g):"}]
[105,{"$f":"IF('Tex-229-F'!$AA$56=\"\",\"\",'Tex-229-F'!$AA$56)","v":""},{"$f":"IF('Tex-229-F'!$S$42=\"\",\"\",'Tex-229-F'!$S$42)","v":"Extraction Method: Tex-210-F by: "},{"$f":"IF('Tex-229-F'!$S$56=\"\",\"\",'Tex-229-F'!$S$56)","v":"Fines+Aggregate+Ash (g):"}]
[106,{"$f":"IF('Tex-229-F'!$AA$57=\"\",\"\",'Tex-229-F'!$AA$57)","v":""},{"$f":"IF('Tex-229-F'!$S$42=\"\",\"\",'Tex-229-F'!$S$42)","v":"Extraction Method: Tex-210-F by: "},{"$f":"IF('Tex-229-F'!$S$57=\"\",\"\",'Tex-229-F'!$S$57)","v":"Total Loss (%):"}]
[107,{"$f":"IF('Tex-229-F'!$AA$58=\"\",\"\",'Tex-229-F'!$AA$58)","v":""},{"$f":"IF('Tex-229-F'!$S$42=\"\",\"\",'Tex-229-F'!$S$42)","v":"Extraction Method: Tex-210-F by: "},{"$f":"IF('Tex-229-F'!$S$58=\"\",\"\",'Tex-229-F'!$S$58)","v":"Hydrocarbon Volatiles (%):"}]
[108,{"$f":"IF('Tex-229-F'!$AA$59=\"\",\"\",'Tex-229-F'!$AA$59)","v":""},{"$f":"IF('Tex-229-F'!$S$42=\"\",\"\",'Tex-229-F'!$S$42)","v":"Extraction Method: Tex-210-F by: "},{"$f":"IF('Tex-229-F'!$S$59=\"\",\"\",'Tex-229-F'!$S$59)","v":"Asphalt Content (%):"}]
[109,{"$f":"IF('Tex-229-F'!$AA$60=\"\",\"\",'Tex-229-F'!$AA$60)","v":""},{"$f":"IF('Tex-229-F'!$S$42=\"\",\"\",'Tex-229-F'!$S$42)","v":"Extraction Method: Tex-210-F by: "},{"$f":"IF('Tex-229-F'!$S$60=\"\",\"\",'Tex-229-F'!$S$60)","v":"Total Loss (g):"}]
[110,{"$f":"IF('Tex-229-F'!$AA$61=\"\",\"\",'Tex-229-F'!$AA$61)","v":""},{"$f":"IF('Tex-229-F'!$S$42=\"\",\"\",'Tex-229-F'!$S$42)","v":"Extraction Method: Tex-210-F by: "},{"$f":"IF('Tex-229-F'!$S$61=\"\",\"\",'Tex-229-F'!$S$61)","v":"Moisture Content (%):"}]
[111,{"$f":"IF('Tex-229-F'!$AA$62=\"\",\"\",'Tex-229-F'!$AA$62)","v":""},{"$f":"IF('Tex-229-F'!$S$42=\"\",\"\",'Tex-229-F'!$S$42)","v":"Extraction Method: Tex-210-F by: "},{"$f":"IF('Tex-229-F'!$S$62=\"\",\"\",'Tex-229-F'!$S$62)","v":"Ash Factor (%):"}]
[112,{"$f":"IF('Tex-229-F'!$AA$63=\"\",\"\",'Tex-229-F'!$AA$63)","v":""},{"$f":"IF('Tex-229-F'!$S$42=\"\",\"\",'Tex-229-F'!$S$42)","v":"Extraction Method: Tex-210-F by: "},{"$f":"IF('Tex-229-F'!$S$63=\"\",\"\",'Tex-229-F'!$S$63)","v":"Percent of Dry Aggregate (%):"}]
[113,{"$f":"IF('Tex-229-F'!$AA$64=\"\",\"\",'Tex-229-F'!$AA$64)","v":""},{"$f":"IF('Tex-229-F'!$S$42=\"\",\"\",'Tex-229-F'!$S$42)","v":"Extraction Method: Tex-210-F by: "},{"$f":"IF('Tex-229-F'!$X$64=\"\",\"\",'Tex-229-F'!$X$64)","v":"Total:"}]
[114,{"$f":"IF('Tex-229-F'!$I$46=\"\",\"\",'Tex-229-F'!$I$46)","v":""},{"$f":"IF('Tex-229-F'!$B$44=\"\",\"\",'Tex-229-F'!$B$44)","v":"GRADATION OF EXTRACTED AGGREGATE-Tex-229-F"},{"$f":"IF('Tex-229-F'!$B$46=\"\",\"\",'Tex-229-F'!$B$46)","v":""}]
[115,{"$f":"IF('Tex-229-F'!$P$46=\"\",\"\",'Tex-229-F'!$P$46)","v":""},{"$f":"IF('Tex-229-F'!$B$44=\"\",\"\",'Tex-229-F'!$B$44)","v":"GRADATION OF EXTRACTED AGGREGATE-Tex-229-F"},{"$f":"IF('Tex-229-F'!$K$46=\"\",\"\",'Tex-229-F'!$K$46)","v":"Dry Weight After Washing:"}]
[116,{"$f":"IF('Tex-229-F'!$E$51=\"\",\"\",'Tex-229-F'!$E$51)","v":""},{"$f":"IF('Tex-229-F'!$B$44=\"\",\"\",'Tex-229-F'!$B$44)","v":"GRADATION OF EXTRACTED AGGREGATE-Tex-229-F"},{"$f":"IF('Tex-229-F'!$B$47=\"\",\"\",'Tex-229-F'!$B$47)","v":"Sieve Size:"},{"$f":"IF('Tex-229-F'!$B$51=\"\",\"\",'Tex-229-F'!$B$51)","v":""},{"$f":"IF('Tex-229-F'!$E$47=\"\",\"\",'Tex-229-F'!$E$47)","v":"Individual Weight Retained, (g)"}]
[117,{"$f":"IF('Tex-229-F'!$I$51=\"\",\"\",'Tex-229-F'!$I$51)","v":""},{"$f":"IF('Tex-229-F'!$B$44=\"\",\"\",'Tex-229-F'!$B$44)","v":"GRADATION OF EXTRACTED AGGREGATE-Tex-229-F"},{"$f":"IF('Tex-229-F'!$B$47=\"\",\"\",'Tex-229-F'!$B$47)","v":"Sieve Size:"},{"$f":"IF('Tex-229-F'!$B$51=\"\",\"\",'Tex-229-F'!$B$51)","v":""},{"$f":"IF('Tex-229-F'!$I$47=\"\",\"\",'Tex-229-F'!$I$47)","v":" Individual Percent Retained"}]
[118,{"$f":"IF('Tex-229-F'!$M$51=\"\",\"\",'Tex-229-F'!$M$51)","v":""},{"$f":"IF('Tex-229-F'!$B$44=\"\",\"\",'Tex-229-F'!$B$44)","v":"GRADATION OF EXTRACTED AGGREGATE-Tex-229-F"},{"$f":"IF('Tex-229-F'!$B$47=\"\",\"\",'Tex-229-F'!$B$47)","v":"Sieve Size:"},{"$f":"IF('Tex-229-F'!$B$51=\"\",\"\",'Tex-229-F'!$B$51)","v":""},{"$f":"IF('Tex-229-F'!$M$47=\"\",\"\",'Tex-229-F'!$M$47)","v":" Cumulative Percent Passing"}]
[119,{"$f":"IF('Tex-229-F'!$O$51=\"\",\"\",'Tex-229-F'!$O$51)","v":""},{"$f":"IF('Tex-229-F'!$B$44=\"\",\"\",'Tex-229-F'!$B$44)","v":"GRADATION OF EXTRACTED AGGREGATE-Tex-229-F"},{"$f":"IF('Tex-229-F'!$B$47=\"\",\"\",'Tex-229-F'!$B$47)","v":"Sieve Size:"},{"$f":"IF('Tex-229-F'!$B$51=\"\",\"\",'Tex-229-F'!$B$51)","v":""},{"$f":"IF('Tex-229-F'!$O$47=\"\",\"\",'Tex-229-F'!$O$47)","v":"JMF  Individual Retained Limits, %"}]
[120,{"$f":"IF('Tex-229-F'!$Q$51=\"\",\"\",'Tex-229-F'!$Q$51)","v":""},{"$f":"IF('Tex-229-F'!$B$44=\"\",\"\",'Tex-229-F'!$B$44)","v":"GRADATION OF EXTRACTED AGGREGATE-Tex-229-F"},{"$f":"IF('Tex-229-F'!$B$47=\"\",\"\",'Tex-229-F'!$B$47)","v":"Sieve Size:"},{"$f":"IF('Tex-229-F'!$B$51=\"\",\"\",'Tex-229-F'!$B$51)","v":""},{"$f":"IF('Tex-229-F'!$Q$47=\"\",\"\",'Tex-229-F'!$Q$47)","v":"In Tolerance"}]
[121,{"$f":"IF('Tex-229-F'!$E$52=\"\",\"\",'Tex-229-F'!$E$52)","v":""},{"$f":"IF('Tex-229-F'!$B$44=\"\",\"\",'Tex-229-F'!$B$44)","v":"GRADATION OF EXTRACTED AGGREGATE-Tex-229-F"},{"$f":"IF('Tex-229-F'!$B$47=\"\",\"\",'Tex-229-F'!$B$47)","v":"Sieve Size:"},{"$f":"IF('Tex-229-F'!$B$52=\"\",\"\",'Tex-229-F'!$B$52)","v":""},{"$f":"IF('Tex-229-F'!$E$47=\"\",\"\",'Tex-229-F'!$E$47)","v":"Individual Weight Retained, (g)"}]
[122,{"$f":"IF('Tex-229-F'!$G$52=\"\",\"\",'Tex-229-F'!$G$52)","v":""},{"$f":"IF('Tex-229-F'!$B$44=\"\",\"\",'Tex-229-F'!$B$44)","v":"GRADATION OF EXTRACTED AGGREGATE-Tex-229-F"},{"$f":"IF('Tex-229-F'!$B$47=\"\",\"\",'Tex-229-F'!$B$47)","v":"Sieve Size:"},{"$f":"IF('Tex-229-F'!$B$52=\"\",\"\",'Tex-229-F'!$B$52)","v":""},{"$f":"IF('Tex-229-F'!$G$47=\"\",\"\",'Tex-229-F'!$G$47)","v":"Cumulative Weight Retained, (g)"}]
[123,{"$f":"IF('Tex-229-F'!$I$52=\"\",\"\",'Tex-229-F'!$I$52)","v":""},{"$f":"IF('Tex-229-F'!$B$44=\"\",\"\",'Tex-229-F'!$B$44)","v":"GRADATION OF EXTRACTED AGGREGATE-Tex-229-F"},{"$f":"IF('Tex-229-F'!$B$47=\"\",\"\",'Tex-229-F'!$B$47)","v":"Sieve Size:"},{"$f":"IF('Tex-229-F'!$B$52=\"\",\"\",'Tex-229-F'!$B$52)","v":""},{"$f":"IF('Tex-229-F'!$I$47=\"\",\"\",'Tex-229-F'!$I$47)","v":" Individual Percent Retained"}]
[124,{"$f":"IF('Tex-229-F'!$K$52=\"\",\"\",'Tex-229-F'!$K$52)","v":""},{"$f":"IF('Tex-229-F'!$B$44=\"\",\"\",'Tex-229-F'!$B$44)","v":"GRADATION OF EXTRACTED AGGREGATE-Tex-229-F"},{"$f":"IF('Tex-229-F'!$B$47=\"\",\"\",'Tex-229-F'!$B$47)","v":"Sieve Size:"},{"$f":"IF('Tex-229-F'!$B$52=\"\",\"\",'Tex-229-F'!$B$52)","v":""},{"$f":"IF('Tex-229-F'!$K$47=\"\",\"\",'Tex-229-F'!$K$47)","v":" Cumulative Percent Retained"}]
[125,{"$f":"IF('Tex-229-F'!$M$52=\"\",\"\",'Tex-229-F'!$M$52)","v":""},{"$f":"IF('Tex-229-F'!$B$44=\"\",\"\",'Tex-229-F'!$B$44)","v":"GRADATION OF EXTRACTED AGGREGATE-Tex-229-F"},{"$f":"IF('Tex-229-F'!$B$47=\"\",\"\",'Tex-229-F'!$B$47)","v":"Sieve Size:"},{"$f":"IF('Tex-229-F'!$B$52=\"\",\"\",'Tex-229-F'!$B$52)","v":""},{"$f":"IF('Tex-229-F'!$M$47=\"\",\"\",'Tex-229-F'!$M$47)","v":" Cumulative Percent Passing"}]
[126,{"$f":"IF('Tex-229-F'!$O$52=\"\",\"\",'Tex-229-F'!$O$52)","v":""},{"$f":"IF('Tex-229-F'!$B$44=\"\",\"\",'Tex-229-F'!$B$44)","v":"GRADATION OF EXTRACTED AGGREGATE-Tex-229-F"},{"$f":"IF('Tex-229-F'!$B$47=\"\",\"\",'Tex-229-F'!$B$47)","v":"Sieve Size:"},{"$f":"IF('Tex-229-F'!$B$52=\"\",\"\",'Tex-229-F'!$B$52)","v":""},{"$f":"IF('Tex-229-F'!$O$47=\"\",\"\",'Tex-229-F'!$O$47)","v":"JMF  Individual Retained Limits, %"}]
[127,{"$f":"IF('Tex-229-F'!$Q$52=\"\",\"\",'Tex-229-F'!$Q$52)","v":""},{"$f":"IF('Tex-229-F'!$B$44=\"\",\"\",'Tex-229-F'!$B$44)","v":"GRADATION OF EXTRACTED AGGREGATE-Tex-229-F"},{"$f":"IF('Tex-229-F'!$B$47=\"\",\"\",'Tex-229-F'!$B$47)","v":"Sieve Size:"},{"$f":"IF('Tex-229-F'!$B$52=\"\",\"\",'Tex-229-F'!$B$52)","v":""},{"$f":"IF('Tex-229-F'!$Q$47=\"\",\"\",'Tex-229-F'!$Q$47)","v":"In Tolerance"}]
[128,{"$f":"IF('Tex-229-F'!$E$53=\"\",\"\",'Tex-229-F'!$E$53)","v":""},{"$f":"IF('Tex-229-F'!$B$44=\"\",\"\",'Tex-229-F'!$B$44)","v":"GRADATION OF EXTRACTED AGGREGATE-Tex-229-F"},{"$f":"IF('Tex-229-F'!$B$47=\"\",\"\",'Tex-229-F'!$B$47)","v":"Sieve Size:"},{"$f":"IF('Tex-229-F'!$B$53=\"\",\"\",'Tex-229-F'!$B$53)","v":""},{"$f":"IF('Tex-229-F'!$E$47=\"\",\"\",'Tex-229-F'!$E$47)","v":"Individual Weight Retained, (g)"}]
[129,{"$f":"IF('Tex-229-F'!$G$53=\"\",\"\",'Tex-229-F'!$G$53)","v":""},{"$f":"IF('Tex-229-F'!$B$44=\"\",\"\",'Tex-229-F'!$B$44)","v":"GRADATION OF EXTRACTED AGGREGATE-Tex-229-F"},{"$f":"IF('Tex-229-F'!$B$47=\"\",\"\",'Tex-229-F'!$B$47)","v":"Sieve Size:"},{"$f":"IF('Tex-229-F'!$B$53=\"\",\"\",'Tex-229-F'!$B$53)","v":""},{"$f":"IF('Tex-229-F'!$G$47=\"\",\"\",'Tex-229-F'!$G$47)","v":"Cumulative Weight Retained, (g)"}]
[130,{"$f":"IF('Tex-229-F'!$I$53=\"\",\"\",'Tex-229-F'!$I$53)","v":""},{"$f":"IF('Tex-229-F'!$B$44=\"\",\"\",'Tex-229-F'!$B$44)","v":"GRADATION OF EXTRACTED AGGREGATE-Tex-229-F"},{"$f":"IF('Tex-229-F'!$B$47=\"\",\"\",'Tex-229-F'!$B$47)","v":"Sieve Size:"},{"$f":"IF('Tex-229-F'!$B$53=\"\",\"\",'Tex-229-F'!$B$53)","v":""},{"$f":"IF('Tex-229-F'!$I$47=\"\",\"\",'Tex-229-F'!$I$47)","v":" Individual Percent Retained"}]
[131,{"$f":"IF('Tex-229-F'!$K$53=\"\",\"\",'Tex-229-F'!$K$53)","v":""},{"$f":"IF('Tex-229-F'!$B$44=\"\",\"\",'Tex-229-F'!$B$44)","v":"GRADATION OF EXTRACTED AGGREGATE-Tex-229-F"},{"$f":"IF('Tex-229-F'!$B$47=\"\",\"\",'Tex-229-F'!$B$47)","v":"Sieve Size:"},{"$f":"IF('Tex-229-F'!$B$53=\"\",\"\",'Tex-229-F'!$B$53)","v":""},{"$f":"IF('Tex-229-F'!$K$47=\"\",\"\",'Tex-229-F'!$K$47)","v":" Cumulative Percent Retained"}]
[132,{"$f":"IF('Tex-229-F'!$M$53=\"\",\"\",'Tex-229-F'!$M$53)","v":""},{"$f":"IF('Tex-229-F'!$B$44=\"\",\"\",'Tex-229-F'!$B$44)","v":"GRADATION OF EXTRACTED AGGREGATE-Tex-229-F"},{"$f":"IF('Tex-229-F'!$B$47=\"\",\"\",'Tex-229-F'!$B$47)","v":"Sieve Size:"},{"$f":"IF('Tex-229-F'!$B$53=\"\",\"\",'Tex-229-F'!$B$53)","v":""},{"$f":"IF('Tex-229-F'!$M$47=\"\",\"\",'Tex-229-F'!$M$47)","v":" Cumulative Percent Passing"}]
[133,{"$f":"IF('Tex-229-F'!$O$53=\"\",\"\",'Tex-229-F'!$O$53)","v":""},{"$f":"IF('Tex-229-F'!$B$44=\"\",\"\",'Tex-229-F'!$B$44)","v":"GRADATION OF EXTRACTED AGGREGATE-Tex-229-F"},{"$f":"IF('Tex-229-F'!$B$47=\"\",\"\",'Tex-229-F'!$B$47)","v":"Sieve Size:"},{"$f":"IF('Tex-229-F'!$B$53=\"\",\"\",'Tex-229-F'!$B$53)","v":""},{"$f":"IF('Tex-229-F'!$O$47=\"\",\"\",'Tex-229-F'!$O$47)","v":"JMF  Individual Retained Limits, %"}]
[134,{"$f":"IF('Tex-229-F'!$Q$53=\"\",\"\",'Tex-229-F'!$Q$53)","v":""},{"$f":"IF('Tex-229-F'!$B$44=\"\",\"\",'Tex-229-F'!$B$44)","v":"GRADATION OF EXTRACTED AGGREGATE-Tex-229-F"},{"$f":"IF('Tex-229-F'!$B$47=\"\",\"\",'Tex-229-F'!$B$47)","v":"Sieve Size:"},{"$f":"IF('Tex-229-F'!$B$53=\"\",\"\",'Tex-229-F'!$B$53)","v":""},{"$f":"IF('Tex-229-F'!$Q$47=\"\",\"\",'Tex-229-F'!$Q$47)","v":"In Tolerance"}]
[135,{"$f":"IF('Tex-229-F'!$E$54=\"\",\"\",'Tex-229-F'!$E$54)","v":""},{"$f":"IF('Tex-229-F'!$B$44=\"\",\"\",'Tex-229-F'!$B$44)","v":"GRADATION OF EXTRACTED AGGREGATE-Tex-229-F"},{"$f":"IF('Tex-229-F'!$B$47=\"\",\"\",'Tex-229-F'!$B$47)","v":"Sieve Size:"},{"$f":"IF('Tex-229-F'!$B$54=\"\",\"\",'Tex-229-F'!$B$54)","v":""},{"$f":"IF('Tex-229-F'!$E$47=\"\",\"\",'Tex-229-F'!$E$47)","v":"Individual Weight Retained, (g)"}]
[136,{"$f":"IF('Tex-229-F'!$G$54=\"\",\"\",'Tex-229-F'!$G$54)","v":""},{"$f":"IF('Tex-229-F'!$B$44=\"\",\"\",'Tex-229-F'!$B$44)","v":"GRADATION OF EXTRACTED AGGREGATE-Tex-229-F"},{"$f":"IF('Tex-229-F'!$B$47=\"\",\"\",'Tex-229-F'!$B$47)","v":"Sieve Size:"},{"$f":"IF('Tex-229-F'!$B$54=\"\",\"\",'Tex-229-F'!$B$54)","v":""},{"$f":"IF('Tex-229-F'!$G$47=\"\",\"\",'Tex-229-F'!$G$47)","v":"Cumulative Weight Retained, (g)"}]
[137,{"$f":"IF('Tex-229-F'!$I$54=\"\",\"\",'Tex-229-F'!$I$54)","v":""},{"$f":"IF('Tex-229-F'!$B$44=\"\",\"\",'Tex-229-F'!$B$44)","v":"GRADATION OF EXTRACTED AGGREGATE-Tex-229-F"},{"$f":"IF('Tex-229-F'!$B$47=\"\",\"\",'Tex-229-F'!$B$47)","v":"Sieve Size:"},{"$f":"IF('Tex-229-F'!$B$54=\"\",\"\",'Tex-229-F'!$B$54)","v":""},{"$f":"IF('Tex-229-F'!$I$47=\"\",\"\",'Tex-229-F'!$I$47)","v":" Individual Percent Retained"}]
[138,{"$f":"IF('Tex-229-F'!$K$54=\"\",\"\",'Tex-229-F'!$K$54)","v":""},{"$f":"IF('Tex-229-F'!$B$44=\"\",\"\",'Tex-229-F'!$B$44)","v":"GRADATION OF EXTRACTED AGGREGATE-Tex-229-F"},{"$f":"IF('Tex-229-F'!$B$47=\"\",\"\",'Tex-229-F'!$B$47)","v":"Sieve Size:"},{"$f":"IF('Tex-229-F'!$B$54=\"\",\"\",'Tex-229-F'!$B$54)","v":""},{"$f":"IF('Tex-229-F'!$K$47=\"\",\"\",'Tex-229-F'!$K$47)","v":" Cumulative Percent Retained"}]
[139,{"$f":"IF('Tex-229-F'!$M$54=\"\",\"\",'Tex-229-F'!$M$54)","v":""},{"$f":"IF('Tex-229-F'!$B$44=\"\",\"\",'Tex-229-F'!$B$44)","v":"GRADATION OF EXTRACTED AGGREGATE-Tex-229-F"},{"$f":"IF('Tex-229-F'!$B$47=\"\",\"\",'Tex-229-F'!$B$47)","v":"Sieve Size:"},{"$f":"IF('Tex-229-F'!$B$54=\"\",\"\",'Tex-229-F'!$B$54)","v":""},{"$f":"IF('Tex-229-F'!$M$47=\"\",\"\",'Tex-229-F'!$M$47)","v":" Cumulative Percent Passing"}]
[140,{"$f":"IF('Tex-229-F'!$O$54=\"\",\"\",'Tex-229-F'!$O$54)","v":""},{"$f":"IF('Tex-229-F'!$B$44=\"\",\"\",'Tex-229-F'!$B$44)","v":"GRADATION OF EXTRACTED AGGREGATE-Tex-229-F"},{"$f":"IF('Tex-229-F'!$B$47=\"\",\"\",'Tex-229-F'!$B$47)","v":"Sieve Size:"},{"$f":"IF('Tex-229-F'!$B$54=\"\",\"\",'Tex-229-F'!$B$54)","v":""},{"$f":"IF('Tex-229-F'!$O$47=\"\",\"\",'Tex-229-F'!$O$47)","v":"JMF  Individual Retained Limits, %"}]
[141,{"$f":"IF('Tex-229-F'!$Q$54=\"\",\"\",'Tex-229-F'!$Q$54)","v":""},{"$f":"IF('Tex-229-F'!$B$44=\"\",\"\",'Tex-229-F'!$B$44)","v":"GRADATION OF EXTRACTED AGGREGATE-Tex-229-F"},{"$f":"IF('Tex-229-F'!$B$47=\"\",\"\",'Tex-229-F'!$B$47)","v":"Sieve Size:"},{"$f":"IF('Tex-229-F'!$B$54=\"\",\"\",'Tex-229-F'!$B$54)","v":""},{"$f":"IF('Tex-229-F'!$Q$47=\"\",\"\",'Tex-229-F'!$Q$47)","v":"In Tolerance"}]
[142,{"$f":"IF('Tex-229-F'!$E$55=\"\",\"\",'Tex-229-F'!$E$55)","v":""},{"$f":"IF('Tex-229-F'!$B$44=\"\",\"\",'Tex-229-F'!$B$44)","v":"GRADATION OF EXTRACTED AGGREGATE-Tex-229-F"},{"$f":"IF('Tex-229-F'!$B$47=\"\",\"\",'Tex-229-F'!$B$47)","v":"Sieve Size:"},{"$f":"IF('Tex-229-F'!$B$55=\"\",\"\",'Tex-229-F'!$B$55)","v":""},{"$f":"IF('Tex-229-F'!$E$47=\"\",\"\",'Tex-229-F'!$E$47)","v":"Individual Weight Retained, (g)"}]
[143,{"$f":"IF('Tex-229-F'!$G$55=\"\",\"\",'Tex-229-F'!$G$55)","v":""},{"$f":"IF('Tex-229-F'!$B$44=\"\",\"\",'Tex-229-F'!$B$44)","v":"GRADATION OF EXTRACTED AGGREGATE-Tex-229-F"},{"$f":"IF('Tex-229-F'!$B$47=\"\",\"\",'Tex-229-F'!$B$47)","v":"Sieve Size:"},{"$f":"IF('Tex-229-F'!$B$55=\"\",\"\",'Tex-229-F'!$B$55)","v":""},{"$f":"IF('Tex-229-F'!$G$47=\"\",\"\",'Tex-229-F'!$G$47)","v":"Cumulative Weight Retained, (g)"}]
[144,{"$f":"IF('Tex-229-F'!$I$55=\"\",\"\",'Tex-229-F'!$I$55)","v":""},{"$f":"IF('Tex-229-F'!$B$44=\"\",\"\",'Tex-229-F'!$B$44)","v":"GRADATION OF EXTRACTED AGGREGATE-Tex-229-F"},{"$f":"IF('Tex-229-F'!$B$47=\"\",\"\",'Tex-229-F'!$B$47)","v":"Sieve Size:"},{"$f":"IF('Tex-229-F'!$B$55=\"\",\"\",'Tex-229-F'!$B$55)","v":""},{"$f":"IF('Tex-229-F'!$I$47=\"\",\"\",'Tex-229-F'!$I$47)","v":" Individual Percent Retained"}]
[145,{"$f":"IF('Tex-229-F'!$K$55=\"\",\"\",'Tex-229-F'!$K$55)","v":""},{"$f":"IF('Tex-229-F'!$B$44=\"\",\"\",'Tex-229-F'!$B$44)","v":"GRADATION OF EXTRACTED AGGREGATE-Tex-229-F"},{"$f":"IF('Tex-229-F'!$B$47=\"\",\"\",'Tex-229-F'!$B$47)","v":"Sieve Size:"},{"$f":"IF('Tex-229-F'!$B$55=\"\",\"\",'Tex-229-F'!$B$55)","v":""},{"$f":"IF('Tex-229-F'!$K$47=\"\",\"\",'Tex-229-F'!$K$47)","v":" Cumulative Percent Retained"}]
[146,{"$f":"IF('Tex-229-F'!$M$55=\"\",\"\",'Tex-229-F'!$M$55)","v":""},{"$f":"IF('Tex-229-F'!$B$44=\"\",\"\",'Tex-229-F'!$B$44)","v":"GRADATION OF EXTRACTED AGGREGATE-Tex-229-F"},{"$f":"IF('Tex-229-F'!$B$47=\"\",\"\",'Tex-229-F'!$B$47)","v":"Sieve Size:"},{"$f":"IF('Tex-229-F'!$B$55=\"\",\"\",'Tex-229-F'!$B$55)","v":""},{"$f":"IF('Tex-229-F'!$M$47=\"\",\"\",'Tex-229-F'!$M$47)","v":" Cumulative Percent Passing"}]
[147,{"$f":"IF('Tex-229-F'!$O$55=\"\",\"\",'Tex-229-F'!$O$55)","v":""},{"$f":"IF('Tex-229-F'!$B$44=\"\",\"\",'Tex-229-F'!$B$44)","v":"GRADATION OF EXTRACTED AGGREGATE-Tex-229-F"},{"$f":"IF('Tex-229-F'!$B$47=\"\",\"\",'Tex-229-F'!$B$47)","v":"Sieve Size:"},{"$f":"IF('Tex-229-F'!$B$55=\"\",\"\",'Tex-229-F'!$B$55)","v":""},{"$f":"IF('Tex-229-F'!$O$47=\"\",\"\",'Tex-229-F'!$O$47)","v":"JMF  Individual Retained Limits, %"}]
[148,{"$f":"IF('Tex-229-F'!$Q$55=\"\",\"\",'Tex-229-F'!$Q$55)","v":""},{"$f":"IF('Tex-229-F'!$B$44=\"\",\"\",'Tex-229-F'!$B$44)","v":"GRADATION OF EXTRACTED AGGREGATE-Tex-229-F"},{"$f":"IF('Tex-229-F'!$B$47=\"\",\"\",'Tex-229-F'!$B$47)","v":"Sieve Size:"},{"$f":"IF('Tex-229-F'!$B$55=\"\",\"\",'Tex-229-F'!$B$55)","v":""},{"$f":"IF('Tex-229-F'!$Q$47=\"\",\"\",'Tex-229-F'!$Q$47)","v":"In Tolerance"}]
[149,{"$f":"IF('Tex-229-F'!$E$56=\"\",\"\",'Tex-229-F'!$E$56)","v":""},{"$f":"IF('Tex-229-F'!$B$44=\"\",\"\",'Tex-229-F'!$B$44)","v":"GRADATION OF EXTRACTED AGGREGATE-Tex-229-F"},{"$f":"IF('Tex-229-F'!$B$47=\"\",\"\",'Tex-229-F'!$B$47)","v":"Sieve Size:"},{"$f":"IF('Tex-229-F'!$B$56=\"\",\"\",'Tex-229-F'!$B$56)","v":""},{"$f":"IF('Tex-229-F'!$E$47=\"\",\"\",'Tex-229-F'!$E$47)","v":"Individual Weight Retained, (g)"}]
[150,{"$f":"IF('Tex-229-F'!$G$56=\"\",\"\",'Tex-229-F'!$G$56)","v":""},{"$f":"IF('Tex-229-F'!$B$44=\"\",\"\",'Tex-229-F'!$B$44)","v":"GRADATION OF EXTRACTED AGGREGATE-Tex-229-F"},{"$f":"IF('Tex-229-F'!$B$47=\"\",\"\",'Tex-229-F'!$B$47)","v":"Sieve Size:"},{"$f":"IF('Tex-229-F'!$B$56=\"\",\"\",'Tex-229-F'!$B$56)","v":""},{"$f":"IF('Tex-229-F'!$G$47=\"\",\"\",'Tex-229-F'!$G$47)","v":"Cumulative Weight Retained, (g)"}]
[151,{"$f":"IF('Tex-229-F'!$I$56=\"\",\"\",'Tex-229-F'!$I$56)","v":""},{"$f":"IF('Tex-229-F'!$B$44=\"\",\"\",'Tex-229-F'!$B$44)","v":"GRADATION OF EXTRACTED AGGREGATE-Tex-229-F"},{"$f":"IF('Tex-229-F'!$B$47=\"\",\"\",'Tex-229-F'!$B$47)","v":"Sieve Size:"},{"$f":"IF('Tex-229-F'!$B$56=\"\",\"\",'Tex-229-F'!$B$56)","v":""},{"$f":"IF('Tex-229-F'!$I$47=\"\",\"\",'Tex-229-F'!$I$47)","v":" Individual Percent Retained"}]
[152,{"$f":"IF('Tex-229-F'!$K$56=\"\",\"\",'Tex-229-F'!$K$56)","v":""},{"$f":"IF('Tex-229-F'!$B$44=\"\",\"\",'Tex-229-F'!$B$44)","v":"GRADATION OF EXTRACTED AGGREGATE-Tex-229-F"},{"$f":"IF('Tex-229-F'!$B$47=\"\",\"\",'Tex-229-F'!$B$47)","v":"Sieve Size:"},{"$f":"IF('Tex-229-F'!$B$56=\"\",\"\",'Tex-229-F'!$B$56)","v":""},{"$f":"IF('Tex-229-F'!$K$47=\"\",\"\",'Tex-229-F'!$K$47)","v":" Cumulative Percent Retained"}]
[153,{"$f":"IF('Tex-229-F'!$M$56=\"\",\"\",'Tex-229-F'!$M$56)","v":""},{"$f":"IF('Tex-229-F'!$B$44=\"\",\"\",'Tex-229-F'!$B$44)","v":"GRADATION OF EXTRACTED AGGREGATE-Tex-229-F"},{"$f":"IF('Tex-229-F'!$B$47=\"\",\"\",'Tex-229-F'!$B$47)","v":"Sieve Size:"},{"$f":"IF('Tex-229-F'!$B$56=\"\",\"\",'Tex-229-F'!$B$56)","v":""},{"$f":"IF('Tex-229-F'!$M$47=\"\",\"\",'Tex-229-F'!$M$47)","v":" Cumulative Percent Passing"}]
[154,{"$f":"IF('Tex-229-F'!$O$56=\"\",\"\",'Tex-229-F'!$O$56)","v":""},{"$f":"IF('Tex-229-F'!$B$44=\"\",\"\",'Tex-229-F'!$B$44)","v":"GRADATION OF EXTRACTED AGGREGATE-Tex-229-F"},{"$f":"IF('Tex-229-F'!$B$47=\"\",\"\",'Tex-229-F'!$B$47)","v":"Sieve Size:"},{"$f":"IF('Tex-229-F'!$B$56=\"\",\"\",'Tex-229-F'!$B$56)","v":""},{"$f":"IF('Tex-229-F'!$O$47=\"\",\"\",'Tex-229-F'!$O$47)","v":"JMF  Individual Retained Limits, %"}]
[155,{"$f":"IF('Tex-229-F'!$Q$56=\"\",\"\",'Tex-229-F'!$Q$56)","v":""},{"$f":"IF('Tex-229-F'!$B$44=\"\",\"\",'Tex-229-F'!$B$44)","v":"GRADATION OF EXTRACTED AGGREGATE-Tex-229-F"},{"$f":"IF('Tex-229-F'!$B$47=\"\",\"\",'Tex-229-F'!$B$47)","v":"Sieve Size:"},{"$f":"IF('Tex-229-F'!$B$56=\"\",\"\",'Tex-229-F'!$B$56)","v":""},{"$f":"IF('Tex-229-F'!$Q$47=\"\",\"\",'Tex-229-F'!$Q$47)","v":"In Tolerance"}]
[156,{"$f":"IF('Tex-229-F'!$E$57=\"\",\"\",'Tex-229-F'!$E$57)","v":""},{"$f":"IF('Tex-229-F'!$B$44=\"\",\"\",'Tex-229-F'!$B$44)","v":"GRADATION OF EXTRACTED AGGREGATE-Tex-229-F"},{"$f":"IF('Tex-229-F'!$B$47=\"\",\"\",'Tex-229-F'!$B$47)","v":"Sieve Size:"},{"$f":"IF('Tex-229-F'!$B$57=\"\",\"\",'Tex-229-F'!$B$57)","v":""},{"$f":"IF('Tex-229-F'!$E$47=\"\",\"\",'Tex-229-F'!$E$47)","v":"Individual Weight Retained, (g)"}]
[157,{"$f":"IF('Tex-229-F'!$G$57=\"\",\"\",'Tex-229-F'!$G$57)","v":""},{"$f":"IF('Tex-229-F'!$B$44=\"\",\"\",'Tex-229-F'!$B$44)","v":"GRADATION OF EXTRACTED AGGREGATE-Tex-229-F"},{"$f":"IF('Tex-229-F'!$B$47=\"\",\"\",'Tex-229-F'!$B$47)","v":"Sieve Size:"},{"$f":"IF('Tex-229-F'!$B$57=\"\",\"\",'Tex-229-F'!$B$57)","v":""},{"$f":"IF('Tex-229-F'!$G$47=\"\",\"\",'Tex-229-F'!$G$47)","v":"Cumulative Weight Retained, (g)"}]
[158,{"$f":"IF('Tex-229-F'!$I$57=\"\",\"\",'Tex-229-F'!$I$57)","v":""},{"$f":"IF('Tex-229-F'!$B$44=\"\",\"\",'Tex-229-F'!$B$44)","v":"GRADATION OF EXTRACTED AGGREGATE-Tex-229-F"},{"$f":"IF('Tex-229-F'!$B$47=\"\",\"\",'Tex-229-F'!$B$47)","v":"Sieve Size:"},{"$f":"IF('Tex-229-F'!$B$57=\"\",\"\",'Tex-229-F'!$B$57)","v":""},{"$f":"IF('Tex-229-F'!$I$47=\"\",\"\",'Tex-229-F'!$I$47)","v":" Individual Percent Retained"}]
[159,{"$f":"IF('Tex-229-F'!$K$57=\"\",\"\",'Tex-229-F'!$K$57)","v":""},{"$f":"IF('Tex-229-F'!$B$44=\"\",\"\",'Tex-229-F'!$B$44)","v":"GRADATION OF EXTRACTED AGGREGATE-Tex-229-F"},{"$f":"IF('Tex-229-F'!$B$47=\"\",\"\",'Tex-229-F'!$B$47)","v":"Sieve Size:"},{"$f":"IF('Tex-229-F'!$B$57=\"\",\"\",'Tex-229-F'!$B$57)","v":""},{"$f":"IF('Tex-229-F'!$K$47=\"\",\"\",'Tex-229-F'!$K$47)","v":" Cumulative Percent Retained"}]
[160,{"$f":"IF('Tex-229-F'!$M$57=\"\",\"\",'Tex-229-F'!$M$57)","v":""},{"$f":"IF('Tex-229-F'!$B$44=\"\",\"\",'Tex-229-F'!$B$44)","v":"GRADATION OF EXTRACTED AGGREGATE-Tex-229-F"},{"$f":"IF('Tex-229-F'!$B$47=\"\",\"\",'Tex-229-F'!$B$47)","v":"Sieve Size:"},{"$f":"IF('Tex-229-F'!$B$57=\"\",\"\",'Tex-229-F'!$B$57)","v":""},{"$f":"IF('Tex-229-F'!$M$47=\"\",\"\",'Tex-229-F'!$M$47)","v":" Cumulative Percent Passing"}]
[161,{"$f":"IF('Tex-229-F'!$O$57=\"\",\"\",'Tex-229-F'!$O$57)","v":""},{"$f":"IF('Tex-229-F'!$B$44=\"\",\"\",'Tex-229-F'!$B$44)","v":"GRADATION OF EXTRACTED AGGREGATE-Tex-229-F"},{"$f":"IF('Tex-229-F'!$B$47=\"\",\"\",'Tex-229-F'!$B$47)","v":"Sieve Size:"},{"$f":"IF('Tex-229-F'!$B$57=\"\",\"\",'Tex-229-F'!$B$57)","v":""},{"$f":"IF('Tex-229-F'!$O$47=\"\",\"\",'Tex-229-F'!$O$47)","v":"JMF  Individual Retained Limits, %"}]
[162,{"$f":"IF('Tex-229-F'!$Q$57=\"\",\"\",'Tex-229-F'!$Q$57)","v":""},{"$f":"IF('Tex-229-F'!$B$44=\"\",\"\",'Tex-229-F'!$B$44)","v":"GRADATION OF EXTRACTED AGGREGATE-Tex-229-F"},{"$f":"IF('Tex-229-F'!$B$47=\"\",\"\",'Tex-229-F'!$B$47)","v":"Sieve Size:"},{"$f":"IF('Tex-229-F'!$B$57=\"\",\"\",'Tex-229-F'!$B$57)","v":""},{"$f":"IF('Tex-229-F'!$Q$47=\"\",\"\",'Tex-229-F'!$Q$47)","v":"In Tolerance"}]
[163,{"$f":"IF('Tex-229-F'!$E$58=\"\",\"\",'Tex-229-F'!$E$58)","v":""},{"$f":"IF('Tex-229-F'!$B$44=\"\",\"\",'Tex-229-F'!$B$44)","v":"GRADATION OF EXTRACTED AGGREGATE-Tex-229-F"},{"$f":"IF('Tex-229-F'!$B$47=\"\",\"\",'Tex-229-F'!$B$47)","v":"Sieve Size:"},{"$f":"IF('Tex-229-F'!$B$58=\"\",\"\",'Tex-229-F'!$B$58)","v":""},{"$f":"IF('Tex-229-F'!$E$47=\"\",\"\",'Tex-229-F'!$E$47)","v":"Individual Weight Retained, (g)"}]
[164,{"$f":"IF('Tex-229-F'!$G$58=\"\",\"\",'Tex-229-F'!$G$58)","v":""},{"$f":"IF('Tex-229-F'!$B$44=\"\",\"\",'Tex-229-F'!$B$44)","v":"GRADATION OF EXTRACTED AGGREGATE-Tex-229-F"},{"$f":"IF('Tex-229-F'!$B$47=\"\",\"\",'Tex-229-F'!$B$47)","v":"Sieve Size:"},{"$f":"IF('Tex-229-F'!$B$58=\"\",\"\",'Tex-229-F'!$B$58)","v":""},{"$f":"IF('Tex-229-F'!$G$47=\"\",\"\",'Tex-229-F'!$G$47)","v":"Cumulative Weight Retained, (g)"}]
[165,{"$f":"IF('Tex-229-F'!$I$58=\"\",\"\",'Tex-229-F'!$I$58)","v":""},{"$f":"IF('Tex-229-F'!$B$44=\"\",\"\",'Tex-229-F'!$B$44)","v":"GRADATION OF EXTRACTED AGGREGATE-Tex-229-F"},{"$f":"IF('Tex-229-F'!$B$47=\"\",\"\",'Tex-229-F'!$B$47)","v":"Sieve Size:"},{"$f":"IF('Tex-229-F'!$B$58=\"\",\"\",'Tex-229-F'!$B$58)","v":""},{"$f":"IF('Tex-229-F'!$I$47=\"\",\"\",'Tex-229-F'!$I$47)","v":" Individual Percent Retained"}]
[166,{"$f":"IF('Tex-229-F'!$K$58=\"\",\"\",'Tex-229-F'!$K$58)","v":""},{"$f":"IF('Tex-229-F'!$B$44=\"\",\"\",'Tex-229-F'!$B$44)","v":"GRADATION OF EXTRACTED AGGREGATE-Tex-229-F"},{"$f":"IF('Tex-229-F'!$B$47=\"\",\"\",'Tex-229-F'!$B$47)","v":"Sieve Size:"},{"$f":"IF('Tex-229-F'!$B$58=\"\",\"\",'Tex-229-F'!$B$58)","v":""},{"$f":"IF('Tex-229-F'!$K$47=\"\",\"\",'Tex-229-F'!$K$47)","v":" Cumulative Percent Retained"}]
[167,{"$f":"IF('Tex-229-F'!$M$58=\"\",\"\",'Tex-229-F'!$M$58)","v":""},{"$f":"IF('Tex-229-F'!$B$44=\"\",\"\",'Tex-229-F'!$B$44)","v":"GRADATION OF EXTRACTED AGGREGATE-Tex-229-F"},{"$f":"IF('Tex-229-F'!$B$47=\"\",\"\",'Tex-229-F'!$B$47)","v":"Sieve Size:"},{"$f":"IF('Tex-229-F'!$B$58=\"\",\"\",'Tex-229-F'!$B$58)","v":""},{"$f":"IF('Tex-229-F'!$M$47=\"\",\"\",'Tex-229-F'!$M$47)","v":" Cumulative Percent Passing"}]
[168,{"$f":"IF('Tex-229-F'!$O$58=\"\",\"\",'Tex-229-F'!$O$58)","v":""},{"$f":"IF('Tex-229-F'!$B$44=\"\",\"\",'Tex-229-F'!$B$44)","v":"GRADATION OF EXTRACTED AGGREGATE-Tex-229-F"},{"$f":"IF('Tex-229-F'!$B$47=\"\",\"\",'Tex-229-F'!$B$47)","v":"Sieve Size:"},{"$f":"IF('Tex-229-F'!$B$58=\"\",\"\",'Tex-229-F'!$B$58)","v":""},{"$f":"IF('Tex-229-F'!$O$47=\"\",\"\",'Tex-229-F'!$O$47)","v":"JMF  Individual Retained Limits, %"}]
[169,{"$f":"IF('Tex-229-F'!$Q$58=\"\",\"\",'Tex-229-F'!$Q$58)","v":""},{"$f":"IF('Tex-229-F'!$B$44=\"\",\"\",'Tex-229-F'!$B$44)","v":"GRADATION OF EXTRACTED AGGREGATE-Tex-229-F"},{"$f":"IF('Tex-229-F'!$B$47=\"\",\"\",'Tex-229-F'!$B$47)","v":"Sieve Size:"},{"$f":"IF('Tex-229-F'!$B$58=\"\",\"\",'Tex-229-F'!$B$58)","v":""},{"$f":"IF('Tex-229-F'!$Q$47=\"\",\"\",'Tex-229-F'!$Q$47)","v":"In Tolerance"}]
[170,{"$f":"IF('Tex-229-F'!$E$59=\"\",\"\",'Tex-229-F'!$E$59)","v":""},{"$f":"IF('Tex-229-F'!$B$44=\"\",\"\",'Tex-229-F'!$B$44)","v":"GRADATION OF EXTRACTED AGGREGATE-Tex-229-F"},{"$f":"IF('Tex-229-F'!$B$47=\"\",\"\",'Tex-229-F'!$B$47)","v":"Sieve Size:"},{"$f":"IF('Tex-229-F'!$B$59=\"\",\"\",'Tex-229-F'!$B$59)","v":""},{"$f":"IF('Tex-229-F'!$E$47=\"\",\"\",'Tex-229-F'!$E$47)","v":"Individual Weight Retained, (g)"}]
[171,{"$f":"IF('Tex-229-F'!$G$59=\"\",\"\",'Tex-229-F'!$G$59)","v":""},{"$f":"IF('Tex-229-F'!$B$44=\"\",\"\",'Tex-229-F'!$B$44)","v":"GRADATION OF EXTRACTED AGGREGATE-Tex-229-F"},{"$f":"IF('Tex-229-F'!$B$47=\"\",\"\",'Tex-229-F'!$B$47)","v":"Sieve Size:"},{"$f":"IF('Tex-229-F'!$B$59=\"\",\"\",'Tex-229-F'!$B$59)","v":""},{"$f":"IF('Tex-229-F'!$G$47=\"\",\"\",'Tex-229-F'!$G$47)","v":"Cumulative Weight Retained, (g)"}]
[172,{"$f":"IF('Tex-229-F'!$I$59=\"\",\"\",'Tex-229-F'!$I$59)","v":""},{"$f":"IF('Tex-229-F'!$B$44=\"\",\"\",'Tex-229-F'!$B$44)","v":"GRADATION OF EXTRACTED AGGREGATE-Tex-229-F"},{"$f":"IF('Tex-229-F'!$B$47=\"\",\"\",'Tex-229-F'!$B$47)","v":"Sieve Size:"},{"$f":"IF('Tex-229-F'!$B$59=\"\",\"\",'Tex-229-F'!$B$59)","v":""},{"$f":"IF('Tex-229-F'!$I$47=\"\",\"\",'Tex-229-F'!$I$47)","v":" Individual Percent Retained"}]
[173,{"$f":"IF('Tex-229-F'!$K$59=\"\",\"\",'Tex-229-F'!$K$59)","v":""},{"$f":"IF('Tex-229-F'!$B$44=\"\",\"\",'Tex-229-F'!$B$44)","v":"GRADATION OF EXTRACTED AGGREGATE-Tex-229-F"},{"$f":"IF('Tex-229-F'!$B$47=\"\",\"\",'Tex-229-F'!$B$47)","v":"Sieve Size:"},{"$f":"IF('Tex-229-F'!$B$59=\"\",\"\",'Tex-229-F'!$B$59)","v":""},{"$f":"IF('Tex-229-F'!$K$47=\"\",\"\",'Tex-229-F'!$K$47)","v":" Cumulative Percent Retained"}]
[174,{"$f":"IF('Tex-229-F'!$M$59=\"\",\"\",'Tex-229-F'!$M$59)","v":""},{"$f":"IF('Tex-229-F'!$B$44=\"\",\"\",'Tex-229-F'!$B$44)","v":"GRADATION OF EXTRACTED AGGREGATE-Tex-229-F"},{"$f":"IF('Tex-229-F'!$B$47=\"\",\"\",'Tex-229-F'!$B$47)","v":"Sieve Size:"},{"$f":"IF('Tex-229-F'!$B$59=\"\",\"\",'Tex-229-F'!$B$59)","v":""},{"$f":"IF('Tex-229-F'!$M$47=\"\",\"\",'Tex-229-F'!$M$47)","v":" Cumulative Percent Passing"}]
[175,{"$f":"IF('Tex-229-F'!$O$59=\"\",\"\",'Tex-229-F'!$O$59)","v":""},{"$f":"IF('Tex-229-F'!$B$44=\"\",\"\",'Tex-229-F'!$B$44)","v":"GRADATION OF EXTRACTED AGGREGATE-Tex-229-F"},{"$f":"IF('Tex-229-F'!$B$47=\"\",\"\",'Tex-229-F'!$B$47)","v":"Sieve Size:"},{"$f":"IF('Tex-229-F'!$B$59=\"\",\"\",'Tex-229-F'!$B$59)","v":""},{"$f":"IF('Tex-229-F'!$O$47=\"\",\"\",'Tex-229-F'!$O$47)","v":"JMF  Individual Retained Limits, %"}]
[176,{"$f":"IF('Tex-229-F'!$Q$59=\"\",\"\",'Tex-229-F'!$Q$59)","v":""},{"$f":"IF('Tex-229-F'!$B$44=\"\",\"\",'Tex-229-F'!$B$44)","v":"GRADATION OF EXTRACTED AGGREGATE-Tex-229-F"},{"$f":"IF('Tex-229-F'!$B$47=\"\",\"\",'Tex-229-F'!$B$47)","v":"Sieve Size:"},{"$f":"IF('Tex-229-F'!$B$59=\"\",\"\",'Tex-229-F'!$B$59)","v":""},{"$f":"IF('Tex-229-F'!$Q$47=\"\",\"\",'Tex-229-F'!$Q$47)","v":"In Tolerance"}]
[177,{"$f":"IF('Tex-229-F'!$E$60=\"\",\"\",'Tex-229-F'!$E$60)","v":""},{"$f":"IF('Tex-229-F'!$B$44=\"\",\"\",'Tex-229-F'!$B$44)","v":"GRADATION OF EXTRACTED AGGREGATE-Tex-229-F"},{"$f":"IF('Tex-229-F'!$B$47=\"\",\"\",'Tex-229-F'!$B$47)","v":"Sieve Size:"},{"$f":"IF('Tex-229-F'!$B$60=\"\",\"\",'Tex-229-F'!$B$60)","v":""},{"$f":"IF('Tex-229-F'!$E$47=\"\",\"\",'Tex-229-F'!$E$47)","v":"Individual Weight Retained, (g)"}]
[178,{"$f":"IF('Tex-229-F'!$G$60=\"\",\"\",'Tex-229-F'!$G$60)","v":""},{"$f":"IF('Tex-229-F'!$B$44=\"\",\"\",'Tex-229-F'!$B$44)","v":"GRADATION OF EXTRACTED AGGREGATE-Tex-229-F"},{"$f":"IF('Tex-229-F'!$B$47=\"\",\"\",'Tex-229-F'!$B$47)","v":"Sieve Size:"},{"$f":"IF('Tex-229-F'!$B$60=\"\",\"\",'Tex-229-F'!$B$60)","v":""},{"$f":"IF('Tex-229-F'!$G$47=\"\",\"\",'Tex-229-F'!$G$47)","v":"Cumulative Weight Retained, (g)"}]
[179,{"$f":"IF('Tex-229-F'!$I$60=\"\",\"\",'Tex-229-F'!$I$60)","v":""},{"$f":"IF('Tex-229-F'!$B$44=\"\",\"\",'Tex-229-F'!$B$44)","v":"GRADATION OF EXTRACTED AGGREGATE-Tex-229-F"},{"$f":"IF('Tex-229-F'!$B$47=\"\",\"\",'Tex-229-F'!$B$47)","v":"Sieve Size:"},{"$f":"IF('Tex-229-F'!$B$60=\"\",\"\",'Tex-229-F'!$B$60)","v":""},{"$f":"IF('Tex-229-F'!$I$47=\"\",\"\",'Tex-229-F'!$I$47)","v":" Individual Percent Retained"}]
[180,{"$f":"IF('Tex-229-F'!$K$60=\"\",\"\",'Tex-229-F'!$K$60)","v":""},{"$f":"IF('Tex-229-F'!$B$44=\"\",\"\",'Tex-229-F'!$B$44)","v":"GRADATION OF EXTRACTED AGGREGATE-Tex-229-F"},{"$f":"IF('Tex-229-F'!$B$47=\"\",\"\",'Tex-229-F'!$B$47)","v":"Sieve Size:"},{"$f":"IF('Tex-229-F'!$B$60=\"\",\"\",'Tex-229-F'!$B$60)","v":""},{"$f":"IF('Tex-229-F'!$K$47=\"\",\"\",'Tex-229-F'!$K$47)","v":" Cumulative Percent Retained"}]
[181,{"$f":"IF('Tex-229-F'!$M$60=\"\",\"\",'Tex-229-F'!$M$60)","v":""},{"$f":"IF('Tex-229-F'!$B$44=\"\",\"\",'Tex-229-F'!$B$44)","v":"GRADATION OF EXTRACTED AGGREGATE-Tex-229-F"},{"$f":"IF('Tex-229-F'!$B$47=\"\",\"\",'Tex-229-F'!$B$47)","v":"Sieve Size:"},{"$f":"IF('Tex-229-F'!$B$60=\"\",\"\",'Tex-229-F'!$B$60)","v":""},{"$f":"IF('Tex-229-F'!$M$47=\"\",\"\",'Tex-229-F'!$M$47)","v":" Cumulative Percent Passing"}]
[182,{"$f":"IF('Tex-229-F'!$O$60=\"\",\"\",'Tex-229-F'!$O$60)","v":""},{"$f":"IF('Tex-229-F'!$B$44=\"\",\"\",'Tex-229-F'!$B$44)","v":"GRADATION OF EXTRACTED AGGREGATE-Tex-229-F"},{"$f":"IF('Tex-229-F'!$B$47=\"\",\"\",'Tex-229-F'!$B$47)","v":"Sieve Size:"},{"$f":"IF('Tex-229-F'!$B$60=\"\",\"\",'Tex-229-F'!$B$60)","v":""},{"$f":"IF('Tex-229-F'!$O$47=\"\",\"\",'Tex-229-F'!$O$47)","v":"JMF  Individual Retained Limits, %"}]
[183,{"$f":"IF('Tex-229-F'!$Q$60=\"\",\"\",'Tex-229-F'!$Q$60)","v":""},{"$f":"IF('Tex-229-F'!$B$44=\"\",\"\",'Tex-229-F'!$B$44)","v":"GRADATION OF EXTRACTED AGGREGATE-Tex-229-F"},{"$f":"IF('Tex-229-F'!$B$47=\"\",\"\",'Tex-229-F'!$B$47)","v":"Sieve Size:"},{"$f":"IF('Tex-229-F'!$B$60=\"\",\"\",'Tex-229-F'!$B$60)","v":""},{"$f":"IF('Tex-229-F'!$Q$47=\"\",\"\",'Tex-229-F'!$Q$47)","v":"In Tolerance"}]
[184,{"$f":"IF('Tex-229-F'!$E$61=\"\",\"\",'Tex-229-F'!$E$61)","v":""},{"$f":"IF('Tex-229-F'!$B$44=\"\",\"\",'Tex-229-F'!$B$44)","v":"GRADATION OF EXTRACTED AGGREGATE-Tex-229-F"},{"$f":"IF('Tex-229-F'!$B$47=\"\",\"\",'Tex-229-F'!$B$47)","v":"Sieve Size:"},{"$f":"IF('Tex-229-F'!$B$61=\"\",\"\",'Tex-229-F'!$B$61)","v":""},{"$f":"IF('Tex-229-F'!$E$47=\"\",\"\",'Tex-229-F'!$E$47)","v":"Individual Weight Retained, (g)"}]
[185,{"$f":"IF('Tex-229-F'!$E$62=\"\",\"\",'Tex-229-F'!$E$62)","v":""},{"$f":"IF('Tex-229-F'!$G$62=\"\",\"\",'Tex-229-F'!$G$62)","v":"Gain (g)"}]
[186,{"$f":"IF('Tex-229-F'!$E$63=\"\",\"\",'Tex-229-F'!$E$63)","v":""},{"$f":"IF('Tex-229-F'!$B$44=\"\",\"\",'Tex-229-F'!$B$44)","v":"GRADATION OF EXTRACTED AGGREGATE-Tex-229-F"},{"$f":"IF('Tex-229-F'!$B$47=\"\",\"\",'Tex-229-F'!$B$47)","v":"Sieve Size:"},{"$f":"IF('Tex-229-F'!$B$63=\"\",\"\",'Tex-229-F'!$B$63)","v":"Total "},{"$f":"IF('Tex-229-F'!$E$47=\"\",\"\",'Tex-229-F'!$E$47)","v":"Individual Weight Retained, (g)"}]
[187,{"$f":"IF('Tex-229-F'!$E$64=\"\",\"\",'Tex-229-F'!$E$64)","v":""},{"$f":"IF('Tex-229-F'!$B$44=\"\",\"\",'Tex-229-F'!$B$44)","v":"GRADATION OF EXTRACTED AGGREGATE-Tex-229-F"},{"$f":"IF('Tex-229-F'!$B$47=\"\",\"\",'Tex-229-F'!$B$47)","v":"Sieve Size:"},{"$f":"IF('Tex-229-F'!$B$64=\"\",\"\",'Tex-229-F'!$B$64)","v":"Total Weight:"},{"$f":"IF('Tex-229-F'!$E$47=\"\",\"\",'Tex-229-F'!$E$47)","v":"Individual Weight Retained, (g)"}]
[188,{"$f":"IF('Tex-229-F'!$E$65=\"\",\"\",'Tex-229-F'!$E$65)","v":""},{"$f":"IF('Tex-229-F'!$G$65=\"\",\"\",'Tex-229-F'!$G$65)","v":"Sieving Gain (g), from ?"}]

{"sheet":"MDV","index":3,"n_rows":208,"n_cols":16,"rows_kept":208,"cut":false,"hidden":true,"merged":[[194,7,199,7],[194,1,199,1],[200,7,207,7],[200,1,207,1],[149,7,157,7],[140,7,148,7],[130,7,139,7],[185,7,193,7],[176,7,184,7],[167,7,175,7],[158,7,166,7],[121,7,129,7],[112,7,120,7],[57,7,65,7],[66,7,73,7],[74,7,80,7],[81,7,87,7],[103,7,111,7],[94,7,102,7],[88,7,93,7],[1,5,1,6],[29,7,35,7],[36,7,41,7],[42,7,49,7],[3,7,11,7],[12,7,20,7],[21,7,28,7],[3,1,11,1],[12,1,20,1],[42,1,49,1],[50,7,56,7],[29,1,35,1],[50,1,56,1],[36,1,41,1],[21,1,28,1]]}
[]
[null,null,null,null,null,"Washed Sieve",null,"VMA:"]
[null,"Grade","1993 Sieve Size","1995 Sieve Size","Sieve Measurement","Min","Max","Min",null,"Sieve Size",null,null,null,"Tx1 Per Passing","Upper Limits","Lower Limits"]
[null,"TYPE A","1-1/2\"","37.5 mm",37.5,98,100,11,null,{"$f":"sieve1","v":""},{"$f":"SSize1","v":""},{"$f":"IF(ISERROR(K4^0.45),\"\",K4^0.45)","v":""},{"$f":"100","v":100},{"$f":"'Tex-229-F'!M51","v":""},{"$f":"IF(JMFDes1=\"\",\"\",IF(SSize1=0.075,INDEX(INDIRECT(Grade),1,6),IF(JMFDes1+IF(SSize1>=2,5,3)>100,100,JMFDes1+IF(SSize1>=2,5,3))))","v":""},{"$f":"IF(JMFDes1=\"\",\"\",IF(SSize1=0.075,INDEX(INDIRECT(Grade),1,5),IF(JMFDes1-IF(SSize1>=2,5,3)<0,0,JMFDes1-IF(SSize1>=2,5,3))))","v":""}]
[null,null,"1-1/4\"","31.5 mm",31.5,95,100,null,null,{"$f":"sieve2","v":""},{"$f":"SSize2","v":""},"",{"$f":"IF(ISERROR((100*($L5/$L$4))),0,(100*($L5/$L$4)))","v":0},{"$f":"'Tex-229-F'!M52","v":""},{"$f":"IF(JMFDes2=\"\",\"\",IF(SSize2=0.075,INDEX(INDIRECT(Grade),2,6),IF(JMFDes2+IF(SSize2>=2,5,3)>100,100,JMFDes2+IF(SSize2>=2,5,3))))","v":""},{"$f":"IF(JMFDes2=\"\",\"\",IF(SSize2=0.075,INDEX(INDIRECT(Grade),2,5),IF(JMFDes2-IF(SSize2>=2,5,3)<0,0,JMFDes2-IF(SSize2>=2,5,3))))","v":""}]
[null,null,"7/8\"","22.4 mm",22.4,70,90,null,null,{"$f":"sieve3","v":""},{"$f":"SSize3","v":""},"",0,{"$f":"'Tex-229-F'!M53","v":""},{"$f":"IF(JMFDes3=\"\",\"\",IF(SSize3=0.075,INDEX(INDIRECT(Grade),3,6),IF(JMFDes3+IF(SSize3>=2,5,3)>100,100,JMFDes3+IF(SSize3>=2,5,3))))","v":""},{"$f":"IF(JMFDes3=\"\",\"\",IF(SSize3=0.075,INDEX(INDIRECT(Grade),3,5),IF(JMFDes3-IF(SSize3>=2,5,3)<0,0,JMFDes3-IF(SSize3>=2,5,3))))","v":""}]
[null,null,"1/2\"","12.5 mm",12.5,50,70,null,null,{"$f":"sieve4","v":""},{"$f":"SSize4","v":""},"",0,{"$f":"'Tex-229-F'!M54","v":""},{"$f":"IF(JMFDes4=\"\",\"\",IF(SSize4=0.075,INDEX(INDIRECT(Grade),4,6),IF(JMFDes4+IF(SSize4>=2,5,3)>100,100,JMFDes4+IF(SSize4>=2,5,3))))","v":""},{"$f":"IF(JMFDes4=\"\",\"\",IF(SSize4=0.075,INDEX(INDIRECT(Grade),4,5),IF(JMFDes4-IF(SSize4>=2,5,3)<0,0,JMFDes4-IF(SSize4>=2,5,3))))","v":""}]
[null,null,"No. 4","4.75 mm",4.75,30,50,null,null,{"$f":"sieve5","v":""},{"$f":"SSize5","v":""},"",0,{"$f":"'Tex-229-F'!M55","v":""},{"$f":"IF(JMFDes5=\"\",\"\",IF(SSize5=0.075,INDEX(INDIRECT(Grade),5,6),IF(JMFDes5+IF(SSize5>=2,5,3)>100,100,JMFDes5+IF(SSize5>=2,5,3))))","v":""},{"$f":"IF(JMFDes5=\"\",\"\",IF(SSize5=0.075,INDEX(INDIRECT(Grade),5,5),IF(JMFDes5-IF(SSize5>=2,5,3)<0,0,JMFDes5-IF(SSize5>=2,5,3))))","v":""}]
[null,null,"No. 10","2 mm",2,20,34,null,null,{"$f":"sieve6","v":""},{"$f":"SSize6","v":""},"",0,{"$f":"'Tex-229-F'!M56","v":""},{"$f":"IF(JMFDes6=\"\",\"\",IF(SSize6=0.075,INDEX(INDIRECT(Grade),6,6),IF(JMFDes6+IF(SSize6>=2,5,3)>100,100,JMFDes6+IF(SSize6>=2,5,3))))","v":""},{"$f":"IF(JMFDes6=\"\",\"\",IF(SSize6=0.075,INDEX(INDIRECT(Grade),6,5),IF(JMFDes6-IF(SSize6>=2,5,3)<0,0,JMFDes6-IF(SSize6>=2,5,3))))","v":""}]
[null,null,"No. 40","425 µm",0.42499999999999999,5,20,null,null,{"$f":"sieve7","v":""},{"$f":"SSize7","v":""},"",0,{"$f":"'Tex-229-F'!M57","v":""},{"$f":"IF(JMFDes7=\"\",\"\",IF(SSize7=0.075,INDEX(INDIRECT(Grade),7,6),IF(JMFDes7+IF(SSize7>=2,5,3)>100,100,JMFDes7+IF(SSize7>=2,5,3))))","v":""},{"$f":"IF(JMFDes7=\"\",\"\",IF(SSize7=0.075,INDEX(INDIRECT(Grade),7,5),IF(JMFDes7-IF(SSize7>=2,5,3)<0,0,JMFDes7-IF(SSize7>=2,5,3))))","v":""}]
[null,null,"No. 80","180 µm",0.18,2,12,null,null,{"$f":"sieve8","v":""},{"$f":"SSize8","v":""},"",0,{"$f":"'Tex-229-F'!M58","v":""},{"$f":"IF(JMFDes8=\"\",\"\",IF(SSize8=0.075,INDEX(INDIRECT(Grade),8,6),IF(JMFDes8+IF(SSize8>=2,5,3)>100,100,JMFDes8+IF(SSize8>=2,5,3))))","v":""},{"$f":"IF(JMFDes8=\"\",\"\",IF(SSize8=0.075,INDEX(INDIRECT(Grade),8,5),IF(JMFDes8-IF(SSize8>=2,5,3)<0,0,JMFDes8-IF(SSize8>=2,5,3))))","v":""}]
[null,null,"No. 200","75 µm",7.4999999999999997E-2,1,6,null,null,{"$f":"sieve9","v":""},{"$f":"SSize9","v":""},"",0,{"$f":"'Tex-229-F'!M59","v":""},{"$f":"IF(JMFDes9=\"\",\"\",IF(SSize9=0.075,INDEX(INDIRECT(Grade),9,6),IF(JMFDes9+IF(SSize9>=2,5,3)>100,100,JMFDes9+IF(SSize9>=2,5,3))))","v":""},{"$f":"IF(JMFDes9=\"\",\"\",IF(SSize9=0.075,INDEX(INDIRECT(Grade),9,5),IF(JMFDes9-IF(SSize9>=2,5,3)<0,0,JMFDes9-IF(SSize9>=2,5,3))))","v":""}]
[null,"TYPE B","1\"","25 mm",25,98,100,12,null,{"$f":"sieve10","v":""},{"$f":"ssize10","v":""},"",0,{"$f":"'Tex-229-F'!M60","v":""},{"$f":"IF(JMFDes10=\"\",\"\",IF(ssize10=0.075,INDEX(INDIRECT(Grade),10,6),IF(JMFDes10+IF(ssize10>=2,5,3)>100,100,JMFDes10+IF(ssize10>=2,5,3))))","v":""},{"$f":"IF(JMFDes10=\"\",\"\",IF(ssize10=0.075,INDEX(INDIRECT(Grade),10,5),IF(JMFDes10-IF(ssize10>=2,5,3)<0,0,JMFDes10-IF(ssize10>=2,5,3))))","v":""}]
[null,null,"7/8\"","22.4 mm",22.4,95,100,null,null,null,null,0,0]
[null,null,"5/8\"","16 mm",16,75,95]
[null,null,"3/8\"","9.5 mm",9.5,60,80]
[null,null,"No. 4","4.75 mm",4.75,40,60]
[null,null,"No. 10","2 mm",2,27,40]
[null,null,"No. 40","425 µm",0.42499999999999999,10,25]
[null,null,"No. 80","180 µm",0.18,3,13]
[null,null,"No. 200","75 µm",7.4999999999999997E-2,1,6]
[null,"TYPE C","7/8\"","22.4 mm",22.4,98,100,13]
[null,null,"5/8\"","16 mm",16,95,100]
[null,null,"3/8\"","9.5 mm",9.5,70,85]
[null,null,"No. 4","4.75 mm",4.75,43,63]
[null,null,"No. 10","2 mm",2,30,40]
[null,null,"No. 40","425 µm",0.42499999999999999,10,25]
[null,null,"No. 80","180 µm",0.18,3,13]
[null,null,"No. 200","75 µm",7.4999999999999997E-2,1,6]
[null,"TYPE D","1/2\"","12.5 mm",12.5,98,100,14]
[null,null,"3/8\"","9.5 mm",9.5,85,100]
[null,null,"No. 4","4.75 mm",4.75,50,70]
[null,null,"No. 10","2 mm",2,32,42]
[null,null,"No. 40","425 µm",0.42499999999999999,11,26]
[null,null,"No. 80","180 µm",0.18,4,14]
[null,null,"No. 200","75 µm",7.4999999999999997E-2,1,6]
[null,"TYPE F","3/8\"","9.5 mm",9.5,98,100,15]
[null,null,"1/4\"","6.3 mm",6.3,95,100]
[null,null,"No. 10","2 mm",2,32,42]
[null,null,"No. 40","425 µm",0.42499999999999999,9,24]
[null,null,"No. 80","180 µm",0.18,3,13]
[null,null,"No. 200","75 µm",7.4999999999999997E-2,1,6]
[null,"TYPE CMHB-C","7/8\"","22.4 mm",22.4,98,100,13]
[null,null,"5/8\"","16 mm",16,98,100]
[null,null,"3/8\"","9.5 mm",9.5,50,70]
[null,null,"No. 4","4.75 mm",4.75,30,45]
[null,null,"No. 10","2 mm",2,15,25]
[null,null,"No. 40","425 µm",0.42499999999999999,6,20]
[null,null,"No. 80","180 µm",0.18,6,18]
[null,null,"No. 200","75 µm",7.4999999999999997E-2,5,8]
[null,"TYPE CMHB-F","1/2\"","12.5 mm",12.5,98,100,14]
[null,null,"3/8\"","9.5 mm",9.5,85,100]
[null,null,"No. 4","4.75 mm",4.75,40,60]
[null,null,"No. 10","2 mm",2,15,25]
[null,null,"No. 40","425 µm",0.42499999999999999,6,20]
[null,null,"No. 80","180 µm",0.18,6,18]
[null,null,"No. 200","75 µm",7.4999999999999997E-2,5,8]
[null,"A","1-1/2\"",null,37.5,98,100,12]
[null,null,"1\"",null,25,78,94]
[null,null,"3/4\"",null,19,64,85]
[null,null,"1/2\"",null,12.5,50,70]
[null,null,"No. 4",null,4.75,30,50]
[null,null,"No. 8",null,2.36,22,36]
[null,null,"No. 30",null,0.6,8,23]
[null,null,"No. 50",null,0.3,3,19]
[null,null,"No. 200",null,7.4999999999999997E-2,2,7]
[null,"B","1\"",null,25,98,100,13]
[null,null,"3/4\"",null,19,84,98]
[null,null,"3/8\"",null,9.5,60,80]
[null,null,"No. 4",null,4.75,40,60]
[null,null,"No. 8",null,2.36,29,43]
[null,null,"No. 30",null,0.6,13,28]
[null,null,"No. 50",null,0.3,6,20]
[null,null,"No. 200",null,7.4999999999999997E-2,2,7]
[null,"C","3/4\"",null,19,95,100,14]
[null,null,"3/8\"",null,9.5,70,85]
[null,null,"No. 4",null,4.75,43,63]
[null,null,"No. 8",null,2.36,32,44]
[null,null,"No. 30",null,0.6,14,28]
[null,null,"No. 50",null,0.3,7,21]
[null,null,"No. 200",null,7.4999999999999997E-2,2,7]
[null,"D","1/2\"",null,12.5,98,100,15]
[null,null,"3/8\"",null,9.5,85,100]
[null,null,"No. 4",null,4.75,50,70]
[null,null,"No. 8",null,2.36,35,46]
[null,null,"No. 30",null,0.6,15,29]
[null,null,"No. 50",null,0.3,7,20]
[null,null,"No. 200",null,7.4999999999999997E-2,2,7]
[null,"F","3/8\"",null,9.5,98,100,16]
[null,null,"No. 4",null,4.75,80,86]
[null,null,"No. 8",null,2.36,38,48]
[null,null,"No. 30",null,0.6,12,27]
[null,null,"No. 50",null,0.3,6,19]
[null,null,"No. 200",null,7.4999999999999997E-2,2,7]
[null,"SP-A","2\"",null,50,100,100,13]
[null,null,"1-1/2\"",null,37.5,98,100]
[null,null,"1\"",null,25,90,100]
[null,null,"3/4\"",null,19,"Note 1"]
[null,null,"No. 8",null,2.36,19,45]
[null,null,"No. 16",null,1.18,1,45]
[null,null,"No. 30",null,0.6,1,45]
[null,null,"No. 50",null,0.3,1,45]
[null,null,"No. 200",null,7.4999999999999997E-2,1,7]
[null,"SP-B","1-1/2\"",null,37.5,100,100,14]
[null,null,"1\"",null,25,98,100]
[null,null,"3/4\"",null,19,90,100]
[null,null,"1/2\"",null,12.5,"Note 1"]
[null,null,"No. 8",null,2.36,23,49]
[null,null,"No. 16",null,1.18,2,49]
[null,null,"No. 30",null,0.6,2,49]
[null,null,"No. 50",null,0.3,2,49]
[null,null,"No. 200",null,7.4999999999999997E-2,2,8]
[null,"SP-C","1\"",null,25,100,100,15]
[null,null,"3/4\"",null,19,98,100]
[null,null,"1/2\"",null,12.5,90,100]
[null,null,"3/8\"",null,9.5,"Note 1"]
[null,null,"No. 8",null,2.36,28,58]
[null,null,"No. 16",null,1.18,2,58]
[null,null,"No. 30",null,0.6,2,58]
[null,null,"No. 50",null,0.3,2,58]
[null,null,"No. 200",null,7.4999999999999997E-2,2,10]
[null,"SP-D","3/4\"",null,19,100,100,16]
[null,null,"1/2\"",null,12.5,98,100]
[null,null,"3/8\"",null,9.5,90,100]
[null,null,"No. 4",null,4.75,"Note 1"]
[null,null,"No. 8",null,2.36,32,67]
[null,null,"No. 16",null,1.18,2,67]
[null,null,"No. 30",null,0.6,2,67]
[null,null,"No. 50",null,0.3,2,67]
[null,null,"No. 200",null,7.4999999999999997E-2,2,10]
[null,"CMHB-C","1\"",null,25,100,100,14]
[null,null,"3/4\"",null,19,98,100]
[null,null,"1/2\"",null,12.5,72,85]
[null,null,"3/8\"",null,9.5,50,70]
[null,null,"No. 4",null,4.75,30,45]
[null,null,"No. 8",null,2.36,17,27]
[null,null,"No. 16",null,1.18,5,27]
[null,null,"No. 30",null,0.6,5,27]
[null,null,"No. 50",null,0.3,5,27]
[null,null,"No. 200",null,7.4999999999999997E-2,5,9]
[null,"CMHB-F","3/4\"",null,19,100,100,15]
[null,null,"1/2\"",null,12.5,98,100]
[null,null,"3/8\"",null,9.5,85,100]
[null,null,"No. 4",null,4.75,40,60]
[null,null,"No. 8",null,2.36,17,27]
[null,null,"No. 16",null,1.18,5,27]
[null,null,"No. 30",null,0.6,5,27]
[null,null,"No. 50",null,0.3,5,27]
[null,null,"No. 200",null,7.4999999999999997E-2,5,9]
[null,"SMA-C","3/4\"",null,19,100,100,17.5]
[null,null,"1/2\"",null,12.5,80,90]
[null,null,"3/8\"",null,9.5,25,60]
[null,null,"No. 4",null,4.75,20,28]
[null,null,"No. 8",null,2.36,14,20]
[null,null,"No. 16",null,1.18,8,20]
[null,null,"No. 30",null,0.6,8,20]
[null,null,"No. 50",null,0.3,8,20]
[null,null,"No. 200",null,7.4999999999999997E-2,8,12]
[null,"SMA-D","3/4\"",null,19,100,100,17.5]
[null,null,"1/2\"",null,12.5,85,99]
[null,null,"3/8\"",null,9.5,50,75]
[null,null,"No. 4",null,4.75,20,32]
[null,null,"No. 8",null,2.36,16,28]
[null,null,"No. 16",null,1.18,8,28]
[null,null,"No. 30",null,0.6,8,28]
[null,null,"No. 50",null,0.3,8,28]
[null,null,"No. 200",null,7.4999999999999997E-2,8,12]
[null,"SMA-F","3/4\"",null,19,100,100,17.5]
[null,null,"1/2\"",null,12.5,100,100]
[null,null,"3/8\"",null,9.5,70,90]
[null,null,"No. 4",null,4.75,30,50]
[null,null,"No. 8",null,2.36,20,30]
[null,null,"No. 16",null,1.18,8,30]
[null,null,"No. 30",null,0.6,8,30]
[null,null,"No. 50",null,0.3,8,30]
[null,null,"No. 200",null,7.4999999999999997E-2,8,14]
[null,"SMAR-C","3/4\"",null,19,100,100,19]
[null,null,"1/2\"",null,12.5,72,85]
[null,null,"3/8\"",null,9.5,50,70]
[null,null,"No. 4",null,4.75,30,45]
[null,null,"No. 8",null,2.36,17,27]
[null,null,"No. 16",null,1.18,12,22]
[null,null,"No. 30",null,0.6,8,20]
[null,null,"No. 50",null,0.3,6,15]
[null,null,"No. 200",null,7.4999999999999997E-2,5,9]
[null,"SMAR-F","3/4\"",null,19,100,100,19]
[null,null,"1/2\"",null,12.5,100,100]
[null,null,"3/8\"",null,9.5,95,100]
[null,null,"No. 4",null,4.75,40,50]
[null,null,"No. 8",null,2.36,17,27]
[null,null,"No. 16",null,1.18,12,22]
[null,null,"No. 30",null,0.6,8,20]
[null,null,"No. 50",null,0.3,6,15]
[null,null,"No. 200",null,7.4999999999999997E-2,5,9]
[null,"SMA_.5_inch_Spec_3248","3/4\"","19 mm",19,100,100,17]
[null,null,"1/2\"","12.5 mm",12.5,90,99]
[null,null,"3/8\"","9.5 mm",9.5,70,85]
[null,null,"No. 4","4.75 mm",4.75,30,42]
[null,null,"No. 8","2.36 mm",2.36,20,33]
[null,null,"No. 200","75 µm",7.4999999999999997E-2,8,11]
[null,"SP_HMACP_.5","3/4\"","19 mm",19,100,100,14.5]
[null,null,"1/2\"","12.5 mm",12.5,90,100]
[null,null,"3/8\"","9.5 mm",9.5,58,90]
[null,null,"No. 8","2.36 mm",2.36,28,58]
[null,null,"No. 16","1.18 mm",1.18]
[null,null,"No. 30","600 µm",0.6]
[null,null,"No. 50","300 µm",0.3]
[null,null,"No. 200","75 µm",7.4999999999999997E-2,2,10]

{"sheet":"spcyr","index":4,"n_rows":17,"n_cols":3,"rows_kept":17,"cut":false,"hidden":true,"merged":[]}
["spec1993","spec1995","spec2004"]
["Type_A","Type_A","Type_A"]
["Type_B","Type_B","Type_B"]
["Type_C","Type_C","Type_C"]
["Type_D","Type_D","Type_D"]
["Type_F","Type_F","Type_F"]
["Type_CMHB_C","Type_CMHB_C","Type_SP_A"]
["Type_CMHB_F","Type_CMHB_F","Type_SP_B"]
["SMA_.5_inch_Spec_3248","SMA_.5_inch_Spec_3248","Type_SP_C"]
["SP_HMACP_.5","SP_HMACP_.5","Type_SP_D"]
[null,null,"Type_CMHB_C"]
[null,null,"Type_CMHB_F"]
[null,null,"Type_SMA_C"]
[null,null,"Type_SMA_D"]
[null,null,"Type_SMA_F"]
[null,null,"Type_SMAR_C"]
[null,null,"Type_SMAR_F"]