{"text_format":"1","workbook":"xlsx","n_sheets":4,"sheets":["MgEst","RX","Revisions","Sheet1"],"not_rendered":{"charts":0,"images":1,"macros":1,"external_links":0,"defined_names":184,"comments":1,"pivot_tables":0},"unopened":[],"bounds":{"document_bytes":16777216,"sheet_cells":100000,"rows_first":2000,"rows_last":500,"rows_between":2000,"halvings":0,"cell_chars":16384,"cell_head_chars":4096},"cells_cut":0,"cells_raw":0,"read":"whole","date_system":"1900"}

{"sheet":"MgEst","index":0,"n_rows":55,"n_cols":12,"rows_kept":55,"cut":false,"hidden":false,"merged":[[7,10,7,11],[21,3,21,9],[36,1,36,2],[0,0,0,1],[12,7,12,8],[11,3,11,4],[12,3,12,4],[7,7,7,8],[10,7,10,8],[7,3,7,4],[8,3,8,4],[8,7,8,8],[10,3,10,4],[9,7,9,8],[23,1,23,2],[24,1,24,2],[55,1,55,3],[51,6,51,8],[43,1,44,8],[49,2,49,4],[51,1,51,3],[48,2,48,4],[46,2,46,4],[47,2,47,4],[25,1,25,2],[26,1,26,2],[9,3,9,4],[14,3,14,8],[19,3,19,4],[11,7,11,8],[13,3,13,4],[15,3,15,8],[13,7,13,8],[16,7,16,8],[16,3,16,4],[33,10,33,11],[27,1,27,2],[38,1,38,2],[28,1,28,2],[29,3,29,9],[30,1,30,2],[31,1,31,2],[32,1,32,2],[33,1,33,2],[34,1,34,2],[35,1,35,2]]}
["TxDOT Manuals >",null,null,"Tex-461-A"]
[null,"TEXAS DEPARTMENT OF TRANSPORTATION",null,null,null,null,null,null,null,null,87]
[null,null,null,null,null,null,null,null,null,null,1]
[null,null,null,null,null,null,null,null,null,null,"tx2mgest.xlsm::45574.599745"]
[null,"ESTIMATED MAGNESIUM SULFATE SOUNDNESS LOSS"]
[null,"MgEst"]
[null,null,null,null,null,null,null,null,{"$f":"\"File Version: \" & TEXT(MID(sn,SEARCH(\"::\",sn,1)+2,20),\"mm/dd/yy hh:mm:ss\")","v":"File Version: 10/09/24 14:23:38"}]
[null,null,"SAMPLE ID:",null,null,null,"SAMPLED DATE:"]
[null,null,"TEST NUMBER:",null,null,null,"LETTING DATE:"]
[null,null,"SAMPLE STATUS:",null,null,null,"CONTROLLING CSJ:"]
[null,null,"COUNTY:",null,null,null,"SPEC YEAR:"]
[null,null,"SAMPLED BY:",null,null,null,"SPEC ITEM:"]
[null,null,"SAMPLE LOCATION:",null,null,null,"SPECIAL PROVISION:"]
[null,null,"MATERIAL CODE:",null,null,null,"MIX TYPE:"]
[null,null,"MATERIAL NAME:"]
[null,null,"PRODUCER:"]
[null,null,"AREA ENGINEER:",null,null,null,"PROJECT MANAGER:"]
[null,null,null,null,null,null,null,null,null,null,null," "]
[null,null,"COURSE\\LIFT:",null,"STATION:",null,null,"DIST. FROM CL:"]
[null,null,"CONTRACTOR DESIGN #:"]
[]
[null,null,null,"COARSE AGGREGATE SOURCES"]
[null,null,null,"Bin No.1 ","Bin No.2","Bin No.3","Bin No.4","Bin No.5","Bin No.6","Bin No.7"]
[null,"Aggregate Type:"]
[null,"Aggregate Pit:"]
[null,"Aggregate Number:"]
[null,"Sample ID:"]
[null,"RSSM lost value listed in the BRSQC:"]
[null,"RSMD value listed in the BRSQC:"]
[null,null,null,"MICRO-DEVAL ABRASION (Tex-461-F)"]
[null,"Machine No."]
[null,"Tier No."]
[null,"Total No. of  Revolutions:"]
[null,"Average RPM:",null,{"$f":"IF(D33=\"\",\"\",D33/105)","v":""},"","","",{"$f":"IF(H33=\"\",\"\",H33/105)","v":""},"","","<<100 ± 5 Required"]
[null,"Initial Weight:"]
[null,"Final Weight:"]
[null,"Percent Loss (%):",null,{"$f":"IF(ISERROR((1-(D36/D35))*100),\"\",(1-(D36/D35))*100)","v":""},"","","","","",""]
[]
[null,"Magnesium Sulfate Soundness Loss (Mgest.):",null,{"$f":"IF(ISERROR(D28*D37/D29),\"\",D28*D37/D29)","v":""},{"$f":"IF(ISERROR(E28*E37/E29),\"\",E28*E37/E29)","v":""},"","","","","",{"$f":"IF(Grade=\"\",\"\",IF(OR(AND($D$39<>\"\",D$39>VLOOKUP(Grade,Requirement,2)),AND($E$39<>\"\",E$39>VLOOKUP(Grade,Requirement,2)),AND($F$39<>\"\",F$39>VLOOKUP(Grade,Requirement,2)),AND($G$39<>\"\",G$39>VLOOKUP(Grade,Requirement,2)),AND($H$39<>\"\",H$39>VLOOKUP(Grade,Requirement,2)),AND($I$39<>\"\",I$39>VLOOKUP(Grade,Requirement,2)),AND($J$39<>\"\",J$39>VLOOKUP(Grade,Requirement,2))),\"<<Exceeds maximum requirement\",\"\"))","v":""}]
[]
[]
[]
[null,"Remarks:",{"$f":"NOW()","v":"2024-10-09T14:23:38.260"}]
[]
[]
[]
[null,"Sample Method:","Sampled By:",null,null,"Sampled Date:"]
[null,"TX400"]
[null,"Test Method:","Tested By:",null,null,"Tested Date:"]
[null,"TX461"]
[null,"Test Stamp Code:",null,null,"Omit Test:","Completed Date:","Reviewed By:"]
[]
[null,"Locked By:","TxDOT:","District:","Area:"]
[]
[null,"Authorized By:",null,null,"Authorized Date:"]

{"sheet":"RX","index":1,"n_rows":107,"n_cols":9,"rows_kept":107,"cut":false,"hidden":true,"merged":[]}
[105]
["Fld_nbr","Value","Desc_1","Desc_2","Desc_3","Desc_4","Desc_5","Desc_6","Desc_7"]
[1,{"$f":"IF(MgEst!$B$44=\"\",\"\",MgEst!$B$44)","v":""},{"$f":"IF(MgEst!$B$43=\"\",\"\",MgEst!$B$43)","v":"Remarks:"}]
[2,{"$f":"IF(MgEst!$D$19=\"\",\"\",MgEst!$D$19)","v":""},{"$f":"IF(MgEst!$C$19=\"\",\"\",MgEst!$C$19)","v":"COURSE\\LIFT:"}]
[3,{"$f":"IF(MgEst!$C$50=\"\",\"\",MgEst!$C$50)","v":""},"Tested By:",{"$f":"IF(MgEst!$B$50=\"\",\"\",MgEst!$B$50)","v":"TX461"}]
[4,{"$f":"IF(MgEst!$F$50=\"\",\"\",MgEst!$F$50)","v":""},"Tested Date:",{"$f":"IF(MgEst!$B$50=\"\",\"\",MgEst!$B$50)","v":"TX461"}]
[5,{"$f":"IF(MgEst!$D$20=\"\",\"\",MgEst!$D$20)","v":""},{"$f":"IF(MgEst!C20=\"\",\"\",MgEst!C20)","v":"CONTRACTOR DESIGN #:"}]
[6,{"$f":"IF(MgEst!$D$24=\"\",\"\",MgEst!$D$24)","v":""},{"$f":"IF(MgEst!B$6=\"\",\"\",MgEst!B$6)","v":"MgEst"},{"$f":"IF(MgEst!B$24=\"\",\"\",MgEst!B$24)","v":"Aggregate Type:"},{"$f":"IF(MgEst!$D$23=\"\",\"\",MgEst!$D$23)","v":"Bin No.1 "}]
[7,{"$f":"IF(MgEst!$E$24=\"\",\"\",MgEst!$E$24)","v":""},{"$f":"IF(MgEst!B$6=\"\",\"\",MgEst!B$6)","v":"MgEst"},{"$f":"IF(MgEst!B$24=\"\",\"\",MgEst!B$24)","v":"Aggregate Type:"},{"$f":"IF(MgEst!$E$23=\"\",\"\",MgEst!$E$23)","v":"Bin No.2"}]
[8,{"$f":"IF(MgEst!$F$24=\"\",\"\",MgEst!$F$24)","v":""},{"$f":"IF(MgEst!B$6=\"\",\"\",MgEst!B$6)","v":"MgEst"},{"$f":"IF(MgEst!B$24=\"\",\"\",MgEst!B$24)","v":"Aggregate Type:"},{"$f":"IF(MgEst!$F$23=\"\",\"\",MgEst!$F$23)","v":"Bin No.3"}]
[9,{"$f":"IF(MgEst!$G$24=\"\",\"\",MgEst!$G$24)","v":""},{"$f":"IF(MgEst!B$6=\"\",\"\",MgEst!B$6)","v":"MgEst"},{"$f":"IF(MgEst!B$24=\"\",\"\",MgEst!B$24)","v":"Aggregate Type:"},{"$f":"IF(MgEst!$G$23=\"\",\"\",MgEst!$G$23)","v":"Bin No.4"}]
[10,{"$f":"IF(MgEst!$H$24=\"\",\"\",MgEst!$H$24)","v":""},{"$f":"IF(MgEst!B$6=\"\",\"\",MgEst!B$6)","v":"MgEst"},{"$f":"IF(MgEst!B$24=\"\",\"\",MgEst!B$24)","v":"Aggregate Type:"},{"$f":"IF(MgEst!$H$23=\"\",\"\",MgEst!$H$23)","v":"Bin No.5"}]
[11,{"$f":"IF(MgEst!$I$24=\"\",\"\",MgEst!$I$24)","v":""},{"$f":"IF(MgEst!B$6=\"\",\"\",MgEst!B$6)","v":"MgEst"},{"$f":"IF(MgEst!B$24=\"\",\"\",MgEst!B$24)","v":"Aggregate Type:"},{"$f":"IF(MgEst!$I$23=\"\",\"\",MgEst!$I$23)","v":"Bin No.6"}]
[12,{"$f":"IF(MgEst!$J$24=\"\",\"\",MgEst!$J$24)","v":""},{"$f":"IF(MgEst!B$6=\"\",\"\",MgEst!B$6)","v":"MgEst"},{"$f":"IF(MgEst!B$24=\"\",\"\",MgEst!B$24)","v":"Aggregate Type:"},{"$f":"IF(MgEst!$J$23=\"\",\"\",MgEst!$J$23)","v":"Bin No.7"}]
[13,{"$f":"IF(MgEst!$D$25=\"\",\"\",MgEst!$D$25)","v":""},{"$f":"IF(MgEst!B$6=\"\",\"\",MgEst!B$6)","v":"MgEst"},{"$f":"IF(MgEst!B$25=\"\",\"\",MgEst!B$25)","v":"Aggregate Pit:"},{"$f":"IF(MgEst!$D$23=\"\",\"\",MgEst!$D$23)","v":"Bin No.1 "}]
[14,{"$f":"IF(MgEst!$E$25=\"\",\"\",MgEst!$E$25)","v":""},{"$f":"IF(MgEst!B$6=\"\",\"\",MgEst!B$6)","v":"MgEst"},{"$f":"IF(MgEst!B$25=\"\",\"\",MgEst!B$25)","v":"Aggregate Pit:"},{"$f":"IF(MgEst!$E$23=\"\",\"\",MgEst!$E$23)","v":"Bin No.2"}]
[15,{"$f":"IF(MgEst!$F$25=\"\",\"\",MgEst!$F$25)","v":""},{"$f":"IF(MgEst!B$6=\"\",\"\",MgEst!B$6)","v":"MgEst"},{"$f":"IF(MgEst!B$25=\"\",\"\",MgEst!B$25)","v":"Aggregate Pit:"},{"$f":"IF(MgEst!$F$23=\"\",\"\",MgEst!$F$23)","v":"Bin No.3"}]
[16,{"$f":"IF(MgEst!$G$25=\"\",\"\",MgEst!$G$25)","v":""},{"$f":"IF(MgEst!B$6=\"\",\"\",MgEst!B$6)","v":"MgEst"},{"$f":"IF(MgEst!B$25=\"\",\"\",MgEst!B$25)","v":"Aggregate Pit:"},{"$f":"IF(MgEst!$G$23=\"\",\"\",MgEst!$G$23)","v":"Bin No.4"}]
[17,{"$f":"IF(MgEst!$H$25=\"\",\"\",MgEst!$H$25)","v":""},{"$f":"IF(MgEst!B$6=\"\",\"\",MgEst!B$6)","v":"MgEst"},{"$f":"IF(MgEst!B$25=\"\",\"\",MgEst!B$25)","v":"Aggregate Pit:"},{"$f":"IF(MgEst!$H$23=\"\",\"\",MgEst!$H$23)","v":"Bin No.5"}]
[18,{"$f":"IF(MgEst!$I$25=\"\",\"\",MgEst!$I$25)","v":""},{"$f":"IF(MgEst!B$6=\"\",\"\",MgEst!B$6)","v":"MgEst"},{"$f":"IF(MgEst!B$25=\"\",\"\",MgEst!B$25)","v":"Aggregate Pit:"},{"$f":"IF(MgEst!$I$23=\"\",\"\",MgEst!$I$23)","v":"Bin No.6"}]
[19,{"$f":"IF(MgEst!$J$25=\"\",\"\",MgEst!$J$25)","v":""},{"$f":"IF(MgEst!B$6=\"\",\"\",MgEst!B$6)","v":"MgEst"},{"$f":"IF(MgEst!B$25=\"\",\"\",MgEst!B$25)","v":"Aggregate Pit:"},{"$f":"IF(MgEst!$J$23=\"\",\"\",MgEst!$J$23)","v":"Bin No.7"}]
[20,{"$f":"IF(MgEst!$D$26=\"\",\"\",MgEst!$D$26)","v":""},{"$f":"IF(MgEst!B$6=\"\",\"\",MgEst!B$6)","v":"MgEst"},{"$f":"IF(MgEst!B$26=\"\",\"\",MgEst!B$26)","v":"Aggregate Number:"},{"$f":"IF(MgEst!$D$23=\"\",\"\",MgEst!$D$23)","v":"Bin No.1 "}]
[21,{"$f":"IF(MgEst!$E$26=\"\",\"\",MgEst!$E$26)","v":""},{"$f":"IF(MgEst!B$6=\"\",\"\",MgEst!B$6)","v":"MgEst"},{"$f":"IF(MgEst!B$26=\"\",\"\",MgEst!B$26)","v":"Aggregate Number:"},{"$f":"IF(MgEst!$E$23=\"\",\"\",MgEst!$E$23)","v":"Bin No.2"}]
[22,{"$f":"IF(MgEst!$F$26=\"\",\"\",MgEst!$F$26)","v":""},{"$f":"IF(MgEst!B$6=\"\",\"\",MgEst!B$6)","v":"MgEst"},{"$f":"IF(MgEst!B$26=\"\",\"\",MgEst!B$26)","v":"Aggregate Number:"},{"$f":"IF(MgEst!$F$23=\"\",\"\",MgEst!$F$23)","v":"Bin No.3"}]
[23,{"$f":"IF(MgEst!$G$26=\"\",\"\",MgEst!$G$26)","v":""},{"$f":"IF(MgEst!B$6=\"\",\"\",MgEst!B$6)","v":"MgEst"},{"$f":"IF(MgEst!B$26=\"\",\"\",MgEst!B$26)","v":"Aggregate Number:"},{"$f":"IF(MgEst!$G$23=\"\",\"\",MgEst!$G$23)","v":"Bin No.4"}]
[24,{"$f":"IF(MgEst!$H$26=\"\",\"\",MgEst!$H$26)","v":""},{"$f":"IF(MgEst!B$6=\"\",\"\",MgEst!B$6)","v":"MgEst"},{"$f":"IF(MgEst!B$26=\"\",\"\",MgEst!B$26)","v":"Aggregate Number:"},{"$f":"IF(MgEst!$H$23=\"\",\"\",MgEst!$H$23)","v":"Bin No.5"}]
[25,{"$f":"IF(MgEst!$I$26=\"\",\"\",MgEst!$I$26)","v":""},{"$f":"IF(MgEst!B$6=\"\",\"\",MgEst!B$6)","v":"MgEst"},{"$f":"IF(MgEst!B$26=\"\",\"\",MgEst!B$26)","v":"Aggregate Number:"},{"$f":"IF(MgEst!$I$23=\"\",\"\",MgEst!$I$23)","v":"Bin No.6"}]
[26,{"$f":"IF(MgEst!$J$26=\"\",\"\",MgEst!$J$26)","v":""},{"$f":"IF(MgEst!B$6=\"\",\"\",MgEst!B$6)","v":"MgEst"},{"$f":"IF(MgEst!B$26=\"\",\"\",MgEst!B$26)","v":"Aggregate Number:"},{"$f":"IF(MgEst!$J$23=\"\",\"\",MgEst!$J$23)","v":"Bin No.7"}]
[27,{"$f":"IF(MgEst!$D$27=\"\",\"\",MgEst!$D$27)","v":""},{"$f":"IF(MgEst!B$6=\"\",\"\",MgEst!B$6)","v":"MgEst"},{"$f":"IF(MgEst!B$27=\"\",\"\",MgEst!B$27)","v":"Sample ID:"},{"$f":"IF(MgEst!$D$23=\"\",\"\",MgEst!$D$23)","v":"Bin No.1 "}]
[28,{"$f":"IF(MgEst!$E$27=\"\",\"\",MgEst!$E$27)","v":""},{"$f":"IF(MgEst!B$6=\"\",\"\",MgEst!B$6)","v":"MgEst"},{"$f":"IF(MgEst!B$27=\"\",\"\",MgEst!B$27)","v":"Sample ID:"},{"$f":"IF(MgEst!$E$23=\"\",\"\",MgEst!$E$23)","v":"Bin No.2"}]
[29,{"$f":"IF(MgEst!$F$27=\"\",\"\",MgEst!$F$27)","v":""},{"$f":"IF(MgEst!B$6=\"\",\"\",MgEst!B$6)","v":"MgEst"},{"$f":"IF(MgEst!B$27=\"\",\"\",MgEst!B$27)","v":"Sample ID:"},{"$f":"IF(MgEst!$F$23=\"\",\"\",MgEst!$F$23)","v":"Bin No.3"}]
[30,{"$f":"IF(MgEst!$G$27=\"\",\"\",MgEst!$G$27)","v":""},{"$f":"IF(MgEst!B$6=\"\",\"\",MgEst!B$6)","v":"MgEst"},{"$f":"IF(MgEst!B$27=\"\",\"\",MgEst!B$27)","v":"Sample ID:"},{"$f":"IF(MgEst!$G$23=\"\",\"\",MgEst!$G$23)","v":"Bin No.4"}]
[31,{"$f":"IF(MgEst!$H$27=\"\",\"\",MgEst!$H$27)","v":""},{"$f":"IF(MgEst!B$6=\"\",\"\",MgEst!B$6)","v":"MgEst"},{"$f":"IF(MgEst!B$27=\"\",\"\",MgEst!B$27)","v":"Sample ID:"},{"$f":"IF(MgEst!$H$23=\"\",\"\",MgEst!$H$23)","v":"Bin No.5"}]
[32,{"$f":"IF(MgEst!$I$27=\"\",\"\",MgEst!$I$27)","v":""},{"$f":"IF(MgEst!B$6=\"\",\"\",MgEst!B$6)","v":"MgEst"},{"$f":"IF(MgEst!B$27=\"\",\"\",MgEst!B$27)","v":"Sample ID:"},{"$f":"IF(MgEst!$I$23=\"\",\"\",MgEst!$I$23)","v":"Bin No.6"}]
[33,{"$f":"IF(MgEst!$J$27=\"\",\"\",MgEst!$J$27)","v":""},{"$f":"IF(MgEst!B$6=\"\",\"\",MgEst!B$6)","v":"MgEst"},{"$f":"IF(MgEst!B$27=\"\",\"\",MgEst!B$27)","v":"Sample ID:"},{"$f":"IF(MgEst!$J$23=\"\",\"\",MgEst!$J$23)","v":"Bin No.7"}]
[34,{"$f":"IF(MgEst!$D$28=\"\",\"\",MgEst!$D$28)","v":""},{"$f":"IF(MgEst!B$6=\"\",\"\",MgEst!B$6)","v":"MgEst"},{"$f":"IF(MgEst!B$28=\"\",\"\",MgEst!B$28)","v":"RSSM lost value listed in the BRSQC:"},{"$f":"IF(MgEst!$D$23=\"\",\"\",MgEst!$D$23)","v":"Bin No.1 "}]
[35,{"$f":"IF(MgEst!$E$28=\"\",\"\",MgEst!$E$28)","v":""},{"$f":"IF(MgEst!B$6=\"\",\"\",MgEst!B$6)","v":"MgEst"},{"$f":"IF(MgEst!B$28=\"\",\"\",MgEst!B$28)","v":"RSSM lost value listed in the BRSQC:"},{"$f":"IF(MgEst!$E$23=\"\",\"\",MgEst!$E$23)","v":"Bin No.2"}]
[36,{"$f":"IF(MgEst!$F$28=\"\",\"\",MgEst!$F$28)","v":""},{"$f":"IF(MgEst!B$6=\"\",\"\",MgEst!B$6)","v":"MgEst"},{"$f":"IF(MgEst!B$28=\"\",\"\",MgEst!B$28)","v":"RSSM lost value listed in the BRSQC:"},{"$f":"IF(MgEst!$F$23=\"\",\"\",MgEst!$F$23)","v":"Bin No.3"}]
[37,{"$f":"IF(MgEst!$G$28=\"\",\"\",MgEst!$G$28)","v":""},{"$f":"IF(MgEst!B$6=\"\",\"\",MgEst!B$6)","v":"MgEst"},{"$f":"IF(MgEst!B$28=\"\",\"\",MgEst!B$28)","v":"RSSM lost value listed in the BRSQC:"},{"$f":"IF(MgEst!$G$23=\"\",\"\",MgEst!$G$23)","v":"Bin No.4"}]
[38,{"$f":"IF(MgEst!$H$28=\"\",\"\",MgEst!$H$28)","v":""},{"$f":"IF(MgEst!B$6=\"\",\"\",MgEst!B$6)","v":"MgEst"},{"$f":"IF(MgEst!B$28=\"\",\"\",MgEst!B$28)","v":"RSSM lost value listed in the BRSQC:"},{"$f":"IF(MgEst!$H$23=\"\",\"\",MgEst!$H$23)","v":"Bin No.5"}]
[39,{"$f":"IF(MgEst!$I$28=\"\",\"\",MgEst!$I$28)","v":""},{"$f":"IF(MgEst!B$6=\"\",\"\",MgEst!B$6)","v":"MgEst"},{"$f":"IF(MgEst!B$28=\"\",\"\",MgEst!B$28)","v":"RSSM lost value listed in the BRSQC:"},{"$f":"IF(MgEst!$I$23=\"\",\"\",MgEst!$I$23)","v":"Bin No.6"}]
[40,{"$f":"IF(MgEst!$J$28=\"\",\"\",MgEst!$J$28)","v":""},{"$f":"IF(MgEst!B$6=\"\",\"\",MgEst!B$6)","v":"MgEst"},{"$f":"IF(MgEst!B$28=\"\",\"\",MgEst!B$28)","v":"RSSM lost value listed in the BRSQC:"},{"$f":"IF(MgEst!$J$23=\"\",\"\",MgEst!$J$23)","v":"Bin No.7"}]
[41,{"$f":"IF(MgEst!$D$29=\"\",\"\",MgEst!$D$29)","v":""},{"$f":"IF(MgEst!B$6=\"\",\"\",MgEst!B$6)","v":"MgEst"},{"$f":"IF(MgEst!B$29=\"\",\"\",MgEst!B$29)","v":"RSMD value listed in the BRSQC:"},{"$f":"IF(MgEst!$D$23=\"\",\"\",MgEst!$D$23)","v":"Bin No.1 "}]
[42,{"$f":"IF(MgEst!$E$29=\"\",\"\",MgEst!$E$29)","v":""},{"$f":"IF(MgEst!B$6=\"\",\"\",MgEst!B$6)","v":"MgEst"},{"$f":"IF(MgEst!B$29=\"\",\"\",MgEst!B$29)","v":"RSMD value listed in the BRSQC:"},{"$f":"IF(MgEst!$E$23=\"\",\"\",MgEst!$E$23)","v":"Bin No.2"}]
[43,{"$f":"IF(MgEst!$F$29=\"\",\"\",MgEst!$F$29)","v":""},{"$f":"IF(MgEst!B$6=\"\",\"\",MgEst!B$6)","v":"MgEst"},{"$f":"IF(MgEst!B$29=\"\",\"\",MgEst!B$29)","v":"RSMD value listed in the BRSQC:"},{"$f":"IF(MgEst!$F$23=\"\",\"\",MgEst!$F$23)","v":"Bin No.3"}]
[44,{"$f":"IF(MgEst!$G$29=\"\",\"\",MgEst!$G$29)","v":""},{"$f":"IF(MgEst!B$6=\"\",\"\",MgEst!B$6)","v":"MgEst"},{"$f":"IF(MgEst!B$29=\"\",\"\",MgEst!B$29)","v":"RSMD value listed in the BRSQC:"},{"$f":"IF(MgEst!$G$23=\"\",\"\",MgEst!$G$23)","v":"Bin No.4"}]
[45,{"$f":"IF(MgEst!$H$29=\"\",\"\",MgEst!$H$29)","v":""},{"$f":"IF(MgEst!B$6=\"\",\"\",MgEst!B$6)","v":"MgEst"},{"$f":"IF(MgEst!B$29=\"\",\"\",MgEst!B$29)","v":"RSMD value listed in the BRSQC:"},{"$f":"IF(MgEst!$H$23=\"\",\"\",MgEst!$H$23)","v":"Bin No.5"}]
[46,{"$f":"IF(MgEst!$I$29=\"\",\"\",MgEst!$I$29)","v":""},{"$f":"IF(MgEst!B$6=\"\",\"\",MgEst!B$6)","v":"MgEst"},{"$f":"IF(MgEst!B$29=\"\",\"\",MgEst!B$29)","v":"RSMD value listed in the BRSQC:"},{"$f":"IF(MgEst!$I$23=\"\",\"\",MgEst!$I$23)","v":"Bin No.6"}]
[47,{"$f":"IF(MgEst!$J$29=\"\",\"\",MgEst!$J$29)","v":""},{"$f":"IF(MgEst!B$6=\"\",\"\",MgEst!B$6)","v":"MgEst"},{"$f":"IF(MgEst!B$29=\"\",\"\",MgEst!B$29)","v":"RSMD value listed in the BRSQC:"},{"$f":"IF(MgEst!$J$23=\"\",\"\",MgEst!$J$23)","v":"Bin No.7"}]
[48,{"$f":"IF(MgEst!$D$31=\"\",\"\",MgEst!$D$31)","v":""},{"$f":"IF(MgEst!B$6=\"\",\"\",MgEst!B$6)","v":"MgEst"},{"$f":"IF(MgEst!B$31=\"\",\"\",MgEst!B$31)","v":"Machine No."},{"$f":"IF(MgEst!$D$23=\"\",\"\",MgEst!$D$23)","v":"Bin No.1 "}]
[49,{"$f":"IF(MgEst!$E$31=\"\",\"\",MgEst!$E$31)","v":""},{"$f":"IF(MgEst!B$6=\"\",\"\",MgEst!B$6)","v":"MgEst"},{"$f":"IF(MgEst!B$31=\"\",\"\",MgEst!B$31)","v":"Machine No."},{"$f":"IF(MgEst!$E$23=\"\",\"\",MgEst!$E$23)","v":"Bin No.2"}]
[50,{"$f":"IF(MgEst!$F$31=\"\",\"\",MgEst!$F$31)","v":""},{"$f":"IF(MgEst!B$6=\"\",\"\",MgEst!B$6)","v":"MgEst"},{"$f":"IF(MgEst!B$31=\"\",\"\",MgEst!B$31)","v":"Machine No."},{"$f":"IF(MgEst!$F$23=\"\",\"\",MgEst!$F$23)","v":"Bin No.3"}]
[51,{"$f":"IF(MgEst!$G$31=\"\",\"\",MgEst!$G$31)","v":""},{"$f":"IF(MgEst!B$6=\"\",\"\",MgEst!B$6)","v":"MgEst"},{"$f":"IF(MgEst!B$31=\"\",\"\",MgEst!B$31)","v":"Machine No."},{"$f":"IF(MgEst!$G$23=\"\",\"\",MgEst!$G$23)","v":"Bin No.4"}]
[52,{"$f":"IF(MgEst!$H$31=\"\",\"\",MgEst!$H$31)","v":""},{"$f":"IF(MgEst!B$6=\"\",\"\",MgEst!B$6)","v":"MgEst"},{"$f":"IF(MgEst!B$31=\"\",\"\",MgEst!B$31)","v":"Machine No."},{"$f":"IF(MgEst!$H$23=\"\",\"\",MgEst!$H$23)","v":"Bin No.5"}]
[53,{"$f":"IF(MgEst!$I$31=\"\",\"\",MgEst!$I$31)","v":""},{"$f":"IF(MgEst!B$6=\"\",\"\",MgEst!B$6)","v":"MgEst"},{"$f":"IF(MgEst!B$31=\"\",\"\",MgEst!B$31)","v":"Machine No."},{"$f":"IF(MgEst!$I$23=\"\",\"\",MgEst!$I$23)","v":"Bin No.6"}]
[54,{"$f":"IF(MgEst!$J$31=\"\",\"\",MgEst!$J$31)","v":""},{"$f":"IF(MgEst!B$6=\"\",\"\",MgEst!B$6)","v":"MgEst"},{"$f":"IF(MgEst!B$31=\"\",\"\",MgEst!B$31)","v":"Machine No."},{"$f":"IF(MgEst!$J$23=\"\",\"\",MgEst!$J$23)","v":"Bin No.7"}]
[55,{"$f":"IF(MgEst!$D$32=\"\",\"\",MgEst!$D$32)","v":""},{"$f":"IF(MgEst!B$6=\"\",\"\",MgEst!B$6)","v":"MgEst"},{"$f":"IF(MgEst!B$32=\"\",\"\",MgEst!B$32)","v":"Tier No."},{"$f":"IF(MgEst!$D$23=\"\",\"\",MgEst!$D$23)","v":"Bin No.1 "}]
[56,{"$f":"IF(MgEst!$E$32=\"\",\"\",MgEst!$E$32)","v":""},{"$f":"IF(MgEst!B$6=\"\",\"\",MgEst!B$6)","v":"MgEst"},{"$f":"IF(MgEst!B$32=\"\",\"\",MgEst!B$32)","v":"Tier No."},{"$f":"IF(MgEst!$E$23=\"\",\"\",MgEst!$E$23)","v":"Bin No.2"}]
[57,{"$f":"IF(MgEst!$F$32=\"\",\"\",MgEst!$F$32)","v":""},{"$f":"IF(MgEst!B$6=\"\",\"\",MgEst!B$6)","v":"MgEst"},{"$f":"IF(MgEst!B$32=\"\",\"\",MgEst!B$32)","v":"Tier No."},{"$f":"IF(MgEst!$F$23=\"\",\"\",MgEst!$F$23)","v":"Bin No.3"}]
[58,{"$f":"IF(MgEst!$G$32=\"\",\"\",MgEst!$G$32)","v":""},{"$f":"IF(MgEst!B$6=\"\",\"\",MgEst!B$6)","v":"MgEst"},{"$f":"IF(MgEst!B$32=\"\",\"\",MgEst!B$32)","v":"Tier No."},{"$f":"IF(MgEst!$G$23=\"\",\"\",MgEst!$G$23)","v":"Bin No.4"}]
[59,{"$f":"IF(MgEst!$H$32=\"\",\"\",MgEst!$H$32)","v":""},{"$f":"IF(MgEst!B$6=\"\",\"\",MgEst!B$6)","v":"MgEst"},{"$f":"IF(MgEst!B$32=\"\",\"\",MgEst!B$32)","v":"Tier No."},{"$f":"IF(MgEst!$H$23=\"\",\"\",MgEst!$H$23)","v":"Bin No.5"}]
[60,{"$f":"IF(MgEst!$I$32=\"\",\"\",MgEst!$I$32)","v":""},{"$f":"IF(MgEst!B$6=\"\",\"\",MgEst!B$6)","v":"MgEst"},{"$f":"IF(MgEst!B$32=\"\",\"\",MgEst!B$32)","v":"Tier No."},{"$f":"IF(MgEst!$I$23=\"\",\"\",MgEst!$I$23)","v":"Bin No.6"}]
[61,{"$f":"IF(MgEst!$J$32=\"\",\"\",MgEst!$J$32)","v":""},{"$f":"IF(MgEst!B$6=\"\",\"\",MgEst!B$6)","v":"MgEst"},{"$f":"IF(MgEst!B$32=\"\",\"\",MgEst!B$32)","v":"Tier No."},{"$f":"IF(MgEst!$J$23=\"\",\"\",MgEst!$J$23)","v":"Bin No.7"}]
[62,{"$f":"IF(MgEst!$D$33=\"\",\"\",MgEst!$D$33)","v":""},{"$f":"IF(MgEst!B$6=\"\",\"\",MgEst!B$6)","v":"MgEst"},{"$f":"IF(MgEst!B$33=\"\",\"\",MgEst!B$33)","v":"Total No. of  Revolutions:"},{"$f":"IF(MgEst!$D$23=\"\",\"\",MgEst!$D$23)","v":"Bin No.1 "}]
[63,{"$f":"IF(MgEst!$E$33=\"\",\"\",MgEst!$E$33)","v":""},{"$f":"IF(MgEst!B$6=\"\",\"\",MgEst!B$6)","v":"MgEst"},{"$f":"IF(MgEst!B$33=\"\",\"\",MgEst!B$33)","v":"Total No. of  Revolutions:"},{"$f":"IF(MgEst!$E$23=\"\",\"\",MgEst!$E$23)","v":"Bin No.2"}]
[64,{"$f":"IF(MgEst!$F$33=\"\",\"\",MgEst!$F$33)","v":""},{"$f":"IF(MgEst!B$6=\"\",\"\",MgEst!B$6)","v":"MgEst"},{"$f":"IF(MgEst!B$33=\"\",\"\",MgEst!B$33)","v":"Total No. of  Revolutions:"},{"$f":"IF(MgEst!$F$23=\"\",\"\",MgEst!$F$23)","v":"Bin No.3"}]
[65,{"$f":"IF(MgEst!$G$33=\"\",\"\",MgEst!$G$33)","v":""},{"$f":"IF(MgEst!B$6=\"\",\"\",MgEst!B$6)","v":"MgEst"},{"$f":"IF(MgEst!B$33=\"\",\"\",MgEst!B$33)","v":"Total No. of  Revolutions:"},{"$f":"IF(MgEst!$G$23=\"\",\"\",MgEst!$G$23)","v":"Bin No.4"}]
[66,{"$f":"IF(MgEst!$H$33=\"\",\"\",MgEst!$H$33)","v":""},{"$f":"IF(MgEst!B$6=\"\",\"\",MgEst!B$6)","v":"MgEst"},{"$f":"IF(MgEst!B$33=\"\",\"\",MgEst!B$33)","v":"Total No. of  Revolutions:"},{"$f":"IF(MgEst!$H$23=\"\",\"\",MgEst!$H$23)","v":"Bin No.5"}]
[67,{"$f":"IF(MgEst!$I$33=\"\",\"\",MgEst!$I$33)","v":""},{"$f":"IF(MgEst!B$6=\"\",\"\",MgEst!B$6)","v":"MgEst"},{"$f":"IF(MgEst!B$33=\"\",\"\",MgEst!B$33)","v":"Total No. of  Revolutions:"},{"$f":"IF(MgEst!$I$23=\"\",\"\",MgEst!$I$23)","v":"Bin No.6"}]
[68,{"$f":"IF(MgEst!$J$33=\"\",\"\",MgEst!$J$33)","v":""},{"$f":"IF(MgEst!B$6=\"\",\"\",MgEst!B$6)","v":"MgEst"},{"$f":"IF(MgEst!B$33=\"\",\"\",MgEst!B$33)","v":"Total No. of  Revolutions:"},{"$f":"IF(MgEst!$J$23=\"\",\"\",MgEst!$J$23)","v":"Bin No.7"}]
[69,{"$f":"IF(MgEst!$D$34=\"\",\"\",MgEst!$D$34)","v":""},{"$f":"IF(MgEst!B$6=\"\",\"\",MgEst!B$6)","v":"MgEst"},{"$f":"IF(MgEst!B$34=\"\",\"\",MgEst!B$34)","v":"Average RPM:"},{"$f":"IF(MgEst!$D$23=\"\",\"\",MgEst!$D$23)","v":"Bin No.1 "}]
[70,{"$f":"IF(MgEst!$E$34=\"\",\"\",MgEst!$E$34)","v":""},{"$f":"IF(MgEst!B$6=\"\",\"\",MgEst!B$6)","v":"MgEst"},{"$f":"IF(MgEst!B$34=\"\",\"\",MgEst!B$34)","v":"Average RPM:"},{"$f":"IF(MgEst!$E$23=\"\",\"\",MgEst!$E$23)","v":"Bin No.2"}]
[71,{"$f":"IF(MgEst!$F$34=\"\",\"\",MgEst!$F$34)","v":""},{"$f":"IF(MgEst!B$6=\"\",\"\",MgEst!B$6)","v":"MgEst"},{"$f":"IF(MgEst!B$34=\"\",\"\",MgEst!B$34)","v":"Average RPM:"},{"$f":"IF(MgEst!$F$23=\"\",\"\",MgEst!$F$23)","v":"Bin No.3"}]
[72,{"$f":"IF(MgEst!$G$34=\"\",\"\",MgEst!$G$34)","v":""},{"$f":"IF(MgEst!B$6=\"\",\"\",MgEst!B$6)","v":"MgEst"},{"$f":"IF(MgEst!B$34=\"\",\"\",MgEst!B$34)","v":"Average RPM:"},{"$f":"IF(MgEst!$G$23=\"\",\"\",MgEst!$G$23)","v":"Bin No.4"}]
[73,{"$f":"IF(MgEst!$H$34=\"\",\"\",MgEst!$H$34)","v":""},{"$f":"IF(MgEst!B$6=\"\",\"\",MgEst!B$6)","v":"MgEst"},{"$f":"IF(MgEst!B$34=\"\",\"\",MgEst!B$34)","v":"Average RPM:"},{"$f":"IF(MgEst!$H$23=\"\",\"\",MgEst!$H$23)","v":"Bin No.5"}]
[74,{"$f":"IF(MgEst!$I$34=\"\",\"\",MgEst!$I$34)","v":""},{"$f":"IF(MgEst!B$6=\"\",\"\",MgEst!B$6)","v":"MgEst"},{"$f":"IF(MgEst!B$34=\"\",\"\",MgEst!B$34)","v":"Average RPM:"},{"$f":"IF(MgEst!$I$23=\"\",\"\",MgEst!$I$23)","v":"Bin No.6"}]
[75,{"$f":"IF(MgEst!$J$34=\"\",\"\",MgEst!$J$34)","v":""},{"$f":"IF(MgEst!B$6=\"\",\"\",MgEst!B$6)","v":"MgEst"},{"$f":"IF(MgEst!B$34=\"\",\"\",MgEst!B$34)","v":"Average RPM:"},{"$f":"IF(MgEst!$J$23=\"\",\"\",MgEst!$J$23)","v":"Bin No.7"}]
[76,{"$f":"IF(MgEst!$D$35=\"\",\"\",MgEst!$D$35)","v":""},{"$f":"IF(MgEst!B$6=\"\",\"\",MgEst!B$6)","v":"MgEst"},{"$f":"IF(MgEst!B$35=\"\",\"\",MgEst!B$35)","v":"Initial Weight:"},{"$f":"IF(MgEst!$D$23=\"\",\"\",MgEst!$D$23)","v":"Bin No.1 "}]
[77,{"$f":"IF(MgEst!$E$35=\"\",\"\",MgEst!$E$35)","v":""},{"$f":"IF(MgEst!B$6=\"\",\"\",MgEst!B$6)","v":"MgEst"},{"$f":"IF(MgEst!B$35=\"\",\"\",MgEst!B$35)","v":"Initial Weight:"},{"$f":"IF(MgEst!$E$23=\"\",\"\",MgEst!$E$23)","v":"Bin No.2"}]
[78,{"$f":"IF(MgEst!$F$35=\"\",\"\",MgEst!$F$35)","v":""},{"$f":"IF(MgEst!B$6=\"\",\"\",MgEst!B$6)","v":"MgEst"},{"$f":"IF(MgEst!B$35=\"\",\"\",MgEst!B$35)","v":"Initial Weight:"},{"$f":"IF(MgEst!$F$23=\"\",\"\",MgEst!$F$23)","v":"Bin No.3"}]
[79,{"$f":"IF(MgEst!$G$35=\"\",\"\",MgEst!$G$35)","v":""},{"$f":"IF(MgEst!B$6=\"\",\"\",MgEst!B$6)","v":"MgEst"},{"$f":"IF(MgEst!B$35=\"\",\"\",MgEst!B$35)","v":"Initial Weight:"},{"$f":"IF(MgEst!$G$23=\"\",\"\",MgEst!$G$23)","v":"Bin No.4"}]
[80,{"$f":"IF(MgEst!$H$35=\"\",\"\",MgEst!$H$35)","v":""},{"$f":"IF(MgEst!B$6=\"\",\"\",MgEst!B$6)","v":"MgEst"},{"$f":"IF(MgEst!B$35=\"\",\"\",MgEst!B$35)","v":"Initial Weight:"},{"$f":"IF(MgEst!$H$23=\"\",\"\",MgEst!$H$23)","v":"Bin No.5"}]
[81,{"$f":"IF(MgEst!$I$35=\"\",\"\",MgEst!$I$35)","v":""},{"$f":"IF(MgEst!B$6=\"\",\"\",MgEst!B$6)","v":"MgEst"},{"$f":"IF(MgEst!B$35=\"\",\"\",MgEst!B$35)","v":"Initial Weight:"},{"$f":"IF(MgEst!$I$23=\"\",\"\",MgEst!$I$23)","v":"Bin No.6"}]
[82,{"$f":"IF(MgEst!$J$35=\"\",\"\",MgEst!$J$35)","v":""},{"$f":"IF(MgEst!B$6=\"\",\"\",MgEst!B$6)","v":"MgEst"},{"$f":"IF(MgEst!B$35=\"\",\"\",MgEst!B$35)","v":"Initial Weight:"},{"$f":"IF(MgEst!$J$23=\"\",\"\",MgEst!$J$23)","v":"Bin No.7"}]
[83,{"$f":"IF(MgEst!$D$36=\"\",\"\",MgEst!$D$36)","v":""},{"$f":"IF(MgEst!B$6=\"\",\"\",MgEst!B$6)","v":"MgEst"},{"$f":"IF(MgEst!B$36=\"\",\"\",MgEst!B$36)","v":"Final Weight:"},{"$f":"IF(MgEst!$D$23=\"\",\"\",MgEst!$D$23)","v":"Bin No.1 "}]
[84,{"$f":"IF(MgEst!$E$36=\"\",\"\",MgEst!$E$36)","v":""},{"$f":"IF(MgEst!B$6=\"\",\"\",MgEst!B$6)","v":"MgEst"},{"$f":"IF(MgEst!B$36=\"\",\"\",MgEst!B$36)","v":"Final Weight:"},{"$f":"IF(MgEst!$E$23=\"\",\"\",MgEst!$E$23)","v":"Bin No.2"}]
[85,{"$f":"IF(MgEst!$F$36=\"\",\"\",MgEst!$F$36)","v":""},{"$f":"IF(MgEst!B$6=\"\",\"\",MgEst!B$6)","v":"MgEst"},{"$f":"IF(MgEst!B$36=\"\",\"\",MgEst!B$36)","v":"Final Weight:"},{"$f":"IF(MgEst!$F$23=\"\",\"\",MgEst!$F$23)","v":"Bin No.3"}]
[86,{"$f":"IF(MgEst!$G$36=\"\",\"\",MgEst!$G$36)","v":""},{"$f":"IF(MgEst!B$6=\"\",\"\",MgEst!B$6)","v":"MgEst"},{"$f":"IF(MgEst!B$36=\"\",\"\",MgEst!B$36)","v":"Final Weight:"},{"$f":"IF(MgEst!$G$23=\"\",\"\",MgEst!$G$23)","v":"Bin No.4"}]
[87,{"$f":"IF(MgEst!$H$36=\"\",\"\",MgEst!$H$36)","v":""},{"$f":"IF(MgEst!B$6=\"\",\"\",MgEst!B$6)","v":"MgEst"},{"$f":"IF(MgEst!B$36=\"\",\"\",MgEst!B$36)","v":"Final Weight:"},{"$f":"IF(MgEst!$H$23=\"\",\"\",MgEst!$H$23)","v":"Bin No.5"}]
[88,{"$f":"IF(MgEst!$I$36=\"\",\"\",MgEst!$I$36)","v":""},{"$f":"IF(MgEst!B$6=\"\",\"\",MgEst!B$6)","v":"MgEst"},{"$f":"IF(MgEst!B$36=\"\",\"\",MgEst!B$36)","v":"Final Weight:"},{"$f":"IF(MgEst!$I$23=\"\",\"\",MgEst!$I$23)","v":"Bin No.6"}]
[89,{"$f":"IF(MgEst!$J$36=\"\",\"\",MgEst!$J$36)","v":""},{"$f":"IF(MgEst!B$6=\"\",\"\",MgEst!B$6)","v":"MgEst"},{"$f":"IF(MgEst!B$36=\"\",\"\",MgEst!B$36)","v":"Final Weight:"},{"$f":"IF(MgEst!$J$23=\"\",\"\",MgEst!$J$23)","v":"Bin No.7"}]
[90,{"$f":"IF(MgEst!$D$37=\"\",\"\",MgEst!$D$37)","v":""},{"$f":"IF(MgEst!B$6=\"\",\"\",MgEst!B$6)","v":"MgEst"},{"$f":"IF(MgEst!B$37=\"\",\"\",MgEst!B$37)","v":"Percent Loss (%):"},{"$f":"IF(MgEst!$D$23=\"\",\"\",MgEst!$D$23)","v":"Bin No.1 "}]
[91,{"$f":"IF(MgEst!$E$37=\"\",\"\",MgEst!$E$37)","v":""},{"$f":"IF(MgEst!B$6=\"\",\"\",MgEst!B$6)","v":"MgEst"},{"$f":"IF(MgEst!B$37=\"\",\"\",MgEst!B$37)","v":"Percent Loss (%):"},{"$f":"IF(MgEst!$E$23=\"\",\"\",MgEst!$E$23)","v":"Bin No.2"}]
[92,{"$f":"IF(MgEst!$F$37=\"\",\"\",MgEst!$F$37)","v":""},{"$f":"IF(MgEst!B$6=\"\",\"\",MgEst!B$6)","v":"MgEst"},{"$f":"IF(MgEst!B$37=\"\",\"\",MgEst!B$37)","v":"Percent Loss (%):"},{"$f":"IF(MgEst!$F$23=\"\",\"\",MgEst!$F$23)","v":"Bin No.3"}]
[93,{"$f":"IF(MgEst!$G$37=\"\",\"\",MgEst!$G$37)","v":""},{"$f":"IF(MgEst!B$6=\"\",\"\",MgEst!B$6)","v":"MgEst"},{"$f":"IF(MgEst!B$37=\"\",\"\",MgEst!B$37)","v":"Percent Loss (%):"},{"$f":"IF(MgEst!$G$23=\"\",\"\",MgEst!$G$23)","v":"Bin No.4"}]
[94,{"$f":"IF(MgEst!$H$37=\"\",\"\",MgEst!$H$37)","v":""},{"$f":"IF(MgEst!B$6=\"\",\"\",MgEst!B$6)","v":"MgEst"},{"$f":"IF(MgEst!B$37=\"\",\"\",MgEst!B$37)","v":"Percent Loss (%):"},{"$f":"IF(MgEst!$H$23=\"\",\"\",MgEst!$H$23)","v":"Bin No.5"}]
[95,{"$f":"IF(MgEst!$I$37=\"\",\"\",MgEst!$I$37)","v":""},{"$f":"IF(MgEst!B$6=\"\",\"\",MgEst!B$6)","v":"MgEst"},{"$f":"IF(MgEst!B$37=\"\",\"\",MgEst!B$37)","v":"Percent Loss (%):"},{"$f":"IF(MgEst!$I$23=\"\",\"\",MgEst!$I$23)","v":"Bin No.6"}]
[96,{"$f":"IF(MgEst!$J$37=\"\",\"\",MgEst!$J$37)","v":""},{"$f":"IF(MgEst!B$6=\"\",\"\",MgEst!B$6)","v":"MgEst"},{"$f":"IF(MgEst!B$37=\"\",\"\",MgEst!B$37)","v":"Percent Loss (%):"},{"$f":"IF(MgEst!$J$23=\"\",\"\",MgEst!$J$23)","v":"Bin No.7"}]
[97,{"$f":"IF(MgEst!$D$39=\"\",\"\",MgEst!$D$39)","v":""},{"$f":"IF(MgEst!B$6=\"\",\"\",MgEst!B$6)","v":"MgEst"},{"$f":"IF(MgEst!B$39=\"\",\"\",MgEst!B$39)","v":"Magnesium Sulfate Soundness Loss (Mgest.):"},{"$f":"IF(MgEst!$D$23=\"\",\"\",MgEst!$D$23)","v":"Bin No.1 "}]
[98,{"$f":"IF(MgEst!$E$39=\"\",\"\",MgEst!$E$39)","v":""},{"$f":"IF(MgEst!B$6=\"\",\"\",MgEst!B$6)","v":"MgEst"},{"$f":"IF(MgEst!B$39=\"\",\"\",MgEst!B$39)","v":"Magnesium Sulfate Soundness Loss (Mgest.):"},{"$f":"IF(MgEst!$E$23=\"\",\"\",MgEst!$E$23)","v":"Bin No.2"}]
[99,{"$f":"IF(MgEst!$F$39=\"\",\"\",MgEst!$F$39)","v":""},{"$f":"IF(MgEst!B$6=\"\",\"\",MgEst!B$6)","v":"MgEst"},{"$f":"IF(MgEst!B$39=\"\",\"\",MgEst!B$39)","v":"Magnesium Sulfate Soundness Loss (Mgest.):"},{"$f":"IF(MgEst!$F$23=\"\",\"\",MgEst!$F$23)","v":"Bin No.3"}]
[100,{"$f":"IF(MgEst!$G$39=\"\",\"\",MgEst!$G$39)","v":""},{"$f":"IF(MgEst!B$6=\"\",\"\",MgEst!B$6)","v":"MgEst"},{"$f":"IF(MgEst!B$39=\"\",\"\",MgEst!B$39)","v":"Magnesium Sulfate Soundness Loss (Mgest.):"},{"$f":"IF(MgEst!$G$23=\"\",\"\",MgEst!$G$23)","v":"Bin No.4"}]
[101,{"$f":"IF(MgEst!$H$39=\"\",\"\",MgEst!$H$39)","v":""},{"$f":"IF(MgEst!B$6=\"\",\"\",MgEst!B$6)","v":"MgEst"},{"$f":"IF(MgEst!B$39=\"\",\"\",MgEst!B$39)","v":"Magnesium Sulfate Soundness Loss (Mgest.):"},{"$f":"IF(MgEst!$H$23=\"\",\"\",MgEst!$H$23)","v":"Bin No.5"}]
[102,{"$f":"IF(MgEst!$I$39=\"\",\"\",MgEst!$I$39)","v":""},{"$f":"IF(MgEst!B$6=\"\",\"\",MgEst!B$6)","v":"MgEst"},{"$f":"IF(MgEst!B$39=\"\",\"\",MgEst!B$39)","v":"Magnesium Sulfate Soundness Loss (Mgest.):"},{"$f":"IF(MgEst!$I$23=\"\",\"\",MgEst!$I$23)","v":"Bin No.6"}]
[103,{"$f":"IF(MgEst!$J$39=\"\",\"\",MgEst!$J$39)","v":""},{"$f":"IF(MgEst!B$6=\"\",\"\",MgEst!B$6)","v":"MgEst"},{"$f":"IF(MgEst!B$39=\"\",\"\",MgEst!B$39)","v":"Magnesium Sulfate Soundness Loss (Mgest.):"},{"$f":"IF(MgEst!$J$23=\"\",\"\",MgEst!$J$23)","v":"Bin No.7"}]
[104,{"$f":"IF(MgEst!$C$48=\"\",\"\",MgEst!$C$48)","v":""},"Tested By:",{"$f":"IF(MgEst!$B$48=\"\",\"\",MgEst!$B$48)","v":"TX400"}]
[105,{"$f":"IF(MgEst!$F$48=\"\",\"\",MgEst!$F$48)","v":""},"Tested Date:",{"$f":"IF(MgEst!$B$48=\"\",\"\",MgEst!$B$48)","v":"TX400"}]

{"sheet":"Revisions","index":2,"n_rows":3,"n_cols":3,"rows_kept":3,"cut":false,"hidden":true,"merged":[]}
["Date","Changes","By"]
["2011-07-07","Template created","Gisel Carrasco"]
["2024-08-06","2024 items added","Syeda Rahman"]

{"sheet":"Sheet1","index":3,"n_rows":30,"n_cols":6,"rows_kept":30,"cut":false,"hidden":true,"merged":[]}
[]
[]
[null,"spec2004,2014","spec2024",null,"MIX TYPES","Max Req"]
[null,"Type_A","Type_B",null,"CAM",20]
[null,"Type_B","Type_C",null,"CMHB_C",25]
[null,"Type_C","Type_D",null,"CMHB_F",25]
[null,"Type_D","Type_F",null,"LRA",20]
[null,"Type_F","PFC_C",null,"Microsurfacing",30]
[null,"PFC_AR","PFC_F",null,"Other",100]
[null,"PFC_PG76","SP_B",null,"PFC_AR",20]
[null,"SP_A","SP_C",null,"PFC_PG76",20]
[null,"SP_B","SP_D",null,"SMA_C",20]
[null,"SP_C","SMA_C",null,"SMA_D",20]
[null,"SP_D","SMA_D",null,"SMA_F",20]
[null,"CMHB_C","SMA_F",null,"SMAR_C",20]
[null,"CMHB_F","SMAR_F",null,"SMAR_F",20]
[null,"SMA_C","Microsurfacing",null,"SP_A",25]
[null,"SMA_D","TOM_C",null,"SP_B",25]
[null,"SMA_F","TOM_F",null,"SP_C",25]
[null,"SMAR_C","TBPFC_C",null,"SP_D",25]
[null,"SMAR_F","TBPFC_F",null,"TBPFC_AR",20]
[null,"Microsurfacing","TBFC_A",null,"TBPFC_PG76",20]
[null,"TBPFC_AR","TBFC_B",null,"Type_A",30]
[null,"TBPFC_PG76","TBFC_C",null,"Type_B",30]
[null,"UTBHMWC_A","CAM",null,"Type_C",30]
[null,"UTBHMWC_B","LRA",null,"Type_D",30]
[null,"UTBHMWC_C","Other",null,"Type_F",30]
[null,"CAM",null,null,"UTBHMWC_A",20]
[null,"LRA",null,null,"UTBHMWC_B",20]
[null,"Other",null,null,"UTBHMWC_C",20]