{"text_format":"1","workbook":"xlsx","n_sheets":9,"sheets":["Instructions","Design Data","Test_Data","Power 45 Curve","DATA_Film Thickness","DATA_MDV","DATA_spcyr","RX","DATA_Revisions"],"not_rendered":{"charts":2,"images":4,"macros":1,"external_links":0,"defined_names":817,"comments":3,"pivot_tables":0},"unopened":[{"sheet":"Power 45 Curve","index":3,"reason":"not_a_worksheet"}],"bounds":{"document_bytes":16777216,"sheet_cells":100000,"rows_first":2000,"rows_last":500,"rows_between":2000,"halvings":0,"cell_chars":16384,"cell_head_chars":4096},"cells_cut":0,"cells_raw":0,"read":"whole","date_system":"1900"}

{"sheet":"Instructions","index":0,"n_rows":44,"n_cols":3,"rows_kept":44,"cut":false,"hidden":false,"merged":[[4,1,4,11],[15,1,17,11],[40,2,42,11],[6,1,8,11],[38,2,39,11],[28,2,29,11],[30,2,31,11],[13,1,13,11],[10,1,10,11],[11,1,11,11],[19,2,19,11],[43,2,44,11],[22,2,24,11],[20,2,21,11],[25,2,27,11],[33,1,36,11]]}
[null,"TEXAS DEPARTMENT OF TRANSPORTATION"]
[]
[null,"HMAC Mix Properties"]
[]
[null,"This program can be use for Microsurfacing, LRA, Cold Laid Hot Mix, and Miscellaneous mixtures."]
[]
[null,"If you have questions or comments concerning this program, please call Travis Patton at 512-221-7408 of the Flexible Pavements Section of the Materials and Tests Division. "]
[]
[]
[]
[null,"If you would like to obtain an updated version of this Site Manager form go to "]
[null,"http://www.txdot.gov/txdot_library/consultants_contractors/forms/site_manager.htm   "]
[]
[null,"To move from page to page, click on the different worksheet tabs at the bottom of the page."]
[]
["*","DESIGN DATA SHEET: Select the 2024 specification year, mix type, method of determining asphalt content, method for obtaining combined aggregate, and others. This information will affect the calculation, labeling, and formatting of other worksheets in this template."]
[]
[]
[]
[null,"•","Spec Year: Select the specification year from the dropdown list before selecting the mix type.  "]
[null,"•","Mix Type:  Select the mix type from the dropdown list that most closely matches the mix for this lot. This value will determine what sieve sizes and tolerances are displayed on the worksheets."]
[]
[null,"•","Determination of Asphalt Content: select the method of determining asphalt content that will govern all sublots. Choose Ignition Oven Method or Nuclear Method from the dropdown list. This selection will modify labels and formats on other worksheets."]
[]
[]
[null,"•","Method Used to Obtain Aggregate:  Select the method used to obtain the combined aggregate for the gradation. Select Ignition Oven Method or Belt Feed from the dropdown list. This selection will modify labels and formats on other worksheets allowing users to enter the test data in the designated area.  "]
[]
[]
[null,"•","Determining Density & Properties of Bituminous Mixtures: Enter the press correction factor, if available. Enter the mix properties and mix design target density. "]
[]
[null,"•","Mechanical Testing: When available, enter the results of the IDT and Hamburg Wheel tests performed during design."]
[]
[]
["*","TEST DATA SHEET: Project information, spec year, spec item, special provision, and mix type will be transferred to this sheet. Here you will enter production test data. The sheet calculates Rice Specific Gravity, Moisture Content, Aggregate Gradation, Density of Laboratory & Roadway Samples and additional test results. This worksheet will flag results that are out of specification or do not meet operational tolerances depending on specification."]
[]
[]
[]
[]
[null,"•","Gradation: For PFC mixtures, the worksheet will flag the cumulative percent passing if the gradation for production samples exceeds the master gradation limits."]
[]
[null,"•","Determining Density: When the percent absorption is greater than 2%, and the vacuum method is used to calculate the Ga, the worksheet will select the lowest Ga from both calculations as required in the test procedure."]
[]
[]
[null,null,"For roadway cores, this worksheet averages the air voids from the roadway cores to calculate the in-place air voids. It subtracts the average air voids from 100 to calculate in-place density as required by specification."]

{"sheet":"Design Data","index":1,"n_rows":124,"n_cols":31,"rows_kept":124,"cut":false,"hidden":false,"merged":[[0,0,0,3],[0,16,0,17],[0,4,0,5],[0,6,0,7],[0,8,0,9],[9,1,9,5],[6,6,6,10],[7,6,7,10],[8,6,8,10],[9,6,9,10],[8,11,8,15],[6,11,6,15],[6,1,6,5],[7,1,7,5],[8,1,8,5],[0,10,0,11],[14,1,14,5],[14,6,14,20],[44,4,44,5],[47,8,47,9],[38,4,41,5],[47,10,47,12],[38,6,41,7],[38,8,41,9],[45,6,45,7],[42,1,42,3],[22,2,22,7],[22,16,22,18],[29,1,29,7],[43,6,43,7],[44,6,44,7],[44,8,44,9],[44,10,44,12],[123,11,123,13],[93,14,93,16],[123,1,123,10],[117,1,117,3],[107,1,107,3],[117,4,117,13],[93,1,93,3],[93,4,93,13],[99,1,99,3],[97,1,97,3],[121,1,121,3],[121,4,121,6],[121,7,121,9],[121,10,121,12],[117,14,117,16],[99,4,99,13],[107,14,107,16],[97,14,97,16],[103,14,103,16],[105,14,105,16],[115,14,115,16],[105,4,105,13],[95,1,95,3],[119,17,119,26],[91,1,91,3],[91,4,91,13],[119,14,119,16],[107,4,107,13],[103,1,103,3],[103,4,103,13],[111,1,111,3],[111,4,111,13],[111,14,111,16],[115,1,115,3],[115,4,115,13],[119,11,119,13],[119,1,119,10],[113,1,113,3],[113,4,113,13],[113,14,113,16],[109,1,109,3],[109,4,109,13],[109,14,109,16],[105,1,105,3],[50,4,50,5],[47,4,47,5],[45,1,45,3],[43,1,43,3],[42,10,42,12],[48,10,48,12],[45,4,45,5],[43,8,43,9],[47,6,47,7],[42,4,42,5],[43,4,43,5],[44,1,44,3],[46,4,46,5],[46,1,46,3],[48,4,48,5],[48,1,48,3],[46,10,46,12],[60,1,60,6],[58,1,58,6],[58,18,58,19],[66,13,66,15],[49,1,49,3],[47,1,47,3],[48,8,48,9],[50,10,50,12],[50,8,50,9],[49,15,49,16],[48,6,48,7],[50,1,50,3],[53,15,53,17],[53,8,53,9],[53,10,53,12],[53,13,53,14],[53,5,53,7],[49,8,49,9],[50,15,50,16],[51,1,51,3],[49,4,49,5],[49,10,49,12],[49,6,49,7],[50,6,50,7],[51,4,51,5],[58,7,58,8],[57,1,57,6],[57,12,57,17],[51,8,51,9],[57,7,57,8],[51,17,51,19],[51,10,51,12],[51,6,51,7],[58,12,58,17],[55,1,55,20],[47,15,47,16],[27,8,27,13],[27,17,27,19],[17,14,17,16],[44,15,44,16],[46,17,46,19],[38,17,41,19],[36,8,36,13],[36,16,36,22],[43,10,43,12],[38,10,41,12],[38,20,41,20],[47,17,47,19],[38,15,41,16],[38,13,41,13],[46,22,46,24],[79,1,79,20],[89,14,89,16],[91,14,91,16],[89,1,89,3],[89,4,89,13],[101,1,101,3],[101,4,101,13],[101,14,101,16],[73,14,73,16],[87,1,87,3],[87,4,87,13],[87,14,87,16],[73,9,73,12],[97,4,97,13],[95,4,95,13],[95,14,95,16],[99,14,99,16],[85,1,85,3],[85,14,85,16],[85,4,85,13],[80,1,80,20],[83,1,83,3],[83,4,83,13],[83,14,83,16],[0,34,0,35],[42,25,42,27],[38,25,41,27],[42,17,42,19],[42,22,42,24],[38,22,41,24],[12,16,12,20],[9,16,9,20],[7,16,7,20],[8,16,8,20],[0,26,0,27],[0,22,0,23],[0,24,0,25],[31,22,31,25],[38,21,41,21],[17,17,17,20],[11,16,11,20],[17,22,17,23],[17,24,17,27],[29,21,29,25],[42,15,42,16],[0,18,0,19],[0,20,0,21],[25,1,25,20],[0,32,0,33],[0,28,0,29],[0,30,0,31],[43,22,43,24],[43,25,43,27],[44,17,44,19],[44,22,44,24],[44,25,44,27],[43,15,43,16],[0,12,0,13],[0,14,0,15],[45,8,45,9],[45,10,45,12],[45,15,45,16],[6,16,6,20],[34,1,34,20],[36,14,36,15],[27,21,27,25],[27,15,27,16],[29,8,29,9],[12,6,12,10],[12,11,12,15],[15,16,15,20],[12,1,12,5],[11,1,11,5],[17,6,17,8],[42,6,42,7],[38,14,41,14],[17,9,17,10],[42,8,42,9],[38,1,41,3],[15,1,15,5],[15,6,15,10],[47,25,47,27],[50,25,50,27],[50,17,50,19],[17,1,17,5],[9,11,9,15],[7,11,7,15],[11,11,11,15],[10,1,10,5],[29,18,29,19],[13,1,13,5],[15,11,15,15],[17,11,17,13],[29,11,29,17],[22,8,22,10],[20,1,20,20],[45,22,45,24],[45,25,45,27],[45,17,45,19],[13,6,13,20],[10,11,10,15],[11,6,11,10],[10,6,10,10],[10,16,10,20],[48,15,48,16],[46,25,46,27],[32,19,32,25],[43,17,43,19],[46,6,46,7],[46,8,46,9],[46,15,46,16],[57,28,58,32],[59,21,60,24],[59,25,60,27],[59,28,60,32],[57,21,58,24],[57,25,58,27],[57,18,57,19],[51,15,51,16],[49,25,49,27],[48,25,48,27],[51,25,51,27],[50,22,50,24],[47,22,47,24],[49,17,49,19],[51,22,51,24],[48,17,48,19],[48,22,48,24],[49,22,49,24],[77,1,78,20],[73,5,73,8],[53,18,53,19],[69,15,69,16],[72,14,72,16],[70,1,70,20],[72,5,72,8],[69,4,69,11],[69,12,69,13],[60,18,60,19],[67,1,67,20],[72,9,72,12],[64,13,64,15],[65,7,65,12],[65,13,65,15],[64,7,64,12],[60,12,60,17],[59,7,59,10],[59,12,59,17],[66,7,66,12],[62,1,62,20],[59,18,59,19],[59,1,59,6],[60,7,60,10]]}
["TxDOT Manuals >",null,null,null,"Tex-207-F",null,"Tex-208-F",null,"Tex-210-F",null,"Tex-212-F",null,"Tex-213-F",null,"Tex-217-F",null,"Tex-227-F",null,"Tex-228-F",null,"Tex-229-F",null,"Tex-231-F",null,"Tex-235-F",null,"Tex-236-F",null,"Tex-530-C",null,"Tex-531-C"]
[null,"TEXAS DEPARTMENT OF TRANSPORTATION",null,null,null,null,null,null,null,null,null,null,null,null,null,null,null,null,null,null,null,null,null,null,null,null,null,"UPLC:",336]
[null,null,null,null,null,null,null,null,null,null,null,null,null,null,null,null,null,null,null,null,null,null,null,null,null,null,null,"DLT:",18]
[]
[null,"HMAC MIX PROPERTIES",null,null,null,null,null,null,null,null,null,null,null,null,null,null,null,null,null,null,null,null,null,null,null,null,null,"SN:","tx2mxprop.xlsm::45574.600359"]
[null,null,null,null,null,null,null,null,null,null,null,null,null,null,null,null,null,null,null,null,{"$f":"\"TX2MXPROP - File Version: \" & TEXT(MID(sn,SEARCH(\"::\",sn,1)+2,20),\"mm/dd/yy hh:mm:ss\")","v":"TX2MXPROP - File Version: 10/09/24 14:24:31"}]
[null,"SAMPLE ID:",null,null,null,null,null,null,null,null,null,"SAMPLED DATE:"]
[null,"TEST NUMBER:",null,null,null,null,null,null,null,null,null,"LETTING DATE:"]
[null,"SAMPLE STATUS:",null,null,null,null,null,null,null,null,null,"CONTROLLING CSJ:"]
[null,"COUNTY:",null,null,null,null,null,null,null,null,null,"SPEC YEAR:"]
[null,"SAMPLED BY:",null,null,null,null,null,null,null,null,null,"SPEC ITEM:"]
[null,"SAMPLE LOCATION:",null,null,null,null,null,null,null,null,null,"SPECIAL PROVISION:"]
[null,"MATERIAL CODE:",null,null,null,null,null,null,null,null,null,"MIX TYPE:"]
[null,"MATERIAL NAME:"]
[null,"PRODUCER:",null,null,null,null,""]
[null,"AREA ENGINEER:",null,null,null,null,null,null,null,null,null,"PROJECT MANAGER:"]
[]
[null,"COURSE\\LIFT:",null,null,null,null,null,null,null,"STATION:",null,"",null,null,"DIST. FROM CL:",null,null,"",null,null,null,null,"Design # :"]
[]
[]
[null,"PRODUCTION DATA"]
[]
[null,null,{"$f":"\"Quantity actually placed, \" & IF(specyear=\"1995\",\"MG\",\"Tons\")","v":"Quantity actually placed, Tons"},null,null,null,null,null,null,null,null,null,null,null,null,null,"Roadway Rice?"]
[]
[]
[null,"DETERMINATION OF ASPHALT CONTENT"]
[]
[null,null,null,null,null,null,null,"Determination of asphalt content by:",null,null,null,null,null,null,null,"PG Binder:",null,null,null,null,null,"Current JMF % Flux Material"]
[]
[null,{"$f":"\"Original Mix Design Asphalt Content, %:\"","v":"Original Mix Design Asphalt Content, %:"},null,null,null,null,null,null,null,null,null,{"$f":"\"Current JMF Asphalt Content, %:\"","v":"Current JMF Asphalt Content, %:"},null,null,null,null,null,null,null,null,null,"Ignition Correction Factor",null,null,null,null,null,"%"]
[]
[null,{"$f":"IF(Grade = \"Microsurfacing\",IF(OR(MixDesAC>9,MixDesAC<6),\"Asphalt Content must be between 6% and 9%\",\"\"),\"\")","v":""},null,null,null,null,null,null,null,null,null,{"$f":"IF(Grade = \"Microsurfacing\",IF(OR(JMFDesAC>9,JMFDesAC<6),\"Asphalt Content must be between 6% and 9%\",\"\"),\"\")","v":""},null,null,null,null,null,null,null,null,null,null,"Recycled Binder, %"]
[null,null,null,null,null,null,null,null,null,null,null,null,null,null,null,null,null,null,null,"Maximum Recycled Binder Ratio, %"]
[]
[null,"COMBINED AGGREGATE GRADATION:Tex-229-F"]
[]
[null,null,null,null,null,null,null,"Method used to obtain aggregate:",null,null,null,null,null,null,"using:"]
[]
[null,"Sieve Size:",null,null,"Size (mm)",null,{"$f":"IF(ISERROR(RETAINED = \"NO\"),\"Master Specification % Passing\",IF(RETAINED = \"NO\", \"Master Specification % Passing\",\"Master Specification % Retained\")) & \" Tolerances\"","v":"Master Specification % Retained Tolerances"},null,{"$f":"IF(ISERROR(RETAINED = \"NO\"),\"Master Specification % Passing\",IF(RETAINED = \"NO\", \"Master Specification % Passing\",\"Master Specification % Retained\")) & \" Restricted\"","v":"Master Specification % Retained Restricted"},null,{"$f":"IF(ISERROR(RETAINED = \"NO\"),\"Design JMF Cumulative Percent Passing\",IF(RETAINED = \"NO\",\"Design JMF Cumulative Percent Passing\",\"Design JMF Cumulative Percent Retained\"))","v":"Design JMF Cumulative Percent Retained"},null,null,"In Tolerance","Restricted Zone",{"$f":"IF(ISERROR(RETAINED = \"NO\"), \"Current JMF Design % Passing\",IF(RETAINED = \"NO\",\"Current JMF Design % Passing\",\"Current JMF Design % Retained\")) &\" Tolerances \"","v":"Current JMF Design % Retained Tolerances "},null,{"$f":"IF(ISERROR(RETAINED = \"NO\"),\"Current JMF Cumulative Percent Passing\",IF(RETAINED = \"NO\",\"Current JMF Cumulative Percent Passing\",\"Current JMF Cumulative Percent Retained\"))","v":"Current JMF Cumulative Percent Retained"},null,null,"In Tolerance","Restricted Zone","Sieve Size:",null,null,"TxDOT Ignition Oven Correction Factor,%:"]
[]
[]
[]
[null,{"$f":"IF(ISERROR(INDEX(INDIRECT(Grade),1,IF(specyear = \"1995\",3,2))),\"\",INDEX(INDIRECT(Grade),1,IF(specyear = \"1995\",3,2)))","v":""},null,null,{"$f":"IF(ISERROR(INDEX(INDIRECT(Grade),1,4)),\"\",INDEX(INDIRECT(Grade),1,4))","v":""},null,{"$f":"IF(ISERROR(OR(INDEX(INDIRECT(Grade),1,5),INDEX(INDIRECT(Grade),1,6))),\"\",INDEX(INDIRECT(Grade),1,5) & \"-\" & INDEX(INDIRECT(Grade),1,6))","v":""},null,{"$f":"IF(ISERROR(OR(INDEX(INDIRECT(Grade),1,10),INDEX(INDIRECT(Grade),1,11))),\"\",INDEX(INDIRECT(Grade),1,10) & \"-\" & INDEX(INDIRECT(Grade),1,11))","v":""},null,null,null,null,{"$f":"IF(OR($G43=\"\",MixDes1=\"\"),\"\",IF(AND(MixDes1>=INDEX(INDIRECT(Grade),1,5),MixDes1<=INDEX(INDIRECT(Grade),1,6)),\"þ\",\"ý\"))","v":""},{"$f":"IF(OR(I43=\"\",MixDes1=\"\"),\"\",IF(OR(MixDes1<INDEX(INDIRECT(Grade),1,10),MixDes1>INDEX(INDIRECT(Grade),1,11)),\"þ\",\"ý\"))","v":""},{"$f":"IF(ISERROR(IF(OR(INDEX(INDIRECT(Grade),1,5)&INDEX(INDIRECT(Grade),1,6)=\"\",JMFDes1=\"\"),\"\",IF(AND(ProdRetained = \"YES\",RETAINED = \"NO\"), jmftol1,microjmftol1))),\"\",IF(OR(INDEX(INDIRECT(Grade),1,5)&INDEX(INDIRECT(Grade),1,6)=\"\",JMFDes1=\"\"),\"\",IF(AND(ProdRetained = \"YES\",RETAINED = \"NO\"), jmftol1,microjmftol1)))","v":""},null,null,null,null,{"$f":"IF(OR($P43=\"\",JMFDes1=\"\"),\"\",IF(RETAINED = \"NO\",IF(AND(JMFDes1>=INDEX(INDIRECT(Grade),1,5),JMFDes1<=INDEX(INDIRECT(Grade),1,6),ABS((100-MixDes1)-(100-JMFDes1))<=INDEX(INDIRECT(Grade),1,8)),\"þ\",\"ý\"),IF(AND(JMFDes1>=INDEX(INDIRECT(Grade),1,5),JMFDes1<=INDEX(INDIRECT(Grade),1,6),ABS((MixDes1)-(JMFDes1))<=INDEX(INDIRECT(Grade),1,8)),\"þ\",\"ý\")))","v":""},{"$f":"IF(OR(I43=\"\",JMFDes1=\"\"),\"\",IF(OR(JMFDes1<INDEX(INDIRECT(Grade),1,10),JMFDes1>INDEX(INDIRECT(Grade),1,11)),\"þ\",\"ý\"))","v":""},{"$f":"IF(ISERROR(INDEX(INDIRECT(Grade),1,IF(specyear = \"1995\",3,2))),\"\",INDEX(INDIRECT(Grade),1,IF(specyear = \"1995\",3,2)))","v":""}]
[null,{"$f":"IF(ISERROR(INDEX(INDIRECT(Grade),2,IF(specyear = \"1995\",3,2))),\"\",INDEX(INDIRECT(Grade),2,IF(specyear = \"1995\",3,2)))","v":""},null,null,{"$f":"IF(ISERROR(INDEX(INDIRECT(Grade),2,4)),\"\",INDEX(INDIRECT(Grade),2,4))","v":""},null,{"$f":"IF(ISERROR(OR(INDEX(INDIRECT(Grade),2,5),INDEX(INDIRECT(Grade),2,6))),\"\",INDEX(INDIRECT(Grade),2,5) & \"-\" & INDEX(INDIRECT(Grade),2,6))","v":""},null,{"$f":"IF(ISERROR(OR(INDEX(INDIRECT(Grade),2,10),INDEX(INDIRECT(Grade),2,11))),\"\",INDEX(INDIRECT(Grade),2,10) & \"-\" & INDEX(INDIRECT(Grade),2,11))","v":""},null,null,null,null,{"$f":"IF(OR($G44=\"\",Mixdes2=\"\"),\"\",IF(AND(Mixdes2>=INDEX(INDIRECT(Grade),2,5),Mixdes2<=INDEX(INDIRECT(Grade),2,6)),\"þ\",\"ý\"))","v":""},{"$f":"IF(OR(I44=\"\",Mixdes2=\"\"),\"\",IF(OR(Mixdes2<INDEX(INDIRECT(Grade),2,10),Mixdes2>INDEX(INDIRECT(Grade),2,11)),\"þ\",\"ý\"))","v":""},{"$f":"IF(ISERROR(IF(OR(INDEX(INDIRECT(Grade),2,5)&INDEX(INDIRECT(Grade),2,6)=\"\",JMFDes2=\"\"),\"\",IF(AND(ProdRetained = \"YES\",RETAINED = \"NO\"), jmftol2,microjmftol2))),\"\",IF(OR(INDEX(INDIRECT(Grade),2,5)&INDEX(INDIRECT(Grade),2,6)=\"\",JMFDes2=\"\"),\"\",IF(AND(ProdRetained = \"YES\",RETAINED = \"NO\"), jmftol2,microjmftol2)))","v":""},null,null,null,null,{"$f":"IF(OR($P44=\"\",JMFDes2=\"\"),\"\",IF(RETAINED = \"NO\",IF(AND(JMFDes2>=INDEX(INDIRECT(Grade),2,5),JMFDes2<=INDEX(INDIRECT(Grade),2,6),ABS((MixDes1-Mixdes2)-(JMFDes1-JMFDes2))<=INDEX(INDIRECT(Grade),2,8)),\"þ\",\"ý\"),IF(AND(JMFDes2>=INDEX(INDIRECT(Grade),2,5),JMFDes2<=INDEX(INDIRECT(Grade),2,6),ABS((Mixdes2)-(JMFDes2))<=INDEX(INDIRECT(Grade),2,8)),\"þ\",\"ý\")))","v":""},{"$f":"IF(OR(I44=\"\",JMFDes2=\"\"),\"\",IF(OR(JMFDes2<INDEX(INDIRECT(Grade),2,10),JMFDes2>INDEX(INDIRECT(Grade),2,11)),\"þ\",\"ý\"))","v":""},{"$f":"IF(ISERROR(INDEX(INDIRECT(Grade),2,IF(specyear = \"1995\",3,2))),\"\",INDEX(INDIRECT(Grade),2,IF(specyear = \"1995\",3,2)))","v":""}]
[null,{"$f":"IF(ISERROR(INDEX(INDIRECT(Grade),3,IF(specyear = \"1995\",3,2))),\"\",INDEX(INDIRECT(Grade),3,IF(specyear = \"1995\",3,2)))","v":""},null,null,{"$f":"IF(ISERROR(INDEX(INDIRECT(Grade),3,4)),\"\",INDEX(INDIRECT(Grade),3,4))","v":""},null,{"$f":"IF(ISERROR(OR(INDEX(INDIRECT(Grade),3,5),INDEX(INDIRECT(Grade),3,6))),\"\",INDEX(INDIRECT(Grade),3,5) & \"-\" & INDEX(INDIRECT(Grade),3,6))","v":""},null,{"$f":"IF(ISERROR(OR(INDEX(INDIRECT(Grade),3,10),INDEX(INDIRECT(Grade),3,11))),\"\",INDEX(INDIRECT(Grade),3,10) & \"-\" & INDEX(INDIRECT(Grade),3,11))","v":""},null,null,null,null,{"$f":"IF(OR($G45=\"\",MixDes3=\"\"),\"\",IF(AND(MixDes3>=INDEX(INDIRECT(Grade),3,5),MixDes3<=INDEX(INDIRECT(Grade),3,6)),\"þ\",\"ý\"))","v":""},{"$f":"IF(OR(I45=\"\",MixDes3=\"\"),\"\",IF(OR(MixDes3<INDEX(INDIRECT(Grade),3,10),MixDes3>INDEX(INDIRECT(Grade),3,11)),\"þ\",\"ý\"))","v":""},{"$f":"IF(ISERROR(IF(OR(INDEX(INDIRECT(Grade),3,5)&INDEX(INDIRECT(Grade),3,6)=\"\",JMFDes3=\"\"),\"\",IF(AND(ProdRetained = \"YES\",RETAINED = \"NO\"), jmftol3,microjmftol3))),\"\",IF(OR(INDEX(INDIRECT(Grade),3,5)&INDEX(INDIRECT(Grade),3,6)=\"\",JMFDes3=\"\"),\"\",IF(AND(ProdRetained = \"YES\",RETAINED = \"NO\"), jmftol3,microjmftol3)))","v":""},null,null,null,null,{"$f":"IF(OR($P45=\"\",JMFDes3=\"\"),\"\",IF(RETAINED = \"NO\",IF(AND(JMFDes3>=INDEX(INDIRECT(Grade),3,5),JMFDes3<=INDEX(INDIRECT(Grade),3,6),ABS((Mixdes2-MixDes3)-(JMFDes2-JMFDes3))<=INDEX(INDIRECT(Grade),3,8)),\"þ\",\"ý\"),IF(AND(JMFDes3>=INDEX(INDIRECT(Grade),3,5),JMFDes3<=INDEX(INDIRECT(Grade),3,6),ABS((MixDes3)-(JMFDes3))<=INDEX(INDIRECT(Grade),3,8)),\"þ\",\"ý\")))","v":""},{"$f":"IF(OR(I45=\"\",JMFDes3=\"\"),\"\",IF(OR(JMFDes3<INDEX(INDIRECT(Grade),3,10),JMFDes3>INDEX(INDIRECT(Grade),3,11)),\"þ\",\"ý\"))","v":""},{"$f":"IF(ISERROR(INDEX(INDIRECT(Grade),3,IF(specyear = \"1995\",3,2))),\"\",INDEX(INDIRECT(Grade),3,IF(specyear = \"1995\",3,2)))","v":""}]
[null,{"$f":"IF(ISERROR(INDEX(INDIRECT(Grade),4,IF(specyear = \"1995\",3,2))),\"\",INDEX(INDIRECT(Grade),4,IF(specyear = \"1995\",3,2)))","v":""},null,null,{"$f":"IF(ISERROR(INDEX(INDIRECT(Grade),4,4)),\"\",INDEX(INDIRECT(Grade),4,4))","v":""},null,{"$f":"IF(ISERROR(OR(INDEX(INDIRECT(Grade),4,5),INDEX(INDIRECT(Grade),4,6))),\"\",INDEX(INDIRECT(Grade),4,5) & \"-\" & INDEX(INDIRECT(Grade),4,6))","v":""},null,{"$f":"IF(ISERROR(OR(INDEX(INDIRECT(Grade),4,10),INDEX(INDIRECT(Grade),4,11))),\"\",INDEX(INDIRECT(Grade),4,10) & \"-\" & INDEX(INDIRECT(Grade),4,11))","v":""},null,null,null,null,{"$f":"IF(OR($G46=\"\",Mixdes4=\"\"),\"\",IF(AND(Mixdes4>=INDEX(INDIRECT(Grade),4,5),Mixdes4<=INDEX(INDIRECT(Grade),4,6)),\"þ\",\"ý\"))","v":""},{"$f":"IF(OR(I46=\"\",Mixdes4=\"\"),\"\",IF(OR(Mixdes4<INDEX(INDIRECT(Grade),4,10),Mixdes4>INDEX(INDIRECT(Grade),4,11)),\"þ\",\"ý\"))","v":""},{"$f":"IF(ISERROR(IF(OR(INDEX(INDIRECT(Grade),4,5)&INDEX(INDIRECT(Grade),4,6)=\"\",JMFDes4=\"\"),\"\",IF(AND(ProdRetained = \"YES\",RETAINED = \"NO\"), jmftol4,microjmftol4))),\"\",IF(OR(INDEX(INDIRECT(Grade),4,5)&INDEX(INDIRECT(Grade),4,6)=\"\",JMFDes4=\"\"),\"\",IF(AND(ProdRetained = \"YES\",RETAINED = \"NO\"), jmftol4,microjmftol4)))","v":""},null,null,null,null,{"$f":"IF(OR($P46=\"\",JMFDes4=\"\"),\"\",IF(RETAINED = \"NO\",IF(AND(JMFDes4>=INDEX(INDIRECT(Grade),4,5),JMFDes4<=INDEX(INDIRECT(Grade),4,6),ABS((MixDes3-Mixdes4)-(JMFDes3-JMFDes4))<=INDEX(INDIRECT(Grade),4,8)),\"þ\",\"ý\"),IF(AND(JMFDes4>=INDEX(INDIRECT(Grade),4,5),JMFDes4<=INDEX(INDIRECT(Grade),4,6),ABS((Mixdes4)-(JMFDes4))<=INDEX(INDIRECT(Grade),4,8)),\"þ\",\"ý\")))","v":""},{"$f":"IF(OR(I46=\"\",JMFDes4=\"\"),\"\",IF(OR(JMFDes4<INDEX(INDIRECT(Grade),4,10),JMFDes4>INDEX(INDIRECT(Grade),4,11)),\"þ\",\"ý\"))","v":""},{"$f":"IF(ISERROR(INDEX(INDIRECT(Grade),4,IF(specyear = \"1995\",3,2))),\"\",INDEX(INDIRECT(Grade),4,IF(specyear = \"1995\",3,2)))","v":""}]
[null,{"$f":"IF(ISERROR(INDEX(INDIRECT(Grade),5,IF(specyear = \"1995\",3,2))),\"\",INDEX(INDIRECT(Grade),5,IF(specyear = \"1995\",3,2)))","v":""},null,null,{"$f":"IF(ISERROR(INDEX(INDIRECT(Grade),5,4)),\"\",INDEX(INDIRECT(Grade),5,4))","v":""},null,{"$f":"IF(ISERROR(OR(INDEX(INDIRECT(Grade),5,5),INDEX(INDIRECT(Grade),5,6))),\"\",INDEX(INDIRECT(Grade),5,5) & \"-\" & INDEX(INDIRECT(Grade),5,6))","v":""},null,{"$f":"IF(ISERROR(OR(INDEX(INDIRECT(Grade),5,10),INDEX(INDIRECT(Grade),5,11))),\"\",INDEX(INDIRECT(Grade),5,10) & \"-\" & INDEX(INDIRECT(Grade),5,11))","v":""},null,null,null,null,{"$f":"IF(OR($G47=\"\",MixDes5=\"\"),\"\",IF(AND(MixDes5>=INDEX(INDIRECT(Grade),5,5),MixDes5<=INDEX(INDIRECT(Grade),5,6)),\"þ\",\"ý\"))","v":""},{"$f":"IF(OR(I47=\"\",MixDes5=\"\"),\"\",IF(OR(MixDes5<INDEX(INDIRECT(Grade),5,10),MixDes5>INDEX(INDIRECT(Grade),5,11)),\"þ\",\"ý\"))","v":""},{"$f":"IF(ISERROR(IF(OR(INDEX(INDIRECT(Grade),5,5)&INDEX(INDIRECT(Grade),5,6)=\"\",JMFDes5=\"\"),\"\",IF(AND(ProdRetained = \"YES\",RETAINED = \"NO\"), jmftol5,microjmftol5))),\"\",IF(OR(INDEX(INDIRECT(Grade),5,5)&INDEX(INDIRECT(Grade),5,6)=\"\",JMFDes5=\"\"),\"\",IF(AND(ProdRetained = \"YES\",RETAINED = \"NO\"), jmftol5,microjmftol5)))","v":""},null,null,null,null,{"$f":"IF(OR($P47=\"\",JMFDes5=\"\"),\"\",IF(RETAINED = \"NO\",IF(AND(JMFDes5>=INDEX(INDIRECT(Grade),5,5),JMFDes5<=INDEX(INDIRECT(Grade),5,6),ABS((Mixdes4-MixDes5)-(JMFDes4-JMFDes5))<=INDEX(INDIRECT(Grade),5,8)),\"þ\",\"ý\"),IF(AND(JMFDes5>=INDEX(INDIRECT(Grade),5,5),JMFDes5<=INDEX(INDIRECT(Grade),5,6),ABS((MixDes5)-(JMFDes5))<=INDEX(INDIRECT(Grade),5,8)),\"þ\",\"ý\")))","v":""},{"$f":"IF(OR(I47=\"\",JMFDes5=\"\"),\"\",IF(OR(JMFDes5<INDEX(INDIRECT(Grade),5,10),JMFDes5>INDEX(INDIRECT(Grade),5,11)),\"þ\",\"ý\"))","v":""},{"$f":"IF(ISERROR(INDEX(INDIRECT(Grade),5,IF(specyear = \"1995\",3,2))),\"\",INDEX(INDIRECT(Grade),5,IF(specyear = \"1995\",3,2)))","v":""}]
[null,{"$f":"IF(ISERROR(INDEX(INDIRECT(Grade),6,IF(specyear = \"1995\",3,2))),\"\",INDEX(INDIRECT(Grade),6,IF(specyear = \"1995\",3,2)))","v":""},null,null,{"$f":"IF(ISERROR(INDEX(INDIRECT(Grade),6,4)),\"\",INDEX(INDIRECT(Grade),6,4))","v":""},null,{"$f":"IF(ISERROR(OR(INDEX(INDIRECT(Grade),6,5),INDEX(INDIRECT(Grade),6,6))),\"\",INDEX(INDIRECT(Grade),6,5) & \"-\" & INDEX(INDIRECT(Grade),6,6))","v":""},null,{"$f":"IF(ISERROR(OR(INDEX(INDIRECT(Grade),6,10),INDEX(INDIRECT(Grade),6,11))),\"\",INDEX(INDIRECT(Grade),6,10) & \"-\" & INDEX(INDIRECT(Grade),6,11))","v":""},null,null,null,null,{"$f":"IF(OR($G48=\"\",MixDes6=\"\"),\"\",IF(AND(MixDes6>=INDEX(INDIRECT(Grade),6,5),MixDes6<=INDEX(INDIRECT(Grade),6,6)),\"þ\",\"ý\"))","v":""},{"$f":"IF(OR(I48=\"\",MixDes6=\"\"),\"\",IF(OR(MixDes6<INDEX(INDIRECT(Grade),6,10),MixDes6>INDEX(INDIRECT(Grade),6,11)),\"þ\",\"ý\"))","v":""},{"$f":"IF(ISERROR(IF(OR(INDEX(INDIRECT(Grade),6,5)&INDEX(INDIRECT(Grade),6,6)=\"\",JMFDes6=\"\"),\"\",IF(AND(ProdRetained = \"YES\",RETAINED = \"NO\"), jmftol6,microjmftol6))),\"\",IF(OR(INDEX(INDIRECT(Grade),6,5)&INDEX(INDIRECT(Grade),6,6)=\"\",JMFDes6=\"\"),\"\",IF(AND(ProdRetained = \"YES\",RETAINED = \"NO\"), jmftol6,microjmftol6)))","v":""},null,null,null,null,{"$f":"IF(OR($P48=\"\",JMFDes6=\"\"),\"\",IF(RETAINED = \"NO\",IF(AND(JMFDes6>=INDEX(INDIRECT(Grade),6,5),JMFDes6<=INDEX(INDIRECT(Grade),6,6),ABS((MixDes5-MixDes6)-(JMFDes5-JMFDes6))<=INDEX(INDIRECT(Grade),6,8)),\"þ\",\"ý\"),IF(AND(JMFDes6>=INDEX(INDIRECT(Grade),6,5),JMFDes6<=INDEX(INDIRECT(Grade),6,6),ABS((MixDes6)-(JMFDes6))<=INDEX(INDIRECT(Grade),6,8)),\"þ\",\"ý\")))","v":""},{"$f":"IF(OR(I48=\"\",JMFDes6=\"\"),\"\",IF(OR(JMFDes6<INDEX(INDIRECT(Grade),6,10),JMFDes6>INDEX(INDIRECT(Grade),6,11)),\"þ\",\"ý\"))","v":""},{"$f":"IF(ISERROR(INDEX(INDIRECT(Grade),6,IF(specyear = \"1995\",3,2))),\"\",INDEX(INDIRECT(Grade),6,IF(specyear = \"1995\",3,2)))","v":""}]
[null,{"$f":"IF(ISERROR(INDEX(INDIRECT(Grade),7,IF(specyear = \"1995\",3,2))),\"\",INDEX(INDIRECT(Grade),7,IF(specyear = \"1995\",3,2)))","v":""},null,null,{"$f":"IF(ISERROR(INDEX(INDIRECT(Grade),7,4)),\"\",INDEX(INDIRECT(Grade),7,4))","v":""},null,{"$f":"IF(ISERROR(OR(INDEX(INDIRECT(Grade),7,5),INDEX(INDIRECT(Grade),7,6))),\"\",INDEX(INDIRECT(Grade),7,5) & \"-\" & INDEX(INDIRECT(Grade),7,6))","v":""},null,{"$f":"IF(ISERROR(OR(INDEX(INDIRECT(Grade),7,10),INDEX(INDIRECT(Grade),7,11))),\"\",INDEX(INDIRECT(Grade),7,10) & \"-\" & INDEX(INDIRECT(Grade),7,11))","v":""},null,null,null,null,{"$f":"IF(OR($G49=\"\",MixDes7=\"\"),\"\",IF(AND(MixDes7>=INDEX(INDIRECT(Grade),7,5),MixDes7<=INDEX(INDIRECT(Grade),7,6)),\"þ\",\"ý\"))","v":""},{"$f":"IF(OR(I49=\"\",MixDes7=\"\"),\"\",IF(OR(MixDes7<INDEX(INDIRECT(Grade),7,10),MixDes7>INDEX(INDIRECT(Grade),7,11)),\"þ\",\"ý\"))","v":""},{"$f":"IF(ISERROR(IF(OR(INDEX(INDIRECT(Grade),7,5)&INDEX(INDIRECT(Grade),7,6)=\"\",JMFDes7=\"\"),\"\",IF(AND(ProdRetained = \"YES\",RETAINED = \"NO\"), jmftol7,microjmftol7))),\"\",IF(OR(INDEX(INDIRECT(Grade),7,5)&INDEX(INDIRECT(Grade),7,6)=\"\",JMFDes7=\"\"),\"\",IF(AND(ProdRetained = \"YES\",RETAINED = \"NO\"), jmftol7,microjmftol7)))","v":""},null,null,null,null,{"$f":"IF(OR($P49=\"\",JMFDes7=\"\"),\"\",IF(RETAINED = \"NO\",IF(AND(JMFDes7>=INDEX(INDIRECT(Grade),7,5),JMFDes7<=INDEX(INDIRECT(Grade),7,6),ABS((MixDes6-MixDes7)-(JMFDes6-JMFDes7))<=INDEX(INDIRECT(Grade),7,8)),\"þ\",\"ý\"),IF(AND(JMFDes7>=INDEX(INDIRECT(Grade),7,5),JMFDes7<=INDEX(INDIRECT(Grade),7,6),ABS((MixDes7)-(JMFDes7))<=INDEX(INDIRECT(Grade),7,8)),\"þ\",\"ý\")))","v":""},{"$f":"IF(OR(I49=\"\",JMFDes7=\"\"),\"\",IF(OR(JMFDes7<INDEX(INDIRECT(Grade),7,10),JMFDes7>INDEX(INDIRECT(Grade),7,11)),\"þ\",\"ý\"))","v":""},{"$f":"IF(ISERROR(INDEX(INDIRECT(Grade),7,IF(specyear = \"1995\",3,2))),\"\",INDEX(INDIRECT(Grade),7,IF(specyear = \"1995\",3,2)))","v":""}]
[null,{"$f":"IF(ISERROR(INDEX(INDIRECT(Grade),8,IF(specyear = \"1995\",3,2))),\"\",INDEX(INDIRECT(Grade),8,IF(specyear = \"1995\",3,2)))","v":""},null,null,{"$f":"IF(ISERROR(INDEX(INDIRECT(Grade),8,4)),\"\",INDEX(INDIRECT(Grade),8,4))","v":""},null,{"$f":"IF(ISERROR(OR(INDEX(INDIRECT(Grade),8,5),INDEX(INDIRECT(Grade),8,6))),\"\",INDEX(INDIRECT(Grade),8,5) & \"-\" & INDEX(INDIRECT(Grade),8,6))","v":""},null,{"$f":"IF(ISERROR(OR(INDEX(INDIRECT(Grade),8,10),INDEX(INDIRECT(Grade),8,11))),\"\",INDEX(INDIRECT(Grade),8,10) & \"-\" & INDEX(INDIRECT(Grade),8,11))","v":""},null,null,null,null,{"$f":"IF(OR($G50=\"\",MixDes8=\"\"),\"\",IF(AND(MixDes8>=INDEX(INDIRECT(Grade),8,5),MixDes8<=INDEX(INDIRECT(Grade),8,6)),\"þ\",\"ý\"))","v":""},{"$f":"IF(OR(I50=\"\",MixDes8=\"\"),\"\",IF(OR(MixDes8<INDEX(INDIRECT(Grade),8,10),MixDes8>INDEX(INDIRECT(Grade),8,11)),\"þ\",\"ý\"))","v":""},{"$f":"IF(ISERROR(IF(OR(INDEX(INDIRECT(Grade),8,5)&INDEX(INDIRECT(Grade),8,6)=\"\",JMFDes8=\"\"),\"\",IF(AND(ProdRetained = \"YES\",RETAINED = \"NO\"), jmftol8,microjmftol8))),\"\",IF(OR(INDEX(INDIRECT(Grade),8,5)&INDEX(INDIRECT(Grade),8,6)=\"\",JMFDes8=\"\"),\"\",IF(AND(ProdRetained = \"YES\",RETAINED = \"NO\"), jmftol8,microjmftol8)))","v":""},null,null,null,null,{"$f":"IF(OR($P50=\"\",JMFDes8=\"\"),\"\",IF(RETAINED = \"NO\",IF(AND(JMFDes8>=INDEX(INDIRECT(Grade),8,5),JMFDes8<=INDEX(INDIRECT(Grade),8,6),ABS((MixDes7-MixDes8)-(JMFDes7-JMFDes8))<=INDEX(INDIRECT(Grade),8,8)),\"þ\",\"ý\"),IF(AND(JMFDes8>=INDEX(INDIRECT(Grade),8,5),JMFDes8<=INDEX(INDIRECT(Grade),8,6),ABS((MixDes8)-(JMFDes8))<=INDEX(INDIRECT(Grade),8,8)),\"þ\",\"ý\")))","v":""},{"$f":"IF(OR(I50=\"\",JMFDes8=\"\"),\"\",IF(OR(JMFDes8<INDEX(INDIRECT(Grade),8,10),JMFDes8>INDEX(INDIRECT(Grade),8,11)),\"þ\",\"ý\"))","v":""},{"$f":"IF(ISERROR(INDEX(INDIRECT(Grade),8,IF(specyear = \"1995\",3,2))),\"\",INDEX(INDIRECT(Grade),8,IF(specyear = \"1995\",3,2)))","v":""}]
[null,{"$f":"IF(ISERROR(INDEX(INDIRECT(Grade),9,IF(specyear = \"1995\",3,2))),\"\",INDEX(INDIRECT(Grade),9,IF(specyear = \"1995\",3,2)))","v":""},null,null,{"$f":"IF(ISERROR(INDEX(INDIRECT(Grade),9,4)),\"\",INDEX(INDIRECT(Grade),9,4))","v":""},null,{"$f":"IF(ISERROR(OR(INDEX(INDIRECT(Grade),9,5),INDEX(INDIRECT(Grade),9,6))),\"\",INDEX(INDIRECT(Grade),9,5) & \"-\" & INDEX(INDIRECT(Grade),9,6))","v":""},null,{"$f":"IF(ISERROR(OR(INDEX(INDIRECT(Grade),9,10),INDEX(INDIRECT(Grade),9,11))),\"\",INDEX(INDIRECT(Grade),9,10) & \"-\" & INDEX(INDIRECT(Grade),9,11))","v":""},null,null,null,null,{"$f":"IF(OR($G51=\"\",MixDes9=\"\"),\"\",IF(AND(MixDes9>=INDEX(INDIRECT(Grade),9,5),MixDes9<=INDEX(INDIRECT(Grade),9,6)),\"þ\",\"ý\"))","v":""},{"$f":"IF(OR(I51=\"\",MixDes9=\"\"),\"\",IF(OR(MixDes9<INDEX(INDIRECT(Grade),9,10),MixDes9>INDEX(INDIRECT(Grade),9,11)),\"þ\",\"ý\"))","v":""},{"$f":"IF(ISERROR(IF(OR(INDEX(INDIRECT(Grade),9,5)&INDEX(INDIRECT(Grade),9,6)=\"\",JMFDes9=\"\"),\"\",IF(AND(ProdRetained = \"YES\",RETAINED = \"NO\"), jmftol9,microjmftol9))),\"\",IF(OR(INDEX(INDIRECT(Grade),9,5)&INDEX(INDIRECT(Grade),9,6)=\"\",JMFDes9=\"\"),\"\",IF(AND(ProdRetained = \"YES\",RETAINED = \"NO\"), jmftol9,microjmftol9)))","v":""},null,null,null,null,{"$f":"IF(OR($P51=\"\",JMFDes9=\"\"),\"\",IF(RETAINED = \"NO\",IF(AND(JMFDes9>=INDEX(INDIRECT(Grade),9,5),JMFDes9<=INDEX(INDIRECT(Grade),9,6),ABS((MixDes8-MixDes9)-(JMFDes8-JMFDes9))<=INDEX(INDIRECT(Grade),9,8)),\"þ\",\"ý\"),IF(AND(JMFDes9>=INDEX(INDIRECT(Grade),9,5),JMFDes9<=INDEX(INDIRECT(Grade),9,6),ABS((MixDes9)-(JMFDes9))<=INDEX(INDIRECT(Grade),9,8)),\"þ\",\"ý\")))","v":""},{"$f":"IF(OR(I51=\"\",JMFDes9=\"\"),\"\",IF(OR(JMFDes9<INDEX(INDIRECT(Grade),9,10),JMFDes9>INDEX(INDIRECT(Grade),9,11)),\"þ\",\"ý\"))","v":""},{"$f":"IF(ISERROR(INDEX(INDIRECT(Grade),9,IF(specyear = \"1995\",3,2))),\"\",INDEX(INDIRECT(Grade),9,IF(specyear = \"1995\",3,2)))","v":""}]
[null,{"$f":"IF(ISERROR(INDEX(INDIRECT(Grade),10,IF(specyear = \"1995\",3,2))),\"\",INDEX(INDIRECT(Grade),10,IF(specyear = \"1995\",3,2)))","v":""},null,null,{"$f":"IF(ISERROR(INDEX(INDIRECT(Grade),10,4)),\"\",INDEX(INDIRECT(Grade),10,4))","v":""},null,{"$f":"IF(ISERROR(OR(INDEX(INDIRECT(Grade),10,5),INDEX(INDIRECT(Grade),10,6))),\"\",INDEX(INDIRECT(Grade),10,5) & \"-\" & INDEX(INDIRECT(Grade),10,6))","v":""},null,{"$f":"IF(ISERROR(OR(INDEX(INDIRECT(Grade),10,10),INDEX(INDIRECT(Grade),10,11))),\"\",INDEX(INDIRECT(Grade),10,10) & \"-\" & INDEX(INDIRECT(Grade),10,11))","v":""},null,null,null,null,{"$f":"IF(OR($G52=\"\",MixDes10=\"\"),\"\",IF(AND(MixDes10>=INDEX(INDIRECT(Grade),10,5),MixDes10<=INDEX(INDIRECT(Grade),10,6)),\"þ\",\"ý\"))","v":""},{"$f":"IF(OR(I52=\"\",MixDes10=\"\"),\"\",IF(OR(MixDes10<INDEX(INDIRECT(Grade),10,10),MixDes10>INDEX(INDIRECT(Grade),10,11)),\"þ\",\"ý\"))","v":""},{"$f":"IF(ISERROR(IF(OR(INDEX(INDIRECT(Grade),10,5)&INDEX(INDIRECT(Grade),10,6)=\"\",JMFDes10=\"\"),\"\",IF(AND(ProdRetained = \"YES\",RETAINED = \"NO\"), jmftol10,microjmftol10))),\"\",IF(OR(INDEX(INDIRECT(Grade),10,5)&INDEX(INDIRECT(Grade),10,6)=\"\",JMFDes10=\"\"),\"\",IF(AND(ProdRetained = \"YES\",RETAINED = \"NO\"), jmftol10,microjmftol10)))","v":""},null,null,null,null,{"$f":"IF(OR($P52=\"\",JMFDes10=\"\"),\"\",IF(RETAINED = \"NO\",IF(AND(JMFDes10>=INDEX(INDIRECT(Grade),10,5),JMFDes10<=INDEX(INDIRECT(Grade),10,6),ABS((MixDes9-MixDes10)-(JMFDes9-JMFDes10))<=INDEX(INDIRECT(Grade),10,8)),\"þ\",\"ý\"),IF(AND(JMFDes10>=INDEX(INDIRECT(Grade),10,5),JMFDes10<=INDEX(INDIRECT(Grade),10,6),ABS((MixDes10)-(JMFDes10))<=INDEX(INDIRECT(Grade),10,8)),\"þ\",\"ý\")))","v":""},{"$f":"IF(OR(I52=\"\",JMFDes10=\"\"),\"\",IF(OR(JMFDes10<INDEX(INDIRECT(Grade),10,10),JMFDes10>INDEX(INDIRECT(Grade),10,11)),\"þ\",\"ý\"))","v":""},{"$f":"IF(ISERROR(INDEX(INDIRECT(Grade),10,IF(specyear = \"1995\",3,2))),\"\",INDEX(INDIRECT(Grade),10,IF(specyear = \"1995\",3,2)))","v":""}]
[]
[null,null,null,null,null,"% White Rock",null,null,null,null,"% LRA",null,null,null,null,"% Virgin Agg."]
[]
[null,"DETERMINING DENSITY & PROPERTIES OF BITUMINOUS MIXTURES"]
[]
[null,"Press correlation factor used?",null,null,null,null,null,null,null,null,null,null,"Ge (Effective) specific gravity:",null,null,null,null,null,null,null,null,"% Mineral Filler (by wt. of dry aggregate)",null,null,null,null,null,null,"Mineral filler should be between 0.5% and 3.0%"]
[null,"Press correlation factor:",null,null,null,null,null,null,null,null,null,null,"G1 (specific gravity of asphalt):"]
[null,"TxDOT press ID & serial no.:",null,null,null,null,null,null,null,null,null,null,"Theoretical max.specific gravity:",null,null,null,null,null,null,null,null,"Wet Track Abrasion Wear Value (g/sq. ft.)",null,null,null,null,null,null,"Maximum value is 75"]
[null,"Contractor press ID no.:",null,null,null,null,null,null,null,null,null,null,"Mix design target density:"]
[null,null,null,null,null,null,null,null,null,null,null,null,null,null,null,null,null,null,{"$f":"IF(AND(TargetDensity=\"\",AvgDensityTx1<>\"\",Grade<>\"\"),\"*Input a target density\",IF(AND(LEFT(Grade,3)=\"LRA\",OR(91<TargetDensity,TargetDensity<87)),\"*Target density does not meet specifications\",IF(AND(MID(Grade,5,3)=\"334\",OR(TargetDensity<91,94<TargetDensity)),\"*Target density does not meet specifications\",\"\")))","v":""}]
[null,"DETERMINING STATIC CREEP:Tex-231-F"]
[]
[null,null,null,null,null,null,null,"Permanent strain, in/in:"]
[null,null,null,null,null,null,null,"Stiffness, psi:"]
[null,null,null,null,null,null,null,"Creep slope, in/in/sec:"]
[null,"DETERMINING HVEEM STABILITY OF BITUMINOUS MIXTURES: Tex-208-F"]
[]
[null,null,null,null,"Design's HVEEM Stability, %:"]
[null,"HAMBURG: Tex-242-F"]
[]
[null,null,null,null,null,"No. of  Passes",null,null,null,"RUT Depth",null,null,null,null,"IDT: Tex-226"]
[null,null,null,null,null,null,null,null,null,null,null,null,null,null,null,null,null,"Psi"]
[null,null,null,null,null,"* Not within Tolerence"]
[null,null,null,null,null,null,null,null,null,null," "]
[null,"Remarks:",null,null,{"$f":"NOW()","v":"2024-10-09T14:24:31.340"}]
[]
[]
[]
[]
[]
[null,"Test Method",null,null,"Tested By:",null,null,null,null,null,null,null,null,null,"Tested Date:"]
[null,"TX126"]
[]
[null,"TX207"]
[]
[null,"TX207PI"]
[]
[null,"TX208"]
[]
[null,"TX210"]
[]
[null,"TX212"]
[]
[null,"TX213"]
[]
[null,"TX217"]
[]
[null,"TX227"]
[]
[null,"TX227PII"]
[]
[null,"TX228"]
[]
[null,"TX229"]
[]
[null,"TX231"]
[]
[null,"TX235"]
[]
[null,"TX236"]
[]
[null,"TX236PI"]
[]
[null,"TX530"]
[]
[null,"TX531"]
[null,"Test Stamp Code:",null,null,null,null,null,null,null,null,null,"Omit Test:",null,null,"Completed Date:",null,null,"Reviewed By:"]
[]
[null,"Locked By:",null,null,"TxDOT:",null,null,"District:",null,null,"Area:"]
[null,"",null,null,"",null,null,"",null,null,""]
[null,"Authorized By:",null,null,null,null,null,null,null,null,null,"Authorized Date:"]
[null,null,null,null,null,null,null,null,null,null,null,null,null,null,{"$f":"IF(OR(authorizeddate>40373,authorizeddate=\"\"),4,IF(authorizeddate>39295,3,IF(authorizeddate>38553,2,1)))","v":4}]

{"sheet":"Test_Data","index":2,"n_rows":115,"n_cols":27,"rows_kept":115,"cut":false,"hidden":false,"merged":[[89,14,89,15],[89,16,89,17],[80,17,80,18],[80,15,80,16],[80,9,80,10],[80,1,80,6],[89,18,89,19],[80,7,80,8],[77,15,77,16],[85,13,85,14],[64,1,64,6],[89,20,89,21],[89,6,89,7],[89,8,89,9],[89,10,89,11],[89,12,89,13],[87,1,87,21],[64,7,64,8],[64,9,64,10],[64,11,64,12],[70,11,70,12],[71,11,71,12],[71,13,71,14],[71,7,71,8],[71,9,71,10],[70,9,70,10],[70,13,70,14],[69,17,69,18],[64,20,64,25],[84,7,84,8],[77,17,77,18],[77,13,77,14],[76,13,76,14],[76,15,76,16],[96,14,96,15],[78,1,78,6],[74,7,74,8],[76,1,76,6],[76,7,76,8],[76,9,76,10],[76,11,76,12],[72,7,72,8],[74,9,74,10],[74,1,74,6],[74,11,74,12],[83,13,83,14],[82,13,82,14],[80,11,80,12],[78,9,78,10],[77,7,77,8],[78,11,78,12],[77,9,77,10],[80,13,80,14],[77,11,77,12],[78,13,78,14],[72,15,72,16],[73,7,73,8],[73,9,73,10],[90,1,90,5],[91,1,91,5],[92,1,92,5],[93,1,93,5],[94,1,94,5],[95,1,95,5],[96,1,96,5],[90,6,90,7],[98,1,98,5],[97,1,97,5],[98,6,98,7],[96,6,96,7],[94,18,94,19],[95,18,95,19],[94,14,94,15],[94,20,94,21],[95,8,95,9],[95,6,95,7],[95,12,95,13],[95,14,95,15],[93,18,93,19],[93,20,93,21],[95,20,95,21],[95,16,95,17],[94,16,94,17],[94,10,94,11],[94,12,94,13],[95,10,95,11],[94,6,94,7],[94,8,94,9],[90,16,90,17],[93,16,93,17],[93,14,93,15],[91,6,91,7],[90,10,90,11],[90,12,90,13],[91,10,91,11],[91,12,91,13],[93,10,93,11],[93,12,93,13],[90,8,90,9],[93,8,93,9],[91,8,91,9],[93,6,93,7],[46,9,46,10],[46,11,46,12],[57,9,57,10],[59,13,59,14],[56,1,56,6],[46,5,46,6],[60,9,60,10],[56,7,56,8],[56,9,56,10],[59,9,59,10],[56,11,56,12],[59,1,59,6],[91,20,91,21],[90,18,90,19],[90,14,90,15],[60,26,60,27],[83,1,83,6],[57,1,57,6],[61,1,61,6],[58,1,58,6],[62,1,62,6],[82,1,82,6],[66,1,66,6],[63,1,63,6],[68,1,68,6],[58,7,58,8],[57,15,57,16],[60,1,60,6],[60,11,60,12],[80,20,80,25],[73,13,73,14],[72,9,72,10],[72,11,72,12],[73,15,73,16],[60,15,60,16],[59,11,59,12],[63,7,63,8],[63,9,63,10],[63,11,63,12],[70,15,70,16],[78,15,78,16],[79,20,79,25],[88,6,88,13],[88,14,88,21],[81,20,81,25],[82,20,82,25],[83,20,83,25],[85,1,85,6],[85,7,85,8],[70,1,70,6],[70,7,70,8],[69,11,69,12],[69,9,69,10],[72,13,72,14],[69,1,69,6],[68,13,68,14],[68,15,68,16],[66,7,66,8],[66,9,66,10],[69,7,69,8],[74,20,74,25],[76,20,76,25],[71,20,71,25],[72,20,72,25],[70,20,70,25],[71,1,71,6],[72,1,72,6],[77,1,77,6],[84,1,84,6],[79,1,79,6],[79,7,79,8],[79,17,79,18],[79,9,79,10],[79,11,79,12],[79,13,79,14],[79,15,79,16],[78,17,78,18],[73,1,73,6],[22,11,22,12],[54,7,54,12],[58,9,58,10],[40,13,40,14],[46,7,46,8],[45,9,45,10],[45,11,45,12],[55,1,55,6],[21,11,21,12],[57,11,57,12],[22,14,22,23],[49,9,49,10],[46,3,46,4],[33,5,36,6],[34,18,34,25],[38,18,38,25],[33,1,36,2],[39,9,39,10],[39,11,39,12],[39,13,39,14],[33,11,36,12],[36,3,36,4],[55,17,55,18],[49,7,49,8],[28,18,28,25],[23,14,23,23],[24,14,24,23],[39,18,39,25],[40,18,40,25],[26,1,26,10],[24,11,24,12],[24,1,24,10],[41,18,41,25],[25,1,25,8],[31,15,31,16],[31,7,31,8],[31,1,31,6],[31,9,31,14],[29,1,29,16],[30,1,30,16],[27,1,27,8],[27,9,27,10],[25,10,25,12],[25,14,25,23],[33,16,36,16],[33,3,35,4],[33,7,36,8],[33,9,36,10],[57,20,57,25],[20,14,20,23],[20,26,20,27],[13,21,13,27],[28,26,28,27],[32,18,32,25],[30,18,30,25],[31,18,31,25],[29,18,29,25],[25,26,25,27],[31,26,31,27],[21,26,21,27],[22,26,22,27],[23,24,23,25],[24,24,24,25],[25,24,25,25],[32,26,32,27],[29,26,29,27],[30,26,30,27],[23,26,23,27],[24,26,24,27],[20,24,20,25],[22,24,22,25],[21,24,21,25],[8,1,8,6],[8,7,8,13],[8,21,8,27],[21,14,21,23],[7,1,7,6],[22,8,22,10],[13,1,13,6],[13,7,13,13],[22,1,22,5],[20,4,20,5],[21,4,21,5],[20,1,20,3],[21,1,21,3],[20,11,20,12],[22,6,22,7],[18,14,18,23],[15,18,15,22],[10,7,10,13],[15,7,15,10],[15,11,15,13],[17,14,17,23],[17,24,17,25],[20,6,20,10],[21,6,21,10],[9,21,9,27],[9,14,9,20],[19,26,19,27],[19,1,19,10],[17,26,17,27],[15,23,15,27],[18,24,18,25],[15,14,15,17],[17,1,18,12],[19,24,19,25],[13,14,13,20],[18,26,18,27],[19,14,19,23],[12,7,12,27],[12,1,12,6],[10,21,10,27],[9,1,9,6],[10,14,10,20],[10,1,10,6],[9,7,9,13],[4,21,4,27],[6,21,6,27],[7,7,7,13],[7,14,7,20],[7,21,7,27],[5,1,5,6],[5,7,5,13],[5,21,5,27],[6,14,6,20],[4,1,4,6],[4,7,4,13],[4,14,4,20],[5,14,5,20],[6,1,6,6],[6,7,6,13],[62,7,62,8],[61,9,61,10],[15,1,15,6],[8,14,8,20],[55,9,55,10],[51,3,51,4],[51,5,51,15],[40,1,40,2],[40,3,40,4],[40,5,40,6],[40,7,40,8],[41,9,41,10],[54,13,54,18],[55,15,55,16],[55,11,55,12],[54,1,54,6],[41,11,41,12],[41,13,41,14],[42,5,42,6],[45,1,45,2],[45,3,45,4],[45,5,45,6],[45,7,45,8],[49,1,49,2],[42,13,42,14],[43,13,43,14],[58,13,58,14],[49,13,49,14],[53,1,53,18],[49,3,49,4],[49,5,49,6],[55,7,55,8],[55,13,55,14],[48,3,48,4],[48,5,48,15],[50,1,50,2],[50,3,50,4],[57,17,57,18],[57,13,57,14],[43,1,43,2],[43,3,43,4],[42,9,42,10],[42,11,42,12],[43,5,43,6],[43,7,43,8],[43,9,43,10],[43,11,43,12],[58,11,58,12],[55,26,55,27],[59,26,59,27],[61,13,61,14],[62,13,62,14],[66,17,66,18],[58,20,58,25],[66,15,66,16],[64,15,64,16],[63,17,63,18],[58,15,58,16],[62,15,62,16],[60,20,60,25],[61,20,61,25],[60,17,60,18],[58,17,58,18],[59,17,59,18],[59,20,59,25],[64,17,64,18],[63,20,63,25],[62,20,62,25],[66,13,66,14],[64,26,64,27],[62,17,62,18],[63,26,63,27],[53,20,53,25],[56,17,56,18],[37,1,37,2],[37,3,37,4],[37,5,37,6],[38,11,38,12],[38,13,38,14],[39,1,39,2],[39,3,39,4],[37,7,37,8],[37,9,37,10],[37,11,37,12],[37,13,37,14],[38,1,38,2],[38,3,38,4],[38,5,38,6],[38,7,38,8],[38,9,38,10],[39,5,39,6],[39,7,39,8],[45,18,45,25],[56,20,56,25],[52,20,52,25],[40,11,40,12],[59,15,59,16],[40,9,40,10],[44,13,44,14],[54,26,54,27],[57,26,57,27],[42,26,42,27],[33,13,36,14],[33,15,36,15],[37,18,37,25],[33,18,33,25],[36,18,36,27],[33,26,33,27],[46,13,46,14],[56,13,56,14],[40,26,40,27],[41,26,41,27],[38,26,38,27],[34,26,34,27],[37,26,37,27],[56,26,56,27],[53,26,53,27],[44,18,44,25],[42,18,42,25],[43,18,43,25],[45,26,45,27],[43,26,43,27],[44,26,44,27],[51,20,51,27],[52,26,52,27],[108,19,108,21],[105,13,107,15],[39,26,39,27],[83,7,83,8],[82,7,82,8],[57,7,57,8],[59,7,59,8],[61,7,61,8],[60,7,60,8],[78,7,78,8],[108,13,108,15],[108,11,108,12],[105,11,107,12],[108,16,108,18],[48,16,48,23],[49,16,49,23],[56,15,56,16],[54,20,54,25],[55,20,55,25],[112,13,112,15],[112,11,112,12],[109,11,109,21],[110,16,111,18],[110,19,111,21],[112,19,112,21],[112,16,112,18],[110,11,111,12],[110,13,111,15],[44,1,44,2],[44,3,44,4],[44,5,44,6],[44,7,44,8],[41,3,41,4],[41,5,41,6],[41,7,41,8],[41,1,41,2],[42,1,42,2],[42,3,42,4],[42,7,42,8],[44,9,44,10],[68,7,68,8],[73,11,73,12],[95,23,95,26],[95,27,95,30],[98,17,98,24],[79,26,79,27],[78,20,78,25],[77,26,77,27],[61,26,61,27],[65,26,65,27],[62,9,62,10],[65,20,65,25],[66,20,66,25],[69,15,69,16],[67,26,67,27],[68,20,68,25],[68,26,68,27],[69,20,69,25],[69,26,69,27],[73,26,73,27],[71,26,71,27],[72,26,72,27],[70,26,70,27],[67,20,67,25],[58,26,58,27],[66,26,66,27],[76,26,76,27],[73,17,73,18],[71,17,71,18],[70,17,70,18],[68,11,68,12],[64,13,64,14],[66,11,66,12],[69,13,69,14],[61,11,61,12],[63,13,63,14],[62,11,62,12],[61,15,61,16],[63,15,63,16],[60,13,60,14],[62,26,62,27],[74,13,74,14],[71,15,71,16],[74,17,74,18],[74,15,74,16],[76,17,76,18],[61,17,61,18],[99,17,99,20],[99,21,99,24],[105,19,107,21],[68,9,68,10],[94,27,94,30],[93,23,93,30],[84,23,84,25],[84,13,84,14],[84,26,84,27],[90,20,90,21],[91,14,91,15],[91,16,91,17],[94,23,94,26],[91,18,91,19],[83,26,83,27],[78,26,78,27],[82,26,82,27],[81,26,81,27],[80,26,80,27],[68,17,68,18],[72,17,72,18],[74,26,74,27],[73,20,73,25],[77,20,77,25],[107,1,107,5],[100,21,100,24],[100,1,100,8],[101,1,101,4],[101,5,101,8],[100,12,100,19],[101,17,101,19],[104,11,104,21],[105,16,107,18],[107,6,107,7],[107,8,107,9],[105,6,105,7],[105,8,105,9],[106,6,106,7],[106,8,106,9],[106,1,106,5],[104,1,104,9],[101,12,101,16],[114,23,115,26],[11,1,11,6],[11,7,11,27],[49,11,49,12],[47,1,47,2],[47,3,47,4],[46,1,46,2],[114,1,115,7],[114,8,115,10],[102,1,102,4],[45,13,45,14],[44,11,44,12],[114,20,115,22],[114,15,115,19],[114,11,115,13],[102,5,102,8],[112,1,112,7],[112,8,112,9],[109,6,109,7],[109,8,109,9],[109,1,109,5],[110,6,110,7],[110,8,110,9],[110,1,110,5]]}
[null,"TEXAS DEPARTMENT OF TRANSPORTATION"]
[null,{"$f":"IF(location=\"\",\"\",location)","v":""}]
[]
[null,"TEST DATA"]
[null,"SAMPLE ID:",null,null,null,null,null,{"$f":"IF(sampleid=\"\",\"\",sampleid)","v":""},null,null,null,null,null,null,"DATE LOT OPENED:",null,null,null,null,null,null,{"$f":"IF(sampleddate=\"\",\"\",sampleddate)","v":""}]
[null,"LOT NUMBER:",null,null,null,null,null,{"$f":"IF(testnumber=\"\",\"\",testnumber)","v":""},null,null,null,null,null,null,"LETTING DATE:",null,null,null,null,null,null,{"$f":"IF(lettingdate=\"\",\"\",lettingdate)","v":""}]
[null,"SAMPLE STATUS:",null,null,null,null,null,{"$f":"IF(status=\"\",\"\",status)","v":""},null,null,null,null,null,null,"CONTROLLING CSJ:",null,null,null,null,null,null,{"$f":"IF(ccsj=\"\",\"\",ccsj)","v":""}]
[null,"COUNTY:",null,null,null,null,null,{"$f":"IF(county=\"\",\"\",county)","v":""},null,null,null,null,null,null,"SPEC YEAR:",null,null,null,null,null,null,{"$f":"IF(specyear=\"\",\"\",specyear)","v":""}]
[null,"SAMPLED BY:",null,null,null,null,null,{"$f":"IF(sampledby=\"\",\"\",sampledby)","v":""},null,null,null,null,null,null,"SPEC ITEM:",null,null,null,null,null,null,{"$f":"IF(specitem=\"\",\"\",specitem)","v":""}]
[null,"SAMPLE LOCATION:",null,null,null,null,null,{"$f":"IF(samplelocation=\"\",\"\",samplelocation)","v":""},null,null,null,null,null,null,"SPECIAL PROVISION:",null,null,null,null,null,null,{"$f":"IF(specialprovision=\"\",\"\",specialprovision)","v":""}]
[null,"MATERIAL CODE:",null,null,null,null,null,{"$f":"IF(material=\"\",\"\",material)","v":""},null,null,null,null,null,null,"MIX TYPE:",null,null,null,null,null,null,{"$f":"IF(Grade=\"\",\"\",Grade)","v":""}]
[null,"MATERIAL NAME:",null,null,null,null,null,{"$f":"IF(matl_nm=\"\",\"\",matl_nm)","v":""}]
[null,"PRODUCER:",null,null,null,null,null,{"$f":"IF(producer=\"\",\"\",producer)","v":""}]
[null,"AREA ENGINEER:",null,null,null,null,null,{"$f":"IF(areaengineer=\"\",\"\",areaengineer)","v":""},null,null,null,null,null,null,"PROJECT MANAGER:",null,null,null,null,null,null,{"$f":"IF(projectmanager=\"\",\"\",projectmanager)","v":""}]
[]
[null,"COURSE\\LIFT:",null,null,null,null,null,{"$f":"IF(courselift=\"\",\"\",courselift)","v":""},null,null,null,"STATION:",null,null,{"$f":"IF(station=\"\",\"\",station)","v":""},null,null,null,"DIST. FROM CL:",null,null,null,null,{"$f":"IF(distfromcl=\"\",\"\",distfromcl)","v":""}]
[]
[null,{"$f":"IF(AsphaltMethod=\"Nuclear Method\",\"DETERMINATION OF ASPHALT CONTENT Nuclear Method: Tex-228-F\",IF(AsphaltMethod = \"Asphalt Meter\", \"DETERMINIATION OF ASPHALT CONTENT Asphalt Meter Method\",\"DETERMINATION OF ASPHALT CONTENT Ignition Oven Method: Tex-236-F\"))","v":"DETERMINATION OF ASPHALT CONTENT Ignition Oven Method: Tex-236-F"},null,null,null,null,null,null,null,null,null,null,null,null,"DETERMINATION OF RICE SPECIFIC GRAVITY-Tex-227-F",null,null,null,null,null,null,null,null,null,"Laboratory",null,"Roadway"]
[null,null,null,null,null,null,null,null,null,null,null,null,null,null," (A) Weight of  Dry Sample in Air:"]
[null,{"$f":" \"Asphalt Content from \" & IF(AsphaltMethod=\"Nuclear Method\", \"Nuclear \",IF(AsphaltMethod = \"Asphalt Meter\", \"Asphalt Meter \",\"Ignition \")) & IF(AsphaltMethod = \"Ignition Oven Method\",\"Method/Corrected, (%):\",\"Method, (%):\")","v":"Asphalt Content from Ignition Method, (%):"},null,null,null,null,null,null,null,null,null,null,{"$f":"IF(IgnAC=\"\",\"\",IgnAC+ACCorr)","v":""},null," (D) Weight of Calibrated Pyc. w/H2O:"]
[null,"Gauge No.",null,null,null,null,"Hydro-Volatile Content, %:",null,null,null,null,{"$f":"IF(HVContent = \"\",\"\",HVContent)","v":""},null,null,"(E) Weight of Sample, Pyc. and H2O:"]
[null,"Time:",null,null,null,null,"Moisture Content, %:",null,null,null,null,{"$f":"IF(MContent=\"\",\"\",MContent)","v":""},null,null,"A/(D+A-E) Rice Specific Gravity (Gr):",null,null,null,null,null,null,null,null,null,{"$f":"IF(ISERROR(Y19/(Y20+Y19-Y21)),\"\",Y19/(Y20+Y19-Y21))","v":""},null,{"$f":"IF(ISERROR(AA19/(AA20+AA19-AA21)),\"\",AA19/(AA20+AA19-AA21))","v":""}]
[null,"Calibration Ref. Number:",null,null,null,null,null,null,"Total AC, %:",null,null,{"$f":"IF(AA80<>\"\",AA80,IF(ISERROR(N(L20)+N(ACCorr)-N(L21)-N(L22)),\"\",N(L20)+N(ACCorr)-N(L21)-N(L22)))","v":0},null,null,"(Asd) Weight of Surface Dry Sample in Air:"]
[null,{"$f":"\"Asphalt content exceeds ±\" & INDEX(INDIRECT(Grade),1,18) - 0.001 & \"% tolerance from current JMF design specification of \" & JMFDesAC & \"%\"","v":{"$error":"#REF!"}},null,null,null,null,null,null,null,null,null,null,null,null,"A/(D+Asd-E) Rice Specific Gravity (Grc):",null,null,null,null,null,null,null,null,null,{"$f":"IF(ISERROR(+Y19/(Y20+Y23-Y21)),\"\",+Y19/(Y20+Y23-Y21))","v":""},null,{"$f":"IF(ISERROR(+AA19/(AA20+AA23-AA21)),\"\",+AA19/(AA20+AA23-AA21))","v":""}]
[null,"Ratio of Recycled to Total Binder, %",null,null,null,null,null,null,null,null,null,{"$f":"IF(OR(IgnAC=\"\",RecBinder=\"\"),\"\",RecBinder/(IgnAC+ACCorr)*100)","v":""},null,null,"(Gr-Grc/Grc) Percentage Difference:",null,null,null,null,null,null,null,null,null,{"$f":"IF(Y22=\"\",\"\",IF(Y24=\"\",\"\",(Y22-Y24)/Y24))","v":""},null,{"$f":"IF(AA22=\"\",\"\",IF(AA24=\"\",\"\",(AA22-AA24)/AA24))","v":""}]
[null,null,null,null,null,null,null,null,null,null,{"$f":"IF(L25=\"\",\"\",IF(OR(AND(courselift=\"Non-Surface (>8 in.)\",L25>RecBinderRatio),AND(courselift=\"Non-Surface (<8 in.)\",L25>RecBinderRatio),AND(courselift=\"Surface\",L25>RecBinderRatio),AND(courselift=\"Intermediate\",L25>RecBinderRatio),AND(courselift=\"Base\",L25>RecBinderRatio)),\"out of tolerance\",\"\"))","v":""},null,null,null,{"$f":"IF(Y25>0.01,\"A/(D+Asd-E)\",\"A/(D+A-E)\") & \" Rice Specific Gravity \" & IF(Y25>0.01,\"(Grc):\",\"(Gr):\")","v":"A/(D+Asd-E) Rice Specific Gravity (Grc):"},null,null,null,null,null,null,null,null,null,{"$f":"IF(Y25>0.003,Y24,Y22)","v":""},null,{"$f":"IF(AA25>0.003,AA24,AA22)","v":""}]
[null,"EFFECT OF WATER ON BITUMINOUS -Tex-530-C"]
[null,"Estimated Percent of Stripping:"]
[null,null,null,null,null,null,null,null,null,null,null,null,null,null,null,null,null,null,{"$f":"\"Determination of Moisture Tex-212-F \"& Field68 & \" :\"","v":"Determination of Moisture Tex-212-F  :"}]
[null,"GRADATION OF EXTRACTED AGGREGATE-Tex-229-F",null,null,null,null,null,null,null,null,null,null,null,null,null,null,null,null,{"$f":"IF(MoistureMethod=\"Part I\",\"Initial Weight of Pan & Sample (g):\",\"Still Number:\")","v":"Still Number:"}]
[null,{"$f":"\"GRADATION SAMPLE FROM \" & IF(ExtractAsphaltMethod = \"Belt Sample\", \"BELT SAMPLE\",IF(ExtractAsphaltMethod=\"Ignition Oven Method\",\"IGNITION OVEN\",\"\"))","v":"GRADATION SAMPLE FROM "},null,null,null,null,null,null,null,null,null,null,null,null,null,null,null,null,{"$f":"IF(MoistureMethod=\"Part I\",\"Pan Weight (g):\",\"Weight of Still & Sample (g):\")","v":"Weight of Still & Sample (g):"}]
[null,{"$f":"IF(ExtractAsphaltMethod=\"belt sample\",\"Belt Sample Original Dry Weight:\",IF(ExtractAsphaltMethod=\"Ignition Oven Method\",\"Ignited Sample Original Dry Weight:\",\"\"))","v":""},null,null,null,null,null,null,null,{"$f":"IF(ExtractAsphaltMethod=\"Extraction Method\",\"\",\"Dry Weight After Washing:\")","v":"Dry Weight After Washing:"},null,null,null,null,null,null,null,null,{"$f":"IF(MoistureMethod=\"Part I\",\"Final Weight of Pan & Sample (g):\",\"Still Weight (g):\")","v":"Still Weight (g):"}]
[null,null,null,null,null,null,null,null,null,null,null,null,null,null,null,null,null,null,"Sample Weight (g):",null,null,null,null,null,null,null,{"$f":"IF(AND(AA31=\"\",AA32=\"\"),\"\",AA31-AA32)","v":""}]
[null,"Sieve Size:",null,{"$f":"IF(Field75=\"\",\"Individual\",Field75) & \" Weight Retained (g)\"","v":"Individual Weight Retained (g)"},null,{"$f":"IF(RetainedMethodTx1=\"Cumulative\",\"Individual\",\"Cumulative\") &\" Weight Retained (g)\"","v":"Cumulative Weight Retained (g)"},null,{"$f":"IF(AND(ExtractAsphaltMethod=\"Ignition Oven Method\",SUM(Correlations)<>0),\"*Adjusted\",\"\") & \" Individual Percent Retained\"","v":" Individual Percent Retained"},null,{"$f":"IF(AND(ExtractAsphaltMethod=\"Ignition Oven Method\",SUM(Correlations)<>0),\"*Adjusted\",\"\") & \" Cumulative Percent Retained\"","v":" Cumulative Percent Retained"},null,{"$f":"IF(AND(ExtractAsphaltMethod=\"Ignition Oven Method\",SUM(Correlations)<>0),\"*Adjusted\",\"\") &\" Cumulative Percent Passing\"","v":" Cumulative Percent Passing"},null,{"$f":"\"JMF \" & IF(AND(RETAINED=\"YES\", ProdRetained=\"NO\"),\" Cumulative Retained Limits, %\",IF(ProdRetained=\"NO\",\" Cumulative Passing Limits, %\",\" Individual Retained Limits, %\"))","v":"JMF  Individual Retained Limits, %"},null,"In Tolerance","Restricted Zone",null,"Moisture Reading (g):"]
[null,null,null,null,null,null,null,null,null,null,null,null,null,null,null,null,null,null,"Moisture Content (%):",null,null,null,null,null,null,null,{"$f":"IF(ISERROR(IF(MoistureMethod=\"Part I\",100*(($AA$30-$AA32)/($AA$30-$AA31)),100*($AA$34/$AA$33))),\"\",IF(MoistureMethod=\"Part I\",100*(($AA$30-$AA32)/($AA$30-$AA31)),100*($AA$34/$AA$33)))","v":""}]
[]
[null,null,null,null,null,null,null,null,null,null,null,null,null,null,null,null,null,null,"Determination of Hydrocarbon-Volatile Content: Tex-213-F"]
[null,{"$f":"IF(sieve1=0,\"\",sieve1)","v":""},null,null,null,{"$f":"IF(D38=\"\",\"\",D38)","v":""},null,{"$f":"IF(ISERROR(100-L38),\"\",100-L38)","v":""},null,{"$f":"IF(ISERROR(H38),\"\",H38)","v":""},null,{"$f":"IF(D38=\"\",\"\",100-IF(RetainedMethodTx1=\"Cumulative\",D38/RetainedTotalTx1*100,F38/RetainedTotalTx1*100)+IF(ExtractAsphaltMethod=\"Ignition Oven Method\",IF(MID($B$4,19,1)=\"C\",IF(version > 1, CCorr1, -CCorr1),IF(version >1, Corr1, -Corr1)),0))","v":""},null,{"$f":"IF(OR('Design Data'!G43=\"\",JMFDes1=\"\"),\"\",IF(AND(RETAINED=\"YES\",ProdRetained=\"YES\"),testmicrojmftol1,IF(AND(version<4,INDEX(INDIRECT(Grade),1,25)=\"YES\"),TEXT(IF(AND(L38<>\"\",L38>INDEX(INDIRECT(Grade),1,6)),100-INDEX(INDIRECT(Grade),1,6),LEFT(testjmftol1,SEARCH(\"-\",testjmftol1,1)-1)),\"##0.0\") & \"-\" & TEXT(IF(AND(L38<>\"\",L38<INDEX(INDIRECT(Grade),1,5)),100-INDEX(INDIRECT(Grade),1,5),RIGHT(testjmftol1,LEN(testjmftol1)-SEARCH(\"-\",testjmftol1,1))),\"##0.0\"),testjmftol1)))","v":""},null,{"$f":"IF(OR('Design Data'!G43=\"\",JMFDes1=\"\",Field76=\"\"),\"\",gradaccept1)","v":""},{"$f":"IF(OR('Design Data'!I43=\"\",JMFDes1=\"\"),\"\",IF(OR($L38<INDEX(INDIRECT(Grade),1,10),$L38>INDEX(INDIRECT(Grade),1,11)),\"þ\",\"ý\"))","v":""},null,"Still Number:"]
[null,{"$f":"IF(sieve2=0,\"\",sieve2)","v":""},null,null,null,{"$f":"IF(D39=\"\",\"\",IF(RetainedMethodTx1=\"Cumulative\",(D39-SUM(F$38:F38)),SUM(D$38:D39)))","v":""},null,{"$f":"IF(ISERROR(L38-L39),\"\",L38-L39)","v":""},null,{"$f":"IF(ISERROR(J38+H39),\"\",J38+H39)","v":""},null,{"$f":"IF(D39=\"\",\"\",100-IF(RetainedMethodTx1=\"Cumulative\",D39/RetainedTotalTx1*100,F39/RetainedTotalTx1*100)+IF(ExtractAsphaltMethod=\"Ignition Oven Method\",IF(MID($B$4,19,1)=\"C\",IF(version > 1, CCorr2, -CCorr2),IF(version > 1, Corr2, -Corr2)),0))","v":""},null,{"$f":"IF(OR('Design Data'!G44=\"\",JMFDes2=\"\"),\"\", IF(AND(RETAINED=\"YES\",ProdRetained=\"YES\"),testmicrojmftol2,IF(AND(version<4,INDEX(INDIRECT(Grade),2,25)=\"YES\"),TEXT(IF(AND(L39<>\"\",L39>INDEX(INDIRECT(Grade),2,6)),L38-INDEX(INDIRECT(Grade),2,6),LEFT(testjmftol2,SEARCH(\"-\",testjmftol2,1)-1)),\"##0.0\") & \"-\" & TEXT(IF(AND(L39<>\"\",L39<INDEX(INDIRECT(Grade),2,5)),L38-INDEX(INDIRECT(Grade),2,5),RIGHT(testjmftol2,LEN(testjmftol2)-SEARCH(\"-\",testjmftol2,1))),\"##0.0\"),testjmftol2)))","v":""},null,{"$f":"IF(OR('Design Data'!G44=\"\",JMFDes2=\"\",Field78=\"\"),\"\",gradaccept2)","v":""},{"$f":"IF(OR('Design Data'!I44=\"\",JMFDes2=\"\"),\"\",IF(OR($L39<INDEX(INDIRECT(Grade),2,10),$L39>INDEX(INDIRECT(Grade),2,11)),\"þ\",\"ý\"))","v":""},null,"Still Weight (g):"]
[null,{"$f":"IF(sieve3=0,\"\",sieve3)","v":""},null,null,null,{"$f":"IF(D40=\"\",\"\",IF(RetainedMethodTx1=\"Cumulative\",(D40-SUM(F$38:F39)),SUM(D$38:D40)))","v":""},null,"",null,"",null,{"$f":"IF(D40=\"\",\"\",100-IF(RetainedMethodTx1=\"Cumulative\",D40/RetainedTotalTx1*100,F40/RetainedTotalTx1*100)+IF(ExtractAsphaltMethod=\"Ignition Oven Method\",IF(MID($B$4,19,1)=\"C\",IF(version > 1, CCorr3, -CCorr3),IF(version > 1, Corr3, -Corr3)),0))","v":""},null,{"$f":"IF(OR('Design Data'!G45=\"\",JMFDes3=\"\"),\"\",IF(AND(RETAINED=\"YES\",ProdRetained=\"YES\"),testmicrojmftol3, IF(AND(version<4,INDEX(INDIRECT(Grade),3,25)=\"YES\"),TEXT(IF(AND(L40<>\"\",L40>INDEX(INDIRECT(Grade),3,6)),L39-INDEX(INDIRECT(Grade),3,6),LEFT(testjmftol3,SEARCH(\"-\",testjmftol3,1)-1)),\"##0.0\") & \"-\" & TEXT(IF(AND(L40<>\"\",L40<INDEX(INDIRECT(Grade),3,5)),L39-INDEX(INDIRECT(Grade),3,5),RIGHT(testjmftol3,LEN(testjmftol3)-SEARCH(\"-\",testjmftol3,1))),\"##0.0\"),testjmftol3)))","v":""},null,{"$f":"IF(OR('Design Data'!G45=\"\",JMFDes3=\"\",Field80=\"\"),\"\",gradaccept3)","v":""},{"$f":"IF(OR('Design Data'!I45=\"\",JMFDes3=\"\"),\"\",IF(OR($L40<INDEX(INDIRECT(Grade),3,10),$L40>INDEX(INDIRECT(Grade),3,11)),\"þ\",\"ý\"))","v":""},null,"Weight of Still and Sample (g):"]
[null,{"$f":"IF(sieve4=0,\"\",sieve4)","v":""},null,null,null,{"$f":"IF(D41=\"\",\"\",IF(RetainedMethodTx1=\"Cumulative\",(D41-SUM(F$38:F40)),SUM(D$38:D41)))","v":""},null,"",null,"",null,{"$f":"IF(D41=\"\",\"\",100-IF(RetainedMethodTx1=\"Cumulative\",D41/RetainedTotalTx1*100,F41/RetainedTotalTx1*100)+IF(ExtractAsphaltMethod=\"Ignition Oven Method\",IF(MID($B$4,19,1)=\"C\",IF(version > 1, CCorr4, -CCorr4),IF(version > 1, Corr4, -Corr4)),0))","v":""},null,{"$f":"IF(OR('Design Data'!G46=\"\",JMFDes4=\"\"),\"\",IF(AND(RETAINED=\"YES\",ProdRetained=\"YES\"),testmicrojmftol4,IF(AND(version<4,INDEX(INDIRECT(Grade),4,25)=\"YES\"),TEXT(IF(AND(L41<>\"\",L41>INDEX(INDIRECT(Grade),4,6)),L40-INDEX(INDIRECT(Grade),4,6),LEFT(testjmftol4,SEARCH(\"-\",testjmftol4,1)-1)),\"##0.0\") & \"-\" & TEXT(IF(AND(L41<>\"\",L41<INDEX(INDIRECT(Grade),4,5)),L40-INDEX(INDIRECT(Grade),4,5),RIGHT(testjmftol4,LEN(testjmftol4)-SEARCH(\"-\",testjmftol4,1))),\"##0.0\"),testjmftol4)))","v":""},null,{"$f":"IF(OR('Design Data'!G46=\"\",JMFDes4=\"\",Field82=\"\"),\"\",gradaccept4)","v":""},{"$f":"IF(OR('Design Data'!I46=\"\",JMFDes4=\"\"),\"\",IF(OR($L41<INDEX(INDIRECT(Grade),4,10),$L41>INDEX(INDIRECT(Grade),4,11)),\"þ\",\"ý\"))","v":""},null,"Sample Weight (g):",null,null,null,null,null,null,null,{"$f":"IF(COUNTBLANK(AA39:AA40)=2,\"\",AA40-AA39)","v":""}]
[null,{"$f":"IF(sieve5=0,\"\",sieve5)","v":""},null,null,null,{"$f":"IF(D42=\"\",\"\",IF(RetainedMethodTx1=\"Cumulative\",(D42-SUM(F$38:F41)),SUM(D$38:D42)))","v":""},null,"",null,"",null,{"$f":"IF(D42=\"\",\"\",100-IF(RetainedMethodTx1=\"Cumulative\",D42/RetainedTotalTx1*100,F42/RetainedTotalTx1*100)+IF(ExtractAsphaltMethod=\"Ignition Oven Method\",IF(MID($B$4,19,1)=\"C\",IF(version > 1, CCorr5, -CCorr5),IF(version >1, Corr5, -Corr5)),0))","v":""},null,{"$f":"IF(OR('Design Data'!G47=\"\",JMFDes5=\"\"),\"\",IF(AND(RETAINED=\"YES\",ProdRetained=\"YES\"),testmicrojmftol5,IF(AND(version<4,INDEX(INDIRECT(Grade),5,25)=\"YES\"),TEXT(IF(AND(L42<>\"\",L42>INDEX(INDIRECT(Grade),5,6)),L41-INDEX(INDIRECT(Grade),5,6),LEFT(testjmftol5,SEARCH(\"-\",testjmftol5,1)-1)),\"##0.0\") & \"-\" & TEXT(IF(AND(L42<>\"\",L42<INDEX(INDIRECT(Grade),5,5)),L41-INDEX(INDIRECT(Grade),5,5),RIGHT(testjmftol5,LEN(testjmftol5)-SEARCH(\"-\",testjmftol5,1))),\"##0.0\"),testjmftol5)))","v":""},null,{"$f":"IF(OR('Design Data'!G47=\"\",JMFDes5=\"\",Field83=\"\"),\"\",gradaccept5)","v":""},{"$f":"IF(OR('Design Data'!I47=\"\",JMFDes5=\"\"),\"\",IF(OR($L42<INDEX(INDIRECT(Grade),5,10),$L42>INDEX(INDIRECT(Grade),5,11)),\"þ\",\"ý\"))","v":""},null,"Top Meniscus Reading (mL):"]
[null,{"$f":"IF(sieve6=0,\"\",sieve6)","v":""},null,null,null,{"$f":"IF(D43=\"\",\"\",IF(RetainedMethodTx1=\"Cumulative\",(D43-SUM(F$38:F42)),SUM(D$38:D43)))","v":""},null,"",null,"",null,{"$f":"IF(D43=\"\",\"\",100-IF(RetainedMethodTx1=\"Cumulative\",D43/RetainedTotalTx1*100,F43/RetainedTotalTx1*100)+IF(ExtractAsphaltMethod=\"Ignition Oven Method\",IF(MID($B$4,19,1)=\"C\",IF(version > 1, CCorr6, -CCorr6),IF(version >1, Corr6, -Corr6)),0))","v":""},null,{"$f":"IF(OR('Design Data'!G48=\"\",JMFDes6=\"\"),\"\", IF(AND(RETAINED=\"YES\",ProdRetained=\"YES\"),testmicrojmftol6,IF(AND(version<4,INDEX(INDIRECT(Grade),6,25)=\"YES\"),TEXT(IF(AND(L43<>\"\",L43>INDEX(INDIRECT(Grade),6,6)),L42-INDEX(INDIRECT(Grade),6,6),LEFT(testjmftol6,SEARCH(\"-\",testjmftol6,1)-1)),\"##0.0\") & \"-\" & TEXT(IF(AND(L43<>\"\",L43<INDEX(INDIRECT(Grade),6,5)),L42-INDEX(INDIRECT(Grade),6,5),RIGHT(testjmftol6,LEN(testjmftol6)-SEARCH(\"-\",testjmftol6,1))),\"##0.0\"),testjmftol6)))","v":""},null,{"$f":"IF(OR('Design Data'!G48=\"\",JMFDes6=\"\",Field85=\"\"),\"\",gradaccept6)","v":""},{"$f":"IF(OR('Design Data'!I48=\"\",JMFDes6=\"\"),\"\",IF(OR($L43<INDEX(INDIRECT(Grade),6,10),$L43>INDEX(INDIRECT(Grade),6,11)),\"þ\",\"ý\"))","v":""},null,"Bottom Meniscus Reading (mL):"]
[null,{"$f":"IF(sieve7=0,\"\",sieve7)","v":""},null,null,null,{"$f":"IF(D44=\"\",\"\",IF(RetainedMethodTx1=\"Cumulative\",(D44-SUM(F$38:F43)),SUM(D$38:D44)))","v":""},null,"",null,"",null,{"$f":"IF(D44=\"\",\"\",100-IF(RetainedMethodTx1=\"Cumulative\",D44/RetainedTotalTx1*100,F44/RetainedTotalTx1*100)+IF(ExtractAsphaltMethod=\"Ignition Oven Method\",IF(MID($B$4,19,1)=\"C\",IF(version > 1, CCorr7, -CCorr7),IF(version > 1, Corr7, -Corr7)),0))","v":""},null,{"$f":"IF(OR('Design Data'!G49=\"\",JMFDes7=\"\"),\"\",IF(AND(RETAINED=\"YES\",ProdRetained=\"YES\"),testmicrojmftol7,IF(AND(version<4,INDEX(INDIRECT(Grade),7,25)=\"YES\"),TEXT(IF(AND(L44<>\"\",L44>INDEX(INDIRECT(Grade),7,6)),L43-INDEX(INDIRECT(Grade),7,6),LEFT(testjmftol7,SEARCH(\"-\",testjmftol7,1)-1)),\"##0.0\") & \"-\" & TEXT(IF(AND(L44<>\"\",L44<INDEX(INDIRECT(Grade),7,5)),L43-INDEX(INDIRECT(Grade),7,5),RIGHT(testjmftol7,LEN(testjmftol7)-SEARCH(\"-\",testjmftol7,1))),\"##0.0\"),testjmftol7)))","v":""},null,{"$f":"IF(OR('Design Data'!G49=\"\",JMFDes7=\"\",Field87=\"\"),\"\",gradaccept7)","v":""},{"$f":"IF(OR('Design Data'!I49=\"\",JMFDes7=\"\"),\"\",IF(OR($L44<INDEX(INDIRECT(Grade),7,10),$L44>INDEX(INDIRECT(Grade),7,11)),\"þ\",\"ý\"))","v":""},null,"Volume of Volatiles (mL):",null,null,null,null,null,null,null,{"$f":"IF(COUNTBLANK(AA42:AA43)=2,\"\",AA42-AA43)","v":""}]
[null,{"$f":"IF(sieve8=0,\"\",sieve8)","v":""},null,null,null,{"$f":"IF(D45=\"\",\"\",IF(RetainedMethodTx1=\"Cumulative\",(D45-SUM(F$38:F44)),SUM(D$38:D45)))","v":""},null,"",null,"",null,{"$f":"IF(D45=\"\",\"\",100-IF(RetainedMethodTx1=\"Cumulative\",D45/RetainedTotalTx1*100,F45/RetainedTotalTx1*100)+IF(ExtractAsphaltMethod=\"Ignition Oven Method\",IF(MID($B$4,19,1)=\"C\",IF(version > 1, CCorr8, -CCorr8),IF(version > 1, Corr8, -Corr8)),0))","v":""},null,{"$f":"IF(OR('Design Data'!G50=\"\",JMFDes8=\"\"),\"\",IF(AND(RETAINED=\"YES\",ProdRetained=\"YES\"),testmicrojmftol8,IF(AND(version<4,INDEX(INDIRECT(Grade),8,25)=\"YES\"),TEXT(IF(AND(L45<>\"\",L45>INDEX(INDIRECT(Grade),8,6)),L44-INDEX(INDIRECT(Grade),8,6),LEFT(testjmftol8,SEARCH(\"-\",testjmftol8,1)-1)),\"##0.0\") & \"-\" & TEXT(IF(AND(L45<>\"\",L45<INDEX(INDIRECT(Grade),8,5)),L44-INDEX(INDIRECT(Grade),8,5),RIGHT(testjmftol8,LEN(testjmftol8)-SEARCH(\"-\",testjmftol8,1))),\"##0.0\"),testjmftol8)))","v":""},null,{"$f":"IF(OR('Design Data'!G50=\"\",JMFDes8=\"\",Field88=\"\"),\"\",gradaccept8)","v":""},{"$f":"IF(OR('Design Data'!I50=\"\",JMFDes8=\"\"),\"\",IF(OR($L45<INDEX(INDIRECT(Grade),8,10),$L45>INDEX(INDIRECT(Grade),8,11)),\"þ\",\"ý\"))","v":""},null,"Specific Gravity of Volatiles:"]
[null,{"$f":"IF(sieve9=0,\"\",sieve9)","v":""},null,null,null,{"$f":"IF(D46=\"\",\"\",IF(RetainedMethodTx1=\"Cumulative\",(D46-SUM(F$38:F45)),SUM(D$38:D46)))","v":""},null,"",null,"",null,{"$f":"IF(D46=\"\",\"\",100-IF(RetainedMethodTx1=\"Cumulative\",D46/RetainedTotalTx1*100,F46/RetainedTotalTx1*100)+IF(ExtractAsphaltMethod=\"Ignition Oven Method\",IF(MID($B$4,19,1)=\"C\",IF(version > 1, CCorr9, -CCorr9),IF(version > 1, Corr9, -Corr9)),0))","v":""},null,{"$f":"IF(OR('Design Data'!G51=\"\",JMFDes9=\"\"),\"\",IF(AND(RETAINED=\"YES\",ProdRetained=\"YES\"),testmicrojmftol9,IF(AND(version<4,INDEX(INDIRECT(Grade),9,25)=\"YES\"),TEXT(IF(AND(L46<>\"\",L46>INDEX(INDIRECT(Grade),9,6)),L45-INDEX(INDIRECT(Grade),9,6),LEFT(testjmftol9,SEARCH(\"-\",testjmftol9,1)-1)),\"##0.0\") & \"-\" & TEXT(IF(AND(L46<>\"\",L46<INDEX(INDIRECT(Grade),9,5)),L45-INDEX(INDIRECT(Grade),9,5),RIGHT(testjmftol9,LEN(testjmftol9)-SEARCH(\"-\",testjmftol9,1))),\"##0.0\"),testjmftol9)))","v":""},null,{"$f":"IF(OR('Design Data'!G51=\"\",JMFDes9=\"\",Field90=\"\"),\"\",gradaccept9)","v":""},{"$f":"IF(OR('Design Data'!I51=\"\",JMFDes9=\"\"),\"\",IF(OR($L46<INDEX(INDIRECT(Grade),9,10),$L46>INDEX(INDIRECT(Grade),9,11)),\"þ\",\"ý\"))","v":""},null,"Percent Hydrocarbon Volatiles (%):",null,null,null,null,null,null,null,{"$f":"IF(ISERROR(100*((AA44*AA45)/AA41)),\"\",100*((AA44*AA45)/AA41))","v":""}]
[null,{"$f":"IF(sieve10=0,\"\",sieve10)","v":""},null,null,null,{"$f":"IF(D47=\"\",\"\",IF(RetainedMethodTx1=\"Cumulative\",(D47-SUM(F$38:F46)),SUM(D$38:D47)))","v":""},null,"",null,"",null,{"$f":"IF(D47=\"\",\"\",100-IF(RetainedMethodTx1=\"Cumulative\",D47/RetainedTotalTx1*100,F47/RetainedTotalTx1*100)+IF(ExtractAsphaltMethod=\"Ignition Oven Method\",IF(MID($B$4,19,1)=\"C\",IF(version > 1, CCorr10, -CCorr10),IF(version >1, Corr10, -Corr10)),0))","v":""},null,{"$f":"IF(OR('Design Data'!G51=\"\",JMFDes10=\"\"),\"\",IF(INDEX(INDIRECT(Grade),10,8)=\"MGL\",INDEX(INDIRECT(Grade),10,5) & \"-\" & INDEX(INDIRECT(Grade),10,6),TEXT(IF(AND(JMFDes9-JMFDes10-INDEX(INDIRECT(Grade),10,8)>=0,JMFDes9-JMFDes10-INDEX(INDIRECT(Grade),10,8)<=100),JMFDes9-JMFDes10-INDEX(INDIRECT(Grade),10,8), TEXT(IF(JMFDes9-JMFDes10-INDEX(INDIRECT(Grade),10,8)>100,100,0),\"##0.0\")),\"##0.0\") & \"-\" & TEXT(IF(AND(JMFDes9-JMFDes10+INDEX(INDIRECT(Grade),10,8)>=0,JMFDes9-JMFDes10+INDEX(INDIRECT(Grade),10,8)<=100),JMFDes9-JMFDes10+INDEX(INDIRECT(Grade),10,8), TEXT(IF(JMFDes9-JMFDes10+INDEX(INDIRECT(Grade),10,8)>100,100,0),\"##0.0\")),\"##0.0\")))","v":""},null,{"$f":"IF(OR('Design Data'!G52=\"\",JMFDes10=\"\",Field302=\"\"),\"\",gradaccept10)","v":""},{"$f":"IF(OR('Design Data'!I52=\"\",JMFDes10=\"\"),\"\",IF(OR($L47<INDEX(INDIRECT(Grade),10,10),$L47>INDEX(INDIRECT(Grade),10,11)),\"þ\",\"ý\"))","v":""}]
[null,{"$f":"IF(Grade=\"\",\"\",\"-\" & OFFSET(B48,-COUNTIF(B38:B47,\"\")-1,0))","v":""},null,null,null,"*Adjusted for ignition oven correlation."]
[null,null,null,{"$f":"IF(ISERROR(IF(ODSWtx1<>\"\",ODSWtx1-IF(RetainedMethodTx1=\"Cumulative\",LARGE(D38:D48,1),SUM(D38:D48)),Teatx1-IF(RetainedMethodTx1=\"Cumulative\",LARGE(D38:D48,1),SUM(D38:D48)))),0,IF(ODSWtx1<>\"\",ODSWtx1-IF(RetainedMethodTx1=\"Cumulative\",LARGE(D38:D48,1),SUM(D38:D48)),Teatx1-IF(RetainedMethodTx1=\"Cumulative\",LARGE(D38:D48,1),SUM(D38:D48))))","v":0},null,{"$f":" IF(ODSWtx1<>\"\",IF(DWAWtx1<>\"\",\"Wash Loss\"&IF(slosstx1>0,\"-\",\"+\"),\"\"),IF(extractedmethod=\"vacuum\",\"Fines-Filter Aid\"&IF(slosstx1>0,\"-\",\"+\"),IF(extractedmethod=\"Chlorinated Centrifuge\",\"Fines+Buchner Fines\"&IF(slosstx1>0,\"-\",\"+\"),IF(extractedmethod=\"non-chlorinated centrifuge\",\"Total Ash+Fines\"&IF(slosstx1>0,\"-\",\"+\"),\"\"))))&IF(slosstx1>0,\"Gain (g)\",\"Loss (g)\")","v":"Gain (g)"},null,null,null,null,null,null,null,null,null,null,{"$f":"IF(H50=\"\",\"\",IF(AND(RETAINED=\"Yes\",OR($H$50<100-INDEX(INDIRECT(Grade),10-COUNTBLANK(B38:B47),6),$H$50>100-INDEX(INDIRECT(Grade),10-COUNTBLANK(B38:B47),5))),\"% passing #200 is outside the master grading limits\",\"\"))","v":""}]
[null,{"$f":"\"Total \" & B48","v":"Total "},null,{"$f":"IF(ISERROR(IF(RetainedMethodTx1=\"cumulative\",LARGE(D38:D48,1),PrePanTx1)+LossTx1),\"\",IF(RetainedMethodTx1=\"cumulative\",LARGE(D38:D48,1),PrePanTx1)+LossTx1)","v":0},null,{"$f":"IF(D48=\"\",\"\",IF(RetainedMethodTx1=\"Cumulative\",(D50-SUM(F$38:F47)),SUM(D$38:D47,PanTx1)))","v":""},null,{"$f":"IF(ISERROR(OFFSET(L48,-COUNTIF(B38:B47,\"\")-1,0)-L50),\"\",OFFSET(L48,-COUNTIF(B38:B47,\"\")-1,0)-L50)","v":""},null,{"$f":"IF(ISERROR(OFFSET(J48,-COUNTIF(B38:B47,\"\")-1,0)+H50),\"\",OFFSET(J48,-COUNTIF(B38:B47,\"\")-1,0)+H50)","v":""},null,{"$f":"IF(ISERROR(100-IF(RetainedMethodTx1=\"Cumulative\",D50/RetainedTotalTx1*100,F50/RetainedTotalTx1*100)),\"\",100-IF(RetainedMethodTx1=\"Cumulative\",D50/RetainedTotalTx1*100,F50/RetainedTotalTx1*100))","v":""},null,{"$f":"IF(SUM('Design Data'!R43:R52)=0,\"\",IF(ProdRetained = \"NO\",testmicrojmftol11,testjmftol11))","v":""},null,{"$f":"IF(F50=\"\",\"\",IF(AND(RETAINED=\"YES\",ProdRetained=\"NO\"),IF(OR(J50<INDEX(INDIRECT(Grade),(10-COUNTBLANK(B38:B47)),5),J50>100,100-J50>INDEX(INDIRECT(Grade),1,16)),\"ý\",\"þ\"),IF(AND(RETAINED = \"NO\", ProdRetained = \"NO\"),IF(OR(L50<0,L50>INDEX(INDIRECT(Grade),(10-COUNTBLANK(B38:B47)),6),100-L50>INDEX(INDIRECT(Grade),1,16)),\"ý\",\"þ\"),IF(OR(H50<INDEX(INDIRECT(Grade),(10-COUNTBLANK(B38:B47)),5),H50>INDEX(INDIRECT(Grade),(10-COUNTBLANK(B38:B47)),6),ABS(INDIRECT(\"JMFDES\"&(10-COUNTBLANK(B38:B47)))-H50)>INDEX(INDIRECT(Grade),1,16)),\"ý\",\"þ\"))))","v":""},{"$f":"IF(H50=\"\",\"\",IF(AND(RETAINED=\"No\",OR($H$50<INDEX(INDIRECT(Grade),10-COUNTBLANK(B38:B47),5),$H$50>INDEX(INDIRECT(Grade),10-COUNTBLANK(B38:B47),6))),\"% passing #200 is outside the master grading limits\",\"\"))","v":""}]
[null,"Total Weight:",null,{"$f":"IF(ISERROR(IF(RetainedMethodTx1=\"Cumulative\",PanTx1,SUM(D38:D47)+PanTx1)),\"\",IF(RetainedMethodTx1=\"Cumulative\",PanTx1,SUM(D38:D47)+PanTx1))","v":0}]
[null,null,null,{"$f":"IF(DWAWtx1<>\"\",IF(RetainedMethodTx1=\"Cumulative\",IF(ISERROR(LARGE(D38:D48,1)),0,LARGE(D38:D48,1)),SUM(D38:D48))-DWAWtx1,IF(ODSWtx1<>\"\",IF(RetainedMethodTx1=\"Cumulative\",IF(ISERROR(LARGE(D38:D48,1)),0,LARGE(D38:D48,1)),SUM(D38:D48))-ODSWtx1,IF(EAtx1<>\"\",IF(RetainedMethodTx1=\"Cumulative\",IF(ISERROR(LARGE(D38:D48,1)),0,LARGE(D38:D48,1)),SUM(D38:D48))-EAtx1,\"\")))","v":""},null,{"$f":"\"Sieving \" & IF(slosstx1>0,\"Gain\",\"Loss\") & \" (g), from \"& IF(DWAWtx1<>\"\",\"'dry weight after washing'\",IF(ODSWtx1<>\"\",\"'original dry sample'\",IF(EAtx1<>\"\",\"'extracted aggregate'\",\"?\")))","v":"Sieving Gain (g), from ?"},null,null,null,null,null,null,null,null,null,null,null,null,null,null,{"$f":"\"Extraction Method: Tex-210-F \" & \"by \" & extractedmethod & \":\"","v":"Extraction Method: Tex-210-F by :"}]
[null,null,{"$f":"OFFSET(L48,-COUNTIF(B38:B47,\"\")-1,0)","v":0},null,null,null,null,null,null,null,null,null,null,null,null,null,null,null,null,null,"Total Sample (g):"]
[null,"DETERMINING DENSITY & PROPERTIES OF BITUMINOUS MIXTURES-Tex-207-F",null,null,null,null,null,null,null,null,null,null,null,null,null,null,null,null,null,null,"Original Filter Paper (g):"]
[null,"Specimen Type:",null,null,null,null,null,"Laboratory",null,null,null,null,null,"Roadway",null,null,null,null,null,null,"Final Filter Paper (g):"]
[null,"Specimen Number:",null,null,null,null,null,"1(1)",null,"1(2)",null,"1(3)",null,"1(A)",null,"1(B)",null,"1(C)",null,null,"Fines in Filter Paper (g):",null,null,null,null,null,{"$f":"IF(AND(AA55=\"\",AA54=\"\"),\"\",AA55-AA54)","v":""}]
[null,"Specimen Radius (mm):",null,null,null,null,null,75,null,75,null,75,null,null,null,null,null,null,null,null,"Pan+Extracted Aggregate (g):"]
[null,{"$f":"IF(specyear=1995,\"Specimen Height (mm):\",IF(version>2,IF(AND(LEFT(Grade,6)=\"SS3022\",version>2),\"Specimen Height (mm):\",\"Untrimmed Specimen/Core Height (in):\"),\"Specimen Height (in):\"))","v":"Untrimmed Specimen/Core Height (in):"},null,null,null,null,null,null,null,null,null,null,null,null,null,null,null,null,null,null,"Pan (g):"]
[null,"Weight of Specimen in Air (g):",null,null,null,null,null,null,null,null,null,null,null,null,null,null,null,null,null,null,"Extracted Aggregate (g):",null,null,null,null,null,{"$f":"IF(AND(AA57=\"\",AA58=\"\"),\"\",AA57-AA58)","v":""}]
[null,{"$f":"IF(ParaffinUsed=\"Yes\",\"Wt of Spec.+\" & IF(sealingmethod=\"Paraffin\",\"Paraffin\",\"Vacuum Bag\") & \" in Water (g):\",\"Wt of Spec. in Water (g):\")","v":"Wt of Spec. in Water (g):"},null,null,null,null,null,null,null,null,null,null,null,null,null,null,null,null,null,null,{"$f":"IF(extractedmethod=\"non-chlorinated centrifuge\",\"Buchner+Filter+Fines (g):\",\"Dish + Ash per 100mL (g):\")","v":"Dish + Ash per 100mL (g):"}]
[null,{"$f":"IF(ParaffinUsed=\"Yes\",\"Wt of Spec.+\" & IF(sealingmethod=\"Paraffin\",\"Paraffin\",\"Vacuum Bag\") & \" in Air (g):\",\"SSD Wt of Specimen in Air (g):\")","v":"SSD Wt of Specimen in Air (g):"},null,null,null,null,null,null,null,null,null,null,null,null,null,null,null,null,null,null,{"$f":"IF(extractedmethod=\"non-chlorinated centrifuge\",\"Buchner + Filter (g):\",\"Dish (g):\")","v":"Dish (g):"}]
[null,"Volume of Specimen:",null,null,null,null,null,{"$f":"IF(AND(H61=\"\",H60=\"\"),\"\",H61-H60)","v":""},null,{"$f":"IF(AND(J61=\"\",J60=\"\"),\"\",J61-J60)","v":""},null,{"$f":"IF(AND(L61=\"\",L60=\"\"),\"\",L61-L60)","v":""},null,{"$f":"IF(AND(N61=\"\",N60=\"\"),\"\",N61-N60)","v":""},null,{"$f":"IF(AND(P61=\"\",P60=\"\"),\"\",P61-P60)","v":""},null,{"$f":"IF(AND(R61=\"\",R60=\"\"),\"\",R61-R60)","v":""},null,null,{"$f":"IF(extractedmethod=\"non-chlorinated centrifuge\",\"Fines per 200mL (g):\",\"Ash per 100mL (g):\")","v":"Ash per 100mL (g):"},null,null,null,null,null,{"$f":"IF(COUNTBLANK(AA60:AA61)=2,\"\",AA60-AA61)","v":""}]
[null,"Percent Absorption:",null,null,null,null,null,{"$f":"IF(ISERROR(100*((H61-H59)/(H61-H60))),\"\",100*((H61-H59)/(H61-H60)))","v":""},null,{"$f":"IF(ISERROR(100*((J61-J59)/(J61-J60))),\"\",100*((J61-J59)/(J61-J60)))","v":""},null,{"$f":"IF(ISERROR(100*((L61-L59)/(L61-L60))),\"\",100*((L61-L59)/(L61-L60)))","v":""},null,{"$f":"IF(ISERROR(100*((N61-N59)/(N61-N60))),\"\",100*((N61-N59)/(N61-N60)))","v":""},null,{"$f":"IF(ISERROR(100*((P61-P59)/(P61-P60))),\"\",100*((P61-P59)/(P61-P60)))","v":""},null,{"$f":"IF(ISERROR(100*((R61-R59)/(R61-R60))),\"\",100*((R61-R59)/(R61-R60)))","v":""},null,null,"Total Solvent (mL):"]
[4545,"Bag Required for Ga ?:",null,null,null,null,null,{"$f":"IF(ISNUMBER(H63),IF(H63>2,\"Yes\",\"No\"),\"\")","v":""},null,{"$f":"IF(ISNUMBER(J63),IF(J63>2,\"Yes\",\"No\"),\"\")","v":""},null,{"$f":"IF(ISNUMBER(L63),IF(L63>2,\"Yes\",\"No\"),\"\")","v":""},null,{"$f":"IF(ISNUMBER(N63),IF(N63>2,\"Yes\",\"No\"),\"\")","v":""},null,{"$f":"IF(ISNUMBER(P63),IF(P63>2,\"Yes\",\"No\"),\"\")","v":""},null,{"$f":"IF(ISNUMBER(R63),IF(R63>2,\"Yes\",\"No\"),\"\")","v":""},null,null,{"$f":"IF(extractedmethod=\"non-chlorinated centrifuge\",\"Total Fines (g):\",\"Total Ash (g):\")","v":"Total Ash (g):"},null,null,null,null,null,{"$f":"IF(ISERROR((AA62*AA63)/IF(extractedmethod=\"Non-Chlorinated Centrifuge\",200,100)),\"\",(AA62*AA63)/IF(extractedmethod=\"Non-Chlorinated Centrifuge\",200,100))","v":""}]
[null,"Bag Used for Ga?:",null,null,null,null,null,null,null,null,null,null,null,null,null,null,null,null,null,null,"Filtering Aid (g):"]
[]
[null,"Vacuum Bag Method Used:"]
[]
[null,"Weight of Specimen in Air (g):"]
[null,"Sealed Wt. of Specimen in Water (g):"]
[null,"Dry Spec. Wt. After Submersion, (g):"]
[null,"Paraffin Sealed Wt. of Spec. in Air (g):"]
[null,"Specific Gravity of Paraffin:"]
[null,"Weight of Vacuum Bag(s), (g):"]
[null,"Vacuum Bag Volume Correction Factor:",null,null,null,null,null,{"$f":"IF(ISERROR(IF(LEFT(H67,1)=\"L\",-0.00166*(H69/H74)+0.8596,IF(LEFT(H67,1)=\"S\",-0.000566*(H69/H74)+0.8121,IF(LEFT(H67,1)=\"D\",-0.0022448*(H69/H74)+0.85818,\"\")))),\"\",IF(LEFT(H67,1)=\"L\",-0.00166*(H69/H74)+0.8596,IF(LEFT(H67,1)=\"S\",-0.000566*(H69/H74)+0.8121,IF(LEFT(H67,1)=\"D\",-0.0022448*(H69/H74)+0.85818,\"\"))))","v":""},null,{"$f":"IF(ISERROR(IF(LEFT(J67,1)=\"L\",-0.00166*(J69/J74)+0.8596,IF(LEFT(J67,1)=\"S\",-0.000566*(J69/J74)+0.8121,IF(LEFT(J67,1)=\"D\",-0.0022448*(J69/J74)+0.85818,\"\")))),\"\",IF(LEFT(J67,1)=\"L\",-0.00166*(J69/J74)+0.8596,IF(LEFT(J67,1)=\"S\",-0.000566*(J69/J74)+0.8121,IF(LEFT(J67,1)=\"D\",-0.0022448*(J69/J74)+0.85818,\"\"))))","v":""},null,{"$f":"IF(ISERROR(IF(LEFT(L67,1)=\"L\",-0.00166*(L69/L74)+0.8596,IF(LEFT(L67,1)=\"S\",-0.000566*(L69/L74)+0.8121,IF(LEFT(L67,1)=\"D\",-0.0022448*(L69/L74)+0.85818,\"\")))),\"\",IF(LEFT(L67,1)=\"L\",-0.00166*(L69/L74)+0.8596,IF(LEFT(L67,1)=\"S\",-0.000566*(L69/L74)+0.8121,IF(LEFT(L67,1)=\"D\",-0.0022448*(L69/L74)+0.85818,\"\"))))","v":""},null,{"$f":"IF(ISERROR(IF(LEFT(N67,1)=\"L\",-0.00166*(N69/N74)+0.8596,IF(LEFT(N67,1)=\"S\",-0.000566*(N69/N74)+0.8121,IF(LEFT(N67,1)=\"D\",-0.0022448*(N69/N74)+0.85818,\"\")))),\"\",IF(LEFT(N67,1)=\"L\",-0.00166*(N69/N74)+0.8596,IF(LEFT(N67,1)=\"S\",-0.000566*(N69/N74)+0.8121,IF(LEFT(N67,1)=\"D\",-0.0022448*(N69/N74)+0.85818,\"\"))))","v":""},null,{"$f":"IF(ISERROR(IF(LEFT(P67,1)=\"L\",-0.00166*(P69/P74)+0.8596,IF(LEFT(P67,1)=\"S\",-0.000566*(P69/P74)+0.8121,IF(LEFT(P67,1)=\"D\",-0.0022448*(P69/P74)+0.85818,\"\")))),\"\",IF(LEFT(P67,1)=\"L\",-0.00166*(P69/P74)+0.8596,IF(LEFT(P67,1)=\"S\",-0.000566*(P69/P74)+0.8121,IF(LEFT(P67,1)=\"D\",-0.0022448*(P69/P74)+0.85818,\"\"))))","v":""},null,{"$f":"IF(ISERROR(IF(LEFT(R67,1)=\"L\",-0.00166*(R69/R74)+0.8596,IF(LEFT(R67,1)=\"S\",-0.000566*(R69/R74)+0.8121,IF(LEFT(R67,1)=\"D\",-0.0022448*(R69/R74)+0.85818,\"\")))),\"\",IF(LEFT(R67,1)=\"L\",-0.00166*(R69/R74)+0.8596,IF(LEFT(R67,1)=\"S\",-0.000566*(R69/R74)+0.8121,IF(LEFT(R67,1)=\"D\",-0.0022448*(R69/R74)+0.85818,\"\"))))","v":""}]
[]
[null,{"$f":"IF(Y29>0.01,\"Corrected Rice Specific Gravity (Grc):\",\"Rice Specific Gravity (Gr):\")","v":"Rice Specific Gravity (Gr):"},null,null,null,null,null,{"$f":"IF(OR(LEFT(Grade,6)=\"SS3269\", AND(LEFT(Grade,6)=\"SS3022\",version>2,specyear>=\"2004\")),IF(ISERROR(100/((100-M20)/GEorGBulkSG+(M20/G1SGAsph))),\"\",100/((100-M20)/GEorGBulkSG+(M20/G1SGAsph))),RiceTx1)","v":""},null,{"$f":"IF(OR(LEFT(Grade,6)=\"SS3269\",AND(LEFT(Grade,6)=\"SS3022\",version>2,specyear>=\"2004\")),IF(ISERROR(100/((100-M20)/GEorGBulkSG+(M20/G1SGAsph))),\"\",100/((100-M20)/GEorGBulkSG+(M20/G1SGAsph))),RiceTx1)","v":""},null,{"$f":"IF(OR(LEFT(Grade,6)=\"SS3269\",AND(LEFT(Grade,6)=\"SS3022\",version>2,specyear>=\"2004\")),IF(ISERROR(100/((100-M20)/GEorGBulkSG+(M20/G1SGAsph))),\"\",100/((100-M20)/GEorGBulkSG+(M20/G1SGAsph))),RiceTx1)","v":""},null,{"$f":"IF(ISERROR(IF(RoadwayRice=\"Yes\",RRiceTx1,RiceTx1)),\"\",IF(RoadwayRice=\"Yes\",RRiceTx1,IF(AND(LEFT(Grade,6)=\"SS3022\",version>2,specyear>=\"2004\"),IF(ISERROR(100/((100-M20)/GEorGBulkSG+(M20/G1SGAsph))),\"\",100/((100-M20)/GEorGBulkSG+(M20/G1SGAsph))),RiceTx1)))","v":""},null,{"$f":"IF(ISERROR(IF(RoadwayRice=\"Yes\",RRiceTx1,RiceTx1)),\"\",IF(RoadwayRice=\"Yes\",RRiceTx1,IF(AND(LEFT(Grade,6)=\"SS3022\",version>2,specyear>=\"2004\"),IF(ISERROR(100/((100-M20)/GEorGBulkSG+(M20/G1SGAsph))),\"\",100/((100-M20)/GEorGBulkSG+(M20/G1SGAsph))),RiceTx1)))","v":""},null,{"$f":"IF(ISERROR(IF(RoadwayRice=\"Yes\",RRiceTx1,RiceTx1)),\"\",IF(RoadwayRice=\"Yes\",RRiceTx1,IF(AND(LEFT(Grade,6)=\"SS3022\",version>2,specyear>=\"2004\"),IF(ISERROR(100/((100-M20)/GEorGBulkSG+(M20/G1SGAsph))),\"\",100/((100-M20)/GEorGBulkSG+(M20/G1SGAsph))),RiceTx1)))","v":""},null,null,{"$f":"IF(extractedmethod=\"Vacuum\",\"Fines+Aggregate-Filter Aid (g):\",\"Fines+Aggregate+Ash (g):\")","v":"Fines+Aggregate+Ash (g):"},null,null,null,null,null,{"$f":"IF(ISERROR(+AA56+AA59+IF(extractedmethod=\"Vacuum\",-AA65,AA64)),\"\",+AA56+AA59+IF(extractedmethod=\"Vacuum\",-AA65,AA64))","v":""}]
[null,{"$f":"IF(OR(LEFT(H65&J65&L65&N65&P65&R65,1)=\"Y\",AND(MID($B$4,19,1)=\"C\",PressCorrelationFactor<>\"\")),\"Adjusted \",\"\") & \"Bulk Specific Gravity, Ga:\"","v":"Bulk Specific Gravity, Ga:"},null,null,null,null,null,{"$f":"IF(OR(LEFT(Grade,6)=\"SS3269\",AND(LEFT(Grade,6)=\"SS3022\",version>2,specyear>=\"2004\")),IF(ISERROR(H59*1000/(3.14*H57^2*H58)),\"\",H59*1000/(3.14*H57^2*H58)), IF(version>3, IF(ISERROR(IF(H65<>\"Yes\",H59/H62,IF(H67=\"\",\"\",MIN(H59/H62,H71/(H74+H71-H70-(H74/H75))))) + PressCorrelationFactor),\"\",IF(H65<>\"Yes\",H59/H62,IF(H67=\"\",\"\",MIN(H59/H62,H71/(H74+H71-H70-(H74/H75))))) + PressCorrelationFactor),IF(ISERROR(IF(H65<>\"Yes\",H59/H62,IF(H67=\"\",\"\",IF(H67=\"Paraffin\",H69/(H71-H70-((H71-H69)/H73)), H71/(H74+H71-H70-(H74/H75))))) + PressCorrelationFactor),\"\",IF(H65<>\"Yes\",H59/H62,IF(H67=\"\",\"\",IF(H67=\"Paraffin\",H69/(H71-H70-((H71-H69)/H73)), H71/(H74+H71-H70-(H74/H75))))) + PressCorrelationFactor)))","v":""},null,{"$f":"IF(OR(LEFT(Grade,6)=\"SS3269\",AND(LEFT(Grade,6)=\"SS3022\",version>2,specyear>=\"2004\")),IF(ISERROR(J59*1000/(3.14*J57^2*J58)),\"\",J59*1000/(3.14*J57^2*J58)), IF(version>3, IF(ISERROR(IF(J65<>\"Yes\",J59/J62,IF(J67=\"\",\"\",MIN(J59/J62,J71/(J74+J71-J70-(J74/J75))))) + PressCorrelationFactor),\"\",IF(J65<>\"Yes\",J59/J62,IF(J67=\"\",\"\",MIN(J59/J62,J71/(J74+J71-J70-(J74/J75))))) + PressCorrelationFactor),IF(ISERROR(IF(J65<>\"Yes\",J59/J62,IF(J67=\"\",\"\",IF(J67=\"Paraffin\",J69/(J71-J70-((J71-J69)/J73)), J71/(J74+J71-J70-(J74/J75))))) + PressCorrelationFactor),\"\",IF(J65<>\"Yes\",J59/J62,IF(J67=\"\",\"\",IF(J67=\"Paraffin\",J69/(J71-J70-((J71-J69)/J73)), J71/(J74+J71-J70-(J74/J75))))) + PressCorrelationFactor)))","v":""},null,{"$f":"IF(OR(LEFT(Grade,6)=\"SS3269\",AND(LEFT(Grade,6)=\"SS3022\",version>2,specyear>=\"2004\")),IF(ISERROR(L59*1000/(3.14*L57^2*L58)),\"\",L59*1000/(3.14*L57^2*L58)), IF(version>3, IF(ISERROR(IF(L65<>\"Yes\",L59/L62,IF(L67=\"\",\"\",MIN(L59/L62,L71/(L74+L71-L70-(L74/L75))))) + PressCorrelationFactor),\"\",IF(L65<>\"Yes\",L59/L62,IF(L67=\"\",\"\",MIN(L59/L62,L71/(L74+L71-L70-(L74/L75))))) + PressCorrelationFactor),IF(ISERROR(IF(L65<>\"Yes\",L59/L62,IF(L67=\"\",\"\",IF(L67=\"Paraffin\",L69/(L71-L70-((L71-L69)/L73)), L71/(L74+L71-L70-(L74/L75))))) + PressCorrelationFactor),\"\",IF(L65<>\"Yes\",L59/L62,IF(L67=\"\",\"\",IF(L67=\"Paraffin\",L69/(L71-L70-((L71-L69)/L73)), L71/(L74+L71-L70-(L74/L75))))) + PressCorrelationFactor)))","v":""},null,{"$f":"IF(AND(LEFT(Grade,6)=\"SS3022\",version>2,specyear>=\"2004\"),IF(ISERROR(N59*1000/(3.14*N57^2*N58)),\"\",N59*1000/(3.14*N57^2*N58)), IF(version>3, IF(ISERROR(IF(N65<>\"Yes\",N59/N62,IF(N67=\"\",\"\",MIN(N59/N62,N71/(N74+N71-N70-(N74/N75))))) + PressCorrelationFactor),\"\",IF(N65<>\"Yes\",N59/N62,IF(N67=\"\",\"\",MIN(N59/N62,N71/(N74+N71-N70-(N74/N75))))) + PressCorrelationFactor),IF(ISERROR(IF(N65<>\"Yes\",N59/N62,IF(N67=\"\",\"\",IF(N67=\"Paraffin\",N69/(N71-N70-((N71-N69)/N73)), N71/(N74+N71-N70-(N74/N75))))) + PressCorrelationFactor),\"\",IF(N65<>\"Yes\",N59/N62,IF(N67=\"\",\"\",IF(N67=\"Paraffin\",N69/(N71-N70-((N71-N69)/N73)), N71/(N74+N71-N70-(N74/N75))))) + PressCorrelationFactor)))","v":""},null,{"$f":"IF(AND(LEFT(Grade,6)=\"SS3022\",version>2,specyear>=\"2004\"),IF(ISERROR(P59*1000/(3.14*P57^2*P58)),\"\",P59*1000/(3.14*P57^2*P58)), IF(version>3, IF(ISERROR(IF(P65<>\"Yes\",P59/P62,IF(P67=\"\",\"\",MIN(P59/P62,P71/(P74+P71-P70-(P74/P75))))) + PressCorrelationFactor),\"\",IF(P65<>\"Yes\",P59/P62,IF(P67=\"\",\"\",MIN(P59/P62,P71/(P74+P71-P70-(P74/P75))))) + PressCorrelationFactor),IF(ISERROR(IF(P65<>\"Yes\",P59/P62,IF(P67=\"\",\"\",IF(P67=\"Paraffin\",P69/(P71-P70-((P71-P69)/P73)), P71/(P74+P71-P70-(P74/P75))))) + PressCorrelationFactor),\"\",IF(P65<>\"Yes\",P59/P62,IF(P67=\"\",\"\",IF(P67=\"Paraffin\",P69/(P71-P70-((P71-P69)/P73)), P71/(P74+P71-P70-(P74/P75))))) + PressCorrelationFactor)))","v":""},null,{"$f":"IF(AND(LEFT(Grade,6)=\"SS3022\",version>2,specyear>=\"2004\"),IF(ISERROR(R59*1000/(3.14*R57^2*R58)),\"\",R59*1000/(3.14*R57^2*R58)), IF(version>3, IF(ISERROR(IF(R65<>\"Yes\",R59/R62,IF(R67=\"\",\"\",MIN(R59/R62,R71/(R74+R71-R70-(R74/R75))))) + PressCorrelationFactor),\"\",IF(R65<>\"Yes\",R59/R62,IF(R67=\"\",\"\",MIN(R59/R62,R71/(R74+R71-R70-(R74/R75))))) + PressCorrelationFactor),IF(ISERROR(IF(R65<>\"Yes\",R59/R62,IF(R67=\"\",\"\",IF(R67=\"Paraffin\",R69/(R71-R70-((R71-R69)/R73)), R71/(R74+R71-R70-(R74/R75))))) + PressCorrelationFactor),\"\",IF(R65<>\"Yes\",R59/R62,IF(R67=\"\",\"\",IF(R67=\"Paraffin\",R69/(R71-R70-((R71-R69)/R73)), R71/(R74+R71-R70-(R74/R75))))) + PressCorrelationFactor)))","v":""},null,null,"Total Loss (%):",null,null,null,null,null,{"$f":"IF(ISERROR(AA81/AA53*100),\"\",AA81/AA53*100)","v":""}]
[null,"Percent Density:",null,null,null,null,null,{"$f":"IF(ISERROR(100*(H78/H77)),\"\",100*(H78/H77))","v":""},null,{"$f":"IF(ISERROR(100*(J78/J77)),\"\",100*(J78/J77))","v":""},null,{"$f":"IF(ISERROR(100*(L78/L77)),\"\",100*(L78/L77))","v":""},null,{"$f":"IF(ISERROR(100*(N78/N77)),\"\",100*(N78/N77))","v":""},null,{"$f":"IF(ISERROR(100*(P78/P77)),\"\",100*(P78/P77))","v":""},null,{"$f":"IF(ISERROR(100*(R78/R77)),\"\",100*(R78/R77))","v":""},null,null,"Hydrocarbon Volatiles (%):"]
[null,"Percent Air Voids:",null,null,null,null,null,{"$f":"IF(H79=\"\",\"\",100-H79)","v":""},null,{"$f":"IF(J79=\"\",\"\",100-J79)","v":""},null,{"$f":"IF(L79=\"\",\"\",100-L79)","v":""},null,{"$f":"IF(N79=\"\",\"\",100-N79)","v":""},null,{"$f":"IF(P79=\"\",\"\",100-P79)","v":""},null,{"$f":"IF(R79=\"\",\"\",100-R79)","v":""},null,null,"Asphalt Content (%):",null,null,null,null,null,{"$f":"IF(ISERROR(AA78-AA82-AA79+AA83),\"\",AA78-AA82-AA79+AA83)","v":""}]
[null,{"$f":"IF(ISERROR(IF(SMALL(H81:Q81,1)<INDEX(INDIRECT(Grade),1,7),\"~ Minimum of \" & INDEX(INDIRECT(Grade),1,7) & \" for VMA:\",\"VMA:\")),\"VMA:\",IF(SMALL(H81:Q81,1)<INDEX(INDIRECT(Grade),1,7),\"~ Minimum of \" & INDEX(INDIRECT(Grade),1,7) & \" for VMA:\",\"VMA:\"))","v":"VMA:"},null,null,null,null,null,{"$f":"IF(ISERROR(100-(100*(H78/RiceTx1))+((H78*ACTx1)/G1SGAsph)),\"\",100-(100*(H78/RiceTx1))+((H78*ACTx1)/G1SGAsph))","v":""},null,{"$f":"IF(ISERROR(100-(100*(J78/RiceTx1))+((J78*ACTx1)/G1SGAsph)),\"\",100-(100*(J78/RiceTx1))+((J78*ACTx1)/G1SGAsph))","v":""},null,{"$f":"IF(ISERROR(100-(100*(L78/RiceTx1))+((L78*ACTx1)/G1SGAsph)),\"\",100-(100*(L78/RiceTx1))+((L78*ACTx1)/G1SGAsph))","v":""},null,{"$f":"IF(ISERROR(100-(100*(N78/RiceTx1))+((N78*ACTx1)/G1SGAsph)),\"\",100-(100*(N78/RiceTx1))+((N78*ACTx1)/G1SGAsph))","v":""},null,{"$f":"IF(ISERROR(100-(100*(P78/RiceTx1))+((P78*ACTx1)/G1SGAsph)),\"\",100-(100*(P78/RiceTx1))+((P78*ACTx1)/G1SGAsph))","v":""},null,{"$f":"IF(ISERROR(100-(100*(R78/RiceTx1))+((R78*ACTx1)/G1SGAsph)),\"\",100-(100*(R78/RiceTx1))+((R78*ACTx1)/G1SGAsph))","v":""},null,null,"Total Loss (g):",null,null,null,null,null,{"$f":"IF(ISERROR(+AA53-AA77),\"\",+AA53-AA77)","v":""}]
[null,{"$f":"IF(AND(MID($B$4,19,1)=\"C\",PressCorrelationFactor<>\"\"),\"~Adjusted Ga Includes a \" & PressCorrelationFactor & \" Press Correlation Factor.\",\"\")","v":""},null,null,null,null,null,{"$f":"IF(AND(TargetDensity=\"\",AvgDensityTx1<>\"\",Grade<>\"\"),\"*Input a target density\",IF(AvgDensityTx1=\"\",\"\",IF(AND(LEFT(Grade,3)=\"LRA\",OR(91<AvgDensityTx1,AvgDensityTx1<87)),\"*Density does not meet specification\",IF(AND(MID(Grade,5,3)=\"334\",OR(TargetDensity+1<AvgDensityTx1,AvgDensityTx1<TargetDensity-1)),\"*Density does not meet specifications\",\"\"))))","v":""},null,null,null,null,null,null,null,null,null,null,null,null,"Moisture Content (%):"]
[null,"Average % Density:",null,null,null,null,null,{"$f":"IF(ISERROR(AVERAGE(H79:M79)),\"\",AVERAGE(H79:M79))","v":""},null,null,null,null,null,{"$f":"IF(version>3,IF(ISERROR(100-AvgAirVoidRdwyTx1),\"\",100-AvgAirVoidRdwyTx1),IF(ISERROR(AVERAGE(N79:S79)),\"\",AVERAGE(N79:S79)))","v":""},null,null,null,null,null,null,"Ash Factor (%):"]
[null,"Average Actual SG:",null,null,null,null,null,{"$f":"IF(ISERROR(AVERAGE(H78:M78)),\"\",AVERAGE(H78:M78))","v":""},null,null,null,null,null,{"$f":"IF(ISERROR(AVERAGE(N78:S78)),\"\",AVERAGE(N78:S78))","v":""},null,null,null,null,null,null,"Percent of Dry Aggregate (%):",null,null,null,null,null,{"$f":"IF(ISERROR(AA77/AA53*100-AA83),\"\",AA77/AA53*100-AA83)","v":""}]
[null,"Average % Air Voids:",null,null,null,null,null,{"$f":"IF(ISERROR(100-AvgDensityTx1),\"\",100-AvgDensityTx1)","v":""},null,null,null,null,null,{"$f":"IF(version>3,IF(ISERROR(AVERAGE(N80:S80)),\"\",AVERAGE(N80:S80)),IF(ISERROR(100-N83),\"\",AVERAGE(100-N83)))","v":""},null,null,null,null,null,null,null,null,null,"Total:",null,null,{"$f":"IF(AND(AA82=\"\",AA79=\"\",AA80=\"\",AA84=\"\"),\"\",SUM(AA82,AA79,AA80,AA84))","v":""}]
[null,"Average VMA:",null,null,null,null,null,{"$f":"IF(ISERROR(AVERAGE(H81:M81)),\"\",AVERAGE(H81:M81))","v":""},null,null,null,null,null,{"$f":"IF(ISERROR(AVERAGE(N81:S81)),\"\",AVERAGE(N81:S81))","v":""}]
[]
[null,{"$f":"IF(specyear=\"2004\",\"IDT - Tex-226\",\"PREDICTION OF MOISTURE-INDUCED DAMAGE TO BITUMINOUS PAVING MIXTURES - Tex-531-C\")","v":"PREDICTION OF MOISTURE-INDUCED DAMAGE TO BITUMINOUS PAVING MIXTURES - Tex-531-C"}]
[null,null,null,null,null,null,"Conditioned",null,null,null,null,null,null,null,"Dry"]
[null,null,null,null,null,null,1,null,2,null,3,null,4,null,1,null,2,null,3,null,4]
[null,"Specimen No."]
[null,"% Density:"]
[]
[null,"Height:"]
[null,"Load, (lbs.):"]
[null,"Strength, (psi.):",null,null,null,null,{"$f":"IF(ISERROR(+G95*0.156/G94),\"\",+G95*0.156/G94)","v":""},null,{"$f":"IF(ISERROR(+I95*0.156/I94),\"\",+I95*0.156/I94)","v":""},null,{"$f":"IF(ISERROR(+K95*0.156/K94),\"\",+K95*0.156/K94)","v":""},null,{"$f":"IF(ISERROR(+M95*0.156/M94),\"\",+M95*0.156/M94)","v":""},null,{"$f":"IF(ISERROR(+O95*0.156/O94),\"\",+O95*0.156/O94)","v":""},null,{"$f":"IF(ISERROR(+Q95*0.156/Q94),\"\",+Q95*0.156/Q94)","v":""},null,{"$f":"IF(ISERROR(+S95*0.156/S94),\"\",+S95*0.156/S94)","v":""},null,{"$f":"IF(ISERROR(+U95*0.156/U94),\"\",+U95*0.156/U94)","v":""}]
[null,"Average Strength, (psi):",null,null,null,null,{"$f":"IF(G96<>\"\",AVERAGE(G96:M96),\"\")","v":""},null,null,null,null,null,null,null,{"$f":"IF(O96<>\"\",AVERAGE(O96:U96),\"\")","v":""}]
[]
[null,"TSR:",null,null,null,null,{"$f":"IF(O97<>\"\",ROUND(+G97/O97,2),\"\")","v":""}]
[]
[null,"Hamburg: Tex-242-F",null,null,null,null,null,null,null,null,null,null,"Fluxing Material: From Quantity Used"]
[null,"No. of  Passes",null,null,null,"RUT Depth",null,null,null,null,null,null,"% Fluxing Material",null,null,null,null,null,null,null,{"$f":"IF(OR(JMFFlux=\"\",Flux=\"\"),\"\",IF(ABS(JMFFlux-Flux)>0.2,\"More than 0.2% from JMF\",\"\"))","v":""}]
[]
[]
[null,"DRAINDOWN OF BITUMIOUS MATERIALS - Tex-235-F",null,null,null,null,null,null,null,null,null,"DELETERIOUS MATERIAL - Tex-217-F (Part I)"]
[null,null,null,null,null,null,"Sample 1",null,"Sample 2",null,null,"Sieve Size",null,"Original Weight Retained, (g)",null,null,"Weight of Deleterious material, (g)",null,null,{"$f":"IF(part=\"Part II\",\"% Loss by Decantation\",\"Deleterious Material,%\")","v":"Deleterious Material,%"}]
[null,"Initial Sample Weight (g):"]
[null,"Initial Weight Plate (g):"]
[null,null,null,null,null,null,null,null,null,null,null,null,null,null,null,null,null,null,null,{"$f":"IF(ISERROR(100*($Q109/$N109)),\"\",100*($Q109/$N109))","v":""},null,null,{"$f":"IF(AND(LEFT(Grade,3)=\"LRA\",T109>1.5,T109<>\"\"),\"Greater than 1.5%\",\"\")","v":""}]
[null,"Final Weight Plate (g):",null,null,null,null,null,null,null,null,null,"DECANTATION - Tex-217-F - (Part II)"]
[null,"Draindown, (%):",null,null,null,null,{"$f":"IF(ISERROR((G110-G108)/G107*100),\"\",(G110-G108)/G107*100)","v":""},null,{"$f":"IF(ISERROR((I110-I108)/I107*100),\"\",(I110-I108)/I107*100)","v":""},null,null,"Sieve Size",null,"Original Weight Retained, (g)",null,null,"Dry Weight after Washing, (g)",null,null,"% Loss by Decantation"]
[]
[null,"Average Draindown, (%):",null,null,null,null,null,null,{"$f":"IF(ISERROR(AVERAGE(G111:I111)),\"\",AVERAGE(G111:I111))","v":""},null,null,null,null,null,null,null,null,null,null,{"$f":"IF(ISERROR(100*($N113-$Q113)/$N113),\"\",100*($N113-$Q113)/$N113)","v":""}]
[]
[null,"Magnesium Sulfate Soundness (%)",null,null,null,null,null,null,null,null,null,null,null,null,null,"Sand Equivalent Value (%)",null,null,null,null,null,null,null,{"$f":"\"Min. Value is \" & INDEX(INDIRECT(Grade),1,34) & \"%\"","v":{"$error":"#REF!"}}]

{"sheet":"DATA_Film Thickness","index":4,"n_rows":34,"n_cols":25,"rows_kept":34,"cut":false,"hidden":true,"merged":[[5,1,5,6],[5,7,5,13],[5,14,5,20],[5,21,5,27],[9,14,9,20],[9,21,9,27],[6,1,6,6],[6,7,6,13],[6,14,6,20],[6,21,6,27],[7,1,7,6],[7,7,7,13],[7,14,7,20],[7,21,7,27],[13,1,13,6],[13,7,13,13],[13,14,13,20],[13,21,13,27],[0,1,0,27],[2,1,2,27],[11,1,11,6],[11,7,11,27],[10,1,10,6],[10,7,10,13],[10,14,10,20],[10,21,10,27],[12,1,12,6],[12,7,12,27],[8,1,8,6],[8,7,8,13],[8,14,8,20],[8,21,8,27],[9,1,9,6],[9,7,9,13],[4,1,4,6],[4,7,4,13],[4,14,4,20],[4,21,4,27],[16,23,16,27],[14,1,14,6],[14,7,14,13],[27,6,27,9],[25,18,25,21],[26,14,26,17],[26,18,26,21],[14,14,14,20],[14,21,14,27],[23,6,23,9],[24,6,24,9],[25,6,25,9],[26,6,26,9],[18,6,19,9],[20,6,20,9],[21,6,21,9],[22,6,22,9],[18,14,19,17],[18,18,19,21],[20,14,20,17],[20,18,20,21],[21,14,21,17],[21,18,21,21],[22,14,22,17],[22,18,22,21],[23,14,23,17],[23,18,23,21],[24,14,24,17],[24,18,24,21],[25,14,25,17],[16,1,16,6],[18,10,19,13],[20,10,20,13],[21,10,21,13],[22,10,22,13],[23,10,23,13],[24,10,24,13],[25,10,25,13],[16,7,16,10],[16,11,16,13],[16,14,16,17],[16,18,16,22],[26,10,26,13],[27,10,27,13],[27,14,27,17],[27,18,27,21],[28,14,28,17],[28,18,28,21],[33,3,33,5],[31,15,32,17],[33,18,33,20],[31,18,32,20],[31,9,32,11],[31,6,32,8],[33,6,33,8],[31,12,32,14],[31,3,32,5],[29,6,29,9],[28,10,28,13],[29,10,29,13],[28,6,28,9],[31,24,32,26],[33,24,33,26],[31,21,32,23],[33,9,33,11],[33,12,33,14],[33,15,33,17],[33,21,33,23],[29,14,29,17],[29,18,29,21]]}
[null,"TEXAS DEPARTMENT OF TRANSPORTATION"]
[null,""]
[null,"FILM THICKNESS"]
[]
[null,"SAMPLE ID:",null,null,null,null,null,{"$f":"IF(sampleid=\"\",\"\",sampleid)","v":""},null,null,null,null,null,null,"DATE LOT OPENED:",null,null,null,null,null,null,{"$f":"IF(sampleddate=\"\",\"\",sampleddate)","v":""}]
[null,"LOT NUMBER:",null,null,null,null,null,{"$f":"IF(testnumber=\"\",\"\",testnumber)","v":""},null,null,null,null,null,null,"LETTING DATE:",null,null,null,null,null,null,{"$f":"IF(lettingdate=\"\",\"\",lettingdate)","v":""}]
[null,"SAMPLE STATUS:",null,null,null,null,null,{"$f":"IF(status=\"\",\"\",status)","v":""},null,null,null,null,null,null,"CONTROLLING CSJ:",null,null,null,null,null,null,{"$f":"IF(ccsj=\"\",\"\",ccsj)","v":""}]
[null,"COUNTY:",null,null,null,null,null,{"$f":"IF(county=\"\",\"\",county)","v":""},null,null,null,null,null,null,"SPEC YEAR:",null,null,null,null,null,null,{"$f":"IF(specyear=\"\",\"\",specyear)","v":""}]
[null,"SAMPLED BY:",null,null,null,null,null,{"$f":"IF(sampledby=\"\",\"\",sampledby)","v":""},null,null,null,null,null,null,"SPEC ITEM:",null,null,null,null,null,null,{"$f":"IF(specitem=\"\",\"\",specitem)","v":""}]
[null,"SAMPLE LOCATION:",null,null,null,null,null,{"$f":"IF(samplelocation=\"\",\"\",samplelocation)","v":""},null,null,null,null,null,null,"SPECIAL PROVISION:",null,null,null,null,null,null,{"$f":"IF(specialprovision=\"\",\"\",specialprovision)","v":""}]
[null,"MATERIAL CODE:",null,null,null,null,null,{"$f":"IF(material=\"\",\"\",material)","v":""},null,null,null,null,null,null,"MIX TYPE:",null,null,null,null,null,null,{"$f":"IF(Grade=\"\",\"\",Grade)","v":""}]
[null,"MATERIAL NAME:",null,null,null,null,null,{"$f":"IF(matl_nm=\"\",\"\",matl_nm)","v":""}]
[null,"PRODUCER:",null,null,null,null,null,{"$f":"IF(producer=\"\",\"\",producer)","v":""}]
[null,"AREA ENGINEER:",null,null,null,null,null,{"$f":"IF(areaengineer=\"\",\"\",areaengineer)","v":""},null,null,null,null,null,null,"PROJECT MANAGER:",null,null,null,null,null,null,{"$f":"IF(projectmanager=\"\",\"\",projectmanager)","v":""}]
[null,"AREA ENGINEER:",null,null,null,null,null,{"$f":"IF(areaengineer=\"\",\"\",areaengineer)","v":""},null,null,null,null,null,null,"PROJECT MANAGER:",null,null,null,null,null,null,{"$f":"IF(projectmanager=\"\",\"\",projectmanager)","v":""}]
[]
[null,"COURSE\\LIFT:",null,null,null,null,null,{"$f":"IF(courselift=\"\",\"\",courselift)","v":""},null,null,null,"STATION:",null,null,{"$f":"IF(station=\"\",\"\",station)","v":""},null,null,null,"DIST. FROM CL:",null,null,null,null,{"$f":"IF(distfromcl=\"\",\"\",distfromcl)","v":""}]
[]
[null,null,null,null,null,null,"Sieve Size:",null,null,null,"Cumulative Percent Passing",null,null,null,"Surface Area Factor",null,null,null,"Surface Area (m2/kg)"]
[]
[null,null,null,null,null,null,{"$f":"IF(ISERROR(INDEX(INDIRECT(Grade),1,IF(specyear = \"2004\",2,3))),\"\",INDEX(INDIRECT(Grade),1,IF(specyear = \"2004\",2,3)))","v":""},null,null,null,{"$f":"Test_Data!L38","v":""},null,null,null,{"$f":"INDEX(INDIRECT(Grade),1,24)","v":{"$error":"#REF!"}},null,null,null,{"$f":"IF(ISERROR(O21*K21/100),\"-\",O21*K21/100)","v":"-"}]
[null,null,null,null,null,null,{"$f":"IF(ISERROR(INDEX(INDIRECT(Grade),2,IF(specyear = \"2004\",2,3))),\"\",INDEX(INDIRECT(Grade),2,IF(specyear = \"2004\",2,3)))","v":""},null,null,null,{"$f":"Test_Data!L39","v":""},null,null,null,{"$f":"INDEX(INDIRECT(Grade),2,24)","v":{"$error":"#REF!"}},null,null,null,"-"]
[null,null,null,null,null,null,{"$f":"IF(ISERROR(INDEX(INDIRECT(Grade),3,IF(specyear = \"2004\",2,3))),\"\",INDEX(INDIRECT(Grade),3,IF(specyear = \"2004\",2,3)))","v":""},null,null,null,{"$f":"Test_Data!L40","v":""},null,null,null,{"$f":"INDEX(INDIRECT(Grade),3,24)","v":{"$error":"#REF!"}},null,null,null,"-"]
[null,null,null,null,null,null,{"$f":"IF(ISERROR(INDEX(INDIRECT(Grade),4,IF(specyear = \"2004\",2,3))),\"\",INDEX(INDIRECT(Grade),4,IF(specyear = \"2004\",2,3)))","v":""},null,null,null,{"$f":"Test_Data!L41","v":""},null,null,null,{"$f":"INDEX(INDIRECT(Grade),4,24)","v":{"$error":"#REF!"}},null,null,null,"-"]
[null,null,null,null,null,null,{"$f":"IF(ISERROR(INDEX(INDIRECT(Grade),5,IF(specyear = \"2004\",2,3))),\"\",INDEX(INDIRECT(Grade),5,IF(specyear = \"2004\",2,3)))","v":""},null,null,null,{"$f":"Test_Data!L42","v":""},null,null,null,{"$f":"INDEX(INDIRECT(Grade),5,24)","v":{"$error":"#REF!"}},null,null,null,"-"]
[null,null,null,null,null,null,{"$f":"IF(ISERROR(INDEX(INDIRECT(Grade),6,IF(specyear = \"2004\",2,3))),\"\",INDEX(INDIRECT(Grade),6,IF(specyear = \"2004\",2,3)))","v":""},null,null,null,{"$f":"Test_Data!L43","v":""},null,null,null,{"$f":"INDEX(INDIRECT(Grade),6,24)","v":{"$error":"#REF!"}},null,null,null,"-"]
[null,null,null,null,null,null,{"$f":"IF(ISERROR(INDEX(INDIRECT(Grade),7,IF(specyear = \"2004\",2,3))),\"\",INDEX(INDIRECT(Grade),7,IF(specyear = \"2004\",2,3)))","v":""},null,null,null,{"$f":"Test_Data!L44","v":""},null,null,null,{"$f":"INDEX(INDIRECT(Grade),7,24)","v":{"$error":"#REF!"}},null,null,null,"-"]
[null,null,null,null,null,null,{"$f":"IF(ISERROR(INDEX(INDIRECT(Grade),8,IF(specyear = \"2004\",2,3))),\"\",INDEX(INDIRECT(Grade),8,IF(specyear = \"2004\",2,3)))","v":""},null,null,null,{"$f":"Test_Data!L45","v":""},null,null,null,{"$f":"INDEX(INDIRECT(Grade),8,24)","v":{"$error":"#REF!"}},null,null,null,"-"]
[null,null,null,null,null,null,{"$f":"IF(ISERROR(INDEX(INDIRECT(Grade),9,IF(specyear = \"2004\",2,3))),\"\",INDEX(INDIRECT(Grade),9,IF(specyear = \"2004\",2,3)))","v":""},null,null,null,{"$f":"Test_Data!L46","v":""},null,null,null,{"$f":"IF(ISERROR(INDEX(INDIRECT(Grade),9,24)),\"\",INDEX(INDIRECT(Grade),9,24))","v":""},null,null,null,"-"]
[null,null,null,null,null,null,{"$f":"IF(ISERROR(INDEX(INDIRECT(Grade),10,IF(specyear = \"2004\",2,3))),\"\",INDEX(INDIRECT(Grade),10,IF(specyear = \"2004\",2,3)))","v":""},null,null,null,{"$f":"Test_Data!L47","v":""},null,null,null,{"$f":"IF(ISERROR(INDEX(INDIRECT(Grade),10,24)),\"\",INDEX(INDIRECT(Grade),10,24))","v":""},null,null,null,"-"]
[]
[null,null,null,"Asphalt Content",null,null,"Maximum Specific Gravity (Gr)",null,null,"Effective Specific Gravity",null,null,"Combined Bulk Specific Gravity (Gsb)",null,null,"Asphalt Absorption",null,null,"Effective Asphalt Content",null,null,"Film Thickness (microns)",null,null,"Film Thickness Within Tolerance"]
[]
[null,null,null,{"$f":"ACTx1","v":0},null,null,{"$f":"RiceTx1","v":""},null,null,{"$f":"IF(ISERROR((100-D34)/((100/G34)-(D34/G1SGAsph))),\"\",(100-D34)/((100/G34)-(D34/G1SGAsph)))","v":""},null,null,null,null,null,{"$f":"IF(ISERROR((J34-M34)/(M34*J34)*G1SGAsph*100),\"\",((J34-M34)/(M34*J34))*G1SGAsph*100)","v":""},null,null,{"$f":"IF(M34=\"\",\"\",D34-((P$34*(100-D34))/100))","v":""},null,null,{"$f":"IF(S34=\"\",\"\",1000000*((S34/100)/(1-(S34/100))/(SUM(S$21:V$30)*G1SGAsph*1000)))","v":""},null,null,{"$f":"IF(V34=\"\",\"\",IF(AND(V34>=9,V34<=11),\"þ\",\"ý\"))","v":""}]

{"sheet":"DATA_MDV","index":5,"n_rows":592,"n_cols":43,"rows_kept":592,"cut":false,"hidden":true,"merged":[[498,16,505,16],[498,21,505,21],[498,34,505,34],[498,7,505,7],[498,17,505,17],[498,18,505,18],[498,20,505,20],[498,22,505,22],[498,23,505,23],[498,24,505,24],[498,26,505,26],[498,27,505,27],[498,28,505,28],[498,29,505,29],[498,30,505,30],[498,31,505,31],[498,32,505,32],[498,33,505,33],[480,29,486,29],[480,30,486,30],[480,31,486,31],[480,32,486,32],[480,33,486,33],[480,34,486,34],[480,22,486,22],[480,23,486,23],[480,24,486,24],[480,26,486,26],[480,27,486,27],[480,28,486,28],[480,7,486,7],[480,16,486,16],[480,17,486,17],[480,18,486,18],[480,20,486,20],[480,21,486,21],[472,29,479,29],[472,30,479,30],[472,31,479,31],[472,32,479,32],[472,33,479,33],[472,34,479,34],[472,22,479,22],[472,23,479,23],[472,24,479,24],[472,26,479,26],[472,27,479,27],[472,28,479,28],[472,7,479,7],[472,16,479,16],[472,17,479,17],[472,18,479,18],[472,20,479,20],[472,21,479,21],[464,29,471,29],[464,30,471,30],[464,31,471,31],[464,32,471,32],[464,33,471,33],[464,34,471,34],[464,22,471,22],[464,23,471,23],[464,24,471,24],[464,26,471,26],[464,27,471,27],[464,28,471,28],[464,7,471,7],[464,16,471,16],[464,17,471,17],[464,18,471,18],[464,20,471,20],[464,21,471,21],[455,30,463,30],[455,31,463,31],[455,32,463,32],[455,33,463,33],[455,34,463,34],[455,22,463,22],[455,23,463,23],[455,24,463,24],[455,26,463,26],[455,27,463,27],[455,28,463,28],[455,7,463,7],[455,16,463,16],[455,17,463,17],[455,18,463,18],[455,20,463,20],[455,21,463,21],[436,34,444,34],[436,22,444,22],[436,23,444,23],[436,24,444,24],[436,26,444,26],[436,27,444,27],[436,28,444,28],[436,7,444,7],[436,16,444,16],[436,17,444,17],[436,18,444,18],[436,20,444,20],[436,21,444,21],[445,29,454,29],[445,30,454,30],[445,31,454,31],[445,32,454,32],[445,33,454,33],[445,34,454,34],[445,22,454,22],[445,23,454,23],[445,24,454,24],[445,26,454,26],[445,27,454,27],[445,28,454,28],[445,7,454,7],[445,16,454,16],[445,17,454,17],[445,18,454,18],[445,20,454,20],[445,21,454,21],[426,34,435,34],[426,20,435,20],[426,21,435,21],[426,24,435,24],[426,26,435,26],[426,27,435,27],[426,28,435,28],[426,22,435,22],[426,23,435,23],[416,31,425,31],[416,32,425,32],[416,33,425,33],[416,34,425,34],[416,24,425,24],[416,26,425,26],[416,27,425,27],[416,28,425,28],[416,29,425,29],[416,30,425,30],[406,34,415,34],[416,7,425,7],[416,16,425,16],[416,17,425,17],[416,18,425,18],[416,20,425,20],[416,21,425,21],[416,22,425,22],[416,23,425,23],[406,20,415,20],[406,21,415,21],[406,22,415,22],[406,23,415,23],[406,24,415,24],[406,26,415,26],[406,29,415,29],[406,30,415,30],[406,31,415,31],[406,32,415,32],[406,27,415,27],[406,28,415,28],[406,7,415,7],[406,16,415,16],[406,17,415,17],[406,18,415,18],[554,9,554,10],[555,9,555,10],[426,7,435,7],[426,16,435,16],[426,17,435,17],[426,18,435,18],[556,9,556,10],[553,11,553,12],[554,11,554,12],[555,11,555,12],[556,11,556,12],[553,9,553,10],[399,29,405,29],[399,30,405,30],[399,31,405,31],[399,32,405,32],[399,33,405,33],[487,32,491,32],[487,33,491,33],[492,33,497,33],[406,33,415,33],[426,29,435,29],[426,30,435,30],[426,31,435,31],[426,32,435,32],[426,33,435,33],[436,29,444,29],[436,30,444,30],[436,31,444,31],[436,32,444,32],[436,33,444,33],[455,29,463,29],[399,34,405,34],[399,22,405,22],[399,23,405,23],[399,24,405,24],[399,26,405,26],[399,27,405,27],[399,28,405,28],[399,7,405,7],[399,16,405,16],[399,17,405,17],[399,18,405,18],[399,20,405,20],[399,21,405,21],[391,29,398,29],[391,30,398,30],[391,31,398,31],[391,32,398,32],[391,33,398,33],[391,34,398,34],[391,22,398,22],[391,23,398,23],[391,24,398,24],[391,26,398,26],[391,27,398,27],[391,28,398,28],[391,7,398,7],[391,16,398,16],[391,17,398,17],[391,18,398,18],[391,20,398,20],[391,21,398,21],[383,29,390,29],[383,30,390,30],[383,31,390,31],[383,32,390,32],[383,33,390,33],[383,34,390,34],[383,22,390,22],[383,23,390,23],[383,24,390,24],[383,26,390,26],[383,27,390,27],[383,28,390,28],[383,7,390,7],[383,16,390,16],[383,17,390,17],[383,18,390,18],[383,20,390,20],[383,21,390,21],[374,29,382,29],[374,30,382,30],[374,31,382,31],[374,32,382,32],[374,33,382,33],[374,34,382,34],[374,22,382,22],[374,23,382,23],[374,24,382,24],[374,26,382,26],[374,27,382,27],[374,28,382,28],[374,7,382,7],[374,16,382,16],[374,17,382,17],[374,18,382,18],[374,20,382,20],[374,21,382,21],[364,29,373,29],[364,30,373,30],[364,31,373,31],[364,32,373,32],[364,33,373,33],[364,34,373,34],[364,22,373,22],[364,23,373,23],[364,24,373,24],[364,26,373,26],[364,27,373,27],[364,28,373,28],[364,7,373,7],[364,16,373,16],[364,17,373,17],[364,18,373,18],[364,20,373,20],[364,21,373,21],[361,30,363,30],[361,31,363,31],[361,32,363,32],[361,33,363,33],[361,26,363,26],[361,27,363,27],[361,28,363,28],[361,29,363,29],[357,30,360,30],[357,31,360,31],[357,32,360,32],[357,33,360,33],[357,26,360,26],[357,27,360,27],[357,28,360,28],[357,29,360,29],[352,30,356,30],[352,31,356,31],[352,32,356,32],[352,33,356,33],[352,26,356,26],[352,27,356,27],[352,28,356,28],[352,29,356,29],[346,30,351,30],[346,31,351,31],[346,32,351,32],[346,33,351,33],[346,26,351,26],[346,27,351,27],[346,28,351,28],[346,29,351,29],[342,30,345,30],[342,31,345,31],[342,32,345,32],[342,33,345,33],[342,26,345,26],[342,27,345,27],[342,28,345,28],[342,29,345,29],[338,30,341,30],[338,31,341,31],[338,32,341,32],[338,33,341,33],[338,26,341,26],[338,27,341,27],[338,28,341,28],[338,29,341,29],[334,30,337,30],[334,31,337,31],[334,32,337,32],[334,33,337,33],[334,26,337,26],[334,27,337,27],[334,28,337,28],[334,29,337,29],[329,30,333,30],[329,31,333,31],[329,32,333,32],[329,33,333,33],[329,26,333,26],[329,27,333,27],[329,28,333,28],[329,29,333,29],[323,30,328,30],[323,31,328,31],[323,32,328,32],[323,33,328,33],[323,26,328,26],[323,27,328,27],[323,28,328,28],[323,29,328,29],[317,30,322,30],[317,31,322,31],[317,32,322,32],[317,33,322,33],[317,26,322,26],[317,27,322,27],[317,28,322,28],[317,29,322,29],[315,30,316,30],[315,31,316,31],[315,32,316,32],[315,33,316,33],[315,26,316,26],[315,27,316,27],[315,28,316,28],[315,29,316,29],[307,13,316,13],[307,14,316,14],[307,20,316,20],[307,21,316,21],[307,15,316,15],[307,16,316,16],[307,17,316,17],[307,18,316,18],[317,21,322,21],[317,22,322,22],[298,20,306,20],[298,21,306,21],[307,1,316,1],[307,7,316,7],[307,9,316,9],[307,10,316,10],[307,11,316,11],[307,12,316,12],[298,1,306,1],[298,7,306,7],[298,9,306,9],[298,10,306,10],[298,11,306,11],[298,12,306,12],[298,13,306,13],[298,14,306,14],[290,15,297,15],[290,16,297,16],[290,17,297,17],[290,18,297,18],[298,15,306,15],[298,16,306,16],[298,17,306,17],[298,18,306,18],[281,20,289,20],[281,21,289,21],[290,1,297,1],[290,7,297,7],[290,9,297,9],[290,10,297,10],[290,11,297,11],[290,12,297,12],[290,13,297,13],[290,14,297,14],[269,20,274,20],[269,21,274,21],[275,20,280,20],[275,21,280,21],[251,20,259,20],[251,21,259,21],[260,20,268,20],[260,21,268,21],[281,17,289,17],[275,17,280,17],[260,17,268,17],[281,16,289,16],[269,17,274,17],[260,18,268,18],[290,20,297,20],[290,21,297,21],[233,20,241,20],[233,21,241,21],[242,20,250,20],[242,21,250,21],[215,20,223,20],[215,21,223,21],[224,20,232,20],[224,21,232,21],[196,20,204,20],[196,21,204,21],[205,20,214,20],[205,21,214,21],[178,20,186,20],[178,21,186,21],[187,20,195,20],[187,21,195,21],[163,20,168,20],[163,21,168,21],[169,20,177,20],[169,21,177,21],[149,20,155,20],[149,21,155,21],[156,20,162,20],[156,21,162,21],[132,20,140,20],[132,21,140,21],[141,20,148,20],[141,21,148,21],[116,20,123,20],[116,21,123,21],[124,20,131,20],[124,21,131,21],[98,20,106,20],[98,21,106,21],[107,20,115,20],[107,21,115,21],[86,20,91,20],[86,21,91,21],[92,20,97,20],[92,21,97,21],[72,20,77,20],[72,21,77,21],[78,20,85,20],[78,21,85,21],[36,20,41,20],[36,21,41,21],[42,20,49,20],[42,21,49,21],[29,20,35,20],[29,21,35,21],[1,20,2,20],[1,21,2,21],[3,20,11,20],[3,21,11,21],[12,20,20,20],[132,16,140,16],[141,16,148,16],[42,18,49,18],[50,18,56,18],[57,18,65,18],[66,18,71,18],[86,18,91,18],[92,18,97,18],[98,18,106,18],[107,18,115,18],[116,18,123,18],[124,17,131,17],[124,18,131,18],[132,17,140,17],[132,18,140,18],[141,17,148,17],[141,18,148,18],[48,36,49,38],[50,36,50,38],[50,20,56,20],[50,21,56,21],[57,20,65,20],[57,21,65,21],[66,20,71,20],[66,21,71,21],[260,16,268,16],[251,16,259,16],[242,16,250,16],[233,16,241,16],[281,1,289,1],[281,7,289,7],[275,16,280,16],[251,7,259,7],[260,7,268,7],[156,16,162,16],[187,16,195,16],[178,16,186,16],[169,16,177,16],[163,16,168,16],[224,16,232,16],[215,16,223,16],[205,16,214,16],[196,16,204,16],[149,16,155,16],[269,1,274,1],[269,7,274,7],[269,16,274,16],[163,7,168,7],[169,7,177,7],[178,7,186,7],[187,7,195,7],[196,7,204,7],[205,7,214,7],[132,7,140,7],[141,7,148,7],[149,7,155,7],[156,7,162,7],[275,1,280,1],[275,7,280,7],[215,7,223,7],[224,7,232,7],[233,7,241,7],[242,7,250,7],[57,1,65,1],[66,7,71,7],[72,7,77,7],[66,1,71,1],[72,1,77,1],[116,1,123,1],[107,1,115,1],[50,1,56,1],[36,1,41,1],[57,17,65,17],[21,1,28,1],[21,7,28,7],[29,7,35,7],[36,7,41,7],[42,7,49,7],[50,7,56,7],[57,7,65,7],[3,1,11,1],[12,1,20,1],[116,12,123,12],[21,17,28,17],[29,17,35,17],[36,17,41,17],[72,17,77,17],[78,17,85,17],[42,17,49,17],[50,17,56,17],[66,17,71,17],[86,17,91,17],[92,17,97,17],[98,17,106,17],[107,17,115,17],[116,17,123,17],[1,5,1,6],[42,1,49,1],[29,1,35,1],[12,18,20,18],[3,17,11,17],[12,17,20,17],[3,7,11,7],[12,7,20,7],[3,16,11,16],[12,16,20,16],[553,6,553,7],[124,1,131,1],[86,1,91,1],[78,1,85,1],[98,7,106,7],[116,7,123,7],[107,7,115,7],[98,1,106,1],[98,14,106,14],[92,1,97,1],[107,12,115,12],[107,13,115,13],[98,12,106,12],[98,15,106,15],[107,14,115,14],[107,15,115,15],[124,12,131,12],[124,13,131,13],[124,14,131,14],[116,14,123,14],[116,15,123,15],[124,15,131,15],[124,9,131,9],[92,9,97,9],[86,9,91,9],[86,7,91,7],[116,9,123,9],[107,9,115,9],[124,7,131,7],[78,7,85,7],[92,7,97,7],[98,9,106,9],[21,16,28,16],[29,16,35,16],[36,16,41,16],[42,16,49,16],[50,16,56,16],[66,16,71,16],[72,16,77,16],[78,16,85,16],[116,16,123,16],[124,16,131,16],[57,16,65,16],[86,16,91,16],[92,16,97,16],[98,16,106,16],[107,16,115,16],[116,13,123,13],[98,13,106,13],[78,9,85,9],[149,17,155,17],[149,18,155,18],[156,17,162,17],[156,18,162,18],[163,17,168,17],[163,18,168,18],[169,17,177,17],[169,18,177,18],[224,17,232,17],[224,18,232,18],[178,17,186,17],[178,18,186,18],[187,17,195,17],[187,18,195,18],[196,17,204,17],[196,18,204,18],[1,18,2,18],[72,18,77,18],[21,18,28,18],[29,18,35,18],[36,18,41,18],[205,18,214,18],[242,18,250,18],[215,18,223,18],[251,18,259,18],[21,35,23,35],[12,22,20,22],[233,17,241,17],[233,18,241,18],[275,18,280,18],[281,18,289,18],[205,17,214,17],[242,17,250,17],[251,17,259,17],[215,17,223,17],[98,24,106,24],[107,22,115,22],[269,18,274,18],[3,18,11,18],[287,22,288,23],[287,24,289,24],[78,18,85,18],[12,21,20,21],[21,20,28,20],[21,21,28,21],[12,30,20,30],[12,31,20,31],[12,32,20,32],[12,33,20,33],[12,34,20,34],[21,22,28,22],[21,23,28,23],[21,24,28,24],[21,26,28,26],[338,7,341,7],[342,7,345,7],[12,23,20,23],[12,24,20,24],[290,22,297,22],[290,23,297,23],[298,22,306,22],[298,23,306,23],[98,22,106,22],[98,23,106,23],[346,1,351,1],[352,1,356,1],[307,22,316,22],[307,23,316,23],[357,1,360,1],[361,1,363,1],[317,7,322,7],[323,7,328,7],[329,7,333,7],[334,7,337,7],[317,1,322,1],[323,1,328,1],[329,1,333,1],[334,1,337,1],[357,7,360,7],[361,7,363,7],[346,7,351,7],[352,7,356,7],[338,1,341,1],[342,1,345,1],[317,9,322,9],[317,10,322,10],[329,9,333,9],[334,9,337,9],[338,9,341,9],[342,9,345,9],[342,10,345,10],[346,9,351,9],[352,9,356,9],[317,11,322,11],[317,12,322,12],[323,9,328,9],[323,10,328,10],[323,11,328,11],[323,12,328,12],[329,12,333,12],[334,10,337,10],[317,15,322,15],[317,16,322,16],[323,13,328,13],[323,14,328,14],[323,15,328,15],[323,16,328,16],[317,13,322,13],[317,14,322,14],[346,13,351,13],[346,14,351,14],[346,15,351,15],[357,9,360,9],[361,9,363,9],[329,10,333,10],[329,11,333,11],[338,10,341,10],[338,11,341,11],[346,10,351,10],[346,11,351,11],[357,10,360,10],[357,11,360,11],[329,13,333,13],[329,14,333,14],[329,15,333,15],[338,14,341,14],[338,15,341,15],[329,16,333,16],[338,16,341,16],[334,11,337,11],[334,12,337,12],[334,13,337,13],[334,14,337,14],[334,15,337,15],[334,16,337,16],[342,11,345,11],[342,12,345,12],[342,13,345,13],[342,14,345,14],[342,15,345,15],[342,16,345,16],[338,12,341,12],[338,13,341,13],[346,12,351,12],[357,14,360,14],[357,15,360,15],[346,16,351,16],[352,10,356,10],[352,11,356,11],[352,12,356,12],[352,13,356,13],[352,14,356,14],[352,15,356,15],[352,16,356,16],[357,16,360,16],[361,10,363,10],[361,11,363,11],[361,12,363,12],[361,13,363,13],[361,14,363,14],[361,15,363,15],[361,16,363,16],[357,12,360,12],[357,13,360,13],[323,17,328,17],[323,18,328,18],[323,20,328,20],[323,21,328,21],[323,22,328,22],[317,17,322,17],[317,18,322,18],[317,20,322,20],[334,17,337,17],[334,18,337,18],[334,20,337,20],[329,17,333,17],[329,18,333,18],[329,20,333,20],[329,21,333,21],[329,22,333,22],[334,21,337,21],[334,22,337,22],[338,21,341,21],[338,22,341,22],[338,17,341,17],[338,18,341,18],[342,17,345,17],[342,18,345,18],[342,20,345,20],[338,20,341,20],[352,17,356,17],[352,18,356,18],[352,20,356,20],[346,17,351,17],[346,18,351,18],[346,20,351,20],[346,21,351,21],[346,22,351,22],[352,21,356,21],[352,22,356,22],[361,21,363,21],[361,22,363,22],[357,21,360,21],[357,22,360,22],[357,17,360,17],[357,18,360,18],[361,17,363,17],[361,18,363,18],[361,20,363,20],[357,20,360,20],[317,23,322,23],[317,24,322,24],[323,23,328,23],[323,24,328,24],[329,23,333,23],[329,24,333,24],[334,23,337,23],[361,23,363,23],[361,24,363,24],[346,23,351,23],[346,24,351,24],[352,23,356,23],[352,24,356,24],[334,24,337,24],[357,23,360,23],[357,24,360,24],[338,23,341,23],[338,24,341,24],[342,23,345,23],[342,24,345,24],[342,21,345,21],[342,22,345,22],[1,25,2,25],[0,22,1,23],[0,24,2,24],[78,22,85,22],[78,23,85,23],[78,24,85,24],[33,39,34,39],[14,35,16,35],[26,35,28,35],[14,37,16,37],[33,37,34,37],[33,38,34,38],[21,36,23,36],[14,36,16,36],[26,36,28,36],[33,36,34,36],[3,27,11,27],[3,28,11,28],[3,29,11,29],[3,30,11,30],[3,22,11,22],[3,23,11,23],[3,24,11,24],[3,26,11,26],[3,31,11,31],[3,32,11,32],[3,33,11,33],[3,34,11,34],[12,26,20,26],[12,27,20,27],[12,28,20,28],[12,29,20,29],[21,27,28,27],[21,28,28,28],[21,29,28,29],[21,30,28,30],[21,31,28,31],[21,32,28,32],[21,33,28,33],[21,34,28,34],[29,22,35,22],[29,23,35,23],[29,24,35,24],[29,26,35,26],[29,27,35,27],[29,28,35,28],[29,29,35,29],[29,30,35,30],[29,31,35,31],[29,32,35,32],[29,33,35,33],[29,34,35,34],[50,33,56,33],[42,30,49,30],[42,31,49,31],[42,32,49,32],[42,33,49,33],[50,34,56,34],[66,22,71,22],[66,23,71,23],[66,24,71,24],[66,26,71,26],[66,27,71,27],[36,22,41,22],[36,23,41,23],[36,24,41,24],[36,26,41,26],[36,27,41,27],[36,28,41,28],[36,29,41,29],[36,30,41,30],[36,31,41,31],[36,32,41,32],[36,33,41,33],[36,34,41,34],[42,22,49,22],[42,23,49,23],[42,24,49,24],[42,26,49,26],[42,27,49,27],[42,28,49,28],[42,29,49,29],[42,34,49,34],[72,31,77,31],[66,34,71,34],[66,30,71,30],[66,31,71,31],[66,32,71,32],[66,33,71,33],[72,34,77,34],[72,28,77,28],[72,29,77,29],[72,30,77,30],[66,28,71,28],[66,29,71,29],[50,28,56,28],[50,29,56,29],[78,33,85,33],[72,22,77,22],[72,23,77,23],[72,24,77,24],[72,26,77,26],[78,26,85,26],[78,27,85,27],[72,32,77,32],[72,33,77,33],[72,27,77,27],[50,22,56,22],[50,23,56,23],[50,24,56,24],[50,26,56,26],[50,27,56,27],[50,30,56,30],[50,31,56,31],[50,32,56,32],[78,28,85,28],[78,29,85,29],[78,30,85,30],[78,31,85,31],[78,32,85,32],[92,32,97,32],[78,34,85,34],[86,22,91,22],[86,23,91,23],[86,24,91,24],[86,26,91,26],[86,27,91,27],[86,28,91,28]],"merged_total":1449,"flags":["merged_cut"]}
[null,null,null,null,null,null,null,null,null,null,null,null,null,null,null,null,null,null,null,null,null,null,"Membrane Application Rates",null,"SA Factors"]
[null,null,null,null,null,"Washed Sieve",null,"VMA:","TOLERANCE",null,null,null,null,null,null,null,null,null,"Asphalt Content Tolerance (%)","Gradation in % Retained?","Min. Sand Equivalient (%)","Max Magnesium Sulfate Soundness (Virgin Aggregate)",null,null,null,"MGL requirement?"]
[null,"Grade","1993 Sieve Size","1995 Sieve Size","Sieve Measurement","Min","Max","Min","%",null,null,null,null,null,null,null,"PAN 200 passing",null,null,"Prod. Gradation % Retained?",null,null,"MIN","MAX",null,null,"% White Rock Min","% White Rock Max","% LRA Min","% LRA Max","% Virgin Agg. Min","% Virgin Agg. Max","% Flux Min","% Flux Max","2004 Min. Sand Equivalent","Sieve Size",null,null,null,"Tx1 Per Passing","Upper Limits","Lower Limits"]
[null,"TYPE A","1-1/2\"","37.5 mm",37.5,98,100,11,5,null,null,null,null,null,null,null,3,null,0.30099999999999999,"NO",45,30,null,null,null,"NO",null,null,null,null,null,null,null,null,null,{"$f":"sieve1","v":""},{"$f":"SSize1","v":""},{"$f":"IF(ISERROR(AK4^0.45),\"\",AK4^0.45)","v":""},{"$f":"100","v":100},{"$f":"Test_Data!L38","v":""},{"$f":"IF(JMFDes1=\"\",\"\",IF(Spec1=\"\",\"\",IF(RETAINED = \"NO\",IF(SSize1=0.075,INDEX(INDIRECT(Grade),1,6),IF(JMFDes1+IF(SSize1>=2,5,3)>100,100,JMFDes1+IF(SSize1>=2,5,3))),IF(SSize1=0.075,100-INDEX(INDIRECT(Grade),1,6),100-IF(JMFDes1+IF(SSize1>=2,5,3)>100,100,JMFDes1+IF(SSize1>=2,5,3))))))","v":""},{"$f":"IF(JMFDes1=\"\",\"\",IF(Spec1=\"\",\"\",IF(RETAINED = \"NO\",IF(SSize1=0.075,INDEX(INDIRECT(Grade),1,5),IF(JMFDes1-IF(SSize1>=2,5,3)<0,0,JMFDes1-IF(SSize1>=2,5,3))),IF(SSize1=0.075,100-INDEX(INDIRECT(Grade),1,5),100-IF(JMFDes1-IF(SSize1>=2,5,3)<0,0,JMFDes1-IF(SSize1>=2,5,3))))))","v":""}]
[null,null,"1-1/4\"","31.5 mm",31.5,95,100,null,5,null,null,null,null,null,null,null,null,null,null,"YES",null,null,null,null,null,"NO",null,null,null,null,null,null,null,null,null,{"$f":"sieve2","v":""},{"$f":"SSize2","v":""},"",{"$f":"IF(ISERROR((100*($AL5/$AL$4))),\"\",(100*($AL5/$AL$4)))","v":""},{"$f":"Test_Data!L39","v":""},{"$f":"IF(JMFDes2=\"\",\"\",IF(Spec2=\"\",\"\",IF(RETAINED = \"NO\",IF(SSize2=0.075,INDEX(INDIRECT(Grade),2,6),IF(JMFDes2+IF(SSize2>=2,5,3)>200,200,JMFDes2+IF(SSize2>=2,5,3))),IF(SSize2=0.075,100-INDEX(INDIRECT(Grade),2,6),100-IF(JMFDes2+IF(SSize2>=2,5,3)>200,200,JMFDes2+IF(SSize2>=2,5,3))))))","v":""},{"$f":"IF(JMFDes2=\"\",\"\",IF(Spec2=\"\",\"\",IF(RETAINED = \"NO\",IF(SSize2=0.075,INDEX(INDIRECT(Grade),2,5),IF(JMFDes2-IF(SSize2>=2,5,3)<0,0,JMFDes2-IF(SSize2>=2,5,3))),IF(SSize2=0.075,100-INDEX(INDIRECT(Grade),2,5),100-IF(JMFDes2-IF(SSize2>=2,5,3)<0,0,JMFDes2-IF(SSize2>=2,5,3))))))","v":""}]
[null,null,"7/8\"","22.4 mm",22.4,70,90,null,5,null,null,null,null,null,null,null,null,null,null,null,null,null,null,null,null,"NO",null,null,null,null,null,null,null,null,null,{"$f":"sieve3","v":""},{"$f":"SSize3","v":""},"","",{"$f":"Test_Data!L40","v":""},{"$f":"IF(JMFDes3=\"\",\"\",IF(Spec3=\"\",\"\",IF(RETAINED = \"NO\",IF(SSize3=0.075,INDEX(INDIRECT(Grade),3,6),IF(JMFDes3+IF(SSize3>=2,5,3)>300,300,JMFDes3+IF(SSize3>=2,5,3))),IF(SSize3=0.075,100-INDEX(INDIRECT(Grade),3,6),100-IF(JMFDes3+IF(SSize3>=2,5,3)>300,300,JMFDes3+IF(SSize3>=2,5,3))))))","v":""},{"$f":"IF(JMFDes3=\"\",\"\",IF(Spec3=\"\",\"\",IF(RETAINED = \"NO\",IF(SSize3=0.075,INDEX(INDIRECT(Grade),3,5),IF(JMFDes3-IF(SSize3>=2,5,3)<0,0,JMFDes3-IF(SSize3>=2,5,3))),IF(SSize3=0.075,100-INDEX(INDIRECT(Grade),3,5),100-IF(JMFDes3-IF(SSize3>=2,5,3)<0,0,JMFDes3-IF(SSize3>=2,5,3))))))","v":""}]
[null,null,"1/2\"","12.5 mm",12.5,50,70,null,5,null,null,null,null,null,null,null,null,null,null,null,null,null,null,null,null,"NO",null,null,null,null,null,null,null,null,null,{"$f":"sieve4","v":""},{"$f":"SSize4","v":""},"","",{"$f":"Test_Data!L41","v":""},{"$f":"IF(JMFDes4=\"\",\"\",IF(Spec4=\"\",\"\",IF(RETAINED = \"NO\",IF(SSize4=0.075,INDEX(INDIRECT(Grade),4,6),IF(JMFDes4+IF(SSize4>=2,5,3)>400,400,JMFDes4+IF(SSize4>=2,5,3))),IF(SSize4=0.075,100-INDEX(INDIRECT(Grade),4,6),100-IF(JMFDes4+IF(SSize4>=2,5,3)>400,400,JMFDes4+IF(SSize4>=2,5,3))))))","v":""},{"$f":"IF(JMFDes4=\"\",\"\",IF(Spec4=\"\",\"\",IF(RETAINED = \"NO\",IF(SSize4=0.075,INDEX(INDIRECT(Grade),4,5),IF(JMFDes4-IF(SSize4>=2,5,3)<0,0,JMFDes4-IF(SSize4>=2,5,3))),IF(SSize4=0.075,100-INDEX(INDIRECT(Grade),4,5),100-IF(JMFDes4-IF(SSize4>=2,5,3)<0,0,JMFDes4-IF(SSize4>=2,5,3))))))","v":""}]
[null,null,"No. 4","4.75 mm",4.75,30,50,null,5,null,null,null,null,null,null,null,null,null,null,null,null,null,null,null,null,"NO",null,null,null,null,null,null,null,null,null,{"$f":"sieve5","v":""},{"$f":"SSize5","v":""},"","",{"$f":"Test_Data!L42","v":""},{"$f":"IF(JMFDes5=\"\",\"\",IF(Spec5=\"\",\"\",IF(RETAINED = \"NO\",IF(SSize5=0.075,INDEX(INDIRECT(Grade),5,6),IF(JMFDes5+IF(SSize5>=2,5,3)>500,500,JMFDes5+IF(SSize5>=2,5,3))),IF(SSize5=0.075,100-INDEX(INDIRECT(Grade),5,6),100-IF(JMFDes5+IF(SSize5>=2,5,3)>500,500,JMFDes5+IF(SSize5>=2,5,3))))))","v":""},{"$f":"IF(JMFDes5=\"\",\"\",IF(Spec5=\"\",\"\",IF(RETAINED = \"NO\",IF(SSize5=0.075,INDEX(INDIRECT(Grade),5,5),IF(JMFDes5-IF(SSize5>=2,5,3)<0,0,JMFDes5-IF(SSize5>=2,5,3))),IF(SSize5=0.075,100-INDEX(INDIRECT(Grade),5,5),100-IF(JMFDes5-IF(SSize5>=2,5,3)<0,0,JMFDes5-IF(SSize5>=2,5,3))))))","v":""}]
[null,null,"No. 10","2 mm",2,20,34,null,5,null,null,null,null,null,null,null,null,null,null,null,null,null,null,null,null,"NO",null,null,null,null,null,null,null,null,null,{"$f":"sieve6","v":""},{"$f":"SSize6","v":""},"","",{"$f":"Test_Data!L43","v":""},{"$f":"IF(JMFDes6=\"\",\"\",IF(Spec6=\"\",\"\",IF(RETAINED = \"NO\",IF(SSize6=0.075,INDEX(INDIRECT(Grade),6,6),IF(JMFDes6+IF(SSize6>=2,5,3)>600,600,JMFDes6+IF(SSize6>=2,5,3))),IF(SSize6=0.075,100-INDEX(INDIRECT(Grade),6,6),100-IF(JMFDes6+IF(SSize6>=2,5,3)>600,600,JMFDes6+IF(SSize6>=2,5,3))))))","v":""},{"$f":"IF(JMFDes6=\"\",\"\",IF(Spec6=\"\",\"\",IF(RETAINED = \"NO\",IF(SSize6=0.075,INDEX(INDIRECT(Grade),6,5),IF(JMFDes6-IF(SSize6>=2,5,3)<0,0,JMFDes6-IF(SSize6>=2,5,3))),IF(SSize6=0.075,100-INDEX(INDIRECT(Grade),6,5),100-IF(JMFDes6-IF(SSize6>=2,5,3)<0,0,JMFDes6-IF(SSize6>=2,5,3))))))","v":""}]
[null,null,"No. 40","425 µm",0.42499999999999999,5,20,null,3,null,null,null,null,null,null,null,null,null,null,null,null,null,null,null,null,"NO",null,null,null,null,null,null,null,null,null,{"$f":"sieve7","v":""},{"$f":"SSize7","v":""},"","",{"$f":"Test_Data!L44","v":""},{"$f":"IF(JMFDes7=\"\",\"\",IF(Spec7=\"\",\"\",IF(RETAINED = \"NO\",IF(SSize7=0.075,INDEX(INDIRECT(Grade),7,6),IF(JMFDes7+IF(SSize7>=2,5,3)>700,700,JMFDes7+IF(SSize7>=2,5,3))),IF(SSize7=0.075,100-INDEX(INDIRECT(Grade),7,6),100-IF(JMFDes7+IF(SSize7>=2,5,3)>700,700,JMFDes7+IF(SSize7>=2,5,3))))))","v":""},{"$f":"IF(JMFDes7=\"\",\"\",IF(Spec7=\"\",\"\",IF(RETAINED = \"NO\",IF(SSize7=0.075,INDEX(INDIRECT(Grade),7,5),IF(JMFDes7-IF(SSize7>=2,5,3)<0,0,JMFDes7-IF(SSize7>=2,5,3))),IF(SSize7=0.075,100-INDEX(INDIRECT(Grade),7,5),100-IF(JMFDes7-IF(SSize7>=2,5,3)<0,0,JMFDes7-IF(SSize7>=2,5,3))))))","v":""}]
[null,null,"No. 80","180 µm",0.18,2,12,null,3,null,null,null,null,null,null,null,null,null,null,null,null,null,null,null,null,"NO",null,null,null,null,null,null,null,null,null,{"$f":"sieve8","v":""},{"$f":"SSize8","v":""},"","",{"$f":"Test_Data!L45","v":""},{"$f":"IF(JMFDes8=\"\",\"\",IF(Spec8=\"\",\"\",IF(RETAINED = \"NO\",IF(SSize8=0.075,INDEX(INDIRECT(Grade),8,6),IF(JMFDes8+IF(SSize8>=2,5,3)>800,800,JMFDes8+IF(SSize8>=2,5,3))),IF(SSize8=0.075,100-INDEX(INDIRECT(Grade),8,6),100-IF(JMFDes8+IF(SSize8>=2,5,3)>800,800,JMFDes8+IF(SSize8>=2,5,3))))))","v":""},{"$f":"IF(JMFDes8=\"\",\"\",IF(Spec8=\"\",\"\",IF(RETAINED = \"NO\",IF(SSize8=0.075,INDEX(INDIRECT(Grade),8,5),IF(JMFDes8-IF(SSize8>=2,5,3)<0,0,JMFDes8-IF(SSize8>=2,5,3))),IF(SSize8=0.075,100-INDEX(INDIRECT(Grade),8,5),100-IF(JMFDes8-IF(SSize8>=2,5,3)<0,0,JMFDes8-IF(SSize8>=2,5,3))))))","v":""}]
[null,null,"No. 200","75 µm",7.4999999999999997E-2,1,6,null,3,null,null,null,null,null,null,null,null,null,null,null,null,null,null,null,null,"NO",null,null,null,null,null,null,null,null,null,{"$f":"sieve9","v":""},{"$f":"SSize9","v":""},"","",{"$f":"Test_Data!L46","v":""},{"$f":"IF(JMFDes9=\"\",\"\",IF(Spec9=\"\",\"\",IF(RETAINED = \"NO\",IF(SSize9=0.075,INDEX(INDIRECT(Grade),9,6),IF(JMFDes9+IF(SSize9>=2,5,3)>900,900,JMFDes9+IF(SSize9>=2,5,3))),IF(SSize9=0.075,100-INDEX(INDIRECT(Grade),9,6),100-IF(JMFDes9+IF(SSize9>=2,5,3)>900,900,JMFDes9+IF(SSize9>=2,5,3))))))","v":""},{"$f":"IF(JMFDes9=\"\",\"\",IF(Spec9=\"\",\"\",IF(RETAINED = \"NO\",IF(SSize9=0.075,INDEX(INDIRECT(Grade),9,5),IF(JMFDes9-IF(SSize9>=2,5,3)<0,0,JMFDes9-IF(SSize9>=2,5,3))),IF(SSize9=0.075,100-INDEX(INDIRECT(Grade),9,5),100-IF(JMFDes9-IF(SSize9>=2,5,3)<0,0,JMFDes9-IF(SSize9>=2,5,3))))))","v":""}]
[null,"TYPE B","1\"","25 mm",25,98,100,12,5,null,null,null,null,null,null,null,3,null,0.30099999999999999,"NO",45,30,null,null,null,"NO",null,null,null,null,null,null,null,null,null,null,null,0,0]
[null,null,"7/8\"","22.4 mm",22.4,95,100,null,5,null,null,null,null,null,null,null,null,null,null,"YES",null,null,null,null,null,"NO"]
[null,null,"5/8\"","16 mm",16,75,95,null,5,null,null,null,null,null,null,null,null,null,null,null,null,null,null,null,null,"NO",null,null,null,null,null,null,null,null,null,"Sieve Size Inches","Sieve Size Metric","Selection"]
[null,null,"3/8\"","9.5 mm",9.5,60,80,null,5,null,null,null,null,null,null,null,null,null,null,null,null,null,null,null,null,"NO"]
[null,null,"No. 4","4.75 mm",4.75,40,60,null,5,null,null,null,null,null,null,null,null,null,null,null,null,null,null,null,null,"NO"]
[null,null,"No. 10","2 mm",2,27,40,null,5,null,null,null,null,null,null,null,null,null,null,null,null,null,null,null,null,"NO",null,null,null,null,null,null,null,null,null,"No. 4","4.75 mm",{"$f":"IF(specyear=\"\",\"Spec Year?\",IF(specyear=\"1993\",AJ18,AK18))","v":"Spec Year?"}]
[null,null,"No. 40","425 µm",0.42499999999999999,10,25,null,3,null,null,null,null,null,null,null,null,null,null,null,null,null,null,null,null,"NO",null,null,null,null,null,null,null,null,null,"No. 10","2 mm",{"$f":"IF(specyear=\"\",\"\",IF(specyear=\"1993\",AJ19,AK19))","v":""}]
[null,null,"No. 80","180 µm",0.18,3,13,null,3,null,null,null,null,null,null,null,null,null,null,null,null,null,null,null,null,"NO"]
[null,null,"No. 200","75 µm",7.4999999999999997E-2,1,6,null,3,null,null,null,null,null,null,null,null,null,null,null,null,null,null,null,null,"NO"]
[null,"TYPE C","7/8\"","22.4 mm",22.4,98,100,13,5,null,null,null,null,null,null,null,3,null,0.30099999999999999,"NO",45,30,null,null,null,"NO",null,null,null,null,null,null,null,null,null,"Current % Retained?","Production % Retained?"]
[null,null,"5/8\"","16 mm",16,95,100,null,5,null,null,null,null,null,null,null,null,null,null,"YES",null,null,null,null,null,"NO"]
[null,null,"3/8\"","9.5 mm",9.5,70,85,null,5,null,null,null,null,null,null,null,null,null,null,null,null,null,null,null,null,"NO"]
[null,null,"No. 4","4.75 mm",4.75,43,63,null,5,null,null,null,null,null,null,null,null,null,null,null,null,null,null,null,null,"NO",null,null,null,null,null,null,null,null,null,{"$f":"IF(ISERROR(INDEX(INDIRECT(Grade),1,19)),\"\",INDEX(INDIRECT(Grade),1,19))","v":""},{"$f":"IF(ISERROR(INDEX(INDIRECT(Grade),2,19)),\"\",INDEX(INDIRECT(Grade),2,19))","v":""}]
[null,null,"No. 10","2 mm",2,30,40,null,5,null,null,null,null,null,null,null,null,null,null,null,null,null,null,null,null,"NO"]
[null,null,"No. 40","425 µm",0.42499999999999999,10,25,null,3,null,null,null,null,null,null,null,null,null,null,null,null,null,null,null,null,"NO",null,null,null,null,null,null,null,null,null,"AC Methods","Aggregate Method"]
[null,null,"No. 80","180 µm",0.18,3,13,null,3,null,null,null,null,null,null,null,null,null,null,null,null,null,null,null,null,"NO",null,null,null,null,null,null,null,null,null,"Ignition Oven Method","Ignition Oven Method"]
[null,null,"No. 200","75 µm",7.4999999999999997E-2,1,6,null,3,null,null,null,null,null,null,null,null,null,null,null,null,null,null,null,null,"NO",null,null,null,null,null,null,null,null,null,"Nuclear Method","Nuclear Method"]
[null,"TYPE D","1/2\"","12.5 mm",12.5,98,100,14,5,null,null,null,null,null,null,null,3,null,0.30099999999999999,"NO",45,30,null,null,null,"NO",null,null,null,null,null,null,null,null,null,"Ignition Oven Method","Ignition Oven Method"]
[null,null,"3/8\"","9.5 mm",9.5,85,100,null,5,null,null,null,null,null,null,null,null,null,null,"YES",null,null,null,null,null,"NO",null,null,null,null,null,null,null,null,null,"Nuclear Method","Belt Sample"]
[null,null,"No. 4","4.75 mm",4.75,50,70,null,5,null,null,null,null,null,null,null,null,null,null,null,null,null,null,null,null,"NO",null,null,null,null,null,null,null,null,null,{"$f":"IF(OR(Grade = \"Microsurfacing\",LEFT(Grade,3) = \"PFC\",LEFT(Grade,4)=\"SMAR\"), \"Asphalt Meter\", \"\")","v":""},{"$f":"IF(Grade = \"Microsurfacing\",\"\",\"Extraction Method\")","v":"Extraction Method"}]
[null,null,"No. 10","2 mm",2,32,42,null,5,null,null,null,null,null,null,null,null,null,null,null,null,null,null,null,null,"NO",null,null,null,null,null,null,null,null,null,null,"Hot Bin Gradation"]
[null,null,"No. 40","425 µm",0.42499999999999999,11,26,null,3,null,null,null,null,null,null,null,null,null,null,null,null,null,null,null,null,"NO",null,null,null,null,null,null,null,null,null,null,"(Design) JMF Spec's"," (Design) JMF Spec's for Microsurfacing","(Test) JMF Spec's","(Test) JMF Spec's for Microsurfacing",null,"(Test) Gradations Acceptable?","(Test) Gradations Acceptable - 2?"]
[null,null,"No. 80","180 µm",0.18,4,14,null,3,null,null,null,null,null,null,null,null,null,null,null,null,null,null,null,null,"NO"]
[null,null,"No. 200","75 µm",7.4999999999999997E-2,1,6,null,3,null,null,null,null,null,null,null,null,null,null,null,null,null,null,null,null,"NO",null,null,null,null,null,null,null,null,null,null,{"$f":"IF(INDEX(INDIRECT(Grade),1,8)=\"MGL\",INDEX(INDIRECT(Grade),1,5) & \"-\" & INDEX(INDIRECT(Grade),1,6),IF(OR(INDEX(INDIRECT(Grade),1,5)>100-((100-MixDes1)-INDEX(INDIRECT(Grade),1,8)),INDEX(INDIRECT(Grade),1,6)<100-((100-MixDes1)+INDEX(INDIRECT(Grade),1,8))),\"O U T\",  IF(INDEX(INDIRECT(Grade),1,5)>100-((100-MixDes1)+INDEX(INDIRECT(Grade),1,8)),INDEX(INDIRECT(Grade),1,5),100-((100-MixDes1)+INDEX(INDIRECT(Grade),1,8))) & \"-\" & IF(INDEX(INDIRECT(Grade),1,6)<100-((100-MixDes1)-INDEX(INDIRECT(Grade),1,8)),INDEX(INDIRECT(Grade),1,6),100-((100-MixDes1)-INDEX(INDIRECT(Grade),1,8)))))","v":{"$error":"#REF!"}},{"$f":"IF(INDEX(INDIRECT(Grade),1,8)=\"MGL\",INDEX(INDIRECT(Grade),1,5) & \"-\" & INDEX(INDIRECT(Grade),1,6),IF(OR(INDEX(INDIRECT(Grade),1,5)>MixDes1+INDEX(INDIRECT(Grade),1,8),INDEX(INDIRECT(Grade),1,6)<MixDes1-INDEX(INDIRECT(Grade),1,8)),\"O U T\",IF(MixDes1-INDEX(INDIRECT(Grade),1,8) < INDEX(INDIRECT(Grade),1,5),INDEX(INDIRECT(Grade),1,5) & \"-\" & IF(MixDes1 + INDEX(INDIRECT(Grade),1,8) > INDEX(INDIRECT(Grade),1,6),INDEX(INDIRECT(Grade),1,6),MixDes1+INDEX(INDIRECT(Grade),1,8)), MixDes1-INDEX(INDIRECT(Grade),1,8) & \"-\" & IF(MixDes1+INDEX(INDIRECT(Grade),1,8)>INDEX(INDIRECT(Grade),1,6),INDEX(INDIRECT(Grade),1,6),MixDes1+INDEX(INDIRECT(Grade),1,8)))))","v":{"$error":"#REF!"}},{"$f":"IF(INDEX(INDIRECT(Grade),1,8)=\"MGL\",INDEX(INDIRECT(Grade),1,5) & \"-\" & INDEX(INDIRECT(Grade),1,6),IF(ProdRetained = \"YES\", TEXT(IF(100-JMFDes1-INDEX(INDIRECT(Grade),1,8)<0,0,100-JMFDes1-INDEX(INDIRECT(Grade),1,8)),\"##0.0\") & \"-\" & TEXT(IF(100-JMFDes1+INDEX(INDIRECT(Grade),1,8)<0,0,100-JMFDes1+INDEX(INDIRECT(Grade),1,8)),\"##0.0\"),TEXT(IF(JMFDes1-INDEX(INDIRECT(Grade),1,8)<0,0,JMFDes1-INDEX(INDIRECT(Grade),1,8)),\"##0.0\") & \"-\" & TEXT(IF(JMFDes1+INDEX(INDIRECT(Grade),1,8)>100,100,JMFDes1+INDEX(INDIRECT(Grade),1,8)),\"##0.0\")))","v":{"$error":"#REF!"}},{"$f":"IF(INDEX(INDIRECT(Grade),1,8)=\"MGL\",testjmftol1,IF(RETAINED = \"NO\", TEXT(IF(100-JMFDes1-INDEX(INDIRECT(Grade),1,8)<0,0,100-JMFDes1-INDEX(INDIRECT(Grade),1,8)),\"##0.0\") & \"-\" & TEXT(IF(100-JMFDes1+INDEX(INDIRECT(Grade),1,8)<0,0,100-JMFDes1+INDEX(INDIRECT(Grade),1,8)),\"##0.0\"),TEXT(IF(JMFDes1-INDEX(INDIRECT(Grade),1,8)<0,0,JMFDes1-INDEX(INDIRECT(Grade),1,8)),\"##0.0\") & \"-\" & TEXT(IF(JMFDes1+INDEX(INDIRECT(Grade),1,8)>0,0,JMFDes1+INDEX(INDIRECT(Grade),1,8)),\"##0.0\")))","v":{"$error":"#REF!"}},null,{"$f":"IF(OR('Design Data'!G43=\"\",JMFDes1=\"\",Field76=\"\"),\"\",IF(AND(INDEX(INDIRECT(Grade),1,25)=\"YES\",OR(Test_Data!L38>INDEX(INDIRECT(Grade),1,6),Test_Data!L38<INDEX(INDIRECT(Grade),1,5))),\"ý\",IF(ProdRetained = \"YES\",IF(INDEX(INDIRECT(Grade),1,8)=\"MGL\",IF(AND(Test_Data!J38>=INDEX(INDIRECT(Grade),1,5),Test_Data!J38<=INDEX(INDIRECT(Grade),1,6)),\"þ\",\"ý\"),IF(ABS(100-JMFDes1-Test_Data!$H38)>INDEX(INDIRECT(Grade),1,8),\"ý\",\"þ\")),AQ36)))","v":""},{"$f":"IF(RETAINED=\"NO\",IF(INDEX(INDIRECT(Grade),1,8)=\"MGL\",IF(AND(Test_Data!L38>=INDEX(INDIRECT(Grade),1,5),Test_Data!L38<=INDEX(INDIRECT(Grade),1,6)),\"þ\",\"ý\"),IF(ABS(JMFDes1-Test_Data!$L38)>INDEX(INDIRECT(Grade),1,8),\"ý\",\"þ\")),IF(INDEX(INDIRECT(Grade),1,8)=\"MGL\",IF(AND(Test_Data!J38>=INDEX(INDIRECT(Grade),1,5),Test_Data!J38<=INDEX(INDIRECT(Grade),1,6)),\"þ\",\"ý\"),IF(ABS(JMFDes1-Test_Data!$J38)>INDEX(INDIRECT(Grade),1,8),\"ý\",\"þ\")))","v":{"$error":"#REF!"}}]
[null,"TYPE F","3/8\"","9.5 mm",9.5,98,100,15,5,null,null,null,null,null,null,null,3,null,0.30099999999999999,"NO",45,30,null,null,null,"NO",null,null,null,null,null,null,null,null,null,null,{"$f":"IF(INDEX(INDIRECT(Grade),2,8)=\"MGL\",INDEX(INDIRECT(Grade),2,5) & \"-\" & INDEX(INDIRECT(Grade),2,6),IF(OR(INDEX(INDIRECT(Grade),2,5)>JMFDes1-((MixDes1-Mixdes2)-INDEX(INDIRECT(Grade),2,8)),INDEX(INDIRECT(Grade),2,6)<JMFDes1-((MixDes1-Mixdes2)+INDEX(INDIRECT(Grade),2,8))),\"O U T\",  IF(INDEX(INDIRECT(Grade),2,5)>JMFDes1-((MixDes1-Mixdes2)+INDEX(INDIRECT(Grade),2,8)),INDEX(INDIRECT(Grade),2,5),JMFDes1-((MixDes1-Mixdes2)+INDEX(INDIRECT(Grade),2,8))) & \"-\" & IF(INDEX(INDIRECT(Grade),2,6)<JMFDes1-((MixDes1-Mixdes2)-INDEX(INDIRECT(Grade),2,8)),INDEX(INDIRECT(Grade),2,6),JMFDes1-((MixDes1-Mixdes2)-INDEX(INDIRECT(Grade),2,8)))))","v":{"$error":"#REF!"}},{"$f":"IF(INDEX(INDIRECT(Grade),2,8)=\"MGL\",INDEX(INDIRECT(Grade),2,5) & \"-\" & INDEX(INDIRECT(Grade),2,6),IF(OR(INDEX(INDIRECT(Grade),2,5)>Mixdes2+INDEX(INDIRECT(Grade),2,8),INDEX(INDIRECT(Grade),2,6)<Mixdes2-INDEX(INDIRECT(Grade),2,8)),\"O U T\",IF(Mixdes2-INDEX(INDIRECT(Grade),2,8) < INDEX(INDIRECT(Grade),2,5),INDEX(INDIRECT(Grade),2,5) & \"-\" & IF(Mixdes2 + INDEX(INDIRECT(Grade),2,8) > INDEX(INDIRECT(Grade),2,6),INDEX(INDIRECT(Grade),2,6),Mixdes2+INDEX(INDIRECT(Grade),2,8)), Mixdes2-INDEX(INDIRECT(Grade),2,8) & \"-\" & IF(Mixdes2+INDEX(INDIRECT(Grade),2,8)>INDEX(INDIRECT(Grade),2,6),INDEX(INDIRECT(Grade),2,6),Mixdes2+INDEX(INDIRECT(Grade),2,8)))))","v":{"$error":"#REF!"}},{"$f":"IF(INDEX(INDIRECT(Grade),2,8)=\"MGL\",INDEX(INDIRECT(Grade),2,5) & \"-\" & INDEX(INDIRECT(Grade),2,6),IF(ProdRetained = \"YES\",TEXT(IF(AND(JMFDes1-JMFDes2-INDEX(INDIRECT(Grade),2,8)>=0,JMFDes1-JMFDes2-INDEX(INDIRECT(Grade),2,8)<=100),JMFDes1-JMFDes2-INDEX(INDIRECT(Grade),2,8), TEXT(IF(JMFDes1-JMFDes2-INDEX(INDIRECT(Grade),2,8)>100,100,0),\"##0.0\")),\"##0.0\") & \"-\" & TEXT(IF(AND(JMFDes1-JMFDes2+INDEX(INDIRECT(Grade),2,8)>=0,JMFDes1-JMFDes2+INDEX(INDIRECT(Grade),2,8)<=100),JMFDes1-JMFDes2+INDEX(INDIRECT(Grade),2,8), TEXT(IF(JMFDes1-JMFDes2+INDEX(INDIRECT(Grade),2,8)>100,100,0),\"##0.0\")),\"##0.0\"),TEXT(IF(AND(JMFDes2-INDEX(INDIRECT(Grade),2,8)>=0,JMFDes2-INDEX(INDIRECT(Grade),2,8)<=100),JMFDes2-INDEX(INDIRECT(Grade),2,8), TEXT(IF(JMFDes2-INDEX(INDIRECT(Grade),2,8)>100,100,0),\"##0.0\")),\"##0.0\") & \"-\" & TEXT(IF(AND(JMFDes2+INDEX(INDIRECT(Grade),2,8)>=0,JMFDes2+INDEX(INDIRECT(Grade),2,8)<=100),JMFDes2+INDEX(INDIRECT(Grade),2,8), TEXT(IF(JMFDes2+INDEX(INDIRECT(Grade),2,8)>100,100,0),\"##0.0\")),\"##0.0\")))","v":{"$error":"#REF!"}},{"$f":"IF(INDEX(INDIRECT(Grade),2,8)=\"MGL\",testjmftol2,IF(RETAINED = \"NO\",TEXT(IF(AND(JMFDes1-JMFDes2-INDEX(INDIRECT(Grade),2,8)>=0,JMFDes1-JMFDes2-INDEX(INDIRECT(Grade),2,8)<=100),JMFDes1-JMFDes2-INDEX(INDIRECT(Grade),2,8), TEXT(IF(JMFDes1-JMFDes2-INDEX(INDIRECT(Grade),2,8)>100,100,0),\"##0.0\")),\"##0.0\") & \"-\" & TEXT(IF(AND(JMFDes1-JMFDes2+INDEX(INDIRECT(Grade),2,8)>=0,JMFDes1-JMFDes2+INDEX(INDIRECT(Grade),2,8)<=100),JMFDes1-JMFDes2+INDEX(INDIRECT(Grade),2,8), TEXT(IF(JMFDes1-JMFDes2+INDEX(INDIRECT(Grade),2,8)>100,100,0),\"##0.0\")),\"##0.0\"),TEXT(IF(AND(JMFDes2-JMFDes1-INDEX(INDIRECT(Grade),2,8)>=0,JMFDes2-JMFDes1-INDEX(INDIRECT(Grade),2,8)<=100),JMFDes2-JMFDes1-INDEX(INDIRECT(Grade),2,8), TEXT(IF(JMFDes2-JMFDes1-INDEX(INDIRECT(Grade),2,8)>100,100,0),\"##0.0\")),\"##0.0\") & \"-\" & TEXT(IF(AND(JMFDes2-JMFDes1+INDEX(INDIRECT(Grade),2,8)>=0,JMFDes2-JMFDes1+INDEX(INDIRECT(Grade),2,8)<=100),JMFDes2-JMFDes1+INDEX(INDIRECT(Grade),2,8), TEXT(IF(JMFDes2-JMFDes1+INDEX(INDIRECT(Grade),2,8)>100,100,0),\"##0.0\")),\"##0.0\")))","v":{"$error":"#REF!"}},null,{"$f":"IF(OR('Design Data'!G44=\"\",JMFDes2=\"\",Field78=\"\"),\"\",IF(AND(INDEX(INDIRECT(Grade),2,25)=\"YES\",OR(Test_Data!L39>INDEX(INDIRECT(Grade),2,6),Test_Data!L39<INDEX(INDIRECT(Grade),2,5))),\"ý\",IF(ProdRetained = \"YES\",IF(INDEX(INDIRECT(Grade),2,8)=\"MGL\",IF(AND(Test_Data!J39>=INDEX(INDIRECT(Grade),2,5),Test_Data!J39<=INDEX(INDIRECT(Grade),2,6)),\"þ\",\"ý\"),IF(ABS(JMFDes1-JMFDes2-Test_Data!$H39)>INDEX(INDIRECT(Grade),2,8),\"ý\",\"þ\")),AQ37)))","v":""},{"$f":"IF(RETAINED=\"NO\",IF(INDEX(INDIRECT(Grade),2,8)=\"MGL\",IF(AND(Test_Data!L39>=INDEX(INDIRECT(Grade),2,5),Test_Data!L39<=INDEX(INDIRECT(Grade),2,6)),\"þ\",\"ý\"),IF(ABS(JMFDes2-Test_Data!$L39)>INDEX(INDIRECT(Grade),2,8),\"ý\",\"þ\")),IF(INDEX(INDIRECT(Grade),2,8)=\"MGL\",IF(AND(Test_Data!J39>=INDEX(INDIRECT(Grade),2,5),Test_Data!J39<=INDEX(INDIRECT(Grade),2,6)),\"þ\",\"ý\"),IF(ABS(JMFDes2-Test_Data!$J39)>INDEX(INDIRECT(Grade),2,8),\"ý\",\"þ\")))","v":{"$error":"#REF!"}}]
[null,null,"1/4\"","6.3 mm",6.3,95,100,null,5,null,null,null,null,null,null,null,null,null,null,"YES",null,null,null,null,null,"NO",null,null,null,null,null,null,null,null,null,null,{"$f":"IF(INDEX(INDIRECT(Grade),3,8)=\"MGL\",INDEX(INDIRECT(Grade),3,5) & \"-\" & INDEX(INDIRECT(Grade),3,6),IF(OR(INDEX(INDIRECT(Grade),3,5)>JMFDes2-((Mixdes2-MixDes3)-INDEX(INDIRECT(Grade),3,8)),INDEX(INDIRECT(Grade),3,6)<JMFDes2-((Mixdes2-MixDes3)+INDEX(INDIRECT(Grade),3,8))),\"O U T\",  IF(INDEX(INDIRECT(Grade),3,5)>JMFDes2-((Mixdes2-MixDes3)+INDEX(INDIRECT(Grade),3,8)),INDEX(INDIRECT(Grade),3,5),JMFDes2-((Mixdes2-MixDes3)+INDEX(INDIRECT(Grade),3,8))) & \"-\" & IF(INDEX(INDIRECT(Grade),3,6)<JMFDes2-((Mixdes2-MixDes3)-INDEX(INDIRECT(Grade),3,8)),INDEX(INDIRECT(Grade),3,6),JMFDes2-((Mixdes2-MixDes3)-INDEX(INDIRECT(Grade),3,8)))))","v":{"$error":"#REF!"}},{"$f":"IF(INDEX(INDIRECT(Grade),3,8)=\"MGL\",INDEX(INDIRECT(Grade),3,5) & \"-\" & INDEX(INDIRECT(Grade),3,6),IF(OR(INDEX(INDIRECT(Grade),3,5)>MixDes3+INDEX(INDIRECT(Grade),3,8),INDEX(INDIRECT(Grade),3,6)<MixDes3-INDEX(INDIRECT(Grade),3,8)),\"O U T\",IF(MixDes3-INDEX(INDIRECT(Grade),3,8) < INDEX(INDIRECT(Grade),3,5),INDEX(INDIRECT(Grade),3,5) & \"-\" & IF(MixDes3 + INDEX(INDIRECT(Grade),3,8) > INDEX(INDIRECT(Grade),3,6),INDEX(INDIRECT(Grade),3,6),MixDes3+INDEX(INDIRECT(Grade),3,8)), MixDes3-INDEX(INDIRECT(Grade),3,8) & \"-\" & IF(MixDes3+INDEX(INDIRECT(Grade),3,8)>INDEX(INDIRECT(Grade),3,6),INDEX(INDIRECT(Grade),3,6),MixDes3+INDEX(INDIRECT(Grade),3,8)))))","v":{"$error":"#REF!"}},{"$f":"IF(INDEX(INDIRECT(Grade),3,8)=\"MGL\",INDEX(INDIRECT(Grade),3,5) & \"-\" & INDEX(INDIRECT(Grade),3,6),IF(ProdRetained = \"YES\",TEXT(IF(AND(JMFDes2-JMFDes3-INDEX(INDIRECT(Grade),3,8)>=0,JMFDes2-JMFDes3-INDEX(INDIRECT(Grade),3,8)<=100),JMFDes2-JMFDes3-INDEX(INDIRECT(Grade),3,8), TEXT(IF(JMFDes2-JMFDes3-INDEX(INDIRECT(Grade),3,8)>100,100,0),\"##0.0\")),\"##0.0\") & \"-\" & TEXT(IF(AND(JMFDes2-JMFDes3+INDEX(INDIRECT(Grade),3,8)>=0,JMFDes2-JMFDes3+INDEX(INDIRECT(Grade),3,8)<=100),JMFDes2-JMFDes3+INDEX(INDIRECT(Grade),3,8), TEXT(IF(JMFDes2-JMFDes3+INDEX(INDIRECT(Grade),3,8)>100,100,0),\"##0.0\")),\"##0.0\"),TEXT(IF(AND(JMFDes3-INDEX(INDIRECT(Grade),3,8)>=0,JMFDes3-INDEX(INDIRECT(Grade),3,8)<=100),JMFDes3-INDEX(INDIRECT(Grade),3,8), TEXT(IF(JMFDes3-INDEX(INDIRECT(Grade),3,8)>100,100,0),\"##0.0\")),\"##0.0\") & \"-\" & TEXT(IF(AND(JMFDes3+INDEX(INDIRECT(Grade),3,8)>=0,JMFDes3+INDEX(INDIRECT(Grade),3,8)<=100),JMFDes3+INDEX(INDIRECT(Grade),3,8), TEXT(IF(JMFDes3+INDEX(INDIRECT(Grade),3,8)>100,100,0),\"##0.0\")),\"##0.0\")))","v":{"$error":"#REF!"}},{"$f":"IF(INDEX(INDIRECT(Grade),3,8)=\"MGL\",testjmftol3,IF(RETAINED = \"NO\",TEXT(IF(AND(JMFDes2-JMFDes3-INDEX(INDIRECT(Grade),3,8)>=0,JMFDes2-JMFDes3-INDEX(INDIRECT(Grade),3,8)<=100),JMFDes2-JMFDes3-INDEX(INDIRECT(Grade),3,8), TEXT(IF(JMFDes2-JMFDes3-INDEX(INDIRECT(Grade),3,8)>100,100,0),\"##0.0\")),\"##0.0\") & \"-\" & TEXT(IF(AND(JMFDes2-JMFDes3+INDEX(INDIRECT(Grade),3,8)>=0,JMFDes2-JMFDes3+INDEX(INDIRECT(Grade),3,8)<=100),JMFDes2-JMFDes3+INDEX(INDIRECT(Grade),3,8), TEXT(IF(JMFDes2-JMFDes3+INDEX(INDIRECT(Grade),3,8)>100,100,0),\"##0.0\")),\"##0.0\"),TEXT(IF(AND(JMFDes3-JMFDes2-INDEX(INDIRECT(Grade),3,8)>=0,JMFDes3-JMFDes2-INDEX(INDIRECT(Grade),3,8)<=100),JMFDes3-JMFDes2-INDEX(INDIRECT(Grade),3,8), TEXT(IF(JMFDes3-JMFDes2-INDEX(INDIRECT(Grade),3,8)>100,100,0),\"##0.0\")),\"##0.0\") & \"-\" & TEXT(IF(AND(JMFDes3-JMFDes2+INDEX(INDIRECT(Grade),3,8)>=0,JMFDes3-JMFDes2+INDEX(INDIRECT(Grade),3,8)<=100),JMFDes3-JMFDes2+INDEX(INDIRECT(Grade),3,8), TEXT(IF(JMFDes3-JMFDes2+INDEX(INDIRECT(Grade),3,8)>100,100,0),\"##0.0\")),\"##0.0\")))","v":{"$error":"#REF!"}},null,{"$f":"IF(OR('Design Data'!G45=\"\",JMFDes3=\"\",Field80=\"\"),\"\",IF(AND(INDEX(INDIRECT(Grade),3,25)=\"YES\",OR(Test_Data!L40>INDEX(INDIRECT(Grade),3,6),Test_Data!L40<INDEX(INDIRECT(Grade),3,5))),\"ý\",IF(ProdRetained = \"YES\",IF(INDEX(INDIRECT(Grade),3,8)=\"MGL\",IF(AND(Test_Data!J40>=INDEX(INDIRECT(Grade),3,5),Test_Data!J40<=INDEX(INDIRECT(Grade),3,6)),\"þ\",\"ý\"),IF(ABS(JMFDes2-JMFDes3-Test_Data!$H40)>INDEX(INDIRECT(Grade),3,8),\"ý\",\"þ\")),AQ38)))","v":""},{"$f":"IF(RETAINED=\"NO\",IF(INDEX(INDIRECT(Grade),3,8)=\"MGL\",IF(AND(Test_Data!L40>=INDEX(INDIRECT(Grade),3,5),Test_Data!L40<=INDEX(INDIRECT(Grade),3,6)),\"þ\",\"ý\"),IF(ABS(JMFDes3-Test_Data!$L40)>INDEX(INDIRECT(Grade),3,8),\"ý\",\"þ\")),IF(INDEX(INDIRECT(Grade),3,8)=\"MGL\",IF(AND(Test_Data!J40>=INDEX(INDIRECT(Grade),3,5),Test_Data!J40<=INDEX(INDIRECT(Grade),3,6)),\"þ\",\"ý\"),IF(ABS(JMFDes3-Test_Data!$J40)>INDEX(INDIRECT(Grade),3,8),\"ý\",\"þ\")))","v":{"$error":"#REF!"}}]
[null,null,"No. 10","2 mm",2,32,42,null,5,null,null,null,null,null,null,null,null,null,null,null,null,null,null,null,null,"NO",null,null,null,null,null,null,null,null,null,null,{"$f":"IF(INDEX(INDIRECT(Grade),4,8)=\"MGL\",INDEX(INDIRECT(Grade),4,5) & \"-\" & INDEX(INDIRECT(Grade),4,6),IF(OR(INDEX(INDIRECT(Grade),4,5)>JMFDes3-((MixDes3-Mixdes4)-INDEX(INDIRECT(Grade),4,8)),INDEX(INDIRECT(Grade),4,6)<JMFDes3-((MixDes3-Mixdes4)+INDEX(INDIRECT(Grade),4,8))),\"O U T\",  IF(INDEX(INDIRECT(Grade),4,5)>JMFDes3-((MixDes3-Mixdes4)+INDEX(INDIRECT(Grade),4,8)),INDEX(INDIRECT(Grade),4,5),JMFDes3-((MixDes3-Mixdes4)+INDEX(INDIRECT(Grade),4,8))) & \"-\" & IF(INDEX(INDIRECT(Grade),4,6)<JMFDes3-((MixDes3-Mixdes4)-INDEX(INDIRECT(Grade),4,8)),INDEX(INDIRECT(Grade),4,6),JMFDes3-((MixDes3-Mixdes4)-INDEX(INDIRECT(Grade),4,8)))))","v":{"$error":"#REF!"}},{"$f":"IF(INDEX(INDIRECT(Grade),4,8)=\"MGL\",INDEX(INDIRECT(Grade),4,5) & \"-\" & INDEX(INDIRECT(Grade),4,6),IF(OR(INDEX(INDIRECT(Grade),4,5)>Mixdes4+INDEX(INDIRECT(Grade),4,8),INDEX(INDIRECT(Grade),4,6)<Mixdes4-INDEX(INDIRECT(Grade),4,8)),\"O U T\",IF(Mixdes4-INDEX(INDIRECT(Grade),4,8) < INDEX(INDIRECT(Grade),4,5),INDEX(INDIRECT(Grade),4,5) & \"-\" & IF(Mixdes4 + INDEX(INDIRECT(Grade),4,8) > INDEX(INDIRECT(Grade),4,6),INDEX(INDIRECT(Grade),4,6),Mixdes4+INDEX(INDIRECT(Grade),4,8)), Mixdes4-INDEX(INDIRECT(Grade),4,8) & \"-\" & IF(Mixdes4+INDEX(INDIRECT(Grade),4,8)>INDEX(INDIRECT(Grade),4,6),INDEX(INDIRECT(Grade),4,6),Mixdes4+INDEX(INDIRECT(Grade),4,8)))))","v":{"$error":"#REF!"}},{"$f":"IF(INDEX(INDIRECT(Grade),4,8)=\"MGL\",INDEX(INDIRECT(Grade),4,5) & \"-\" & INDEX(INDIRECT(Grade),4,6),IF(ProdRetained = \"YES\",TEXT(IF(AND(JMFDes3-JMFDes4-INDEX(INDIRECT(Grade),4,8)>=0,JMFDes3-JMFDes4-INDEX(INDIRECT(Grade),4,8)<=100),JMFDes3-JMFDes4-INDEX(INDIRECT(Grade),4,8), TEXT(IF(JMFDes3-JMFDes4-INDEX(INDIRECT(Grade),4,8)>100,100,0),\"##0.0\")),\"##0.0\") & \"-\" & TEXT(IF(AND(JMFDes3-JMFDes4+INDEX(INDIRECT(Grade),4,8)>=0,JMFDes3-JMFDes4+INDEX(INDIRECT(Grade),4,8)<=100),JMFDes3-JMFDes4+INDEX(INDIRECT(Grade),4,8), TEXT(IF(JMFDes3-JMFDes4+INDEX(INDIRECT(Grade),4,8)>100,100,0),\"##0.0\")),\"##0.0\"),TEXT(IF(AND(JMFDes4-INDEX(INDIRECT(Grade),4,8)>=0,JMFDes4-INDEX(INDIRECT(Grade),4,8)<=100),JMFDes4-INDEX(INDIRECT(Grade),4,8), TEXT(IF(JMFDes4-INDEX(INDIRECT(Grade),4,8)>100,100,0),\"##0.0\")),\"##0.0\") & \"-\" & TEXT(IF(AND(JMFDes4+INDEX(INDIRECT(Grade),4,8)>=0,JMFDes4+INDEX(INDIRECT(Grade),4,8)<=100),JMFDes4+INDEX(INDIRECT(Grade),4,8), TEXT(IF(JMFDes4+INDEX(INDIRECT(Grade),4,8)>100,100,0),\"##0.0\")),\"##0.0\")))","v":{"$error":"#REF!"}},{"$f":"IF(INDEX(INDIRECT(Grade),4,8)=\"MGL\",testjmftol4,IF(RETAINED = \"NO\",TEXT(IF(AND(JMFDes3-JMFDes4-INDEX(INDIRECT(Grade),4,8)>=0,JMFDes3-JMFDes4-INDEX(INDIRECT(Grade),4,8)<=100),JMFDes3-JMFDes4-INDEX(INDIRECT(Grade),4,8), TEXT(IF(JMFDes3-JMFDes4-INDEX(INDIRECT(Grade),4,8)>100,100,0),\"##0.0\")),\"##0.0\") & \"-\" & TEXT(IF(AND(JMFDes3-JMFDes4+INDEX(INDIRECT(Grade),4,8)>=0,JMFDes3-JMFDes4+INDEX(INDIRECT(Grade),4,8)<=100),JMFDes3-JMFDes4+INDEX(INDIRECT(Grade),4,8), TEXT(IF(JMFDes3-JMFDes4+INDEX(INDIRECT(Grade),4,8)>100,100,0),\"##0.0\")),\"##0.0\"),TEXT(IF(AND(JMFDes4-JMFDes3-INDEX(INDIRECT(Grade),4,8)>=0,JMFDes4-JMFDes3-INDEX(INDIRECT(Grade),4,8)<=100),JMFDes4-JMFDes3-INDEX(INDIRECT(Grade),4,8), TEXT(IF(JMFDes4-JMFDes3-INDEX(INDIRECT(Grade),4,8)>100,100,0),\"##0.0\")),\"##0.0\") & \"-\" & TEXT(IF(AND(JMFDes4-JMFDes3+INDEX(INDIRECT(Grade),4,8)>=0,JMFDes4-JMFDes3+INDEX(INDIRECT(Grade),4,8)<=100),JMFDes4-JMFDes3+INDEX(INDIRECT(Grade),4,8), TEXT(IF(JMFDes4-JMFDes3+INDEX(INDIRECT(Grade),4,8)>100,100,0),\"##0.0\")),\"##0.0\")))","v":{"$error":"#REF!"}},null,{"$f":"IF(OR('Design Data'!G46=\"\",JMFDes4=\"\",Field82=\"\"),\"\",IF(AND(INDEX(INDIRECT(Grade),4,25)=\"YES\",OR(Test_Data!L41>INDEX(INDIRECT(Grade),4,6),Test_Data!L41<INDEX(INDIRECT(Grade),4,5))),\"ý\",IF(ProdRetained = \"YES\",IF(INDEX(INDIRECT(Grade),4,8)=\"MGL\",IF(AND(Test_Data!J41>=INDEX(INDIRECT(Grade),4,5),Test_Data!J41<=INDEX(INDIRECT(Grade),4,6)),\"þ\",\"ý\"),IF(ABS(JMFDes3-JMFDes4-Test_Data!$H41)>INDEX(INDIRECT(Grade),4,8),\"ý\",\"þ\")),AQ39)))","v":""},{"$f":"IF(RETAINED=\"NO\",IF(INDEX(INDIRECT(Grade),4,8)=\"MGL\",IF(AND(Test_Data!L41>=INDEX(INDIRECT(Grade),4,5),Test_Data!L41<=INDEX(INDIRECT(Grade),4,6)),\"þ\",\"ý\"),IF(ABS(JMFDes4-Test_Data!$L41)>INDEX(INDIRECT(Grade),4,8),\"ý\",\"þ\")),IF(INDEX(INDIRECT(Grade),4,8)=\"MGL\",IF(AND(Test_Data!J41>=INDEX(INDIRECT(Grade),4,5),Test_Data!J41<=INDEX(INDIRECT(Grade),4,6)),\"þ\",\"ý\"),IF(ABS(JMFDes4-Test_Data!$J41)>INDEX(INDIRECT(Grade),4,8),\"ý\",\"þ\")))","v":{"$error":"#REF!"}}]
[null,null,"No. 40","425 µm",0.42499999999999999,9,24,null,3,null,null,null,null,null,null,null,null,null,null,null,null,null,null,null,null,"NO",null,null,null,null,null,null,null,null,null,null,{"$f":"IF(INDEX(INDIRECT(Grade),5,8)=\"MGL\",INDEX(INDIRECT(Grade),5,5) & \"-\" & INDEX(INDIRECT(Grade),5,6),IF(OR(INDEX(INDIRECT(Grade),5,5)>JMFDes4-((Mixdes4-MixDes5)-INDEX(INDIRECT(Grade),5,8)),INDEX(INDIRECT(Grade),5,6)<JMFDes4-((Mixdes4-MixDes5)+INDEX(INDIRECT(Grade),5,8))),\"O U T\",  IF(INDEX(INDIRECT(Grade),5,5)>JMFDes4-((Mixdes4-MixDes5)+INDEX(INDIRECT(Grade),5,8)),INDEX(INDIRECT(Grade),5,5),JMFDes4-((Mixdes4-MixDes5)+INDEX(INDIRECT(Grade),5,8))) & \"-\" & IF(INDEX(INDIRECT(Grade),5,6)<JMFDes4-((Mixdes4-MixDes5)-INDEX(INDIRECT(Grade),5,8)),INDEX(INDIRECT(Grade),5,6),JMFDes4-((Mixdes4-MixDes5)-INDEX(INDIRECT(Grade),5,8)))))","v":{"$error":"#REF!"}},{"$f":"IF(INDEX(INDIRECT(Grade),5,8)=\"MGL\",INDEX(INDIRECT(Grade),5,5) & \"-\" & INDEX(INDIRECT(Grade),5,6),IF(OR(INDEX(INDIRECT(Grade),5,5)>MixDes5+INDEX(INDIRECT(Grade),5,8),INDEX(INDIRECT(Grade),5,6)<MixDes5-INDEX(INDIRECT(Grade),5,8)),\"O U T\",IF(MixDes5-INDEX(INDIRECT(Grade),5,8) < INDEX(INDIRECT(Grade),5,5),INDEX(INDIRECT(Grade),5,5) & \"-\" & IF(MixDes5 + INDEX(INDIRECT(Grade),5,8) > INDEX(INDIRECT(Grade),5,6),INDEX(INDIRECT(Grade),5,6),MixDes5+INDEX(INDIRECT(Grade),5,8)), MixDes5-INDEX(INDIRECT(Grade),5,8) & \"-\" & IF(MixDes5+INDEX(INDIRECT(Grade),5,8)>INDEX(INDIRECT(Grade),5,6),INDEX(INDIRECT(Grade),5,6),MixDes5+INDEX(INDIRECT(Grade),5,8)))))","v":{"$error":"#REF!"}},{"$f":"IF(INDEX(INDIRECT(Grade),5,8)=\"MGL\",INDEX(INDIRECT(Grade),5,5) & \"-\" & INDEX(INDIRECT(Grade),5,6),IF(ProdRetained = \"YES\",TEXT(IF(AND(JMFDes4-JMFDes5-INDEX(INDIRECT(Grade),5,8)>=0,JMFDes4-JMFDes5-INDEX(INDIRECT(Grade),5,8)<=100),JMFDes4-JMFDes5-INDEX(INDIRECT(Grade),5,8), TEXT(IF(JMFDes4-JMFDes5-INDEX(INDIRECT(Grade),5,8)>100,100,0),\"##0.0\")),\"##0.0\") & \"-\" & TEXT(IF(AND(JMFDes4-JMFDes5+INDEX(INDIRECT(Grade),5,8)>=0,JMFDes4-JMFDes5+INDEX(INDIRECT(Grade),5,8)<=100),JMFDes4-JMFDes5+INDEX(INDIRECT(Grade),5,8), TEXT(IF(JMFDes4-JMFDes5+INDEX(INDIRECT(Grade),5,8)>100,100,0),\"##0.0\")),\"##0.0\"),TEXT(IF(AND(JMFDes5-INDEX(INDIRECT(Grade),5,8)>=0,JMFDes5-INDEX(INDIRECT(Grade),5,8)<=100),JMFDes5-INDEX(INDIRECT(Grade),5,8), TEXT(IF(JMFDes5-INDEX(INDIRECT(Grade),5,8)>100,100,0),\"##0.0\")),\"##0.0\") & \"-\" & TEXT(IF(AND(JMFDes5+INDEX(INDIRECT(Grade),5,8)>=0,JMFDes5+INDEX(INDIRECT(Grade),5,8)<=100),JMFDes5+INDEX(INDIRECT(Grade),5,8), TEXT(IF(JMFDes5+INDEX(INDIRECT(Grade),5,8)>100,100,0),\"##0.0\")),\"##0.0\")))","v":{"$error":"#REF!"}},{"$f":"IF(INDEX(INDIRECT(Grade),5,8)=\"MGL\",testjmftol5,IF(RETAINED = \"NO\",TEXT(IF(AND(JMFDes4-JMFDes5-INDEX(INDIRECT(Grade),5,8)>=0,JMFDes4-JMFDes5-INDEX(INDIRECT(Grade),5,8)<=100),JMFDes4-JMFDes5-INDEX(INDIRECT(Grade),5,8), TEXT(IF(JMFDes4-JMFDes5-INDEX(INDIRECT(Grade),5,8)>100,100,0),\"##0.0\")),\"##0.0\") & \"-\" & TEXT(IF(AND(JMFDes4-JMFDes5+INDEX(INDIRECT(Grade),5,8)>=0,JMFDes4-JMFDes5+INDEX(INDIRECT(Grade),5,8)<=100),JMFDes4-JMFDes5+INDEX(INDIRECT(Grade),5,8), TEXT(IF(JMFDes4-JMFDes5+INDEX(INDIRECT(Grade),5,8)>100,100,0),\"##0.0\")),\"##0.0\"),TEXT(IF(AND(JMFDes5-JMFDes4-INDEX(INDIRECT(Grade),5,8)>=0,JMFDes5-JMFDes4-INDEX(INDIRECT(Grade),5,8)<=100),JMFDes5-JMFDes4-INDEX(INDIRECT(Grade),5,8), TEXT(IF(JMFDes5-JMFDes4-INDEX(INDIRECT(Grade),5,8)>100,100,0),\"##0.0\")),\"##0.0\") & \"-\" & TEXT(IF(AND(JMFDes5-JMFDes4+INDEX(INDIRECT(Grade),5,8)>=0,JMFDes5-JMFDes4+INDEX(INDIRECT(Grade),5,8)<=100),JMFDes5-JMFDes4+INDEX(INDIRECT(Grade),5,8), TEXT(IF(JMFDes5-JMFDes4+INDEX(INDIRECT(Grade),5,8)>100,100,0),\"##0.0\")),\"##0.0\")))","v":{"$error":"#REF!"}},null,{"$f":"IF(OR('Design Data'!G47=\"\",JMFDes5=\"\",Field83=\"\"),\"\",IF(AND(INDEX(INDIRECT(Grade),5,25)=\"YES\",OR(Test_Data!L42>INDEX(INDIRECT(Grade),5,6),Test_Data!L42<INDEX(INDIRECT(Grade),5,5))),\"ý\",IF(ProdRetained = \"YES\",IF(INDEX(INDIRECT(Grade),5,8)=\"MGL\",IF(AND(Test_Data!J42>=INDEX(INDIRECT(Grade),5,5),Test_Data!J42<=INDEX(INDIRECT(Grade),5,6)),\"þ\",\"ý\"),IF(ABS(JMFDes4-JMFDes5-Test_Data!$H42)>INDEX(INDIRECT(Grade),5,8),\"ý\",\"þ\")),AQ40)))","v":""},{"$f":"IF(RETAINED=\"NO\",IF(INDEX(INDIRECT(Grade),5,8)=\"MGL\",IF(AND(Test_Data!L42>=INDEX(INDIRECT(Grade),5,5),Test_Data!L42<=INDEX(INDIRECT(Grade),5,6)),\"þ\",\"ý\"),IF(ABS(JMFDes5-Test_Data!$L42)>INDEX(INDIRECT(Grade),5,8),\"ý\",\"þ\")),IF(INDEX(INDIRECT(Grade),5,8)=\"MGL\",IF(AND(Test_Data!J42>=INDEX(INDIRECT(Grade),5,5),Test_Data!J42<=INDEX(INDIRECT(Grade),5,6)),\"þ\",\"ý\"),IF(ABS(JMFDes5-Test_Data!$J42)>INDEX(INDIRECT(Grade),5,8),\"ý\",\"þ\")))","v":{"$error":"#REF!"}}]
[null,null,"No. 80","180 µm",0.18,3,13,null,3,null,null,null,null,null,null,null,null,null,null,null,null,null,null,null,null,"NO",null,null,null,null,null,null,null,null,null,null,{"$f":"IF(INDEX(INDIRECT(Grade),6,8)=\"MGL\",INDEX(INDIRECT(Grade),6,5) & \"-\" & INDEX(INDIRECT(Grade),6,6),IF(OR(INDEX(INDIRECT(Grade),6,5)>JMFDes5-((MixDes5-MixDes6)-INDEX(INDIRECT(Grade),6,8)),INDEX(INDIRECT(Grade),6,6)<JMFDes5-((MixDes5-MixDes6)+INDEX(INDIRECT(Grade),6,8))),\"O U T\",  IF(INDEX(INDIRECT(Grade),6,5)>JMFDes5-((MixDes5-MixDes6)+INDEX(INDIRECT(Grade),6,8)),INDEX(INDIRECT(Grade),6,5),JMFDes5-((MixDes5-MixDes6)+INDEX(INDIRECT(Grade),6,8))) & \"-\" & IF(INDEX(INDIRECT(Grade),6,6)<JMFDes5-((MixDes5-MixDes6)-INDEX(INDIRECT(Grade),6,8)),INDEX(INDIRECT(Grade),6,6),JMFDes5-((MixDes5-MixDes6)-INDEX(INDIRECT(Grade),6,8)))))","v":{"$error":"#REF!"}},{"$f":"IF(INDEX(INDIRECT(Grade),6,8)=\"MGL\",INDEX(INDIRECT(Grade),6,5) & \"-\" & INDEX(INDIRECT(Grade),6,6),IF(OR(INDEX(INDIRECT(Grade),6,5)>MixDes6+INDEX(INDIRECT(Grade),6,8),INDEX(INDIRECT(Grade),6,6)<MixDes6-INDEX(INDIRECT(Grade),6,8)),\"O U T\",IF(MixDes6-INDEX(INDIRECT(Grade),6,8) < INDEX(INDIRECT(Grade),6,5),INDEX(INDIRECT(Grade),6,5) & \"-\" & IF(MixDes6 + INDEX(INDIRECT(Grade),6,8) > INDEX(INDIRECT(Grade),6,6),INDEX(INDIRECT(Grade),6,6),MixDes6+INDEX(INDIRECT(Grade),6,8)), MixDes6-INDEX(INDIRECT(Grade),6,8) & \"-\" & IF(MixDes6+INDEX(INDIRECT(Grade),6,8)>INDEX(INDIRECT(Grade),6,6),INDEX(INDIRECT(Grade),6,6),MixDes6+INDEX(INDIRECT(Grade),6,8)))))","v":{"$error":"#REF!"}},{"$f":"IF(INDEX(INDIRECT(Grade),6,8)=\"MGL\",INDEX(INDIRECT(Grade),6,5) & \"-\" & INDEX(INDIRECT(Grade),6,6),IF(ProdRetained = \"YES\",TEXT(IF(AND(JMFDes5-JMFDes6-INDEX(INDIRECT(Grade),6,8)>=0,JMFDes5-JMFDes6-INDEX(INDIRECT(Grade),6,8)<=100),JMFDes5-JMFDes6-INDEX(INDIRECT(Grade),6,8), TEXT(IF(JMFDes5-JMFDes6-INDEX(INDIRECT(Grade),6,8)>100,100,0),\"##0.0\")),\"##0.0\") & \"-\" & TEXT(IF(AND(JMFDes5-JMFDes6+INDEX(INDIRECT(Grade),6,8)>=0,JMFDes5-JMFDes6+INDEX(INDIRECT(Grade),6,8)<=100),JMFDes5-JMFDes6+INDEX(INDIRECT(Grade),6,8), TEXT(IF(JMFDes5-JMFDes6+INDEX(INDIRECT(Grade),6,8)>100,100,0),\"##0.0\")),\"##0.0\"),TEXT(IF(AND(JMFDes6-INDEX(INDIRECT(Grade),6,8)>=0,JMFDes6-INDEX(INDIRECT(Grade),6,8)<=100),JMFDes6-INDEX(INDIRECT(Grade),6,8), TEXT(IF(JMFDes6-INDEX(INDIRECT(Grade),6,8)>100,100,0),\"##0.0\")),\"##0.0\") & \"-\" & TEXT(IF(AND(JMFDes6+INDEX(INDIRECT(Grade),6,8)>=0,JMFDes6+INDEX(INDIRECT(Grade),6,8)<=100),JMFDes6+INDEX(INDIRECT(Grade),6,8), TEXT(IF(JMFDes6+INDEX(INDIRECT(Grade),6,8)>100,100,0),\"##0.0\")),\"##0.0\")))","v":{"$error":"#REF!"}},{"$f":"IF(INDEX(INDIRECT(Grade),6,8)=\"MGL\",testjmftol6,IF(RETAINED = \"NO\",TEXT(IF(AND(JMFDes5-JMFDes6-INDEX(INDIRECT(Grade),6,8)>=0,JMFDes5-JMFDes6-INDEX(INDIRECT(Grade),6,8)<=100),JMFDes5-JMFDes6-INDEX(INDIRECT(Grade),6,8), TEXT(IF(JMFDes5-JMFDes6-INDEX(INDIRECT(Grade),6,8)>100,100,0),\"##0.0\")),\"##0.0\") & \"-\" & TEXT(IF(AND(JMFDes5-JMFDes6+INDEX(INDIRECT(Grade),6,8)>=0,JMFDes5-JMFDes6+INDEX(INDIRECT(Grade),6,8)<=100),JMFDes5-JMFDes6+INDEX(INDIRECT(Grade),6,8), TEXT(IF(JMFDes5-JMFDes6+INDEX(INDIRECT(Grade),6,8)>100,100,0),\"##0.0\")),\"##0.0\"),TEXT(IF(AND(JMFDes6-JMFDes5-INDEX(INDIRECT(Grade),6,8)>=0,JMFDes6-JMFDes5-INDEX(INDIRECT(Grade),6,8)<=100),JMFDes6-JMFDes5-INDEX(INDIRECT(Grade),6,8), TEXT(IF(JMFDes6-JMFDes5-INDEX(INDIRECT(Grade),6,8)>100,100,0),\"##0.0\")),\"##0.0\") & \"-\" & TEXT(IF(AND(JMFDes6-JMFDes5+INDEX(INDIRECT(Grade),6,8)>=0,JMFDes6-JMFDes5+INDEX(INDIRECT(Grade),6,8)<=100),JMFDes6-JMFDes5+INDEX(INDIRECT(Grade),6,8), TEXT(IF(JMFDes6-JMFDes5+INDEX(INDIRECT(Grade),6,8)>100,100,0),\"##0.0\")),\"##0.0\")))","v":{"$error":"#REF!"}},null,{"$f":"IF(OR('Design Data'!G48=\"\",JMFDes6=\"\",Field85=\"\"),\"\",IF(AND(INDEX(INDIRECT(Grade),6,25)=\"YES\",OR(Test_Data!L43>INDEX(INDIRECT(Grade),6,6),Test_Data!L43<INDEX(INDIRECT(Grade),6,5))),\"ý\",IF(ProdRetained = \"YES\",IF(INDEX(INDIRECT(Grade),6,8)=\"MGL\",IF(AND(Test_Data!J43>=INDEX(INDIRECT(Grade),6,5),Test_Data!J43<=INDEX(INDIRECT(Grade),6,6)),\"þ\",\"ý\"),IF(ABS(JMFDes5-JMFDes6-Test_Data!$H43)>INDEX(INDIRECT(Grade),6,8),\"ý\",\"þ\")),AQ41)))","v":""},{"$f":"IF(RETAINED=\"NO\",IF(INDEX(INDIRECT(Grade),6,8)=\"MGL\",IF(AND(Test_Data!L43>=INDEX(INDIRECT(Grade),6,5),Test_Data!L43<=INDEX(INDIRECT(Grade),6,6)),\"þ\",\"ý\"),IF(ABS(JMFDes6-Test_Data!$L43)>INDEX(INDIRECT(Grade),6,8),\"ý\",\"þ\")),IF(INDEX(INDIRECT(Grade),6,8)=\"MGL\",IF(AND(Test_Data!J43>=INDEX(INDIRECT(Grade),6,5),Test_Data!J43<=INDEX(INDIRECT(Grade),6,6)),\"þ\",\"ý\"),IF(ABS(JMFDes6-Test_Data!$J43)>INDEX(INDIRECT(Grade),6,8),\"ý\",\"þ\")))","v":{"$error":"#REF!"}}]
[null,null,"No. 200","75 µm",7.4999999999999997E-2,1,6,null,3,null,null,null,null,null,null,null,null,null,null,null,null,null,null,null,null,"NO",null,null,null,null,null,null,null,null,null,null,{"$f":"IF(INDEX(INDIRECT(Grade),7,8)=\"MGL\",INDEX(INDIRECT(Grade),7,5) & \"-\" & INDEX(INDIRECT(Grade),7,6),IF(OR(INDEX(INDIRECT(Grade),7,5)>JMFDes6-((MixDes6-MixDes7)-INDEX(INDIRECT(Grade),7,8)),INDEX(INDIRECT(Grade),7,6)<JMFDes6-((MixDes6-MixDes7)+INDEX(INDIRECT(Grade),7,8))),\"O U T\",  IF(INDEX(INDIRECT(Grade),7,5)>JMFDes6-((MixDes6-MixDes7)+INDEX(INDIRECT(Grade),7,8)),INDEX(INDIRECT(Grade),7,5),JMFDes6-((MixDes6-MixDes7)+INDEX(INDIRECT(Grade),7,8))) & \"-\" & IF(INDEX(INDIRECT(Grade),7,6)<JMFDes6-((MixDes6-MixDes7)-INDEX(INDIRECT(Grade),7,8)),INDEX(INDIRECT(Grade),7,6),JMFDes6-((MixDes6-MixDes7)-INDEX(INDIRECT(Grade),7,8)))))","v":{"$error":"#REF!"}},{"$f":"IF(INDEX(INDIRECT(Grade),7,8)=\"MGL\",INDEX(INDIRECT(Grade),7,5) & \"-\" & INDEX(INDIRECT(Grade),7,6),IF(OR(INDEX(INDIRECT(Grade),7,5)>MixDes7+INDEX(INDIRECT(Grade),7,8),INDEX(INDIRECT(Grade),7,6)<MixDes7-INDEX(INDIRECT(Grade),7,8)),\"O U T\",IF(MixDes7-INDEX(INDIRECT(Grade),7,8) < INDEX(INDIRECT(Grade),7,5),INDEX(INDIRECT(Grade),7,5) & \"-\" & IF(MixDes7 + INDEX(INDIRECT(Grade),7,8) > INDEX(INDIRECT(Grade),7,6),INDEX(INDIRECT(Grade),7,6),MixDes7+INDEX(INDIRECT(Grade),7,8)), MixDes7-INDEX(INDIRECT(Grade),7,8) & \"-\" & IF(MixDes7+INDEX(INDIRECT(Grade),7,8)>INDEX(INDIRECT(Grade),7,6),INDEX(INDIRECT(Grade),7,6),MixDes7+INDEX(INDIRECT(Grade),7,8)))))","v":{"$error":"#REF!"}},{"$f":"IF(INDEX(INDIRECT(Grade),7,8)=\"MGL\",INDEX(INDIRECT(Grade),7,5) & \"-\" & INDEX(INDIRECT(Grade),7,6),IF(ProdRetained = \"YES\",TEXT(IF(AND(JMFDes6-JMFDes7-INDEX(INDIRECT(Grade),7,8)>=0,JMFDes6-JMFDes7-INDEX(INDIRECT(Grade),7,8)<=100),JMFDes6-JMFDes7-INDEX(INDIRECT(Grade),7,8), TEXT(IF(JMFDes6-JMFDes7-INDEX(INDIRECT(Grade),7,8)>100,100,0),\"##0.0\")),\"##0.0\") & \"-\" & TEXT(IF(AND(JMFDes6-JMFDes7+INDEX(INDIRECT(Grade),7,8)>=0,JMFDes6-JMFDes7+INDEX(INDIRECT(Grade),7,8)<=100),JMFDes6-JMFDes7+INDEX(INDIRECT(Grade),7,8), TEXT(IF(JMFDes6-JMFDes7+INDEX(INDIRECT(Grade),7,8)>100,100,0),\"##0.0\")),\"##0.0\"),TEXT(IF(AND(JMFDes7-INDEX(INDIRECT(Grade),7,8)>=0,JMFDes7-INDEX(INDIRECT(Grade),7,8)<=100),JMFDes7-INDEX(INDIRECT(Grade),7,8), TEXT(IF(JMFDes7-INDEX(INDIRECT(Grade),7,8)>100,100,0),\"##0.0\")),\"##0.0\") & \"-\" & TEXT(IF(AND(JMFDes7+INDEX(INDIRECT(Grade),7,8)>=0,JMFDes7+INDEX(INDIRECT(Grade),7,8)<=100),JMFDes7+INDEX(INDIRECT(Grade),7,8), TEXT(IF(JMFDes7+INDEX(INDIRECT(Grade),7,8)>100,100,0),\"##0.0\")),\"##0.0\")))","v":{"$error":"#REF!"}},{"$f":"IF(INDEX(INDIRECT(Grade),7,8)=\"MGL\",testjmftol7,IF(RETAINED = \"NO\",TEXT(IF(AND(JMFDes6-JMFDes7-INDEX(INDIRECT(Grade),7,8)>=0,JMFDes6-JMFDes7-INDEX(INDIRECT(Grade),7,8)<=100),JMFDes6-JMFDes7-INDEX(INDIRECT(Grade),7,8), TEXT(IF(JMFDes6-JMFDes7-INDEX(INDIRECT(Grade),7,8)>100,100,0),\"##0.0\")),\"##0.0\") & \"-\" & TEXT(IF(AND(JMFDes6-JMFDes7+INDEX(INDIRECT(Grade),7,8)>=0,JMFDes6-JMFDes7+INDEX(INDIRECT(Grade),7,8)<=100),JMFDes6-JMFDes7+INDEX(INDIRECT(Grade),7,8), TEXT(IF(JMFDes6-JMFDes7+INDEX(INDIRECT(Grade),7,8)>100,100,0),\"##0.0\")),\"##0.0\"),TEXT(IF(AND(JMFDes7-JMFDes6-INDEX(INDIRECT(Grade),7,8)>=0,JMFDes7-JMFDes6-INDEX(INDIRECT(Grade),7,8)<=100),JMFDes7-JMFDes6-INDEX(INDIRECT(Grade),7,8), TEXT(IF(JMFDes7-JMFDes6-INDEX(INDIRECT(Grade),7,8)>100,100,0),\"##0.0\")),\"##0.0\") & \"-\" & TEXT(IF(AND(JMFDes7-JMFDes6+INDEX(INDIRECT(Grade),7,8)>=0,JMFDes7-JMFDes6+INDEX(INDIRECT(Grade),7,8)<=100),JMFDes7-JMFDes6+INDEX(INDIRECT(Grade),7,8), TEXT(IF(JMFDes7-JMFDes6+INDEX(INDIRECT(Grade),7,8)>100,100,0),\"##0.0\")),\"##0.0\")))","v":{"$error":"#REF!"}},null,{"$f":"IF(OR('Design Data'!G49=\"\",JMFDes7=\"\",Field87=\"\"),\"\",IF(AND(INDEX(INDIRECT(Grade),7,25)=\"YES\",OR(Test_Data!L44>INDEX(INDIRECT(Grade),7,6),Test_Data!L44<INDEX(INDIRECT(Grade),7,5))),\"ý\",IF(ProdRetained = \"YES\",IF(INDEX(INDIRECT(Grade),7,8)=\"MGL\",IF(AND(Test_Data!J44>=INDEX(INDIRECT(Grade),7,5),Test_Data!J44<=INDEX(INDIRECT(Grade),7,6)),\"þ\",\"ý\"),IF(ABS(JMFDes6-JMFDes7-Test_Data!$H44)>INDEX(INDIRECT(Grade),7,8),\"ý\",\"þ\")),AQ42)))","v":""},{"$f":"IF(RETAINED=\"NO\",IF(INDEX(INDIRECT(Grade),7,8)=\"MGL\",IF(AND(Test_Data!L44>=INDEX(INDIRECT(Grade),7,5),Test_Data!L44<=INDEX(INDIRECT(Grade),7,6)),\"þ\",\"ý\"),IF(ABS(JMFDes7-Test_Data!$L44)>INDEX(INDIRECT(Grade),7,8),\"ý\",\"þ\")),IF(INDEX(INDIRECT(Grade),7,8)=\"MGL\",IF(AND(Test_Data!J44>=INDEX(INDIRECT(Grade),7,5),Test_Data!J44<=INDEX(INDIRECT(Grade),7,6)),\"þ\",\"ý\"),IF(ABS(JMFDes7-Test_Data!$J44)>INDEX(INDIRECT(Grade),7,8),\"ý\",\"þ\")))","v":{"$error":"#REF!"}}]
[null,"TYPE CMHB-C","7/8\"","22.4 mm",22.4,98,100,13,5,null,null,null,null,null,null,null,3,null,0.3,"NO",null,null,null,null,null,"NO",null,null,null,null,null,null,null,null,null,null,{"$f":"IF(INDEX(INDIRECT(Grade),8,8)=\"MGL\",INDEX(INDIRECT(Grade),8,5) & \"-\" & INDEX(INDIRECT(Grade),8,6),IF(OR(INDEX(INDIRECT(Grade),8,5)>JMFDes7-((MixDes7-MixDes8)-INDEX(INDIRECT(Grade),8,8)),INDEX(INDIRECT(Grade),8,6)<JMFDes7-((MixDes7-MixDes8)+INDEX(INDIRECT(Grade),8,8))),\"O U T\",  IF(INDEX(INDIRECT(Grade),8,5)>JMFDes7-((MixDes7-MixDes8)+INDEX(INDIRECT(Grade),8,8)),INDEX(INDIRECT(Grade),8,5),JMFDes7-((MixDes7-MixDes8)+INDEX(INDIRECT(Grade),8,8))) & \"-\" & IF(INDEX(INDIRECT(Grade),8,6)<JMFDes7-((MixDes7-MixDes8)-INDEX(INDIRECT(Grade),8,8)),INDEX(INDIRECT(Grade),8,6),JMFDes7-((MixDes7-MixDes8)-INDEX(INDIRECT(Grade),8,8)))))","v":{"$error":"#REF!"}},{"$f":"IF(INDEX(INDIRECT(Grade),8,8)=\"MGL\",INDEX(INDIRECT(Grade),8,5) & \"-\" & INDEX(INDIRECT(Grade),8,6),IF(OR(INDEX(INDIRECT(Grade),8,5)>MixDes8+INDEX(INDIRECT(Grade),8,8),INDEX(INDIRECT(Grade),8,6)<MixDes8-INDEX(INDIRECT(Grade),8,8)),\"O U T\",IF(MixDes8-INDEX(INDIRECT(Grade),8,8) < INDEX(INDIRECT(Grade),8,5),INDEX(INDIRECT(Grade),8,5) & \"-\" & IF(MixDes8 + INDEX(INDIRECT(Grade),8,8) > INDEX(INDIRECT(Grade),8,6),INDEX(INDIRECT(Grade),8,6),MixDes8+INDEX(INDIRECT(Grade),8,8)), MixDes8-INDEX(INDIRECT(Grade),8,8) & \"-\" & IF(MixDes8+INDEX(INDIRECT(Grade),8,8)>INDEX(INDIRECT(Grade),8,6),INDEX(INDIRECT(Grade),8,6),MixDes8+INDEX(INDIRECT(Grade),8,8)))))","v":{"$error":"#REF!"}},{"$f":"IF(INDEX(INDIRECT(Grade),8,8)=\"MGL\",INDEX(INDIRECT(Grade),8,5) & \"-\" & INDEX(INDIRECT(Grade),8,6),IF(ProdRetained = \"YES\", TEXT(IF(AND(JMFDes7-JMFDes8-INDEX(INDIRECT(Grade),8,8)>=0,JMFDes7-JMFDes8-INDEX(INDIRECT(Grade),8,8)<=100),JMFDes7-JMFDes8-INDEX(INDIRECT(Grade),8,8), TEXT(IF(JMFDes7-JMFDes8-INDEX(INDIRECT(Grade),8,8)>100,100,0),\"##0.0\")),\"##0.0\") & \"-\" & TEXT(IF(AND(JMFDes7-JMFDes8+INDEX(INDIRECT(Grade),8,8)>=0,JMFDes7-JMFDes8+INDEX(INDIRECT(Grade),8,8)<=100),JMFDes7-JMFDes8+INDEX(INDIRECT(Grade),8,8), TEXT(IF(JMFDes7-JMFDes8+INDEX(INDIRECT(Grade),8,8)>100,100,0),\"##0.0\")),\"##0.0\"),TEXT(IF(AND(JMFDes8-INDEX(INDIRECT(Grade),8,8)>=0,JMFDes8-INDEX(INDIRECT(Grade),8,8)<=100),JMFDes8-INDEX(INDIRECT(Grade),8,8), TEXT(IF(JMFDes8-INDEX(INDIRECT(Grade),8,8)>100,100,0),\"##0.0\")),\"##0.0\") & \"-\" & TEXT(IF(AND(JMFDes8+INDEX(INDIRECT(Grade),8,8)>=0,JMFDes8+INDEX(INDIRECT(Grade),8,8)<=100),JMFDes8+INDEX(INDIRECT(Grade),8,8), TEXT(IF(JMFDes8+INDEX(INDIRECT(Grade),8,8)>100,100,0),\"##0.0\")),\"##0.0\")))","v":{"$error":"#REF!"}},{"$f":"IF(INDEX(INDIRECT(Grade),8,8)=\"MGL\",testjmftol8,IF(RETAINED = \"NO\", TEXT(IF(AND(JMFDes7-JMFDes8-INDEX(INDIRECT(Grade),8,8)>=0,JMFDes7-JMFDes8-INDEX(INDIRECT(Grade),8,8)<=100),JMFDes7-JMFDes8-INDEX(INDIRECT(Grade),8,8), TEXT(IF(JMFDes7-JMFDes8-INDEX(INDIRECT(Grade),8,8)>100,100,0),\"##0.0\")),\"##0.0\") & \"-\" & TEXT(IF(AND(JMFDes7-JMFDes8+INDEX(INDIRECT(Grade),8,8)>=0,JMFDes7-JMFDes8+INDEX(INDIRECT(Grade),8,8)<=100),JMFDes7-JMFDes8+INDEX(INDIRECT(Grade),8,8), TEXT(IF(JMFDes7-JMFDes8+INDEX(INDIRECT(Grade),8,8)>100,100,0),\"##0.0\")),\"##0.0\"),TEXT(IF(AND(JMFDes8-JMFDes7-INDEX(INDIRECT(Grade),8,8)>=0,JMFDes8-JMFDes7-INDEX(INDIRECT(Grade),8,8)<=100),JMFDes8-JMFDes7-INDEX(INDIRECT(Grade),8,8), TEXT(IF(JMFDes8-JMFDes7-INDEX(INDIRECT(Grade),8,8)>100,100,0),\"##0.0\")),\"##0.0\") & \"-\" & TEXT(IF(AND(JMFDes8-JMFDes7+INDEX(INDIRECT(Grade),8,8)>=0,JMFDes8-JMFDes7+INDEX(INDIRECT(Grade),8,8)<=100),JMFDes8-JMFDes7+INDEX(INDIRECT(Grade),8,8), TEXT(IF(JMFDes8-JMFDes7+INDEX(INDIRECT(Grade),8,8)>100,100,0),\"##0.0\")),\"##0.0\")))","v":{"$error":"#REF!"}},null,{"$f":"IF(OR('Design Data'!G50=\"\",JMFDes8=\"\",Field88=\"\"),\"\",IF(AND(INDEX(INDIRECT(Grade),8,25)=\"YES\",OR(Test_Data!L45>INDEX(INDIRECT(Grade),8,6),Test_Data!L45<INDEX(INDIRECT(Grade),8,5))),\"ý\",IF(ProdRetained = \"YES\",IF(INDEX(INDIRECT(Grade),8,8)=\"MGL\",IF(AND(Test_Data!J45>=INDEX(INDIRECT(Grade),8,5),Test_Data!J45<=INDEX(INDIRECT(Grade),8,6)),\"þ\",\"ý\"),IF(ABS(JMFDes7-JMFDes8-Test_Data!$H45)>INDEX(INDIRECT(Grade),8,8),\"ý\",\"þ\")),AQ43)))","v":""},{"$f":"IF(RETAINED=\"NO\",IF(INDEX(INDIRECT(Grade),8,8)=\"MGL\",IF(AND(Test_Data!L45>=INDEX(INDIRECT(Grade),8,5),Test_Data!L45<=INDEX(INDIRECT(Grade),8,6)),\"þ\",\"ý\"),IF(ABS(JMFDes8-Test_Data!$L45)>INDEX(INDIRECT(Grade),8,8),\"ý\",\"þ\")),IF(INDEX(INDIRECT(Grade),8,8)=\"MGL\",IF(AND(Test_Data!J45>=INDEX(INDIRECT(Grade),8,5),Test_Data!J45<=INDEX(INDIRECT(Grade),8,6)),\"þ\",\"ý\"),IF(ABS(JMFDes8-Test_Data!$J45)>INDEX(INDIRECT(Grade),8,8),\"ý\",\"þ\")))","v":{"$error":"#REF!"}}]
[null,null,"5/8\"","16 mm",16,98,100,null,5,null,null,null,null,null,null,null,null,null,null,"YES",null,null,null,null,null,"NO",null,null,null,null,null,null,null,null,null,null,{"$f":"IF(INDEX(INDIRECT(Grade),9,8)=\"MGL\",INDEX(INDIRECT(Grade),9,5) & \"-\" & INDEX(INDIRECT(Grade),9,6),IF(OR(INDEX(INDIRECT(Grade),9,5)>JMFDes8-((MixDes8-MixDes9)-INDEX(INDIRECT(Grade),9,8)),INDEX(INDIRECT(Grade),9,6)<JMFDes8-((MixDes8-MixDes9)+INDEX(INDIRECT(Grade),9,8))),\"O U T\",  IF(INDEX(INDIRECT(Grade),9,5)>JMFDes8-((MixDes8-MixDes9)+INDEX(INDIRECT(Grade),9,8)),INDEX(INDIRECT(Grade),9,5),JMFDes8-((MixDes8-MixDes9)+INDEX(INDIRECT(Grade),9,8))) & \"-\" & IF(INDEX(INDIRECT(Grade),9,6)<JMFDes8-((MixDes8-MixDes9)-INDEX(INDIRECT(Grade),9,8)),INDEX(INDIRECT(Grade),9,6),JMFDes8-((MixDes8-MixDes9)-INDEX(INDIRECT(Grade),9,8)))))","v":{"$error":"#REF!"}},{"$f":"IF(INDEX(INDIRECT(Grade),9,8)=\"MGL\",INDEX(INDIRECT(Grade),9,5) & \"-\" & INDEX(INDIRECT(Grade),9,6),IF(OR(INDEX(INDIRECT(Grade),9,5)>MixDes9+INDEX(INDIRECT(Grade),9,8),INDEX(INDIRECT(Grade),9,6)<MixDes9-INDEX(INDIRECT(Grade),9,8)),\"O U T\",IF(MixDes9-INDEX(INDIRECT(Grade),9,8) < INDEX(INDIRECT(Grade),9,5),INDEX(INDIRECT(Grade),9,5) & \"-\" & IF(MixDes9 + INDEX(INDIRECT(Grade),9,8) > INDEX(INDIRECT(Grade),9,6),INDEX(INDIRECT(Grade),9,6),MixDes9+INDEX(INDIRECT(Grade),9,8)), MixDes9-INDEX(INDIRECT(Grade),9,8) & \"-\" & IF(MixDes9+INDEX(INDIRECT(Grade),9,8)>INDEX(INDIRECT(Grade),9,6),INDEX(INDIRECT(Grade),9,6),MixDes9+INDEX(INDIRECT(Grade),9,8)))))","v":{"$error":"#REF!"}},{"$f":"IF(INDEX(INDIRECT(Grade),9,8)=\"MGL\",INDEX(INDIRECT(Grade),9,5) & \"-\" & INDEX(INDIRECT(Grade),9,6),IF(ProdRetained = \"YES\", TEXT(IF(AND(JMFDes8-JMFDes9-INDEX(INDIRECT(Grade),9,8)>=0,JMFDes8-JMFDes9-INDEX(INDIRECT(Grade),9,8)<=100),JMFDes8-JMFDes9-INDEX(INDIRECT(Grade),9,8), TEXT(IF(JMFDes8-JMFDes9-INDEX(INDIRECT(Grade),9,8)>100,100,0),\"##0.0\")),\"##0.0\") & \"-\" & TEXT(IF(AND(JMFDes8-JMFDes9+INDEX(INDIRECT(Grade),9,8)>=0,JMFDes8-JMFDes9+INDEX(INDIRECT(Grade),9,8)<=100),JMFDes8-JMFDes9+INDEX(INDIRECT(Grade),9,8), TEXT(IF(JMFDes8-JMFDes9+INDEX(INDIRECT(Grade),9,8)>100,100,0),\"##0.0\")),\"##0.0\"),TEXT(IF(AND(JMFDes9-INDEX(INDIRECT(Grade),9,8)>=0,JMFDes9-INDEX(INDIRECT(Grade),9,8)<=100),JMFDes9-INDEX(INDIRECT(Grade),9,8), TEXT(IF(JMFDes9-INDEX(INDIRECT(Grade),9,8)>100,100,0),\"##0.0\")),\"##0.0\") & \"-\" & TEXT(IF(AND(JMFDes9+INDEX(INDIRECT(Grade),9,8)>=0,JMFDes9+INDEX(INDIRECT(Grade),9,8)<=100),JMFDes9+INDEX(INDIRECT(Grade),9,8), TEXT(IF(JMFDes9+INDEX(INDIRECT(Grade),9,8)>100,100,0),\"##0.0\")),\"##0.0\")))","v":{"$error":"#REF!"}},{"$f":"IF(INDEX(INDIRECT(Grade),1,9)=\"MGL\",testjmftol9,IF(RETAINED = \"NO\",TEXT(IF(AND(JMFDes8-JMFDes9-INDEX(INDIRECT(Grade),9,8)>=0,JMFDes8-JMFDes9-INDEX(INDIRECT(Grade),9,8)<=100),JMFDes8-JMFDes9-INDEX(INDIRECT(Grade),9,8), TEXT(IF(JMFDes8-JMFDes9-INDEX(INDIRECT(Grade),9,8)>100,100,0),\"##0.0\")),\"##0.0\") & \"-\" & TEXT(IF(AND(JMFDes8-JMFDes9+INDEX(INDIRECT(Grade),9,8)>=0,JMFDes8-JMFDes9+INDEX(INDIRECT(Grade),9,8)<=100),JMFDes8-JMFDes9+INDEX(INDIRECT(Grade),9,8), TEXT(IF(JMFDes8-JMFDes9+INDEX(INDIRECT(Grade),9,8)>100,100,0),\"##0.0\")),\"##0.0\"),TEXT(IF(AND(JMFDes9-JMFDes8-INDEX(INDIRECT(Grade),9,8)>=0,JMFDes9-JMFDes8-INDEX(INDIRECT(Grade),9,8)<=100),JMFDes9-JMFDes8-INDEX(INDIRECT(Grade),9,8), TEXT(IF(JMFDes9-JMFDes8-INDEX(INDIRECT(Grade),9,8)>100,100,0),\"##0.0\")),\"##0.0\") & \"-\" & TEXT(IF(AND(JMFDes9-JMFDes8+INDEX(INDIRECT(Grade),9,8)>=0,JMFDes9-JMFDes8+INDEX(INDIRECT(Grade),9,8)<=100),JMFDes9-JMFDes8+INDEX(INDIRECT(Grade),9,8), TEXT(IF(JMFDes9-JMFDes8+INDEX(INDIRECT(Grade),9,8)>100,100,0),\"##0.0\")),\"##0.0\")))","v":{"$error":"#REF!"}},null,{"$f":"IF(OR('Design Data'!G51=\"\",JMFDes9=\"\",Field90=\"\"),\"\",IF(AND(INDEX(INDIRECT(Grade),9,25)=\"YES\",OR(Test_Data!L46>INDEX(INDIRECT(Grade),9,6),Test_Data!L46<INDEX(INDIRECT(Grade),9,5))),\"ý\",IF(ProdRetained = \"YES\",IF(INDEX(INDIRECT(Grade),9,8)=\"MGL\",IF(AND(Test_Data!J46>=INDEX(INDIRECT(Grade),9,5),Test_Data!J46<=INDEX(INDIRECT(Grade),9,6)),\"þ\",\"ý\"),IF(ABS(JMFDes8-JMFDes9-Test_Data!$H46)>INDEX(INDIRECT(Grade),9,8),\"ý\",\"þ\")),AQ44)))","v":""},{"$f":"IF(RETAINED=\"NO\",IF(INDEX(INDIRECT(Grade),9,8)=\"MGL\",IF(AND(Test_Data!L46>=INDEX(INDIRECT(Grade),9,5),Test_Data!L46<=INDEX(INDIRECT(Grade),9,6)),\"þ\",\"ý\"),IF(ABS(JMFDes9-Test_Data!$L46)>INDEX(INDIRECT(Grade),9,8),\"ý\",\"þ\")),IF(INDEX(INDIRECT(Grade),9,8)=\"MGL\",IF(AND(Test_Data!J46>=INDEX(INDIRECT(Grade),9,5),Test_Data!J46<=INDEX(INDIRECT(Grade),9,6)),\"þ\",\"ý\"),IF(ABS(JMFDes9-Test_Data!$J46)>INDEX(INDIRECT(Grade),9,8),\"ý\",\"þ\")))","v":{"$error":"#REF!"}}]
[null,null,"3/8\"","9.5 mm",9.5,50,70,null,5,null,null,null,null,null,null,null,null,null,null,null,null,null,null,null,null,"NO",null,null,null,null,null,null,null,null,null,null,{"$f":"IF(INDEX(INDIRECT(Grade),10,8)=\"MGL\",INDEX(INDIRECT(Grade),10,5) & \"-\" & INDEX(INDIRECT(Grade),10,6),IF(OR(INDEX(INDIRECT(Grade),10,5)>JMFDes9-((MixDes9-MixDes10)-INDEX(INDIRECT(Grade),10,8)),INDEX(INDIRECT(Grade),10,6)<JMFDes9-((MixDes9-MixDes10)+INDEX(INDIRECT(Grade),10,8))),\"O U T\",  IF(INDEX(INDIRECT(Grade),10,5)>JMFDes9-((MixDes9-MixDes10)+INDEX(INDIRECT(Grade),10,8)),INDEX(INDIRECT(Grade),10,5),JMFDes9-((MixDes9-MixDes10)+INDEX(INDIRECT(Grade),10,8))) & \"-\" & IF(INDEX(INDIRECT(Grade),10,6)<JMFDes9-((MixDes9-MixDes10)-INDEX(INDIRECT(Grade),10,8)),INDEX(INDIRECT(Grade),10,6),JMFDes9-((MixDes9-MixDes10)-INDEX(INDIRECT(Grade),10,8)))))","v":{"$error":"#REF!"}},{"$f":"IF(INDEX(INDIRECT(Grade),10,8)=\"MGL\",INDEX(INDIRECT(Grade),10,5) & \"-\" & INDEX(INDIRECT(Grade),10,6),IF(OR(INDEX(INDIRECT(Grade),10,5)>MixDes10+INDEX(INDIRECT(Grade),10,8),INDEX(INDIRECT(Grade),10,6)<MixDes10-INDEX(INDIRECT(Grade),10,8)),\"O U T\",IF(MixDes10-INDEX(INDIRECT(Grade),10,8) < INDEX(INDIRECT(Grade),10,5),INDEX(INDIRECT(Grade),10,5) & \"-\" & IF(MixDes10 + INDEX(INDIRECT(Grade),10,8) > INDEX(INDIRECT(Grade),10,6),INDEX(INDIRECT(Grade),10,6),MixDes10+INDEX(INDIRECT(Grade),10,8)), MixDes10-INDEX(INDIRECT(Grade),10,8) & \"-\" & IF(MixDes10+INDEX(INDIRECT(Grade),10,8)>INDEX(INDIRECT(Grade),10,6),INDEX(INDIRECT(Grade),10,6),MixDes10+INDEX(INDIRECT(Grade),10,8)))))","v":{"$error":"#REF!"}},null,{"$f":"IF(OR('Design Data'!G51=\"\",JMFDes10=\"\"),\"\",TEXT(IF(AND(JMFDes9-JMFDes10-INDEX(INDIRECT(Grade),10,8)>=0,JMFDes9-JMFDes10-INDEX(INDIRECT(Grade),10,8)<=100),JMFDes9-JMFDes10-INDEX(INDIRECT(Grade),10,8), TEXT(IF(JMFDes9-JMFDes10-INDEX(INDIRECT(Grade),10,8)>100,100,0),\"##0.0\")),\"##0.0\") & \"-\" & TEXT(IF(AND(JMFDes9-JMFDes10+INDEX(INDIRECT(Grade),10,8)>=0,JMFDes9-JMFDes10+INDEX(INDIRECT(Grade),10,8)<=100),JMFDes9-JMFDes10+INDEX(INDIRECT(Grade),10,8), TEXT(IF(JMFDes9-JMFDes10+INDEX(INDIRECT(Grade),10,8)>100,100,0),\"##0.0\")),\"##0.0\"))","v":""},null,{"$f":"IF(OR('Design Data'!G52=\"\",JMFDes10=\"\",Field302=\"\"),\"\",IF(AND(INDEX(INDIRECT(Grade),10,25)=\"YES\",OR(Test_Data!L47>INDEX(INDIRECT(Grade),10,6),Test_Data!L47<INDEX(INDIRECT(Grade),10,5))),\"ý\",IF(ProdRetained = \"YES\",IF(INDEX(INDIRECT(Grade),10,8)=\"MGL\",IF(AND(Test_Data!J47>=INDEX(INDIRECT(Grade),10,5),Test_Data!J47<=INDEX(INDIRECT(Grade),10,6)),\"þ\",\"ý\"),IF(ABS(JMFDes9-JMFDes10-Test_Data!$H47)>INDEX(INDIRECT(Grade),10,8),\"ý\",\"þ\")),AQ45)))","v":""},{"$f":"IF(RETAINED=\"NO\",IF(INDEX(INDIRECT(Grade),10,8)=\"MGL\",IF(AND(Test_Data!L47>=INDEX(INDIRECT(Grade),10,5),Test_Data!L47<=INDEX(INDIRECT(Grade),10,6)),\"þ\",\"ý\"),IF(ABS(JMFDes10-Test_Data!$L47)>INDEX(INDIRECT(Grade),10,8),\"ý\",\"þ\")),IF(INDEX(INDIRECT(Grade),10,8)=\"MGL\",IF(AND(Test_Data!J47>=INDEX(INDIRECT(Grade),10,5),Test_Data!J47<=INDEX(INDIRECT(Grade),10,6)),\"þ\",\"ý\"),IF(ABS(JMFDes10-Test_Data!$J47)>INDEX(INDIRECT(Grade),10,8),\"ý\",\"þ\")))","v":{"$error":"#REF!"}}]
[null,null,"No. 4","4.75 mm",4.75,30,45,null,5,null,null,null,null,null,null,null,null,null,null,null,null,null,null,null,null,"NO",null,null,null,null,null,null,null,null,null,null,null,null,{"$f":"IF(SUM('Design Data'!R43:R52)=0,\"\",TEXT(IF(INDEX(INDIRECT(Grade),1,16)<>\"MGL\",IF(AND(version<4,INDIRECT(\"JMFDES\"&(10-COUNTBLANK(Test_Data!B38:B47)))-INDEX(INDIRECT(Grade),1,16)<INDEX(INDIRECT(Grade),(10-COUNTBLANK(Test_Data!B38:B47)),5)),INDEX(INDIRECT(Grade),(10-COUNTBLANK(Test_Data!B38:B47)),5),IF(INDIRECT(\"JMFDES\"&(10-COUNTBLANK(Test_Data!B38:B47)))-INDEX(INDIRECT(Grade),1,16)<0,0,INDIRECT(\"JMFDES\"&(10-COUNTBLANK(Test_Data!B38:B47)))-INDEX(INDIRECT(Grade),1,16))),INDEX(INDIRECT(Grade),(10-COUNTBLANK(Test_Data!B38:B47)),5)),\"0.0\") & \"-\" & TEXT(IF(INDEX(INDIRECT(Grade),1,16)<>\"MGL\",IF(AND(version<4,INDIRECT(\"JMFDES\"&(10-COUNTBLANK(Test_Data!B38:B47)))+INDEX(INDIRECT(Grade),1,16)>INDEX(INDIRECT(Grade),(10-COUNTBLANK(Test_Data!B38:B47)),6)),INDEX(INDIRECT(Grade),(10-COUNTBLANK(Test_Data!B38:B47)),6),INDIRECT(\"JMFDES\"&(10-COUNTBLANK(Test_Data!B38:B47)))+INDEX(INDIRECT(Grade),1,16)),100),\"0.0\"))","v":""},{"$f":"IF(SUM('Design Data'!R43:R52)=0,\"\",IF(AND(RETAINED = \"NO\", ProdRetained = \"NO\"),TEXT(0,\"0.0\"),TEXT(IF(INDEX(INDIRECT(Grade),1,16)=\"MGL\",INDEX(INDIRECT(Grade),(10-COUNTBLANK(Test_Data!B38:B47)),5),IF(INDIRECT(\"JMFDES\"&(10-COUNTBLANK(Test_Data!B38:B47)))-INDEX(INDIRECT(Grade),1,16)<INDEX(INDIRECT(Grade),(10-COUNTBLANK(Test_Data!B38:B47)),5),INDEX(INDIRECT(Grade),(10-COUNTBLANK(Test_Data!B38:B47)),5),INDIRECT(\"JMFDES\"&(10-COUNTBLANK(Test_Data!B38:B47)))-INDEX(INDIRECT(Grade),1,16))),\"0.0\")) & \"-\" & IF(AND(RETAINED=\"YES\",ProdRetained=\"NO\"),TEXT(100,\"0.0\"),TEXT(IF(INDIRECT(\"JMFDES\"&(10-COUNTBLANK(Test_Data!B38:B47)))+INDEX(INDIRECT(Grade),1,16)>INDEX(INDIRECT(Grade),(10-COUNTBLANK(Test_Data!B38:B47)),6),INDEX(INDIRECT(Grade),(10-COUNTBLANK(Test_Data!B38:B47)),6),INDIRECT(\"JMFDES\"&(10-COUNTBLANK(Test_Data!B38:B47)))+INDEX(INDIRECT(Grade),1,16)),\"0.0\")))","v":""}]
[null,null,"No. 10","2 mm",2,15,25,null,5,null,null,null,null,null,null,null,null,null,null,null,null,null,null,null,null,"NO"]
[null,null,"No. 40","425 µm",0.42499999999999999,6,20,null,3,null,null,null,null,null,null,null,null,null,null,null,null,null,null,null,null,"NO"]
[null,null,"No. 80","180 µm",0.18,6,18,null,3,null,null,null,null,null,null,null,null,null,null,null,null,null,null,null,null,"NO",null,null,null,null,null,null,null,null,null,null,"Check for %retained when \"Other\" Mixtype is selected"]
[null,null,"No. 200","75 µm",7.4999999999999997E-2,5,8,null,3,null,null,null,null,null,null,null,null,null,null,null,null,null,null,null,null,"NO"]
[null,"TYPE CMHB-F","1/2\"","12.5 mm",12.5,98,100,14,5,null,null,null,null,null,null,null,3,null,0.30099999999999999,"NO",null,null,null,null,null,"NO"]
[null,null,"3/8\"","9.5 mm",9.5,85,100,null,5,null,null,null,null,null,null,null,null,null,null,"YES",null,null,null,null,null,"NO"]
[null,null,"No. 4","4.75 mm",4.75,40,60,null,5,null,null,null,null,null,null,null,null,null,null,null,null,null,null,null,null,"NO"]
[null,null,"No. 10","2 mm",2,15,25,null,5,null,null,null,null,null,null,null,null,null,null,null,null,null,null,null,null,"NO"]
[null,null,"No. 40","425 µm",0.42499999999999999,6,20,null,3,null,null,null,null,null,null,null,null,null,null,null,null,null,null,null,null,"NO"]
[null,null,"No. 80","180 µm",0.18,6,18,null,3,null,null,null,null,null,null,null,null,null,null,null,null,null,null,null,null,"NO"]
[null,null,"No. 200","75 µm",7.4999999999999997E-2,5,8,null,3,null,null,null,null,null,null,null,"Creep/Hveem",null,null,null,null,null,null,null,null,"NO"]
[null,"OTHER",null,null,{"$f":"IF(Field195=\"\",\"\",VLOOKUP(Field195,B$555:E$580,4,FALSE))","v":""},null,null,null,null,null,null,null,null,null,null,null,null,null,null,null,null,null,null,null,null,"NO"]
[null,null,null,null,{"$f":"IF(Field202=\"\",\"\",VLOOKUP(Field202,B$555:E$580,4,FALSE))","v":""},null,null,null,null,null,null,null,null,null,null,null,null,null,null,"NO",null,null,null,null,null,"NO"]
[null,null,null,null,{"$f":"IF(Field207=\"\",\"\",VLOOKUP(Field207,B$555:E$580,4,FALSE))","v":""},null,null,null,null,null,null,null,null,null,null,null,null,null,null,null,null,null,null,null,null,"NO"]
[null,null,null,null,{"$f":"IF(Field212=\"\",\"\",VLOOKUP(Field212,B$555:E$580,4,FALSE))","v":""},null,null,null,null,null,null,null,null,null,null,null,null,null,null,null,null,null,null,null,null,"NO"]
[null,null,null,null,{"$f":"IF(Field217=\"\",\"\",VLOOKUP(Field217,B$555:E$580,4,FALSE))","v":""},null,null,null,null,null,null,null,null,null,null,null,null,null,null,null,null,null,null,null,null,"NO"]
[null,null,null,null,{"$f":"IF(Field222=\"\",\"\",VLOOKUP(Field222,B$555:E$580,4,FALSE))","v":""},null,null,null,null,null,null,null,null,null,null,null,null,null,null,null,null,null,null,null,null,"NO"]
[null,null,null,null,{"$f":"IF(Field227=\"\",\"\",VLOOKUP(Field227,B$555:E$580,4,FALSE))","v":""},null,null,null,null,null,null,null,null,null,null,null,null,null,null,null,null,null,null,null,null,"NO"]
[null,null,null,null,{"$f":"IF(Field232=\"\",\"\",VLOOKUP(Field232,B$555:E$580,4,FALSE))","v":""},null,null,null,null,null,null,null,null,null,null,null,null,null,null,null,null,null,null,null,null,"NO"]
[null,null,null,null,{"$f":"IF(Field237=\"\",\"\",VLOOKUP(Field237,B$555:E$580,4,FALSE))","v":""},null,null,null,null,null,null,null,null,null,null,null,null,null,null,null,null,null,null,null,null,"NO"]
[null,"PFC","3/4\"","19 mm",19,100,100,null,5,null,null,null,null,null,null,null,2,null,0.30099999999999999,"NO",null,null,null,null,null,"YES"]
[null,null,"1/2\"","12.5 mm",12.5,90,100,null,5,null,null,null,null,null,null,null,null,null,null,"YES",null,null,null,null,null,"YES"]
[null,null,"3/8\"","9.5 mm",9.5,35,60,null,5,null,null,null,null,null,null,null,null,null,null,null,null,null,null,null,null,"YES"]
[null,null,"No. 4","4.75 mm",4.75,10,25,null,5,null,null,null,null,null,null,null,null,null,null,null,null,null,null,null,null,"YES"]
[null,null,"No. 8","2.36 mm",2.36,5,10,null,3,null,null,null,null,null,null,null,null,null,null,null,null,null,null,null,null,"YES"]
[null,null,"No. 200","75 µm",7.4999999999999997E-2,1,4,null,3,null,null,null,null,null,null,null,null,null,null,null,null,null,null,null,null,"YES"]
[null,"PFC_AR","3/4\"","19 mm",19,100,100,null,5,null,null,null,null,null,null,null,2,null,0.30099999999999999,"NO",null,null,null,null,null,"YES"]
[null,null,"1/2\"","12.5 mm",12.5,90,100,null,5,null,null,null,null,null,null,null,null,null,null,"YES",null,null,null,null,null,"YES"]
[null,null,"3/8\"","9.5 mm",9.5,35,60,null,5,null,null,null,null,null,null,null,null,null,null,null,null,null,null,null,null,"YES"]
[null,null,"No. 4","4.75 mm",4.75,10,25,null,5,null,null,null,null,null,null,null,null,null,null,null,null,null,null,null,null,"YES"]
[null,null,"No. 8","2.36 mm",2.36,5,10,null,3,null,null,null,null,null,null,null,null,null,null,null,null,null,null,null,null,"YES"]
[null,null,"No. 200","75 µm",7.4999999999999997E-2,1,4,null,3,null,null,null,null,null,null,null,null,null,null,null,null,null,null,null,null,"YES"]
[null,"1 inch","1 1/2\"","37.5 mm",37.5,100,100,17,5,0.3,null,null,null,null,null,null,2,null,0.30099999999999999,"NO","N/A",20,null,null,null,"NO"]
[null,null,"1\"","25 mm",25,90,100,null,5,null,null,null,null,null,null,null,null,null,null,"YES",null,null,null,null,null,"NO"]
[null,null,"3/4\"","19 mm",19,85,95,null,5,null,null,null,null,null,null,null,null,null,null,null,null,null,null,null,null,"NO"]
[null,null,"1/2\"","12.5 mm",12.5,50,60,null,5,null,null,null,null,null,null,null,null,null,null,null,null,null,null,null,null,"NO"]
[null,null,"3/8\"","9.5 mm",9.5,30,45,null,5,null,null,null,null,null,null,null,null,null,null,null,null,null,null,null,null,"NO"]
[null,null,"No. 4","4.75 mm",4.75,20,28,null,5,null,null,null,null,null,null,null,null,null,null,null,null,null,null,null,null,"NO"]
[null,null,"No. 8","2.36 mm",2.36,16,24,null,5,null,null,null,null,null,null,null,null,null,null,null,null,null,null,null,null,"NO"]
[null,null,"No. 200","75 µm",7.4999999999999997E-2,8,10,null,3,null,null,null,null,null,null,null,null,null,null,null,null,null,null,null,null,"NO"]
[null,"3/4 inch","3/4\"","19 mm",19,100,100,17,5,0.3,null,null,null,null,null,null,2,null,0.30099999999999999,"NO","N/A",20,null,null,null,"NO"]
[null,null,"1/2\"","12.5 mm",12.5,80,90,null,5,null,null,null,null,null,null,null,null,null,null,"YES",null,null,null,null,null,"NO"]
[null,null,"3/8\"","9.5 mm",9.5,25,60,null,5,null,null,null,null,null,null,null,null,null,null,null,null,null,null,null,null,"NO"]
[null,null,"No. 4","4.75 mm",4.75,20,28,null,5,null,null,null,null,null,null,null,null,null,null,null,null,null,null,null,null,"NO"]
[null,null,"No. 8","2.36 mm",2.36,14,20,null,5,null,null,null,null,null,null,null,null,null,null,null,null,null,null,null,null,"NO"]
[null,null,"No. 200","75 µm",7.4999999999999997E-2,8,11,null,3,null,null,null,null,null,null,null,null,null,null,null,null,null,null,null,null,"NO"]
[null,"1/2 inch","3/4\"","19 mm",19,100,100,17,5,0.3,null,null,null,null,null,null,2,null,0.30099999999999999,"NO","N/A",20,null,null,null,"NO"]
[null,null,"1/2\"","12.5 mm",12.5,90,99,null,5,null,null,null,null,null,null,null,null,null,null,"YES",null,null,null,null,null,"NO"]
[null,null,"3/8\"","9.5 mm",9.5,70,85,null,5,null,null,null,null,null,null,null,null,null,null,null,null,null,null,null,null,"NO"]
[null,null,"No. 4","4.75 mm",4.75,30,42,null,5,null,null,null,null,null,null,null,null,null,null,null,null,null,null,null,null,"NO"]
[null,null,"No. 8","2.36 mm",2.36,20,33,null,5,null,null,null,null,null,null,null,null,null,null,null,null,null,null,null,null,"NO"]
[null,null,"No. 200","75 µm",7.4999999999999997E-2,8,11,null,3,null,null,null,null,null,null,null,null,null,null,null,null,null,null,null,null,"NO"]
[null,"SF & SP_HMACP_1.5","2\"","50 mm",50,100,100,11.5,5,0.3,null,null,0.6,1.8,64,77,2,null,0.30099999999999999,"NO",45,30,null,null,null,"NO"]
[null,null,"1-1/2\"","37.5 mm",37.5,90,100,null,5,null,null,null,null,null,null,null,null,null,null,"YES",null,null,null,null,null,"NO"]
[null,null,"1\"","25 mm",25,null,null,null,5,null,null,null,null,null,null,null,null,null,null,null,null,null,null,null,null,"NO"]
[null,null,"No. 4","4.75 mm",4.75,null,null,null,5,null,34.700000000000003,34.700000000000003,null,null,null,null,null,null,null,null,null,null,null,null,null,"NO"]
[null,null,"No. 8","2.36 mm",2.36,15,41,null,5,null,23.3,27.3,null,null,null,null,null,null,null,null,null,null,null,null,null,"NO"]
[null,null,"No. 16","1.18 mm",1.18,null,null,null,3,null,15.5,21.5,null,null,null,null,null,null,null,null,null,null,null,null,null,"NO"]
[null,null,"No. 30","600 µm",0.6,null,null,null,3,null,11.7,15.7,null,null,null,null,null,null,null,null,null,null,null,null,null,"NO"]
[null,null,"No. 50","300 µm",0.3,null,null,null,3,null,10,10,null,null,null,null,null,null,null,null,null,null,null,null,null,"NO"]
[null,null,"No. 200","75 µm",7.4999999999999997E-2,0,6,null,3,null,null,null,null,null,null,null,null,null,null,null,null,null,null,null,null,"NO"]
[null,"SF & SP_HMACP_1","1-1/2\"","37.5 mm",37.5,100,100,12.5,5,0.3,null,null,0.6,1.8,65,75,2,null,0.30099999999999999,"NO",45,30,null,null,null,"NO"]
[null,null,"1\"","25 mm",25,90,100,null,5,null,null,null,null,null,null,null,null,null,null,"YES",null,null,null,null,null,"NO"]
[null,null,"3/4\"","19 mm",19,null,null,null,5,null,null,null,null,null,null,null,null,null,null,null,null,null,null,null,null,"NO"]
[null,null,"No. 4","4.75 mm",4.75,null,null,null,5,null,39.5,39.5,null,null,null,null,null,null,null,null,null,null,null,null,null,"NO"]
[null,null,"No. 8","2.36 mm",2.36,19,45,null,5,null,26.8,30.8,null,null,null,null,null,null,null,null,null,null,null,null,null,"NO"]
[null,null,"No. 16","1.18 mm",1.18,null,null,null,3,null,18.100000000000001,24.1,null,null,null,null,null,null,null,null,null,null,null,null,null,"NO"]
[null,null,"No. 30","600 µm",0.6,null,null,null,3,null,13.6,17.5,null,null,null,null,null,null,null,null,null,null,null,null,null,"NO"]
[null,null,"No. 50","300 µm",0.3,null,null,null,3,null,11.4,11.4,null,null,null,null,null,null,null,null,null,null,null,null,null,"NO"]
[null,null,"No. 200","75 µm",7.4999999999999997E-2,1,7,null,3,null,null,null,null,null,null,null,null,null,null,null,null,null,null,null,null,"NO"]
[null,"SF & SP_HMACP_.75","1\"","25 mm",25,100,100,13.5,5,0.3,null,null,0.6,1.8,65,75,2,null,0.30099999999999999,"NO",45,30,null,null,null,"NO"]
[null,null,"3/4\"","19 mm",19,90,100,null,5,null,null,null,null,null,null,null,null,null,null,"YES",null,null,null,null,null,"NO"]
[null,null,"1/2\"","12.5 mm",12.5,null,null,null,5,null,null,null,null,null,null,null,null,null,null,null,null,null,null,null,null,"NO"]
[null,null,"No. 8","2.36 mm",2.36,23,49,null,5,null,34.6,34.6,null,null,null,null,null,null,null,null,null,null,null,null,null,"NO"]
[null,null,"No. 16","1.18 mm",1.18,null,null,null,3,null,22.3,28.3,null,null,null,null,null,null,null,null,null,null,null,null,null,"NO"]
[null,null,"No. 30","600 µm",0.6,null,null,null,3,null,16.7,20.7,null,null,null,null,null,null,null,null,null,null,null,null,null,"NO"]
[null,null,"No. 50","300 µm",0.3,null,null,null,3,null,13.7,13.7,null,null,null,null,null,null,null,null,null,null,null,null,null,"NO"]
[null,null,"No. 200","75 µm",7.4999999999999997E-2,2,8,null,3,null,null,null,null,null,null,null,null,null,null,null,null,null,null,null,null,"NO"]
[null,"SF & SP_HMACP_.5","3/4\"","19 mm",19,100,100,14.5,5,0.3,null,null,0.6,1.8,73,79,2,null,0.30099999999999999,"NO",45,30,null,null,null,"NO"]
[null,null,"1/2\"","12.5 mm",12.5,90,100,null,5,null,null,null,null,null,null,null,null,null,null,"YES",null,null,null,null,null,"NO"]
[null,null,"3/8\"","9.5 mm",9.5,null,null,null,5,null,null,null,null,null,null,null,null,null,null,null,null,null,null,null,null,"NO"]
[null,null,"No. 8","2.36 mm",2.36,28,58,null,5,null,39.1,39.1,null,null,null,null,null,null,null,null,null,null,null,null,null,"NO"]
[null,null,"No. 16","1.18 mm",1.18,null,null,null,3,null,25.6,31.6,null,null,null,null,null,null,null,null,null,null,null,null,null,"NO"]
[null,null,"No. 30","600 µm",0.6,null,null,null,3,null,19.100000000000001,23.1,null,null,null,null,null,null,null,null,null,null,null,null,null,"NO"]
[null,null,"No. 50","300 µm",0.3,null,null,null,3,null,15.5,15.5,null,null,null,null,null,null,null,null,null,null,null,null,null,"NO"]
[null,null,"No. 200","75 µm",7.4999999999999997E-2,2,10,null,3,null,null,null,null,null,null,null,null,null,null,null,null,null,null,null,null,"NO"]
[null,"Type__A","1-1/2\"",null,37.5,98,100,11,5,null,null,null,null,null,null,null,2,null,0.30099999999999999,"NO",null,null,null,null,null,"NO",null,null,null,null,null,null,null,null,45]
[null,2004,"1\"",null,25,78,94,null,5,null,null,null,null,null,null,null,null,null,null,"YES",null,null,null,null,null,"NO"]
[null,null,"3/4\"",null,19,64,85,null,5,null,null,null,null,null,null,null,null,null,null,null,null,null,null,null,null,"NO"]
[null,null,"1/2\"",null,12.5,50,70,null,5,null,null,null,null,null,null,null,null,null,null,null,null,null,null,null,null,"NO"]
[null,null,"No. 4",null,4.75,30,50,null,5,null,null,null,null,null,null,null,null,null,null,null,null,null,null,null,null,"NO"]
[null,null,"No. 8",null,2.36,22,36,null,5,null,null,null,null,null,null,null,null,null,null,null,null,null,null,null,null,"NO"]
[null,null,"No. 30",null,0.6,8,23,null,3,null,null,null,null,null,null,null,null,null,null,null,null,null,null,null,null,"NO"]
[null,null,"No. 50",null,0.3,3,19,null,3,null,null,null,null,null,null,null,null,null,null,null,null,null,null,null,null,"NO"]
[null,null,"No. 200",null,7.4999999999999997E-2,2,7,null,3,null,null,null,null,null,null,null,null,null,null,null,null,null,null,null,null,"NO"]
[null,"Type__B","1\"",null,25,98,100,12,5,null,null,null,null,null,null,null,2,null,0.30099999999999999,"NO",null,null,null,null,null,"NO",null,null,null,null,null,null,null,null,45]
[null,2004,"3/4\"",null,19,84,98,null,5,null,null,null,null,null,null,null,null,null,null,"YES",null,null,null,null,null,"NO"]
[null,null,"3/8\"",null,9.5,60,80,null,5,null,null,null,null,null,null,null,null,null,null,null,null,null,null,null,null,"NO"]
[null,null,"No. 4",null,4.75,40,60,null,5,null,null,null,null,null,null,null,null,null,null,null,null,null,null,null,null,"NO"]
[null,null,"No. 8",null,2.36,29,43,null,5,null,null,null,null,null,null,null,null,null,null,null,null,null,null,null,null,"NO"]
[null,null,"No. 30",null,0.6,13,28,null,3,null,null,null,null,null,null,null,null,null,null,null,null,null,null,null,null,"NO"]
[null,null,"No. 50",null,0.3,6,20,null,3,null,null,null,null,null,null,null,null,null,null,null,null,null,null,null,null,"NO"]
[null,null,"No. 200",null,7.4999999999999997E-2,2,7,null,3,null,null,null,null,null,null,null,null,null,null,null,null,null,null,null,null,"NO"]
[null,"Type__C","3/4\"",null,19,95,100,13,5,null,null,null,null,null,null,null,2,null,0.30099999999999999,"NO",null,null,null,null,null,"NO",null,null,null,null,null,null,null,null,45]
[null,2004,"3/8\"",null,9.5,70,85,null,5,null,null,null,null,null,null,null,null,null,null,"YES",null,null,null,null,null,"NO"]
[null,null,"No. 4",null,4.75,43,63,null,5,null,null,null,null,null,null,null,null,null,null,null,null,null,null,null,null,"NO"]
[null,null,"No. 8",null,2.36,32,44,null,5,null,null,null,null,null,null,null,null,null,null,null,null,null,null,null,null,"NO"]
[null,null,"No. 30",null,0.6,14,28,null,3,null,null,null,null,null,null,null,null,null,null,null,null,null,null,null,null,"NO"]
[null,null,"No. 50",null,0.3,7,21,null,3,null,null,null,null,null,null,null,null,null,null,null,null,null,null,null,null,"NO"]
[null,null,"No. 200",null,7.4999999999999997E-2,2,7,null,3,null,null,null,null,null,null,null,null,null,null,null,null,null,null,null,null,"NO"]
[null,"Type__D","1/2\"",null,12.5,98,100,14,5,null,null,null,null,null,null,null,2,null,0.30099999999999999,"NO",null,null,null,null,null,"NO",null,null,null,null,null,null,null,null,45]
[null,2004,"3/8\"",null,9.5,85,100,null,5,null,null,null,null,null,null,null,null,null,null,"YES",null,null,null,null,null,"NO"]
[null,null,"No. 4",null,4.75,50,70,null,5,null,null,null,null,null,null,null,null,null,null,null,null,null,null,null,null,"NO"]
[null,null,"No. 8",null,2.36,35,46,null,5,null,null,null,null,null,null,null,null,null,null,null,null,null,null,null,null,"NO"]
[null,null,"No. 30",null,0.6,15,29,null,3,null,null,null,null,null,null,null,null,null,null,null,null,null,null,null,null,"NO"]
[null,null,"No. 50",null,0.3,7,20,null,3,null,null,null,null,null,null,null,null,null,null,null,null,null,null,null,null,"NO"]
[null,null,"No. 200",null,7.4999999999999997E-2,2,7,null,3,null,null,null,null,null,null,null,null,null,null,null,null,null,null,null,null,"NO"]
[null,"Type__F","3/8\"",null,9.5,98,100,15,5,null,null,null,null,null,null,null,2,null,0.30099999999999999,"NO",null,null,null,null,null,"NO",null,null,null,null,null,null,null,null,45]
[null,2004,"No. 4",null,4.75,80,86,null,5,null,null,null,null,null,null,null,null,null,null,"YES",null,null,null,null,null,"NO"]
[null,null,"No. 8",null,2.36,38,48,null,5,null,null,null,null,null,null,null,null,null,null,null,null,null,null,null,null,"NO"]
[null,null,"No. 30",null,0.6,12,27,null,3,null,null,null,null,null,null,null,null,null,null,null,null,null,null,null,null,"NO"]
[null,null,"No. 50",null,0.3,6,19,null,3,null,null,null,null,null,null,null,null,null,null,null,null,null,null,null,null,"NO"]
[null,null,"No. 200",null,7.4999999999999997E-2,2,7,null,3,null,null,null,null,null,null,null,null,null,null,null,null,null,null,null,null,"NO"]
[null,"SP-A","2\"",null,50,100,100,12.5,5,null,null,null,null,null,null,null,2,null,0.30099999999999999,"NO",45,25,null,null,null,"NO",null,null,null,null,null,null,null,null,45]
[null,null,"1-1/2\"",null,37.5,98,100,null,5,null,null,null,null,null,null,null,null,null,null,"YES",null,null,null,null,null,"NO"]
[null,null,"1\"",null,25,90,100,null,5,null,null,null,null,null,null,null,null,null,null,null,null,null,null,null,null,"NO"]
[null,null,"3/4\"",null,19,19,90,null,5,null,null,null,null,null,null,null,null,null,null,null,null,null,null,null,null,"NO"]
[null,null,"No. 8",null,2.36,19,45,null,5,null,null,null,null,null,null,null,null,null,null,null,null,null,null,null,null,"NO"]
[null,null,"No. 16",null,1.18,1,45,null,3,null,null,null,null,null,null,null,null,null,null,null,null,null,null,null,null,"NO"]
[null,null,"No. 30",null,0.6,1,45,null,3,null,null,null,null,null,null,null,null,null,null,null,null,null,null,null,null,"NO"]
[null,null,"No. 50",null,0.3,1,45,null,3,null,null,null,null,null,null,null,null,null,null,null,null,null,null,null,null,"NO"]
[null,null,"No. 200",null,7.4999999999999997E-2,1,7,null,3,null,null,null,null,null,null,null,null,null,null,null,null,null,null,null,null,"NO"]
[null,"SP-B","1-1/2\"",null,37.5,100,100,13.5,5,null,null,null,null,null,null,null,2,null,0.30099999999999999,"NO",45,25,null,null,null,"NO",null,null,null,null,null,null,null,null,45]
[null,null,"1\"",null,25,98,100,null,5,null,null,null,null,null,null,null,null,null,null,"YES",null,null,null,null,null,"NO"]
[null,null,"3/4\"",null,19,90,100,null,5,null,null,null,null,null,null,null,null,null,null,null,null,null,null,null,null,"NO"]
[null,null,"1/2\"",null,12.5,23,90,null,5,null,null,null,null,null,null,null,null,null,null,null,null,null,null,null,null,"NO"]
[null,null,"No. 8",null,2.36,23,49,null,5,null,null,null,null,null,null,null,null,null,null,null,null,null,null,null,null,"NO"]
[null,null,"No. 16",null,1.18,2,49,null,3,null,null,null,null,null,null,null,null,null,null,null,null,null,null,null,null,"NO"]
[null,null,"No. 30",null,0.6,2,49,null,3,null,null,null,null,null,null,null,null,null,null,null,null,null,null,null,null,"NO"]
[null,null,"No. 50",null,0.3,2,49,null,3,null,null,null,null,null,null,null,null,null,null,null,null,null,null,null,null,"NO"]
[null,null,"No. 200",null,7.4999999999999997E-2,2,8,null,3,null,null,null,null,null,null,null,null,null,null,null,null,null,null,null,null,"NO"]
[null,"SP-C","1\"",null,25,100,100,14.5,5,null,null,null,null,null,null,null,2,null,0.30099999999999999,"NO",45,25,null,null,null,"NO",null,null,null,null,null,null,null,null,45]
[null,null,"3/4\"",null,19,98,100,null,5,null,null,null,null,null,null,null,null,null,null,"YES",null,null,null,null,null,"NO"]
[null,null,"1/2\"",null,12.5,90,100,null,5,null,null,null,null,null,null,null,null,null,null,null,null,null,null,null,null,"NO"]
[null,null,"3/8\"",null,9.5,28,90,null,5,null,null,null,null,null,null,null,null,null,null,null,null,null,null,null,null,"NO"]
[null,null,"No. 8",null,2.36,28,58,null,5,null,null,null,null,null,null,null,null,null,null,null,null,null,null,null,null,"NO"]
[null,null,"No. 16",null,1.18,2,58,null,3,null,null,null,null,null,null,null,null,null,null,null,null,null,null,null,null,"NO"]
[null,null,"No. 30",null,0.6,2,58,null,3,null,null,null,null,null,null,null,null,null,null,null,null,null,null,null,null,"NO"]
[null,null,"No. 50",null,0.3,2,58,null,3,null,null,null,null,null,null,null,null,null,null,null,null,null,null,null,null,"NO"]
[null,null,"No. 200",null,7.4999999999999997E-2,2,10,null,3,null,null,null,null,null,null,null,null,null,null,null,null,null,null,null,null,"NO"]
[null,"SP-D","3/4\"",null,19,100,100,15.5,5,null,null,null,null,null,null,null,2,null,0.30099999999999999,"NO",45,25,null,null,null,"NO",null,null,null,null,null,null,null,null,45]
[null,null,"1/2\"",null,12.5,98,100,null,5,null,null,null,null,null,null,null,null,null,null,"YES",null,null,null,null,null,"NO"]
[null,null,"3/8\"",null,9.5,90,100,null,5,null,null,null,null,null,null,null,null,null,null,null,null,null,null,null,null,"NO"]
[null,null,"No. 4",null,4.75,32,90,null,5,null,null,null,null,null,null,null,null,null,null,null,null,null,null,null,null,"NO"]
[null,null,"No. 8",null,2.36,32,67,null,5,null,null,null,null,null,null,null,null,null,null,null,null,null,null,null,null,"NO"]
[null,null,"No. 16",null,1.18,2,67,null,3,null,null,null,null,null,null,null,null,null,null,null,null,null,null,null,null,"NO"]
[null,null,"No. 30",null,0.6,2,67,null,3,null,null,null,null,null,null,null,null,null,null,null,null,null,null,null,null,"NO"]
[null,null,"No. 50",null,0.3,2,67,null,3,null,null,null,null,null,null,null,null,null,null,null,null,null,null,null,null,"NO"]
[null,null,"No. 200",null,7.4999999999999997E-2,2,10,null,3,null,null,null,null,null,null,null,null,null,null,null,null,null,null,null,null,"NO"]
[null,"CMHB-C","1\"",null,25,100,100,13,5,null,null,null,null,null,null,null,2,null,0.30099999999999999,"NO",45,25,null,null,null,"NO",null,null,null,null,null,null,null,null,45]
[null,null,"3/4\"",null,19,98,100,null,5,null,null,null,null,null,null,null,null,null,null,"YES",null,null,null,null,null,"NO"]
[null,null,"1/2\"",null,12.5,72,85,null,5,null,null,null,null,null,null,null,null,null,null,null,null,null,null,null,null,"NO"]
[null,null,"3/8\"",null,9.5,50,70,null,5,null,null,null,null,null,null,null,null,null,null,null,null,null,null,null,null,"NO"]
[null,null,"No. 4",null,4.75,30,45,null,5,null,null,null,null,null,null,null,null,null,null,null,null,null,null,null,null,"NO"]
[null,null,"No. 8",null,2.36,17,27,null,5,null,null,null,null,null,null,null,null,null,null,null,null,null,null,null,null,"NO"]
[null,null,"No. 16",null,1.18,5,27,null,3,null,null,null,null,null,null,null,null,null,null,null,null,null,null,null,null,"NO"]
[null,null,"No. 30",null,0.6,5,27,null,3,null,null,null,null,null,null,null,null,null,null,null,null,null,null,null,null,"NO"]
[null,null,"No. 50",null,0.3,5,27,null,3,null,null,null,null,null,null,null,null,null,null,null,null,null,null,null,null,"NO"]
[null,null,"No. 200",null,7.4999999999999997E-2,5,9,null,3,null,null,null,null,null,null,null,null,null,null,null,null,null,null,null,null,"NO"]
[null,"CMHB-F","3/4\"",null,19,100,100,14,5,null,null,null,null,null,null,null,2,null,0.30099999999999999,"NO",45,25,null,null,null,"NO",null,null,null,null,null,null,null,null,45]
[null,null,"1/2\"",null,12.5,98,100,null,5,null,null,null,null,null,null,null,null,null,null,"YES",null,null,null,null,null,"NO"]
[null,null,"3/8\"",null,9.5,85,100,null,5,null,null,null,null,null,null,null,null,null,null,null,null,null,null,null,null,"NO"]
[null,null,"No. 4",null,4.75,40,60,null,5,null,null,null,null,null,null,null,null,null,null,null,null,null,null,null,null,"NO"]
[null,null,"No. 8",null,2.36,17,27,null,5,null,null,null,null,null,null,null,null,null,null,null,null,null,null,null,null,"NO"]
[null,null,"No. 16",null,1.18,5,27,null,3,null,null,null,null,null,null,null,null,null,null,null,null,null,null,null,null,"NO"]
[null,null,"No. 30",null,0.6,5,27,null,3,null,null,null,null,null,null,null,null,null,null,null,null,null,null,null,null,"NO"]
[null,null,"No. 50",null,0.3,5,27,null,3,null,null,null,null,null,null,null,null,null,null,null,null,null,null,null,null,"NO"]
[null,null,"No. 200",null,7.4999999999999997E-2,5,9,null,3,null,null,null,null,null,null,null,null,null,null,null,null,null,null,null,null,"NO"]
[null,"SMA-C","3/4\"",null,19,100,100,17,5,null,null,null,null,null,null,null,2,null,0.30099999999999999,"NO",45,20,null,null,null,"NO",null,null,null,null,null,null,null,null,45]
[null,null,"1/2\"",null,12.5,80,90,null,5,null,null,null,null,null,null,null,null,null,null,"YES",null,null,null,null,null,"NO"]
[null,null,"3/8\"",null,9.5,25,60,null,5,null,null,null,null,null,null,null,null,null,null,null,null,null,null,null,null,"NO"]
[null,null,"No. 4",null,4.75,20,28,null,5,null,null,null,null,null,null,null,null,null,null,null,null,null,null,null,null,"NO"]
[null,null,"No. 8",null,2.36,14,20,null,5,null,null,null,null,null,null,null,null,null,null,null,null,null,null,null,null,"NO"]
[null,null,"No. 16",null,1.18,8,20,null,3,null,null,null,null,null,null,null,null,null,null,null,null,null,null,null,null,"NO"]
[null,null,"No. 30",null,0.6,8,20,null,3,null,null,null,null,null,null,null,null,null,null,null,null,null,null,null,null,"NO"]
[null,null,"No. 50",null,0.3,8,20,null,3,null,null,null,null,null,null,null,null,null,null,null,null,null,null,null,null,"NO"]
[null,null,"No. 200",null,7.4999999999999997E-2,8,12,null,3,null,null,null,null,null,null,null,null,null,null,null,null,null,null,null,null,"NO"]
[null,"SMA-D","3/4\"",null,19,100,100,17,5,null,null,null,null,null,null,null,2,null,0.30099999999999999,"NO",45,20,null,null,null,"NO",null,null,null,null,null,null,null,null,45]
[null,null,"1/2\"",null,12.5,85,99,null,5,null,null,null,null,null,null,null,null,null,null,"YES",null,null,null,null,null,"NO"]
[null,null,"3/8\"",null,9.5,50,75,null,5,null,null,null,null,null,null,null,null,null,null,null,null,null,null,null,null,"NO"]
[null,null,"No. 4",null,4.75,20,32,null,5,null,null,null,null,null,null,null,null,null,null,null,null,null,null,null,null,"NO"]
[null,null,"No. 8",null,2.36,16,28,null,5,null,null,null,null,null,null,null,null,null,null,null,null,null,null,null,null,"NO"]
[null,null,"No. 16",null,1.18,8,28,null,3,null,null,null,null,null,null,null,null,null,null,null,null,null,null,null,null,"NO"]
[null,null,"No. 30",null,0.6,8,28,null,3,null,null,null,null,null,null,null,null,null,null,null,null,null,null,null,null,"NO"]
[null,null,"No. 50",null,0.3,8,28,null,3,null,null,null,null,null,null,null,null,null,null,null,null,null,null,null,null,"NO"]
[null,null,"No. 200",null,7.4999999999999997E-2,8,12,null,3,null,null,null,null,null,null,null,null,null,null,null,null,null,null,null,null,"NO"]
[null,"SMA-F","3/4\"",null,19,100,100,17,5,null,null,null,null,null,null,null,2,null,0.30099999999999999,"NO",45,20,null,null,null,"NO",null,null,null,null,null,null,null,null,45]
[null,null,"1/2\"",null,12.5,100,100,null,5,null,null,null,null,null,null,null,null,null,null,"YES",null,null,null,null,null,"NO"]
[null,null,"3/8\"",null,9.5,70,90,null,5,null,null,null,null,null,null,null,null,null,null,null,null,null,null,null,null,"NO"]
[null,null,"No. 4",null,4.75,30,50,null,5,null,null,null,null,null,null,null,null,null,null,null,null,null,null,null,null,"NO"]
[null,null,"No. 8",null,2.36,20,30,null,5,null,null,null,null,null,null,null,null,null,null,null,null,null,null,null,null,"NO"]
[null,null,"No. 16",null,1.18,8,30,null,3,null,null,null,null,null,null,null,null,null,null,null,null,null,null,null,null,"NO"]
[null,null,"No. 30",null,0.6,8,30,null,3,null,null,null,null,null,null,null,null,null,null,null,null,null,null,null,null,"NO"]
[null,null,"No. 50",null,0.3,8,30,null,3,null,null,null,null,null,null,null,null,null,null,null,null,null,null,null,null,"NO"]
[null,null,"No. 200",null,7.4999999999999997E-2,8,14,null,3,null,null,null,null,null,null,null,null,null,null,null,null,null,null,null,null,"NO"]
[null,"SMAR-C","3/4\"",null,19,100,100,18.5,5,null,null,null,null,null,null,null,2,null,0.30099999999999999,"NO",45,20,null,null,null,"NO",null,null,null,null,null,null,null,null,45]
[null,null,"1/2\"",null,12.5,72,85,null,5,null,null,null,null,null,null,null,null,null,null,"YES",null,null,null,null,null,"NO"]
[null,null,"3/8\"",null,9.5,50,70,null,5,null,null,null,null,null,null,null,null,null,null,null,null,null,null,null,null,"NO"]
[null,null,"No. 4",null,4.75,30,45,null,5,null,null,null,null,null,null,null,null,null,null,null,null,null,null,null,null,"NO"]
[null,null,"No. 8",null,2.36,17,27,null,5,null,null,null,null,null,null,null,null,null,null,null,null,null,null,null,null,"NO"]
[null,null,"No. 16",null,1.18,12,22,null,3,null,null,null,null,null,null,null,null,null,null,null,null,null,null,null,null,"NO"]
[null,null,"No. 30",null,0.6,8,20,null,3,null,null,null,null,null,null,null,null,null,null,null,null,null,null,null,null,"NO"]
[null,null,"No. 50",null,0.3,6,15,null,3,null,null,null,null,null,null,null,null,null,null,null,null,null,null,null,null,"NO"]
[null,null,"No. 200",null,7.4999999999999997E-2,5,9,null,3,null,null,null,null,null,null,null,null,null,null,null,null,null,null,null,null,"NO"]
[null,"SMAR-F","3/4\"",null,19,100,100,18.5,5,null,null,null,null,null,null,null,2,null,0.30099999999999999,"NO",45,20,null,null,null,"NO",null,null,null,null,null,null,null,null,45]
[null,null,"1/2\"",null,12.5,100,100,null,5,null,null,null,null,null,null,null,null,null,null,"YES",null,null,null,null,null,"NO"]
[null,null,"3/8\"",null,9.5,95,100,null,5,null,null,null,null,null,null,null,null,null,null,null,null,null,null,null,null,"NO"]
[null,null,"No. 4",null,4.75,40,50,null,5,null,null,null,null,null,null,null,null,null,null,null,null,null,null,null,null,"NO"]
[null,null,"No. 8",null,2.36,17,27,null,5,null,null,null,null,null,null,null,null,null,null,null,null,null,null,null,null,"NO"]
[null,null,"No. 16",null,1.18,12,22,null,3,null,null,null,null,null,null,null,null,null,null,null,null,null,null,null,null,"NO"]
[null,null,"No. 30",null,0.6,8,20,null,3,null,null,null,null,null,null,null,null,null,null,null,null,null,null,null,null,"NO"]
[null,null,"No. 50",null,0.3,6,15,null,3,null,null,null,null,null,null,null,null,null,null,null,null,null,null,null,null,"NO"]
[null,null,"No. 200",null,7.4999999999999997E-2,5,9,null,3,null,null,null,null,null,null,null,null,null,null,null,null,null,null,null,null,"NO"]
[null,"PFC   SS3269 PFC-C","3/4\"","19 mm",19,100,100,null,5,null,null,null,null,null,null,null,2,null,0.30099999999999999,"NO","N/A",20,null,null,null,"YES",null,null,null,null,null,null,null,null,0]
[null,null,"1/2\"","12.5 mm",12.5,80,100,null,5,null,null,null,null,null,null,null,null,null,null,"YES",null,null,null,null,null,"YES"]
[null,null,"3/8\"","9.5 mm",9.5,35,60,null,5,null,null,null,null,null,null,null,null,null,null,null,null,null,null,null,null,"YES"]
[null,null,"No. 4","4.75 mm",4.75,1,20,null,5,null,null,null,null,null,null,null,null,null,null,null,null,null,null,null,null,"YES"]
[null,null,"No. 8",2.36,2.36,1,10,null,5,null,null,null,null,null,null,null,null,null,null,null,null,null,null,null,null,"YES"]
[null,null,"No. 200","75 µm",7.4999999999999997E-2,1,4,null,5,null,null,null,null,null,null,null,null,null,null,null,null,null,null,null,null,"YES"]
[null,"PFC_AR","3/4\"","19 mm",19,100,100,null,5,null,null,null,null,null,null,null,2,null,0.30099999999999999,"NO","N/A",20,null,null,null,"YES",null,null,null,null,null,null,null,null,0]
[null,null,"1/2\"","12.5 mm",12.5,95,100,null,5,null,null,null,null,null,null,null,null,null,null,"YES",null,null,null,null,null,"YES"]
[null,null,"3/8\"","9.5 mm",9.5,50,80,null,5,null,null,null,null,null,null,null,null,null,null,null,null,null,null,null,null,"YES"]
[null,null,"No. 4","4.75 mm",4.75,0,8,null,5,null,null,null,null,null,null,null,null,null,null,null,null,null,null,null,null,"YES"]
[null,null,"No. 8","2.36 mm",2.36,0,4,null,5,null,null,null,null,null,null,null,null,null,null,null,null,null,null,null,null,"YES"]
[null,null,"No. 200","75 µm",7.4999999999999997E-2,0,4,null,5,null,null,null,null,null,null,null,null,null,null,null,null,null,null,null,null,"YES"]
[null,"Microsurfacing","1/2\"","12.5 mm",12.5,0,0,null,5,null,null,null,null,null,null,null,3,null,0.501,"YES",null,null,null,null,null,"NO",null,null,null,null,null,null,null,null,70]
[null,null,"3/8\"","9.5 mm",9.5,0,1,null,5,null,null,null,null,null,null,null,null,null,null,"NO",null,null,null,null,null,"NO"]
[null,null,"No. 4","4.75 mm",4.75,6,14,null,5,null,null,null,null,null,null,null,null,null,null,null,null,null,null,null,null,"NO"]
[null,null,"No. 8","2.36 mm",2.36,35,55,null,5,null,null,null,null,null,null,null,null,null,null,null,null,null,null,null,null,"NO"]
[null,null,"No. 16","1.18 mm",1.18,54,75,null,3,null,null,null,null,null,null,null,null,null,null,null,null,null,null,null,null,"NO"]
[null,null,"No. 30","600 µm",0.6,65,85,null,3,null,null,null,null,null,null,null,null,null,null,null,null,null,null,null,null,"NO"]
[null,null,"No. 50","300 µm",0.3,75,90,null,3,null,null,null,null,null,null,null,null,null,null,null,null,null,"Membrane Application Rates",null,"SA Factors","NO"]
[null,null,"No. 100","150 µm",0.15,82,93,null,3,null,null,null,null,null,null,null,null,null,null,null,null,null,null,null,null,"NO"]
[null,null,"No. 200","75 µm",7.4999999999999997E-2,85,95,null,3,null,null,null,null,null,null,null,null,null,null,null,null,null,"MIN","MAX",null,"NO"]
[null,"UTBWC-A","3/8\"","9.5 mm",9.5,100,100,null,5,null,null,null,null,null,null,null,999999,null,0.30099999999999999,"NO",45,20,0.14000000000000001,0.19,0.41,"NO",null,null,null,null,null,null,null,null,45]
[null,null,"No. 4","4.75 mm",4.75,35,55,null,4,null,null,null,null,null,null,null,null,null,null,"NO",null,null,null,null,0.41,"NO"]
[null,null,"No. 8","2.36 mm",2.36,19,30,null,4,null,null,null,null,null,null,null,null,null,null,null,null,null,null,null,0.82,"NO"]
[null,null,"No. 16","1.18 mm",1.18,14,25,null,3,null,null,null,null,null,null,null,null,null,null,null,null,null,null,null,1.64,"NO"]
[null,null,"No. 30","600 µm",0.6,10,18,null,3,null,null,null,null,null,null,null,null,null,null,null,null,null,null,null,2.87,"NO"]
[null,null,"No. 50","300 µm",0.3,7,14,null,3,null,null,null,null,null,null,null,null,null,null,null,null,null,null,null,6.14,"NO"]
[null,null,"No. 100","150 µm",0.15,5,10,null,2,null,null,null,null,null,null,null,null,null,null,null,null,null,null,null,12.29,"NO"]
[null,null,"No. 200","75 µm",7.4999999999999997E-2,4,6,null,"MGL",null,null,null,null,null,null,null,null,null,null,null,null,null,null,null,32.770000000000003,"NO"]
[null,"UTBWC-B","1/2\"","12.5 mm",12.5,100,100,null,5,null,null,null,null,null,null,null,999999,null,0.30099999999999999,"NO",45,20,0.17,0.24,0.41,"NO",null,null,null,null,null,null,null,null,45]
[null,null,"3/8\"","9.5 mm",9.5,75,100,null,5,null,null,null,null,null,null,null,null,null,null,"NO",null,null,null,null,"-","NO"]
[null,null,"No. 4","4.75 mm",4.75,22,36,null,4,null,null,null,null,null,null,null,null,null,null,null,null,null,null,null,0.41,"NO"]
[null,null,"No. 8","2.36 mm",2.36,19,30,null,4,null,null,null,null,null,null,null,null,null,null,null,null,null,null,null,0.82,"NO"]
[null,null,"No. 16","1.18 mm",1.18,14,24,null,3,null,null,null,null,null,null,null,null,null,null,null,null,null,null,null,1.64,"NO"]
[null,null,"No. 30","600 µm",0.6,10,18,null,3,null,null,null,null,null,null,null,null,null,null,null,null,null,null,null,2.87,"NO"]
[null,null,"No. 50","300 µm",0.3,7,14,null,3,null,null,null,null,null,null,null,null,null,null,null,null,null,null,null,6.14,"NO"]
[null,null,"No. 100","150 µm",0.15,5,10,null,2,null,null,null,null,null,null,null,null,null,null,null,null,null,null,null,12.29,"NO"]
[null,null,"No. 200","75 µm",7.4999999999999997E-2,4,6,null,"MGL",null,null,null,null,null,null,null,null,null,null,null,null,null,null,null,32.770000000000003,"NO"]
[null,"UTBWC-C","3/4\"","19 mm",19,100,100,null,5,null,null,null,null,null,null,null,999999,null,0.30099999999999999,"NO",45,20,0.2,0.27,0.41,"NO",null,null,null,null,null,null,null,null,45]
[null,null,"1/2\"","12.5 mm",12.5,75,100,null,5,null,null,null,null,null,null,null,null,null,null,"NO",null,null,null,null,"-","NO"]
[null,null,"3/8\"","9.5 mm",9.5,55,80,null,5,null,null,null,null,null,null,null,null,null,null,null,null,null,null,null,"-","NO"]
[null,null,"No. 4","4.75 mm",4.75,22,36,null,4,null,null,null,null,null,null,null,null,null,null,null,null,null,null,null,0.41,"NO"]
[null,null,"No. 8","2.36 mm",2.36,19,30,null,4,null,null,null,null,null,null,null,null,null,null,null,null,null,null,null,0.82,"NO"]
[null,null,"No. 16","1.18 mm",1.18,14,24,null,3,null,null,null,null,null,null,null,null,null,null,null,null,null,null,null,1.64,"NO"]
[null,null,"No. 30","600 µm",0.6,10,18,null,3,null,null,null,null,null,null,null,null,null,null,null,null,null,null,null,2.87,"NO"]
[null,null,"No. 50","300 µm",0.3,7,14,null,3,null,null,null,null,null,null,null,null,null,null,null,null,null,null,null,6.14,"NO"]
[null,null,"No. 100","150 µm",0.15,5,10,null,2,null,null,null,null,null,null,null,null,null,null,null,null,null,null,null,12.29,"NO","% White Rock Min","% White Rock Max","% LRA Min","% LRA Max","% Virgin Agg. Min","% Virgin Agg. Max","% Flux Min","% Flux Max"]
[null,null,"No. 200","75 µm",7.4999999999999997E-2,4,6,null,"MGL",null,null,null,null,null,null,null,null,null,null,null,null,null,null,null,32.770000000000003,"NO"]
[null,"Type_I_AA_Coarse_Base","1-1/2\"",{"$f":"VLOOKUP(C318,B$555:C$580,2,FALSE)","v":"37.5 mm"},{"$f":"VLOOKUP(D318,C$555:E$580,3,FALSE)","v":37.5},0,0,null,5,null,null,null,null,null,null,null,2,null,0.20100000000000001,"YES",null,25,null,null,null,"NO",100,0,96,98,100,0,2,4,0]
[null,null,"1-1/4\"","31.5 mm",31.5,0,10,null,5,null,null,null,null,null,null,null,null,null,null,"YES",null,null,null,null,null,"NO"]
[null,null,"7/8\"","22.4 mm",22.4,15,30,null,5,null,null,null,null,null,null,null,null,null,null,null,null,null,null,null,null,"NO"]
[null,null,"3/8\"","9.5 mm",9.5,25,45,null,5,null,null,null,null,null,null,null,null,null,null,null,null,null,null,null,null,"NO"]
[null,null,"No. 4","4.75 mm",4.75,45,60,null,5,null,null,null,null,null,null,null,null,null,null,null,null,null,null,null,null,"NO"]
[null,null,"No. 10","2 mm",2,60,75,null,5,null,null,null,null,null,null,null,null,null,null,null,null,null,null,null,null,"NO"]
[null,"Type_I_A_Medium_Base","1\"","25 mm",25,0,0,null,5,null,null,null,null,null,null,null,2,null,0.20100000000000001,"YES",null,25,null,null,null,"NO",15,35,96,98,100,0,2,4,0]
[null,null,"7/8\"","22.4 mm",22.4,0,2,null,5,null,null,null,null,null,null,null,null,null,null,"YES",null,null,null,null,null,"NO"]
[null,null,"5/8\"","16 mm",16,5,15,null,5,null,null,null,null,null,null,null,null,null,null,null,null,null,null,null,null,"NO"]
[null,null,"3/8\"","9.5 mm",9.5,25,35,null,5,null,null,null,null,null,null,null,null,null,null,null,null,null,null,null,null,"NO"]
[null,null,"No. 4","4.75 mm",4.75,50,60,null,5,null,null,null,null,null,null,null,null,null,null,null,null,null,null,null,null,"NO"]
[null,null,"No. 10","2 mm",2,65,75,null,5,null,null,null,null,null,null,null,null,null,null,null,null,null,null,null,null,"NO"]
[null,"Type_I_B_Fine_Base","5/8\"","16 mm",16,0,0,null,5,null,null,null,null,null,null,null,2,null,0.20100000000000001,"YES",null,25,null,null,null,"NO",15,35,96,98,100,0,2,4,0]
[null,null,"1/2\"","12.5 mm",12.5,0,2,null,5,null,null,null,null,null,null,null,null,null,null,"YES",null,null,null,null,null,"NO"]
[null,null,"3/8\"","9.5 mm",9.5,5,15,null,5,null,null,null,null,null,null,null,null,null,null,null,null,null,null,null,null,"NO"]
[null,null,"No. 4","4.75 mm",4.75,45,60,null,5,null,null,null,null,null,null,null,null,null,null,null,null,null,null,null,null,"NO"]
[null,null,"No. 10","2 mm",2,60,75,null,5,null,null,null,null,null,null,null,null,null,null,null,null,null,null,null,null,"NO"]
[null,"Type_I_C_Course_Surface","1/2\"","12.5 mm",12.5,0,0,null,5,null,null,null,null,null,null,null,2,null,0.20100000000000001,"YES",null,25,null,null,null,"NO",15,35,96,98,100,0,2,4,0]
[null,null,"3/8\"","9.5 mm",9.5,0,2,null,5,null,null,null,null,null,null,null,null,null,null,"YES",null,null,null,null,null,"NO"]
[null,null,"No. 4","4.75 mm",4.75,35,50,null,5,null,null,null,null,null,null,null,null,null,null,null,null,null,null,null,null,"NO"]
[null,null,"No. 10","2 mm",2,65,80,null,5,null,null,null,null,null,null,null,null,null,null,null,null,null,null,null,null,"NO"]
[null,"Type_I_CC_Medium_Surface","1/2\"","12.5 mm",12.5,0,0,null,5,null,null,null,null,null,null,null,2,null,0.20100000000000001,"YES",null,25,null,null,null,"NO",15,35,96,98,100,0,2,4,0]
[null,null,"3/8\"","9.5 mm",9.5,0,2,null,5,null,null,null,null,null,null,null,null,null,null,"YES",null,null,null,null,null,"NO"]
[null,null,"No. 4","4.75 mm",4.75,35,50,null,5,null,null,null,null,null,null,null,null,null,null,null,null,null,null,null,null,"NO"]
[null,null,"No. 10","2 mm",2,50,65,null,5,null,null,null,null,null,null,null,null,null,null,null,null,null,null,null,null,"NO"]
[null,"Type_I_D_Fine_Surface","3/8\"","9.5 mm",9.5,0,0,null,5,null,null,null,null,null,null,null,2,null,0.20100000000000001,"YES",null,25,null,null,null,"NO",15,35,96,98,100,0,2,4,0]
[null,null,"1/4\"","6.3 mm",6.3,0,2,null,5,null,null,null,null,null,null,null,null,null,null,"YES",null,null,null,null,null,"NO"]
[null,null,"No. 4","4.75 mm",4.75,10,25,null,5,null,null,null,null,null,null,null,null,null,null,null,null,null,null,null,null,"NO"]
[null,null,"No. 10","2 mm",2,50,65,null,5,null,null,null,null,null,null,null,null,null,null,null,null,null,null,null,null,"NO"]
[null,"Type_II_BS_Surface","3/4\"","19 mm",19,0,0,null,5,null,null,null,null,null,null,null,2,null,0.20100000000000001,"YES",null,25,null,null,null,"NO",15,35,72,80.5,18,25,1.5,3,0]
[null,null,"5/8\"","16 mm",16,0,2,null,5,null,null,null,null,null,null,null,null,null,null,"YES",null,null,null,null,null,"NO"]
[null,null,"1/2\"","12.5 mm",12.5,0,10,null,5,null,null,null,null,null,null,null,null,null,null,null,null,null,null,null,null,"NO"]
[null,null,"3/8\"","9.5 mm",9.5,10,25,null,5,null,null,null,null,null,null,null,null,null,null,null,null,null,null,null,null,"NO"]
[null,null,"No. 4","4.75 mm",4.75,40,55,null,5,null,null,null,null,null,null,null,null,null,null,null,null,null,null,null,null,"NO"]
[null,null,"No. 10","2 mm",2,60,75,null,5,null,null,null,null,null,null,null,null,null,null,null,null,null,null,null,null,"NO"]
[null,"Type_II_CS_Medium_Surface","5/8\"","16 mm",16,0,0,null,5,null,null,null,null,null,null,null,2,null,0.20100000000000001,"YES",null,25,null,null,null,"NO",15,35,72,80.5,18,25,1.5,3,0]
[null,null,"1/2\"","12.5 mm",12.5,0,2,null,5,null,null,null,null,null,null,null,null,null,null,"YES",null,null,null,null,null,"NO"]
[null,null,"3/8\"","9.5 mm",9.5,0,10,null,5,null,null,null,null,null,null,null,null,null,null,null,null,null,null,null,null,"NO"]
[null,null,"No. 4","4.75 mm",4.75,35,55,null,5,null,null,null,null,null,null,null,null,null,null,null,null,null,null,null,null,"NO"]
[null,null,"No. 10","2 mm",2,60,75,null,5,null,null,null,null,null,null,null,null,null,null,null,null,null,null,null,null,"NO"]
[null,"Type_II_DS_Fine_Surface","1/2\"","12.5 mm",12.5,0,0,null,5,null,null,null,null,null,null,null,2,null,0.20100000000000001,"YES",null,25,null,null,null,"NO",15,35,72,80.5,18,25,1.5,3,0]
[null,null,"3/8\"","9.5 mm",9.5,0,2,null,5,null,null,null,null,null,null,null,null,null,null,"YES",null,null,null,null,null,"NO"]
[null,null,"No. 4","4.75 mm",4.75,10,25,null,5,null,null,null,null,null,null,null,null,null,null,null,null,null,null,null,null,"NO"]
[null,null,"No. 10","2 mm",2,50,65,null,5,null,null,null,null,null,null,null,null,null,null,null,null,null,null,null,null,"NO"]
[null,"Type_II_FS_Thin_Surface","3/8\"","9.5 mm",9.5,0,0,null,5,null,null,null,null,null,null,null,2,null,0.20100000000000001,"YES",null,25,null,null,null,"NO",100,0,36.5,63.5,35,60,1.5,3.5,0]
[null,null,"No. 4","4.75 mm",4.75,0,15,null,5,null,null,null,null,null,null,null,null,null,null,"YES",null,null,null,null,null,"NO"]
[null,null,"No. 10","2 mm",2,35,60,null,5,null,null,null,null,null,null,null,null,null,null,null,null,null,null,null,null,"NO"]
[null,"Type__A","2\"",null,50,100,100,11,0,null,null,null,null,null,null,null,2,null,0.30099999999999999,"NO",null,null,null,null,null,"NO",null,null,null,null,null,null,null,null,45]
[null,3224,"1-1/2\"",null,37.5,98,100,null,5,null,null,null,null,null,null,null,null,null,null,"YES",null,null,null,null,null,"NO"]
[null,null,"1\"",null,25,78,94,null,5,null,null,null,null,null,null,null,null,null,null,null,null,null,null,null,null,"NO"]
[null,null,"3/4\"",null,19,64,85,null,5,null,null,null,null,null,null,null,null,null,null,null,null,null,null,null,null,"NO"]
[null,null,"1/2\"",null,12.5,50,70,null,5,null,null,null,null,null,null,null,null,null,null,null,null,null,null,null,null,"NO"]
[null,null,"No. 4",null,4.75,30,50,null,5,null,null,null,null,null,null,null,null,null,null,null,null,null,null,null,null,"NO"]
[null,null,"No. 8",null,2.36,22,36,null,5,null,null,null,null,null,null,null,null,null,null,null,null,null,null,null,null,"NO"]
[null,null,"No. 30",null,0.6,8,23,null,3,null,null,null,null,null,null,null,null,null,null,null,null,null,null,null,null,"NO"]
[null,null,"No. 50",null,0.3,3,19,null,3,null,null,null,null,null,null,null,null,null,null,null,null,null,null,null,null,"NO"]
[null,null,"No. 200",null,7.4999999999999997E-2,2,7,null,3,null,null,null,null,null,null,null,null,null,null,null,null,null,null,null,null,"NO"]
[null,"Type__B","1-1/2\"",null,37.5,100,100,12,0,null,null,null,null,null,null,null,2,null,0.30099999999999999,"NO",null,null,null,null,null,"NO",null,null,null,null,null,null,null,null,45]
[null,3224,"1\"",null,25,98,100,null,5,null,null,null,null,null,null,null,null,null,null,"YES",null,null,null,null,null,"NO"]
[null,null,"3/4\"",null,19,84,98,null,5,null,null,null,null,null,null,null,null,null,null,null,null,null,null,null,null,"NO"]
[null,null,"3/8\"",null,9.5,60,80,null,5,null,null,null,null,null,null,null,null,null,null,null,null,null,null,null,null,"NO"]
[null,null,"No. 4",null,4.75,40,60,null,5,null,null,null,null,null,null,null,null,null,null,null,null,null,null,null,null,"NO"]
[null,null,"No. 8",null,2.36,29,43,null,5,null,null,null,null,null,null,null,null,null,null,null,null,null,null,null,null,"NO"]
[null,null,"No. 30",null,0.6,13,28,null,3,null,null,null,null,null,null,null,null,null,null,null,null,null,null,null,null,"NO"]
[null,null,"No. 50",null,0.3,6,20,null,3,null,null,null,null,null,null,null,null,null,null,null,null,null,null,null,null,"NO"]
[null,null,"No. 200",null,7.4999999999999997E-2,2,7,null,3,null,null,null,null,null,null,null,null,null,null,null,null,null,null,null,null,"NO"]
[null,"Type__C","1\"",null,25,100,100,13,0,null,null,null,null,null,null,null,2,null,0.30099999999999999,"NO",null,null,null,null,null,"NO",null,null,null,null,null,null,null,null,45]
[null,3224,"3/4\"",null,19,95,100,null,5,null,null,null,null,null,null,null,null,null,null,"YES",null,null,null,null,null,"NO"]
[null,null,"3/8\"",null,9.5,70,85,null,5,null,null,null,null,null,null,null,null,null,null,null,null,null,null,null,null,"NO"]
[null,null,"No. 4",null,4.75,43,63,null,5,null,null,null,null,null,null,null,null,null,null,null,null,null,null,null,null,"NO"]
[null,null,"No. 8",null,2.36,32,44,null,5,null,null,null,null,null,null,null,null,null,null,null,null,null,null,null,null,"NO"]
[null,null,"No. 30",null,0.6,14,28,null,3,null,null,null,null,null,null,null,null,null,null,null,null,null,null,null,null,"NO"]
[null,null,"No. 50",null,0.3,7,21,null,3,null,null,null,null,null,null,null,null,null,null,null,null,null,null,null,null,"NO"]
[null,null,"No. 200",null,7.4999999999999997E-2,2,7,null,3,null,null,null,null,null,null,null,null,null,null,null,null,null,null,null,null,"NO"]
[null,"Type__D","3/4\"",null,19,100,100,14,0,null,null,null,null,null,null,null,2,null,0.30099999999999999,"NO",null,null,null,null,null,"NO",null,null,null,null,null,null,null,null,45]
[null,3224,"1/2\"",null,12.5,98,100,null,5,null,null,null,null,null,null,null,null,null,null,"YES",null,null,null,null,null,"NO"]
[null,null,"3/8\"",null,9.5,85,100,null,5,null,null,null,null,null,null,null,null,null,null,null,null,null,null,null,null,"NO"]
[null,null,"No. 4",null,4.75,50,70,null,5,null,null,null,null,null,null,null,null,null,null,null,null,null,null,null,null,"NO"]
[null,null,"No. 8",null,2.36,35,46,null,5,null,null,null,null,null,null,null,null,null,null,null,null,null,null,null,null,"NO"]
[null,null,"No. 30",null,0.6,15,29,null,3,null,null,null,null,null,null,null,null,null,null,null,null,null,null,null,null,"NO"]
[null,null,"No. 50",null,0.3,7,20,null,3,null,null,null,null,null,null,null,null,null,null,null,null,null,null,null,null,"NO"]
[null,null,"No. 200",null,7.4999999999999997E-2,2,7,null,3,null,null,null,null,null,null,null,null,null,null,null,null,null,null,null,null,"NO"]
[null,"Type__F","1/2\"",null,12.5,100,100,15,0,null,null,null,null,null,null,null,2,null,0.30099999999999999,"NO",null,null,null,null,null,"NO",null,null,null,null,null,null,null,null,45]
[null,3224,"3/8\"",null,9.5,98,100,null,5,null,null,null,null,null,null,null,null,null,null,"YES",null,null,null,null,null,"NO"]
[null,null,"No. 4",null,4.75,70,90,null,5,null,null,null,null,null,null,null,null,null,null,null,null,null,null,null,null,"NO"]
[null,null,"No. 8",null,2.36,38,48,null,5,null,null,null,null,null,null,null,null,null,null,null,null,null,null,null,null,"NO"]
[null,null,"No. 30",null,0.6,12,27,null,3,null,null,null,null,null,null,null,null,null,null,null,null,null,null,null,null,"NO"]
[null,null,"No. 50",null,0.3,6,19,null,3,null,null,null,null,null,null,null,null,null,null,null,null,null,null,null,null,"NO"]
[null,null,"No. 200",null,7.4999999999999997E-2,2,7,null,3,null,null,null,null,null,null,null,null,null,null,null,null,null,null,null,null,"NO"]
[null,"SP__A","2\"",null,50,100,100,12.5,0,null,null,null,null,null,null,null,2,null,0.30099999999999999,"NO",45,25,null,null,null,"NO",null,null,null,null,null,null,null,null,45]
[null,3270,"1-1/2\"",null,37.5,98,100,null,5,null,null,null,null,null,null,null,null,null,null,"YES",null,null,null,null,null,"NO"]
[null,null,"1\"",null,25,90,100,null,5,null,null,null,null,null,null,null,null,null,null,null,null,null,null,null,null,"NO"]
[null,null,"3/4\"",null,19,19,90,null,5,null,null,null,null,null,null,null,null,null,null,null,null,null,null,null,null,"NO"]
[null,null,"No. 4",null,4.75,19,90,null,5,null,39.5,39.5,null,null,null,null,null,null,null,null,null,null,null,null,null,"NO"]
[null,null,"No. 8",null,2.36,19,45,null,5,null,26.8,30.8,null,null,null,null,null,null,null,null,null,null,null,null,null,"NO"]
[null,null,"No. 16",null,1.18,1,45,null,3,null,18.100000000000001,24.1,null,null,null,null,null,null,null,null,null,null,null,null,null,"NO"]
[null,null,"No. 30",null,0.6,1,45,null,3,null,13.6,17.5,null,null,null,null,null,null,null,null,null,null,null,null,null,"NO"]
[null,null,"No. 50",null,0.3,1,45,null,3,null,11.4,11.4,null,null,null,null,null,null,null,null,null,null,null,null,null,"NO"]
[null,null,"No. 200",null,7.4999999999999997E-2,1,7,null,3,null,null,null,null,null,null,null,null,null,null,null,null,null,null,null,null,"NO"]
[null,"SP__B","1-1/2\"",null,37.5,100,100,13.5,0,null,null,null,null,null,null,null,2,null,0.30099999999999999,"NO",45,25,null,null,null,"NO",null,null,null,null,null,null,null,null,45]
[null,3270,"1\"",null,25,98,100,null,5,null,null,null,null,null,null,null,null,null,null,"YES",null,null,null,null,null,"NO"]
[null,null,"3/4\"",null,19,90,100,null,5,null,null,null,null,null,null,null,null,null,null,null,null,null,null,null,null,"NO"]
[null,null,"1/2\"",null,12.5,23,90,null,5,null,null,null,null,null,null,null,null,null,null,null,null,null,null,null,null,"NO"]
[null,null,"No. 4",null,4.75,23,90,null,5,null,null,null,null,null,null,null,null,null,null,null,null,null,null,null,null,"NO"]
[null,null,"No. 8",null,2.36,23,49,null,5,null,34.6,34.6,null,null,null,null,null,null,null,null,null,null,null,null,null,"NO"]
[null,null,"No. 16",null,1.18,2,49,null,3,null,22.3,28.3,null,null,null,null,null,null,null,null,null,null,null,null,null,"NO"]
[null,null,"No. 30",null,0.6,2,49,null,3,null,16.7,20.7,null,null,null,null,null,null,null,null,null,null,null,null,null,"NO"]
[null,null,"No. 50",null,0.3,2,49,null,3,null,13.7,13.7,null,null,null,null,null,null,null,null,null,null,null,null,null,"NO"]
[null,null,"No. 200",null,7.4999999999999997E-2,2,8,null,3,null,null,null,null,null,null,null,null,null,null,null,null,null,null,null,null,"NO"]
[null,"SP__C","1\"",null,25,100,100,14.5,0,null,null,null,null,null,null,null,2,null,0.30099999999999999,"NO",45,25,null,null,null,"NO",null,null,null,null,null,null,null,null,45]
[null,3270,"3/4\"",null,19,98,100,null,5,null,null,null,null,null,null,null,null,null,null,"YES",null,null,null,null,null,"NO"]
[null,null,"1/2\"",null,12.5,90,100,null,5,null,null,null,null,null,null,null,null,null,null,null,null,null,null,null,null,"NO"]
[null,null,"3/8\"",null,9.5,28,90,null,5,null,null,null,null,null,null,null,null,null,null,null,null,null,null,null,null,"NO"]
[null,null,"No. 4",null,4.75,28,90,null,5,null,null,null,null,null,null,null,null,null,null,null,null,null,null,null,null,"NO"]
[null,null,"No. 8",null,2.36,28,58,null,5,null,39.1,39.1,null,null,null,null,null,null,null,null,null,null,null,null,null,"NO"]
[null,null,"No. 16",null,1.18,2,58,null,3,null,25.6,31.6,null,null,null,null,null,null,null,null,null,null,null,null,null,"NO"]
[null,null,"No. 30",null,0.6,2,58,null,3,null,19.100000000000001,23.1,null,null,null,null,null,null,null,null,null,null,null,null,null,"NO"]
[null,null,"No. 50",null,0.3,2,58,null,3,null,15.5,15.5,null,null,null,null,null,null,null,null,null,null,null,null,null,"NO"]
[null,null,"No. 200",null,7.4999999999999997E-2,2,10,null,3,null,null,null,null,null,null,null,null,null,null,null,null,null,null,null,null,"NO"]
[null,"SP__D","3/4\"",null,19,100,100,15.5,0,null,null,null,null,null,null,null,2,null,0.30099999999999999,"NO",45,25,null,null,null,"NO",null,null,null,null,null,null,null,null,45]
[null,3270,"1/2\"",null,12.5,98,100,null,5,null,null,null,null,null,null,null,null,null,null,"YES",null,null,null,null,null,"NO"]
[null,null,"3/8\"",null,9.5,90,100,null,5,null,null,null,null,null,null,null,null,null,null,null,null,null,null,null,null,"NO"]
[null,null,"No. 4",null,4.75,32,90,null,5,null,null,null,null,null,null,null,null,null,null,null,null,null,null,null,null,"NO"]
[null,null,"No. 8",null,2.36,32,67,null,5,null,47.2,47.2,null,null,null,null,null,null,null,null,null,null,null,null,null,"NO"]
[null,null,"No. 16",null,1.18,2,67,null,3,null,31.6,37.6,null,null,null,null,null,null,null,null,null,null,null,null,null,"NO"]
[null,null,"No. 30",null,0.6,2,67,null,3,null,23.5,27.5,null,null,null,null,null,null,null,null,null,null,null,null,null,"NO"]
[null,null,"No. 50",null,0.3,2,67,null,3,null,18.7,18.7,null,null,null,null,null,null,null,null,null,null,null,null,null,"NO"]
[null,null,"No. 200",null,7.4999999999999997E-2,2,10,null,3,null,null,null,null,null,null,null,null,null,null,null,null,null,null,null,null,"NO"]
[null,"Type_A","2\"",null,50,100,100,11,0,null,null,null,null,null,null,null,2,null,0.30099999999999999,"NO",null,null,null,null,null,"NO",null,null,null,null,null,null,null,null,45]
[null,3267,"1-1/2\"",null,37.5,98,100,null,5,null,null,null,null,null,null,null,null,null,null,"YES",null,null,null,null,null,"NO"]
[null,3268,"1\"",null,25,78,94,null,5,null,null,null,null,null,null,null,null,null,null,null,null,null,null,null,null,"NO"]
[null,null,"3/4\"",null,19,64,85,null,5,null,null,null,null,null,null,null,null,null,null,null,null,null,null,null,null,"NO"]
[null,null,"1/2\"",null,12.5,50,70,null,5,null,null,null,null,null,null,null,null,null,null,null,null,null,null,null,null,"NO"]
[null,null,"No. 4",null,4.75,30,50,null,5,null,null,null,null,null,null,null,null,null,null,null,null,null,null,null,null,"NO"]
[null,null,"No. 8",null,2.36,22,36,null,5,null,null,null,null,null,null,null,null,null,null,null,null,null,null,null,null,"NO"]
[null,null,"No. 30",null,0.6,8,23,null,3,null,null,null,null,null,null,null,null,null,null,null,null,null,null,null,null,"NO"]
[null,null,"No. 50",null,0.3,3,19,null,3,null,null,null,null,null,null,null,null,null,null,null,null,null,null,null,null,"NO"]
[null,null,"No. 200",null,7.4999999999999997E-2,2,7,null,3,null,null,null,null,null,null,null,null,null,null,null,null,null,null,null,null,"NO"]
[null,"Type_B","1-1/2\"",null,37.5,100,100,12,0,null,null,null,null,null,null,null,2,null,0.30099999999999999,"NO",null,null,null,null,null,"NO",null,null,null,null,null,null,null,null,45]
[null,3267,"1\"",null,25,98,100,null,5,null,null,null,null,null,null,null,null,null,null,"YES",null,null,null,null,null,"NO"]
[null,null,"3/4\"",null,19,84,98,null,5,null,null,null,null,null,null,null,null,null,null,null,null,null,null,null,null,"NO"]
[null,null,"3/8\"",null,9.5,60,80,null,5,null,null,null,null,null,null,null,null,null,null,null,null,null,null,null,null,"NO"]
[null,null,"No. 4",null,4.75,40,60,null,5,null,null,null,null,null,null,null,null,null,null,null,null,null,null,null,null,"NO"]
[null,null,"No. 8",null,2.36,29,43,null,5,null,null,null,null,null,null,null,null,null,null,null,null,null,null,null,null,"NO"]
[null,null,"No. 30",null,0.6,13,28,null,3,null,null,null,null,null,null,null,null,null,null,null,null,null,null,null,null,"NO"]
[null,null,"No. 50",null,0.3,6,20,null,3,null,null,null,null,null,null,null,null,null,null,null,null,null,null,null,null,"NO"]
[null,null,"No. 200",null,7.4999999999999997E-2,2,7,null,3,null,null,null,null,null,null,null,null,null,null,null,null,null,null,null,null,"NO"]
[null,"Type_C","1\"",null,25,100,100,13,0,null,null,null,null,null,null,null,2,null,0.30099999999999999,"NO",null,null,null,null,null,"NO",null,null,null,null,null,null,null,null,45]
[null,3267,"3/4\"",null,19,95,100,null,5,null,null,null,null,null,null,null,null,null,null,"YES",null,null,null,null,null,"NO"]
[null,null,"3/8\"",null,9.5,70,85,null,5,null,null,null,null,null,null,null,null,null,null,null,null,null,null,null,null,"NO"]
[null,null,"No. 4",null,4.75,43,63,null,5,null,null,null,null,null,null,null,null,null,null,null,null,null,null,null,null,"NO"]
[null,null,"No. 8",null,2.36,32,44,null,5,null,null,null,null,null,null,null,null,null,null,null,null,null,null,null,null,"NO"]
[null,null,"No. 30",null,0.6,14,28,null,3,null,null,null,null,null,null,null,null,null,null,null,null,null,null,null,null,"NO"]
[null,null,"No. 50",null,0.3,7,21,null,3,null,null,null,null,null,null,null,null,null,null,null,null,null,null,null,null,"NO"]
[null,null,"No. 200",null,7.4999999999999997E-2,2,7,null,3,null,null,null,null,null,null,null,null,null,null,null,null,null,null,null,null,"NO"]
[null,"Type_D","3/4\"",null,19,100,100,14,0,null,null,null,null,null,null,null,2,null,0.30099999999999999,"NO",null,null,null,null,null,"NO",null,null,null,null,null,null,null,null,45]
[null,3267,"1/2\"",null,12.5,98,100,null,5,null,null,null,null,null,null,null,null,null,null,"YES",null,null,null,null,null,"NO"]
[null,null,"3/8\"",null,9.5,85,100,null,5,null,null,null,null,null,null,null,null,null,null,null,null,null,null,null,null,"NO"]
[null,null,"No. 4",null,4.75,50,70,null,5,null,null,null,null,null,null,null,null,null,null,null,null,null,null,null,null,"NO"]
[null,null,"No. 8",null,2.36,35,46,null,5,null,null,null,null,null,null,null,null,null,null,null,null,null,null,null,null,"NO"]
[null,null,"No. 30",null,0.6,15,29,null,3,null,null,null,null,null,null,null,null,null,null,null,null,null,null,null,null,"NO"]
[null,null,"No. 50",null,0.3,7,20,null,3,null,null,null,null,null,null,null,null,null,null,null,null,null,null,null,null,"NO"]
[null,null,"No. 200",null,7.4999999999999997E-2,2,7,null,3,null,null,null,null,null,null,null,null,null,null,null,null,null,null,null,null,"NO"]
[null,"Type_F","1/2\"",null,12.5,100,100,15,0,null,null,null,null,null,null,null,2,null,0.30099999999999999,"NO",null,null,null,null,null,"NO",null,null,null,null,null,null,null,null,45]
[null,3267,"3/8\"",null,9.5,98,100,null,5,null,null,null,null,null,null,null,null,null,null,"YES",null,null,null,null,null,"NO"]
[null,null,"No. 4",null,4.75,70,90,null,5,null,null,null,null,null,null,null,null,null,null,null,null,null,null,null,null,"NO"]
[null,null,"No. 8",null,2.36,38,48,null,5,null,null,null,null,null,null,null,null,null,null,null,null,null,null,null,null,"NO"]
[null,null,"No. 30",null,0.6,12,27,null,3,null,null,null,null,null,null,null,null,null,null,null,null,null,null,null,null,"NO"]
[null,null,"No. 50",null,0.3,6,19,null,3,null,null,null,null,null,null,null,null,null,null,null,null,null,null,null,null,"NO"]
[null,null,"No. 200",null,7.4999999999999997E-2,2,7,null,3,null,null,null,null,null,null,null,null,null,null,null,null,null,null,null,null,"NO"]
[null,"SS3269 PFC-F","1/2\"","12.5 mm",12.5,100,100,null,5,null,null,null,null,null,null,null,2,null,0.30099999999999999,"NO","N/A",20,null,null,null,"YES",null,null,null,null,null,null,null,null,0]
[null,null,"3/8\"","9.5 mm",9.5,95,100,null,5,null,null,null,null,null,null,null,null,null,null,"YES",null,null,null,null,null,"YES"]
[null,null,"No. 4","4.75 mm",4.75,20,55,null,5,null,null,null,null,null,null,null,null,null,null,null,null,null,null,null,null,"YES"]
[null,null,"No. 8",2.36,2.36,1,10,null,5,null,null,null,null,null,null,null,null,null,null,null,null,null,null,null,null,"YES"]
[null,null,"No. 200","75 µm",7.4999999999999997E-2,1,4,null,5,null,null,null,null,null,null,null,null,null,null,null,null,null,null,null,null,"YES"]
[null,"SS3269 PFCR-C","3/4\"","19 mm",19,100,100,null,5,null,null,null,null,null,null,null,2,null,0.30099999999999999,"NO","N/A",20,null,null,null,"YES",null,null,null,null,null,null,null,null,0]
[null,null,"1/2\"","12.5 mm",12.5,80,100,null,5,null,null,null,null,null,null,null,null,null,null,"YES",null,null,null,null,null,"YES"]
[null,null,"3/8\"","9.5 mm",9.5,35,60,null,5,null,null,null,null,null,null,null,null,null,null,null,null,null,null,null,null,"YES"]
[null,null,"No. 4","4.75 mm",4.75,0,20,null,5,null,null,null,null,null,null,null,null,null,null,null,null,null,null,null,null,"YES"]
[null,null,"No. 8","2.36 mm",2.36,0,10,null,5,null,null,null,null,null,null,null,null,null,null,null,null,null,null,null,null,"YES"]
[null,null,"No. 200","75 µm",7.4999999999999997E-2,0,4,null,5,null,null,null,null,null,null,null,null,null,null,null,null,null,null,null,null,"YES"]
[null,"SS3271 \nSMA-F","1/2\"",null,12.5,100,100,null,5,null,null,null,null,null,null,null,2,null,null,"NO",null,20,null,null,null,"NO",null,null,null,null,null,null,null,null,45]
[null,null,"3/8\"",null,9.5,70,100,null,5,null,null,null,null,null,null,null,null,null,null,"YES",null,null,null,null,null,"NO"]
[null,null,"No. 4",null,4.75,30,60,null,5,null,null,null,null,null,null,null,null,null,null,null,null,null,null,null,null,"NO"]
[null,null,"No. 8",null,2.36,20,40,null,5,null,null,null,null,null,null,null,null,null,null,null,null,null,null,null,null,"NO"]
[null,null,"No. 16",null,1.18,6,30,null,3,null,null,null,null,null,null,null,null,null,null,null,null,null,null,null,null,"NO"]
[null,null,"No. 30",null,0.6,6,30,null,3,null,null,null,null,null,null,null,null,null,null,null,null,null,null,null,null,"NO"]
[null,null,"No. 50",null,0.3,6,30,null,3,null,null,null,null,null,null,null,null,null,null,null,null,null,null,null,null,"NO"]
[null,null,"No. 200",null,7.4999999999999997E-2,6,12,null,3,null,null,null,null,null,null,null,null,null,null,null,null,null,null,null,null,"NO"]
[null,"ITEM334 Type_A","2\"","50 mm",50,100,100,12,5,null,null,null,null,null,null,null,3,null,0.30099999999999999,"NO",45,30,null,null,null,"NO"]
[null,null,"1-1/2\"","37.5 mm",37.5,98,100,null,5,null,null,null,null,null,null,null,null,null,null,"YES",null,null,null,null,null,"NO"]
[null,null,"1\"","25 mm",25,78,94,null,5,null,null,null,null,null,null,null,null,null,null,null,null,null,null,null,null,"NO"]
[null,null,"3/4\"","19 mm",19,64,85,null,5,null,null,null,null,null,null,null,null,null,null,null,null,null,null,null,null,"NO"]
[null,null,"1/2\"","12.5 mm",12.5,50,70,null,5,null,null,null,null,null,null,null,null,null,null,null,null,null,null,null,null,"NO"]
[null,null,"No. 4","4.75 mm",4.75,30,50,null,5,null,null,null,null,null,null,null,null,null,null,null,null,null,null,null,null,"NO"]
[null,null,"No. 8","2.36 mm",2.36,22,36,null,5,null,null,null,null,null,null,null,null,null,null,null,null,null,null,null,null,"NO"]
[null,null,"No. 30","600 µm",0.6,8,23,null,3,null,null,null,null,null,null,null,null,null,null,null,null,null,null,null,null,"NO"]
[null,null,"No. 50","300 µm",0.3,9,19,null,3,null,null,null,null,null,null,null,null,null,null,null,null,null,null,null,null,"NO"]
[null,null,"No. 200","75 µm",7.4999999999999997E-2,2,7,null,3,null,null,null,null,null,null,null,null,null,null,null,null,null,null,null,null,"NO"]
[null,"ITEM334 Type_B","1-1/2\"","37.5 mm",37.5,100,100,13,5,null,null,null,null,null,null,null,3,null,0.30099999999999999,"NO",45,30,null,null,null,"NO"]
[null,null,"1\"","25 mm",25,98,100,null,5,null,null,null,null,null,null,null,null,null,null,"YES",null,null,null,null,null,"NO"]
[null,null,"3/4\"","19 mm",19,84,98,null,5,null,null,null,null,null,null,null,null,null,null,null,null,null,null,null,null,"NO"]
[null,null,"3/8\"","9.5 mm",9.5,60,80,null,5,null,null,null,null,null,null,null,null,null,null,null,null,null,null,null,null,"NO"]
[null,null,"No. 4","4.75 mm",4.75,40,60,null,5,null,null,null,null,null,null,null,null,null,null,null,null,null,null,null,null,"NO"]
[null,null,"No. 8","2.36 mm",2.36,29,43,null,5,null,null,null,null,null,null,null,null,null,null,null,null,null,null,null,null,"NO"]
[null,null,"No. 30","600 µm",0.6,13,28,null,3,null,null,null,null,null,null,null,null,null,null,null,null,null,null,null,null,"NO"]
[null,null,"No. 50","300 µm",0.3,6,20,null,3,null,null,null,null,null,null,null,null,null,null,null,null,null,null,null,null,"NO"]
[null,null,"No. 200","75 µm",7.4999999999999997E-2,2,7,null,3,null,null,null,null,null,null,null,null,null,null,null,null,null,null,null,null,"NO"]
[null,"ITEM334 Type_C","1\"","25 mm",25,100,100,14,5,null,null,null,null,null,null,null,3,null,0.30099999999999999,"NO",45,30,null,null,null,"NO"]
[null,null,"3/4\"","19 mm",19,95,100,null,5,null,null,null,null,null,null,null,null,null,null,"YES",null,null,null,null,null,"NO"]
[null,null,"3/8\"","9.5 mm",9.5,70,85,null,5,null,null,null,null,null,null,null,null,null,null,null,null,null,null,null,null,"NO"]
[null,null,"No. 4","4.75 mm",4.75,43,63,null,5,null,null,null,null,null,null,null,null,null,null,null,null,null,null,null,null,"NO"]
[null,null,"No. 8","2.36 mm",2.36,32,44,null,5,null,null,null,null,null,null,null,null,null,null,null,null,null,null,null,null,"NO"]
[null,null,"No. 30","600 µm",0.6,14,28,null,3,null,null,null,null,null,null,null,null,null,null,null,null,null,null,null,null,"NO"]
[null,null,"No. 50","300 µm",0.3,7,21,null,3,null,null,null,null,null,null,null,null,null,null,null,null,null,null,null,null,"NO"]
[null,null,"No. 200","75 µm",7.4999999999999997E-2,2,7,null,3,null,null,null,null,null,null,null,null,null,null,null,null,null,null,null,null,"NO"]
[null,"ITEM334 Type_D","1\"","25 mm",25,100,100,15,5,null,null,null,null,null,null,null,3,null,0.30099999999999999,"NO",45,30,null,null,null,"NO"]
[null,null,"1/2\"","12.5 mm",12.5,98,100,null,5,null,null,null,null,null,null,null,null,null,null,"YES",null,null,null,null,null,"NO"]
[null,null,"3/8\"","9.5 mm",9.5,85,100,null,5,null,null,null,null,null,null,null,null,null,null,null,null,null,null,null,null,"NO"]
[null,null,"No. 4","4.75 mm",4.75,50,70,null,5,null,null,null,null,null,null,null,null,null,null,null,null,null,null,null,null,"NO"]
[null,null,"No. 8","2.36 mm",2.36,35,46,null,5,null,null,null,null,null,null,null,null,null,null,null,null,null,null,null,null,"NO"]
[null,null,"No. 30","600 µm",0.6,15,29,null,3,null,null,null,null,null,null,null,null,null,null,null,null,null,null,null,null,"NO"]
[null,null,"No. 50","300 µm",0.3,7,20,null,3,null,null,null,null,null,null,null,null,null,null,null,null,null,null,null,null,"NO"]
[null,null,"No. 200","75 µm",7.4999999999999997E-2,2,7,null,3,null,null,null,null,null,null,null,null,null,null,null,null,null,null,null,null,"NO"]
[null,"ITEM334 Type_F","1/2\"","12.5 mm",12.5,100,100,16,5,null,null,null,null,null,null,null,3,null,0.30099999999999999,"NO",45,30,null,null,null,"NO"]
[null,null,"3/8\"","9.5 mm",9.5,98,100,null,5,null,null,null,null,null,null,null,null,null,null,"YES",null,null,null,null,null,"NO"]
[null,null,"No. 4","4.75 mm",4.75,70,90,null,5,null,null,null,null,null,null,null,null,null,null,null,null,null,null,null,null,"NO"]
[null,null,"No. 8","2.36 mm",2.36,38,48,null,5,null,null,null,null,null,null,null,null,null,null,null,null,null,null,null,null,"NO"]
[null,null,"No. 30","600 µm",0.6,12,27,null,3,null,null,null,null,null,null,null,null,null,null,null,null,null,null,null,null,"NO"]
[null,null,"No. 50","300 µm",0.3,6,19,null,3,null,null,null,null,null,null,null,null,null,null,null,null,null,null,null,null,"NO"]
[null,null,"No. 200","75 µm",7.4999999999999997E-2,2,7,null,3,null,null,null,null,null,null,null,null,null,null,null,null,null,null,null,null,"NO"]
[]
[]
[]
[]
[]
[null,"English","Metric","Selection","Sizes",null,"MIX TYPES",null,null,null,null,"Course"]
[null,"2\"","50 mm",{"$f":"IF(specyear=\"\",\"\",IF(specyear=\"1995\",C555,B555))","v":""},50,null,"Type_A",null,null,"Surface",null,{"$f":"J555","v":"Surface"}]
[null,"1-3/4\"","45 mm","",45,null,"Type_B",null,null,"Intermediate",null,{"$f":"IF(OR(LEFT(Grade,3)=\"PFC\",Grade=\"Microsurfacing\",LEFT(Grade,5)=\"UTBWC\"),\"\",(IF(LEFT(Grade,6)=\"SS3224\",\"Non-Surface (<8 in.)\",J556)))","v":"Intermediate"}]
[null,"1-1/2\"","37.5 mm","",37.5,null,"Type_C",null,null,"Base",null,{"$f":"IF(OR(LEFT(Grade,3)=\"PFC\",Grade=\"Microsurfacing\",LEFT(Grade,5)=\"UTBWC\"),\"\",(IF(LEFT(Grade,6)=\"SS3224\",\"Non-Surface (>8 in.)\",J557)))","v":"Base"}]
[null,"1-1/4\"","31.5 mm","",31.5,null,"Type_C_Surface"]
[null,"1\"","25 mm","",25,null,"Type_D"]
[null,"7/8\"","22.4 mm","",22.4,null,"Type_D_Surface"]
[null,"3/4\"","19 mm","",19,null,"Type_F"]
[null,"5/8\"","16 mm","",16,null,"Type_CMHB_C"]
[null,"1/2\"","12.5 mm","",12.5,null,"Type_CMHB_F"]
[null,"7/16\"","11.2 mm","",11.2,null,"PFC"]
[null,"3/8\"","9.5 mm","",9.5,null,"PFC_AR"]
[null,"5/16\"","8 mm","",8,null,"HD_SMA_1_inch"]
[null,"1/4\"","6.3 mm","",6.3,null,"HD_SMA_.75_inch"]
[null,"No. 4","4.75 mm","",4.75,null,"HD_SMA_.5_inch"]
[null,"No. 6","3.35 mm","",3.35,null,"SF_HMACP_1.5_inch"]
[null,"No. 8","2.36 mm","",2.36,null,"SF_HMACP_1_inch"]
[null,"No. 10","2 mm","",2,null,"SF_HMACP_.75_inch"]
[null,"No. 14","1.4 mm","",1.4,null,"SF_HMACP_.5_inch"]
[null,"No. 16","1.18 mm","",1.18,null,"SP_HMACP_1.5_inch"]
[null,"No. 20","850 µm","",0.85,null,"SP_HMACP_1_inch"]
[null,"No. 30","600 µm","",0.6,null,"SP_HMACP_.75_inch"]
[null,"No. 40","425 µm","",0.42499999999999999,null,"SP_HMACP_.5_inch"]
[null,"No. 50","300 µm","",0.3,null,"LRA_Type_I_AA_Coarse_Base"]
[null,"No. 80","180 µm","",0.18,null,"LRA_Type_I_A_Medium_Base"]
[null,"No. 100","150 µm","",0.15,null,"LRA_Type_I_B_Fine_Base"]
[null,"No. 200","75 µm","",7.4999999999999997E-2,null,"LRA_Type_I_C_Course_Surface"]
[null,null,null,null,null,null,"LRA_Type_I_CC_Medium_Surface"]
[null,null,null,null,null,null,"LRA_Type_I_D_Fine_Surface"]
[null,null,null,null,null,null,"LRA_Type_II_BS_Surface"]
[null,null,null,null,null,null,"LRA_Type_II_CS_Medium_Surface"]
[null,null,null,null,null,null,"LRA_Type_II_DS_Fine_Surface"]
[null,null,null,null,null,null,"ITEM334_Type_A"]
[null,null,null,null,null,null,"ITEM334_Type_B"]
[null,null,null,null,null,null,"ITEM334_Type_C"]
[null,null,null,null,null,null,"ITEM334_Type_D"]
[null,null,null,null,null,null,"ITEM334_Type_F"]
[null,null,null,null,null,null,"LRA_Type_II_FS_Thin_Surface"]
[null,null,null,null,null,null,"Other"]

{"sheet":"DATA_spcyr","index":6,"n_rows":62,"n_cols":5,"rows_kept":62,"cut":false,"hidden":true,"merged":[]}
["spec1993","spec1995","spec2004","spec2014","spec2024"]
["Type_A","Type_A","CMHB_C","Microsurfacing","Microsurfacing"]
["Type_B","Type_B","CMHB_F","LRA_Type_I_AA_Coarse_Base","LRA_Type_I_AA_Coarse_Base"]
["Type_C","Type_C","SMA_C","LRA_Type_I_A_Medium_Base","LRA_Type_I_A_Medium_Base"]
["Type_C_Surface","Type_C_Surface","SMA_D","LRA_Type_I_B_Fine_Base","LRA_Type_I_B_Fine_Base"]
["Type_D","Type_D","SMA_F","LRA_Type_I_C_Course_Surface","LRA_Type_I_C_Course_Surface"]
["Type_D_Surface","Type_D_Surface","SMAR_C","LRA_Type_I_CC_Medium_Surface","LRA_Type_I_CC_Medium_Surface"]
["Type_F","Type_F","SMAR_F","LRA_Type_I_D_Fine_Surface","LRA_Type_I_D_Fine_Surface"]
["Type_CMHB_C","Type_CMHB_C","SP_A","LRA_Type_II_BS_Surface","LRA_Type_II_BS_Surface"]
["Type_CMHB_F","Type_CMHB_F","SP_B","LRA_Type_II_CS_Medium_Surface","LRA_Type_II_CS_Medium_Surface"]
["PFC","PFC","SP_C","LRA_Type_II_DS_Fine_Surface","LRA_Type_II_DS_Fine_Surface"]
["PFC_AR","PFC_AR","SP_D","LRA_Type_II_FS_Thin_Surface","LRA_Type_II_FS_Thin_Surface"]
["HD_SMA_1_inch","HD_SMA_1_inch","Type__A","ITEM334_Type_A","ITEM334_Type_A"]
["HD_SMA_.75_inch","HD_SMA_.75_inch","Type__B","ITEM334_Type_B","ITEM334_Type_B"]
["HD_SMA_.5_inch","HD_SMA_.5_inch","Type__C","ITEM334_Type_C","ITEM334_Type_C"]
["SF_HMACP_1.5_inch","SF_HMACP_1.5_inch","Type__D","ITEM334_Type_D","ITEM334_Type_D"]
["SF_HMACP_1_inch","SF_HMACP_1_inch","Type__F","ITEM334_Type_F","ITEM334_Type_F"]
["SF_HMACP_.75_inch","SF_HMACP_.75_inch","SS3224_Type_A","SS3022_OGAB","Other"]
["SF_HMACP_.5_inch","SF_HMACP_.5_inch","SS3224_Type_B","Other"]
["SP_HMACP_1.5_inch","SP_HMACP_1.5_inch","SS3224_Type_C"]
["SP_HMACP_1_inch","SP_HMACP_1_inch","SS3224_Type_D"]
["SP_HMACP_.75_inch","SP_HMACP_.75_inch","SS3224_Type_F"]
["SP_HMACP_.5_inch","SP_HMACP_.5_inch","PFC_"]
["Other","Other","PFC__AR"]
[null,null,"Microsurfacing"]
[null,null,"UTBWC_A"]
[null,null,"UTBWC_B"]
[null,null,"UTBWC_C"]
[null,null,"LRA_Type_I_AA_Coarse_Base"]
[null,null,"LRA_Type_I_A_Medium_Base"]
[null,null,"LRA_Type_I_B_Fine_Base"]
[null,null,"LRA_Type_I_C_Course_Surface"]
[null,null,"LRA_Type_I_CC_Medium_Surface"]
[null,null,"LRA_Type_I_D_Fine_Surface"]
[null,null,"LRA_Type_II_BS_Surface"]
[null,null,"LRA_Type_II_CS_Medium_Surface"]
[null,null,"LRA_Type_II_DS_Fine_Surface"]
[null,null,"LRA_Type_II_FS_Thin_Surface"]
[null,null,"SS3267_Type_A"]
[null,null,"SS3267_Type_B"]
[null,null,"SS3267_Type_C"]
[null,null,"SS3267_Type_D"]
[null,null,"SS3267_Type_F"]
[null,null,"SS3268_Type_A"]
[null,null,"SS3268_Type_B"]
[null,null,"SS3268_Type_C"]
[null,null,"SS3268_Type_D"]
[null,null,"SS3268_Type_F"]
[null,null,"SS3269_PFC_F"]
[null,null,"SS3269_PFC_C"]
[null,null,"SS3269_PFCR_F"]
[null,null,"SS3269_PFCR_C"]
[null,null,"SS3270_SP_A"]
[null,null,"SS3270_SP_B"]
[null,null,"SS3270_SP_C"]
[null,null,"SS3270_SP_D"]
[null,null,"SS3271_SMA_C"]
[null,null,"SS3271_SMA_D"]
[null,null,"SS3271_SMA_F"]
[null,null,"SS3271_SMAR_C"]
[null,null,"SS3271_SMAR_F"]
[null,null,"Other"]

{"sheet":"RX","index":7,"n_rows":537,"n_cols":9,"rows_kept":537,"cut":false,"hidden":true,"merged":[]}
[{"$f":"COUNT(A3:A2000)","v":535}]
["Fld_nbr","Value","Desc_1","Desc_2","Desc_3","Desc_4","Desc_5","Desc_6","Desc_7"]
[1,{"$f":"IF('Design Data'!$B$78=\"\",\"\",'Design Data'!$B$78)","v":""},{"$f":"IF('Design Data'!$B$77=\"\",\"\",'Design Data'!$B$77)","v":"Remarks:"}]
[2,{"$f":"IF('Design Data'!$G$18=\"\",\"\",'Design Data'!$G$18)","v":""},{"$f":"IF('Design Data'!$B$18=\"\",\"\",'Design Data'!$B$18)","v":"COURSE\\LIFT:"}]
[3,{"$f":"IF('Design Data'!$E$86=\"\",\"\",'Design Data'!$E$86)","v":""},"Tested By ",{"$f":"IF('Design Data'!$B$86=\"\",\"\",'Design Data'!$B$86)","v":"TX207"}]
[4,{"$f":"IF('Design Data'!$O$86=\"\",\"\",'Design Data'!$O$86)","v":""},"Tested Date ",{"$f":"IF('Design Data'!$B$86=\"\",\"\",'Design Data'!$B$86)","v":"TX207"}]
[5,{"$f":"IF('Design Data'!$E$90=\"\",\"\",'Design Data'!$E$90)","v":""},"Tested By ",{"$f":"IF('Design Data'!$B$90=\"\",\"\",'Design Data'!$B$90)","v":"TX208"}]
[6,{"$f":"IF('Design Data'!$O$90=\"\",\"\",'Design Data'!$O$90)","v":""},"Tested Date ",{"$f":"IF('Design Data'!$B$90=\"\",\"\",'Design Data'!$B$90)","v":"TX208"}]
[7,{"$f":"IF('Design Data'!$E$92=\"\",\"\",'Design Data'!$E$92)","v":""},"Tested By ",{"$f":"IF('Design Data'!$B$92=\"\",\"\",'Design Data'!$B$92)","v":"TX210"}]
[8,{"$f":"IF('Design Data'!$O$92=\"\",\"\",'Design Data'!$O$92)","v":""},"Tested Date ",{"$f":"IF('Design Data'!$B$92=\"\",\"\",'Design Data'!$B$92)","v":"TX210"}]
[9,{"$f":"IF('Design Data'!$E$94=\"\",\"\",'Design Data'!$E$94)","v":""},"Tested By ",{"$f":"IF('Design Data'!$B$94=\"\",\"\",'Design Data'!$B$94)","v":"TX212"}]
[10,{"$f":"IF('Design Data'!$O$94=\"\",\"\",'Design Data'!$O$94)","v":""},"Tested Date ",{"$f":"IF('Design Data'!$B$94=\"\",\"\",'Design Data'!$B$94)","v":"TX212"}]
[11,{"$f":"IF('Design Data'!$E$96=\"\",\"\",'Design Data'!$E$96)","v":""},"Tested By ",{"$f":"IF('Design Data'!$B$96=\"\",\"\",'Design Data'!$B$96)","v":"TX213"}]
[12,{"$f":"IF('Design Data'!$O$96=\"\",\"\",'Design Data'!$O$96)","v":""},"Tested Date ",{"$f":"IF('Design Data'!$B$96=\"\",\"\",'Design Data'!$B$96)","v":"TX213"}]
[13,{"$f":"IF('Design Data'!$E$100=\"\",\"\",'Design Data'!$E$100)","v":""},"Tested By ",{"$f":"IF('Design Data'!$B$100=\"\",\"\",'Design Data'!$B$100)","v":"TX227"}]
[14,{"$f":"IF('Design Data'!$O$100=\"\",\"\",'Design Data'!$O$100)","v":""},"Tested Date ",{"$f":"IF('Design Data'!$B$100=\"\",\"\",'Design Data'!$B$100)","v":"TX227"}]
[15,{"$f":"IF('Design Data'!$E$104=\"\",\"\",'Design Data'!$E$104)","v":""},"Tested By ",{"$f":"IF('Design Data'!$B$104=\"\",\"\",'Design Data'!$B$104)","v":"TX228"}]
[16,{"$f":"IF('Design Data'!$O$104=\"\",\"\",'Design Data'!$O$104)","v":""},"Tested Date ",{"$f":"IF('Design Data'!$B$104=\"\",\"\",'Design Data'!$B$104)","v":"TX228"}]
[17,{"$f":"IF('Design Data'!$E$106=\"\",\"\",'Design Data'!$E$106)","v":""},"Tested By ",{"$f":"IF('Design Data'!$B$106=\"\",\"\",'Design Data'!$B$106)","v":"TX229"}]
[18,{"$f":"IF('Design Data'!$O$106=\"\",\"\",'Design Data'!$O$106)","v":""},"Tested Date ",{"$f":"IF('Design Data'!$B$106=\"\",\"\",'Design Data'!$B$106)","v":"TX229"}]
[19,{"$f":"IF('Design Data'!$E$108=\"\",\"\",'Design Data'!$E$108)","v":""},"Tested By ",{"$f":"IF('Design Data'!$B$108=\"\",\"\",'Design Data'!$B$108)","v":"TX231"}]
[20,{"$f":"IF('Design Data'!$O$108=\"\",\"\",'Design Data'!$O$108)","v":""},"Tested Date ",{"$f":"IF('Design Data'!$B$108=\"\",\"\",'Design Data'!$B$108)","v":"TX231"}]
[21,{"$f":"IF('Design Data'!$E$110=\"\",\"\",'Design Data'!$E$110)","v":""},"Tested By ",{"$f":"IF('Design Data'!$B$110=\"\",\"\",'Design Data'!$B$110)","v":"TX235"}]
[22,{"$f":"IF('Design Data'!$O$110=\"\",\"\",'Design Data'!$O$110)","v":""},"Tested Date ",{"$f":"IF('Design Data'!$B$110=\"\",\"\",'Design Data'!$B$110)","v":"TX235"}]
[23,{"$f":"IF('Design Data'!$E$112=\"\",\"\",'Design Data'!$E$112)","v":""},"Tested By ",{"$f":"IF('Design Data'!$B$112=\"\",\"\",'Design Data'!$B$112)","v":"TX236"}]
[24,{"$f":"IF('Design Data'!$O$112=\"\",\"\",'Design Data'!$O$112)","v":""},"Tested Date ",{"$f":"IF('Design Data'!$B$112=\"\",\"\",'Design Data'!$B$112)","v":"TX236"}]
[25,{"$f":"IF('Design Data'!$E$116=\"\",\"\",'Design Data'!$E$116)","v":""},"Tested By ",{"$f":"IF('Design Data'!$B$116=\"\",\"\",'Design Data'!$B$116)","v":"TX530"}]
[26,{"$f":"IF('Design Data'!$O$116=\"\",\"\",'Design Data'!$O$116)","v":""},"Tested Date ",{"$f":"IF('Design Data'!$B$116=\"\",\"\",'Design Data'!$B$116)","v":"TX530"}]
[27,{"$f":"IF('Design Data'!$E$118=\"\",\"\",'Design Data'!$E$118)","v":""},"Tested By ",{"$f":"IF('Design Data'!$B$118=\"\",\"\",'Design Data'!$B$118)","v":"TX531"}]
[28,{"$f":"IF('Design Data'!$O$118=\"\",\"\",'Design Data'!$O$118)","v":""},"Tested Date ",{"$f":"IF('Design Data'!$B$118=\"\",\"\",'Design Data'!$B$118)","v":"TX531"}]
[29,{"$f":"IF('Design Data'!$E$98=\"\",\"\",'Design Data'!$E$98)","v":""},"Tested By ",{"$f":"IF('Design Data'!$B$98=\"\",\"\",'Design Data'!$B$98)","v":"TX217"}]
[30,{"$f":"IF('Design Data'!$O$98=\"\",\"\",'Design Data'!$O$98)","v":""},"Tested Date ",{"$f":"IF('Design Data'!$B$98=\"\",\"\",'Design Data'!$B$98)","v":"TX217"}]
[31,{"$f":"IF('Design Data'!$I$23=\"\",\"\",'Design Data'!$I$23)","v":""},{"$f":"IF('Design Data'!$B$21=\"\",\"\",'Design Data'!$B$21)","v":"PRODUCTION DATA"},{"$f":"IF('Design Data'!$C$23=\"\",\"\",'Design Data'!$C$23)","v":"Quantity actually placed, Tons"}]
[32,{"$f":"IF('Design Data'!$T$23=\"\",\"\",'Design Data'!$T$23)","v":""},{"$f":"IF('Design Data'!$B$21=\"\",\"\",'Design Data'!$B$21)","v":"PRODUCTION DATA"},{"$f":"IF('Design Data'!$Q$23=\"\",\"\",'Design Data'!$Q$23)","v":"Roadway Rice?"}]
[33,{"$f":"IF('Design Data'!$I$28=\"\",\"\",'Design Data'!$I$28)","v":""},{"$f":"IF('Design Data'!$B$26=\"\",\"\",'Design Data'!$B$26)","v":"DETERMINATION OF ASPHALT CONTENT"},{"$f":"IF('Design Data'!$H$28=\"\",\"\",'Design Data'!$H$28)","v":"Determination of asphalt content by:"}]
[34,{"$f":"IF('Design Data'!$R$28=\"\",\"\",'Design Data'!$R$28)","v":""},{"$f":"IF('Design Data'!$B$26=\"\",\"\",'Design Data'!$B$26)","v":"DETERMINATION OF ASPHALT CONTENT"},{"$f":"IF('Design Data'!$P$28=\"\",\"\",'Design Data'!$P$28)","v":"PG Binder:"}]
[35,{"$f":"IF('Design Data'!$AA$28=\"\",\"\",'Design Data'!$AA$28)","v":""},{"$f":"IF('Design Data'!$B$26=\"\",\"\",'Design Data'!$B$26)","v":"DETERMINATION OF ASPHALT CONTENT"},{"$f":"IF('Design Data'!$V$28=\"\",\"\",'Design Data'!$V$28)","v":"Current JMF % Flux Material"}]
[36,{"$f":"IF('Design Data'!$I$30=\"\",\"\",'Design Data'!$I$30)","v":""},{"$f":"IF('Design Data'!$B$26=\"\",\"\",'Design Data'!$B$26)","v":"DETERMINATION OF ASPHALT CONTENT"},{"$f":"IF('Design Data'!$B$30=\"\",\"\",'Design Data'!$B$30)","v":"Original Mix Design Asphalt Content, %:"}]
[37,{"$f":"IF('Design Data'!$S$30=\"\",\"\",'Design Data'!$S$30)","v":""},{"$f":"IF('Design Data'!$B$26=\"\",\"\",'Design Data'!$B$26)","v":"DETERMINATION OF ASPHALT CONTENT"},{"$f":"IF('Design Data'!$L$30=\"\",\"\",'Design Data'!$L$30)","v":"Current JMF Asphalt Content, %:"}]
[38,{"$f":"IF('Design Data'!$AA$30=\"\",\"\",'Design Data'!$AA$30)","v":""},{"$f":"IF('Design Data'!$B$26=\"\",\"\",'Design Data'!$B$26)","v":"DETERMINATION OF ASPHALT CONTENT"},{"$f":"IF('Design Data'!$V$30=\"\",\"\",'Design Data'!$V$30)","v":"Ignition Correction Factor"}]
[39,{"$f":"IF('Design Data'!$I$37=\"\",\"\",'Design Data'!$I$37)","v":""},{"$f":"IF('Design Data'!$B$35=\"\",\"\",'Design Data'!$B$35)","v":"COMBINED AGGREGATE GRADATION:Tex-229-F"},{"$f":"IF('Design Data'!$H$37=\"\",\"\",'Design Data'!$H$37)","v":"Method used to obtain aggregate:"}]
[40,{"$f":"IF('Design Data'!$Q$37=\"\",\"\",'Design Data'!$Q$37)","v":""},{"$f":"IF('Design Data'!$B$35=\"\",\"\",'Design Data'!$B$35)","v":"COMBINED AGGREGATE GRADATION:Tex-229-F"},{"$f":"IF('Design Data'!$O$37=\"\",\"\",'Design Data'!$O$37)","v":"using:"}]
[41,{"$f":"IF('Design Data'!$G$43=\"\",\"\",'Design Data'!$G$43)","v":""},{"$f":"IF('Design Data'!$B$35=\"\",\"\",'Design Data'!$B$35)","v":"COMBINED AGGREGATE GRADATION:Tex-229-F"},{"$f":"IF('Design Data'!$B$39=\"\",\"\",'Design Data'!$B$39)","v":"Sieve Size:"},{"$f":"IF('Design Data'!$B$43=\"\",\"\",'Design Data'!$B$43)","v":""},{"$f":"IF('Design Data'!$G$39=\"\",\"\",'Design Data'!$G$39)","v":"Master Specification % Retained Tolerances"}]
[42,{"$f":"IF('Design Data'!$I$43=\"\",\"\",'Design Data'!$I$43)","v":""},{"$f":"IF('Design Data'!$B$35=\"\",\"\",'Design Data'!$B$35)","v":"COMBINED AGGREGATE GRADATION:Tex-229-F"},{"$f":"IF('Design Data'!$B$39=\"\",\"\",'Design Data'!$B$39)","v":"Sieve Size:"},{"$f":"IF('Design Data'!$B$43=\"\",\"\",'Design Data'!$B$43)","v":""},{"$f":"IF('Design Data'!$I$39=\"\",\"\",'Design Data'!$I$39)","v":"Master Specification % Retained Restricted"}]
[43,{"$f":"IF('Design Data'!$K$43=\"\",\"\",'Design Data'!$K$43)","v":""},{"$f":"IF('Design Data'!$B$35=\"\",\"\",'Design Data'!$B$35)","v":"COMBINED AGGREGATE GRADATION:Tex-229-F"},{"$f":"IF('Design Data'!$B$39=\"\",\"\",'Design Data'!$B$39)","v":"Sieve Size:"},{"$f":"IF('Design Data'!$B$43=\"\",\"\",'Design Data'!$B$43)","v":""},{"$f":"IF('Design Data'!$K$39=\"\",\"\",'Design Data'!$K$39)","v":"Design JMF Cumulative Percent Retained"}]
[44,{"$f":"IF('Design Data'!$N$43=\"\",\"\",'Design Data'!$N$43)","v":""},{"$f":"IF('Design Data'!$B$35=\"\",\"\",'Design Data'!$B$35)","v":"COMBINED AGGREGATE GRADATION:Tex-229-F"},{"$f":"IF('Design Data'!$B$39=\"\",\"\",'Design Data'!$B$39)","v":"Sieve Size:"},{"$f":"IF('Design Data'!$B$43=\"\",\"\",'Design Data'!$B$43)","v":""},{"$f":"IF('Design Data'!$N$39=\"\",\"\",'Design Data'!$N$39)","v":"In Tolerance"}]
[45,{"$f":"IF('Design Data'!$O$43=\"\",\"\",'Design Data'!$O$43)","v":""},{"$f":"IF('Design Data'!$B$35=\"\",\"\",'Design Data'!$B$35)","v":"COMBINED AGGREGATE GRADATION:Tex-229-F"},{"$f":"IF('Design Data'!$B$39=\"\",\"\",'Design Data'!$B$39)","v":"Sieve Size:"},{"$f":"IF('Design Data'!$B$43=\"\",\"\",'Design Data'!$B$43)","v":""},{"$f":"IF('Design Data'!$O$39=\"\",\"\",'Design Data'!$O$39)","v":"Restricted Zone"}]
[46,{"$f":"IF('Design Data'!$P$43=\"\",\"\",'Design Data'!$P$43)","v":""},{"$f":"IF('Design Data'!$B$35=\"\",\"\",'Design Data'!$B$35)","v":"COMBINED AGGREGATE GRADATION:Tex-229-F"},{"$f":"IF('Design Data'!$B$39=\"\",\"\",'Design Data'!$B$39)","v":"Sieve Size:"},{"$f":"IF('Design Data'!$B$43=\"\",\"\",'Design Data'!$B$43)","v":""},{"$f":"IF('Design Data'!$P$39=\"\",\"\",'Design Data'!$P$39)","v":"Current JMF Design % Retained Tolerances "}]
[47,{"$f":"IF('Design Data'!$R$43=\"\",\"\",'Design Data'!$R$43)","v":""},{"$f":"IF('Design Data'!$B$35=\"\",\"\",'Design Data'!$B$35)","v":"COMBINED AGGREGATE GRADATION:Tex-229-F"},{"$f":"IF('Design Data'!$B$39=\"\",\"\",'Design Data'!$B$39)","v":"Sieve Size:"},{"$f":"IF('Design Data'!$B$43=\"\",\"\",'Design Data'!$B$43)","v":""},{"$f":"IF('Design Data'!$R$39=\"\",\"\",'Design Data'!$R$39)","v":"Current JMF Cumulative Percent Retained"}]
[48,{"$f":"IF('Design Data'!$U$43=\"\",\"\",'Design Data'!$U$43)","v":""},{"$f":"IF('Design Data'!$B$35=\"\",\"\",'Design Data'!$B$35)","v":"COMBINED AGGREGATE GRADATION:Tex-229-F"},{"$f":"IF('Design Data'!$B$39=\"\",\"\",'Design Data'!$B$39)","v":"Sieve Size:"},{"$f":"IF('Design Data'!$B$43=\"\",\"\",'Design Data'!$B$43)","v":""},{"$f":"IF('Design Data'!$U$39=\"\",\"\",'Design Data'!$U$39)","v":"In Tolerance"}]
[49,{"$f":"IF('Design Data'!$V$43=\"\",\"\",'Design Data'!$V$43)","v":""},{"$f":"IF('Design Data'!$B$35=\"\",\"\",'Design Data'!$B$35)","v":"COMBINED AGGREGATE GRADATION:Tex-229-F"},{"$f":"IF('Design Data'!$B$39=\"\",\"\",'Design Data'!$B$39)","v":"Sieve Size:"},{"$f":"IF('Design Data'!$B$43=\"\",\"\",'Design Data'!$B$43)","v":""},{"$f":"IF('Design Data'!$V$39=\"\",\"\",'Design Data'!$V$39)","v":"Restricted Zone"}]
[50,{"$f":"IF('Design Data'!$Z$43=\"\",\"\",'Design Data'!$Z$43)","v":""},{"$f":"IF('Design Data'!$B$35=\"\",\"\",'Design Data'!$B$35)","v":"COMBINED AGGREGATE GRADATION:Tex-229-F"},{"$f":"IF('Design Data'!$B$39=\"\",\"\",'Design Data'!$B$39)","v":"Sieve Size:"},{"$f":"IF('Design Data'!$B$43=\"\",\"\",'Design Data'!$B$43)","v":""},{"$f":"IF('Design Data'!$Z$39=\"\",\"\",'Design Data'!$Z$39)","v":"TxDOT Ignition Oven Correction Factor,%:"}]
[51,{"$f":"IF('Design Data'!$G$44=\"\",\"\",'Design Data'!$G$44)","v":""},{"$f":"IF('Design Data'!$B$35=\"\",\"\",'Design Data'!$B$35)","v":"COMBINED AGGREGATE GRADATION:Tex-229-F"},{"$f":"IF('Design Data'!$B$39=\"\",\"\",'Design Data'!$B$39)","v":"Sieve Size:"},{"$f":"IF('Design Data'!$B$44=\"\",\"\",'Design Data'!$B$44)","v":""},{"$f":"IF('Design Data'!$G$39=\"\",\"\",'Design Data'!$G$39)","v":"Master Specification % Retained Tolerances"}]
[52,{"$f":"IF('Design Data'!$I$44=\"\",\"\",'Design Data'!$I$44)","v":""},{"$f":"IF('Design Data'!$B$35=\"\",\"\",'Design Data'!$B$35)","v":"COMBINED AGGREGATE GRADATION:Tex-229-F"},{"$f":"IF('Design Data'!$B$39=\"\",\"\",'Design Data'!$B$39)","v":"Sieve Size:"},{"$f":"IF('Design Data'!$B$44=\"\",\"\",'Design Data'!$B$44)","v":""},{"$f":"IF('Design Data'!$I$39=\"\",\"\",'Design Data'!$I$39)","v":"Master Specification % Retained Restricted"}]
[53,{"$f":"IF('Design Data'!$K$44=\"\",\"\",'Design Data'!$K$44)","v":""},{"$f":"IF('Design Data'!$B$35=\"\",\"\",'Design Data'!$B$35)","v":"COMBINED AGGREGATE GRADATION:Tex-229-F"},{"$f":"IF('Design Data'!$B$39=\"\",\"\",'Design Data'!$B$39)","v":"Sieve Size:"},{"$f":"IF('Design Data'!$B$44=\"\",\"\",'Design Data'!$B$44)","v":""},{"$f":"IF('Design Data'!$K$39=\"\",\"\",'Design Data'!$K$39)","v":"Design JMF Cumulative Percent Retained"}]
[54,{"$f":"IF('Design Data'!$N$44=\"\",\"\",'Design Data'!$N$44)","v":""},{"$f":"IF('Design Data'!$B$35=\"\",\"\",'Design Data'!$B$35)","v":"COMBINED AGGREGATE GRADATION:Tex-229-F"},{"$f":"IF('Design Data'!$B$39=\"\",\"\",'Design Data'!$B$39)","v":"Sieve Size:"},{"$f":"IF('Design Data'!$B$44=\"\",\"\",'Design Data'!$B$44)","v":""},{"$f":"IF('Design Data'!$N$39=\"\",\"\",'Design Data'!$N$39)","v":"In Tolerance"}]
[55,{"$f":"IF('Design Data'!$O$44=\"\",\"\",'Design Data'!$O$44)","v":""},{"$f":"IF('Design Data'!$B$35=\"\",\"\",'Design Data'!$B$35)","v":"COMBINED AGGREGATE GRADATION:Tex-229-F"},{"$f":"IF('Design Data'!$B$39=\"\",\"\",'Design Data'!$B$39)","v":"Sieve Size:"},{"$f":"IF('Design Data'!$B$44=\"\",\"\",'Design Data'!$B$44)","v":""},{"$f":"IF('Design Data'!$O$39=\"\",\"\",'Design Data'!$O$39)","v":"Restricted Zone"}]
[56,{"$f":"IF('Design Data'!$P$44=\"\",\"\",'Design Data'!$P$44)","v":""},{"$f":"IF('Design Data'!$B$35=\"\",\"\",'Design Data'!$B$35)","v":"COMBINED AGGREGATE GRADATION:Tex-229-F"},{"$f":"IF('Design Data'!$B$39=\"\",\"\",'Design Data'!$B$39)","v":"Sieve Size:"},{"$f":"IF('Design Data'!$B$44=\"\",\"\",'Design Data'!$B$44)","v":""},{"$f":"IF('Design Data'!$P$39=\"\",\"\",'Design Data'!$P$39)","v":"Current JMF Design % Retained Tolerances "}]
[57,{"$f":"IF('Design Data'!$R$44=\"\",\"\",'Design Data'!$R$44)","v":""},{"$f":"IF('Design Data'!$B$35=\"\",\"\",'Design Data'!$B$35)","v":"COMBINED AGGREGATE GRADATION:Tex-229-F"},{"$f":"IF('Design Data'!$B$39=\"\",\"\",'Design Data'!$B$39)","v":"Sieve Size:"},{"$f":"IF('Design Data'!$B$44=\"\",\"\",'Design Data'!$B$44)","v":""},{"$f":"IF('Design Data'!$R$39=\"\",\"\",'Design Data'!$R$39)","v":"Current JMF Cumulative Percent Retained"}]
[58,{"$f":"IF('Design Data'!$U$44=\"\",\"\",'Design Data'!$U$44)","v":""},{"$f":"IF('Design Data'!$B$35=\"\",\"\",'Design Data'!$B$35)","v":"COMBINED AGGREGATE GRADATION:Tex-229-F"},{"$f":"IF('Design Data'!$B$39=\"\",\"\",'Design Data'!$B$39)","v":"Sieve Size:"},{"$f":"IF('Design Data'!$B$44=\"\",\"\",'Design Data'!$B$44)","v":""},{"$f":"IF('Design Data'!$U$39=\"\",\"\",'Design Data'!$U$39)","v":"In Tolerance"}]
[59,{"$f":"IF('Design Data'!$V$44=\"\",\"\",'Design Data'!$V$44)","v":""},{"$f":"IF('Design Data'!$B$35=\"\",\"\",'Design Data'!$B$35)","v":"COMBINED AGGREGATE GRADATION:Tex-229-F"},{"$f":"IF('Design Data'!$B$39=\"\",\"\",'Design Data'!$B$39)","v":"Sieve Size:"},{"$f":"IF('Design Data'!$B$44=\"\",\"\",'Design Data'!$B$44)","v":""},{"$f":"IF('Design Data'!$V$39=\"\",\"\",'Design Data'!$V$39)","v":"Restricted Zone"}]
[60,{"$f":"IF('Design Data'!$Z$44=\"\",\"\",'Design Data'!$Z$44)","v":""},{"$f":"IF('Design Data'!$B$35=\"\",\"\",'Design Data'!$B$35)","v":"COMBINED AGGREGATE GRADATION:Tex-229-F"},{"$f":"IF('Design Data'!$B$39=\"\",\"\",'Design Data'!$B$39)","v":"Sieve Size:"},{"$f":"IF('Design Data'!$B$44=\"\",\"\",'Design Data'!$B$44)","v":""},{"$f":"IF('Design Data'!$Z$39=\"\",\"\",'Design Data'!$Z$39)","v":"TxDOT Ignition Oven Correction Factor,%:"}]
[61,{"$f":"IF('Design Data'!$G$45=\"\",\"\",'Design Data'!$G$45)","v":""},{"$f":"IF('Design Data'!$B$35=\"\",\"\",'Design Data'!$B$35)","v":"COMBINED AGGREGATE GRADATION:Tex-229-F"},{"$f":"IF('Design Data'!$B$39=\"\",\"\",'Design Data'!$B$39)","v":"Sieve Size:"},{"$f":"IF('Design Data'!$B$45=\"\",\"\",'Design Data'!$B$45)","v":""},{"$f":"IF('Design Data'!$G$39=\"\",\"\",'Design Data'!$G$39)","v":"Master Specification % Retained Tolerances"}]
[62,{"$f":"IF('Design Data'!$I$45=\"\",\"\",'Design Data'!$I$45)","v":""},{"$f":"IF('Design Data'!$B$35=\"\",\"\",'Design Data'!$B$35)","v":"COMBINED AGGREGATE GRADATION:Tex-229-F"},{"$f":"IF('Design Data'!$B$39=\"\",\"\",'Design Data'!$B$39)","v":"Sieve Size:"},{"$f":"IF('Design Data'!$B$45=\"\",\"\",'Design Data'!$B$45)","v":""},{"$f":"IF('Design Data'!$I$39=\"\",\"\",'Design Data'!$I$39)","v":"Master Specification % Retained Restricted"}]
[63,{"$f":"IF('Design Data'!$K$45=\"\",\"\",'Design Data'!$K$45)","v":""},{"$f":"IF('Design Data'!$B$35=\"\",\"\",'Design Data'!$B$35)","v":"COMBINED AGGREGATE GRADATION:Tex-229-F"},{"$f":"IF('Design Data'!$B$39=\"\",\"\",'Design Data'!$B$39)","v":"Sieve Size:"},{"$f":"IF('Design Data'!$B$45=\"\",\"\",'Design Data'!$B$45)","v":""},{"$f":"IF('Design Data'!$K$39=\"\",\"\",'Design Data'!$K$39)","v":"Design JMF Cumulative Percent Retained"}]
[64,{"$f":"IF('Design Data'!$N$45=\"\",\"\",'Design Data'!$N$45)","v":""},{"$f":"IF('Design Data'!$B$35=\"\",\"\",'Design Data'!$B$35)","v":"COMBINED AGGREGATE GRADATION:Tex-229-F"},{"$f":"IF('Design Data'!$B$39=\"\",\"\",'Design Data'!$B$39)","v":"Sieve Size:"},{"$f":"IF('Design Data'!$B$45=\"\",\"\",'Design Data'!$B$45)","v":""},{"$f":"IF('Design Data'!$N$39=\"\",\"\",'Design Data'!$N$39)","v":"In Tolerance"}]
[65,{"$f":"IF('Design Data'!$O$45=\"\",\"\",'Design Data'!$O$45)","v":""},{"$f":"IF('Design Data'!$B$35=\"\",\"\",'Design Data'!$B$35)","v":"COMBINED AGGREGATE GRADATION:Tex-229-F"},{"$f":"IF('Design Data'!$B$39=\"\",\"\",'Design Data'!$B$39)","v":"Sieve Size:"},{"$f":"IF('Design Data'!$B$45=\"\",\"\",'Design Data'!$B$45)","v":""},{"$f":"IF('Design Data'!$O$39=\"\",\"\",'Design Data'!$O$39)","v":"Restricted Zone"}]
[66,{"$f":"IF('Design Data'!$P$45=\"\",\"\",'Design Data'!$P$45)","v":""},{"$f":"IF('Design Data'!$B$35=\"\",\"\",'Design Data'!$B$35)","v":"COMBINED AGGREGATE GRADATION:Tex-229-F"},{"$f":"IF('Design Data'!$B$39=\"\",\"\",'Design Data'!$B$39)","v":"Sieve Size:"},{"$f":"IF('Design Data'!$B$45=\"\",\"\",'Design Data'!$B$45)","v":""},{"$f":"IF('Design Data'!$P$39=\"\",\"\",'Design Data'!$P$39)","v":"Current JMF Design % Retained Tolerances "}]
[67,{"$f":"IF('Design Data'!$R$45=\"\",\"\",'Design Data'!$R$45)","v":""},{"$f":"IF('Design Data'!$B$35=\"\",\"\",'Design Data'!$B$35)","v":"COMBINED AGGREGATE GRADATION:Tex-229-F"},{"$f":"IF('Design Data'!$B$39=\"\",\"\",'Design Data'!$B$39)","v":"Sieve Size:"},{"$f":"IF('Design Data'!$B$45=\"\",\"\",'Design Data'!$B$45)","v":""},{"$f":"IF('Design Data'!$R$39=\"\",\"\",'Design Data'!$R$39)","v":"Current JMF Cumulative Percent Retained"}]
[68,{"$f":"IF('Design Data'!$U$45=\"\",\"\",'Design Data'!$U$45)","v":""},{"$f":"IF('Design Data'!$B$35=\"\",\"\",'Design Data'!$B$35)","v":"COMBINED AGGREGATE GRADATION:Tex-229-F"},{"$f":"IF('Design Data'!$B$39=\"\",\"\",'Design Data'!$B$39)","v":"Sieve Size:"},{"$f":"IF('Design Data'!$B$45=\"\",\"\",'Design Data'!$B$45)","v":""},{"$f":"IF('Design Data'!$U$39=\"\",\"\",'Design Data'!$U$39)","v":"In Tolerance"}]
[69,{"$f":"IF('Design Data'!$V$45=\"\",\"\",'Design Data'!$V$45)","v":""},{"$f":"IF('Design Data'!$B$35=\"\",\"\",'Design Data'!$B$35)","v":"COMBINED AGGREGATE GRADATION:Tex-229-F"},{"$f":"IF('Design Data'!$B$39=\"\",\"\",'Design Data'!$B$39)","v":"Sieve Size:"},{"$f":"IF('Design Data'!$B$45=\"\",\"\",'Design Data'!$B$45)","v":""},{"$f":"IF('Design Data'!$V$39=\"\",\"\",'Design Data'!$V$39)","v":"Restricted Zone"}]
[70,{"$f":"IF('Design Data'!$Z$45=\"\",\"\",'Design Data'!$Z$45)","v":""},{"$f":"IF('Design Data'!$B$35=\"\",\"\",'Design Data'!$B$35)","v":"COMBINED AGGREGATE GRADATION:Tex-229-F"},{"$f":"IF('Design Data'!$B$39=\"\",\"\",'Design Data'!$B$39)","v":"Sieve Size:"},{"$f":"IF('Design Data'!$B$45=\"\",\"\",'Design Data'!$B$45)","v":""},{"$f":"IF('Design Data'!$Z$39=\"\",\"\",'Design Data'!$Z$39)","v":"TxDOT Ignition Oven Correction Factor,%:"}]
[71,{"$f":"IF('Design Data'!$G$46=\"\",\"\",'Design Data'!$G$46)","v":""},{"$f":"IF('Design Data'!$B$35=\"\",\"\",'Design Data'!$B$35)","v":"COMBINED AGGREGATE GRADATION:Tex-229-F"},{"$f":"IF('Design Data'!$B$39=\"\",\"\",'Design Data'!$B$39)","v":"Sieve Size:"},{"$f":"IF('Design Data'!$B$46=\"\",\"\",'Design Data'!$B$46)","v":""},{"$f":"IF('Design Data'!$G$39=\"\",\"\",'Design Data'!$G$39)","v":"Master Specification % Retained Tolerances"}]
[72,{"$f":"IF('Design Data'!$I$46=\"\",\"\",'Design Data'!$I$46)","v":""},{"$f":"IF('Design Data'!$B$35=\"\",\"\",'Design Data'!$B$35)","v":"COMBINED AGGREGATE GRADATION:Tex-229-F"},{"$f":"IF('Design Data'!$B$39=\"\",\"\",'Design Data'!$B$39)","v":"Sieve Size:"},{"$f":"IF('Design Data'!$B$46=\"\",\"\",'Design Data'!$B$46)","v":""},{"$f":"IF('Design Data'!$I$39=\"\",\"\",'Design Data'!$I$39)","v":"Master Specification % Retained Restricted"}]
[73,{"$f":"IF('Design Data'!$K$46=\"\",\"\",'Design Data'!$K$46)","v":""},{"$f":"IF('Design Data'!$B$35=\"\",\"\",'Design Data'!$B$35)","v":"COMBINED AGGREGATE GRADATION:Tex-229-F"},{"$f":"IF('Design Data'!$B$39=\"\",\"\",'Design Data'!$B$39)","v":"Sieve Size:"},{"$f":"IF('Design Data'!$B$46=\"\",\"\",'Design Data'!$B$46)","v":""},{"$f":"IF('Design Data'!$K$39=\"\",\"\",'Design Data'!$K$39)","v":"Design JMF Cumulative Percent Retained"}]
[74,{"$f":"IF('Design Data'!$N$46=\"\",\"\",'Design Data'!$N$46)","v":""},{"$f":"IF('Design Data'!$B$35=\"\",\"\",'Design Data'!$B$35)","v":"COMBINED AGGREGATE GRADATION:Tex-229-F"},{"$f":"IF('Design Data'!$B$39=\"\",\"\",'Design Data'!$B$39)","v":"Sieve Size:"},{"$f":"IF('Design Data'!$B$46=\"\",\"\",'Design Data'!$B$46)","v":""},{"$f":"IF('Design Data'!$N$39=\"\",\"\",'Design Data'!$N$39)","v":"In Tolerance"}]
[75,{"$f":"IF('Design Data'!$O$46=\"\",\"\",'Design Data'!$O$46)","v":""},{"$f":"IF('Design Data'!$B$35=\"\",\"\",'Design Data'!$B$35)","v":"COMBINED AGGREGATE GRADATION:Tex-229-F"},{"$f":"IF('Design Data'!$B$39=\"\",\"\",'Design Data'!$B$39)","v":"Sieve Size:"},{"$f":"IF('Design Data'!$B$46=\"\",\"\",'Design Data'!$B$46)","v":""},{"$f":"IF('Design Data'!$O$39=\"\",\"\",'Design Data'!$O$39)","v":"Restricted Zone"}]
[76,{"$f":"IF('Design Data'!$P$46=\"\",\"\",'Design Data'!$P$46)","v":""},{"$f":"IF('Design Data'!$B$35=\"\",\"\",'Design Data'!$B$35)","v":"COMBINED AGGREGATE GRADATION:Tex-229-F"},{"$f":"IF('Design Data'!$B$39=\"\",\"\",'Design Data'!$B$39)","v":"Sieve Size:"},{"$f":"IF('Design Data'!$B$46=\"\",\"\",'Design Data'!$B$46)","v":""},{"$f":"IF('Design Data'!$P$39=\"\",\"\",'Design Data'!$P$39)","v":"Current JMF Design % Retained Tolerances "}]
[77,{"$f":"IF('Design Data'!$R$46=\"\",\"\",'Design Data'!$R$46)","v":""},{"$f":"IF('Design Data'!$B$35=\"\",\"\",'Design Data'!$B$35)","v":"COMBINED AGGREGATE GRADATION:Tex-229-F"},{"$f":"IF('Design Data'!$B$39=\"\",\"\",'Design Data'!$B$39)","v":"Sieve Size:"},{"$f":"IF('Design Data'!$B$46=\"\",\"\",'Design Data'!$B$46)","v":""},{"$f":"IF('Design Data'!$R$39=\"\",\"\",'Design Data'!$R$39)","v":"Current JMF Cumulative Percent Retained"}]
[78,{"$f":"IF('Design Data'!$U$46=\"\",\"\",'Design Data'!$U$46)","v":""},{"$f":"IF('Design Data'!$B$35=\"\",\"\",'Design Data'!$B$35)","v":"COMBINED AGGREGATE GRADATION:Tex-229-F"},{"$f":"IF('Design Data'!$B$39=\"\",\"\",'Design Data'!$B$39)","v":"Sieve Size:"},{"$f":"IF('Design Data'!$B$46=\"\",\"\",'Design Data'!$B$46)","v":""},{"$f":"IF('Design Data'!$U$39=\"\",\"\",'Design Data'!$U$39)","v":"In Tolerance"}]
[79,{"$f":"IF('Design Data'!$V$46=\"\",\"\",'Design Data'!$V$46)","v":""},{"$f":"IF('Design Data'!$B$35=\"\",\"\",'Design Data'!$B$35)","v":"COMBINED AGGREGATE GRADATION:Tex-229-F"},{"$f":"IF('Design Data'!$B$39=\"\",\"\",'Design Data'!$B$39)","v":"Sieve Size:"},{"$f":"IF('Design Data'!$B$46=\"\",\"\",'Design Data'!$B$46)","v":""},{"$f":"IF('Design Data'!$V$39=\"\",\"\",'Design Data'!$V$39)","v":"Restricted Zone"}]
[80,{"$f":"IF('Design Data'!$Z$46=\"\",\"\",'Design Data'!$Z$46)","v":""},{"$f":"IF('Design Data'!$B$35=\"\",\"\",'Design Data'!$B$35)","v":"COMBINED AGGREGATE GRADATION:Tex-229-F"},{"$f":"IF('Design Data'!$B$39=\"\",\"\",'Design Data'!$B$39)","v":"Sieve Size:"},{"$f":"IF('Design Data'!$B$46=\"\",\"\",'Design Data'!$B$46)","v":""},{"$f":"IF('Design Data'!$Z$39=\"\",\"\",'Design Data'!$Z$39)","v":"TxDOT Ignition Oven Correction Factor,%:"}]
[81,{"$f":"IF('Design Data'!$G$47=\"\",\"\",'Design Data'!$G$47)","v":""},{"$f":"IF('Design Data'!$B$35=\"\",\"\",'Design Data'!$B$35)","v":"COMBINED AGGREGATE GRADATION:Tex-229-F"},{"$f":"IF('Design Data'!$B$39=\"\",\"\",'Design Data'!$B$39)","v":"Sieve Size:"},{"$f":"IF('Design Data'!$B$47=\"\",\"\",'Design Data'!$B$47)","v":""},{"$f":"IF('Design Data'!$G$39=\"\",\"\",'Design Data'!$G$39)","v":"Master Specification % Retained Tolerances"}]
[82,{"$f":"IF('Design Data'!$I$47=\"\",\"\",'Design Data'!$I$47)","v":""},{"$f":"IF('Design Data'!$B$35=\"\",\"\",'Design Data'!$B$35)","v":"COMBINED AGGREGATE GRADATION:Tex-229-F"},{"$f":"IF('Design Data'!$B$39=\"\",\"\",'Design Data'!$B$39)","v":"Sieve Size:"},{"$f":"IF('Design Data'!$B$47=\"\",\"\",'Design Data'!$B$47)","v":""},{"$f":"IF('Design Data'!$I$39=\"\",\"\",'Design Data'!$I$39)","v":"Master Specification % Retained Restricted"}]
[83,{"$f":"IF('Design Data'!$K$47=\"\",\"\",'Design Data'!$K$47)","v":""},{"$f":"IF('Design Data'!$B$35=\"\",\"\",'Design Data'!$B$35)","v":"COMBINED AGGREGATE GRADATION:Tex-229-F"},{"$f":"IF('Design Data'!$B$39=\"\",\"\",'Design Data'!$B$39)","v":"Sieve Size:"},{"$f":"IF('Design Data'!$B$47=\"\",\"\",'Design Data'!$B$47)","v":""},{"$f":"IF('Design Data'!$K$39=\"\",\"\",'Design Data'!$K$39)","v":"Design JMF Cumulative Percent Retained"}]
[84,{"$f":"IF('Design Data'!$N$47=\"\",\"\",'Design Data'!$N$47)","v":""},{"$f":"IF('Design Data'!$B$35=\"\",\"\",'Design Data'!$B$35)","v":"COMBINED AGGREGATE GRADATION:Tex-229-F"},{"$f":"IF('Design Data'!$B$39=\"\",\"\",'Design Data'!$B$39)","v":"Sieve Size:"},{"$f":"IF('Design Data'!$B$47=\"\",\"\",'Design Data'!$B$47)","v":""},{"$f":"IF('Design Data'!$N$39=\"\",\"\",'Design Data'!$N$39)","v":"In Tolerance"}]
[85,{"$f":"IF('Design Data'!$O$47=\"\",\"\",'Design Data'!$O$47)","v":""},{"$f":"IF('Design Data'!$B$35=\"\",\"\",'Design Data'!$B$35)","v":"COMBINED AGGREGATE GRADATION:Tex-229-F"},{"$f":"IF('Design Data'!$B$39=\"\",\"\",'Design Data'!$B$39)","v":"Sieve Size:"},{"$f":"IF('Design Data'!$B$47=\"\",\"\",'Design Data'!$B$47)","v":""},{"$f":"IF('Design Data'!$O$39=\"\",\"\",'Design Data'!$O$39)","v":"Restricted Zone"}]
[86,{"$f":"IF('Design Data'!$P$47=\"\",\"\",'Design Data'!$P$47)","v":""},{"$f":"IF('Design Data'!$B$35=\"\",\"\",'Design Data'!$B$35)","v":"COMBINED AGGREGATE GRADATION:Tex-229-F"},{"$f":"IF('Design Data'!$B$39=\"\",\"\",'Design Data'!$B$39)","v":"Sieve Size:"},{"$f":"IF('Design Data'!$B$47=\"\",\"\",'Design Data'!$B$47)","v":""},{"$f":"IF('Design Data'!$P$39=\"\",\"\",'Design Data'!$P$39)","v":"Current JMF Design % Retained Tolerances "}]
[87,{"$f":"IF('Design Data'!$R$47=\"\",\"\",'Design Data'!$R$47)","v":""},{"$f":"IF('Design Data'!$B$35=\"\",\"\",'Design Data'!$B$35)","v":"COMBINED AGGREGATE GRADATION:Tex-229-F"},{"$f":"IF('Design Data'!$B$39=\"\",\"\",'Design Data'!$B$39)","v":"Sieve Size:"},{"$f":"IF('Design Data'!$B$47=\"\",\"\",'Design Data'!$B$47)","v":""},{"$f":"IF('Design Data'!$R$39=\"\",\"\",'Design Data'!$R$39)","v":"Current JMF Cumulative Percent Retained"}]
[88,{"$f":"IF('Design Data'!$U$47=\"\",\"\",'Design Data'!$U$47)","v":""},{"$f":"IF('Design Data'!$B$35=\"\",\"\",'Design Data'!$B$35)","v":"COMBINED AGGREGATE GRADATION:Tex-229-F"},{"$f":"IF('Design Data'!$B$39=\"\",\"\",'Design Data'!$B$39)","v":"Sieve Size:"},{"$f":"IF('Design Data'!$B$47=\"\",\"\",'Design Data'!$B$47)","v":""},{"$f":"IF('Design Data'!$U$39=\"\",\"\",'Design Data'!$U$39)","v":"In Tolerance"}]
[89,{"$f":"IF('Design Data'!$V$47=\"\",\"\",'Design Data'!$V$47)","v":""},{"$f":"IF('Design Data'!$B$35=\"\",\"\",'Design Data'!$B$35)","v":"COMBINED AGGREGATE GRADATION:Tex-229-F"},{"$f":"IF('Design Data'!$B$39=\"\",\"\",'Design Data'!$B$39)","v":"Sieve Size:"},{"$f":"IF('Design Data'!$B$47=\"\",\"\",'Design Data'!$B$47)","v":""},{"$f":"IF('Design Data'!$V$39=\"\",\"\",'Design Data'!$V$39)","v":"Restricted Zone"}]
[90,{"$f":"IF('Design Data'!$Z$47=\"\",\"\",'Design Data'!$Z$47)","v":""},{"$f":"IF('Design Data'!$B$35=\"\",\"\",'Design Data'!$B$35)","v":"COMBINED AGGREGATE GRADATION:Tex-229-F"},{"$f":"IF('Design Data'!$B$39=\"\",\"\",'Design Data'!$B$39)","v":"Sieve Size:"},{"$f":"IF('Design Data'!$B$47=\"\",\"\",'Design Data'!$B$47)","v":""},{"$f":"IF('Design Data'!$Z$39=\"\",\"\",'Design Data'!$Z$39)","v":"TxDOT Ignition Oven Correction Factor,%:"}]
[91,{"$f":"IF('Design Data'!$G$48=\"\",\"\",'Design Data'!$G$48)","v":""},{"$f":"IF('Design Data'!$B$35=\"\",\"\",'Design Data'!$B$35)","v":"COMBINED AGGREGATE GRADATION:Tex-229-F"},{"$f":"IF('Design Data'!$B$39=\"\",\"\",'Design Data'!$B$39)","v":"Sieve Size:"},{"$f":"IF('Design Data'!$B$48=\"\",\"\",'Design Data'!$B$48)","v":""},{"$f":"IF('Design Data'!$G$39=\"\",\"\",'Design Data'!$G$39)","v":"Master Specification % Retained Tolerances"}]
[92,{"$f":"IF('Design Data'!$I$48=\"\",\"\",'Design Data'!$I$48)","v":""},{"$f":"IF('Design Data'!$B$35=\"\",\"\",'Design Data'!$B$35)","v":"COMBINED AGGREGATE GRADATION:Tex-229-F"},{"$f":"IF('Design Data'!$B$39=\"\",\"\",'Design Data'!$B$39)","v":"Sieve Size:"},{"$f":"IF('Design Data'!$B$48=\"\",\"\",'Design Data'!$B$48)","v":""},{"$f":"IF('Design Data'!$I$39=\"\",\"\",'Design Data'!$I$39)","v":"Master Specification % Retained Restricted"}]
[93,{"$f":"IF('Design Data'!$K$48=\"\",\"\",'Design Data'!$K$48)","v":""},{"$f":"IF('Design Data'!$B$35=\"\",\"\",'Design Data'!$B$35)","v":"COMBINED AGGREGATE GRADATION:Tex-229-F"},{"$f":"IF('Design Data'!$B$39=\"\",\"\",'Design Data'!$B$39)","v":"Sieve Size:"},{"$f":"IF('Design Data'!$B$48=\"\",\"\",'Design Data'!$B$48)","v":""},{"$f":"IF('Design Data'!$K$39=\"\",\"\",'Design Data'!$K$39)","v":"Design JMF Cumulative Percent Retained"}]
[94,{"$f":"IF('Design Data'!$N$48=\"\",\"\",'Design Data'!$N$48)","v":""},{"$f":"IF('Design Data'!$B$35=\"\",\"\",'Design Data'!$B$35)","v":"COMBINED AGGREGATE GRADATION:Tex-229-F"},{"$f":"IF('Design Data'!$B$39=\"\",\"\",'Design Data'!$B$39)","v":"Sieve Size:"},{"$f":"IF('Design Data'!$B$48=\"\",\"\",'Design Data'!$B$48)","v":""},{"$f":"IF('Design Data'!$N$39=\"\",\"\",'Design Data'!$N$39)","v":"In Tolerance"}]
[95,{"$f":"IF('Design Data'!$O$48=\"\",\"\",'Design Data'!$O$48)","v":""},{"$f":"IF('Design Data'!$B$35=\"\",\"\",'Design Data'!$B$35)","v":"COMBINED AGGREGATE GRADATION:Tex-229-F"},{"$f":"IF('Design Data'!$B$39=\"\",\"\",'Design Data'!$B$39)","v":"Sieve Size:"},{"$f":"IF('Design Data'!$B$48=\"\",\"\",'Design Data'!$B$48)","v":""},{"$f":"IF('Design Data'!$O$39=\"\",\"\",'Design Data'!$O$39)","v":"Restricted Zone"}]
[96,{"$f":"IF('Design Data'!$P$48=\"\",\"\",'Design Data'!$P$48)","v":""},{"$f":"IF('Design Data'!$B$35=\"\",\"\",'Design Data'!$B$35)","v":"COMBINED AGGREGATE GRADATION:Tex-229-F"},{"$f":"IF('Design Data'!$B$39=\"\",\"\",'Design Data'!$B$39)","v":"Sieve Size:"},{"$f":"IF('Design Data'!$B$48=\"\",\"\",'Design Data'!$B$48)","v":""},{"$f":"IF('Design Data'!$P$39=\"\",\"\",'Design Data'!$P$39)","v":"Current JMF Design % Retained Tolerances "}]
[97,{"$f":"IF('Design Data'!$R$48=\"\",\"\",'Design Data'!$R$48)","v":""},{"$f":"IF('Design Data'!$B$35=\"\",\"\",'Design Data'!$B$35)","v":"COMBINED AGGREGATE GRADATION:Tex-229-F"},{"$f":"IF('Design Data'!$B$39=\"\",\"\",'Design Data'!$B$39)","v":"Sieve Size:"},{"$f":"IF('Design Data'!$B$48=\"\",\"\",'Design Data'!$B$48)","v":""},{"$f":"IF('Design Data'!$R$39=\"\",\"\",'Design Data'!$R$39)","v":"Current JMF Cumulative Percent Retained"}]
[98,{"$f":"IF('Design Data'!$U$48=\"\",\"\",'Design Data'!$U$48)","v":""},{"$f":"IF('Design Data'!$B$35=\"\",\"\",'Design Data'!$B$35)","v":"COMBINED AGGREGATE GRADATION:Tex-229-F"},{"$f":"IF('Design Data'!$B$39=\"\",\"\",'Design Data'!$B$39)","v":"Sieve Size:"},{"$f":"IF('Design Data'!$B$48=\"\",\"\",'Design Data'!$B$48)","v":""},{"$f":"IF('Design Data'!$U$39=\"\",\"\",'Design Data'!$U$39)","v":"In Tolerance"}]
[99,{"$f":"IF('Design Data'!$V$48=\"\",\"\",'Design Data'!$V$48)","v":""},{"$f":"IF('Design Data'!$B$35=\"\",\"\",'Design Data'!$B$35)","v":"COMBINED AGGREGATE GRADATION:Tex-229-F"},{"$f":"IF('Design Data'!$B$39=\"\",\"\",'Design Data'!$B$39)","v":"Sieve Size:"},{"$f":"IF('Design Data'!$B$48=\"\",\"\",'Design Data'!$B$48)","v":""},{"$f":"IF('Design Data'!$V$39=\"\",\"\",'Design Data'!$V$39)","v":"Restricted Zone"}]
[100,{"$f":"IF('Design Data'!$Z$48=\"\",\"\",'Design Data'!$Z$48)","v":""},{"$f":"IF('Design Data'!$B$35=\"\",\"\",'Design Data'!$B$35)","v":"COMBINED AGGREGATE GRADATION:Tex-229-F"},{"$f":"IF('Design Data'!$B$39=\"\",\"\",'Design Data'!$B$39)","v":"Sieve Size:"},{"$f":"IF('Design Data'!$B$48=\"\",\"\",'Design Data'!$B$48)","v":""},{"$f":"IF('Design Data'!$Z$39=\"\",\"\",'Design Data'!$Z$39)","v":"TxDOT Ignition Oven Correction Factor,%:"}]
[101,{"$f":"IF('Design Data'!$G$49=\"\",\"\",'Design Data'!$G$49)","v":""},{"$f":"IF('Design Data'!$B$35=\"\",\"\",'Design Data'!$B$35)","v":"COMBINED AGGREGATE GRADATION:Tex-229-F"},{"$f":"IF('Design Data'!$B$39=\"\",\"\",'Design Data'!$B$39)","v":"Sieve Size:"},{"$f":"IF('Design Data'!$B$49=\"\",\"\",'Design Data'!$B$49)","v":""},{"$f":"IF('Design Data'!$G$39=\"\",\"\",'Design Data'!$G$39)","v":"Master Specification % Retained Tolerances"}]
[102,{"$f":"IF('Design Data'!$I$49=\"\",\"\",'Design Data'!$I$49)","v":""},{"$f":"IF('Design Data'!$B$35=\"\",\"\",'Design Data'!$B$35)","v":"COMBINED AGGREGATE GRADATION:Tex-229-F"},{"$f":"IF('Design Data'!$B$39=\"\",\"\",'Design Data'!$B$39)","v":"Sieve Size:"},{"$f":"IF('Design Data'!$B$49=\"\",\"\",'Design Data'!$B$49)","v":""},{"$f":"IF('Design Data'!$I$39=\"\",\"\",'Design Data'!$I$39)","v":"Master Specification % Retained Restricted"}]
[103,{"$f":"IF('Design Data'!$K$49=\"\",\"\",'Design Data'!$K$49)","v":""},{"$f":"IF('Design Data'!$B$35=\"\",\"\",'Design Data'!$B$35)","v":"COMBINED AGGREGATE GRADATION:Tex-229-F"},{"$f":"IF('Design Data'!$B$39=\"\",\"\",'Design Data'!$B$39)","v":"Sieve Size:"},{"$f":"IF('Design Data'!$B$49=\"\",\"\",'Design Data'!$B$49)","v":""},{"$f":"IF('Design Data'!$K$39=\"\",\"\",'Design Data'!$K$39)","v":"Design JMF Cumulative Percent Retained"}]
[104,{"$f":"IF('Design Data'!$N$49=\"\",\"\",'Design Data'!$N$49)","v":""},{"$f":"IF('Design Data'!$B$35=\"\",\"\",'Design Data'!$B$35)","v":"COMBINED AGGREGATE GRADATION:Tex-229-F"},{"$f":"IF('Design Data'!$B$39=\"\",\"\",'Design Data'!$B$39)","v":"Sieve Size:"},{"$f":"IF('Design Data'!$B$49=\"\",\"\",'Design Data'!$B$49)","v":""},{"$f":"IF('Design Data'!$N$39=\"\",\"\",'Design Data'!$N$39)","v":"In Tolerance"}]
[105,{"$f":"IF('Design Data'!$O$49=\"\",\"\",'Design Data'!$O$49)","v":""},{"$f":"IF('Design Data'!$B$35=\"\",\"\",'Design Data'!$B$35)","v":"COMBINED AGGREGATE GRADATION:Tex-229-F"},{"$f":"IF('Design Data'!$B$39=\"\",\"\",'Design Data'!$B$39)","v":"Sieve Size:"},{"$f":"IF('Design Data'!$B$49=\"\",\"\",'Design Data'!$B$49)","v":""},{"$f":"IF('Design Data'!$O$39=\"\",\"\",'Design Data'!$O$39)","v":"Restricted Zone"}]
[106,{"$f":"IF('Design Data'!$P$49=\"\",\"\",'Design Data'!$P$49)","v":""},{"$f":"IF('Design Data'!$B$35=\"\",\"\",'Design Data'!$B$35)","v":"COMBINED AGGREGATE GRADATION:Tex-229-F"},{"$f":"IF('Design Data'!$B$39=\"\",\"\",'Design Data'!$B$39)","v":"Sieve Size:"},{"$f":"IF('Design Data'!$B$49=\"\",\"\",'Design Data'!$B$49)","v":""},{"$f":"IF('Design Data'!$P$39=\"\",\"\",'Design Data'!$P$39)","v":"Current JMF Design % Retained Tolerances "}]
[107,{"$f":"IF('Design Data'!$R$49=\"\",\"\",'Design Data'!$R$49)","v":""},{"$f":"IF('Design Data'!$B$35=\"\",\"\",'Design Data'!$B$35)","v":"COMBINED AGGREGATE GRADATION:Tex-229-F"},{"$f":"IF('Design Data'!$B$39=\"\",\"\",'Design Data'!$B$39)","v":"Sieve Size:"},{"$f":"IF('Design Data'!$B$49=\"\",\"\",'Design Data'!$B$49)","v":""},{"$f":"IF('Design Data'!$R$39=\"\",\"\",'Design Data'!$R$39)","v":"Current JMF Cumulative Percent Retained"}]
[108,{"$f":"IF('Design Data'!$U$49=\"\",\"\",'Design Data'!$U$49)","v":""},{"$f":"IF('Design Data'!$B$35=\"\",\"\",'Design Data'!$B$35)","v":"COMBINED AGGREGATE GRADATION:Tex-229-F"},{"$f":"IF('Design Data'!$B$39=\"\",\"\",'Design Data'!$B$39)","v":"Sieve Size:"},{"$f":"IF('Design Data'!$B$49=\"\",\"\",'Design Data'!$B$49)","v":""},{"$f":"IF('Design Data'!$U$39=\"\",\"\",'Design Data'!$U$39)","v":"In Tolerance"}]
[109,{"$f":"IF('Design Data'!$V$49=\"\",\"\",'Design Data'!$V$49)","v":""},{"$f":"IF('Design Data'!$B$35=\"\",\"\",'Design Data'!$B$35)","v":"COMBINED AGGREGATE GRADATION:Tex-229-F"},{"$f":"IF('Design Data'!$B$39=\"\",\"\",'Design Data'!$B$39)","v":"Sieve Size:"},{"$f":"IF('Design Data'!$B$49=\"\",\"\",'Design Data'!$B$49)","v":""},{"$f":"IF('Design Data'!$V$39=\"\",\"\",'Design Data'!$V$39)","v":"Restricted Zone"}]
[110,{"$f":"IF('Design Data'!$Z$49=\"\",\"\",'Design Data'!$Z$49)","v":""},{"$f":"IF('Design Data'!$B$35=\"\",\"\",'Design Data'!$B$35)","v":"COMBINED AGGREGATE GRADATION:Tex-229-F"},{"$f":"IF('Design Data'!$B$39=\"\",\"\",'Design Data'!$B$39)","v":"Sieve Size:"},{"$f":"IF('Design Data'!$B$49=\"\",\"\",'Design Data'!$B$49)","v":""},{"$f":"IF('Design Data'!$Z$39=\"\",\"\",'Design Data'!$Z$39)","v":"TxDOT Ignition Oven Correction Factor,%:"}]
[111,{"$f":"IF('Design Data'!$G$50=\"\",\"\",'Design Data'!$G$50)","v":""},{"$f":"IF('Design Data'!$B$35=\"\",\"\",'Design Data'!$B$35)","v":"COMBINED AGGREGATE GRADATION:Tex-229-F"},{"$f":"IF('Design Data'!$B$39=\"\",\"\",'Design Data'!$B$39)","v":"Sieve Size:"},{"$f":"IF('Design Data'!$B$50=\"\",\"\",'Design Data'!$B$50)","v":""},{"$f":"IF('Design Data'!$G$39=\"\",\"\",'Design Data'!$G$39)","v":"Master Specification % Retained Tolerances"}]
[112,{"$f":"IF('Design Data'!$I$50=\"\",\"\",'Design Data'!$I$50)","v":""},{"$f":"IF('Design Data'!$B$35=\"\",\"\",'Design Data'!$B$35)","v":"COMBINED AGGREGATE GRADATION:Tex-229-F"},{"$f":"IF('Design Data'!$B$39=\"\",\"\",'Design Data'!$B$39)","v":"Sieve Size:"},{"$f":"IF('Design Data'!$B$50=\"\",\"\",'Design Data'!$B$50)","v":""},{"$f":"IF('Design Data'!$I$39=\"\",\"\",'Design Data'!$I$39)","v":"Master Specification % Retained Restricted"}]
[113,{"$f":"IF('Design Data'!$K$50=\"\",\"\",'Design Data'!$K$50)","v":""},{"$f":"IF('Design Data'!$B$35=\"\",\"\",'Design Data'!$B$35)","v":"COMBINED AGGREGATE GRADATION:Tex-229-F"},{"$f":"IF('Design Data'!$B$39=\"\",\"\",'Design Data'!$B$39)","v":"Sieve Size:"},{"$f":"IF('Design Data'!$B$50=\"\",\"\",'Design Data'!$B$50)","v":""},{"$f":"IF('Design Data'!$K$39=\"\",\"\",'Design Data'!$K$39)","v":"Design JMF Cumulative Percent Retained"}]
[114,{"$f":"IF('Design Data'!$N$50=\"\",\"\",'Design Data'!$N$50)","v":""},{"$f":"IF('Design Data'!$B$35=\"\",\"\",'Design Data'!$B$35)","v":"COMBINED AGGREGATE GRADATION:Tex-229-F"},{"$f":"IF('Design Data'!$B$39=\"\",\"\",'Design Data'!$B$39)","v":"Sieve Size:"},{"$f":"IF('Design Data'!$B$50=\"\",\"\",'Design Data'!$B$50)","v":""},{"$f":"IF('Design Data'!$N$39=\"\",\"\",'Design Data'!$N$39)","v":"In Tolerance"}]
[115,{"$f":"IF('Design Data'!$O$50=\"\",\"\",'Design Data'!$O$50)","v":""},{"$f":"IF('Design Data'!$B$35=\"\",\"\",'Design Data'!$B$35)","v":"COMBINED AGGREGATE GRADATION:Tex-229-F"},{"$f":"IF('Design Data'!$B$39=\"\",\"\",'Design Data'!$B$39)","v":"Sieve Size:"},{"$f":"IF('Design Data'!$B$50=\"\",\"\",'Design Data'!$B$50)","v":""},{"$f":"IF('Design Data'!$O$39=\"\",\"\",'Design Data'!$O$39)","v":"Restricted Zone"}]
[116,{"$f":"IF('Design Data'!$P$50=\"\",\"\",'Design Data'!$P$50)","v":""},{"$f":"IF('Design Data'!$B$35=\"\",\"\",'Design Data'!$B$35)","v":"COMBINED AGGREGATE GRADATION:Tex-229-F"},{"$f":"IF('Design Data'!$B$39=\"\",\"\",'Design Data'!$B$39)","v":"Sieve Size:"},{"$f":"IF('Design Data'!$B$50=\"\",\"\",'Design Data'!$B$50)","v":""},{"$f":"IF('Design Data'!$P$39=\"\",\"\",'Design Data'!$P$39)","v":"Current JMF Design % Retained Tolerances "}]
[117,{"$f":"IF('Design Data'!$R$50=\"\",\"\",'Design Data'!$R$50)","v":""},{"$f":"IF('Design Data'!$B$35=\"\",\"\",'Design Data'!$B$35)","v":"COMBINED AGGREGATE GRADATION:Tex-229-F"},{"$f":"IF('Design Data'!$B$39=\"\",\"\",'Design Data'!$B$39)","v":"Sieve Size:"},{"$f":"IF('Design Data'!$B$50=\"\",\"\",'Design Data'!$B$50)","v":""},{"$f":"IF('Design Data'!$R$39=\"\",\"\",'Design Data'!$R$39)","v":"Current JMF Cumulative Percent Retained"}]
[118,{"$f":"IF('Design Data'!$U$50=\"\",\"\",'Design Data'!$U$50)","v":""},{"$f":"IF('Design Data'!$B$35=\"\",\"\",'Design Data'!$B$35)","v":"COMBINED AGGREGATE GRADATION:Tex-229-F"},{"$f":"IF('Design Data'!$B$39=\"\",\"\",'Design Data'!$B$39)","v":"Sieve Size:"},{"$f":"IF('Design Data'!$B$50=\"\",\"\",'Design Data'!$B$50)","v":""},{"$f":"IF('Design Data'!$U$39=\"\",\"\",'Design Data'!$U$39)","v":"In Tolerance"}]
[119,{"$f":"IF('Design Data'!$V$50=\"\",\"\",'Design Data'!$V$50)","v":""},{"$f":"IF('Design Data'!$B$35=\"\",\"\",'Design Data'!$B$35)","v":"COMBINED AGGREGATE GRADATION:Tex-229-F"},{"$f":"IF('Design Data'!$B$39=\"\",\"\",'Design Data'!$B$39)","v":"Sieve Size:"},{"$f":"IF('Design Data'!$B$50=\"\",\"\",'Design Data'!$B$50)","v":""},{"$f":"IF('Design Data'!$V$39=\"\",\"\",'Design Data'!$V$39)","v":"Restricted Zone"}]
[120,{"$f":"IF('Design Data'!$Z$50=\"\",\"\",'Design Data'!$Z$50)","v":""},{"$f":"IF('Design Data'!$B$35=\"\",\"\",'Design Data'!$B$35)","v":"COMBINED AGGREGATE GRADATION:Tex-229-F"},{"$f":"IF('Design Data'!$B$39=\"\",\"\",'Design Data'!$B$39)","v":"Sieve Size:"},{"$f":"IF('Design Data'!$B$50=\"\",\"\",'Design Data'!$B$50)","v":""},{"$f":"IF('Design Data'!$Z$39=\"\",\"\",'Design Data'!$Z$39)","v":"TxDOT Ignition Oven Correction Factor,%:"}]
[121,{"$f":"IF('Design Data'!$G$51=\"\",\"\",'Design Data'!$G$51)","v":""},{"$f":"IF('Design Data'!$B$35=\"\",\"\",'Design Data'!$B$35)","v":"COMBINED AGGREGATE GRADATION:Tex-229-F"},{"$f":"IF('Design Data'!$B$39=\"\",\"\",'Design Data'!$B$39)","v":"Sieve Size:"},{"$f":"IF('Design Data'!$B$51=\"\",\"\",'Design Data'!$B$51)","v":""},{"$f":"IF('Design Data'!$G$39=\"\",\"\",'Design Data'!$G$39)","v":"Master Specification % Retained Tolerances"}]
[122,{"$f":"IF('Design Data'!$I$51=\"\",\"\",'Design Data'!$I$51)","v":""},{"$f":"IF('Design Data'!$B$35=\"\",\"\",'Design Data'!$B$35)","v":"COMBINED AGGREGATE GRADATION:Tex-229-F"},{"$f":"IF('Design Data'!$B$39=\"\",\"\",'Design Data'!$B$39)","v":"Sieve Size:"},{"$f":"IF('Design Data'!$B$51=\"\",\"\",'Design Data'!$B$51)","v":""},{"$f":"IF('Design Data'!$I$39=\"\",\"\",'Design Data'!$I$39)","v":"Master Specification % Retained Restricted"}]
[123,{"$f":"IF('Design Data'!$K$51=\"\",\"\",'Design Data'!$K$51)","v":""},{"$f":"IF('Design Data'!$B$35=\"\",\"\",'Design Data'!$B$35)","v":"COMBINED AGGREGATE GRADATION:Tex-229-F"},{"$f":"IF('Design Data'!$B$39=\"\",\"\",'Design Data'!$B$39)","v":"Sieve Size:"},{"$f":"IF('Design Data'!$B$51=\"\",\"\",'Design Data'!$B$51)","v":""},{"$f":"IF('Design Data'!$K$39=\"\",\"\",'Design Data'!$K$39)","v":"Design JMF Cumulative Percent Retained"}]
[124,{"$f":"IF('Design Data'!$N$51=\"\",\"\",'Design Data'!$N$51)","v":""},{"$f":"IF('Design Data'!$B$35=\"\",\"\",'Design Data'!$B$35)","v":"COMBINED AGGREGATE GRADATION:Tex-229-F"},{"$f":"IF('Design Data'!$B$39=\"\",\"\",'Design Data'!$B$39)","v":"Sieve Size:"},{"$f":"IF('Design Data'!$B$51=\"\",\"\",'Design Data'!$B$51)","v":""},{"$f":"IF('Design Data'!$N$39=\"\",\"\",'Design Data'!$N$39)","v":"In Tolerance"}]
[125,{"$f":"IF('Design Data'!$O$51=\"\",\"\",'Design Data'!$O$51)","v":""},{"$f":"IF('Design Data'!$B$35=\"\",\"\",'Design Data'!$B$35)","v":"COMBINED AGGREGATE GRADATION:Tex-229-F"},{"$f":"IF('Design Data'!$B$39=\"\",\"\",'Design Data'!$B$39)","v":"Sieve Size:"},{"$f":"IF('Design Data'!$B$51=\"\",\"\",'Design Data'!$B$51)","v":""},{"$f":"IF('Design Data'!$O$39=\"\",\"\",'Design Data'!$O$39)","v":"Restricted Zone"}]
[126,{"$f":"IF('Design Data'!$P$51=\"\",\"\",'Design Data'!$P$51)","v":""},{"$f":"IF('Design Data'!$B$35=\"\",\"\",'Design Data'!$B$35)","v":"COMBINED AGGREGATE GRADATION:Tex-229-F"},{"$f":"IF('Design Data'!$B$39=\"\",\"\",'Design Data'!$B$39)","v":"Sieve Size:"},{"$f":"IF('Design Data'!$B$51=\"\",\"\",'Design Data'!$B$51)","v":""},{"$f":"IF('Design Data'!$P$39=\"\",\"\",'Design Data'!$P$39)","v":"Current JMF Design % Retained Tolerances "}]
[127,{"$f":"IF('Design Data'!$R$51=\"\",\"\",'Design Data'!$R$51)","v":""},{"$f":"IF('Design Data'!$B$35=\"\",\"\",'Design Data'!$B$35)","v":"COMBINED AGGREGATE GRADATION:Tex-229-F"},{"$f":"IF('Design Data'!$B$39=\"\",\"\",'Design Data'!$B$39)","v":"Sieve Size:"},{"$f":"IF('Design Data'!$B$51=\"\",\"\",'Design Data'!$B$51)","v":""},{"$f":"IF('Design Data'!$R$39=\"\",\"\",'Design Data'!$R$39)","v":"Current JMF Cumulative Percent Retained"}]
[128,{"$f":"IF('Design Data'!$U$51=\"\",\"\",'Design Data'!$U$51)","v":""},{"$f":"IF('Design Data'!$B$35=\"\",\"\",'Design Data'!$B$35)","v":"COMBINED AGGREGATE GRADATION:Tex-229-F"},{"$f":"IF('Design Data'!$B$39=\"\",\"\",'Design Data'!$B$39)","v":"Sieve Size:"},{"$f":"IF('Design Data'!$B$51=\"\",\"\",'Design Data'!$B$51)","v":""},{"$f":"IF('Design Data'!$U$39=\"\",\"\",'Design Data'!$U$39)","v":"In Tolerance"}]
[129,{"$f":"IF('Design Data'!$V$51=\"\",\"\",'Design Data'!$V$51)","v":""},{"$f":"IF('Design Data'!$B$35=\"\",\"\",'Design Data'!$B$35)","v":"COMBINED AGGREGATE GRADATION:Tex-229-F"},{"$f":"IF('Design Data'!$B$39=\"\",\"\",'Design Data'!$B$39)","v":"Sieve Size:"},{"$f":"IF('Design Data'!$B$51=\"\",\"\",'Design Data'!$B$51)","v":""},{"$f":"IF('Design Data'!$V$39=\"\",\"\",'Design Data'!$V$39)","v":"Restricted Zone"}]
[130,{"$f":"IF('Design Data'!$Z$51=\"\",\"\",'Design Data'!$Z$51)","v":""},{"$f":"IF('Design Data'!$B$35=\"\",\"\",'Design Data'!$B$35)","v":"COMBINED AGGREGATE GRADATION:Tex-229-F"},{"$f":"IF('Design Data'!$B$39=\"\",\"\",'Design Data'!$B$39)","v":"Sieve Size:"},{"$f":"IF('Design Data'!$B$51=\"\",\"\",'Design Data'!$B$51)","v":""},{"$f":"IF('Design Data'!$Z$39=\"\",\"\",'Design Data'!$Z$39)","v":"TxDOT Ignition Oven Correction Factor,%:"}]
[131,{"$f":"IF('Design Data'!$G$52=\"\",\"\",'Design Data'!$G$52)","v":""},{"$f":"IF('Design Data'!$B$35=\"\",\"\",'Design Data'!$B$35)","v":"COMBINED AGGREGATE GRADATION:Tex-229-F"},{"$f":"IF('Design Data'!$B$39=\"\",\"\",'Design Data'!$B$39)","v":"Sieve Size:"},{"$f":"IF('Design Data'!$B$52=\"\",\"\",'Design Data'!$B$52)","v":""},{"$f":"IF('Design Data'!$G$39=\"\",\"\",'Design Data'!$G$39)","v":"Master Specification % Retained Tolerances"}]
[132,{"$f":"IF('Design Data'!$I$52=\"\",\"\",'Design Data'!$I$52)","v":""},{"$f":"IF('Design Data'!$B$35=\"\",\"\",'Design Data'!$B$35)","v":"COMBINED AGGREGATE GRADATION:Tex-229-F"},{"$f":"IF('Design Data'!$B$39=\"\",\"\",'Design Data'!$B$39)","v":"Sieve Size:"},{"$f":"IF('Design Data'!$B$52=\"\",\"\",'Design Data'!$B$52)","v":""},{"$f":"IF('Design Data'!$I$39=\"\",\"\",'Design Data'!$I$39)","v":"Master Specification % Retained Restricted"}]
[133,{"$f":"IF('Design Data'!$K$52=\"\",\"\",'Design Data'!$K$52)","v":""},{"$f":"IF('Design Data'!$B$35=\"\",\"\",'Design Data'!$B$35)","v":"COMBINED AGGREGATE GRADATION:Tex-229-F"},{"$f":"IF('Design Data'!$B$39=\"\",\"\",'Design Data'!$B$39)","v":"Sieve Size:"},{"$f":"IF('Design Data'!$B$52=\"\",\"\",'Design Data'!$B$52)","v":""},{"$f":"IF('Design Data'!$K$39=\"\",\"\",'Design Data'!$K$39)","v":"Design JMF Cumulative Percent Retained"}]
[134,{"$f":"IF('Design Data'!$N$52=\"\",\"\",'Design Data'!$N$52)","v":""},{"$f":"IF('Design Data'!$B$35=\"\",\"\",'Design Data'!$B$35)","v":"COMBINED AGGREGATE GRADATION:Tex-229-F"},{"$f":"IF('Design Data'!$B$39=\"\",\"\",'Design Data'!$B$39)","v":"Sieve Size:"},{"$f":"IF('Design Data'!$B$52=\"\",\"\",'Design Data'!$B$52)","v":""},{"$f":"IF('Design Data'!$N$39=\"\",\"\",'Design Data'!$N$39)","v":"In Tolerance"}]
[135,{"$f":"IF('Design Data'!$O$52=\"\",\"\",'Design Data'!$O$52)","v":""},{"$f":"IF('Design Data'!$B$35=\"\",\"\",'Design Data'!$B$35)","v":"COMBINED AGGREGATE GRADATION:Tex-229-F"},{"$f":"IF('Design Data'!$B$39=\"\",\"\",'Design Data'!$B$39)","v":"Sieve Size:"},{"$f":"IF('Design Data'!$B$52=\"\",\"\",'Design Data'!$B$52)","v":""},{"$f":"IF('Design Data'!$O$39=\"\",\"\",'Design Data'!$O$39)","v":"Restricted Zone"}]
[136,{"$f":"IF('Design Data'!$P$52=\"\",\"\",'Design Data'!$P$52)","v":""},{"$f":"IF('Design Data'!$B$35=\"\",\"\",'Design Data'!$B$35)","v":"COMBINED AGGREGATE GRADATION:Tex-229-F"},{"$f":"IF('Design Data'!$B$39=\"\",\"\",'Design Data'!$B$39)","v":"Sieve Size:"},{"$f":"IF('Design Data'!$B$52=\"\",\"\",'Design Data'!$B$52)","v":""},{"$f":"IF('Design Data'!$P$39=\"\",\"\",'Design Data'!$P$39)","v":"Current JMF Design % Retained Tolerances "}]
[137,{"$f":"IF('Design Data'!$R$52=\"\",\"\",'Design Data'!$R$52)","v":""},{"$f":"IF('Design Data'!$B$35=\"\",\"\",'Design Data'!$B$35)","v":"COMBINED AGGREGATE GRADATION:Tex-229-F"},{"$f":"IF('Design Data'!$B$39=\"\",\"\",'Design Data'!$B$39)","v":"Sieve Size:"},{"$f":"IF('Design Data'!$B$52=\"\",\"\",'Design Data'!$B$52)","v":""},{"$f":"IF('Design Data'!$R$39=\"\",\"\",'Design Data'!$R$39)","v":"Current JMF Cumulative Percent Retained"}]
[138,{"$f":"IF('Design Data'!$U$52=\"\",\"\",'Design Data'!$U$52)","v":""},{"$f":"IF('Design Data'!$B$35=\"\",\"\",'Design Data'!$B$35)","v":"COMBINED AGGREGATE GRADATION:Tex-229-F"},{"$f":"IF('Design Data'!$B$39=\"\",\"\",'Design Data'!$B$39)","v":"Sieve Size:"},{"$f":"IF('Design Data'!$B$52=\"\",\"\",'Design Data'!$B$52)","v":""},{"$f":"IF('Design Data'!$U$39=\"\",\"\",'Design Data'!$U$39)","v":"In Tolerance"}]
[139,{"$f":"IF('Design Data'!$V$52=\"\",\"\",'Design Data'!$V$52)","v":""},{"$f":"IF('Design Data'!$B$35=\"\",\"\",'Design Data'!$B$35)","v":"COMBINED AGGREGATE GRADATION:Tex-229-F"},{"$f":"IF('Design Data'!$B$39=\"\",\"\",'Design Data'!$B$39)","v":"Sieve Size:"},{"$f":"IF('Design Data'!$B$52=\"\",\"\",'Design Data'!$B$52)","v":""},{"$f":"IF('Design Data'!$V$39=\"\",\"\",'Design Data'!$V$39)","v":"Restricted Zone"}]
[140,{"$f":"IF('Design Data'!$Z$52=\"\",\"\",'Design Data'!$Z$52)","v":""},{"$f":"IF('Design Data'!$B$35=\"\",\"\",'Design Data'!$B$35)","v":"COMBINED AGGREGATE GRADATION:Tex-229-F"},{"$f":"IF('Design Data'!$B$39=\"\",\"\",'Design Data'!$B$39)","v":"Sieve Size:"},{"$f":"IF('Design Data'!$B$52=\"\",\"\",'Design Data'!$B$52)","v":""},{"$f":"IF('Design Data'!$Z$39=\"\",\"\",'Design Data'!$Z$39)","v":"TxDOT Ignition Oven Correction Factor,%:"}]
[141,{"$f":"IF('Design Data'!$I$54=\"\",\"\",'Design Data'!$I$54)","v":""},{"$f":"IF('Design Data'!$B$35=\"\",\"\",'Design Data'!$B$35)","v":"COMBINED AGGREGATE GRADATION:Tex-229-F"},{"$f":"IF('Design Data'!$F$54=\"\",\"\",'Design Data'!$F$54)","v":"% White Rock"}]
[142,{"$f":"IF('Design Data'!$N$54=\"\",\"\",'Design Data'!$N$54)","v":""},{"$f":"IF('Design Data'!$B$35=\"\",\"\",'Design Data'!$B$35)","v":"COMBINED AGGREGATE GRADATION:Tex-229-F"},{"$f":"IF('Design Data'!$K$54=\"\",\"\",'Design Data'!$K$54)","v":"% LRA"}]
[143,{"$f":"IF('Design Data'!$S$54=\"\",\"\",'Design Data'!$S$54)","v":""},{"$f":"IF('Design Data'!$B$35=\"\",\"\",'Design Data'!$B$35)","v":"COMBINED AGGREGATE GRADATION:Tex-229-F"},{"$f":"IF('Design Data'!$P$54=\"\",\"\",'Design Data'!$P$54)","v":"% Virgin Agg."}]
[144,{"$f":"IF('Design Data'!$H$58=\"\",\"\",'Design Data'!$H$58)","v":""},{"$f":"IF('Design Data'!$B$56=\"\",\"\",'Design Data'!$B$56)","v":"DETERMINING DENSITY & PROPERTIES OF BITUMINOUS MIXTURES"},{"$f":"IF('Design Data'!$B$58=\"\",\"\",'Design Data'!$B$58)","v":"Press correlation factor used?"}]
[145,{"$f":"IF('Design Data'!$H$59=\"\",\"\",'Design Data'!$H$59)","v":""},{"$f":"IF('Design Data'!$B$56=\"\",\"\",'Design Data'!$B$56)","v":"DETERMINING DENSITY & PROPERTIES OF BITUMINOUS MIXTURES"},{"$f":"IF('Design Data'!$B$59=\"\",\"\",'Design Data'!$B$59)","v":"Press correlation factor:"}]
[146,{"$f":"IF('Design Data'!$H$60=\"\",\"\",'Design Data'!$H$60)","v":""},{"$f":"IF('Design Data'!$B$56=\"\",\"\",'Design Data'!$B$56)","v":"DETERMINING DENSITY & PROPERTIES OF BITUMINOUS MIXTURES"},{"$f":"IF('Design Data'!$B$60=\"\",\"\",'Design Data'!$B$60)","v":"TxDOT press ID & serial no.:"}]
[147,{"$f":"IF('Design Data'!$H$61=\"\",\"\",'Design Data'!$H$61)","v":""},{"$f":"IF('Design Data'!$B$56=\"\",\"\",'Design Data'!$B$56)","v":"DETERMINING DENSITY & PROPERTIES OF BITUMINOUS MIXTURES"},{"$f":"IF('Design Data'!$B$61=\"\",\"\",'Design Data'!$B$61)","v":"Contractor press ID no.:"}]
[148,{"$f":"IF('Design Data'!$S$58=\"\",\"\",'Design Data'!$S$58)","v":""},{"$f":"IF('Design Data'!$B$56=\"\",\"\",'Design Data'!$B$56)","v":"DETERMINING DENSITY & PROPERTIES OF BITUMINOUS MIXTURES"},{"$f":"IF('Design Data'!$M$58=\"\",\"\",'Design Data'!$M$58)","v":"Ge (Effective) specific gravity:"}]
[149,{"$f":"IF('Design Data'!$S$59=\"\",\"\",'Design Data'!$S$59)","v":""},{"$f":"IF('Design Data'!$B$56=\"\",\"\",'Design Data'!$B$56)","v":"DETERMINING DENSITY & PROPERTIES OF BITUMINOUS MIXTURES"},{"$f":"IF('Design Data'!$M$59=\"\",\"\",'Design Data'!$M$59)","v":"G1 (specific gravity of asphalt):"}]
[150,{"$f":"IF('Design Data'!$S$60=\"\",\"\",'Design Data'!$S$60)","v":""},{"$f":"IF('Design Data'!$B$56=\"\",\"\",'Design Data'!$B$56)","v":"DETERMINING DENSITY & PROPERTIES OF BITUMINOUS MIXTURES"},{"$f":"IF('Design Data'!$M$60=\"\",\"\",'Design Data'!$M$60)","v":"Theoretical max.specific gravity:"}]
[151,{"$f":"IF('Design Data'!$S$61=\"\",\"\",'Design Data'!$S$61)","v":""},{"$f":"IF('Design Data'!$B$56=\"\",\"\",'Design Data'!$B$56)","v":"DETERMINING DENSITY & PROPERTIES OF BITUMINOUS MIXTURES"},{"$f":"IF('Design Data'!$M$61=\"\",\"\",'Design Data'!$M$61)","v":"Mix design target density:"}]
[152,{"$f":"IF('Design Data'!$Z$58=\"\",\"\",'Design Data'!$Z$58)","v":""},{"$f":"IF('Design Data'!$B$56=\"\",\"\",'Design Data'!$B$56)","v":"DETERMINING DENSITY & PROPERTIES OF BITUMINOUS MIXTURES"},{"$f":"IF('Design Data'!$V$58=\"\",\"\",'Design Data'!$V$58)","v":"% Mineral Filler (by wt. of dry aggregate)"}]
[153,{"$f":"IF('Design Data'!$Z$60=\"\",\"\",'Design Data'!$Z$60)","v":""},{"$f":"IF('Design Data'!$B$56=\"\",\"\",'Design Data'!$B$56)","v":"DETERMINING DENSITY & PROPERTIES OF BITUMINOUS MIXTURES"},{"$f":"IF('Design Data'!$V$60=\"\",\"\",'Design Data'!$V$60)","v":"Wet Track Abrasion Wear Value (g/sq. ft.)"}]
[154,{"$f":"IF('Design Data'!$N$65=\"\",\"\",'Design Data'!$N$65)","v":""},{"$f":"IF('Design Data'!$B$63=\"\",\"\",'Design Data'!$B$63)","v":"DETERMINING STATIC CREEP:Tex-231-F"},{"$f":"IF('Design Data'!$H$65=\"\",\"\",'Design Data'!$H$65)","v":"Permanent strain, in/in:"}]
[155,{"$f":"IF('Design Data'!$N$66=\"\",\"\",'Design Data'!$N$66)","v":""},{"$f":"IF('Design Data'!$B$63=\"\",\"\",'Design Data'!$B$63)","v":"DETERMINING STATIC CREEP:Tex-231-F"},{"$f":"IF('Design Data'!$H$66=\"\",\"\",'Design Data'!$H$66)","v":"Stiffness, psi:"}]
[156,{"$f":"IF('Design Data'!$N$67=\"\",\"\",'Design Data'!$N$67)","v":""},{"$f":"IF('Design Data'!$B$63=\"\",\"\",'Design Data'!$B$63)","v":"DETERMINING STATIC CREEP:Tex-231-F"},{"$f":"IF('Design Data'!$H$67=\"\",\"\",'Design Data'!$H$67)","v":"Creep slope, in/in/sec:"}]
[157,{"$f":"IF('Design Data'!$M$70=\"\",\"\",'Design Data'!$M$70)","v":""},{"$f":"IF('Design Data'!$B$68=\"\",\"\",'Design Data'!$B$68)","v":"DETERMINING HVEEM STABILITY OF BITUMINOUS MIXTURES: Tex-208-F"},{"$f":"IF('Design Data'!$E$70=\"\",\"\",'Design Data'!$E$70)","v":"Design's HVEEM Stability, %:"}]
[158,{"$f":"IF('Design Data'!$F$74=\"\",\"\",'Design Data'!$F$74)","v":""},{"$f":"IF('Design Data'!$B$71=\"\",\"\",'Design Data'!$B$71)","v":"HAMBURG: Tex-242-F"},{"$f":"IF('Design Data'!$F$73=\"\",\"\",'Design Data'!$F$73)","v":"No. of  Passes"}]
[159,{"$f":"IF('Design Data'!$J$74=\"\",\"\",'Design Data'!$J$74)","v":""},{"$f":"IF('Design Data'!$B$71=\"\",\"\",'Design Data'!$B$71)","v":"HAMBURG: Tex-242-F"},{"$f":"IF('Design Data'!$J$73=\"\",\"\",'Design Data'!$J$73)","v":"RUT Depth"}]
[160,{"$f":"IF('Design Data'!$O$74=\"\",\"\",'Design Data'!$O$74)","v":""},{"$f":"IF('Design Data'!$B$71=\"\",\"\",'Design Data'!$B$71)","v":"HAMBURG: Tex-242-F"},{"$f":"IF('Design Data'!$O$73=\"\",\"\",'Design Data'!$O$73)","v":"IDT: Tex-226"}]
[161,{"$f":"IF(Test_Data!$L$20=\"\",\"\",Test_Data!$L$20)","v":""},{"$f":"IF(Test_Data!$B$18=\"\",\"\",Test_Data!$B$18)","v":"DETERMINATION OF ASPHALT CONTENT Ignition Oven Method: Tex-236-F"},{"$f":"IF(Test_Data!$B$20=\"\",\"\",Test_Data!$B$20)","v":"Asphalt Content from Ignition Method, (%):"}]
[162,{"$f":"IF(Test_Data!$M$20=\"\",\"\",Test_Data!$M$20)","v":""},{"$f":"IF(Test_Data!$B$18=\"\",\"\",Test_Data!$B$18)","v":"DETERMINATION OF ASPHALT CONTENT Ignition Oven Method: Tex-236-F"},{"$f":"IF(Test_Data!$B$20=\"\",\"\",Test_Data!$B$20)","v":"Asphalt Content from Ignition Method, (%):"}]
[163,{"$f":"IF(Test_Data!$L$21=\"\",\"\",Test_Data!$L$21)","v":""},{"$f":"IF(Test_Data!$B$18=\"\",\"\",Test_Data!$B$18)","v":"DETERMINATION OF ASPHALT CONTENT Ignition Oven Method: Tex-236-F"},{"$f":"IF(Test_Data!$G$21=\"\",\"\",Test_Data!$G$21)","v":"Hydro-Volatile Content, %:"}]
[164,{"$f":"IF(Test_Data!$L$22=\"\",\"\",Test_Data!$L$22)","v":""},{"$f":"IF(Test_Data!$B$18=\"\",\"\",Test_Data!$B$18)","v":"DETERMINATION OF ASPHALT CONTENT Ignition Oven Method: Tex-236-F"},{"$f":"IF(Test_Data!$G$22=\"\",\"\",Test_Data!$G$22)","v":"Moisture Content, %:"}]
[165,{"$f":"IF(Test_Data!$L$23=\"\",\"\",Test_Data!$L$23)","v":0},{"$f":"IF(Test_Data!$B$18=\"\",\"\",Test_Data!$B$18)","v":"DETERMINATION OF ASPHALT CONTENT Ignition Oven Method: Tex-236-F"},{"$f":"IF(Test_Data!$I$23=\"\",\"\",Test_Data!$I$23)","v":"Total AC, %:"}]
[166,{"$f":"IF(Test_Data!$E$21=\"\",\"\",Test_Data!$E$21)","v":""},{"$f":"IF(Test_Data!$B$18=\"\",\"\",Test_Data!$B$18)","v":"DETERMINATION OF ASPHALT CONTENT Ignition Oven Method: Tex-236-F"},{"$f":"IF(Test_Data!$B$21=\"\",\"\",Test_Data!$B$21)","v":"Gauge No."}]
[167,{"$f":"IF(Test_Data!$E$22=\"\",\"\",Test_Data!$E$22)","v":""},{"$f":"IF(Test_Data!$B$18=\"\",\"\",Test_Data!$B$18)","v":"DETERMINATION OF ASPHALT CONTENT Ignition Oven Method: Tex-236-F"},{"$f":"IF(Test_Data!$B$22=\"\",\"\",Test_Data!$B$22)","v":"Time:"}]
[168,{"$f":"IF(Test_Data!$G$23=\"\",\"\",Test_Data!$G$23)","v":""},{"$f":"IF(Test_Data!$B$18=\"\",\"\",Test_Data!$B$18)","v":"DETERMINATION OF ASPHALT CONTENT Ignition Oven Method: Tex-236-F"},{"$f":"IF(Test_Data!$B$23=\"\",\"\",Test_Data!$B$23)","v":"Calibration Ref. Number:"}]
[169,{"$f":"IF(Test_Data!$Y$19=\"\",\"\",Test_Data!$Y$19)","v":""},{"$f":"IF(Test_Data!$O$18=\"\",\"\",Test_Data!$O$18)","v":"DETERMINATION OF RICE SPECIFIC GRAVITY-Tex-227-F"},{"$f":"IF(Test_Data!$O$19=\"\",\"\",Test_Data!$O$19)","v":" (A) Weight of  Dry Sample in Air:"},{"$f":"IF(Test_Data!$Y$18=\"\",\"\",Test_Data!$Y$18)","v":"Laboratory"}]
[170,{"$f":"IF(Test_Data!$AA$19=\"\",\"\",Test_Data!$AA$19)","v":""},{"$f":"IF(Test_Data!$O$18=\"\",\"\",Test_Data!$O$18)","v":"DETERMINATION OF RICE SPECIFIC GRAVITY-Tex-227-F"},{"$f":"IF(Test_Data!$O$19=\"\",\"\",Test_Data!$O$19)","v":" (A) Weight of  Dry Sample in Air:"},{"$f":"IF(Test_Data!$AA$18=\"\",\"\",Test_Data!$AA$18)","v":"Roadway"}]
[171,{"$f":"IF(Test_Data!$Y$20=\"\",\"\",Test_Data!$Y$20)","v":""},{"$f":"IF(Test_Data!$O$18=\"\",\"\",Test_Data!$O$18)","v":"DETERMINATION OF RICE SPECIFIC GRAVITY-Tex-227-F"},{"$f":"IF(Test_Data!$O$20=\"\",\"\",Test_Data!$O$20)","v":" (D) Weight of Calibrated Pyc. w/H2O:"},{"$f":"IF(Test_Data!$Y$18=\"\",\"\",Test_Data!$Y$18)","v":"Laboratory"}]
[172,{"$f":"IF(Test_Data!$AA$20=\"\",\"\",Test_Data!$AA$20)","v":""},{"$f":"IF(Test_Data!$O$18=\"\",\"\",Test_Data!$O$18)","v":"DETERMINATION OF RICE SPECIFIC GRAVITY-Tex-227-F"},{"$f":"IF(Test_Data!$O$20=\"\",\"\",Test_Data!$O$20)","v":" (D) Weight of Calibrated Pyc. w/H2O:"},{"$f":"IF(Test_Data!$AA$18=\"\",\"\",Test_Data!$AA$18)","v":"Roadway"}]
[173,{"$f":"IF(Test_Data!$Y$21=\"\",\"\",Test_Data!$Y$21)","v":""},{"$f":"IF(Test_Data!$O$18=\"\",\"\",Test_Data!$O$18)","v":"DETERMINATION OF RICE SPECIFIC GRAVITY-Tex-227-F"},{"$f":"IF(Test_Data!$O$21=\"\",\"\",Test_Data!$O$21)","v":"(E) Weight of Sample, Pyc. and H2O:"},{"$f":"IF(Test_Data!$Y$18=\"\",\"\",Test_Data!$Y$18)","v":"Laboratory"}]
[174,{"$f":"IF(Test_Data!$AA$21=\"\",\"\",Test_Data!$AA$21)","v":""},{"$f":"IF(Test_Data!$O$18=\"\",\"\",Test_Data!$O$18)","v":"DETERMINATION OF RICE SPECIFIC GRAVITY-Tex-227-F"},{"$f":"IF(Test_Data!$O$21=\"\",\"\",Test_Data!$O$21)","v":"(E) Weight of Sample, Pyc. and H2O:"},{"$f":"IF(Test_Data!$AA$18=\"\",\"\",Test_Data!$AA$18)","v":"Roadway"}]
[175,{"$f":"IF(Test_Data!$Y$22=\"\",\"\",Test_Data!$Y$22)","v":""},{"$f":"IF(Test_Data!$O$18=\"\",\"\",Test_Data!$O$18)","v":"DETERMINATION OF RICE SPECIFIC GRAVITY-Tex-227-F"},{"$f":"IF(Test_Data!$O$22=\"\",\"\",Test_Data!$O$22)","v":"A/(D+A-E) Rice Specific Gravity (Gr):"},{"$f":"IF(Test_Data!$Y$18=\"\",\"\",Test_Data!$Y$18)","v":"Laboratory"}]
[176,{"$f":"IF(Test_Data!$AA$22=\"\",\"\",Test_Data!$AA$22)","v":""},{"$f":"IF(Test_Data!$O$18=\"\",\"\",Test_Data!$O$18)","v":"DETERMINATION OF RICE SPECIFIC GRAVITY-Tex-227-F"},{"$f":"IF(Test_Data!$O$22=\"\",\"\",Test_Data!$O$22)","v":"A/(D+A-E) Rice Specific Gravity (Gr):"},{"$f":"IF(Test_Data!$AA$18=\"\",\"\",Test_Data!$AA$18)","v":"Roadway"}]
[177,{"$f":"IF(Test_Data!$Y$23=\"\",\"\",Test_Data!$Y$23)","v":""},{"$f":"IF(Test_Data!$O$18=\"\",\"\",Test_Data!$O$18)","v":"DETERMINATION OF RICE SPECIFIC GRAVITY-Tex-227-F"},{"$f":"IF(Test_Data!$O$23=\"\",\"\",Test_Data!$O$23)","v":"(Asd) Weight of Surface Dry Sample in Air:"},{"$f":"IF(Test_Data!$Y$18=\"\",\"\",Test_Data!$Y$18)","v":"Laboratory"}]
[178,{"$f":"IF(Test_Data!$AA$23=\"\",\"\",Test_Data!$AA$23)","v":""},{"$f":"IF(Test_Data!$O$18=\"\",\"\",Test_Data!$O$18)","v":"DETERMINATION OF RICE SPECIFIC GRAVITY-Tex-227-F"},{"$f":"IF(Test_Data!$O$23=\"\",\"\",Test_Data!$O$23)","v":"(Asd) Weight of Surface Dry Sample in Air:"},{"$f":"IF(Test_Data!$AA$18=\"\",\"\",Test_Data!$AA$18)","v":"Roadway"}]
[179,{"$f":"IF(Test_Data!$Y$24=\"\",\"\",Test_Data!$Y$24)","v":""},{"$f":"IF(Test_Data!$O$18=\"\",\"\",Test_Data!$O$18)","v":"DETERMINATION OF RICE SPECIFIC GRAVITY-Tex-227-F"},{"$f":"IF(Test_Data!$O$24=\"\",\"\",Test_Data!$O$24)","v":"A/(D+Asd-E) Rice Specific Gravity (Grc):"},{"$f":"IF(Test_Data!$Y$18=\"\",\"\",Test_Data!$Y$18)","v":"Laboratory"}]
[180,{"$f":"IF(Test_Data!$AA$24=\"\",\"\",Test_Data!$AA$24)","v":""},{"$f":"IF(Test_Data!$O$18=\"\",\"\",Test_Data!$O$18)","v":"DETERMINATION OF RICE SPECIFIC GRAVITY-Tex-227-F"},{"$f":"IF(Test_Data!$O$24=\"\",\"\",Test_Data!$O$24)","v":"A/(D+Asd-E) Rice Specific Gravity (Grc):"},{"$f":"IF(Test_Data!$AA$18=\"\",\"\",Test_Data!$AA$18)","v":"Roadway"}]
[181,{"$f":"IF(Test_Data!$Y$25=\"\",\"\",Test_Data!$Y$25)","v":""},{"$f":"IF(Test_Data!$O$18=\"\",\"\",Test_Data!$O$18)","v":"DETERMINATION OF RICE SPECIFIC GRAVITY-Tex-227-F"},{"$f":"IF(Test_Data!$O$25=\"\",\"\",Test_Data!$O$25)","v":"(Gr-Grc/Grc) Percentage Difference:"},{"$f":"IF(Test_Data!$Y$18=\"\",\"\",Test_Data!$Y$18)","v":"Laboratory"}]
[182,{"$f":"IF(Test_Data!$AA$25=\"\",\"\",Test_Data!$AA$25)","v":""},{"$f":"IF(Test_Data!$O$18=\"\",\"\",Test_Data!$O$18)","v":"DETERMINATION OF RICE SPECIFIC GRAVITY-Tex-227-F"},{"$f":"IF(Test_Data!$O$25=\"\",\"\",Test_Data!$O$25)","v":"(Gr-Grc/Grc) Percentage Difference:"},{"$f":"IF(Test_Data!$AA$18=\"\",\"\",Test_Data!$AA$18)","v":"Roadway"}]
[183,{"$f":"IF(Test_Data!$Y$26=\"\",\"\",Test_Data!$Y$26)","v":""},{"$f":"IF(Test_Data!$O$18=\"\",\"\",Test_Data!$O$18)","v":"DETERMINATION OF RICE SPECIFIC GRAVITY-Tex-227-F"},{"$f":"IF(Test_Data!$O$26=\"\",\"\",Test_Data!$O$26)","v":"A/(D+Asd-E) Rice Specific Gravity (Grc):"},{"$f":"IF(Test_Data!$Y$18=\"\",\"\",Test_Data!$Y$18)","v":"Laboratory"}]
[184,{"$f":"IF(Test_Data!$AA$26=\"\",\"\",Test_Data!$AA$26)","v":""},{"$f":"IF(Test_Data!$O$18=\"\",\"\",Test_Data!$O$18)","v":"DETERMINATION OF RICE SPECIFIC GRAVITY-Tex-227-F"},{"$f":"IF(Test_Data!$O$26=\"\",\"\",Test_Data!$O$26)","v":"A/(D+Asd-E) Rice Specific Gravity (Grc):"},{"$f":"IF(Test_Data!$AA$18=\"\",\"\",Test_Data!$AA$18)","v":"Roadway"}]
[185,{"$f":"IF(Test_Data!$J$28=\"\",\"\",Test_Data!$J$28)","v":""},{"$f":"IF(Test_Data!$B$27=\"\",\"\",Test_Data!$B$27)","v":"EFFECT OF WATER ON BITUMINOUS -Tex-530-C"},{"$f":"IF(Test_Data!$B$28=\"\",\"\",Test_Data!$B$28)","v":"Estimated Percent of Stripping:"}]
[186,{"$f":"IF(Test_Data!$H$32=\"\",\"\",Test_Data!$H$32)","v":""},{"$f":"IF(Test_Data!$B$30=\"\",\"\",Test_Data!$B$30)","v":"GRADATION OF EXTRACTED AGGREGATE-Tex-229-F"},{"$f":"IF(Test_Data!$B$32=\"\",\"\",Test_Data!$B$32)","v":""}]
[187,{"$f":"IF(Test_Data!$P$32=\"\",\"\",Test_Data!$P$32)","v":""},{"$f":"IF(Test_Data!$B$30=\"\",\"\",Test_Data!$B$30)","v":"GRADATION OF EXTRACTED AGGREGATE-Tex-229-F"},{"$f":"IF(Test_Data!$J$32=\"\",\"\",Test_Data!$J$32)","v":"Dry Weight After Washing:"}]
[188,{"$f":"IF(Test_Data!$D$38=\"\",\"\",Test_Data!$D$38)","v":""},{"$f":"IF(Test_Data!$B$30=\"\",\"\",Test_Data!$B$30)","v":"GRADATION OF EXTRACTED AGGREGATE-Tex-229-F"},{"$f":"IF(Test_Data!$B$34=\"\",\"\",Test_Data!$B$34)","v":"Sieve Size:"},{"$f":"IF(Test_Data!$B$38=\"\",\"\",Test_Data!$B$38)","v":""},{"$f":"IF(Test_Data!$D$34=\"\",\"\",Test_Data!$D$34)","v":"Individual Weight Retained (g)"}]
[189,{"$f":"IF(Test_Data!$F$38=\"\",\"\",Test_Data!$F$38)","v":""},{"$f":"IF(Test_Data!$B$30=\"\",\"\",Test_Data!$B$30)","v":"GRADATION OF EXTRACTED AGGREGATE-Tex-229-F"},{"$f":"IF(Test_Data!$B$34=\"\",\"\",Test_Data!$B$34)","v":"Sieve Size:"},{"$f":"IF(Test_Data!$B$38=\"\",\"\",Test_Data!$B$38)","v":""},{"$f":"IF(Test_Data!$F$34=\"\",\"\",Test_Data!$F$34)","v":"Cumulative Weight Retained (g)"}]
[190,{"$f":"IF(Test_Data!$H$38=\"\",\"\",Test_Data!$H$38)","v":""},{"$f":"IF(Test_Data!$B$30=\"\",\"\",Test_Data!$B$30)","v":"GRADATION OF EXTRACTED AGGREGATE-Tex-229-F"},{"$f":"IF(Test_Data!$B$34=\"\",\"\",Test_Data!$B$34)","v":"Sieve Size:"},{"$f":"IF(Test_Data!$B$38=\"\",\"\",Test_Data!$B$38)","v":""},{"$f":"IF(Test_Data!$H$34=\"\",\"\",Test_Data!$H$34)","v":" Individual Percent Retained"}]
[191,{"$f":"IF(Test_Data!$J$38=\"\",\"\",Test_Data!$J$38)","v":""},{"$f":"IF(Test_Data!$B$30=\"\",\"\",Test_Data!$B$30)","v":"GRADATION OF EXTRACTED AGGREGATE-Tex-229-F"},{"$f":"IF(Test_Data!$B$34=\"\",\"\",Test_Data!$B$34)","v":"Sieve Size:"},{"$f":"IF(Test_Data!$B$38=\"\",\"\",Test_Data!$B$38)","v":""},{"$f":"IF(Test_Data!$J$34=\"\",\"\",Test_Data!$J$34)","v":" Cumulative Percent Retained"}]
[192,{"$f":"IF(Test_Data!$L$38=\"\",\"\",Test_Data!$L$38)","v":""},{"$f":"IF(Test_Data!$B$30=\"\",\"\",Test_Data!$B$30)","v":"GRADATION OF EXTRACTED AGGREGATE-Tex-229-F"},{"$f":"IF(Test_Data!$B$34=\"\",\"\",Test_Data!$B$34)","v":"Sieve Size:"},{"$f":"IF(Test_Data!$B$38=\"\",\"\",Test_Data!$B$38)","v":""},{"$f":"IF(Test_Data!$L$34=\"\",\"\",Test_Data!$L$34)","v":" Cumulative Percent Passing"}]
[193,{"$f":"IF(Test_Data!$N$38=\"\",\"\",Test_Data!$N$38)","v":""},{"$f":"IF(Test_Data!$B$30=\"\",\"\",Test_Data!$B$30)","v":"GRADATION OF EXTRACTED AGGREGATE-Tex-229-F"},{"$f":"IF(Test_Data!$B$34=\"\",\"\",Test_Data!$B$34)","v":"Sieve Size:"},{"$f":"IF(Test_Data!$B$38=\"\",\"\",Test_Data!$B$38)","v":""},{"$f":"IF(Test_Data!$N$34=\"\",\"\",Test_Data!$N$34)","v":"JMF  Individual Retained Limits, %"}]
[194,{"$f":"IF(Test_Data!$P$38=\"\",\"\",Test_Data!$P$38)","v":""},{"$f":"IF(Test_Data!$B$30=\"\",\"\",Test_Data!$B$30)","v":"GRADATION OF EXTRACTED AGGREGATE-Tex-229-F"},{"$f":"IF(Test_Data!$B$34=\"\",\"\",Test_Data!$B$34)","v":"Sieve Size:"},{"$f":"IF(Test_Data!$B$38=\"\",\"\",Test_Data!$B$38)","v":""},{"$f":"IF(Test_Data!$P$34=\"\",\"\",Test_Data!$P$34)","v":"In Tolerance"}]
[195,{"$f":"IF(Test_Data!$Q$38=\"\",\"\",Test_Data!$Q$38)","v":""},{"$f":"IF(Test_Data!$B$30=\"\",\"\",Test_Data!$B$30)","v":"GRADATION OF EXTRACTED AGGREGATE-Tex-229-F"},{"$f":"IF(Test_Data!$B$34=\"\",\"\",Test_Data!$B$34)","v":"Sieve Size:"},{"$f":"IF(Test_Data!$B$38=\"\",\"\",Test_Data!$B$38)","v":""},{"$f":"IF(Test_Data!$Q$34=\"\",\"\",Test_Data!$Q$34)","v":"Restricted Zone"}]
[196,{"$f":"IF(Test_Data!$D$39=\"\",\"\",Test_Data!$D$39)","v":""},{"$f":"IF(Test_Data!$B$30=\"\",\"\",Test_Data!$B$30)","v":"GRADATION OF EXTRACTED AGGREGATE-Tex-229-F"},{"$f":"IF(Test_Data!$B$34=\"\",\"\",Test_Data!$B$34)","v":"Sieve Size:"},{"$f":"IF(Test_Data!$B$39=\"\",\"\",Test_Data!$B$39)","v":""},{"$f":"IF(Test_Data!$D$34=\"\",\"\",Test_Data!$D$34)","v":"Individual Weight Retained (g)"}]
[197,{"$f":"IF(Test_Data!$F$39=\"\",\"\",Test_Data!$F$39)","v":""},{"$f":"IF(Test_Data!$B$30=\"\",\"\",Test_Data!$B$30)","v":"GRADATION OF EXTRACTED AGGREGATE-Tex-229-F"},{"$f":"IF(Test_Data!$B$34=\"\",\"\",Test_Data!$B$34)","v":"Sieve Size:"},{"$f":"IF(Test_Data!$B$39=\"\",\"\",Test_Data!$B$39)","v":""},{"$f":"IF(Test_Data!$F$34=\"\",\"\",Test_Data!$F$34)","v":"Cumulative Weight Retained (g)"}]
[198,{"$f":"IF(Test_Data!$H$39=\"\",\"\",Test_Data!$H$39)","v":""},{"$f":"IF(Test_Data!$B$30=\"\",\"\",Test_Data!$B$30)","v":"GRADATION OF EXTRACTED AGGREGATE-Tex-229-F"},{"$f":"IF(Test_Data!$B$34=\"\",\"\",Test_Data!$B$34)","v":"Sieve Size:"},{"$f":"IF(Test_Data!$B$39=\"\",\"\",Test_Data!$B$39)","v":""},{"$f":"IF(Test_Data!$H$34=\"\",\"\",Test_Data!$H$34)","v":" Individual Percent Retained"}]
[199,{"$f":"IF(Test_Data!$J$39=\"\",\"\",Test_Data!$J$39)","v":""},{"$f":"IF(Test_Data!$B$30=\"\",\"\",Test_Data!$B$30)","v":"GRADATION OF EXTRACTED AGGREGATE-Tex-229-F"},{"$f":"IF(Test_Data!$B$34=\"\",\"\",Test_Data!$B$34)","v":"Sieve Size:"},{"$f":"IF(Test_Data!$B$39=\"\",\"\",Test_Data!$B$39)","v":""},{"$f":"IF(Test_Data!$J$34=\"\",\"\",Test_Data!$J$34)","v":" Cumulative Percent Retained"}]
[200,{"$f":"IF(Test_Data!$L$39=\"\",\"\",Test_Data!$L$39)","v":""},{"$f":"IF(Test_Data!$B$30=\"\",\"\",Test_Data!$B$30)","v":"GRADATION OF EXTRACTED AGGREGATE-Tex-229-F"},{"$f":"IF(Test_Data!$B$34=\"\",\"\",Test_Data!$B$34)","v":"Sieve Size:"},{"$f":"IF(Test_Data!$B$39=\"\",\"\",Test_Data!$B$39)","v":""},{"$f":"IF(Test_Data!$L$34=\"\",\"\",Test_Data!$L$34)","v":" Cumulative Percent Passing"}]
[201,{"$f":"IF(Test_Data!$N$39=\"\",\"\",Test_Data!$N$39)","v":""},{"$f":"IF(Test_Data!$B$30=\"\",\"\",Test_Data!$B$30)","v":"GRADATION OF EXTRACTED AGGREGATE-Tex-229-F"},{"$f":"IF(Test_Data!$B$34=\"\",\"\",Test_Data!$B$34)","v":"Sieve Size:"},{"$f":"IF(Test_Data!$B$39=\"\",\"\",Test_Data!$B$39)","v":""},{"$f":"IF(Test_Data!$N$34=\"\",\"\",Test_Data!$N$34)","v":"JMF  Individual Retained Limits, %"}]
[202,{"$f":"IF(Test_Data!$P$39=\"\",\"\",Test_Data!$P$39)","v":""},{"$f":"IF(Test_Data!$B$30=\"\",\"\",Test_Data!$B$30)","v":"GRADATION OF EXTRACTED AGGREGATE-Tex-229-F"},{"$f":"IF(Test_Data!$B$34=\"\",\"\",Test_Data!$B$34)","v":"Sieve Size:"},{"$f":"IF(Test_Data!$B$39=\"\",\"\",Test_Data!$B$39)","v":""},{"$f":"IF(Test_Data!$P$34=\"\",\"\",Test_Data!$P$34)","v":"In Tolerance"}]
[203,{"$f":"IF(Test_Data!$Q$39=\"\",\"\",Test_Data!$Q$39)","v":""},{"$f":"IF(Test_Data!$B$30=\"\",\"\",Test_Data!$B$30)","v":"GRADATION OF EXTRACTED AGGREGATE-Tex-229-F"},{"$f":"IF(Test_Data!$B$34=\"\",\"\",Test_Data!$B$34)","v":"Sieve Size:"},{"$f":"IF(Test_Data!$B$39=\"\",\"\",Test_Data!$B$39)","v":""},{"$f":"IF(Test_Data!$Q$34=\"\",\"\",Test_Data!$Q$34)","v":"Restricted Zone"}]
[204,{"$f":"IF(Test_Data!$D$40=\"\",\"\",Test_Data!$D$40)","v":""},{"$f":"IF(Test_Data!$B$30=\"\",\"\",Test_Data!$B$30)","v":"GRADATION OF EXTRACTED AGGREGATE-Tex-229-F"},{"$f":"IF(Test_Data!$B$34=\"\",\"\",Test_Data!$B$34)","v":"Sieve Size:"},{"$f":"IF(Test_Data!$B$40=\"\",\"\",Test_Data!$B$40)","v":""},{"$f":"IF(Test_Data!$D$34=\"\",\"\",Test_Data!$D$34)","v":"Individual Weight Retained (g)"}]
[205,{"$f":"IF(Test_Data!$F$40=\"\",\"\",Test_Data!$F$40)","v":""},{"$f":"IF(Test_Data!$B$30=\"\",\"\",Test_Data!$B$30)","v":"GRADATION OF EXTRACTED AGGREGATE-Tex-229-F"},{"$f":"IF(Test_Data!$B$34=\"\",\"\",Test_Data!$B$34)","v":"Sieve Size:"},{"$f":"IF(Test_Data!$B$40=\"\",\"\",Test_Data!$B$40)","v":""},{"$f":"IF(Test_Data!$F$34=\"\",\"\",Test_Data!$F$34)","v":"Cumulative Weight Retained (g)"}]
[206,{"$f":"IF(Test_Data!$H$40=\"\",\"\",Test_Data!$H$40)","v":""},{"$f":"IF(Test_Data!$B$30=\"\",\"\",Test_Data!$B$30)","v":"GRADATION OF EXTRACTED AGGREGATE-Tex-229-F"},{"$f":"IF(Test_Data!$B$34=\"\",\"\",Test_Data!$B$34)","v":"Sieve Size:"},{"$f":"IF(Test_Data!$B$40=\"\",\"\",Test_Data!$B$40)","v":""},{"$f":"IF(Test_Data!$H$34=\"\",\"\",Test_Data!$H$34)","v":" Individual Percent Retained"}]
[207,{"$f":"IF(Test_Data!$J$40=\"\",\"\",Test_Data!$J$40)","v":""},{"$f":"IF(Test_Data!$B$30=\"\",\"\",Test_Data!$B$30)","v":"GRADATION OF EXTRACTED AGGREGATE-Tex-229-F"},{"$f":"IF(Test_Data!$B$34=\"\",\"\",Test_Data!$B$34)","v":"Sieve Size:"},{"$f":"IF(Test_Data!$B$40=\"\",\"\",Test_Data!$B$40)","v":""},{"$f":"IF(Test_Data!$J$34=\"\",\"\",Test_Data!$J$34)","v":" Cumulative Percent Retained"}]
[208,{"$f":"IF(Test_Data!$L$40=\"\",\"\",Test_Data!$L$40)","v":""},{"$f":"IF(Test_Data!$B$30=\"\",\"\",Test_Data!$B$30)","v":"GRADATION OF EXTRACTED AGGREGATE-Tex-229-F"},{"$f":"IF(Test_Data!$B$34=\"\",\"\",Test_Data!$B$34)","v":"Sieve Size:"},{"$f":"IF(Test_Data!$B$40=\"\",\"\",Test_Data!$B$40)","v":""},{"$f":"IF(Test_Data!$L$34=\"\",\"\",Test_Data!$L$34)","v":" Cumulative Percent Passing"}]
[209,{"$f":"IF(Test_Data!$N$40=\"\",\"\",Test_Data!$N$40)","v":""},{"$f":"IF(Test_Data!$B$30=\"\",\"\",Test_Data!$B$30)","v":"GRADATION OF EXTRACTED AGGREGATE-Tex-229-F"},{"$f":"IF(Test_Data!$B$34=\"\",\"\",Test_Data!$B$34)","v":"Sieve Size:"},{"$f":"IF(Test_Data!$B$40=\"\",\"\",Test_Data!$B$40)","v":""},{"$f":"IF(Test_Data!$N$34=\"\",\"\",Test_Data!$N$34)","v":"JMF  Individual Retained Limits, %"}]
[210,{"$f":"IF(Test_Data!$P$40=\"\",\"\",Test_Data!$P$40)","v":""},{"$f":"IF(Test_Data!$B$30=\"\",\"\",Test_Data!$B$30)","v":"GRADATION OF EXTRACTED AGGREGATE-Tex-229-F"},{"$f":"IF(Test_Data!$B$34=\"\",\"\",Test_Data!$B$34)","v":"Sieve Size:"},{"$f":"IF(Test_Data!$B$40=\"\",\"\",Test_Data!$B$40)","v":""},{"$f":"IF(Test_Data!$P$34=\"\",\"\",Test_Data!$P$34)","v":"In Tolerance"}]
[211,{"$f":"IF(Test_Data!$Q$40=\"\",\"\",Test_Data!$Q$40)","v":""},{"$f":"IF(Test_Data!$B$30=\"\",\"\",Test_Data!$B$30)","v":"GRADATION OF EXTRACTED AGGREGATE-Tex-229-F"},{"$f":"IF(Test_Data!$B$34=\"\",\"\",Test_Data!$B$34)","v":"Sieve Size:"},{"$f":"IF(Test_Data!$B$40=\"\",\"\",Test_Data!$B$40)","v":""},{"$f":"IF(Test_Data!$Q$34=\"\",\"\",Test_Data!$Q$34)","v":"Restricted Zone"}]
[212,{"$f":"IF(Test_Data!$D$41=\"\",\"\",Test_Data!$D$41)","v":""},{"$f":"IF(Test_Data!$B$30=\"\",\"\",Test_Data!$B$30)","v":"GRADATION OF EXTRACTED AGGREGATE-Tex-229-F"},{"$f":"IF(Test_Data!$B$34=\"\",\"\",Test_Data!$B$34)","v":"Sieve Size:"},{"$f":"IF(Test_Data!$B$41=\"\",\"\",Test_Data!$B$41)","v":""},{"$f":"IF(Test_Data!$D$34=\"\",\"\",Test_Data!$D$34)","v":"Individual Weight Retained (g)"}]
[213,{"$f":"IF(Test_Data!$F$41=\"\",\"\",Test_Data!$F$41)","v":""},{"$f":"IF(Test_Data!$B$30=\"\",\"\",Test_Data!$B$30)","v":"GRADATION OF EXTRACTED AGGREGATE-Tex-229-F"},{"$f":"IF(Test_Data!$B$34=\"\",\"\",Test_Data!$B$34)","v":"Sieve Size:"},{"$f":"IF(Test_Data!$B$41=\"\",\"\",Test_Data!$B$41)","v":""},{"$f":"IF(Test_Data!$F$34=\"\",\"\",Test_Data!$F$34)","v":"Cumulative Weight Retained (g)"}]
[214,{"$f":"IF(Test_Data!$H$41=\"\",\"\",Test_Data!$H$41)","v":""},{"$f":"IF(Test_Data!$B$30=\"\",\"\",Test_Data!$B$30)","v":"GRADATION OF EXTRACTED AGGREGATE-Tex-229-F"},{"$f":"IF(Test_Data!$B$34=\"\",\"\",Test_Data!$B$34)","v":"Sieve Size:"},{"$f":"IF(Test_Data!$B$41=\"\",\"\",Test_Data!$B$41)","v":""},{"$f":"IF(Test_Data!$H$34=\"\",\"\",Test_Data!$H$34)","v":" Individual Percent Retained"}]
[215,{"$f":"IF(Test_Data!$J$41=\"\",\"\",Test_Data!$J$41)","v":""},{"$f":"IF(Test_Data!$B$30=\"\",\"\",Test_Data!$B$30)","v":"GRADATION OF EXTRACTED AGGREGATE-Tex-229-F"},{"$f":"IF(Test_Data!$B$34=\"\",\"\",Test_Data!$B$34)","v":"Sieve Size:"},{"$f":"IF(Test_Data!$B$41=\"\",\"\",Test_Data!$B$41)","v":""},{"$f":"IF(Test_Data!$J$34=\"\",\"\",Test_Data!$J$34)","v":" Cumulative Percent Retained"}]
[216,{"$f":"IF(Test_Data!$L$41=\"\",\"\",Test_Data!$L$41)","v":""},{"$f":"IF(Test_Data!$B$30=\"\",\"\",Test_Data!$B$30)","v":"GRADATION OF EXTRACTED AGGREGATE-Tex-229-F"},{"$f":"IF(Test_Data!$B$34=\"\",\"\",Test_Data!$B$34)","v":"Sieve Size:"},{"$f":"IF(Test_Data!$B$41=\"\",\"\",Test_Data!$B$41)","v":""},{"$f":"IF(Test_Data!$L$34=\"\",\"\",Test_Data!$L$34)","v":" Cumulative Percent Passing"}]
[217,{"$f":"IF(Test_Data!$N$41=\"\",\"\",Test_Data!$N$41)","v":""},{"$f":"IF(Test_Data!$B$30=\"\",\"\",Test_Data!$B$30)","v":"GRADATION OF EXTRACTED AGGREGATE-Tex-229-F"},{"$f":"IF(Test_Data!$B$34=\"\",\"\",Test_Data!$B$34)","v":"Sieve Size:"},{"$f":"IF(Test_Data!$B$41=\"\",\"\",Test_Data!$B$41)","v":""},{"$f":"IF(Test_Data!$N$34=\"\",\"\",Test_Data!$N$34)","v":"JMF  Individual Retained Limits, %"}]
[218,{"$f":"IF(Test_Data!$P$41=\"\",\"\",Test_Data!$P$41)","v":""},{"$f":"IF(Test_Data!$B$30=\"\",\"\",Test_Data!$B$30)","v":"GRADATION OF EXTRACTED AGGREGATE-Tex-229-F"},{"$f":"IF(Test_Data!$B$34=\"\",\"\",Test_Data!$B$34)","v":"Sieve Size:"},{"$f":"IF(Test_Data!$B$41=\"\",\"\",Test_Data!$B$41)","v":""},{"$f":"IF(Test_Data!$P$34=\"\",\"\",Test_Data!$P$34)","v":"In Tolerance"}]
[219,{"$f":"IF(Test_Data!$Q$41=\"\",\"\",Test_Data!$Q$41)","v":""},{"$f":"IF(Test_Data!$B$30=\"\",\"\",Test_Data!$B$30)","v":"GRADATION OF EXTRACTED AGGREGATE-Tex-229-F"},{"$f":"IF(Test_Data!$B$34=\"\",\"\",Test_Data!$B$34)","v":"Sieve Size:"},{"$f":"IF(Test_Data!$B$41=\"\",\"\",Test_Data!$B$41)","v":""},{"$f":"IF(Test_Data!$Q$34=\"\",\"\",Test_Data!$Q$34)","v":"Restricted Zone"}]
[220,{"$f":"IF(Test_Data!$D$42=\"\",\"\",Test_Data!$D$42)","v":""},{"$f":"IF(Test_Data!$B$30=\"\",\"\",Test_Data!$B$30)","v":"GRADATION OF EXTRACTED AGGREGATE-Tex-229-F"},{"$f":"IF(Test_Data!$B$34=\"\",\"\",Test_Data!$B$34)","v":"Sieve Size:"},{"$f":"IF(Test_Data!$B$42=\"\",\"\",Test_Data!$B$42)","v":""},{"$f":"IF(Test_Data!$D$34=\"\",\"\",Test_Data!$D$34)","v":"Individual Weight Retained (g)"}]
[221,{"$f":"IF(Test_Data!$F$42=\"\",\"\",Test_Data!$F$42)","v":""},{"$f":"IF(Test_Data!$B$30=\"\",\"\",Test_Data!$B$30)","v":"GRADATION OF EXTRACTED AGGREGATE-Tex-229-F"},{"$f":"IF(Test_Data!$B$34=\"\",\"\",Test_Data!$B$34)","v":"Sieve Size:"},{"$f":"IF(Test_Data!$B$42=\"\",\"\",Test_Data!$B$42)","v":""},{"$f":"IF(Test_Data!$F$34=\"\",\"\",Test_Data!$F$34)","v":"Cumulative Weight Retained (g)"}]
[222,{"$f":"IF(Test_Data!$H$42=\"\",\"\",Test_Data!$H$42)","v":""},{"$f":"IF(Test_Data!$B$30=\"\",\"\",Test_Data!$B$30)","v":"GRADATION OF EXTRACTED AGGREGATE-Tex-229-F"},{"$f":"IF(Test_Data!$B$34=\"\",\"\",Test_Data!$B$34)","v":"Sieve Size:"},{"$f":"IF(Test_Data!$B$42=\"\",\"\",Test_Data!$B$42)","v":""},{"$f":"IF(Test_Data!$H$34=\"\",\"\",Test_Data!$H$34)","v":" Individual Percent Retained"}]
[223,{"$f":"IF(Test_Data!$J$42=\"\",\"\",Test_Data!$J$42)","v":""},{"$f":"IF(Test_Data!$B$30=\"\",\"\",Test_Data!$B$30)","v":"GRADATION OF EXTRACTED AGGREGATE-Tex-229-F"},{"$f":"IF(Test_Data!$B$34=\"\",\"\",Test_Data!$B$34)","v":"Sieve Size:"},{"$f":"IF(Test_Data!$B$42=\"\",\"\",Test_Data!$B$42)","v":""},{"$f":"IF(Test_Data!$J$34=\"\",\"\",Test_Data!$J$34)","v":" Cumulative Percent Retained"}]
[224,{"$f":"IF(Test_Data!$L$42=\"\",\"\",Test_Data!$L$42)","v":""},{"$f":"IF(Test_Data!$B$30=\"\",\"\",Test_Data!$B$30)","v":"GRADATION OF EXTRACTED AGGREGATE-Tex-229-F"},{"$f":"IF(Test_Data!$B$34=\"\",\"\",Test_Data!$B$34)","v":"Sieve Size:"},{"$f":"IF(Test_Data!$B$42=\"\",\"\",Test_Data!$B$42)","v":""},{"$f":"IF(Test_Data!$L$34=\"\",\"\",Test_Data!$L$34)","v":" Cumulative Percent Passing"}]
[225,{"$f":"IF(Test_Data!$N$42=\"\",\"\",Test_Data!$N$42)","v":""},{"$f":"IF(Test_Data!$B$30=\"\",\"\",Test_Data!$B$30)","v":"GRADATION OF EXTRACTED AGGREGATE-Tex-229-F"},{"$f":"IF(Test_Data!$B$34=\"\",\"\",Test_Data!$B$34)","v":"Sieve Size:"},{"$f":"IF(Test_Data!$B$42=\"\",\"\",Test_Data!$B$42)","v":""},{"$f":"IF(Test_Data!$N$34=\"\",\"\",Test_Data!$N$34)","v":"JMF  Individual Retained Limits, %"}]
[226,{"$f":"IF(Test_Data!$P$42=\"\",\"\",Test_Data!$P$42)","v":""},{"$f":"IF(Test_Data!$B$30=\"\",\"\",Test_Data!$B$30)","v":"GRADATION OF EXTRACTED AGGREGATE-Tex-229-F"},{"$f":"IF(Test_Data!$B$34=\"\",\"\",Test_Data!$B$34)","v":"Sieve Size:"},{"$f":"IF(Test_Data!$B$42=\"\",\"\",Test_Data!$B$42)","v":""},{"$f":"IF(Test_Data!$P$34=\"\",\"\",Test_Data!$P$34)","v":"In Tolerance"}]
[227,{"$f":"IF(Test_Data!$Q$42=\"\",\"\",Test_Data!$Q$42)","v":""},{"$f":"IF(Test_Data!$B$30=\"\",\"\",Test_Data!$B$30)","v":"GRADATION OF EXTRACTED AGGREGATE-Tex-229-F"},{"$f":"IF(Test_Data!$B$34=\"\",\"\",Test_Data!$B$34)","v":"Sieve Size:"},{"$f":"IF(Test_Data!$B$42=\"\",\"\",Test_Data!$B$42)","v":""},{"$f":"IF(Test_Data!$Q$34=\"\",\"\",Test_Data!$Q$34)","v":"Restricted Zone"}]
[228,{"$f":"IF(Test_Data!$D$43=\"\",\"\",Test_Data!$D$43)","v":""},{"$f":"IF(Test_Data!$B$30=\"\",\"\",Test_Data!$B$30)","v":"GRADATION OF EXTRACTED AGGREGATE-Tex-229-F"},{"$f":"IF(Test_Data!$B$34=\"\",\"\",Test_Data!$B$34)","v":"Sieve Size:"},{"$f":"IF(Test_Data!$B$43=\"\",\"\",Test_Data!$B$43)","v":""},{"$f":"IF(Test_Data!$D$34=\"\",\"\",Test_Data!$D$34)","v":"Individual Weight Retained (g)"}]
[229,{"$f":"IF(Test_Data!$F$43=\"\",\"\",Test_Data!$F$43)","v":""},{"$f":"IF(Test_Data!$B$30=\"\",\"\",Test_Data!$B$30)","v":"GRADATION OF EXTRACTED AGGREGATE-Tex-229-F"},{"$f":"IF(Test_Data!$B$34=\"\",\"\",Test_Data!$B$34)","v":"Sieve Size:"},{"$f":"IF(Test_Data!$B$43=\"\",\"\",Test_Data!$B$43)","v":""},{"$f":"IF(Test_Data!$F$34=\"\",\"\",Test_Data!$F$34)","v":"Cumulative Weight Retained (g)"}]
[230,{"$f":"IF(Test_Data!$H$43=\"\",\"\",Test_Data!$H$43)","v":""},{"$f":"IF(Test_Data!$B$30=\"\",\"\",Test_Data!$B$30)","v":"GRADATION OF EXTRACTED AGGREGATE-Tex-229-F"},{"$f":"IF(Test_Data!$B$34=\"\",\"\",Test_Data!$B$34)","v":"Sieve Size:"},{"$f":"IF(Test_Data!$B$43=\"\",\"\",Test_Data!$B$43)","v":""},{"$f":"IF(Test_Data!$H$34=\"\",\"\",Test_Data!$H$34)","v":" Individual Percent Retained"}]
[231,{"$f":"IF(Test_Data!$J$43=\"\",\"\",Test_Data!$J$43)","v":""},{"$f":"IF(Test_Data!$B$30=\"\",\"\",Test_Data!$B$30)","v":"GRADATION OF EXTRACTED AGGREGATE-Tex-229-F"},{"$f":"IF(Test_Data!$B$34=\"\",\"\",Test_Data!$B$34)","v":"Sieve Size:"},{"$f":"IF(Test_Data!$B$43=\"\",\"\",Test_Data!$B$43)","v":""},{"$f":"IF(Test_Data!$J$34=\"\",\"\",Test_Data!$J$34)","v":" Cumulative Percent Retained"}]
[232,{"$f":"IF(Test_Data!$L$43=\"\",\"\",Test_Data!$L$43)","v":""},{"$f":"IF(Test_Data!$B$30=\"\",\"\",Test_Data!$B$30)","v":"GRADATION OF EXTRACTED AGGREGATE-Tex-229-F"},{"$f":"IF(Test_Data!$B$34=\"\",\"\",Test_Data!$B$34)","v":"Sieve Size:"},{"$f":"IF(Test_Data!$B$43=\"\",\"\",Test_Data!$B$43)","v":""},{"$f":"IF(Test_Data!$L$34=\"\",\"\",Test_Data!$L$34)","v":" Cumulative Percent Passing"}]
[233,{"$f":"IF(Test_Data!$N$43=\"\",\"\",Test_Data!$N$43)","v":""},{"$f":"IF(Test_Data!$B$30=\"\",\"\",Test_Data!$B$30)","v":"GRADATION OF EXTRACTED AGGREGATE-Tex-229-F"},{"$f":"IF(Test_Data!$B$34=\"\",\"\",Test_Data!$B$34)","v":"Sieve Size:"},{"$f":"IF(Test_Data!$B$43=\"\",\"\",Test_Data!$B$43)","v":""},{"$f":"IF(Test_Data!$N$34=\"\",\"\",Test_Data!$N$34)","v":"JMF  Individual Retained Limits, %"}]
[234,{"$f":"IF(Test_Data!$P$43=\"\",\"\",Test_Data!$P$43)","v":""},{"$f":"IF(Test_Data!$B$30=\"\",\"\",Test_Data!$B$30)","v":"GRADATION OF EXTRACTED AGGREGATE-Tex-229-F"},{"$f":"IF(Test_Data!$B$34=\"\",\"\",Test_Data!$B$34)","v":"Sieve Size:"},{"$f":"IF(Test_Data!$B$43=\"\",\"\",Test_Data!$B$43)","v":""},{"$f":"IF(Test_Data!$P$34=\"\",\"\",Test_Data!$P$34)","v":"In Tolerance"}]
[235,{"$f":"IF(Test_Data!$Q$43=\"\",\"\",Test_Data!$Q$43)","v":""},{"$f":"IF(Test_Data!$B$30=\"\",\"\",Test_Data!$B$30)","v":"GRADATION OF EXTRACTED AGGREGATE-Tex-229-F"},{"$f":"IF(Test_Data!$B$34=\"\",\"\",Test_Data!$B$34)","v":"Sieve Size:"},{"$f":"IF(Test_Data!$B$43=\"\",\"\",Test_Data!$B$43)","v":""},{"$f":"IF(Test_Data!$Q$34=\"\",\"\",Test_Data!$Q$34)","v":"Restricted Zone"}]
[236,{"$f":"IF(Test_Data!$D$44=\"\",\"\",Test_Data!$D$44)","v":""},{"$f":"IF(Test_Data!$B$30=\"\",\"\",Test_Data!$B$30)","v":"GRADATION OF EXTRACTED AGGREGATE-Tex-229-F"},{"$f":"IF(Test_Data!$B$34=\"\",\"\",Test_Data!$B$34)","v":"Sieve Size:"},{"$f":"IF(Test_Data!$B$44=\"\",\"\",Test_Data!$B$44)","v":""},{"$f":"IF(Test_Data!$D$34=\"\",\"\",Test_Data!$D$34)","v":"Individual Weight Retained (g)"}]
[237,{"$f":"IF(Test_Data!$F$44=\"\",\"\",Test_Data!$F$44)","v":""},{"$f":"IF(Test_Data!$B$30=\"\",\"\",Test_Data!$B$30)","v":"GRADATION OF EXTRACTED AGGREGATE-Tex-229-F"},{"$f":"IF(Test_Data!$B$34=\"\",\"\",Test_Data!$B$34)","v":"Sieve Size:"},{"$f":"IF(Test_Data!$B$44=\"\",\"\",Test_Data!$B$44)","v":""},{"$f":"IF(Test_Data!$F$34=\"\",\"\",Test_Data!$F$34)","v":"Cumulative Weight Retained (g)"}]
[238,{"$f":"IF(Test_Data!$H$44=\"\",\"\",Test_Data!$H$44)","v":""},{"$f":"IF(Test_Data!$B$30=\"\",\"\",Test_Data!$B$30)","v":"GRADATION OF EXTRACTED AGGREGATE-Tex-229-F"},{"$f":"IF(Test_Data!$B$34=\"\",\"\",Test_Data!$B$34)","v":"Sieve Size:"},{"$f":"IF(Test_Data!$B$44=\"\",\"\",Test_Data!$B$44)","v":""},{"$f":"IF(Test_Data!$H$34=\"\",\"\",Test_Data!$H$34)","v":" Individual Percent Retained"}]
[239,{"$f":"IF(Test_Data!$J$44=\"\",\"\",Test_Data!$J$44)","v":""},{"$f":"IF(Test_Data!$B$30=\"\",\"\",Test_Data!$B$30)","v":"GRADATION OF EXTRACTED AGGREGATE-Tex-229-F"},{"$f":"IF(Test_Data!$B$34=\"\",\"\",Test_Data!$B$34)","v":"Sieve Size:"},{"$f":"IF(Test_Data!$B$44=\"\",\"\",Test_Data!$B$44)","v":""},{"$f":"IF(Test_Data!$J$34=\"\",\"\",Test_Data!$J$34)","v":" Cumulative Percent Retained"}]
[240,{"$f":"IF(Test_Data!$L$44=\"\",\"\",Test_Data!$L$44)","v":""},{"$f":"IF(Test_Data!$B$30=\"\",\"\",Test_Data!$B$30)","v":"GRADATION OF EXTRACTED AGGREGATE-Tex-229-F"},{"$f":"IF(Test_Data!$B$34=\"\",\"\",Test_Data!$B$34)","v":"Sieve Size:"},{"$f":"IF(Test_Data!$B$44=\"\",\"\",Test_Data!$B$44)","v":""},{"$f":"IF(Test_Data!$L$34=\"\",\"\",Test_Data!$L$34)","v":" Cumulative Percent Passing"}]
[241,{"$f":"IF(Test_Data!$N$44=\"\",\"\",Test_Data!$N$44)","v":""},{"$f":"IF(Test_Data!$B$30=\"\",\"\",Test_Data!$B$30)","v":"GRADATION OF EXTRACTED AGGREGATE-Tex-229-F"},{"$f":"IF(Test_Data!$B$34=\"\",\"\",Test_Data!$B$34)","v":"Sieve Size:"},{"$f":"IF(Test_Data!$B$44=\"\",\"\",Test_Data!$B$44)","v":""},{"$f":"IF(Test_Data!$N$34=\"\",\"\",Test_Data!$N$34)","v":"JMF  Individual Retained Limits, %"}]
[242,{"$f":"IF(Test_Data!$P$44=\"\",\"\",Test_Data!$P$44)","v":""},{"$f":"IF(Test_Data!$B$30=\"\",\"\",Test_Data!$B$30)","v":"GRADATION OF EXTRACTED AGGREGATE-Tex-229-F"},{"$f":"IF(Test_Data!$B$34=\"\",\"\",Test_Data!$B$34)","v":"Sieve Size:"},{"$f":"IF(Test_Data!$B$44=\"\",\"\",Test_Data!$B$44)","v":""},{"$f":"IF(Test_Data!$P$34=\"\",\"\",Test_Data!$P$34)","v":"In Tolerance"}]
[243,{"$f":"IF(Test_Data!$Q$44=\"\",\"\",Test_Data!$Q$44)","v":""},{"$f":"IF(Test_Data!$B$30=\"\",\"\",Test_Data!$B$30)","v":"GRADATION OF EXTRACTED AGGREGATE-Tex-229-F"},{"$f":"IF(Test_Data!$B$34=\"\",\"\",Test_Data!$B$34)","v":"Sieve Size:"},{"$f":"IF(Test_Data!$B$44=\"\",\"\",Test_Data!$B$44)","v":""},{"$f":"IF(Test_Data!$Q$34=\"\",\"\",Test_Data!$Q$34)","v":"Restricted Zone"}]
[244,{"$f":"IF(Test_Data!$D$45=\"\",\"\",Test_Data!$D$45)","v":""},{"$f":"IF(Test_Data!$B$30=\"\",\"\",Test_Data!$B$30)","v":"GRADATION OF EXTRACTED AGGREGATE-Tex-229-F"},{"$f":"IF(Test_Data!$B$34=\"\",\"\",Test_Data!$B$34)","v":"Sieve Size:"},{"$f":"IF(Test_Data!$B$45=\"\",\"\",Test_Data!$B$45)","v":""},{"$f":"IF(Test_Data!$D$34=\"\",\"\",Test_Data!$D$34)","v":"Individual Weight Retained (g)"}]
[245,{"$f":"IF(Test_Data!$F$45=\"\",\"\",Test_Data!$F$45)","v":""},{"$f":"IF(Test_Data!$B$30=\"\",\"\",Test_Data!$B$30)","v":"GRADATION OF EXTRACTED AGGREGATE-Tex-229-F"},{"$f":"IF(Test_Data!$B$34=\"\",\"\",Test_Data!$B$34)","v":"Sieve Size:"},{"$f":"IF(Test_Data!$B$45=\"\",\"\",Test_Data!$B$45)","v":""},{"$f":"IF(Test_Data!$F$34=\"\",\"\",Test_Data!$F$34)","v":"Cumulative Weight Retained (g)"}]
[246,{"$f":"IF(Test_Data!$H$45=\"\",\"\",Test_Data!$H$45)","v":""},{"$f":"IF(Test_Data!$B$30=\"\",\"\",Test_Data!$B$30)","v":"GRADATION OF EXTRACTED AGGREGATE-Tex-229-F"},{"$f":"IF(Test_Data!$B$34=\"\",\"\",Test_Data!$B$34)","v":"Sieve Size:"},{"$f":"IF(Test_Data!$B$45=\"\",\"\",Test_Data!$B$45)","v":""},{"$f":"IF(Test_Data!$H$34=\"\",\"\",Test_Data!$H$34)","v":" Individual Percent Retained"}]
[247,{"$f":"IF(Test_Data!$J$45=\"\",\"\",Test_Data!$J$45)","v":""},{"$f":"IF(Test_Data!$B$30=\"\",\"\",Test_Data!$B$30)","v":"GRADATION OF EXTRACTED AGGREGATE-Tex-229-F"},{"$f":"IF(Test_Data!$B$34=\"\",\"\",Test_Data!$B$34)","v":"Sieve Size:"},{"$f":"IF(Test_Data!$B$45=\"\",\"\",Test_Data!$B$45)","v":""},{"$f":"IF(Test_Data!$J$34=\"\",\"\",Test_Data!$J$34)","v":" Cumulative Percent Retained"}]
[248,{"$f":"IF(Test_Data!$L$45=\"\",\"\",Test_Data!$L$45)","v":""},{"$f":"IF(Test_Data!$B$30=\"\",\"\",Test_Data!$B$30)","v":"GRADATION OF EXTRACTED AGGREGATE-Tex-229-F"},{"$f":"IF(Test_Data!$B$34=\"\",\"\",Test_Data!$B$34)","v":"Sieve Size:"},{"$f":"IF(Test_Data!$B$45=\"\",\"\",Test_Data!$B$45)","v":""},{"$f":"IF(Test_Data!$L$34=\"\",\"\",Test_Data!$L$34)","v":" Cumulative Percent Passing"}]
[249,{"$f":"IF(Test_Data!$N$45=\"\",\"\",Test_Data!$N$45)","v":""},{"$f":"IF(Test_Data!$B$30=\"\",\"\",Test_Data!$B$30)","v":"GRADATION OF EXTRACTED AGGREGATE-Tex-229-F"},{"$f":"IF(Test_Data!$B$34=\"\",\"\",Test_Data!$B$34)","v":"Sieve Size:"},{"$f":"IF(Test_Data!$B$45=\"\",\"\",Test_Data!$B$45)","v":""},{"$f":"IF(Test_Data!$N$34=\"\",\"\",Test_Data!$N$34)","v":"JMF  Individual Retained Limits, %"}]
[250,{"$f":"IF(Test_Data!$P$45=\"\",\"\",Test_Data!$P$45)","v":""},{"$f":"IF(Test_Data!$B$30=\"\",\"\",Test_Data!$B$30)","v":"GRADATION OF EXTRACTED AGGREGATE-Tex-229-F"},{"$f":"IF(Test_Data!$B$34=\"\",\"\",Test_Data!$B$34)","v":"Sieve Size:"},{"$f":"IF(Test_Data!$B$45=\"\",\"\",Test_Data!$B$45)","v":""},{"$f":"IF(Test_Data!$P$34=\"\",\"\",Test_Data!$P$34)","v":"In Tolerance"}]
[251,{"$f":"IF(Test_Data!$Q$45=\"\",\"\",Test_Data!$Q$45)","v":""},{"$f":"IF(Test_Data!$B$30=\"\",\"\",Test_Data!$B$30)","v":"GRADATION OF EXTRACTED AGGREGATE-Tex-229-F"},{"$f":"IF(Test_Data!$B$34=\"\",\"\",Test_Data!$B$34)","v":"Sieve Size:"},{"$f":"IF(Test_Data!$B$45=\"\",\"\",Test_Data!$B$45)","v":""},{"$f":"IF(Test_Data!$Q$34=\"\",\"\",Test_Data!$Q$34)","v":"Restricted Zone"}]
[252,{"$f":"IF(Test_Data!$D$46=\"\",\"\",Test_Data!$D$46)","v":""},{"$f":"IF(Test_Data!$B$30=\"\",\"\",Test_Data!$B$30)","v":"GRADATION OF EXTRACTED AGGREGATE-Tex-229-F"},{"$f":"IF(Test_Data!$B$34=\"\",\"\",Test_Data!$B$34)","v":"Sieve Size:"},{"$f":"IF(Test_Data!$B$46=\"\",\"\",Test_Data!$B$46)","v":""},{"$f":"IF(Test_Data!$D$34=\"\",\"\",Test_Data!$D$34)","v":"Individual Weight Retained (g)"}]
[253,{"$f":"IF(Test_Data!$F$46=\"\",\"\",Test_Data!$F$46)","v":""},{"$f":"IF(Test_Data!$B$30=\"\",\"\",Test_Data!$B$30)","v":"GRADATION OF EXTRACTED AGGREGATE-Tex-229-F"},{"$f":"IF(Test_Data!$B$34=\"\",\"\",Test_Data!$B$34)","v":"Sieve Size:"},{"$f":"IF(Test_Data!$B$46=\"\",\"\",Test_Data!$B$46)","v":""},{"$f":"IF(Test_Data!$F$34=\"\",\"\",Test_Data!$F$34)","v":"Cumulative Weight Retained (g)"}]
[254,{"$f":"IF(Test_Data!$H$46=\"\",\"\",Test_Data!$H$46)","v":""},{"$f":"IF(Test_Data!$B$30=\"\",\"\",Test_Data!$B$30)","v":"GRADATION OF EXTRACTED AGGREGATE-Tex-229-F"},{"$f":"IF(Test_Data!$B$34=\"\",\"\",Test_Data!$B$34)","v":"Sieve Size:"},{"$f":"IF(Test_Data!$B$46=\"\",\"\",Test_Data!$B$46)","v":""},{"$f":"IF(Test_Data!$H$34=\"\",\"\",Test_Data!$H$34)","v":" Individual Percent Retained"}]
[255,{"$f":"IF(Test_Data!$J$46=\"\",\"\",Test_Data!$J$46)","v":""},{"$f":"IF(Test_Data!$B$30=\"\",\"\",Test_Data!$B$30)","v":"GRADATION OF EXTRACTED AGGREGATE-Tex-229-F"},{"$f":"IF(Test_Data!$B$34=\"\",\"\",Test_Data!$B$34)","v":"Sieve Size:"},{"$f":"IF(Test_Data!$B$46=\"\",\"\",Test_Data!$B$46)","v":""},{"$f":"IF(Test_Data!$J$34=\"\",\"\",Test_Data!$J$34)","v":" Cumulative Percent Retained"}]
[256,{"$f":"IF(Test_Data!$L$46=\"\",\"\",Test_Data!$L$46)","v":""},{"$f":"IF(Test_Data!$B$30=\"\",\"\",Test_Data!$B$30)","v":"GRADATION OF EXTRACTED AGGREGATE-Tex-229-F"},{"$f":"IF(Test_Data!$B$34=\"\",\"\",Test_Data!$B$34)","v":"Sieve Size:"},{"$f":"IF(Test_Data!$B$46=\"\",\"\",Test_Data!$B$46)","v":""},{"$f":"IF(Test_Data!$L$34=\"\",\"\",Test_Data!$L$34)","v":" Cumulative Percent Passing"}]
[257,{"$f":"IF(Test_Data!$N$46=\"\",\"\",Test_Data!$N$46)","v":""},{"$f":"IF(Test_Data!$B$30=\"\",\"\",Test_Data!$B$30)","v":"GRADATION OF EXTRACTED AGGREGATE-Tex-229-F"},{"$f":"IF(Test_Data!$B$34=\"\",\"\",Test_Data!$B$34)","v":"Sieve Size:"},{"$f":"IF(Test_Data!$B$46=\"\",\"\",Test_Data!$B$46)","v":""},{"$f":"IF(Test_Data!$N$34=\"\",\"\",Test_Data!$N$34)","v":"JMF  Individual Retained Limits, %"}]
[258,{"$f":"IF(Test_Data!$P$46=\"\",\"\",Test_Data!$P$46)","v":""},{"$f":"IF(Test_Data!$B$30=\"\",\"\",Test_Data!$B$30)","v":"GRADATION OF EXTRACTED AGGREGATE-Tex-229-F"},{"$f":"IF(Test_Data!$B$34=\"\",\"\",Test_Data!$B$34)","v":"Sieve Size:"},{"$f":"IF(Test_Data!$B$46=\"\",\"\",Test_Data!$B$46)","v":""},{"$f":"IF(Test_Data!$P$34=\"\",\"\",Test_Data!$P$34)","v":"In Tolerance"}]
[259,{"$f":"IF(Test_Data!$Q$46=\"\",\"\",Test_Data!$Q$46)","v":""},{"$f":"IF(Test_Data!$B$30=\"\",\"\",Test_Data!$B$30)","v":"GRADATION OF EXTRACTED AGGREGATE-Tex-229-F"},{"$f":"IF(Test_Data!$B$34=\"\",\"\",Test_Data!$B$34)","v":"Sieve Size:"},{"$f":"IF(Test_Data!$B$46=\"\",\"\",Test_Data!$B$46)","v":""},{"$f":"IF(Test_Data!$Q$34=\"\",\"\",Test_Data!$Q$34)","v":"Restricted Zone"}]
[260,{"$f":"IF(Test_Data!$D$47=\"\",\"\",Test_Data!$D$47)","v":""},{"$f":"IF(Test_Data!$B$30=\"\",\"\",Test_Data!$B$30)","v":"GRADATION OF EXTRACTED AGGREGATE-Tex-229-F"},{"$f":"IF(Test_Data!$B$34=\"\",\"\",Test_Data!$B$34)","v":"Sieve Size:"},{"$f":"IF(Test_Data!$B$47=\"\",\"\",Test_Data!$B$47)","v":""},{"$f":"IF(Test_Data!$D$34=\"\",\"\",Test_Data!$D$34)","v":"Individual Weight Retained (g)"}]
[261,{"$f":"IF(Test_Data!$F$47=\"\",\"\",Test_Data!$F$47)","v":""},{"$f":"IF(Test_Data!$B$30=\"\",\"\",Test_Data!$B$30)","v":"GRADATION OF EXTRACTED AGGREGATE-Tex-229-F"},{"$f":"IF(Test_Data!$B$34=\"\",\"\",Test_Data!$B$34)","v":"Sieve Size:"},{"$f":"IF(Test_Data!$B$47=\"\",\"\",Test_Data!$B$47)","v":""},{"$f":"IF(Test_Data!$F$34=\"\",\"\",Test_Data!$F$34)","v":"Cumulative Weight Retained (g)"}]
[262,{"$f":"IF(Test_Data!$H$47=\"\",\"\",Test_Data!$H$47)","v":""},{"$f":"IF(Test_Data!$B$30=\"\",\"\",Test_Data!$B$30)","v":"GRADATION OF EXTRACTED AGGREGATE-Tex-229-F"},{"$f":"IF(Test_Data!$B$34=\"\",\"\",Test_Data!$B$34)","v":"Sieve Size:"},{"$f":"IF(Test_Data!$B$47=\"\",\"\",Test_Data!$B$47)","v":""},{"$f":"IF(Test_Data!$H$34=\"\",\"\",Test_Data!$H$34)","v":" Individual Percent Retained"}]
[263,{"$f":"IF(Test_Data!$J$47=\"\",\"\",Test_Data!$J$47)","v":""},{"$f":"IF(Test_Data!$B$30=\"\",\"\",Test_Data!$B$30)","v":"GRADATION OF EXTRACTED AGGREGATE-Tex-229-F"},{"$f":"IF(Test_Data!$B$34=\"\",\"\",Test_Data!$B$34)","v":"Sieve Size:"},{"$f":"IF(Test_Data!$B$47=\"\",\"\",Test_Data!$B$47)","v":""},{"$f":"IF(Test_Data!$J$34=\"\",\"\",Test_Data!$J$34)","v":" Cumulative Percent Retained"}]
[264,{"$f":"IF(Test_Data!$L$47=\"\",\"\",Test_Data!$L$47)","v":""},{"$f":"IF(Test_Data!$B$30=\"\",\"\",Test_Data!$B$30)","v":"GRADATION OF EXTRACTED AGGREGATE-Tex-229-F"},{"$f":"IF(Test_Data!$B$34=\"\",\"\",Test_Data!$B$34)","v":"Sieve Size:"},{"$f":"IF(Test_Data!$B$47=\"\",\"\",Test_Data!$B$47)","v":""},{"$f":"IF(Test_Data!$L$34=\"\",\"\",Test_Data!$L$34)","v":" Cumulative Percent Passing"}]
[265,{"$f":"IF(Test_Data!$N$47=\"\",\"\",Test_Data!$N$47)","v":""},{"$f":"IF(Test_Data!$B$30=\"\",\"\",Test_Data!$B$30)","v":"GRADATION OF EXTRACTED AGGREGATE-Tex-229-F"},{"$f":"IF(Test_Data!$B$34=\"\",\"\",Test_Data!$B$34)","v":"Sieve Size:"},{"$f":"IF(Test_Data!$B$47=\"\",\"\",Test_Data!$B$47)","v":""},{"$f":"IF(Test_Data!$N$34=\"\",\"\",Test_Data!$N$34)","v":"JMF  Individual Retained Limits, %"}]
[266,{"$f":"IF(Test_Data!$P$47=\"\",\"\",Test_Data!$P$47)","v":""},{"$f":"IF(Test_Data!$B$30=\"\",\"\",Test_Data!$B$30)","v":"GRADATION OF EXTRACTED AGGREGATE-Tex-229-F"},{"$f":"IF(Test_Data!$B$34=\"\",\"\",Test_Data!$B$34)","v":"Sieve Size:"},{"$f":"IF(Test_Data!$B$47=\"\",\"\",Test_Data!$B$47)","v":""},{"$f":"IF(Test_Data!$P$34=\"\",\"\",Test_Data!$P$34)","v":"In Tolerance"}]
[267,{"$f":"IF(Test_Data!$Q$47=\"\",\"\",Test_Data!$Q$47)","v":""},{"$f":"IF(Test_Data!$B$30=\"\",\"\",Test_Data!$B$30)","v":"GRADATION OF EXTRACTED AGGREGATE-Tex-229-F"},{"$f":"IF(Test_Data!$B$34=\"\",\"\",Test_Data!$B$34)","v":"Sieve Size:"},{"$f":"IF(Test_Data!$B$47=\"\",\"\",Test_Data!$B$47)","v":""},{"$f":"IF(Test_Data!$Q$34=\"\",\"\",Test_Data!$Q$34)","v":"Restricted Zone"}]
[268,{"$f":"IF(Test_Data!$D$48=\"\",\"\",Test_Data!$D$48)","v":""},{"$f":"IF(Test_Data!$B$30=\"\",\"\",Test_Data!$B$30)","v":"GRADATION OF EXTRACTED AGGREGATE-Tex-229-F"},{"$f":"IF(Test_Data!$B$34=\"\",\"\",Test_Data!$B$34)","v":"Sieve Size:"},{"$f":"IF(Test_Data!$B$48=\"\",\"\",Test_Data!$B$48)","v":""},{"$f":"IF(Test_Data!$D$34=\"\",\"\",Test_Data!$D$34)","v":"Individual Weight Retained (g)"}]
[269,{"$f":"IF(Test_Data!$D$49=\"\",\"\",Test_Data!$D$49)","v":0},{"$f":"IF(Test_Data!$B$30=\"\",\"\",Test_Data!$B$30)","v":"GRADATION OF EXTRACTED AGGREGATE-Tex-229-F"},{"$f":"IF(Test_Data!$F$49=\"\",\"\",Test_Data!$F$49)","v":"Gain (g)"}]
[270,{"$f":"IF(Test_Data!$D$50=\"\",\"\",Test_Data!$D$50)","v":0},{"$f":"IF(Test_Data!$B$30=\"\",\"\",Test_Data!$B$30)","v":"GRADATION OF EXTRACTED AGGREGATE-Tex-229-F"},{"$f":"IF(Test_Data!$B$34=\"\",\"\",Test_Data!$B$34)","v":"Sieve Size:"},{"$f":"IF(Test_Data!$B$50=\"\",\"\",Test_Data!$B$50)","v":"Total "},{"$f":"IF(Test_Data!$D$34=\"\",\"\",Test_Data!$D$34)","v":"Individual Weight Retained (g)"}]
[271,{"$f":"IF(Test_Data!$F$50=\"\",\"\",Test_Data!$F$50)","v":""},{"$f":"IF(Test_Data!$B$30=\"\",\"\",Test_Data!$B$30)","v":"GRADATION OF EXTRACTED AGGREGATE-Tex-229-F"},{"$f":"IF(Test_Data!$B$34=\"\",\"\",Test_Data!$B$34)","v":"Sieve Size:"},{"$f":"IF(Test_Data!$B$50=\"\",\"\",Test_Data!$B$50)","v":"Total "},{"$f":"IF(Test_Data!$F$34=\"\",\"\",Test_Data!$F$34)","v":"Cumulative Weight Retained (g)"}]
[272,{"$f":"IF(Test_Data!$H$50=\"\",\"\",Test_Data!$H$50)","v":""},{"$f":"IF(Test_Data!$B$30=\"\",\"\",Test_Data!$B$30)","v":"GRADATION OF EXTRACTED AGGREGATE-Tex-229-F"},{"$f":"IF(Test_Data!$B$34=\"\",\"\",Test_Data!$B$34)","v":"Sieve Size:"},{"$f":"IF(Test_Data!$B$50=\"\",\"\",Test_Data!$B$50)","v":"Total "},{"$f":"IF(Test_Data!$H$34=\"\",\"\",Test_Data!$H$34)","v":" Individual Percent Retained"}]
[273,{"$f":"IF(Test_Data!$J$50=\"\",\"\",Test_Data!$J$50)","v":""},{"$f":"IF(Test_Data!$B$30=\"\",\"\",Test_Data!$B$30)","v":"GRADATION OF EXTRACTED AGGREGATE-Tex-229-F"},{"$f":"IF(Test_Data!$B$34=\"\",\"\",Test_Data!$B$34)","v":"Sieve Size:"},{"$f":"IF(Test_Data!$B$50=\"\",\"\",Test_Data!$B$50)","v":"Total "},{"$f":"IF(Test_Data!$J$34=\"\",\"\",Test_Data!$J$34)","v":" Cumulative Percent Retained"}]
[274,{"$f":"IF(Test_Data!$L$50=\"\",\"\",Test_Data!$L$50)","v":""},{"$f":"IF(Test_Data!$B$30=\"\",\"\",Test_Data!$B$30)","v":"GRADATION OF EXTRACTED AGGREGATE-Tex-229-F"},{"$f":"IF(Test_Data!$B$34=\"\",\"\",Test_Data!$B$34)","v":"Sieve Size:"},{"$f":"IF(Test_Data!$B$50=\"\",\"\",Test_Data!$B$50)","v":"Total "},{"$f":"IF(Test_Data!$L$34=\"\",\"\",Test_Data!$L$34)","v":" Cumulative Percent Passing"}]
[275,{"$f":"IF(Test_Data!$N$50=\"\",\"\",Test_Data!$N$50)","v":""},{"$f":"IF(Test_Data!$B$30=\"\",\"\",Test_Data!$B$30)","v":"GRADATION OF EXTRACTED AGGREGATE-Tex-229-F"},{"$f":"IF(Test_Data!$B$34=\"\",\"\",Test_Data!$B$34)","v":"Sieve Size:"},{"$f":"IF(Test_Data!$B$50=\"\",\"\",Test_Data!$B$50)","v":"Total "},{"$f":"IF(Test_Data!$N$34=\"\",\"\",Test_Data!$N$34)","v":"JMF  Individual Retained Limits, %"}]
[276,{"$f":"IF(Test_Data!$P$50=\"\",\"\",Test_Data!$P$50)","v":""},{"$f":"IF(Test_Data!$B$30=\"\",\"\",Test_Data!$B$30)","v":"GRADATION OF EXTRACTED AGGREGATE-Tex-229-F"},{"$f":"IF(Test_Data!$B$34=\"\",\"\",Test_Data!$B$34)","v":"Sieve Size:"},{"$f":"IF(Test_Data!$B$50=\"\",\"\",Test_Data!$B$50)","v":"Total "},{"$f":"IF(Test_Data!$P$34=\"\",\"\",Test_Data!$P$34)","v":"In Tolerance"}]
[277,{"$f":"IF(Test_Data!$D$51=\"\",\"\",Test_Data!$D$51)","v":0},{"$f":"IF(Test_Data!$B$30=\"\",\"\",Test_Data!$B$30)","v":"GRADATION OF EXTRACTED AGGREGATE-Tex-229-F"},{"$f":"IF(Test_Data!$B$34=\"\",\"\",Test_Data!$B$34)","v":"Sieve Size:"},{"$f":"IF(Test_Data!$B$51=\"\",\"\",Test_Data!$B$51)","v":"Total Weight:"},{"$f":"IF(Test_Data!$D$34=\"\",\"\",Test_Data!$D$34)","v":"Individual Weight Retained (g)"}]
[278,{"$f":"IF(Test_Data!$D$52=\"\",\"\",Test_Data!$D$52)","v":""},{"$f":"IF(Test_Data!$B$30=\"\",\"\",Test_Data!$B$30)","v":"GRADATION OF EXTRACTED AGGREGATE-Tex-229-F"},{"$f":"IF(Test_Data!$F$52=\"\",\"\",Test_Data!$F$52)","v":"Sieving Gain (g), from ?"}]
[279,{"$f":"IF(Test_Data!$AA$30=\"\",\"\",Test_Data!$AA$30)","v":""},{"$f":"IF(Test_Data!$S$29=\"\",\"\",Test_Data!$S$29)","v":"Determination of Moisture Tex-212-F  :"},{"$f":"IF(Test_Data!$S$30=\"\",\"\",Test_Data!$S$30)","v":"Still Number:"}]
[280,{"$f":"IF(Test_Data!$AA$31=\"\",\"\",Test_Data!$AA$31)","v":""},{"$f":"IF(Test_Data!$S$29=\"\",\"\",Test_Data!$S$29)","v":"Determination of Moisture Tex-212-F  :"},{"$f":"IF(Test_Data!$S$31=\"\",\"\",Test_Data!$S$31)","v":"Weight of Still & Sample (g):"}]
[281,{"$f":"IF(Test_Data!$AA$32=\"\",\"\",Test_Data!$AA$32)","v":""},{"$f":"IF(Test_Data!$S$29=\"\",\"\",Test_Data!$S$29)","v":"Determination of Moisture Tex-212-F  :"},{"$f":"IF(Test_Data!$S$32=\"\",\"\",Test_Data!$S$32)","v":"Still Weight (g):"}]
[282,{"$f":"IF(Test_Data!$AA$33=\"\",\"\",Test_Data!$AA$33)","v":""},{"$f":"IF(Test_Data!$S$29=\"\",\"\",Test_Data!$S$29)","v":"Determination of Moisture Tex-212-F  :"},{"$f":"IF(Test_Data!$S$33=\"\",\"\",Test_Data!$S$33)","v":"Sample Weight (g):"}]
[283,{"$f":"IF(Test_Data!$AA$34=\"\",\"\",Test_Data!$AA$34)","v":""},{"$f":"IF(Test_Data!$S$29=\"\",\"\",Test_Data!$S$29)","v":"Determination of Moisture Tex-212-F  :"},{"$f":"IF(Test_Data!$S$34=\"\",\"\",Test_Data!$S$34)","v":"Moisture Reading (g):"}]
[284,{"$f":"IF(Test_Data!$AA$35=\"\",\"\",Test_Data!$AA$35)","v":""},{"$f":"IF(Test_Data!$S$29=\"\",\"\",Test_Data!$S$29)","v":"Determination of Moisture Tex-212-F  :"},{"$f":"IF(Test_Data!$S$35=\"\",\"\",Test_Data!$S$35)","v":"Moisture Content (%):"}]
[285,{"$f":"IF(Test_Data!$AA$38=\"\",\"\",Test_Data!$AA$38)","v":""},{"$f":"IF(Test_Data!$S$37=\"\",\"\",Test_Data!$S$37)","v":"Determination of Hydrocarbon-Volatile Content: Tex-213-F"},{"$f":"IF(Test_Data!$S$38=\"\",\"\",Test_Data!$S$38)","v":"Still Number:"}]
[286,{"$f":"IF(Test_Data!$AA$39=\"\",\"\",Test_Data!$AA$39)","v":""},{"$f":"IF(Test_Data!$S$37=\"\",\"\",Test_Data!$S$37)","v":"Determination of Hydrocarbon-Volatile Content: Tex-213-F"},{"$f":"IF(Test_Data!$S$39=\"\",\"\",Test_Data!$S$39)","v":"Still Weight (g):"}]
[287,{"$f":"IF(Test_Data!$AA$40=\"\",\"\",Test_Data!$AA$40)","v":""},{"$f":"IF(Test_Data!$S$37=\"\",\"\",Test_Data!$S$37)","v":"Determination of Hydrocarbon-Volatile Content: Tex-213-F"},{"$f":"IF(Test_Data!$S$40=\"\",\"\",Test_Data!$S$40)","v":"Weight of Still and Sample (g):"}]
[288,{"$f":"IF(Test_Data!$AA$41=\"\",\"\",Test_Data!$AA$41)","v":""},{"$f":"IF(Test_Data!$S$37=\"\",\"\",Test_Data!$S$37)","v":"Determination of Hydrocarbon-Volatile Content: Tex-213-F"},{"$f":"IF(Test_Data!$S$41=\"\",\"\",Test_Data!$S$41)","v":"Sample Weight (g):"}]
[289,{"$f":"IF(Test_Data!$AA$42=\"\",\"\",Test_Data!$AA$42)","v":""},{"$f":"IF(Test_Data!$S$37=\"\",\"\",Test_Data!$S$37)","v":"Determination of Hydrocarbon-Volatile Content: Tex-213-F"},{"$f":"IF(Test_Data!$S$42=\"\",\"\",Test_Data!$S$42)","v":"Top Meniscus Reading (mL):"}]
[290,{"$f":"IF(Test_Data!$AA$43=\"\",\"\",Test_Data!$AA$43)","v":""},{"$f":"IF(Test_Data!$S$37=\"\",\"\",Test_Data!$S$37)","v":"Determination of Hydrocarbon-Volatile Content: Tex-213-F"},{"$f":"IF(Test_Data!$S$43=\"\",\"\",Test_Data!$S$43)","v":"Bottom Meniscus Reading (mL):"}]
[291,{"$f":"IF(Test_Data!$AA$44=\"\",\"\",Test_Data!$AA$44)","v":""},{"$f":"IF(Test_Data!$S$37=\"\",\"\",Test_Data!$S$37)","v":"Determination of Hydrocarbon-Volatile Content: Tex-213-F"},{"$f":"IF(Test_Data!$S$44=\"\",\"\",Test_Data!$S$44)","v":"Volume of Volatiles (mL):"}]
[292,{"$f":"IF(Test_Data!$AA$45=\"\",\"\",Test_Data!$AA$45)","v":""},{"$f":"IF(Test_Data!$S$37=\"\",\"\",Test_Data!$S$37)","v":"Determination of Hydrocarbon-Volatile Content: Tex-213-F"},{"$f":"IF(Test_Data!$S$45=\"\",\"\",Test_Data!$S$45)","v":"Specific Gravity of Volatiles:"}]
[293,{"$f":"IF(Test_Data!$AA$46=\"\",\"\",Test_Data!$AA$46)","v":""},{"$f":"IF(Test_Data!$S$37=\"\",\"\",Test_Data!$S$37)","v":"Determination of Hydrocarbon-Volatile Content: Tex-213-F"},{"$f":"IF(Test_Data!$S$46=\"\",\"\",Test_Data!$S$46)","v":"Percent Hydrocarbon Volatiles (%):"}]
[294,{"$f":"IF(Test_Data!$AA$53=\"\",\"\",Test_Data!$AA$53)","v":""},{"$f":"IF(Test_Data!$U$52=\"\",\"\",Test_Data!$U$52)","v":"Extraction Method: Tex-210-F by :"},{"$f":"IF(Test_Data!$U$53=\"\",\"\",Test_Data!$U$53)","v":"Total Sample (g):"}]
[295,{"$f":"IF(Test_Data!$AA$54=\"\",\"\",Test_Data!$AA$54)","v":""},{"$f":"IF(Test_Data!$U$52=\"\",\"\",Test_Data!$U$52)","v":"Extraction Method: Tex-210-F by :"},{"$f":"IF(Test_Data!$U$54=\"\",\"\",Test_Data!$U$54)","v":"Original Filter Paper (g):"}]
[296,{"$f":"IF(Test_Data!$AA$55=\"\",\"\",Test_Data!$AA$55)","v":""},{"$f":"IF(Test_Data!$U$52=\"\",\"\",Test_Data!$U$52)","v":"Extraction Method: Tex-210-F by :"},{"$f":"IF(Test_Data!$U$55=\"\",\"\",Test_Data!$U$55)","v":"Final Filter Paper (g):"}]
[297,{"$f":"IF(Test_Data!$AA$56=\"\",\"\",Test_Data!$AA$56)","v":""},{"$f":"IF(Test_Data!$U$52=\"\",\"\",Test_Data!$U$52)","v":"Extraction Method: Tex-210-F by :"},{"$f":"IF(Test_Data!$U$56=\"\",\"\",Test_Data!$U$56)","v":"Fines in Filter Paper (g):"}]
[298,{"$f":"IF(Test_Data!$AA$57=\"\",\"\",Test_Data!$AA$57)","v":""},{"$f":"IF(Test_Data!$U$52=\"\",\"\",Test_Data!$U$52)","v":"Extraction Method: Tex-210-F by :"},{"$f":"IF(Test_Data!$U$57=\"\",\"\",Test_Data!$U$57)","v":"Pan+Extracted Aggregate (g):"}]
[299,{"$f":"IF(Test_Data!$AA$58=\"\",\"\",Test_Data!$AA$58)","v":""},{"$f":"IF(Test_Data!$U$52=\"\",\"\",Test_Data!$U$52)","v":"Extraction Method: Tex-210-F by :"},{"$f":"IF(Test_Data!$U$58=\"\",\"\",Test_Data!$U$58)","v":"Pan (g):"}]
[300,{"$f":"IF(Test_Data!$AA$59=\"\",\"\",Test_Data!$AA$59)","v":""},{"$f":"IF(Test_Data!$U$52=\"\",\"\",Test_Data!$U$52)","v":"Extraction Method: Tex-210-F by :"},{"$f":"IF(Test_Data!$U$59=\"\",\"\",Test_Data!$U$59)","v":"Extracted Aggregate (g):"}]
[301,{"$f":"IF(Test_Data!$AA$60=\"\",\"\",Test_Data!$AA$60)","v":""},{"$f":"IF(Test_Data!$U$52=\"\",\"\",Test_Data!$U$52)","v":"Extraction Method: Tex-210-F by :"},{"$f":"IF(Test_Data!$U$60=\"\",\"\",Test_Data!$U$60)","v":"Dish + Ash per 100mL (g):"}]
[302,{"$f":"IF(Test_Data!$AA$61=\"\",\"\",Test_Data!$AA$61)","v":""},{"$f":"IF(Test_Data!$U$52=\"\",\"\",Test_Data!$U$52)","v":"Extraction Method: Tex-210-F by :"},{"$f":"IF(Test_Data!$U$61=\"\",\"\",Test_Data!$U$61)","v":"Dish (g):"}]
[303,{"$f":"IF(Test_Data!$AA$62=\"\",\"\",Test_Data!$AA$62)","v":""},{"$f":"IF(Test_Data!$U$52=\"\",\"\",Test_Data!$U$52)","v":"Extraction Method: Tex-210-F by :"},{"$f":"IF(Test_Data!$U$62=\"\",\"\",Test_Data!$U$62)","v":"Ash per 100mL (g):"}]
[304,{"$f":"IF(Test_Data!$AA$63=\"\",\"\",Test_Data!$AA$63)","v":""},{"$f":"IF(Test_Data!$U$52=\"\",\"\",Test_Data!$U$52)","v":"Extraction Method: Tex-210-F by :"},{"$f":"IF(Test_Data!$U$63=\"\",\"\",Test_Data!$U$63)","v":"Total Solvent (mL):"}]
[305,{"$f":"IF(Test_Data!$AA$64=\"\",\"\",Test_Data!$AA$64)","v":""},{"$f":"IF(Test_Data!$U$52=\"\",\"\",Test_Data!$U$52)","v":"Extraction Method: Tex-210-F by :"},{"$f":"IF(Test_Data!$U$64=\"\",\"\",Test_Data!$U$64)","v":"Total Ash (g):"}]
[306,{"$f":"IF(Test_Data!$AA$65=\"\",\"\",Test_Data!$AA$65)","v":""},{"$f":"IF(Test_Data!$U$52=\"\",\"\",Test_Data!$U$52)","v":"Extraction Method: Tex-210-F by :"},{"$f":"IF(Test_Data!$U$65=\"\",\"\",Test_Data!$U$65)","v":"Filtering Aid (g):"}]
[307,{"$f":"IF(Test_Data!$AA$77=\"\",\"\",Test_Data!$AA$77)","v":""},{"$f":"IF(Test_Data!$U$52=\"\",\"\",Test_Data!$U$52)","v":"Extraction Method: Tex-210-F by :"},{"$f":"IF(Test_Data!$U$77=\"\",\"\",Test_Data!$U$77)","v":"Fines+Aggregate+Ash (g):"}]
[308,{"$f":"IF(Test_Data!$AA$78=\"\",\"\",Test_Data!$AA$78)","v":""},{"$f":"IF(Test_Data!$U$52=\"\",\"\",Test_Data!$U$52)","v":"Extraction Method: Tex-210-F by :"},{"$f":"IF(Test_Data!$U$78=\"\",\"\",Test_Data!$U$78)","v":"Total Loss (%):"}]
[309,{"$f":"IF(Test_Data!$AA$79=\"\",\"\",Test_Data!$AA$79)","v":""},{"$f":"IF(Test_Data!$U$52=\"\",\"\",Test_Data!$U$52)","v":"Extraction Method: Tex-210-F by :"},{"$f":"IF(Test_Data!$U$79=\"\",\"\",Test_Data!$U$79)","v":"Hydrocarbon Volatiles (%):"}]
[310,{"$f":"IF(Test_Data!$AA$80=\"\",\"\",Test_Data!$AA$80)","v":""},{"$f":"IF(Test_Data!$U$52=\"\",\"\",Test_Data!$U$52)","v":"Extraction Method: Tex-210-F by :"},{"$f":"IF(Test_Data!$U$80=\"\",\"\",Test_Data!$U$80)","v":"Asphalt Content (%):"}]
[311,{"$f":"IF(Test_Data!$AA$81=\"\",\"\",Test_Data!$AA$81)","v":""},{"$f":"IF(Test_Data!$U$52=\"\",\"\",Test_Data!$U$52)","v":"Extraction Method: Tex-210-F by :"},{"$f":"IF(Test_Data!$U$81=\"\",\"\",Test_Data!$U$81)","v":"Total Loss (g):"}]
[312,{"$f":"IF(Test_Data!$AA$82=\"\",\"\",Test_Data!$AA$82)","v":""},{"$f":"IF(Test_Data!$U$52=\"\",\"\",Test_Data!$U$52)","v":"Extraction Method: Tex-210-F by :"},{"$f":"IF(Test_Data!$U$82=\"\",\"\",Test_Data!$U$82)","v":"Moisture Content (%):"}]
[313,{"$f":"IF(Test_Data!$AA$83=\"\",\"\",Test_Data!$AA$83)","v":""},{"$f":"IF(Test_Data!$U$52=\"\",\"\",Test_Data!$U$52)","v":"Extraction Method: Tex-210-F by :"},{"$f":"IF(Test_Data!$U$83=\"\",\"\",Test_Data!$U$83)","v":"Ash Factor (%):"}]
[314,{"$f":"IF(Test_Data!$AA$84=\"\",\"\",Test_Data!$AA$84)","v":""},{"$f":"IF(Test_Data!$U$52=\"\",\"\",Test_Data!$U$52)","v":"Extraction Method: Tex-210-F by :"},{"$f":"IF(Test_Data!$U$84=\"\",\"\",Test_Data!$U$84)","v":"Percent of Dry Aggregate (%):"}]
[315,{"$f":"IF(Test_Data!$AA$85=\"\",\"\",Test_Data!$AA$85)","v":""},{"$f":"IF(Test_Data!$U$52=\"\",\"\",Test_Data!$U$52)","v":"Extraction Method: Tex-210-F by :"},{"$f":"IF(Test_Data!$X$85=\"\",\"\",Test_Data!$X$85)","v":"Total:"}]
[316,{"$f":"IF(Test_Data!$H$57=\"\",\"\",Test_Data!$H$57)","v":75},{"$f":"IF(Test_Data!$B$54=\"\",\"\",Test_Data!$B$54)","v":"DETERMINING DENSITY & PROPERTIES OF BITUMINOUS MIXTURES-Tex-207-F"},{"$f":"IF(Test_Data!$B$57=\"\",\"\",Test_Data!$B$57)","v":"Specimen Radius (mm):"},{"$f":"IF(Test_Data!$H$55=\"\",\"\",Test_Data!$H$55)","v":"Laboratory"},{"$f":"IF(Test_Data!$H$56=\"\",\"\",Test_Data!$H$56)","v":"1(1)"}]
[317,{"$f":"IF(Test_Data!$J$57=\"\",\"\",Test_Data!$J$57)","v":75},{"$f":"IF(Test_Data!$B$54=\"\",\"\",Test_Data!$B$54)","v":"DETERMINING DENSITY & PROPERTIES OF BITUMINOUS MIXTURES-Tex-207-F"},{"$f":"IF(Test_Data!$B$57=\"\",\"\",Test_Data!$B$57)","v":"Specimen Radius (mm):"},{"$f":"IF(Test_Data!$H$55=\"\",\"\",Test_Data!$H$55)","v":"Laboratory"},{"$f":"IF(Test_Data!$J$56=\"\",\"\",Test_Data!$J$56)","v":"1(2)"}]
[318,{"$f":"IF(Test_Data!$L$57=\"\",\"\",Test_Data!$L$57)","v":75},{"$f":"IF(Test_Data!$B$54=\"\",\"\",Test_Data!$B$54)","v":"DETERMINING DENSITY & PROPERTIES OF BITUMINOUS MIXTURES-Tex-207-F"},{"$f":"IF(Test_Data!$B$57=\"\",\"\",Test_Data!$B$57)","v":"Specimen Radius (mm):"},{"$f":"IF(Test_Data!$H$55=\"\",\"\",Test_Data!$H$55)","v":"Laboratory"},{"$f":"IF(Test_Data!$L$56=\"\",\"\",Test_Data!$L$56)","v":"1(3)"}]
[319,{"$f":"IF(Test_Data!$N$57=\"\",\"\",Test_Data!$N$57)","v":""},{"$f":"IF(Test_Data!$B$54=\"\",\"\",Test_Data!$B$54)","v":"DETERMINING DENSITY & PROPERTIES OF BITUMINOUS MIXTURES-Tex-207-F"},{"$f":"IF(Test_Data!$B$57=\"\",\"\",Test_Data!$B$57)","v":"Specimen Radius (mm):"},{"$f":"IF(Test_Data!$N$55=\"\",\"\",Test_Data!$N$55)","v":"Roadway"},{"$f":"IF(Test_Data!$N$56=\"\",\"\",Test_Data!$N$56)","v":"1(A)"}]
[320,{"$f":"IF(Test_Data!$P$57=\"\",\"\",Test_Data!$P$57)","v":""},{"$f":"IF(Test_Data!$B$54=\"\",\"\",Test_Data!$B$54)","v":"DETERMINING DENSITY & PROPERTIES OF BITUMINOUS MIXTURES-Tex-207-F"},{"$f":"IF(Test_Data!$B$57=\"\",\"\",Test_Data!$B$57)","v":"Specimen Radius (mm):"},{"$f":"IF(Test_Data!$N$55=\"\",\"\",Test_Data!$N$55)","v":"Roadway"},{"$f":"IF(Test_Data!$P$56=\"\",\"\",Test_Data!$P$56)","v":"1(B)"}]
[321,{"$f":"IF(Test_Data!$R$57=\"\",\"\",Test_Data!$R$57)","v":""},{"$f":"IF(Test_Data!$B$54=\"\",\"\",Test_Data!$B$54)","v":"DETERMINING DENSITY & PROPERTIES OF BITUMINOUS MIXTURES-Tex-207-F"},{"$f":"IF(Test_Data!$B$57=\"\",\"\",Test_Data!$B$57)","v":"Specimen Radius (mm):"},{"$f":"IF(Test_Data!$N$55=\"\",\"\",Test_Data!$N$55)","v":"Roadway"},{"$f":"IF(Test_Data!$R$56=\"\",\"\",Test_Data!$R$56)","v":"1(C)"}]
[322,{"$f":"IF(Test_Data!$H$58=\"\",\"\",Test_Data!$H$58)","v":""},{"$f":"IF(Test_Data!$B$54=\"\",\"\",Test_Data!$B$54)","v":"DETERMINING DENSITY & PROPERTIES OF BITUMINOUS MIXTURES-Tex-207-F"},{"$f":"IF(Test_Data!$B$58=\"\",\"\",Test_Data!$B$58)","v":"Untrimmed Specimen/Core Height (in):"},{"$f":"IF(Test_Data!$H$55=\"\",\"\",Test_Data!$H$55)","v":"Laboratory"},{"$f":"IF(Test_Data!$H$56=\"\",\"\",Test_Data!$H$56)","v":"1(1)"}]
[323,{"$f":"IF(Test_Data!$J$58=\"\",\"\",Test_Data!$J$58)","v":""},{"$f":"IF(Test_Data!$B$54=\"\",\"\",Test_Data!$B$54)","v":"DETERMINING DENSITY & PROPERTIES OF BITUMINOUS MIXTURES-Tex-207-F"},{"$f":"IF(Test_Data!$B$58=\"\",\"\",Test_Data!$B$58)","v":"Untrimmed Specimen/Core Height (in):"},{"$f":"IF(Test_Data!$H$55=\"\",\"\",Test_Data!$H$55)","v":"Laboratory"},{"$f":"IF(Test_Data!$J$56=\"\",\"\",Test_Data!$J$56)","v":"1(2)"}]
[324,{"$f":"IF(Test_Data!$L$58=\"\",\"\",Test_Data!$L$58)","v":""},{"$f":"IF(Test_Data!$B$54=\"\",\"\",Test_Data!$B$54)","v":"DETERMINING DENSITY & PROPERTIES OF BITUMINOUS MIXTURES-Tex-207-F"},{"$f":"IF(Test_Data!$B$58=\"\",\"\",Test_Data!$B$58)","v":"Untrimmed Specimen/Core Height (in):"},{"$f":"IF(Test_Data!$H$55=\"\",\"\",Test_Data!$H$55)","v":"Laboratory"},{"$f":"IF(Test_Data!$L$56=\"\",\"\",Test_Data!$L$56)","v":"1(3)"}]
[325,{"$f":"IF(Test_Data!$N$58=\"\",\"\",Test_Data!$N$58)","v":""},{"$f":"IF(Test_Data!$B$54=\"\",\"\",Test_Data!$B$54)","v":"DETERMINING DENSITY & PROPERTIES OF BITUMINOUS MIXTURES-Tex-207-F"},{"$f":"IF(Test_Data!$B$58=\"\",\"\",Test_Data!$B$58)","v":"Untrimmed Specimen/Core Height (in):"},{"$f":"IF(Test_Data!$N$55=\"\",\"\",Test_Data!$N$55)","v":"Roadway"},{"$f":"IF(Test_Data!$N$56=\"\",\"\",Test_Data!$N$56)","v":"1(A)"}]
[326,{"$f":"IF(Test_Data!$P$58=\"\",\"\",Test_Data!$P$58)","v":""},{"$f":"IF(Test_Data!$B$54=\"\",\"\",Test_Data!$B$54)","v":"DETERMINING DENSITY & PROPERTIES OF BITUMINOUS MIXTURES-Tex-207-F"},{"$f":"IF(Test_Data!$B$58=\"\",\"\",Test_Data!$B$58)","v":"Untrimmed Specimen/Core Height (in):"},{"$f":"IF(Test_Data!$N$55=\"\",\"\",Test_Data!$N$55)","v":"Roadway"},{"$f":"IF(Test_Data!$P$56=\"\",\"\",Test_Data!$P$56)","v":"1(B)"}]
[327,{"$f":"IF(Test_Data!$R$58=\"\",\"\",Test_Data!$R$58)","v":""},{"$f":"IF(Test_Data!$B$54=\"\",\"\",Test_Data!$B$54)","v":"DETERMINING DENSITY & PROPERTIES OF BITUMINOUS MIXTURES-Tex-207-F"},{"$f":"IF(Test_Data!$B$58=\"\",\"\",Test_Data!$B$58)","v":"Untrimmed Specimen/Core Height (in):"},{"$f":"IF(Test_Data!$N$55=\"\",\"\",Test_Data!$N$55)","v":"Roadway"},{"$f":"IF(Test_Data!$R$56=\"\",\"\",Test_Data!$R$56)","v":"1(C)"}]
[328,{"$f":"IF(Test_Data!$H$59=\"\",\"\",Test_Data!$H$59)","v":""},{"$f":"IF(Test_Data!$B$54=\"\",\"\",Test_Data!$B$54)","v":"DETERMINING DENSITY & PROPERTIES OF BITUMINOUS MIXTURES-Tex-207-F"},{"$f":"IF(Test_Data!$B$59=\"\",\"\",Test_Data!$B$59)","v":"Weight of Specimen in Air (g):"},{"$f":"IF(Test_Data!$H$55=\"\",\"\",Test_Data!$H$55)","v":"Laboratory"},{"$f":"IF(Test_Data!$H$56=\"\",\"\",Test_Data!$H$56)","v":"1(1)"}]
[329,{"$f":"IF(Test_Data!$J$59=\"\",\"\",Test_Data!$J$59)","v":""},{"$f":"IF(Test_Data!$B$54=\"\",\"\",Test_Data!$B$54)","v":"DETERMINING DENSITY & PROPERTIES OF BITUMINOUS MIXTURES-Tex-207-F"},{"$f":"IF(Test_Data!$B$59=\"\",\"\",Test_Data!$B$59)","v":"Weight of Specimen in Air (g):"},{"$f":"IF(Test_Data!$H$55=\"\",\"\",Test_Data!$H$55)","v":"Laboratory"},{"$f":"IF(Test_Data!$J$56=\"\",\"\",Test_Data!$J$56)","v":"1(2)"}]
[330,{"$f":"IF(Test_Data!$L$59=\"\",\"\",Test_Data!$L$59)","v":""},{"$f":"IF(Test_Data!$B$54=\"\",\"\",Test_Data!$B$54)","v":"DETERMINING DENSITY & PROPERTIES OF BITUMINOUS MIXTURES-Tex-207-F"},{"$f":"IF(Test_Data!$B$59=\"\",\"\",Test_Data!$B$59)","v":"Weight of Specimen in Air (g):"},{"$f":"IF(Test_Data!$H$55=\"\",\"\",Test_Data!$H$55)","v":"Laboratory"},{"$f":"IF(Test_Data!$L$56=\"\",\"\",Test_Data!$L$56)","v":"1(3)"}]
[331,{"$f":"IF(Test_Data!$N$59=\"\",\"\",Test_Data!$N$59)","v":""},{"$f":"IF(Test_Data!$B$54=\"\",\"\",Test_Data!$B$54)","v":"DETERMINING DENSITY & PROPERTIES OF BITUMINOUS MIXTURES-Tex-207-F"},{"$f":"IF(Test_Data!$B$59=\"\",\"\",Test_Data!$B$59)","v":"Weight of Specimen in Air (g):"},{"$f":"IF(Test_Data!$N$55=\"\",\"\",Test_Data!$N$55)","v":"Roadway"},{"$f":"IF(Test_Data!$N$56=\"\",\"\",Test_Data!$N$56)","v":"1(A)"}]
[332,{"$f":"IF(Test_Data!$P$59=\"\",\"\",Test_Data!$P$59)","v":""},{"$f":"IF(Test_Data!$B$54=\"\",\"\",Test_Data!$B$54)","v":"DETERMINING DENSITY & PROPERTIES OF BITUMINOUS MIXTURES-Tex-207-F"},{"$f":"IF(Test_Data!$B$59=\"\",\"\",Test_Data!$B$59)","v":"Weight of Specimen in Air (g):"},{"$f":"IF(Test_Data!$N$55=\"\",\"\",Test_Data!$N$55)","v":"Roadway"},{"$f":"IF(Test_Data!$P$56=\"\",\"\",Test_Data!$P$56)","v":"1(B)"}]
[333,{"$f":"IF(Test_Data!$R$59=\"\",\"\",Test_Data!$R$59)","v":""},{"$f":"IF(Test_Data!$B$54=\"\",\"\",Test_Data!$B$54)","v":"DETERMINING DENSITY & PROPERTIES OF BITUMINOUS MIXTURES-Tex-207-F"},{"$f":"IF(Test_Data!$B$59=\"\",\"\",Test_Data!$B$59)","v":"Weight of Specimen in Air (g):"},{"$f":"IF(Test_Data!$N$55=\"\",\"\",Test_Data!$N$55)","v":"Roadway"},{"$f":"IF(Test_Data!$R$56=\"\",\"\",Test_Data!$R$56)","v":"1(C)"}]
[334,{"$f":"IF(Test_Data!$H$60=\"\",\"\",Test_Data!$H$60)","v":""},{"$f":"IF(Test_Data!$B$54=\"\",\"\",Test_Data!$B$54)","v":"DETERMINING DENSITY & PROPERTIES OF BITUMINOUS MIXTURES-Tex-207-F"},{"$f":"IF(Test_Data!$B$60=\"\",\"\",Test_Data!$B$60)","v":"Wt of Spec. in Water (g):"},{"$f":"IF(Test_Data!$H$55=\"\",\"\",Test_Data!$H$55)","v":"Laboratory"},{"$f":"IF(Test_Data!$H$56=\"\",\"\",Test_Data!$H$56)","v":"1(1)"}]
[335,{"$f":"IF(Test_Data!$J$60=\"\",\"\",Test_Data!$J$60)","v":""},{"$f":"IF(Test_Data!$B$54=\"\",\"\",Test_Data!$B$54)","v":"DETERMINING DENSITY & PROPERTIES OF BITUMINOUS MIXTURES-Tex-207-F"},{"$f":"IF(Test_Data!$B$60=\"\",\"\",Test_Data!$B$60)","v":"Wt of Spec. in Water (g):"},{"$f":"IF(Test_Data!$H$55=\"\",\"\",Test_Data!$H$55)","v":"Laboratory"},{"$f":"IF(Test_Data!$J$56=\"\",\"\",Test_Data!$J$56)","v":"1(2)"}]
[336,{"$f":"IF(Test_Data!$L$60=\"\",\"\",Test_Data!$L$60)","v":""},{"$f":"IF(Test_Data!$B$54=\"\",\"\",Test_Data!$B$54)","v":"DETERMINING DENSITY & PROPERTIES OF BITUMINOUS MIXTURES-Tex-207-F"},{"$f":"IF(Test_Data!$B$60=\"\",\"\",Test_Data!$B$60)","v":"Wt of Spec. in Water (g):"},{"$f":"IF(Test_Data!$H$55=\"\",\"\",Test_Data!$H$55)","v":"Laboratory"},{"$f":"IF(Test_Data!$L$56=\"\",\"\",Test_Data!$L$56)","v":"1(3)"}]
[337,{"$f":"IF(Test_Data!$N$60=\"\",\"\",Test_Data!$N$60)","v":""},{"$f":"IF(Test_Data!$B$54=\"\",\"\",Test_Data!$B$54)","v":"DETERMINING DENSITY & PROPERTIES OF BITUMINOUS MIXTURES-Tex-207-F"},{"$f":"IF(Test_Data!$B$60=\"\",\"\",Test_Data!$B$60)","v":"Wt of Spec. in Water (g):"},{"$f":"IF(Test_Data!$N$55=\"\",\"\",Test_Data!$N$55)","v":"Roadway"},{"$f":"IF(Test_Data!$N$56=\"\",\"\",Test_Data!$N$56)","v":"1(A)"}]
[338,{"$f":"IF(Test_Data!$P$60=\"\",\"\",Test_Data!$P$60)","v":""},{"$f":"IF(Test_Data!$B$54=\"\",\"\",Test_Data!$B$54)","v":"DETERMINING DENSITY & PROPERTIES OF BITUMINOUS MIXTURES-Tex-207-F"},{"$f":"IF(Test_Data!$B$60=\"\",\"\",Test_Data!$B$60)","v":"Wt of Spec. in Water (g):"},{"$f":"IF(Test_Data!$N$55=\"\",\"\",Test_Data!$N$55)","v":"Roadway"},{"$f":"IF(Test_Data!$P$56=\"\",\"\",Test_Data!$P$56)","v":"1(B)"}]
[339,{"$f":"IF(Test_Data!$R$60=\"\",\"\",Test_Data!$R$60)","v":""},{"$f":"IF(Test_Data!$B$54=\"\",\"\",Test_Data!$B$54)","v":"DETERMINING DENSITY & PROPERTIES OF BITUMINOUS MIXTURES-Tex-207-F"},{"$f":"IF(Test_Data!$B$60=\"\",\"\",Test_Data!$B$60)","v":"Wt of Spec. in Water (g):"},{"$f":"IF(Test_Data!$N$55=\"\",\"\",Test_Data!$N$55)","v":"Roadway"},{"$f":"IF(Test_Data!$R$56=\"\",\"\",Test_Data!$R$56)","v":"1(C)"}]
[340,{"$f":"IF(Test_Data!$H$61=\"\",\"\",Test_Data!$H$61)","v":""},{"$f":"IF(Test_Data!$B$54=\"\",\"\",Test_Data!$B$54)","v":"DETERMINING DENSITY & PROPERTIES OF BITUMINOUS MIXTURES-Tex-207-F"},{"$f":"IF(Test_Data!$B$61=\"\",\"\",Test_Data!$B$61)","v":"SSD Wt of Specimen in Air (g):"},{"$f":"IF(Test_Data!$H$55=\"\",\"\",Test_Data!$H$55)","v":"Laboratory"},{"$f":"IF(Test_Data!$H$56=\"\",\"\",Test_Data!$H$56)","v":"1(1)"}]
[341,{"$f":"IF(Test_Data!$J$61=\"\",\"\",Test_Data!$J$61)","v":""},{"$f":"IF(Test_Data!$B$54=\"\",\"\",Test_Data!$B$54)","v":"DETERMINING DENSITY & PROPERTIES OF BITUMINOUS MIXTURES-Tex-207-F"},{"$f":"IF(Test_Data!$B$61=\"\",\"\",Test_Data!$B$61)","v":"SSD Wt of Specimen in Air (g):"},{"$f":"IF(Test_Data!$H$55=\"\",\"\",Test_Data!$H$55)","v":"Laboratory"},{"$f":"IF(Test_Data!$J$56=\"\",\"\",Test_Data!$J$56)","v":"1(2)"}]
[342,{"$f":"IF(Test_Data!$L$61=\"\",\"\",Test_Data!$L$61)","v":""},{"$f":"IF(Test_Data!$B$54=\"\",\"\",Test_Data!$B$54)","v":"DETERMINING DENSITY & PROPERTIES OF BITUMINOUS MIXTURES-Tex-207-F"},{"$f":"IF(Test_Data!$B$61=\"\",\"\",Test_Data!$B$61)","v":"SSD Wt of Specimen in Air (g):"},{"$f":"IF(Test_Data!$H$55=\"\",\"\",Test_Data!$H$55)","v":"Laboratory"},{"$f":"IF(Test_Data!$L$56=\"\",\"\",Test_Data!$L$56)","v":"1(3)"}]
[343,{"$f":"IF(Test_Data!$N$61=\"\",\"\",Test_Data!$N$61)","v":""},{"$f":"IF(Test_Data!$B$54=\"\",\"\",Test_Data!$B$54)","v":"DETERMINING DENSITY & PROPERTIES OF BITUMINOUS MIXTURES-Tex-207-F"},{"$f":"IF(Test_Data!$B$61=\"\",\"\",Test_Data!$B$61)","v":"SSD Wt of Specimen in Air (g):"},{"$f":"IF(Test_Data!$N$55=\"\",\"\",Test_Data!$N$55)","v":"Roadway"},{"$f":"IF(Test_Data!$N$56=\"\",\"\",Test_Data!$N$56)","v":"1(A)"}]
[344,{"$f":"IF(Test_Data!$P$61=\"\",\"\",Test_Data!$P$61)","v":""},{"$f":"IF(Test_Data!$B$54=\"\",\"\",Test_Data!$B$54)","v":"DETERMINING DENSITY & PROPERTIES OF BITUMINOUS MIXTURES-Tex-207-F"},{"$f":"IF(Test_Data!$B$61=\"\",\"\",Test_Data!$B$61)","v":"SSD Wt of Specimen in Air (g):"},{"$f":"IF(Test_Data!$N$55=\"\",\"\",Test_Data!$N$55)","v":"Roadway"},{"$f":"IF(Test_Data!$P$56=\"\",\"\",Test_Data!$P$56)","v":"1(B)"}]
[345,{"$f":"IF(Test_Data!$R$61=\"\",\"\",Test_Data!$R$61)","v":""},{"$f":"IF(Test_Data!$B$54=\"\",\"\",Test_Data!$B$54)","v":"DETERMINING DENSITY & PROPERTIES OF BITUMINOUS MIXTURES-Tex-207-F"},{"$f":"IF(Test_Data!$B$61=\"\",\"\",Test_Data!$B$61)","v":"SSD Wt of Specimen in Air (g):"},{"$f":"IF(Test_Data!$N$55=\"\",\"\",Test_Data!$N$55)","v":"Roadway"},{"$f":"IF(Test_Data!$R$56=\"\",\"\",Test_Data!$R$56)","v":"1(C)"}]
[346,{"$f":"IF(Test_Data!$H$62=\"\",\"\",Test_Data!$H$62)","v":""},{"$f":"IF(Test_Data!$B$54=\"\",\"\",Test_Data!$B$54)","v":"DETERMINING DENSITY & PROPERTIES OF BITUMINOUS MIXTURES-Tex-207-F"},{"$f":"IF(Test_Data!$B$62=\"\",\"\",Test_Data!$B$62)","v":"Volume of Specimen:"},{"$f":"IF(Test_Data!$H$55=\"\",\"\",Test_Data!$H$55)","v":"Laboratory"},{"$f":"IF(Test_Data!$H$56=\"\",\"\",Test_Data!$H$56)","v":"1(1)"}]
[347,{"$f":"IF(Test_Data!$J$62=\"\",\"\",Test_Data!$J$62)","v":""},{"$f":"IF(Test_Data!$B$54=\"\",\"\",Test_Data!$B$54)","v":"DETERMINING DENSITY & PROPERTIES OF BITUMINOUS MIXTURES-Tex-207-F"},{"$f":"IF(Test_Data!$B$62=\"\",\"\",Test_Data!$B$62)","v":"Volume of Specimen:"},{"$f":"IF(Test_Data!$H$55=\"\",\"\",Test_Data!$H$55)","v":"Laboratory"},{"$f":"IF(Test_Data!$J$56=\"\",\"\",Test_Data!$J$56)","v":"1(2)"}]
[348,{"$f":"IF(Test_Data!$L$62=\"\",\"\",Test_Data!$L$62)","v":""},{"$f":"IF(Test_Data!$B$54=\"\",\"\",Test_Data!$B$54)","v":"DETERMINING DENSITY & PROPERTIES OF BITUMINOUS MIXTURES-Tex-207-F"},{"$f":"IF(Test_Data!$B$62=\"\",\"\",Test_Data!$B$62)","v":"Volume of Specimen:"},{"$f":"IF(Test_Data!$H$55=\"\",\"\",Test_Data!$H$55)","v":"Laboratory"},{"$f":"IF(Test_Data!$L$56=\"\",\"\",Test_Data!$L$56)","v":"1(3)"}]
[349,{"$f":"IF(Test_Data!$N$62=\"\",\"\",Test_Data!$N$62)","v":""},{"$f":"IF(Test_Data!$B$54=\"\",\"\",Test_Data!$B$54)","v":"DETERMINING DENSITY & PROPERTIES OF BITUMINOUS MIXTURES-Tex-207-F"},{"$f":"IF(Test_Data!$B$62=\"\",\"\",Test_Data!$B$62)","v":"Volume of Specimen:"},{"$f":"IF(Test_Data!$N$55=\"\",\"\",Test_Data!$N$55)","v":"Roadway"},{"$f":"IF(Test_Data!$N$56=\"\",\"\",Test_Data!$N$56)","v":"1(A)"}]
[350,{"$f":"IF(Test_Data!$P$62=\"\",\"\",Test_Data!$P$62)","v":""},{"$f":"IF(Test_Data!$B$54=\"\",\"\",Test_Data!$B$54)","v":"DETERMINING DENSITY & PROPERTIES OF BITUMINOUS MIXTURES-Tex-207-F"},{"$f":"IF(Test_Data!$B$62=\"\",\"\",Test_Data!$B$62)","v":"Volume of Specimen:"},{"$f":"IF(Test_Data!$N$55=\"\",\"\",Test_Data!$N$55)","v":"Roadway"},{"$f":"IF(Test_Data!$P$56=\"\",\"\",Test_Data!$P$56)","v":"1(B)"}]
[351,{"$f":"IF(Test_Data!$R$62=\"\",\"\",Test_Data!$R$62)","v":""},{"$f":"IF(Test_Data!$B$54=\"\",\"\",Test_Data!$B$54)","v":"DETERMINING DENSITY & PROPERTIES OF BITUMINOUS MIXTURES-Tex-207-F"},{"$f":"IF(Test_Data!$B$62=\"\",\"\",Test_Data!$B$62)","v":"Volume of Specimen:"},{"$f":"IF(Test_Data!$N$55=\"\",\"\",Test_Data!$N$55)","v":"Roadway"},{"$f":"IF(Test_Data!$R$56=\"\",\"\",Test_Data!$R$56)","v":"1(C)"}]
[352,{"$f":"IF(Test_Data!$H$63=\"\",\"\",Test_Data!$H$63)","v":""},{"$f":"IF(Test_Data!$B$54=\"\",\"\",Test_Data!$B$54)","v":"DETERMINING DENSITY & PROPERTIES OF BITUMINOUS MIXTURES-Tex-207-F"},{"$f":"IF(Test_Data!$B$63=\"\",\"\",Test_Data!$B$63)","v":"Percent Absorption:"},{"$f":"IF(Test_Data!$H$55=\"\",\"\",Test_Data!$H$55)","v":"Laboratory"},{"$f":"IF(Test_Data!$H$56=\"\",\"\",Test_Data!$H$56)","v":"1(1)"}]
[353,{"$f":"IF(Test_Data!$J$63=\"\",\"\",Test_Data!$J$63)","v":""},{"$f":"IF(Test_Data!$B$54=\"\",\"\",Test_Data!$B$54)","v":"DETERMINING DENSITY & PROPERTIES OF BITUMINOUS MIXTURES-Tex-207-F"},{"$f":"IF(Test_Data!$B$63=\"\",\"\",Test_Data!$B$63)","v":"Percent Absorption:"},{"$f":"IF(Test_Data!$H$55=\"\",\"\",Test_Data!$H$55)","v":"Laboratory"},{"$f":"IF(Test_Data!$J$56=\"\",\"\",Test_Data!$J$56)","v":"1(2)"}]
[354,{"$f":"IF(Test_Data!$L$63=\"\",\"\",Test_Data!$L$63)","v":""},{"$f":"IF(Test_Data!$B$54=\"\",\"\",Test_Data!$B$54)","v":"DETERMINING DENSITY & PROPERTIES OF BITUMINOUS MIXTURES-Tex-207-F"},{"$f":"IF(Test_Data!$B$63=\"\",\"\",Test_Data!$B$63)","v":"Percent Absorption:"},{"$f":"IF(Test_Data!$H$55=\"\",\"\",Test_Data!$H$55)","v":"Laboratory"},{"$f":"IF(Test_Data!$L$56=\"\",\"\",Test_Data!$L$56)","v":"1(3)"}]
[355,{"$f":"IF(Test_Data!$N$63=\"\",\"\",Test_Data!$N$63)","v":""},{"$f":"IF(Test_Data!$B$54=\"\",\"\",Test_Data!$B$54)","v":"DETERMINING DENSITY & PROPERTIES OF BITUMINOUS MIXTURES-Tex-207-F"},{"$f":"IF(Test_Data!$B$63=\"\",\"\",Test_Data!$B$63)","v":"Percent Absorption:"},{"$f":"IF(Test_Data!$N$55=\"\",\"\",Test_Data!$N$55)","v":"Roadway"},{"$f":"IF(Test_Data!$N$56=\"\",\"\",Test_Data!$N$56)","v":"1(A)"}]
[356,{"$f":"IF(Test_Data!$P$63=\"\",\"\",Test_Data!$P$63)","v":""},{"$f":"IF(Test_Data!$B$54=\"\",\"\",Test_Data!$B$54)","v":"DETERMINING DENSITY & PROPERTIES OF BITUMINOUS MIXTURES-Tex-207-F"},{"$f":"IF(Test_Data!$B$63=\"\",\"\",Test_Data!$B$63)","v":"Percent Absorption:"},{"$f":"IF(Test_Data!$N$55=\"\",\"\",Test_Data!$N$55)","v":"Roadway"},{"$f":"IF(Test_Data!$P$56=\"\",\"\",Test_Data!$P$56)","v":"1(B)"}]
[357,{"$f":"IF(Test_Data!$R$63=\"\",\"\",Test_Data!$R$63)","v":""},{"$f":"IF(Test_Data!$B$54=\"\",\"\",Test_Data!$B$54)","v":"DETERMINING DENSITY & PROPERTIES OF BITUMINOUS MIXTURES-Tex-207-F"},{"$f":"IF(Test_Data!$B$63=\"\",\"\",Test_Data!$B$63)","v":"Percent Absorption:"},{"$f":"IF(Test_Data!$N$55=\"\",\"\",Test_Data!$N$55)","v":"Roadway"},{"$f":"IF(Test_Data!$R$56=\"\",\"\",Test_Data!$R$56)","v":"1(C)"}]
[358,{"$f":"IF(Test_Data!$H$64=\"\",\"\",Test_Data!$H$64)","v":""},{"$f":"IF(Test_Data!$B$54=\"\",\"\",Test_Data!$B$54)","v":"DETERMINING DENSITY & PROPERTIES OF BITUMINOUS MIXTURES-Tex-207-F"},{"$f":"IF(Test_Data!$B$64=\"\",\"\",Test_Data!$B$64)","v":"Bag Required for Ga ?:"},{"$f":"IF(Test_Data!$H$55=\"\",\"\",Test_Data!$H$55)","v":"Laboratory"},{"$f":"IF(Test_Data!$H$56=\"\",\"\",Test_Data!$H$56)","v":"1(1)"}]
[359,{"$f":"IF(Test_Data!$J$64=\"\",\"\",Test_Data!$J$64)","v":""},{"$f":"IF(Test_Data!$B$54=\"\",\"\",Test_Data!$B$54)","v":"DETERMINING DENSITY & PROPERTIES OF BITUMINOUS MIXTURES-Tex-207-F"},{"$f":"IF(Test_Data!$B$64=\"\",\"\",Test_Data!$B$64)","v":"Bag Required for Ga ?:"},{"$f":"IF(Test_Data!$H$55=\"\",\"\",Test_Data!$H$55)","v":"Laboratory"},{"$f":"IF(Test_Data!$J$56=\"\",\"\",Test_Data!$J$56)","v":"1(2)"}]
[360,{"$f":"IF(Test_Data!$L$64=\"\",\"\",Test_Data!$L$64)","v":""},{"$f":"IF(Test_Data!$B$54=\"\",\"\",Test_Data!$B$54)","v":"DETERMINING DENSITY & PROPERTIES OF BITUMINOUS MIXTURES-Tex-207-F"},{"$f":"IF(Test_Data!$B$64=\"\",\"\",Test_Data!$B$64)","v":"Bag Required for Ga ?:"},{"$f":"IF(Test_Data!$H$55=\"\",\"\",Test_Data!$H$55)","v":"Laboratory"},{"$f":"IF(Test_Data!$L$56=\"\",\"\",Test_Data!$L$56)","v":"1(3)"}]
[361,{"$f":"IF(Test_Data!$N$64=\"\",\"\",Test_Data!$N$64)","v":""},{"$f":"IF(Test_Data!$B$54=\"\",\"\",Test_Data!$B$54)","v":"DETERMINING DENSITY & PROPERTIES OF BITUMINOUS MIXTURES-Tex-207-F"},{"$f":"IF(Test_Data!$B$64=\"\",\"\",Test_Data!$B$64)","v":"Bag Required for Ga ?:"},{"$f":"IF(Test_Data!$N$55=\"\",\"\",Test_Data!$N$55)","v":"Roadway"},{"$f":"IF(Test_Data!$N$56=\"\",\"\",Test_Data!$N$56)","v":"1(A)"}]
[362,{"$f":"IF(Test_Data!$P$64=\"\",\"\",Test_Data!$P$64)","v":""},{"$f":"IF(Test_Data!$B$54=\"\",\"\",Test_Data!$B$54)","v":"DETERMINING DENSITY & PROPERTIES OF BITUMINOUS MIXTURES-Tex-207-F"},{"$f":"IF(Test_Data!$B$64=\"\",\"\",Test_Data!$B$64)","v":"Bag Required for Ga ?:"},{"$f":"IF(Test_Data!$N$55=\"\",\"\",Test_Data!$N$55)","v":"Roadway"},{"$f":"IF(Test_Data!$P$56=\"\",\"\",Test_Data!$P$56)","v":"1(B)"}]
[363,{"$f":"IF(Test_Data!$R$64=\"\",\"\",Test_Data!$R$64)","v":""},{"$f":"IF(Test_Data!$B$54=\"\",\"\",Test_Data!$B$54)","v":"DETERMINING DENSITY & PROPERTIES OF BITUMINOUS MIXTURES-Tex-207-F"},{"$f":"IF(Test_Data!$B$64=\"\",\"\",Test_Data!$B$64)","v":"Bag Required for Ga ?:"},{"$f":"IF(Test_Data!$N$55=\"\",\"\",Test_Data!$N$55)","v":"Roadway"},{"$f":"IF(Test_Data!$R$56=\"\",\"\",Test_Data!$R$56)","v":"1(C)"}]
[364,{"$f":"IF(Test_Data!$H$65=\"\",\"\",Test_Data!$H$65)","v":""},{"$f":"IF(Test_Data!$B$54=\"\",\"\",Test_Data!$B$54)","v":"DETERMINING DENSITY & PROPERTIES OF BITUMINOUS MIXTURES-Tex-207-F"},{"$f":"IF(Test_Data!$B$65=\"\",\"\",Test_Data!$B$65)","v":"Bag Used for Ga?:"},{"$f":"IF(Test_Data!$H$55=\"\",\"\",Test_Data!$H$55)","v":"Laboratory"},{"$f":"IF(Test_Data!$H$56=\"\",\"\",Test_Data!$H$56)","v":"1(1)"}]
[365,{"$f":"IF(Test_Data!$J$65=\"\",\"\",Test_Data!$J$65)","v":""},{"$f":"IF(Test_Data!$B$54=\"\",\"\",Test_Data!$B$54)","v":"DETERMINING DENSITY & PROPERTIES OF BITUMINOUS MIXTURES-Tex-207-F"},{"$f":"IF(Test_Data!$B$65=\"\",\"\",Test_Data!$B$65)","v":"Bag Used for Ga?:"},{"$f":"IF(Test_Data!$H$55=\"\",\"\",Test_Data!$H$55)","v":"Laboratory"},{"$f":"IF(Test_Data!$J$56=\"\",\"\",Test_Data!$J$56)","v":"1(2)"}]
[366,{"$f":"IF(Test_Data!$L$65=\"\",\"\",Test_Data!$L$65)","v":""},{"$f":"IF(Test_Data!$B$54=\"\",\"\",Test_Data!$B$54)","v":"DETERMINING DENSITY & PROPERTIES OF BITUMINOUS MIXTURES-Tex-207-F"},{"$f":"IF(Test_Data!$B$65=\"\",\"\",Test_Data!$B$65)","v":"Bag Used for Ga?:"},{"$f":"IF(Test_Data!$H$55=\"\",\"\",Test_Data!$H$55)","v":"Laboratory"},{"$f":"IF(Test_Data!$L$56=\"\",\"\",Test_Data!$L$56)","v":"1(3)"}]
[367,{"$f":"IF(Test_Data!$N$65=\"\",\"\",Test_Data!$N$65)","v":""},{"$f":"IF(Test_Data!$B$54=\"\",\"\",Test_Data!$B$54)","v":"DETERMINING DENSITY & PROPERTIES OF BITUMINOUS MIXTURES-Tex-207-F"},{"$f":"IF(Test_Data!$B$65=\"\",\"\",Test_Data!$B$65)","v":"Bag Used for Ga?:"},{"$f":"IF(Test_Data!$N$55=\"\",\"\",Test_Data!$N$55)","v":"Roadway"},{"$f":"IF(Test_Data!$N$56=\"\",\"\",Test_Data!$N$56)","v":"1(A)"}]
[368,{"$f":"IF(Test_Data!$P$65=\"\",\"\",Test_Data!$P$65)","v":""},{"$f":"IF(Test_Data!$B$54=\"\",\"\",Test_Data!$B$54)","v":"DETERMINING DENSITY & PROPERTIES OF BITUMINOUS MIXTURES-Tex-207-F"},{"$f":"IF(Test_Data!$B$65=\"\",\"\",Test_Data!$B$65)","v":"Bag Used for Ga?:"},{"$f":"IF(Test_Data!$N$55=\"\",\"\",Test_Data!$N$55)","v":"Roadway"},{"$f":"IF(Test_Data!$P$56=\"\",\"\",Test_Data!$P$56)","v":"1(B)"}]
[369,{"$f":"IF(Test_Data!$R$65=\"\",\"\",Test_Data!$R$65)","v":""},{"$f":"IF(Test_Data!$B$54=\"\",\"\",Test_Data!$B$54)","v":"DETERMINING DENSITY & PROPERTIES OF BITUMINOUS MIXTURES-Tex-207-F"},{"$f":"IF(Test_Data!$B$65=\"\",\"\",Test_Data!$B$65)","v":"Bag Used for Ga?:"},{"$f":"IF(Test_Data!$N$55=\"\",\"\",Test_Data!$N$55)","v":"Roadway"},{"$f":"IF(Test_Data!$R$56=\"\",\"\",Test_Data!$R$56)","v":"1(C)"}]
[370,{"$f":"IF(Test_Data!$H$67=\"\",\"\",Test_Data!$H$67)","v":""},{"$f":"IF(Test_Data!$B$54=\"\",\"\",Test_Data!$B$54)","v":"DETERMINING DENSITY & PROPERTIES OF BITUMINOUS MIXTURES-Tex-207-F"},{"$f":"IF(Test_Data!$B$67=\"\",\"\",Test_Data!$B$67)","v":"Vacuum Bag Method Used:"},{"$f":"IF(Test_Data!$H$55=\"\",\"\",Test_Data!$H$55)","v":"Laboratory"},{"$f":"IF(Test_Data!$H$56=\"\",\"\",Test_Data!$H$56)","v":"1(1)"}]
[371,{"$f":"IF(Test_Data!$J$67=\"\",\"\",Test_Data!$J$67)","v":""},{"$f":"IF(Test_Data!$B$54=\"\",\"\",Test_Data!$B$54)","v":"DETERMINING DENSITY & PROPERTIES OF BITUMINOUS MIXTURES-Tex-207-F"},{"$f":"IF(Test_Data!$B$67=\"\",\"\",Test_Data!$B$67)","v":"Vacuum Bag Method Used:"},{"$f":"IF(Test_Data!$H$55=\"\",\"\",Test_Data!$H$55)","v":"Laboratory"},{"$f":"IF(Test_Data!$J$56=\"\",\"\",Test_Data!$J$56)","v":"1(2)"}]
[372,{"$f":"IF(Test_Data!$L$67=\"\",\"\",Test_Data!$L$67)","v":""},{"$f":"IF(Test_Data!$B$54=\"\",\"\",Test_Data!$B$54)","v":"DETERMINING DENSITY & PROPERTIES OF BITUMINOUS MIXTURES-Tex-207-F"},{"$f":"IF(Test_Data!$B$67=\"\",\"\",Test_Data!$B$67)","v":"Vacuum Bag Method Used:"},{"$f":"IF(Test_Data!$H$55=\"\",\"\",Test_Data!$H$55)","v":"Laboratory"},{"$f":"IF(Test_Data!$L$56=\"\",\"\",Test_Data!$L$56)","v":"1(3)"}]
[373,{"$f":"IF(Test_Data!$N$67=\"\",\"\",Test_Data!$N$67)","v":""},{"$f":"IF(Test_Data!$B$54=\"\",\"\",Test_Data!$B$54)","v":"DETERMINING DENSITY & PROPERTIES OF BITUMINOUS MIXTURES-Tex-207-F"},{"$f":"IF(Test_Data!$B$67=\"\",\"\",Test_Data!$B$67)","v":"Vacuum Bag Method Used:"},{"$f":"IF(Test_Data!$N$55=\"\",\"\",Test_Data!$N$55)","v":"Roadway"},{"$f":"IF(Test_Data!$N$56=\"\",\"\",Test_Data!$N$56)","v":"1(A)"}]
[374,{"$f":"IF(Test_Data!$P$67=\"\",\"\",Test_Data!$P$67)","v":""},{"$f":"IF(Test_Data!$B$54=\"\",\"\",Test_Data!$B$54)","v":"DETERMINING DENSITY & PROPERTIES OF BITUMINOUS MIXTURES-Tex-207-F"},{"$f":"IF(Test_Data!$B$67=\"\",\"\",Test_Data!$B$67)","v":"Vacuum Bag Method Used:"},{"$f":"IF(Test_Data!$N$55=\"\",\"\",Test_Data!$N$55)","v":"Roadway"},{"$f":"IF(Test_Data!$P$56=\"\",\"\",Test_Data!$P$56)","v":"1(B)"}]
[375,{"$f":"IF(Test_Data!$R$67=\"\",\"\",Test_Data!$R$67)","v":""},{"$f":"IF(Test_Data!$B$54=\"\",\"\",Test_Data!$B$54)","v":"DETERMINING DENSITY & PROPERTIES OF BITUMINOUS MIXTURES-Tex-207-F"},{"$f":"IF(Test_Data!$B$67=\"\",\"\",Test_Data!$B$67)","v":"Vacuum Bag Method Used:"},{"$f":"IF(Test_Data!$N$55=\"\",\"\",Test_Data!$N$55)","v":"Roadway"},{"$f":"IF(Test_Data!$R$56=\"\",\"\",Test_Data!$R$56)","v":"1(C)"}]
[376,{"$f":"IF(Test_Data!$H$69=\"\",\"\",Test_Data!$H$69)","v":""},{"$f":"IF(Test_Data!$B$54=\"\",\"\",Test_Data!$B$54)","v":"DETERMINING DENSITY & PROPERTIES OF BITUMINOUS MIXTURES-Tex-207-F"},{"$f":"IF(Test_Data!$B$69=\"\",\"\",Test_Data!$B$69)","v":"Weight of Specimen in Air (g):"},{"$f":"IF(Test_Data!$H$55=\"\",\"\",Test_Data!$H$55)","v":"Laboratory"},{"$f":"IF(Test_Data!$H$56=\"\",\"\",Test_Data!$H$56)","v":"1(1)"}]
[377,{"$f":"IF(Test_Data!$J$69=\"\",\"\",Test_Data!$J$69)","v":""},{"$f":"IF(Test_Data!$B$54=\"\",\"\",Test_Data!$B$54)","v":"DETERMINING DENSITY & PROPERTIES OF BITUMINOUS MIXTURES-Tex-207-F"},{"$f":"IF(Test_Data!$B$69=\"\",\"\",Test_Data!$B$69)","v":"Weight of Specimen in Air (g):"},{"$f":"IF(Test_Data!$H$55=\"\",\"\",Test_Data!$H$55)","v":"Laboratory"},{"$f":"IF(Test_Data!$J$56=\"\",\"\",Test_Data!$J$56)","v":"1(2)"}]
[378,{"$f":"IF(Test_Data!$L$69=\"\",\"\",Test_Data!$L$69)","v":""},{"$f":"IF(Test_Data!$B$54=\"\",\"\",Test_Data!$B$54)","v":"DETERMINING DENSITY & PROPERTIES OF BITUMINOUS MIXTURES-Tex-207-F"},{"$f":"IF(Test_Data!$B$69=\"\",\"\",Test_Data!$B$69)","v":"Weight of Specimen in Air (g):"},{"$f":"IF(Test_Data!$H$55=\"\",\"\",Test_Data!$H$55)","v":"Laboratory"},{"$f":"IF(Test_Data!$L$56=\"\",\"\",Test_Data!$L$56)","v":"1(3)"}]
[379,{"$f":"IF(Test_Data!$N$69=\"\",\"\",Test_Data!$N$69)","v":""},{"$f":"IF(Test_Data!$B$54=\"\",\"\",Test_Data!$B$54)","v":"DETERMINING DENSITY & PROPERTIES OF BITUMINOUS MIXTURES-Tex-207-F"},{"$f":"IF(Test_Data!$B$69=\"\",\"\",Test_Data!$B$69)","v":"Weight of Specimen in Air (g):"},{"$f":"IF(Test_Data!$N$55=\"\",\"\",Test_Data!$N$55)","v":"Roadway"},{"$f":"IF(Test_Data!$N$56=\"\",\"\",Test_Data!$N$56)","v":"1(A)"}]
[380,{"$f":"IF(Test_Data!$P$69=\"\",\"\",Test_Data!$P$69)","v":""},{"$f":"IF(Test_Data!$B$54=\"\",\"\",Test_Data!$B$54)","v":"DETERMINING DENSITY & PROPERTIES OF BITUMINOUS MIXTURES-Tex-207-F"},{"$f":"IF(Test_Data!$B$69=\"\",\"\",Test_Data!$B$69)","v":"Weight of Specimen in Air (g):"},{"$f":"IF(Test_Data!$N$55=\"\",\"\",Test_Data!$N$55)","v":"Roadway"},{"$f":"IF(Test_Data!$P$56=\"\",\"\",Test_Data!$P$56)","v":"1(B)"}]
[381,{"$f":"IF(Test_Data!$R$69=\"\",\"\",Test_Data!$R$69)","v":""},{"$f":"IF(Test_Data!$B$54=\"\",\"\",Test_Data!$B$54)","v":"DETERMINING DENSITY & PROPERTIES OF BITUMINOUS MIXTURES-Tex-207-F"},{"$f":"IF(Test_Data!$B$69=\"\",\"\",Test_Data!$B$69)","v":"Weight of Specimen in Air (g):"},{"$f":"IF(Test_Data!$N$55=\"\",\"\",Test_Data!$N$55)","v":"Roadway"},{"$f":"IF(Test_Data!$R$56=\"\",\"\",Test_Data!$R$56)","v":"1(C)"}]
[382,{"$f":"IF(Test_Data!$H$70=\"\",\"\",Test_Data!$H$70)","v":""},{"$f":"IF(Test_Data!$B$54=\"\",\"\",Test_Data!$B$54)","v":"DETERMINING DENSITY & PROPERTIES OF BITUMINOUS MIXTURES-Tex-207-F"},{"$f":"IF(Test_Data!$B$70=\"\",\"\",Test_Data!$B$70)","v":"Sealed Wt. of Specimen in Water (g):"},{"$f":"IF(Test_Data!$H$55=\"\",\"\",Test_Data!$H$55)","v":"Laboratory"},{"$f":"IF(Test_Data!$H$56=\"\",\"\",Test_Data!$H$56)","v":"1(1)"}]
[383,{"$f":"IF(Test_Data!$J$70=\"\",\"\",Test_Data!$J$70)","v":""},{"$f":"IF(Test_Data!$B$54=\"\",\"\",Test_Data!$B$54)","v":"DETERMINING DENSITY & PROPERTIES OF BITUMINOUS MIXTURES-Tex-207-F"},{"$f":"IF(Test_Data!$B$70=\"\",\"\",Test_Data!$B$70)","v":"Sealed Wt. of Specimen in Water (g):"},{"$f":"IF(Test_Data!$H$55=\"\",\"\",Test_Data!$H$55)","v":"Laboratory"},{"$f":"IF(Test_Data!$J$56=\"\",\"\",Test_Data!$J$56)","v":"1(2)"}]
[384,{"$f":"IF(Test_Data!$L$70=\"\",\"\",Test_Data!$L$70)","v":""},{"$f":"IF(Test_Data!$B$54=\"\",\"\",Test_Data!$B$54)","v":"DETERMINING DENSITY & PROPERTIES OF BITUMINOUS MIXTURES-Tex-207-F"},{"$f":"IF(Test_Data!$B$70=\"\",\"\",Test_Data!$B$70)","v":"Sealed Wt. of Specimen in Water (g):"},{"$f":"IF(Test_Data!$H$55=\"\",\"\",Test_Data!$H$55)","v":"Laboratory"},{"$f":"IF(Test_Data!$L$56=\"\",\"\",Test_Data!$L$56)","v":"1(3)"}]
[385,{"$f":"IF(Test_Data!$N$70=\"\",\"\",Test_Data!$N$70)","v":""},{"$f":"IF(Test_Data!$B$54=\"\",\"\",Test_Data!$B$54)","v":"DETERMINING DENSITY & PROPERTIES OF BITUMINOUS MIXTURES-Tex-207-F"},{"$f":"IF(Test_Data!$B$70=\"\",\"\",Test_Data!$B$70)","v":"Sealed Wt. of Specimen in Water (g):"},{"$f":"IF(Test_Data!$N$55=\"\",\"\",Test_Data!$N$55)","v":"Roadway"},{"$f":"IF(Test_Data!$N$56=\"\",\"\",Test_Data!$N$56)","v":"1(A)"}]
[386,{"$f":"IF(Test_Data!$P$70=\"\",\"\",Test_Data!$P$70)","v":""},{"$f":"IF(Test_Data!$B$54=\"\",\"\",Test_Data!$B$54)","v":"DETERMINING DENSITY & PROPERTIES OF BITUMINOUS MIXTURES-Tex-207-F"},{"$f":"IF(Test_Data!$B$70=\"\",\"\",Test_Data!$B$70)","v":"Sealed Wt. of Specimen in Water (g):"},{"$f":"IF(Test_Data!$N$55=\"\",\"\",Test_Data!$N$55)","v":"Roadway"},{"$f":"IF(Test_Data!$P$56=\"\",\"\",Test_Data!$P$56)","v":"1(B)"}]
[387,{"$f":"IF(Test_Data!$R$70=\"\",\"\",Test_Data!$R$70)","v":""},{"$f":"IF(Test_Data!$B$54=\"\",\"\",Test_Data!$B$54)","v":"DETERMINING DENSITY & PROPERTIES OF BITUMINOUS MIXTURES-Tex-207-F"},{"$f":"IF(Test_Data!$B$70=\"\",\"\",Test_Data!$B$70)","v":"Sealed Wt. of Specimen in Water (g):"},{"$f":"IF(Test_Data!$N$55=\"\",\"\",Test_Data!$N$55)","v":"Roadway"},{"$f":"IF(Test_Data!$R$56=\"\",\"\",Test_Data!$R$56)","v":"1(C)"}]
[388,{"$f":"IF(Test_Data!$H$71=\"\",\"\",Test_Data!$H$71)","v":""},{"$f":"IF(Test_Data!$B$54=\"\",\"\",Test_Data!$B$54)","v":"DETERMINING DENSITY & PROPERTIES OF BITUMINOUS MIXTURES-Tex-207-F"},{"$f":"IF(Test_Data!$B$71=\"\",\"\",Test_Data!$B$71)","v":"Dry Spec. Wt. After Submersion, (g):"},{"$f":"IF(Test_Data!$H$55=\"\",\"\",Test_Data!$H$55)","v":"Laboratory"},{"$f":"IF(Test_Data!$H$56=\"\",\"\",Test_Data!$H$56)","v":"1(1)"}]
[389,{"$f":"IF(Test_Data!$J$71=\"\",\"\",Test_Data!$J$71)","v":""},{"$f":"IF(Test_Data!$B$54=\"\",\"\",Test_Data!$B$54)","v":"DETERMINING DENSITY & PROPERTIES OF BITUMINOUS MIXTURES-Tex-207-F"},{"$f":"IF(Test_Data!$B$71=\"\",\"\",Test_Data!$B$71)","v":"Dry Spec. Wt. After Submersion, (g):"},{"$f":"IF(Test_Data!$H$55=\"\",\"\",Test_Data!$H$55)","v":"Laboratory"},{"$f":"IF(Test_Data!$J$56=\"\",\"\",Test_Data!$J$56)","v":"1(2)"}]
[390,{"$f":"IF(Test_Data!$L$71=\"\",\"\",Test_Data!$L$71)","v":""},{"$f":"IF(Test_Data!$B$54=\"\",\"\",Test_Data!$B$54)","v":"DETERMINING DENSITY & PROPERTIES OF BITUMINOUS MIXTURES-Tex-207-F"},{"$f":"IF(Test_Data!$B$71=\"\",\"\",Test_Data!$B$71)","v":"Dry Spec. Wt. After Submersion, (g):"},{"$f":"IF(Test_Data!$H$55=\"\",\"\",Test_Data!$H$55)","v":"Laboratory"},{"$f":"IF(Test_Data!$L$56=\"\",\"\",Test_Data!$L$56)","v":"1(3)"}]
[391,{"$f":"IF(Test_Data!$N$71=\"\",\"\",Test_Data!$N$71)","v":""},{"$f":"IF(Test_Data!$B$54=\"\",\"\",Test_Data!$B$54)","v":"DETERMINING DENSITY & PROPERTIES OF BITUMINOUS MIXTURES-Tex-207-F"},{"$f":"IF(Test_Data!$B$71=\"\",\"\",Test_Data!$B$71)","v":"Dry Spec. Wt. After Submersion, (g):"},{"$f":"IF(Test_Data!$N$55=\"\",\"\",Test_Data!$N$55)","v":"Roadway"},{"$f":"IF(Test_Data!$N$56=\"\",\"\",Test_Data!$N$56)","v":"1(A)"}]
[392,{"$f":"IF(Test_Data!$P$71=\"\",\"\",Test_Data!$P$71)","v":""},{"$f":"IF(Test_Data!$B$54=\"\",\"\",Test_Data!$B$54)","v":"DETERMINING DENSITY & PROPERTIES OF BITUMINOUS MIXTURES-Tex-207-F"},{"$f":"IF(Test_Data!$B$71=\"\",\"\",Test_Data!$B$71)","v":"Dry Spec. Wt. After Submersion, (g):"},{"$f":"IF(Test_Data!$N$55=\"\",\"\",Test_Data!$N$55)","v":"Roadway"},{"$f":"IF(Test_Data!$P$56=\"\",\"\",Test_Data!$P$56)","v":"1(B)"}]
[393,{"$f":"IF(Test_Data!$R$71=\"\",\"\",Test_Data!$R$71)","v":""},{"$f":"IF(Test_Data!$B$54=\"\",\"\",Test_Data!$B$54)","v":"DETERMINING DENSITY & PROPERTIES OF BITUMINOUS MIXTURES-Tex-207-F"},{"$f":"IF(Test_Data!$B$71=\"\",\"\",Test_Data!$B$71)","v":"Dry Spec. Wt. After Submersion, (g):"},{"$f":"IF(Test_Data!$N$55=\"\",\"\",Test_Data!$N$55)","v":"Roadway"},{"$f":"IF(Test_Data!$R$56=\"\",\"\",Test_Data!$R$56)","v":"1(C)"}]
[394,{"$f":"IF(Test_Data!$H$72=\"\",\"\",Test_Data!$H$72)","v":""},{"$f":"IF(Test_Data!$B$54=\"\",\"\",Test_Data!$B$54)","v":"DETERMINING DENSITY & PROPERTIES OF BITUMINOUS MIXTURES-Tex-207-F"},{"$f":"IF(Test_Data!$B$72=\"\",\"\",Test_Data!$B$72)","v":"Paraffin Sealed Wt. of Spec. in Air (g):"},{"$f":"IF(Test_Data!$H$55=\"\",\"\",Test_Data!$H$55)","v":"Laboratory"},{"$f":"IF(Test_Data!$H$56=\"\",\"\",Test_Data!$H$56)","v":"1(1)"}]
[395,{"$f":"IF(Test_Data!$J$72=\"\",\"\",Test_Data!$J$72)","v":""},{"$f":"IF(Test_Data!$B$54=\"\",\"\",Test_Data!$B$54)","v":"DETERMINING DENSITY & PROPERTIES OF BITUMINOUS MIXTURES-Tex-207-F"},{"$f":"IF(Test_Data!$B$72=\"\",\"\",Test_Data!$B$72)","v":"Paraffin Sealed Wt. of Spec. in Air (g):"},{"$f":"IF(Test_Data!$H$55=\"\",\"\",Test_Data!$H$55)","v":"Laboratory"},{"$f":"IF(Test_Data!$J$56=\"\",\"\",Test_Data!$J$56)","v":"1(2)"}]
[396,{"$f":"IF(Test_Data!$L$72=\"\",\"\",Test_Data!$L$72)","v":""},{"$f":"IF(Test_Data!$B$54=\"\",\"\",Test_Data!$B$54)","v":"DETERMINING DENSITY & PROPERTIES OF BITUMINOUS MIXTURES-Tex-207-F"},{"$f":"IF(Test_Data!$B$72=\"\",\"\",Test_Data!$B$72)","v":"Paraffin Sealed Wt. of Spec. in Air (g):"},{"$f":"IF(Test_Data!$H$55=\"\",\"\",Test_Data!$H$55)","v":"Laboratory"},{"$f":"IF(Test_Data!$L$56=\"\",\"\",Test_Data!$L$56)","v":"1(3)"}]
[397,{"$f":"IF(Test_Data!$N$72=\"\",\"\",Test_Data!$N$72)","v":""},{"$f":"IF(Test_Data!$B$54=\"\",\"\",Test_Data!$B$54)","v":"DETERMINING DENSITY & PROPERTIES OF BITUMINOUS MIXTURES-Tex-207-F"},{"$f":"IF(Test_Data!$B$72=\"\",\"\",Test_Data!$B$72)","v":"Paraffin Sealed Wt. of Spec. in Air (g):"},{"$f":"IF(Test_Data!$N$55=\"\",\"\",Test_Data!$N$55)","v":"Roadway"},{"$f":"IF(Test_Data!$N$56=\"\",\"\",Test_Data!$N$56)","v":"1(A)"}]
[398,{"$f":"IF(Test_Data!$P$72=\"\",\"\",Test_Data!$P$72)","v":""},{"$f":"IF(Test_Data!$B$54=\"\",\"\",Test_Data!$B$54)","v":"DETERMINING DENSITY & PROPERTIES OF BITUMINOUS MIXTURES-Tex-207-F"},{"$f":"IF(Test_Data!$B$72=\"\",\"\",Test_Data!$B$72)","v":"Paraffin Sealed Wt. of Spec. in Air (g):"},{"$f":"IF(Test_Data!$N$55=\"\",\"\",Test_Data!$N$55)","v":"Roadway"},{"$f":"IF(Test_Data!$P$56=\"\",\"\",Test_Data!$P$56)","v":"1(B)"}]
[399,{"$f":"IF(Test_Data!$R$72=\"\",\"\",Test_Data!$R$72)","v":""},{"$f":"IF(Test_Data!$B$54=\"\",\"\",Test_Data!$B$54)","v":"DETERMINING DENSITY & PROPERTIES OF BITUMINOUS MIXTURES-Tex-207-F"},{"$f":"IF(Test_Data!$B$72=\"\",\"\",Test_Data!$B$72)","v":"Paraffin Sealed Wt. of Spec. in Air (g):"},{"$f":"IF(Test_Data!$N$55=\"\",\"\",Test_Data!$N$55)","v":"Roadway"},{"$f":"IF(Test_Data!$R$56=\"\",\"\",Test_Data!$R$56)","v":"1(C)"}]
[400,{"$f":"IF(Test_Data!$H$73=\"\",\"\",Test_Data!$H$73)","v":""},{"$f":"IF(Test_Data!$B$54=\"\",\"\",Test_Data!$B$54)","v":"DETERMINING DENSITY & PROPERTIES OF BITUMINOUS MIXTURES-Tex-207-F"},{"$f":"IF(Test_Data!$B$73=\"\",\"\",Test_Data!$B$73)","v":"Specific Gravity of Paraffin:"},{"$f":"IF(Test_Data!$H$55=\"\",\"\",Test_Data!$H$55)","v":"Laboratory"},{"$f":"IF(Test_Data!$H$56=\"\",\"\",Test_Data!$H$56)","v":"1(1)"}]
[401,{"$f":"IF(Test_Data!$J$73=\"\",\"\",Test_Data!$J$73)","v":""},{"$f":"IF(Test_Data!$B$54=\"\",\"\",Test_Data!$B$54)","v":"DETERMINING DENSITY & PROPERTIES OF BITUMINOUS MIXTURES-Tex-207-F"},{"$f":"IF(Test_Data!$B$73=\"\",\"\",Test_Data!$B$73)","v":"Specific Gravity of Paraffin:"},{"$f":"IF(Test_Data!$H$55=\"\",\"\",Test_Data!$H$55)","v":"Laboratory"},{"$f":"IF(Test_Data!$J$56=\"\",\"\",Test_Data!$J$56)","v":"1(2)"}]
[402,{"$f":"IF(Test_Data!$L$73=\"\",\"\",Test_Data!$L$73)","v":""},{"$f":"IF(Test_Data!$B$54=\"\",\"\",Test_Data!$B$54)","v":"DETERMINING DENSITY & PROPERTIES OF BITUMINOUS MIXTURES-Tex-207-F"},{"$f":"IF(Test_Data!$B$73=\"\",\"\",Test_Data!$B$73)","v":"Specific Gravity of Paraffin:"},{"$f":"IF(Test_Data!$H$55=\"\",\"\",Test_Data!$H$55)","v":"Laboratory"},{"$f":"IF(Test_Data!$L$56=\"\",\"\",Test_Data!$L$56)","v":"1(3)"}]
[403,{"$f":"IF(Test_Data!$N$73=\"\",\"\",Test_Data!$N$73)","v":""},{"$f":"IF(Test_Data!$B$54=\"\",\"\",Test_Data!$B$54)","v":"DETERMINING DENSITY & PROPERTIES OF BITUMINOUS MIXTURES-Tex-207-F"},{"$f":"IF(Test_Data!$B$73=\"\",\"\",Test_Data!$B$73)","v":"Specific Gravity of Paraffin:"},{"$f":"IF(Test_Data!$N$55=\"\",\"\",Test_Data!$N$55)","v":"Roadway"},{"$f":"IF(Test_Data!$N$56=\"\",\"\",Test_Data!$N$56)","v":"1(A)"}]
[404,{"$f":"IF(Test_Data!$P$73=\"\",\"\",Test_Data!$P$73)","v":""},{"$f":"IF(Test_Data!$B$54=\"\",\"\",Test_Data!$B$54)","v":"DETERMINING DENSITY & PROPERTIES OF BITUMINOUS MIXTURES-Tex-207-F"},{"$f":"IF(Test_Data!$B$73=\"\",\"\",Test_Data!$B$73)","v":"Specific Gravity of Paraffin:"},{"$f":"IF(Test_Data!$N$55=\"\",\"\",Test_Data!$N$55)","v":"Roadway"},{"$f":"IF(Test_Data!$P$56=\"\",\"\",Test_Data!$P$56)","v":"1(B)"}]
[405,{"$f":"IF(Test_Data!$R$73=\"\",\"\",Test_Data!$R$73)","v":""},{"$f":"IF(Test_Data!$B$54=\"\",\"\",Test_Data!$B$54)","v":"DETERMINING DENSITY & PROPERTIES OF BITUMINOUS MIXTURES-Tex-207-F"},{"$f":"IF(Test_Data!$B$73=\"\",\"\",Test_Data!$B$73)","v":"Specific Gravity of Paraffin:"},{"$f":"IF(Test_Data!$N$55=\"\",\"\",Test_Data!$N$55)","v":"Roadway"},{"$f":"IF(Test_Data!$R$56=\"\",\"\",Test_Data!$R$56)","v":"1(C)"}]
[406,{"$f":"IF(Test_Data!$H$74=\"\",\"\",Test_Data!$H$74)","v":""},{"$f":"IF(Test_Data!$B$54=\"\",\"\",Test_Data!$B$54)","v":"DETERMINING DENSITY & PROPERTIES OF BITUMINOUS MIXTURES-Tex-207-F"},{"$f":"IF(Test_Data!$B$74=\"\",\"\",Test_Data!$B$74)","v":"Weight of Vacuum Bag(s), (g):"},{"$f":"IF(Test_Data!$H$55=\"\",\"\",Test_Data!$H$55)","v":"Laboratory"},{"$f":"IF(Test_Data!$H$56=\"\",\"\",Test_Data!$H$56)","v":"1(1)"}]
[407,{"$f":"IF(Test_Data!$J$74=\"\",\"\",Test_Data!$J$74)","v":""},{"$f":"IF(Test_Data!$B$54=\"\",\"\",Test_Data!$B$54)","v":"DETERMINING DENSITY & PROPERTIES OF BITUMINOUS MIXTURES-Tex-207-F"},{"$f":"IF(Test_Data!$B$74=\"\",\"\",Test_Data!$B$74)","v":"Weight of Vacuum Bag(s), (g):"},{"$f":"IF(Test_Data!$H$55=\"\",\"\",Test_Data!$H$55)","v":"Laboratory"},{"$f":"IF(Test_Data!$J$56=\"\",\"\",Test_Data!$J$56)","v":"1(2)"}]
[408,{"$f":"IF(Test_Data!$L$74=\"\",\"\",Test_Data!$L$74)","v":""},{"$f":"IF(Test_Data!$B$54=\"\",\"\",Test_Data!$B$54)","v":"DETERMINING DENSITY & PROPERTIES OF BITUMINOUS MIXTURES-Tex-207-F"},{"$f":"IF(Test_Data!$B$74=\"\",\"\",Test_Data!$B$74)","v":"Weight of Vacuum Bag(s), (g):"},{"$f":"IF(Test_Data!$H$55=\"\",\"\",Test_Data!$H$55)","v":"Laboratory"},{"$f":"IF(Test_Data!$L$56=\"\",\"\",Test_Data!$L$56)","v":"1(3)"}]
[409,{"$f":"IF(Test_Data!$N$74=\"\",\"\",Test_Data!$N$74)","v":""},{"$f":"IF(Test_Data!$B$54=\"\",\"\",Test_Data!$B$54)","v":"DETERMINING DENSITY & PROPERTIES OF BITUMINOUS MIXTURES-Tex-207-F"},{"$f":"IF(Test_Data!$B$74=\"\",\"\",Test_Data!$B$74)","v":"Weight of Vacuum Bag(s), (g):"},{"$f":"IF(Test_Data!$N$55=\"\",\"\",Test_Data!$N$55)","v":"Roadway"},{"$f":"IF(Test_Data!$N$56=\"\",\"\",Test_Data!$N$56)","v":"1(A)"}]
[410,{"$f":"IF(Test_Data!$P$74=\"\",\"\",Test_Data!$P$74)","v":""},{"$f":"IF(Test_Data!$B$54=\"\",\"\",Test_Data!$B$54)","v":"DETERMINING DENSITY & PROPERTIES OF BITUMINOUS MIXTURES-Tex-207-F"},{"$f":"IF(Test_Data!$B$74=\"\",\"\",Test_Data!$B$74)","v":"Weight of Vacuum Bag(s), (g):"},{"$f":"IF(Test_Data!$N$55=\"\",\"\",Test_Data!$N$55)","v":"Roadway"},{"$f":"IF(Test_Data!$P$56=\"\",\"\",Test_Data!$P$56)","v":"1(B)"}]
[411,{"$f":"IF(Test_Data!$R$74=\"\",\"\",Test_Data!$R$74)","v":""},{"$f":"IF(Test_Data!$B$54=\"\",\"\",Test_Data!$B$54)","v":"DETERMINING DENSITY & PROPERTIES OF BITUMINOUS MIXTURES-Tex-207-F"},{"$f":"IF(Test_Data!$B$74=\"\",\"\",Test_Data!$B$74)","v":"Weight of Vacuum Bag(s), (g):"},{"$f":"IF(Test_Data!$N$55=\"\",\"\",Test_Data!$N$55)","v":"Roadway"},{"$f":"IF(Test_Data!$R$56=\"\",\"\",Test_Data!$R$56)","v":"1(C)"}]
[412,{"$f":"IF(Test_Data!$H$75=\"\",\"\",Test_Data!$H$75)","v":""},{"$f":"IF(Test_Data!$B$54=\"\",\"\",Test_Data!$B$54)","v":"DETERMINING DENSITY & PROPERTIES OF BITUMINOUS MIXTURES-Tex-207-F"},{"$f":"IF(Test_Data!$B$75=\"\",\"\",Test_Data!$B$75)","v":"Vacuum Bag Volume Correction Factor:"},{"$f":"IF(Test_Data!$H$55=\"\",\"\",Test_Data!$H$55)","v":"Laboratory"},{"$f":"IF(Test_Data!$H$56=\"\",\"\",Test_Data!$H$56)","v":"1(1)"}]
[413,{"$f":"IF(Test_Data!$J$75=\"\",\"\",Test_Data!$J$75)","v":""},{"$f":"IF(Test_Data!$B$54=\"\",\"\",Test_Data!$B$54)","v":"DETERMINING DENSITY & PROPERTIES OF BITUMINOUS MIXTURES-Tex-207-F"},{"$f":"IF(Test_Data!$B$75=\"\",\"\",Test_Data!$B$75)","v":"Vacuum Bag Volume Correction Factor:"},{"$f":"IF(Test_Data!$H$55=\"\",\"\",Test_Data!$H$55)","v":"Laboratory"},{"$f":"IF(Test_Data!$J$56=\"\",\"\",Test_Data!$J$56)","v":"1(2)"}]
[414,{"$f":"IF(Test_Data!$L$75=\"\",\"\",Test_Data!$L$75)","v":""},{"$f":"IF(Test_Data!$B$54=\"\",\"\",Test_Data!$B$54)","v":"DETERMINING DENSITY & PROPERTIES OF BITUMINOUS MIXTURES-Tex-207-F"},{"$f":"IF(Test_Data!$B$75=\"\",\"\",Test_Data!$B$75)","v":"Vacuum Bag Volume Correction Factor:"},{"$f":"IF(Test_Data!$H$55=\"\",\"\",Test_Data!$H$55)","v":"Laboratory"},{"$f":"IF(Test_Data!$L$56=\"\",\"\",Test_Data!$L$56)","v":"1(3)"}]
[415,{"$f":"IF(Test_Data!$N$75=\"\",\"\",Test_Data!$N$75)","v":""},{"$f":"IF(Test_Data!$B$54=\"\",\"\",Test_Data!$B$54)","v":"DETERMINING DENSITY & PROPERTIES OF BITUMINOUS MIXTURES-Tex-207-F"},{"$f":"IF(Test_Data!$B$75=\"\",\"\",Test_Data!$B$75)","v":"Vacuum Bag Volume Correction Factor:"},{"$f":"IF(Test_Data!$N$55=\"\",\"\",Test_Data!$N$55)","v":"Roadway"},{"$f":"IF(Test_Data!$N$56=\"\",\"\",Test_Data!$N$56)","v":"1(A)"}]
[416,{"$f":"IF(Test_Data!$P$75=\"\",\"\",Test_Data!$P$75)","v":""},{"$f":"IF(Test_Data!$B$54=\"\",\"\",Test_Data!$B$54)","v":"DETERMINING DENSITY & PROPERTIES OF BITUMINOUS MIXTURES-Tex-207-F"},{"$f":"IF(Test_Data!$B$75=\"\",\"\",Test_Data!$B$75)","v":"Vacuum Bag Volume Correction Factor:"},{"$f":"IF(Test_Data!$N$55=\"\",\"\",Test_Data!$N$55)","v":"Roadway"},{"$f":"IF(Test_Data!$P$56=\"\",\"\",Test_Data!$P$56)","v":"1(B)"}]
[417,{"$f":"IF(Test_Data!$R$75=\"\",\"\",Test_Data!$R$75)","v":""},{"$f":"IF(Test_Data!$B$54=\"\",\"\",Test_Data!$B$54)","v":"DETERMINING DENSITY & PROPERTIES OF BITUMINOUS MIXTURES-Tex-207-F"},{"$f":"IF(Test_Data!$B$75=\"\",\"\",Test_Data!$B$75)","v":"Vacuum Bag Volume Correction Factor:"},{"$f":"IF(Test_Data!$N$55=\"\",\"\",Test_Data!$N$55)","v":"Roadway"},{"$f":"IF(Test_Data!$R$56=\"\",\"\",Test_Data!$R$56)","v":"1(C)"}]
[418,{"$f":"IF(Test_Data!$H$77=\"\",\"\",Test_Data!$H$77)","v":""},{"$f":"IF(Test_Data!$B$54=\"\",\"\",Test_Data!$B$54)","v":"DETERMINING DENSITY & PROPERTIES OF BITUMINOUS MIXTURES-Tex-207-F"},{"$f":"IF(Test_Data!$B$77=\"\",\"\",Test_Data!$B$77)","v":"Rice Specific Gravity (Gr):"},{"$f":"IF(Test_Data!$H$55=\"\",\"\",Test_Data!$H$55)","v":"Laboratory"},{"$f":"IF(Test_Data!$H$56=\"\",\"\",Test_Data!$H$56)","v":"1(1)"}]
[419,{"$f":"IF(Test_Data!$J$77=\"\",\"\",Test_Data!$J$77)","v":""},{"$f":"IF(Test_Data!$B$54=\"\",\"\",Test_Data!$B$54)","v":"DETERMINING DENSITY & PROPERTIES OF BITUMINOUS MIXTURES-Tex-207-F"},{"$f":"IF(Test_Data!$B$77=\"\",\"\",Test_Data!$B$77)","v":"Rice Specific Gravity (Gr):"},{"$f":"IF(Test_Data!$H$55=\"\",\"\",Test_Data!$H$55)","v":"Laboratory"},{"$f":"IF(Test_Data!$J$56=\"\",\"\",Test_Data!$J$56)","v":"1(2)"}]
[420,{"$f":"IF(Test_Data!$L$77=\"\",\"\",Test_Data!$L$77)","v":""},{"$f":"IF(Test_Data!$B$54=\"\",\"\",Test_Data!$B$54)","v":"DETERMINING DENSITY & PROPERTIES OF BITUMINOUS MIXTURES-Tex-207-F"},{"$f":"IF(Test_Data!$B$77=\"\",\"\",Test_Data!$B$77)","v":"Rice Specific Gravity (Gr):"},{"$f":"IF(Test_Data!$H$55=\"\",\"\",Test_Data!$H$55)","v":"Laboratory"},{"$f":"IF(Test_Data!$L$56=\"\",\"\",Test_Data!$L$56)","v":"1(3)"}]
[421,{"$f":"IF(Test_Data!$N$77=\"\",\"\",Test_Data!$N$77)","v":""},{"$f":"IF(Test_Data!$B$54=\"\",\"\",Test_Data!$B$54)","v":"DETERMINING DENSITY & PROPERTIES OF BITUMINOUS MIXTURES-Tex-207-F"},{"$f":"IF(Test_Data!$B$77=\"\",\"\",Test_Data!$B$77)","v":"Rice Specific Gravity (Gr):"},{"$f":"IF(Test_Data!$N$55=\"\",\"\",Test_Data!$N$55)","v":"Roadway"},{"$f":"IF(Test_Data!$N$56=\"\",\"\",Test_Data!$N$56)","v":"1(A)"}]
[422,{"$f":"IF(Test_Data!$P$77=\"\",\"\",Test_Data!$P$77)","v":""},{"$f":"IF(Test_Data!$B$54=\"\",\"\",Test_Data!$B$54)","v":"DETERMINING DENSITY & PROPERTIES OF BITUMINOUS MIXTURES-Tex-207-F"},{"$f":"IF(Test_Data!$B$77=\"\",\"\",Test_Data!$B$77)","v":"Rice Specific Gravity (Gr):"},{"$f":"IF(Test_Data!$N$55=\"\",\"\",Test_Data!$N$55)","v":"Roadway"},{"$f":"IF(Test_Data!$P$56=\"\",\"\",Test_Data!$P$56)","v":"1(B)"}]
[423,{"$f":"IF(Test_Data!$R$77=\"\",\"\",Test_Data!$R$77)","v":""},{"$f":"IF(Test_Data!$B$54=\"\",\"\",Test_Data!$B$54)","v":"DETERMINING DENSITY & PROPERTIES OF BITUMINOUS MIXTURES-Tex-207-F"},{"$f":"IF(Test_Data!$B$77=\"\",\"\",Test_Data!$B$77)","v":"Rice Specific Gravity (Gr):"},{"$f":"IF(Test_Data!$N$55=\"\",\"\",Test_Data!$N$55)","v":"Roadway"},{"$f":"IF(Test_Data!$R$56=\"\",\"\",Test_Data!$R$56)","v":"1(C)"}]
[424,{"$f":"IF(Test_Data!$H$78=\"\",\"\",Test_Data!$H$78)","v":""},{"$f":"IF(Test_Data!$B$54=\"\",\"\",Test_Data!$B$54)","v":"DETERMINING DENSITY & PROPERTIES OF BITUMINOUS MIXTURES-Tex-207-F"},{"$f":"IF(Test_Data!$B$78=\"\",\"\",Test_Data!$B$78)","v":"Bulk Specific Gravity, Ga:"},{"$f":"IF(Test_Data!$H$55=\"\",\"\",Test_Data!$H$55)","v":"Laboratory"},{"$f":"IF(Test_Data!$H$56=\"\",\"\",Test_Data!$H$56)","v":"1(1)"}]
[425,{"$f":"IF(Test_Data!$J$78=\"\",\"\",Test_Data!$J$78)","v":""},{"$f":"IF(Test_Data!$B$54=\"\",\"\",Test_Data!$B$54)","v":"DETERMINING DENSITY & PROPERTIES OF BITUMINOUS MIXTURES-Tex-207-F"},{"$f":"IF(Test_Data!$B$78=\"\",\"\",Test_Data!$B$78)","v":"Bulk Specific Gravity, Ga:"},{"$f":"IF(Test_Data!$H$55=\"\",\"\",Test_Data!$H$55)","v":"Laboratory"},{"$f":"IF(Test_Data!$J$56=\"\",\"\",Test_Data!$J$56)","v":"1(2)"}]
[426,{"$f":"IF(Test_Data!$L$78=\"\",\"\",Test_Data!$L$78)","v":""},{"$f":"IF(Test_Data!$B$54=\"\",\"\",Test_Data!$B$54)","v":"DETERMINING DENSITY & PROPERTIES OF BITUMINOUS MIXTURES-Tex-207-F"},{"$f":"IF(Test_Data!$B$78=\"\",\"\",Test_Data!$B$78)","v":"Bulk Specific Gravity, Ga:"},{"$f":"IF(Test_Data!$H$55=\"\",\"\",Test_Data!$H$55)","v":"Laboratory"},{"$f":"IF(Test_Data!$L$56=\"\",\"\",Test_Data!$L$56)","v":"1(3)"}]
[427,{"$f":"IF(Test_Data!$N$78=\"\",\"\",Test_Data!$N$78)","v":""},{"$f":"IF(Test_Data!$B$54=\"\",\"\",Test_Data!$B$54)","v":"DETERMINING DENSITY & PROPERTIES OF BITUMINOUS MIXTURES-Tex-207-F"},{"$f":"IF(Test_Data!$B$78=\"\",\"\",Test_Data!$B$78)","v":"Bulk Specific Gravity, Ga:"},{"$f":"IF(Test_Data!$N$55=\"\",\"\",Test_Data!$N$55)","v":"Roadway"},{"$f":"IF(Test_Data!$N$56=\"\",\"\",Test_Data!$N$56)","v":"1(A)"}]
[428,{"$f":"IF(Test_Data!$P$78=\"\",\"\",Test_Data!$P$78)","v":""},{"$f":"IF(Test_Data!$B$54=\"\",\"\",Test_Data!$B$54)","v":"DETERMINING DENSITY & PROPERTIES OF BITUMINOUS MIXTURES-Tex-207-F"},{"$f":"IF(Test_Data!$B$78=\"\",\"\",Test_Data!$B$78)","v":"Bulk Specific Gravity, Ga:"},{"$f":"IF(Test_Data!$N$55=\"\",\"\",Test_Data!$N$55)","v":"Roadway"},{"$f":"IF(Test_Data!$P$56=\"\",\"\",Test_Data!$P$56)","v":"1(B)"}]
[429,{"$f":"IF(Test_Data!$R$78=\"\",\"\",Test_Data!$R$78)","v":""},{"$f":"IF(Test_Data!$B$54=\"\",\"\",Test_Data!$B$54)","v":"DETERMINING DENSITY & PROPERTIES OF BITUMINOUS MIXTURES-Tex-207-F"},{"$f":"IF(Test_Data!$B$78=\"\",\"\",Test_Data!$B$78)","v":"Bulk Specific Gravity, Ga:"},{"$f":"IF(Test_Data!$N$55=\"\",\"\",Test_Data!$N$55)","v":"Roadway"},{"$f":"IF(Test_Data!$R$56=\"\",\"\",Test_Data!$R$56)","v":"1(C)"}]
[430,{"$f":"IF(Test_Data!$H$79=\"\",\"\",Test_Data!$H$79)","v":""},{"$f":"IF(Test_Data!$B$54=\"\",\"\",Test_Data!$B$54)","v":"DETERMINING DENSITY & PROPERTIES OF BITUMINOUS MIXTURES-Tex-207-F"},{"$f":"IF(Test_Data!$B$79=\"\",\"\",Test_Data!$B$79)","v":"Percent Density:"},{"$f":"IF(Test_Data!$H$55=\"\",\"\",Test_Data!$H$55)","v":"Laboratory"},{"$f":"IF(Test_Data!$H$56=\"\",\"\",Test_Data!$H$56)","v":"1(1)"}]
[431,{"$f":"IF(Test_Data!$J$79=\"\",\"\",Test_Data!$J$79)","v":""},{"$f":"IF(Test_Data!$B$54=\"\",\"\",Test_Data!$B$54)","v":"DETERMINING DENSITY & PROPERTIES OF BITUMINOUS MIXTURES-Tex-207-F"},{"$f":"IF(Test_Data!$B$79=\"\",\"\",Test_Data!$B$79)","v":"Percent Density:"},{"$f":"IF(Test_Data!$H$55=\"\",\"\",Test_Data!$H$55)","v":"Laboratory"},{"$f":"IF(Test_Data!$J$56=\"\",\"\",Test_Data!$J$56)","v":"1(2)"}]
[432,{"$f":"IF(Test_Data!$L$79=\"\",\"\",Test_Data!$L$79)","v":""},{"$f":"IF(Test_Data!$B$54=\"\",\"\",Test_Data!$B$54)","v":"DETERMINING DENSITY & PROPERTIES OF BITUMINOUS MIXTURES-Tex-207-F"},{"$f":"IF(Test_Data!$B$79=\"\",\"\",Test_Data!$B$79)","v":"Percent Density:"},{"$f":"IF(Test_Data!$H$55=\"\",\"\",Test_Data!$H$55)","v":"Laboratory"},{"$f":"IF(Test_Data!$L$56=\"\",\"\",Test_Data!$L$56)","v":"1(3)"}]
[433,{"$f":"IF(Test_Data!$N$79=\"\",\"\",Test_Data!$N$79)","v":""},{"$f":"IF(Test_Data!$B$54=\"\",\"\",Test_Data!$B$54)","v":"DETERMINING DENSITY & PROPERTIES OF BITUMINOUS MIXTURES-Tex-207-F"},{"$f":"IF(Test_Data!$B$79=\"\",\"\",Test_Data!$B$79)","v":"Percent Density:"},{"$f":"IF(Test_Data!$N$55=\"\",\"\",Test_Data!$N$55)","v":"Roadway"},{"$f":"IF(Test_Data!$N$56=\"\",\"\",Test_Data!$N$56)","v":"1(A)"}]
[434,{"$f":"IF(Test_Data!$P$79=\"\",\"\",Test_Data!$P$79)","v":""},{"$f":"IF(Test_Data!$B$54=\"\",\"\",Test_Data!$B$54)","v":"DETERMINING DENSITY & PROPERTIES OF BITUMINOUS MIXTURES-Tex-207-F"},{"$f":"IF(Test_Data!$B$79=\"\",\"\",Test_Data!$B$79)","v":"Percent Density:"},{"$f":"IF(Test_Data!$N$55=\"\",\"\",Test_Data!$N$55)","v":"Roadway"},{"$f":"IF(Test_Data!$P$56=\"\",\"\",Test_Data!$P$56)","v":"1(B)"}]
[435,{"$f":"IF(Test_Data!$R$79=\"\",\"\",Test_Data!$R$79)","v":""},{"$f":"IF(Test_Data!$B$54=\"\",\"\",Test_Data!$B$54)","v":"DETERMINING DENSITY & PROPERTIES OF BITUMINOUS MIXTURES-Tex-207-F"},{"$f":"IF(Test_Data!$B$79=\"\",\"\",Test_Data!$B$79)","v":"Percent Density:"},{"$f":"IF(Test_Data!$N$55=\"\",\"\",Test_Data!$N$55)","v":"Roadway"},{"$f":"IF(Test_Data!$R$56=\"\",\"\",Test_Data!$R$56)","v":"1(C)"}]
[436,{"$f":"IF(Test_Data!$H$80=\"\",\"\",Test_Data!$H$80)","v":""},{"$f":"IF(Test_Data!$B$54=\"\",\"\",Test_Data!$B$54)","v":"DETERMINING DENSITY & PROPERTIES OF BITUMINOUS MIXTURES-Tex-207-F"},{"$f":"IF(Test_Data!$B$80=\"\",\"\",Test_Data!$B$80)","v":"Percent Air Voids:"},{"$f":"IF(Test_Data!$H$55=\"\",\"\",Test_Data!$H$55)","v":"Laboratory"},{"$f":"IF(Test_Data!$H$56=\"\",\"\",Test_Data!$H$56)","v":"1(1)"}]
[437,{"$f":"IF(Test_Data!$J$80=\"\",\"\",Test_Data!$J$80)","v":""},{"$f":"IF(Test_Data!$B$54=\"\",\"\",Test_Data!$B$54)","v":"DETERMINING DENSITY & PROPERTIES OF BITUMINOUS MIXTURES-Tex-207-F"},{"$f":"IF(Test_Data!$B$80=\"\",\"\",Test_Data!$B$80)","v":"Percent Air Voids:"},{"$f":"IF(Test_Data!$H$55=\"\",\"\",Test_Data!$H$55)","v":"Laboratory"},{"$f":"IF(Test_Data!$J$56=\"\",\"\",Test_Data!$J$56)","v":"1(2)"}]
[438,{"$f":"IF(Test_Data!$L$80=\"\",\"\",Test_Data!$L$80)","v":""},{"$f":"IF(Test_Data!$B$54=\"\",\"\",Test_Data!$B$54)","v":"DETERMINING DENSITY & PROPERTIES OF BITUMINOUS MIXTURES-Tex-207-F"},{"$f":"IF(Test_Data!$B$80=\"\",\"\",Test_Data!$B$80)","v":"Percent Air Voids:"},{"$f":"IF(Test_Data!$H$55=\"\",\"\",Test_Data!$H$55)","v":"Laboratory"},{"$f":"IF(Test_Data!$L$56=\"\",\"\",Test_Data!$L$56)","v":"1(3)"}]
[439,{"$f":"IF(Test_Data!$N$80=\"\",\"\",Test_Data!$N$80)","v":""},{"$f":"IF(Test_Data!$B$54=\"\",\"\",Test_Data!$B$54)","v":"DETERMINING DENSITY & PROPERTIES OF BITUMINOUS MIXTURES-Tex-207-F"},{"$f":"IF(Test_Data!$B$80=\"\",\"\",Test_Data!$B$80)","v":"Percent Air Voids:"},{"$f":"IF(Test_Data!$N$55=\"\",\"\",Test_Data!$N$55)","v":"Roadway"},{"$f":"IF(Test_Data!$N$56=\"\",\"\",Test_Data!$N$56)","v":"1(A)"}]
[440,{"$f":"IF(Test_Data!$P$80=\"\",\"\",Test_Data!$P$80)","v":""},{"$f":"IF(Test_Data!$B$54=\"\",\"\",Test_Data!$B$54)","v":"DETERMINING DENSITY & PROPERTIES OF BITUMINOUS MIXTURES-Tex-207-F"},{"$f":"IF(Test_Data!$B$80=\"\",\"\",Test_Data!$B$80)","v":"Percent Air Voids:"},{"$f":"IF(Test_Data!$N$55=\"\",\"\",Test_Data!$N$55)","v":"Roadway"},{"$f":"IF(Test_Data!$P$56=\"\",\"\",Test_Data!$P$56)","v":"1(B)"}]
[441,{"$f":"IF(Test_Data!$R$80=\"\",\"\",Test_Data!$R$80)","v":""},{"$f":"IF(Test_Data!$B$54=\"\",\"\",Test_Data!$B$54)","v":"DETERMINING DENSITY & PROPERTIES OF BITUMINOUS MIXTURES-Tex-207-F"},{"$f":"IF(Test_Data!$B$80=\"\",\"\",Test_Data!$B$80)","v":"Percent Air Voids:"},{"$f":"IF(Test_Data!$N$55=\"\",\"\",Test_Data!$N$55)","v":"Roadway"},{"$f":"IF(Test_Data!$R$56=\"\",\"\",Test_Data!$R$56)","v":"1(C)"}]
[442,{"$f":"IF(Test_Data!$H$81=\"\",\"\",Test_Data!$H$81)","v":""},{"$f":"IF(Test_Data!$B$54=\"\",\"\",Test_Data!$B$54)","v":"DETERMINING DENSITY & PROPERTIES OF BITUMINOUS MIXTURES-Tex-207-F"},{"$f":"IF(Test_Data!$B$81=\"\",\"\",Test_Data!$B$81)","v":"VMA:"},{"$f":"IF(Test_Data!$H$55=\"\",\"\",Test_Data!$H$55)","v":"Laboratory"},{"$f":"IF(Test_Data!$H$56=\"\",\"\",Test_Data!$H$56)","v":"1(1)"}]
[443,{"$f":"IF(Test_Data!$J$81=\"\",\"\",Test_Data!$J$81)","v":""},{"$f":"IF(Test_Data!$B$54=\"\",\"\",Test_Data!$B$54)","v":"DETERMINING DENSITY & PROPERTIES OF BITUMINOUS MIXTURES-Tex-207-F"},{"$f":"IF(Test_Data!$B$81=\"\",\"\",Test_Data!$B$81)","v":"VMA:"},{"$f":"IF(Test_Data!$H$55=\"\",\"\",Test_Data!$H$55)","v":"Laboratory"},{"$f":"IF(Test_Data!$J$56=\"\",\"\",Test_Data!$J$56)","v":"1(2)"}]
[444,{"$f":"IF(Test_Data!$L$81=\"\",\"\",Test_Data!$L$81)","v":""},{"$f":"IF(Test_Data!$B$54=\"\",\"\",Test_Data!$B$54)","v":"DETERMINING DENSITY & PROPERTIES OF BITUMINOUS MIXTURES-Tex-207-F"},{"$f":"IF(Test_Data!$B$81=\"\",\"\",Test_Data!$B$81)","v":"VMA:"},{"$f":"IF(Test_Data!$H$55=\"\",\"\",Test_Data!$H$55)","v":"Laboratory"},{"$f":"IF(Test_Data!$L$56=\"\",\"\",Test_Data!$L$56)","v":"1(3)"}]
[445,{"$f":"IF(Test_Data!$N$81=\"\",\"\",Test_Data!$N$81)","v":""},{"$f":"IF(Test_Data!$B$54=\"\",\"\",Test_Data!$B$54)","v":"DETERMINING DENSITY & PROPERTIES OF BITUMINOUS MIXTURES-Tex-207-F"},{"$f":"IF(Test_Data!$B$81=\"\",\"\",Test_Data!$B$81)","v":"VMA:"},{"$f":"IF(Test_Data!$N$55=\"\",\"\",Test_Data!$N$55)","v":"Roadway"},{"$f":"IF(Test_Data!$N$56=\"\",\"\",Test_Data!$N$56)","v":"1(A)"}]
[446,{"$f":"IF(Test_Data!$P$81=\"\",\"\",Test_Data!$P$81)","v":""},{"$f":"IF(Test_Data!$B$54=\"\",\"\",Test_Data!$B$54)","v":"DETERMINING DENSITY & PROPERTIES OF BITUMINOUS MIXTURES-Tex-207-F"},{"$f":"IF(Test_Data!$B$81=\"\",\"\",Test_Data!$B$81)","v":"VMA:"},{"$f":"IF(Test_Data!$N$55=\"\",\"\",Test_Data!$N$55)","v":"Roadway"},{"$f":"IF(Test_Data!$P$56=\"\",\"\",Test_Data!$P$56)","v":"1(B)"}]
[447,{"$f":"IF(Test_Data!$R$81=\"\",\"\",Test_Data!$R$81)","v":""},{"$f":"IF(Test_Data!$B$54=\"\",\"\",Test_Data!$B$54)","v":"DETERMINING DENSITY & PROPERTIES OF BITUMINOUS MIXTURES-Tex-207-F"},{"$f":"IF(Test_Data!$B$81=\"\",\"\",Test_Data!$B$81)","v":"VMA:"},{"$f":"IF(Test_Data!$N$55=\"\",\"\",Test_Data!$N$55)","v":"Roadway"},{"$f":"IF(Test_Data!$R$56=\"\",\"\",Test_Data!$R$56)","v":"1(C)"}]
[448,{"$f":"IF(Test_Data!$H$83=\"\",\"\",Test_Data!$H$83)","v":""},{"$f":"IF(Test_Data!$B$54=\"\",\"\",Test_Data!$B$54)","v":"DETERMINING DENSITY & PROPERTIES OF BITUMINOUS MIXTURES-Tex-207-F"},{"$f":"IF(Test_Data!$B$83=\"\",\"\",Test_Data!$B$83)","v":"Average % Density:"},{"$f":"IF(Test_Data!$H$55=\"\",\"\",Test_Data!$H$55)","v":"Laboratory"}]
[449,{"$f":"IF(Test_Data!$H$84=\"\",\"\",Test_Data!$H$84)","v":""},{"$f":"IF(Test_Data!$B$54=\"\",\"\",Test_Data!$B$54)","v":"DETERMINING DENSITY & PROPERTIES OF BITUMINOUS MIXTURES-Tex-207-F"},{"$f":"IF(Test_Data!$B$84=\"\",\"\",Test_Data!$B$84)","v":"Average Actual SG:"},{"$f":"IF(Test_Data!$H$55=\"\",\"\",Test_Data!$H$55)","v":"Laboratory"}]
[450,{"$f":"IF(Test_Data!$H$85=\"\",\"\",Test_Data!$H$85)","v":""},{"$f":"IF(Test_Data!$B$54=\"\",\"\",Test_Data!$B$54)","v":"DETERMINING DENSITY & PROPERTIES OF BITUMINOUS MIXTURES-Tex-207-F"},{"$f":"IF(Test_Data!$B$85=\"\",\"\",Test_Data!$B$85)","v":"Average % Air Voids:"},{"$f":"IF(Test_Data!$H$55=\"\",\"\",Test_Data!$H$55)","v":"Laboratory"}]
[451,{"$f":"IF(Test_Data!$H$86=\"\",\"\",Test_Data!$H$86)","v":""},{"$f":"IF(Test_Data!$B$54=\"\",\"\",Test_Data!$B$54)","v":"DETERMINING DENSITY & PROPERTIES OF BITUMINOUS MIXTURES-Tex-207-F"},{"$f":"IF(Test_Data!$B$86=\"\",\"\",Test_Data!$B$86)","v":"Average VMA:"},{"$f":"IF(Test_Data!$H$55=\"\",\"\",Test_Data!$H$55)","v":"Laboratory"}]
[452,{"$f":"IF(Test_Data!$N$83=\"\",\"\",Test_Data!$N$83)","v":""},{"$f":"IF(Test_Data!$B$54=\"\",\"\",Test_Data!$B$54)","v":"DETERMINING DENSITY & PROPERTIES OF BITUMINOUS MIXTURES-Tex-207-F"},{"$f":"IF(Test_Data!$B$83=\"\",\"\",Test_Data!$B$83)","v":"Average % Density:"},{"$f":"IF(Test_Data!$N$55=\"\",\"\",Test_Data!$N$55)","v":"Roadway"}]
[453,{"$f":"IF(Test_Data!$N$84=\"\",\"\",Test_Data!$N$84)","v":""},{"$f":"IF(Test_Data!$B$54=\"\",\"\",Test_Data!$B$54)","v":"DETERMINING DENSITY & PROPERTIES OF BITUMINOUS MIXTURES-Tex-207-F"},{"$f":"IF(Test_Data!$B$84=\"\",\"\",Test_Data!$B$84)","v":"Average Actual SG:"},{"$f":"IF(Test_Data!$N$55=\"\",\"\",Test_Data!$N$55)","v":"Roadway"}]
[454,{"$f":"IF(Test_Data!$N$85=\"\",\"\",Test_Data!$N$85)","v":""},{"$f":"IF(Test_Data!$B$54=\"\",\"\",Test_Data!$B$54)","v":"DETERMINING DENSITY & PROPERTIES OF BITUMINOUS MIXTURES-Tex-207-F"},{"$f":"IF(Test_Data!$B$85=\"\",\"\",Test_Data!$B$85)","v":"Average % Air Voids:"},{"$f":"IF(Test_Data!$N$55=\"\",\"\",Test_Data!$N$55)","v":"Roadway"}]
[455,{"$f":"IF(Test_Data!$N$86=\"\",\"\",Test_Data!$N$86)","v":""},{"$f":"IF(Test_Data!$B$54=\"\",\"\",Test_Data!$B$54)","v":"DETERMINING DENSITY & PROPERTIES OF BITUMINOUS MIXTURES-Tex-207-F"},{"$f":"IF(Test_Data!$B$86=\"\",\"\",Test_Data!$B$86)","v":"Average VMA:"},{"$f":"IF(Test_Data!$N$55=\"\",\"\",Test_Data!$N$55)","v":"Roadway"}]
[456,{"$f":"IF(Test_Data!$G$91=\"\",\"\",Test_Data!$G$91)","v":""},{"$f":"IF(Test_Data!$B$88=\"\",\"\",Test_Data!$B$88)","v":"PREDICTION OF MOISTURE-INDUCED DAMAGE TO BITUMINOUS PAVING MIXTURES - Tex-531-C"},{"$f":"IF(Test_Data!$B$91=\"\",\"\",Test_Data!$B$91)","v":"Specimen No."},{"$f":"IF(Test_Data!$G$89=\"\",\"\",Test_Data!$G$89)","v":"Conditioned"},{"$f":"IF(Test_Data!$G$90=\"\",\"\",Test_Data!$G$90)","v":1}]
[457,{"$f":"IF(Test_Data!$I$91=\"\",\"\",Test_Data!$I$91)","v":""},{"$f":"IF(Test_Data!$B$88=\"\",\"\",Test_Data!$B$88)","v":"PREDICTION OF MOISTURE-INDUCED DAMAGE TO BITUMINOUS PAVING MIXTURES - Tex-531-C"},{"$f":"IF(Test_Data!$B$91=\"\",\"\",Test_Data!$B$91)","v":"Specimen No."},{"$f":"IF(Test_Data!$G$89=\"\",\"\",Test_Data!$G$89)","v":"Conditioned"},{"$f":"IF(Test_Data!$I$90=\"\",\"\",Test_Data!$I$90)","v":2}]
[458,{"$f":"IF(Test_Data!$K$91=\"\",\"\",Test_Data!$K$91)","v":""},{"$f":"IF(Test_Data!$B$88=\"\",\"\",Test_Data!$B$88)","v":"PREDICTION OF MOISTURE-INDUCED DAMAGE TO BITUMINOUS PAVING MIXTURES - Tex-531-C"},{"$f":"IF(Test_Data!$B$91=\"\",\"\",Test_Data!$B$91)","v":"Specimen No."},{"$f":"IF(Test_Data!$G$89=\"\",\"\",Test_Data!$G$89)","v":"Conditioned"},{"$f":"IF(Test_Data!$K$90=\"\",\"\",Test_Data!$K$90)","v":3}]
[459,{"$f":"IF(Test_Data!$M$91=\"\",\"\",Test_Data!$M$91)","v":""},{"$f":"IF(Test_Data!$B$88=\"\",\"\",Test_Data!$B$88)","v":"PREDICTION OF MOISTURE-INDUCED DAMAGE TO BITUMINOUS PAVING MIXTURES - Tex-531-C"},{"$f":"IF(Test_Data!$B$91=\"\",\"\",Test_Data!$B$91)","v":"Specimen No."},{"$f":"IF(Test_Data!$G$89=\"\",\"\",Test_Data!$G$89)","v":"Conditioned"},{"$f":"IF(Test_Data!$M$90=\"\",\"\",Test_Data!$M$90)","v":4}]
[460,{"$f":"IF(Test_Data!$O$91=\"\",\"\",Test_Data!$O$91)","v":""},{"$f":"IF(Test_Data!$B$88=\"\",\"\",Test_Data!$B$88)","v":"PREDICTION OF MOISTURE-INDUCED DAMAGE TO BITUMINOUS PAVING MIXTURES - Tex-531-C"},{"$f":"IF(Test_Data!$B$91=\"\",\"\",Test_Data!$B$91)","v":"Specimen No."},{"$f":"IF(Test_Data!$O$89=\"\",\"\",Test_Data!$O$89)","v":"Dry"},{"$f":"IF(Test_Data!$O$90=\"\",\"\",Test_Data!$O$90)","v":1}]
[461,{"$f":"IF(Test_Data!$Q$91=\"\",\"\",Test_Data!$Q$91)","v":""},{"$f":"IF(Test_Data!$B$88=\"\",\"\",Test_Data!$B$88)","v":"PREDICTION OF MOISTURE-INDUCED DAMAGE TO BITUMINOUS PAVING MIXTURES - Tex-531-C"},{"$f":"IF(Test_Data!$B$91=\"\",\"\",Test_Data!$B$91)","v":"Specimen No."},{"$f":"IF(Test_Data!$O$89=\"\",\"\",Test_Data!$O$89)","v":"Dry"},{"$f":"IF(Test_Data!$Q$90=\"\",\"\",Test_Data!$Q$90)","v":2}]
[462,{"$f":"IF(Test_Data!$S$91=\"\",\"\",Test_Data!$S$91)","v":""},{"$f":"IF(Test_Data!$B$88=\"\",\"\",Test_Data!$B$88)","v":"PREDICTION OF MOISTURE-INDUCED DAMAGE TO BITUMINOUS PAVING MIXTURES - Tex-531-C"},{"$f":"IF(Test_Data!$B$91=\"\",\"\",Test_Data!$B$91)","v":"Specimen No."},{"$f":"IF(Test_Data!$O$89=\"\",\"\",Test_Data!$O$89)","v":"Dry"},{"$f":"IF(Test_Data!$S$90=\"\",\"\",Test_Data!$S$90)","v":3}]
[463,{"$f":"IF(Test_Data!$U$91=\"\",\"\",Test_Data!$U$91)","v":""},{"$f":"IF(Test_Data!$B$88=\"\",\"\",Test_Data!$B$88)","v":"PREDICTION OF MOISTURE-INDUCED DAMAGE TO BITUMINOUS PAVING MIXTURES - Tex-531-C"},{"$f":"IF(Test_Data!$B$91=\"\",\"\",Test_Data!$B$91)","v":"Specimen No."},{"$f":"IF(Test_Data!$O$89=\"\",\"\",Test_Data!$O$89)","v":"Dry"},{"$f":"IF(Test_Data!$U$90=\"\",\"\",Test_Data!$U$90)","v":4}]
[464,{"$f":"IF(Test_Data!$G$92=\"\",\"\",Test_Data!$G$92)","v":""},{"$f":"IF(Test_Data!$B$88=\"\",\"\",Test_Data!$B$88)","v":"PREDICTION OF MOISTURE-INDUCED DAMAGE TO BITUMINOUS PAVING MIXTURES - Tex-531-C"},{"$f":"IF(Test_Data!$B$92=\"\",\"\",Test_Data!$B$92)","v":"% Density:"},{"$f":"IF(Test_Data!$G$89=\"\",\"\",Test_Data!$G$89)","v":"Conditioned"},{"$f":"IF(Test_Data!$G$90=\"\",\"\",Test_Data!$G$90)","v":1}]
[465,{"$f":"IF(Test_Data!$I$92=\"\",\"\",Test_Data!$I$92)","v":""},{"$f":"IF(Test_Data!$B$88=\"\",\"\",Test_Data!$B$88)","v":"PREDICTION OF MOISTURE-INDUCED DAMAGE TO BITUMINOUS PAVING MIXTURES - Tex-531-C"},{"$f":"IF(Test_Data!$B$92=\"\",\"\",Test_Data!$B$92)","v":"% Density:"},{"$f":"IF(Test_Data!$G$89=\"\",\"\",Test_Data!$G$89)","v":"Conditioned"},{"$f":"IF(Test_Data!$I$90=\"\",\"\",Test_Data!$I$90)","v":2}]
[466,{"$f":"IF(Test_Data!$K$92=\"\",\"\",Test_Data!$K$92)","v":""},{"$f":"IF(Test_Data!$B$88=\"\",\"\",Test_Data!$B$88)","v":"PREDICTION OF MOISTURE-INDUCED DAMAGE TO BITUMINOUS PAVING MIXTURES - Tex-531-C"},{"$f":"IF(Test_Data!$B$92=\"\",\"\",Test_Data!$B$92)","v":"% Density:"},{"$f":"IF(Test_Data!$G$89=\"\",\"\",Test_Data!$G$89)","v":"Conditioned"},{"$f":"IF(Test_Data!$K$90=\"\",\"\",Test_Data!$K$90)","v":3}]
[467,{"$f":"IF(Test_Data!$M$92=\"\",\"\",Test_Data!$M$92)","v":""},{"$f":"IF(Test_Data!$B$88=\"\",\"\",Test_Data!$B$88)","v":"PREDICTION OF MOISTURE-INDUCED DAMAGE TO BITUMINOUS PAVING MIXTURES - Tex-531-C"},{"$f":"IF(Test_Data!$B$92=\"\",\"\",Test_Data!$B$92)","v":"% Density:"},{"$f":"IF(Test_Data!$G$89=\"\",\"\",Test_Data!$G$89)","v":"Conditioned"},{"$f":"IF(Test_Data!$M$90=\"\",\"\",Test_Data!$M$90)","v":4}]
[468,{"$f":"IF(Test_Data!$O$92=\"\",\"\",Test_Data!$O$92)","v":""},{"$f":"IF(Test_Data!$B$88=\"\",\"\",Test_Data!$B$88)","v":"PREDICTION OF MOISTURE-INDUCED DAMAGE TO BITUMINOUS PAVING MIXTURES - Tex-531-C"},{"$f":"IF(Test_Data!$B$92=\"\",\"\",Test_Data!$B$92)","v":"% Density:"},{"$f":"IF(Test_Data!$O$89=\"\",\"\",Test_Data!$O$89)","v":"Dry"},{"$f":"IF(Test_Data!$O$90=\"\",\"\",Test_Data!$O$90)","v":1}]
[469,{"$f":"IF(Test_Data!$Q$92=\"\",\"\",Test_Data!$Q$92)","v":""},{"$f":"IF(Test_Data!$B$88=\"\",\"\",Test_Data!$B$88)","v":"PREDICTION OF MOISTURE-INDUCED DAMAGE TO BITUMINOUS PAVING MIXTURES - Tex-531-C"},{"$f":"IF(Test_Data!$B$92=\"\",\"\",Test_Data!$B$92)","v":"% Density:"},{"$f":"IF(Test_Data!$O$89=\"\",\"\",Test_Data!$O$89)","v":"Dry"},{"$f":"IF(Test_Data!$Q$90=\"\",\"\",Test_Data!$Q$90)","v":2}]
[470,{"$f":"IF(Test_Data!$S$92=\"\",\"\",Test_Data!$S$92)","v":""},{"$f":"IF(Test_Data!$B$88=\"\",\"\",Test_Data!$B$88)","v":"PREDICTION OF MOISTURE-INDUCED DAMAGE TO BITUMINOUS PAVING MIXTURES - Tex-531-C"},{"$f":"IF(Test_Data!$B$92=\"\",\"\",Test_Data!$B$92)","v":"% Density:"},{"$f":"IF(Test_Data!$O$89=\"\",\"\",Test_Data!$O$89)","v":"Dry"},{"$f":"IF(Test_Data!$S$90=\"\",\"\",Test_Data!$S$90)","v":3}]
[471,{"$f":"IF(Test_Data!$U$92=\"\",\"\",Test_Data!$U$92)","v":""},{"$f":"IF(Test_Data!$B$88=\"\",\"\",Test_Data!$B$88)","v":"PREDICTION OF MOISTURE-INDUCED DAMAGE TO BITUMINOUS PAVING MIXTURES - Tex-531-C"},{"$f":"IF(Test_Data!$B$92=\"\",\"\",Test_Data!$B$92)","v":"% Density:"},{"$f":"IF(Test_Data!$O$89=\"\",\"\",Test_Data!$O$89)","v":"Dry"},{"$f":"IF(Test_Data!$U$90=\"\",\"\",Test_Data!$U$90)","v":4}]
[472,{"$f":"IF(Test_Data!$G$94=\"\",\"\",Test_Data!$G$94)","v":""},{"$f":"IF(Test_Data!$B$88=\"\",\"\",Test_Data!$B$88)","v":"PREDICTION OF MOISTURE-INDUCED DAMAGE TO BITUMINOUS PAVING MIXTURES - Tex-531-C"},{"$f":"IF(Test_Data!$B$94=\"\",\"\",Test_Data!$B$94)","v":"Height:"},{"$f":"IF(Test_Data!$G$89=\"\",\"\",Test_Data!$G$89)","v":"Conditioned"},{"$f":"IF(Test_Data!$G$90=\"\",\"\",Test_Data!$G$90)","v":1}]
[473,{"$f":"IF(Test_Data!$I$94=\"\",\"\",Test_Data!$I$94)","v":""},{"$f":"IF(Test_Data!$B$88=\"\",\"\",Test_Data!$B$88)","v":"PREDICTION OF MOISTURE-INDUCED DAMAGE TO BITUMINOUS PAVING MIXTURES - Tex-531-C"},{"$f":"IF(Test_Data!$B$94=\"\",\"\",Test_Data!$B$94)","v":"Height:"},{"$f":"IF(Test_Data!$G$89=\"\",\"\",Test_Data!$G$89)","v":"Conditioned"},{"$f":"IF(Test_Data!$I$90=\"\",\"\",Test_Data!$I$90)","v":2}]
[474,{"$f":"IF(Test_Data!$K$94=\"\",\"\",Test_Data!$K$94)","v":""},{"$f":"IF(Test_Data!$B$88=\"\",\"\",Test_Data!$B$88)","v":"PREDICTION OF MOISTURE-INDUCED DAMAGE TO BITUMINOUS PAVING MIXTURES - Tex-531-C"},{"$f":"IF(Test_Data!$B$94=\"\",\"\",Test_Data!$B$94)","v":"Height:"},{"$f":"IF(Test_Data!$G$89=\"\",\"\",Test_Data!$G$89)","v":"Conditioned"},{"$f":"IF(Test_Data!$K$90=\"\",\"\",Test_Data!$K$90)","v":3}]
[475,{"$f":"IF(Test_Data!$M$94=\"\",\"\",Test_Data!$M$94)","v":""},{"$f":"IF(Test_Data!$B$88=\"\",\"\",Test_Data!$B$88)","v":"PREDICTION OF MOISTURE-INDUCED DAMAGE TO BITUMINOUS PAVING MIXTURES - Tex-531-C"},{"$f":"IF(Test_Data!$B$94=\"\",\"\",Test_Data!$B$94)","v":"Height:"},{"$f":"IF(Test_Data!$G$89=\"\",\"\",Test_Data!$G$89)","v":"Conditioned"},{"$f":"IF(Test_Data!$M$90=\"\",\"\",Test_Data!$M$90)","v":4}]
[476,{"$f":"IF(Test_Data!$O$94=\"\",\"\",Test_Data!$O$94)","v":""},{"$f":"IF(Test_Data!$B$88=\"\",\"\",Test_Data!$B$88)","v":"PREDICTION OF MOISTURE-INDUCED DAMAGE TO BITUMINOUS PAVING MIXTURES - Tex-531-C"},{"$f":"IF(Test_Data!$B$94=\"\",\"\",Test_Data!$B$94)","v":"Height:"},{"$f":"IF(Test_Data!$O$89=\"\",\"\",Test_Data!$O$89)","v":"Dry"},{"$f":"IF(Test_Data!$O$90=\"\",\"\",Test_Data!$O$90)","v":1}]
[477,{"$f":"IF(Test_Data!$Q$94=\"\",\"\",Test_Data!$Q$94)","v":""},{"$f":"IF(Test_Data!$B$88=\"\",\"\",Test_Data!$B$88)","v":"PREDICTION OF MOISTURE-INDUCED DAMAGE TO BITUMINOUS PAVING MIXTURES - Tex-531-C"},{"$f":"IF(Test_Data!$B$94=\"\",\"\",Test_Data!$B$94)","v":"Height:"},{"$f":"IF(Test_Data!$O$89=\"\",\"\",Test_Data!$O$89)","v":"Dry"},{"$f":"IF(Test_Data!$Q$90=\"\",\"\",Test_Data!$Q$90)","v":2}]
[478,{"$f":"IF(Test_Data!$S$94=\"\",\"\",Test_Data!$S$94)","v":""},{"$f":"IF(Test_Data!$B$88=\"\",\"\",Test_Data!$B$88)","v":"PREDICTION OF MOISTURE-INDUCED DAMAGE TO BITUMINOUS PAVING MIXTURES - Tex-531-C"},{"$f":"IF(Test_Data!$B$94=\"\",\"\",Test_Data!$B$94)","v":"Height:"},{"$f":"IF(Test_Data!$O$89=\"\",\"\",Test_Data!$O$89)","v":"Dry"},{"$f":"IF(Test_Data!$S$90=\"\",\"\",Test_Data!$S$90)","v":3}]
[479,{"$f":"IF(Test_Data!$U$94=\"\",\"\",Test_Data!$U$94)","v":""},{"$f":"IF(Test_Data!$B$88=\"\",\"\",Test_Data!$B$88)","v":"PREDICTION OF MOISTURE-INDUCED DAMAGE TO BITUMINOUS PAVING MIXTURES - Tex-531-C"},{"$f":"IF(Test_Data!$B$94=\"\",\"\",Test_Data!$B$94)","v":"Height:"},{"$f":"IF(Test_Data!$O$89=\"\",\"\",Test_Data!$O$89)","v":"Dry"},{"$f":"IF(Test_Data!$U$90=\"\",\"\",Test_Data!$U$90)","v":4}]
[480,{"$f":"IF(Test_Data!$G$95=\"\",\"\",Test_Data!$G$95)","v":""},{"$f":"IF(Test_Data!$B$88=\"\",\"\",Test_Data!$B$88)","v":"PREDICTION OF MOISTURE-INDUCED DAMAGE TO BITUMINOUS PAVING MIXTURES - Tex-531-C"},{"$f":"IF(Test_Data!$B$95=\"\",\"\",Test_Data!$B$95)","v":"Load, (lbs.):"},{"$f":"IF(Test_Data!$G$89=\"\",\"\",Test_Data!$G$89)","v":"Conditioned"},{"$f":"IF(Test_Data!$G$90=\"\",\"\",Test_Data!$G$90)","v":1}]
[481,{"$f":"IF(Test_Data!$I$95=\"\",\"\",Test_Data!$I$95)","v":""},{"$f":"IF(Test_Data!$B$88=\"\",\"\",Test_Data!$B$88)","v":"PREDICTION OF MOISTURE-INDUCED DAMAGE TO BITUMINOUS PAVING MIXTURES - Tex-531-C"},{"$f":"IF(Test_Data!$B$95=\"\",\"\",Test_Data!$B$95)","v":"Load, (lbs.):"},{"$f":"IF(Test_Data!$G$89=\"\",\"\",Test_Data!$G$89)","v":"Conditioned"},{"$f":"IF(Test_Data!$I$90=\"\",\"\",Test_Data!$I$90)","v":2}]
[482,{"$f":"IF(Test_Data!$K$95=\"\",\"\",Test_Data!$K$95)","v":""},{"$f":"IF(Test_Data!$B$88=\"\",\"\",Test_Data!$B$88)","v":"PREDICTION OF MOISTURE-INDUCED DAMAGE TO BITUMINOUS PAVING MIXTURES - Tex-531-C"},{"$f":"IF(Test_Data!$B$95=\"\",\"\",Test_Data!$B$95)","v":"Load, (lbs.):"},{"$f":"IF(Test_Data!$G$89=\"\",\"\",Test_Data!$G$89)","v":"Conditioned"},{"$f":"IF(Test_Data!$K$90=\"\",\"\",Test_Data!$K$90)","v":3}]
[483,{"$f":"IF(Test_Data!$M$95=\"\",\"\",Test_Data!$M$95)","v":""},{"$f":"IF(Test_Data!$B$88=\"\",\"\",Test_Data!$B$88)","v":"PREDICTION OF MOISTURE-INDUCED DAMAGE TO BITUMINOUS PAVING MIXTURES - Tex-531-C"},{"$f":"IF(Test_Data!$B$95=\"\",\"\",Test_Data!$B$95)","v":"Load, (lbs.):"},{"$f":"IF(Test_Data!$G$89=\"\",\"\",Test_Data!$G$89)","v":"Conditioned"},{"$f":"IF(Test_Data!$M$90=\"\",\"\",Test_Data!$M$90)","v":4}]
[484,{"$f":"IF(Test_Data!$O$95=\"\",\"\",Test_Data!$O$95)","v":""},{"$f":"IF(Test_Data!$B$88=\"\",\"\",Test_Data!$B$88)","v":"PREDICTION OF MOISTURE-INDUCED DAMAGE TO BITUMINOUS PAVING MIXTURES - Tex-531-C"},{"$f":"IF(Test_Data!$B$95=\"\",\"\",Test_Data!$B$95)","v":"Load, (lbs.):"},{"$f":"IF(Test_Data!$O$89=\"\",\"\",Test_Data!$O$89)","v":"Dry"},{"$f":"IF(Test_Data!$O$90=\"\",\"\",Test_Data!$O$90)","v":1}]
[485,{"$f":"IF(Test_Data!$Q$95=\"\",\"\",Test_Data!$Q$95)","v":""},{"$f":"IF(Test_Data!$B$88=\"\",\"\",Test_Data!$B$88)","v":"PREDICTION OF MOISTURE-INDUCED DAMAGE TO BITUMINOUS PAVING MIXTURES - Tex-531-C"},{"$f":"IF(Test_Data!$B$95=\"\",\"\",Test_Data!$B$95)","v":"Load, (lbs.):"},{"$f":"IF(Test_Data!$O$89=\"\",\"\",Test_Data!$O$89)","v":"Dry"},{"$f":"IF(Test_Data!$Q$90=\"\",\"\",Test_Data!$Q$90)","v":2}]
[486,{"$f":"IF(Test_Data!$S$95=\"\",\"\",Test_Data!$S$95)","v":""},{"$f":"IF(Test_Data!$B$88=\"\",\"\",Test_Data!$B$88)","v":"PREDICTION OF MOISTURE-INDUCED DAMAGE TO BITUMINOUS PAVING MIXTURES - Tex-531-C"},{"$f":"IF(Test_Data!$B$95=\"\",\"\",Test_Data!$B$95)","v":"Load, (lbs.):"},{"$f":"IF(Test_Data!$O$89=\"\",\"\",Test_Data!$O$89)","v":"Dry"},{"$f":"IF(Test_Data!$S$90=\"\",\"\",Test_Data!$S$90)","v":3}]
[487,{"$f":"IF(Test_Data!$U$95=\"\",\"\",Test_Data!$U$95)","v":""},{"$f":"IF(Test_Data!$B$88=\"\",\"\",Test_Data!$B$88)","v":"PREDICTION OF MOISTURE-INDUCED DAMAGE TO BITUMINOUS PAVING MIXTURES - Tex-531-C"},{"$f":"IF(Test_Data!$B$95=\"\",\"\",Test_Data!$B$95)","v":"Load, (lbs.):"},{"$f":"IF(Test_Data!$O$89=\"\",\"\",Test_Data!$O$89)","v":"Dry"},{"$f":"IF(Test_Data!$U$90=\"\",\"\",Test_Data!$U$90)","v":4}]
[488,{"$f":"IF(Test_Data!$G$96=\"\",\"\",Test_Data!$G$96)","v":""},{"$f":"IF(Test_Data!$B$88=\"\",\"\",Test_Data!$B$88)","v":"PREDICTION OF MOISTURE-INDUCED DAMAGE TO BITUMINOUS PAVING MIXTURES - Tex-531-C"},{"$f":"IF(Test_Data!$B$96=\"\",\"\",Test_Data!$B$96)","v":"Strength, (psi.):"},{"$f":"IF(Test_Data!$G$89=\"\",\"\",Test_Data!$G$89)","v":"Conditioned"},{"$f":"IF(Test_Data!$G$90=\"\",\"\",Test_Data!$G$90)","v":1}]
[489,{"$f":"IF(Test_Data!$I$96=\"\",\"\",Test_Data!$I$96)","v":""},{"$f":"IF(Test_Data!$B$88=\"\",\"\",Test_Data!$B$88)","v":"PREDICTION OF MOISTURE-INDUCED DAMAGE TO BITUMINOUS PAVING MIXTURES - Tex-531-C"},{"$f":"IF(Test_Data!$B$96=\"\",\"\",Test_Data!$B$96)","v":"Strength, (psi.):"},{"$f":"IF(Test_Data!$G$89=\"\",\"\",Test_Data!$G$89)","v":"Conditioned"},{"$f":"IF(Test_Data!$I$90=\"\",\"\",Test_Data!$I$90)","v":2}]
[490,{"$f":"IF(Test_Data!$K$96=\"\",\"\",Test_Data!$K$96)","v":""},{"$f":"IF(Test_Data!$B$88=\"\",\"\",Test_Data!$B$88)","v":"PREDICTION OF MOISTURE-INDUCED DAMAGE TO BITUMINOUS PAVING MIXTURES - Tex-531-C"},{"$f":"IF(Test_Data!$B$96=\"\",\"\",Test_Data!$B$96)","v":"Strength, (psi.):"},{"$f":"IF(Test_Data!$G$89=\"\",\"\",Test_Data!$G$89)","v":"Conditioned"},{"$f":"IF(Test_Data!$K$90=\"\",\"\",Test_Data!$K$90)","v":3}]
[491,{"$f":"IF(Test_Data!$M$96=\"\",\"\",Test_Data!$M$96)","v":""},{"$f":"IF(Test_Data!$B$88=\"\",\"\",Test_Data!$B$88)","v":"PREDICTION OF MOISTURE-INDUCED DAMAGE TO BITUMINOUS PAVING MIXTURES - Tex-531-C"},{"$f":"IF(Test_Data!$B$96=\"\",\"\",Test_Data!$B$96)","v":"Strength, (psi.):"},{"$f":"IF(Test_Data!$G$89=\"\",\"\",Test_Data!$G$89)","v":"Conditioned"},{"$f":"IF(Test_Data!$M$90=\"\",\"\",Test_Data!$M$90)","v":4}]
[492,{"$f":"IF(Test_Data!$O$96=\"\",\"\",Test_Data!$O$96)","v":""},{"$f":"IF(Test_Data!$B$88=\"\",\"\",Test_Data!$B$88)","v":"PREDICTION OF MOISTURE-INDUCED DAMAGE TO BITUMINOUS PAVING MIXTURES - Tex-531-C"},{"$f":"IF(Test_Data!$B$96=\"\",\"\",Test_Data!$B$96)","v":"Strength, (psi.):"},{"$f":"IF(Test_Data!$O$89=\"\",\"\",Test_Data!$O$89)","v":"Dry"},{"$f":"IF(Test_Data!$O$90=\"\",\"\",Test_Data!$O$90)","v":1}]
[493,{"$f":"IF(Test_Data!$Q$96=\"\",\"\",Test_Data!$Q$96)","v":""},{"$f":"IF(Test_Data!$B$88=\"\",\"\",Test_Data!$B$88)","v":"PREDICTION OF MOISTURE-INDUCED DAMAGE TO BITUMINOUS PAVING MIXTURES - Tex-531-C"},{"$f":"IF(Test_Data!$B$96=\"\",\"\",Test_Data!$B$96)","v":"Strength, (psi.):"},{"$f":"IF(Test_Data!$O$89=\"\",\"\",Test_Data!$O$89)","v":"Dry"},{"$f":"IF(Test_Data!$Q$90=\"\",\"\",Test_Data!$Q$90)","v":2}]
[494,{"$f":"IF(Test_Data!$S$96=\"\",\"\",Test_Data!$S$96)","v":""},{"$f":"IF(Test_Data!$B$88=\"\",\"\",Test_Data!$B$88)","v":"PREDICTION OF MOISTURE-INDUCED DAMAGE TO BITUMINOUS PAVING MIXTURES - Tex-531-C"},{"$f":"IF(Test_Data!$B$96=\"\",\"\",Test_Data!$B$96)","v":"Strength, (psi.):"},{"$f":"IF(Test_Data!$O$89=\"\",\"\",Test_Data!$O$89)","v":"Dry"},{"$f":"IF(Test_Data!$S$90=\"\",\"\",Test_Data!$S$90)","v":3}]
[495,{"$f":"IF(Test_Data!$U$96=\"\",\"\",Test_Data!$U$96)","v":""},{"$f":"IF(Test_Data!$B$88=\"\",\"\",Test_Data!$B$88)","v":"PREDICTION OF MOISTURE-INDUCED DAMAGE TO BITUMINOUS PAVING MIXTURES - Tex-531-C"},{"$f":"IF(Test_Data!$B$96=\"\",\"\",Test_Data!$B$96)","v":"Strength, (psi.):"},{"$f":"IF(Test_Data!$O$89=\"\",\"\",Test_Data!$O$89)","v":"Dry"},{"$f":"IF(Test_Data!$U$90=\"\",\"\",Test_Data!$U$90)","v":4}]
[496,{"$f":"IF(Test_Data!$G$97=\"\",\"\",Test_Data!$G$97)","v":""},{"$f":"IF(Test_Data!$B$88=\"\",\"\",Test_Data!$B$88)","v":"PREDICTION OF MOISTURE-INDUCED DAMAGE TO BITUMINOUS PAVING MIXTURES - Tex-531-C"},{"$f":"IF(Test_Data!$B$97=\"\",\"\",Test_Data!$B$97)","v":"Average Strength, (psi):"},{"$f":"IF(Test_Data!$G$89=\"\",\"\",Test_Data!$G$89)","v":"Conditioned"}]
[497,{"$f":"IF(Test_Data!$O$97=\"\",\"\",Test_Data!$O$97)","v":""},{"$f":"IF(Test_Data!$B$88=\"\",\"\",Test_Data!$B$88)","v":"PREDICTION OF MOISTURE-INDUCED DAMAGE TO BITUMINOUS PAVING MIXTURES - Tex-531-C"},{"$f":"IF(Test_Data!$B$97=\"\",\"\",Test_Data!$B$97)","v":"Average Strength, (psi):"},{"$f":"IF(Test_Data!$O$89=\"\",\"\",Test_Data!$O$89)","v":"Dry"}]
[498,{"$f":"IF(Test_Data!$G$99=\"\",\"\",Test_Data!$G$99)","v":""},{"$f":"IF(Test_Data!$B$88=\"\",\"\",Test_Data!$B$88)","v":"PREDICTION OF MOISTURE-INDUCED DAMAGE TO BITUMINOUS PAVING MIXTURES - Tex-531-C"},{"$f":"IF(Test_Data!$B$99=\"\",\"\",Test_Data!$B$99)","v":"TSR:"}]
[499,{"$f":"IF(Test_Data!$B$103=\"\",\"\",Test_Data!$B$103)","v":""},{"$f":"IF(Test_Data!$B$101=\"\",\"\",Test_Data!$B$101)","v":"Hamburg: Tex-242-F"},{"$f":"IF(Test_Data!$B$102=\"\",\"\",Test_Data!$B$102)","v":"No. of  Passes"}]
[500,{"$f":"IF(Test_Data!$F$103=\"\",\"\",Test_Data!$F$103)","v":""},{"$f":"IF(Test_Data!$B$101=\"\",\"\",Test_Data!$B$101)","v":"Hamburg: Tex-242-F"},{"$f":"IF(Test_Data!$F$102=\"\",\"\",Test_Data!$F$102)","v":"RUT Depth"}]
[501,{"$f":"IF(Test_Data!$R$102=\"\",\"\",Test_Data!$R$102)","v":""},{"$f":"IF(Test_Data!$M$101=\"\",\"\",Test_Data!$M$101)","v":"Fluxing Material: From Quantity Used"},{"$f":"IF(Test_Data!$M$102=\"\",\"\",Test_Data!$M$102)","v":"% Fluxing Material"}]
[502,{"$f":"IF(Test_Data!$G$107=\"\",\"\",Test_Data!$G$107)","v":""},{"$f":"IF(Test_Data!$B$105=\"\",\"\",Test_Data!$B$105)","v":"DRAINDOWN OF BITUMIOUS MATERIALS - Tex-235-F"},{"$f":"IF(Test_Data!$B$107=\"\",\"\",Test_Data!$B$107)","v":"Initial Sample Weight (g):"},{"$f":"IF(Test_Data!$G$106=\"\",\"\",Test_Data!$G$106)","v":"Sample 1"}]
[503,{"$f":"IF(Test_Data!$I$107=\"\",\"\",Test_Data!$I$107)","v":""},{"$f":"IF(Test_Data!$B$105=\"\",\"\",Test_Data!$B$105)","v":"DRAINDOWN OF BITUMIOUS MATERIALS - Tex-235-F"},{"$f":"IF(Test_Data!$B$107=\"\",\"\",Test_Data!$B$107)","v":"Initial Sample Weight (g):"},{"$f":"IF(Test_Data!$I$106=\"\",\"\",Test_Data!$I$106)","v":"Sample 2"}]
[504,{"$f":"IF(Test_Data!$G$108=\"\",\"\",Test_Data!$G$108)","v":""},{"$f":"IF(Test_Data!$B$105=\"\",\"\",Test_Data!$B$105)","v":"DRAINDOWN OF BITUMIOUS MATERIALS - Tex-235-F"},{"$f":"IF(Test_Data!$B$108=\"\",\"\",Test_Data!$B$108)","v":"Initial Weight Plate (g):"},{"$f":"IF(Test_Data!$G$106=\"\",\"\",Test_Data!$G$106)","v":"Sample 1"}]
[505,{"$f":"IF(Test_Data!$I$108=\"\",\"\",Test_Data!$I$108)","v":""},{"$f":"IF(Test_Data!$B$105=\"\",\"\",Test_Data!$B$105)","v":"DRAINDOWN OF BITUMIOUS MATERIALS - Tex-235-F"},{"$f":"IF(Test_Data!$B$108=\"\",\"\",Test_Data!$B$108)","v":"Initial Weight Plate (g):"},{"$f":"IF(Test_Data!$I$106=\"\",\"\",Test_Data!$I$106)","v":"Sample 2"}]
[506,{"$f":"IF(Test_Data!$G$110=\"\",\"\",Test_Data!$G$110)","v":""},{"$f":"IF(Test_Data!$B$105=\"\",\"\",Test_Data!$B$105)","v":"DRAINDOWN OF BITUMIOUS MATERIALS - Tex-235-F"},{"$f":"IF(Test_Data!$B$110=\"\",\"\",Test_Data!$B$110)","v":"Final Weight Plate (g):"},{"$f":"IF(Test_Data!$G$106=\"\",\"\",Test_Data!$G$106)","v":"Sample 1"}]
[507,{"$f":"IF(Test_Data!$I$110=\"\",\"\",Test_Data!$I$110)","v":""},{"$f":"IF(Test_Data!$B$105=\"\",\"\",Test_Data!$B$105)","v":"DRAINDOWN OF BITUMIOUS MATERIALS - Tex-235-F"},{"$f":"IF(Test_Data!$B$110=\"\",\"\",Test_Data!$B$110)","v":"Final Weight Plate (g):"},{"$f":"IF(Test_Data!$I$106=\"\",\"\",Test_Data!$I$106)","v":"Sample 2"}]
[508,{"$f":"IF(Test_Data!$G$111=\"\",\"\",Test_Data!$G$111)","v":""},{"$f":"IF(Test_Data!$B$105=\"\",\"\",Test_Data!$B$105)","v":"DRAINDOWN OF BITUMIOUS MATERIALS - Tex-235-F"},{"$f":"IF(Test_Data!$B$111=\"\",\"\",Test_Data!$B$111)","v":"Draindown, (%):"},{"$f":"IF(Test_Data!$G$106=\"\",\"\",Test_Data!$G$106)","v":"Sample 1"}]
[509,{"$f":"IF(Test_Data!$I$111=\"\",\"\",Test_Data!$I$111)","v":""},{"$f":"IF(Test_Data!$B$105=\"\",\"\",Test_Data!$B$105)","v":"DRAINDOWN OF BITUMIOUS MATERIALS - Tex-235-F"},{"$f":"IF(Test_Data!$B$111=\"\",\"\",Test_Data!$B$111)","v":"Draindown, (%):"},{"$f":"IF(Test_Data!$I$106=\"\",\"\",Test_Data!$I$106)","v":"Sample 2"}]
[510,{"$f":"IF(Test_Data!$L$109=\"\",\"\",Test_Data!$L$109)","v":""},{"$f":"IF(Test_Data!$L$105=\"\",\"\",Test_Data!$L$105)","v":"DELETERIOUS MATERIAL - Tex-217-F (Part I)"},{"$f":"IF(Test_Data!$L$106=\"\",\"\",Test_Data!$L$106)","v":"Sieve Size"}]
[511,{"$f":"IF(Test_Data!$N$109=\"\",\"\",Test_Data!$N$109)","v":""},{"$f":"IF(Test_Data!$L$105=\"\",\"\",Test_Data!$L$105)","v":"DELETERIOUS MATERIAL - Tex-217-F (Part I)"},{"$f":"IF(Test_Data!$N$106=\"\",\"\",Test_Data!$N$106)","v":"Original Weight Retained, (g)"}]
[512,{"$f":"IF(Test_Data!$Q$109=\"\",\"\",Test_Data!$Q$109)","v":""},{"$f":"IF(Test_Data!$L$105=\"\",\"\",Test_Data!$L$105)","v":"DELETERIOUS MATERIAL - Tex-217-F (Part I)"},{"$f":"IF(Test_Data!$Q$106=\"\",\"\",Test_Data!$Q$106)","v":"Weight of Deleterious material, (g)"}]
[513,{"$f":"IF(Test_Data!$T$109=\"\",\"\",Test_Data!$T$109)","v":""},{"$f":"IF(Test_Data!$L$105=\"\",\"\",Test_Data!$L$105)","v":"DELETERIOUS MATERIAL - Tex-217-F (Part I)"},{"$f":"IF(Test_Data!$T$106=\"\",\"\",Test_Data!$T$106)","v":"Deleterious Material,%"}]
[514,{"$f":"IF(Test_Data!$L$113=\"\",\"\",Test_Data!$L$113)","v":""},{"$f":"IF(Test_Data!$L$110=\"\",\"\",Test_Data!$L$110)","v":"DECANTATION - Tex-217-F - (Part II)"},{"$f":"IF(Test_Data!$L$111=\"\",\"\",Test_Data!$L$111)","v":"Sieve Size"}]
[515,{"$f":"IF(Test_Data!$N$113=\"\",\"\",Test_Data!$N$113)","v":""},{"$f":"IF(Test_Data!$L$110=\"\",\"\",Test_Data!$L$110)","v":"DECANTATION - Tex-217-F - (Part II)"},{"$f":"IF(Test_Data!$N$111=\"\",\"\",Test_Data!$N$111)","v":"Original Weight Retained, (g)"}]
[516,{"$f":"IF(Test_Data!$Q$113=\"\",\"\",Test_Data!$Q$113)","v":""},{"$f":"IF(Test_Data!$L$110=\"\",\"\",Test_Data!$L$110)","v":"DECANTATION - Tex-217-F - (Part II)"},{"$f":"IF(Test_Data!$Q$111=\"\",\"\",Test_Data!$Q$111)","v":"Dry Weight after Washing, (g)"}]
[517,{"$f":"IF(Test_Data!$T$113=\"\",\"\",Test_Data!$T$113)","v":""},{"$f":"IF(Test_Data!$L$110=\"\",\"\",Test_Data!$L$110)","v":"DECANTATION - Tex-217-F - (Part II)"},{"$f":"IF(Test_Data!$T$111=\"\",\"\",Test_Data!$T$111)","v":"% Loss by Decantation"}]
[518,{"$f":"IF(Test_Data!$I$113=\"\",\"\",Test_Data!$I$113)","v":""},{"$f":"IF(Test_Data!$B$105=\"\",\"\",Test_Data!$B$105)","v":"DRAINDOWN OF BITUMIOUS MATERIALS - Tex-235-F"},{"$f":"IF(Test_Data!$B$113=\"\",\"\",Test_Data!$B$113)","v":"Average Draindown, (%):"}]
[519,{"$f":"IF(Test_Data!$I$115=\"\",\"\",Test_Data!$I$115)","v":""},{"$f":"IF(Test_Data!$B$105=\"\",\"\",Test_Data!$B$105)","v":"DRAINDOWN OF BITUMIOUS MATERIALS - Tex-235-F"},{"$f":"IF(Test_Data!$B$115=\"\",\"\",Test_Data!$B$115)","v":"Magnesium Sulfate Soundness (%)"}]
[520,{"$f":"IF(Test_Data!$U$115=\"\",\"\",Test_Data!$U$115)","v":""},{"$f":"IF(Test_Data!$L$110=\"\",\"\",Test_Data!$L$110)","v":"DECANTATION - Tex-217-F - (Part II)"},{"$f":"IF(Test_Data!$P$115=\"\",\"\",Test_Data!$P$115)","v":"Sand Equivalent Value (%)"}]
[521,{"$f":"IF('Design Data'!Y18=\"\",\"\",'Design Data'!Y18)","v":""},{"$f":"IF('Design Data'!W18=\"\",\"\",'Design Data'!W18)","v":"Design # :"}]
[522,{"$f":"IF(Test_Data!N57=\"\",\"\",Test_Data!N57)","v":""},{"$f":"IF(Test_Data!N55=\"\",\"\",Test_Data!N55)","v":"Roadway"},{"$f":"IF(Test_Data!B57=\"\",\"\",Test_Data!B57)","v":"Specimen Radius (mm):"},{"$f":"IF(Test_Data!N56=\"\",\"\",Test_Data!N56)","v":"1(A)"}]
[523,{"$f":"IF(Test_Data!P57=\"\",\"\",Test_Data!P57)","v":""},{"$f":"IF(Test_Data!N55=\"\",\"\",Test_Data!N55)","v":"Roadway"},{"$f":"IF(Test_Data!B57=\"\",\"\",Test_Data!B57)","v":"Specimen Radius (mm):"},{"$f":"IF(Test_Data!P56=\"\",\"\",Test_Data!P56)","v":"1(B)"}]
[524,{"$f":"IF(Test_Data!R57=\"\",\"\",Test_Data!R57)","v":""},{"$f":"IF(Test_Data!N55=\"\",\"\",Test_Data!N55)","v":"Roadway"},{"$f":"IF(Test_Data!B57=\"\",\"\",Test_Data!B57)","v":"Specimen Radius (mm):"},{"$f":"IF(Test_Data!R56=\"\",\"\",Test_Data!R56)","v":"1(C)"}]
[525,{"$f":"IF('Design Data'!$AA$32=\"\",\"\",'Design Data'!$AA$32)","v":""},{"$f":"IF('Design Data'!$B$26=\"\",\"\",'Design Data'!$B$26)","v":"DETERMINATION OF ASPHALT CONTENT"},{"$f":"IF('Design Data'!$W$32=\"\",\"\",'Design Data'!$W$32)","v":"Recycled Binder, %"}]
[526,{"$f":"IF(Test_Data!$L$25=\"\",\"\",Test_Data!$L$25)","v":""},{"$f":"IF(Test_Data!$B$18=\"\",\"\",Test_Data!$B$18)","v":"DETERMINATION OF ASPHALT CONTENT Ignition Oven Method: Tex-236-F"},{"$f":"IF(Test_Data!$B$25=\"\",\"\",Test_Data!$B$25)","v":"Ratio of Recycled to Total Binder, %"}]
[527,{"$f":"IF('Design Data'!$AA$33=\"\",\"\",'Design Data'!$AA$33)","v":""},{"$f":"IF('Design Data'!$B$26=\"\",\"\",'Design Data'!$B$26)","v":"DETERMINATION OF ASPHALT CONTENT"},{"$f":"IF('Design Data'!$T$33=\"\",\"\",'Design Data'!$T$33)","v":"Maximum Recycled Binder Ratio, %"}]
[528,{"$f":"IF('Design Data'!$E$102=\"\",\"\",'Design Data'!$E$102)","v":""},"Tested By ","TX227PII"]
[529,{"$f":"IF('Design Data'!$O$102=\"\",\"\",'Design Data'!$O$102)","v":""},"Tested Date ","TX227PII"]
[530,{"$f":"IF('Design Data'!$E$114=\"\",\"\",'Design Data'!$E$114)","v":""},"Tested By ","TX236PI"]
[531,{"$f":"IF('Design Data'!$O$114=\"\",\"\",'Design Data'!$O$114)","v":""},"Tested Date ","TX236PI"]
[532,{"$f":"IF('Design Data'!$E$88=\"\",\"\",'Design Data'!$E$88)","v":""},"Tested By ","TX207PI"]
[533,{"$f":"IF('Design Data'!$O$88=\"\",\"\",'Design Data'!$O$88)","v":""},"Tested Date ","TX207PI"]
[534,{"$f":"IF('Design Data'!$E$84=\"\",\"\",'Design Data'!$E$84)","v":""},"Tested By ","TX126"]
[535,{"$f":"IF('Design Data'!$O$84=\"\",\"\",'Design Data'!$O$84)","v":""},"Tested Date ","TX126"]

{"sheet":"DATA_Revisions","index":8,"n_rows":80,"n_cols":3,"rows_kept":80,"cut":false,"hidden":true,"merged":[[58,0,59,0],[58,2,59,2],[4,0,38,0],[4,2,38,2],[40,0,43,0],[40,2,43,2],[55,0,56,0],[55,2,56,2],[46,0,47,0],[46,2,47,2],[60,0,61,0],[60,2,61,2],[73,0,75,0],[73,2,75,2],[69,0,71,0],[69,2,71,2],[62,0,68,0],[62,2,68,2]]}
["Date","Changes","By"]
["2005-05-12","Cell H71 Add Formula =IF(ISERROR(IF(LEFT(H63,1)=\"L\",-0.00166*(H65/H70)+0.8596,IF(LEFT(H63,1)=\"S\",-0.000566*(H65/H70)+0.8121,IF(LEFT(H63,1)=\"D\",-0.0022448*(H65/H70)+0.85818,\"\")))),\"\",IF(LEFT(H63,1)=\"L\",-0.00166*(H65/H70)+0.8596,IF(LEFT(H63,1)=\"S\",-0.000566*(H65/H70)+0.8121,IF(LEFT(H63,1)=\"D\",-0.0022448*(H65/H70)+0.85818,\"\"))))","Richard Izzo"]
[]
[]
["2005-06-20","Add Microsurfacing to spec year 2004 (for microsurfacing)","Brett Haggerty"]
[null,"Add %retained and %passing radio buttons to the Grade6specs form (in case future additions are made, ensure that the user can define if data is requested in %passing or %retained)"]
[null,"Add AC% Tolerance to the Grade6specs form (for future reference allow the user to specify the %tolerance for ac%)"]
[null,"Add AC% tolerance column to all grades on the MDV sheet (modularizes the input instead of leaving the hard coded +/-0.3%)"]
[null,"Add the Retained column to all grades in the MDV sheet (specifies if the requested information is in %retained or %passing)"]
[null,"Change all grade definitions to include up to the \"Retained\" column in the MDV sheet (this allows subsequently defined equations to be more modular)"]
[null,"Cell B23 in the Test_Data sheet is now: \"Asphalt content exceeds ±\" & INDEX(INDIRECT(Grade),1,18) - 0.001 & \"% tolerance from current JMF design specification of \" & JMFDesAC & \"%\"   (this allows for the AC% tolerance to be accessed from the MDV sheet as opposed to be set to the hard coded +/-0.3% value)"]
[null,"Conditional Formatting for Cell L19 on the Test_Data sheet now includes:AND($L$19<>0,JMFDesAC<>0,SUM($L$20:$M$21)=0,ABS(JMFDesAC-$L$19)>INDEX(INDIRECT(Grade),1,18)) (so that the AC% tolerance is not hard coded)"]
[null,"Conditional Formatting for Cell B19 on the Test_Data sheet now includes: AND($L$19<>0,JMFDesAC<>0,SUM($L$20:$M$21)=0,ABS(JMFDesAC-$L$19)>INDEX(INDIRECT(Grade),1,18)) (so that the AC% tolerance is not hard coded)"]
[null,"Conditional Formatting for cell B23 on the Test_Data sheet now includes : OR(AND(SUM($L$20:$M$21)=0,ABS(JMFDesAC-$L$19)>INDEX(INDIRECT(Grade),1,18)),ABS(JMFDesAC-$L$22)>INDEX(INDIRECT(Grade),1,18)) (so that the AC% tolerance is not hard coded)"]
[null,"Cells L36 to L45 on the Test_Data sheet now include if statements to change values to %retained or %passing results"]
[null,"Cells P36 to P45 on the Test_Data sheet now included if statements to change values to %retained or %passing results"]
[null,"Cells L48 and P48 on the Test_Data sheet now include if statements if no tolerance exist for percent passing sieve #200"]
[null,"Cell L35 on Design Data Sheet now includes a statement to adjust the displayed query for %retained or % passing"]
[null,"Cell R35 on Design Data Sheet now includes a statement to adjust the displayed query to %retained or %passing"]
[null,"Added Mineral Filler box for cell Z52 on Design Data sheet"]
[null,"Added conditional formatting for cell Z52 on the Design Data sheet, which contains limits specifically for microsurface (i.e. <0.5% or >3.0%)"]
[null,"Added notice if cell Z52 exceeds specifications to cell AC52 on the Design Data sheet"]
[null,"Added Wet Track Abrasion Wear Value box for cell Z54 on Design Data sheet"]
[null,"Added conditional formatting for cell Z54 on the Design Data sheet, which contains limits specifically for microsurface (i.e. >75)"]
[null,"Added notice if cell Z54 exceeds specifications to cell AC54 on the Design Data sheet"]
[null,"Added Magnesium Sulfate Soundness box for cell I114 on Test_Data sheet"]
[null,"Added conditional formatting for cell I114 on the Test_Data sheet, which contains limits specifically for microsurface (i.e. >30)"]
[null,"Added notice if cell I114 exceeds specifications to cell L114 on the Design Data sheet"]
[null,"Added Sand Equivalent Value box for cell U114 on Test_Data sheet"]
[null,"Added conditional formatting for cell U114 on the Test_Data sheet, which contains limits specifically for microsurface (i.e. <70)"]
[null,"Added notice if cell U114 exceeds specifications to cell X114 on the Design Data sheet"]
[null,"Changed AA4 to AB14 to adjust the power 45 curve data when entered data is in %retained or %passing"]
[null,"Addition of conditional formatting when microsurfacing is selected to blank out the cells for: PG Grade, Density information, Hamburg information, Rice Gravity information, Item 213 information, IDT data, draindown information"]
[null,"Change the validation list for the \"DETERMINATION OF ASPHALT CONTENT\" from hardcoded data to a list in the MDV sheet"]
[null,"Remove extraction from the \"DETERMINATION OF ASPHALT CONTENT\" validation list when Microsurfacing is the selected type"]
[null,"Change Cells P39:P47 to adjust for microsurfacing limits (on the Design Data sheet)"]
[null,"Add Cells W34:X45 for the microsurfacing and all other limits that will be displayed on the Design Data Sheet"]
[null,"Change Cells U39:U47 to include the tolerances specifically for microsurfacing"]
[null,"Add Cell W50, to allow the older versions of this template to correspond to new versions.  (i.e. now that %retained is an issue, it becomes necessary for the user to enter if the gradation is measured as %retained or %passing.  Hence, in previous versions this value was not accounted for and has a value of \"\")"]
[]
["2006-05-11","Included Corrected AC content for Ignition Oven Testing","Brett Haggerty"]
[null,"Add the \"Film Thickness\" Worksheet, which is only visible when using the Ultra Bond Wear Coarse mixetypes (UTBWC)"]
[null,"Add the Bulk Specific Gravity cell in the Film Thickness Worksheet"]
[null,"Adjust the asphalt tolerances for SuperPave Mixes to the limits of the subsequent sieve size, instead of \"Note 1\""]
[]
["2006-06-06","Adjusted the Ga calculation in the Test_Data sheet to include the press correlation factor (cells H74:L74)","Brett Haggerty"]
["2006-06-28","Add the LRA mixtype","Brett Haggerty"]
[null,"Update the UTBWC mixytpes to calculate the correct limits within the Test_Data worksheet, for gradations."]
[]
["2006-11-15","Updated the minimum VMA to the plant produced values for all 2004 mixtypes","Brett Haggerty"]
[]
["2007-05-17","Removal of the defined cell \"SGAsph\", which was referencing a cell in a different workbook.","Brett Haggerty"]
[]
["2007-07-20","Add the Dimensional Analysis for PFC density calculation, and update the Tested Specimen Gradation limits to include Master Gradation bands for PFC as well","Brett Haggerty"]
["2008-04-23","Update the Pan 200 Passing tolerances (cells Q282:Q364), which were previously left blank.","Brett Haggerty"]
["2008-05-15","Updated the Sand Equivalent conditional formatting to display errors for only 2004 data","Brett Haggerty"]
[null,"The above update required additional entries for mixtypes in the MDV sheet for the \"2004 Min. Sand Equivalent\".  As well as reassigning cell definitions for grade."]
["2008-08-14","Modified the aggregate gradation limits and the good/bad check, for the pan","Brett Haggerty"]
["2009-05-29","Add a new cell for tracking the design #","Brett Haggerty"]
[null,"Add new cells in the MDV worksheet for keeping tracking of warranty mixes that have cumulative %Retained JMF & cumulative % Retained test gradation requirements"]
["2009-09-15","Add capability for PFC cores to be obtained for density analysis. Make the radius for PFC on lab molded specimen density analysis static (= 75)","Brett Haggerty"]
[null,"Increase UPLC to 326"]
["2010-07-15","Modified the conditinal formatting of the cumulative percent passing in the Test Data worksheet to flag it when the aggregate gradation exceeds the Master Gradation Band.","Gisel Carrasco"]
[null,"Add version #4 (from 7/15/20010)"]
[null,"In the Test_Data worksheet, calculate the roadway average % air voids (N82) from the individual % air voids when version 4 is used. And, calculate the roadway average % density (N84) from cell N82"]
[null,"In the Test_Data worksheet, take reference to Paraffin testing out."]
[null,"Change conditional formatting and validation of cells to avoid text (from cell H57: P60)"]
[null,"In the Test_Data worksheet, delete conditional formatting of gradation labels (cells H33, J33, L33) when correction factors are entered"]
[null,"Add Instructions sheet"]
["2012-03-05","SS3224 mix types added","Gisel Carrasco"]
[null,"Intructions sheet updated"]
[null,"VMA calculation apdated"]
["2012-06-28","Added recycled binder ratio calculation in Test_Data Sheet","Gisel Carrasco"]
["2013-10-03","Added SS3270 SP A-D (Including restricted zone on gradation)","Travis Patton"]
[null,"Changed course\\lift to \"intermediate\" and \"base\" except for SS3224"]
[null,"Added Maximum Recycled Binder Ratio cell on \"Design Data\" sheet."]
["2013-10-10","Added SS3267 A-F","Travis Patton"]
["2014-03-12","Added SS3268 Type D","Gisel Carrasco"]
["2016-10-20","Added SS3022 OGAB","Andre Smit"]
["2023-02-02","Added TX126 to the \"Test Method\" list on \"Design Data\" Sheet","Syeda Rahman"]