{"text_format":"1","workbook":"xlsx","n_sheets":11,"sheets":["Design Gradation","Patching Mix Gradations","AggSource","Custom Gradation","9202-ASPPM Approval","9202-SCM I Approval","9202-SCM II Approval","9202-CMA-SG","9202-CMA-WG","9202-NVM Approval","9203 Approval"],"not_rendered":{"charts":0,"images":1,"macros":1,"external_links":0,"defined_names":444,"comments":0,"pivot_tables":0},"unopened":[],"bounds":{"document_bytes":16777216,"sheet_cells":100000,"rows_first":2000,"rows_last":500,"rows_between":2000,"halvings":0,"cell_chars":16384,"cell_head_chars":4096},"cells_cut":0,"cells_raw":0,"read":"whole","date_system":"1900"}

{"sheet":"Design Gradation","index":0,"n_rows":37,"n_cols":22,"rows_kept":37,"cut":false,"hidden":false,"merged":[[14,5,14,8],[12,5,12,16],[5,13,5,16],[6,13,6,16],[7,13,7,16],[8,13,8,16],[5,9,5,12],[6,9,6,12],[7,9,7,12],[8,9,8,12],[5,5,5,8],[6,5,6,8],[7,5,7,8],[11,9,11,12],[10,1,10,4],[11,1,11,4],[10,9,10,12],[9,13,9,16],[10,13,10,16],[11,13,11,16],[5,1,5,4],[6,1,6,4],[7,1,7,4],[14,13,14,16],[14,1,14,4],[13,5,13,16],[14,9,14,12],[12,1,12,4],[8,5,8,8],[9,5,9,8],[8,1,8,4],[13,1,13,4],[10,5,10,8],[9,1,9,4],[11,5,11,8],[9,9,9,12],[22,18,22,21],[23,19,24,21],[34,1,34,2],[33,1,33,2],[32,1,32,2],[31,1,31,2],[30,1,30,2],[29,1,29,2],[28,1,28,2],[27,1,27,2],[24,1,24,3],[26,1,26,2],[16,4,16,17],[17,16,17,17],[17,14,17,15],[17,12,17,13],[17,10,17,11],[17,8,17,9],[17,6,17,7],[17,4,17,5],[20,10,20,11],[20,8,20,9],[20,6,20,7],[20,4,20,5],[19,16,19,17],[19,14,19,15],[19,12,19,13],[19,10,19,11],[19,8,19,9],[19,6,19,7],[35,1,35,2],[36,1,36,2],[19,4,19,5],[18,16,18,17],[18,14,18,15],[18,12,18,13],[18,10,18,11],[18,8,18,9],[18,6,18,7],[18,4,18,5],[18,1,18,3],[20,1,20,3],[19,1,19,3],[20,16,20,17],[20,14,20,15],[20,12,20,13]]}
[]
[null,"TEXAS DEPARTMENT OF TRANSPORTATION",null,null,null,null,null,null,null,null,null,null,null,null,null,null,null,null,261]
[]
[null,"PATCHING MIX DESIGN : COMBINED GRADATION",null,null,null,null,null,null,null,null,null,null,null,null,null,null,null,null,"Tx2Patch.xlsm::43143.639387"]
[null,null,null,null,null,null,null,null,null,null,null,null,null,null,null,null,{"$f":"\"TXTRAEI :: File Version: \" & TEXT(MID(SN,SEARCH(\"::\",SN,1)+2,20),\"mm/dd/yy hh:mm:ss\")","v":"TXTRAEI :: File Version: 02/12/18 15:20:43"}]
[null,"SAMPLE ID:",null,null,null,null,null,null,null,"SAMPLE DATE:"]
[null,"LOT NUMBER:",null,null,null,null,null,null,null,"LETTING DATE:",null,null,null,""]
[null,"SAMPLE STATUS:",null,null,null,null,null,null,null,"CONTROLLING CSJ:"]
[null,"COUNTY:",null,null,null,null,null,null,null,"SPEC YEAR:"]
[null,"SAMPLED BY:",null,null,null,null,null,null,null,"SPEC ITEM:"]
[null,"SAMPLE LOCATION:",null,null,null,null,null,null,null,"SPECIAL PROVISION:"]
[null,"MATERIAL CODE:",null,null,null,null,null,null,null,"MIX TYPE:",null,null,null,null,null,null,null,null,{"$f":"IF(Field1=\"Custom_Gradation\",\"Click Here\",\"\")","v":""}]
[null,"MATERIAL NAME:"]
[null,"PRODUCER:",null,null,null,""]
[null,"AREA ENGINEER:",null,null,null,null,null,null,null,"PROJECT MANAGER:"]
{"$rows_left_out":23}
{"sheet":"Patching Mix Gradations","index":1,"n_rows":100,"n_cols":16,"rows_kept":100,"cut":false,"hidden":true,"merged":[[43,1,52,1],[24,1,29,1],[30,1,36,1],[37,1,42,1],[1,5,1,6],[4,1,10,1],[11,1,15,1],[16,1,23,1],[57,2,57,3],[57,4,57,5],[59,5,66,5],[59,4,66,4],[68,4,68,5],[92,4,99,4],[92,5,99,5],[90,2,90,3],[79,2,79,3],[68,2,68,3],[70,4,77,4],[70,5,77,5],[79,4,79,5],[81,4,88,4],[81,5,88,5],[90,4,90,5]]}
[]
[null,null,null,null,null,"Washed Sieve"]
[null,"Grade",null,null,null,"Min","Max",null,null,null,"MIX TYPES",null,"Gradation Table"]
[null,1,2,3,4,5,6,null,null,null,"DMS9202_Gradation_I",null,"English","Metric","Selection","Size"]
[null,"DMS 9202\nGradation I","1/2\"",null,12.5,100,100,null,null,null,"DMS9202_Gradation_II",null,"2\"","50 mm","2\"",50]
[null,null,"3/8\"",null,9.5,95,100,null,null,null,"DMS9202_Gradation_III",null,"1-3/4\"","45 mm","1-3/4\"",45]
[null,null,"No. 4",null,4.75,90,100,null,null,null,"DMS9202_Gradation_IV",null,"1-1/2\"","37.5 mm","1-1/2\"",37.5]
[null,null,"No. 10",null,2,10,30,null,null,null,"DMS9203_Dense_Graded",null,"1-1/4\"","31.5 mm","1-1/4\"",31.5]
[null,null," No. 40",null,0.42499999999999999,0,25,null,null,null,"DMS9203_Open_Graded",null,"1\"","25 mm","1\"",25]
[null,null," No. 80",null,0.18,0,10,null,null,null,"Custom_Gradation",null,"7/8\"","22.4 mm","7/8\"",22.4]
[null,null,"No. 200",null,7.4999999999999997E-2,0,5,null,null,null,null,null,"3/4\"","19 mm","3/4\"",19]
[null,"DMS 9202\nGradation II","1/2\"",null,12.5,100,100,null,null,null,null,null,"5/8\"","16 mm","5/8\"",16]
[null,null,"3/8\"",null,9.5,95,100,null,null,null,null,null,"1/2\"","12.5 mm","1/2\"",12.5]
[null,null,"No. 4",null,4.75,17,40,null,null,null,null,null,"7/16\"","11.2 mm","7/16\"",11.2]
[null,null,"No. 10",null,2,2,15,null,null,null,null,null,"3/8\"","9.5 mm","3/8\"",9.5]
{"$rows_left_out":86}
{"sheet":"AggSource","index":2,"n_rows":49,"n_cols":12,"rows_kept":49,"cut":false,"hidden":true,"merged":[[2,1,2,2],[2,3,2,4],[2,5,2,6],[2,7,2,8],[2,9,2,10]]}
[]
[null,"Version:08/1/2012"]
[null,"Sandstone",null,"Limestone-Dolomite",null,"Gravel",null,"Igneous",null,"Lightweight",null,"Aggregate Code"]
[null,"Apple (Sawyer, OK)","0050437",1604,1501506,"Aztec Canyon","0418814","Bird Hill",1523213,"Streetman",1817502,{"$f":"IF(ISERROR(VLOOKUP('Design Gradation'!$E$20,INDIRECT(Bin1Source & \"Table\"),2,FALSE)),\"\",VLOOKUP('Design Gradation'!$E$20,INDIRECT(Bin1Source & \"Table\"),2,FALSE))","v":""}]
[null,"Brownlee",1402704,"Ardmore, OK","0050412","Beck",2110901,"Cinder Mountain","0050313",null,null,{"$f":"IF(ISERROR(VLOOKUP('Design Gradation'!$G$20,INDIRECT(Bin2Source & \"Table\"),2,FALSE)),\"\",VLOOKUP('Design Gradation'!$G$20,INDIRECT(Bin2Source & \"Table\"),2,FALSE))","v":""}]
[null,"Byrd Pit","0050447","Balcones Quarry",1504602,"Big Creek","0411807","Davis, OK.","0050439",null,null,{"$f":"IF(ISERROR(VLOOKUP('Design Gradation'!$I$20,INDIRECT(Bin3Source & \"Table\"),2,FALSE)),\"\",VLOOKUP('Design Gradation'!$I$20,INDIRECT(Bin3Source & \"Table\"),2,FALSE))","v":""}]
[null,null,null,"Beckmann",1501503,"Boys Ranch","0418008","Jones Mill","0050122",null,null,{"$f":"IF(ISERROR(VLOOKUP('Design Gradation'!$K$20,INDIRECT(Bin4Source & \"Table\"),2,FALSE)),\"\",VLOOKUP('Design Gradation'!$K$20,INDIRECT(Bin4Source & \"Table\"),2,FALSE))","v":""}]
[null,null,null,"Bridgeport","0224904","Broken Bow S & G","0050451","Knippa",1523206,null,null,{"$f":"IF(ISERROR(VLOOKUP('Design Gradation'!$M$20,INDIRECT(Bin5Source&\"Table\"),2,FALSE)),\"\",VLOOKUP('Design Gradation'!$M$20,INDIRECT(Bin5Source&\"Table\"),2,FALSE))","v":""}]
[null,null,null,"Brownwood",2302501,"D and D",2215905,"McKelligon-Granite",2407206,null,null,{"$f":"IF(ISERROR(VLOOKUP('Design Gradation'!$O$20,INDIRECT(Bin6Source & \"Table\"),2,FALSE)),\"\",VLOOKUP('Design Gradation'!$O$20,INDIRECT(Bin6Source & \"Table\"),2,FALSE))","v":""}]
[null,null,null,"Burnet",1402701,"Fletcher Pit","2506508","Mill Creek (Grnt), OK.","0050433",null,null,{"$f":"IF(ISERROR(VLOOKUP('Design Gradation'!$Q$20,INDIRECT(Bin7Source & \"Table\"),2,FALSE)),\"\",VLOOKUP('Design Gradation'!$Q$20,INDIRECT(Bin7Source & \"Table\"),2,FALSE))","v":""}]
[null,null,null,"Butterfield",2407220,"Frasier Pit","2506509","Padre Canyon",2411613]
[null,null,null,"Chambers","0224921","Galo",2224019,"Plant 1 ","0050106"]
[null,null,null,"Chapman",1523211,"Hoban","0619502","Porcupine Mountain","0040105"]
[null,null,null,"Coleman, OK","0050414","Kritser-Fain","0418812","Snyder, OK.","0050435"]
[null,null,null,"Cooperton, OK","0050415","Las Viboras",2110905,"Vado","0050310"]
{"$rows_left_out":35}
{"sheet":"Custom Gradation","index":3,"n_rows":13,"n_cols":8,"rows_kept":13,"cut":false,"hidden":true,"merged":[[1,4,1,5],[1,2,2,2],[1,3,2,3]]}
[]
[null,null,"Sieve Size",null,"Specification Limits"]
[null,null,null,null,"Lower","Upper "]
[null,{"$f":"IF(LEFT(CustomSieve1,2)=\"No\",CustomSieve1,LEFT(CustomSieve1,LEN(CustomSieve1)-1))","v":{"$error":"#VALUE!"}},null,{"$f":"IF(LEFT(CustomSieve1,1)=\"2\",50,VLOOKUP(C4,'Patching Mix Gradations'!O5:P30,2,FALSE))","v":{"$error":"#N/A"}},null,null,null,{"$f":"IF(Field1=\"Custom_Gradation\",\"Click Here\",\"\")","v":""}]
[null,{"$f":"IF(LEFT(CustomSieve2,2)=\"No\",CustomSieve2,LEFT(CustomSieve2,LEN(CustomSieve2)-1))","v":{"$error":"#VALUE!"}},null,{"$f":"IF(LEFT(CustomSieve2,1)=\"2\",50,VLOOKUP(C5,'Patching Mix Gradations'!O6:P31,2,FALSE))","v":{"$error":"#N/A"}}]
[null,{"$f":"IF(LEFT(CustomSieve3,2)=\"No\",CustomSieve3,LEFT(CustomSieve3,LEN(CustomSieve3)-1))","v":{"$error":"#VALUE!"}},null,{"$f":"IF(LEFT(CustomSieve3,1)=\"2\",50,VLOOKUP(C6,'Patching Mix Gradations'!O7:P32,2,FALSE))","v":{"$error":"#N/A"}}]
[null,{"$f":"IF(LEFT(CustomSieve4,2)=\"No\",CustomSieve4,LEFT(CustomSieve4,LEN(CustomSieve4)-1))","v":{"$error":"#VALUE!"}},null,{"$f":"IF(LEFT(CustomSieve4,1)=\"2\",50,VLOOKUP(C7,'Patching Mix Gradations'!O8:P33,2,FALSE))","v":{"$error":"#N/A"}}]
[null,{"$f":"IF(LEFT(CustomSieve5,2)=\"No\",CustomSieve5,LEFT(CustomSieve5,LEN(CustomSieve5)-1))","v":{"$error":"#VALUE!"}},null,{"$f":"IF(LEFT(CustomSieve5,1)=\"2\",50,VLOOKUP(C8,'Patching Mix Gradations'!O9:P34,2,FALSE))","v":{"$error":"#N/A"}}]
[null,{"$f":"IF(LEFT(CustomSieve6,2)=\"No\",CustomSieve6,LEFT(CustomSieve6,LEN(CustomSieve6)-1))","v":{"$error":"#VALUE!"}},null,{"$f":"IF(LEFT(CustomSieve6,1)=\"2\",50,VLOOKUP(C9,'Patching Mix Gradations'!O10:P35,2,FALSE))","v":{"$error":"#N/A"}}]
[null,{"$f":"IF(LEFT(CustomSieve7,2)=\"No\",CustomSieve7,LEFT(CustomSieve7,LEN(CustomSieve7)-1))","v":{"$error":"#VALUE!"}},null,{"$f":"IF(LEFT(CustomSieve7,1)=\"2\",50,VLOOKUP(C10,'Patching Mix Gradations'!O11:P36,2,FALSE))","v":{"$error":"#N/A"}}]
[null,{"$f":"IF(LEFT(CustomSieve8,2)=\"No\",CustomSieve8,LEFT(CustomSieve8,LEN(CustomSieve8)-1))","v":{"$error":"#VALUE!"}},null,{"$f":"IF(LEFT(CustomSieve8,1)=\"2\",50,VLOOKUP(C11,'Patching Mix Gradations'!O12:P37,2,FALSE))","v":{"$error":"#N/A"}}]
[null,{"$f":"IF(LEFT(CustomSieve9,2)=\"No\",CustomSieve9,LEFT(CustomSieve9,LEN(CustomSieve9)-1))","v":{"$error":"#VALUE!"}},null,{"$f":"IF(LEFT(CustomSieve9,1)=\"2\",50,VLOOKUP(C12,'Patching Mix Gradations'!O13:P38,2,FALSE))","v":{"$error":"#N/A"}}]
[null,{"$f":"IF(LEFT(CustomSieve10,2)=\"No\",CustomSieve10,LEFT(CustomSieve10,LEN(CustomSieve10)-1))","v":{"$error":"#VALUE!"}},null,{"$f":"IF(LEFT(CustomSieve10,1)=\"2\",50,VLOOKUP(C13,'Patching Mix Gradations'!O14:P39,2,FALSE))","v":{"$error":"#N/A"}}]

{"sheet":"9202-ASPPM Approval","index":4,"n_rows":55,"n_cols":7,"rows_kept":55,"cut":false,"hidden":false,"merged":[[54,6,54,7],[46,3,46,4],[49,3,49,4],[47,3,47,4],[51,3,51,4],[52,3,52,4],[0,1,1,6],[4,6,5,6],[28,1,29,1],[28,2,28,4],[2,2,2,6],[21,1,21,6],[7,1,7,6],[4,3,5,3],[4,4,5,4],[4,5,5,5],[3,1,3,6],[4,1,6,2],[27,1,27,6],[28,5,29,5],[28,6,29,6],[29,3,29,4],[44,1,44,6],[40,1,40,6],[41,1,41,2],[30,3,30,4],[36,3,36,4],[35,3,35,4],[34,3,34,4],[42,1,42,2],[41,3,41,5],[42,3,42,5],[33,3,33,4],[32,3,32,4],[31,3,31,4],[37,1,37,6],[38,2,38,4],[39,2,39,4]]}
[null,"DMS - 9202 ASPPM\nAsphaltic Concrete Patching Material (Stockpile Storage or Bagged)"]
[]
[null,"Sample ID:"]
[null,"All Season Pre-Coated Patching Mixture (ASPPM)"]
[null,"Asphalt pre-coat content on the coarse and fine aggregates. Must use AC-10, PG 64-22, or equivalent material in accordance with Item 300.",null,"Min","Max","Amount of\n Pre-coat","Meet\nRequirement?"]
[]
[null,null,null,1,null,null,{"$f":"IF(F7=\"\",\"\",IF(F7<1,\"FAIL\",\"PASS\"))","v":""}]
[null,"Asphalt Material Properties for ASPPM Binder"]
[null,"Property","Test Procedure","Min","Max","Sample Data","Meet\nRequirement?"]
[null,"Kinematic viscosity, 140°F, cSt","T 201",300,700,null,{"$f":"IF(F10=\"\",\"\",IF(F10<D10,\"FAIL\",IF(F10>E10,\"FAIL\",\"PASS\")))","v":""}]
[null,"Water, %","T 55","--",0.1,null,{"$f":"IF(F11=\"\",\"\",IF(F11>E11,\"FAIL\",\"PASS\"))","v":""}]
[null,"Flash point, T.O.C., °F","T 79",250,"--",null,{"$f":"IF(F12=\"\",\"\",IF(F12<D12,\"FAIL\",\"PASS\"))","v":""}]
[null,"Distillation test:","T 78"]
[null,"  Distillate, percentage by volume of total\n  distillate to 680°F"]
[null,"        to 437°F",null,0,0,null,{"$f":"IF(F15=\"\",\"\",IF(F15=0,\"PASS\",\"FAIL\"))","v":""}]
{"$rows_left_out":41}
{"sheet":"9202-SCM I Approval","index":5,"n_rows":52,"n_cols":7,"rows_kept":52,"cut":false,"hidden":false,"merged":[[46,3,46,4],[48,3,48,4],[49,3,49,4],[51,6,51,7],[39,1,39,2],[39,3,39,5],[40,1,40,6],[41,1,41,6],[43,3,43,4],[44,3,44,4],[38,1,38,2],[38,3,38,5],[27,3,27,4],[28,3,28,4],[29,3,29,4],[30,3,30,4],[31,3,31,4],[32,3,32,4],[33,3,33,4],[34,1,34,6],[35,2,35,4],[36,2,36,4],[37,1,37,6],[0,1,1,6],[2,2,2,6],[3,1,3,6],[17,1,17,6],[23,1,23,6],[26,3,26,4],[24,1,25,1],[24,2,24,4],[24,5,25,5],[24,6,25,6],[25,3,25,4]]}
[null,"DMS - 9202 SCM I (Special Cutback Material I)\nAsphaltic Concrete Patching Material (Stockpile Storage or Bagged)"]
[]
[null,"Sample ID:"]
[null,"Asphalt Material Properties for SCM I Binder"]
[null,"Property","Test Procedure","Min","Max","Sample Data","Meet\nRequirement?"]
[null,"Kinematic viscosity, 140°F, cSt","T 201",500,1000,null,{"$f":"IF(F6=\"\",\"\",IF(F6<D6,\"FAIL\",IF(F6>E6,\"FAIL\",\"PASS\")))","v":""}]
[null,"Water, %","T 55","--",0.2,null,{"$f":"IF(F7=\"\",\"\",IF(F7>E7,\"FAIL\",\"PASS\"))","v":""}]
[null,"Flash point, T.O.C., °F","T 79",174,"--",null,{"$f":"IF(F8=\"\",\"\",IF(F8<D8,\"FAIL\",\"PASS\"))","v":""}]
[null,"Distillation test:","T 78"]
[null,"  Distillate, percentage by volume of total\n  distillate to 680°F"]
[null,"        to 437°F",null,0,0,null,{"$f":"IF(F11=\"\",\"\",IF(F11=0,\"PASS\",\"FAIL\"))","v":""}]
[null,"        to 500°F",null,0,0.5,null,{"$f":"IF(F12=\"\",\"\",IF(F12>E12,\"FAIL\", IF(F12<0,\"FAIL\",\"PASS\")))","v":""}]
[null,"        to 600°F",null,20,60,null,{"$f":"IF(F13=\"\",\"\",IF(F13<D13,\"FAIL\",IF(F13>E13,\"FAIL\",\"PASS\")))","v":""}]
[null,"  Residue from distillation, volume %",null,76,100,null,{"$f":"IF(F14=\"\",\"\",IF(F14<D14,\"FAIL\",IF(F14>E14,\"FAIL\",\"PASS\")))","v":""}]
[null,"Tests on distillation residue:"]
{"$rows_left_out":38}
{"sheet":"9202-SCM II Approval","index":6,"n_rows":52,"n_cols":7,"rows_kept":52,"cut":false,"hidden":false,"merged":[[49,3,49,4],[51,6,51,7],[40,1,40,6],[41,1,41,6],[43,3,43,4],[44,3,44,4],[46,3,46,4],[48,3,48,4],[0,1,1,6],[2,2,2,6],[3,1,3,6],[17,1,17,6],[34,1,34,6],[32,3,32,4],[27,3,27,4],[28,3,28,4],[29,3,29,4],[30,3,30,4],[31,3,31,4],[23,1,23,6],[24,1,25,1],[24,2,24,4],[24,5,25,5],[24,6,25,6],[25,3,25,4],[39,1,39,2],[39,3,39,5],[33,3,33,4],[35,2,35,4],[37,1,37,6],[38,1,38,2],[38,3,38,5],[36,2,36,4],[26,3,26,4]]}
[null,"DMS - 9202 SCM II (Special Cutback Material II)\nAsphaltic Concrete Patching Material (Stockpile Storage or Bagged)"]
[]
[null,"Sample ID:"]
[null,"Asphalt Material Properties for SCM II Binder"]
[null,"Property","Test Procedure","Min","Max","Sample Data","Meet\nRequirement?"]
[null,"Kinematic viscosity, 140°F, cSt","T 201",1000,2000,null,{"$f":"IF(F6=\"\",\"\",IF(F6<D6,\"FAIL\",IF(F6>E6,\"FAIL\",\"PASS\")))","v":""}]
[null,"Water, %","T 55","--",0.2,null,{"$f":"IF(F7=\"\",\"\",IF(F7>E7,\"FAIL\",\"PASS\"))","v":""}]
[null,"Flash point, T.O.C., °F","T 79",174,"--",null,{"$f":"IF(F8=\"\",\"\",IF(F8<D8,\"FAIL\",\"PASS\"))","v":""}]
[null,"Distillation test:","T 78"]
[null,"  Distillate, percentage by volume of total\n  distillate to 680°F"]
[null,"        to 437°F",null,0,0,null,{"$f":"IF(F11=\"\",\"\",IF(F11=0,\"PASS\",\"FAIL\"))","v":""}]
[null,"        to 500°F",null,0,0.5,null,{"$f":"IF(F12=\"\",\"\",IF(F12>E12,\"FAIL\", IF(F12<0,\"FAIL\",\"PASS\")))","v":""}]
[null,"        to 600°F",null,15,50,null,{"$f":"IF(F13=\"\",\"\",IF(F13<D13,\"FAIL\",IF(F13>E13,\"FAIL\",\"PASS\")))","v":""}]
[null,"  Residue from distillation, volume %",null,82,100,null,{"$f":"IF(F14=\"\",\"\",IF(F14<D14,\"FAIL\",IF(F14>E14,\"FAIL\",\"PASS\")))","v":""}]
[null,"Tests on distillation residue:"]
{"$rows_left_out":38}
{"sheet":"9202-CMA-SG","index":7,"n_rows":54,"n_cols":7,"rows_kept":54,"cut":false,"hidden":false,"merged":[[53,6,53,7],[43,1,43,6],[45,3,45,4],[46,3,46,4],[48,3,48,4],[50,3,50,4],[51,3,51,4],[42,1,42,6],[33,3,33,4],[34,3,34,4],[35,3,35,4],[36,1,36,6],[37,2,37,4],[38,2,38,4],[39,1,39,6],[40,1,40,2],[40,3,40,5],[41,1,41,2],[41,3,41,5],[32,3,32,4],[0,1,1,6],[2,2,2,6],[3,1,3,6],[18,1,18,6],[24,1,24,6],[25,1,26,1],[25,2,25,4],[25,5,26,5],[25,6,26,6],[26,3,26,4],[27,3,27,4],[28,3,28,4],[29,3,29,4],[30,3,30,4],[31,3,31,4]]}
[null,"DMS - 9202 CMA-SG (Cold Mix Summer Grade)\nAsphaltic Concrete Patching Material (Stockpile Storage or Bagged)"]
[]
[null,"Sample ID:"]
[null,"Asphalt Material Properties for CMA-SG Binder"]
[null,"Property","Test Procedure","Min","Max","Sample Data","Meet\nRequirement?"]
[null,"Viscosity, 77°F, Poises","D 49571",3000,5000,null,{"$f":"IF(F6=\"\",\"\",IF(F6<D6,\"FAIL\",IF(F6>E6,\"FAIL\",\"PASS\")))","v":""}]
[null,"Water, %","T 55","--",1,null,{"$f":"IF(F7=\"\",\"\",IF(F7>E7,\"FAIL\",\"PASS\"))","v":""}]
[null,"Flash point, T.O.C., °F","T 79",158,"--",null,{"$f":"IF(F8=\"\",\"\",IF(F8<D8,\"FAIL\",\"PASS\"))","v":""}]
[null,"Distillation test:","T 78"]
[null,"  Distillate, percentage by volume of total\n  distillate to 680°F"]
[null,"        to 437°F",null,0,0,null,{"$f":"IF(F11=\"\",\"\",IF(F11=0,\"PASS\",\"FAIL\"))","v":""}]
[null,"        to 500°F",null,0,5,null,{"$f":"IF(F12=\"\",\"\",IF(F12>E12,\"FAIL\", IF(F12<0,\"FAIL\",\"PASS\")))","v":""}]
[null,"        to 600°F",null,30,70,null,{"$f":"IF(F13=\"\",\"\",IF(F13<D13,\"FAIL\",IF(F13>E13,\"FAIL\",\"PASS\")))","v":""}]
[null,"  Residue from distillation, volume %",null,78,100,null,{"$f":"IF(F14=\"\",\"\",IF(F14<D14,\"FAIL\",IF(F14>E14,\"FAIL\",\"PASS\")))","v":""}]
[null,"Tests on distillation residue:"]
{"$rows_left_out":40}
{"sheet":"9202-CMA-WG","index":8,"n_rows":54,"n_cols":7,"rows_kept":54,"cut":false,"hidden":false,"merged":[[25,1,26,1],[25,2,25,4],[25,5,26,5],[25,6,26,6],[26,3,26,4],[0,1,1,6],[2,2,2,6],[3,1,3,6],[18,1,18,6],[24,1,24,6],[27,3,27,4],[41,1,41,2],[41,3,41,5],[42,1,42,6],[43,1,43,6],[35,3,35,4],[36,1,36,6],[37,2,37,4],[38,2,38,4],[39,1,39,6],[40,1,40,2],[40,3,40,5],[29,3,29,4],[30,3,30,4],[31,3,31,4],[32,3,32,4],[48,3,48,4],[50,3,50,4],[51,3,51,4],[53,6,53,7],[28,3,28,4],[45,3,45,4],[46,3,46,4],[33,3,33,4],[34,3,34,4]]}
[null,"DMS - 9202 CMA-WG (Cold Mix Winter Grade)\nAsphaltic Concrete Patching Material (Stockpile Storage or Bagged)"]
[]
[null,"Sample ID:"]
[null,"Asphalt Material Properties for CMA-WG Binder"]
[null,"Property","Test Procedure","Min","Max","Sample Data","Meet\nRequirement?"]
[null,"Viscosity, 77°F, Poises","D 49571",1500,4000,null,{"$f":"IF(F6=\"\",\"\",IF(F6<D6,\"FAIL\",IF(F6>E6,\"FAIL\",\"PASS\")))","v":""}]
[null,"Water, %","T 55","--",1,null,{"$f":"IF(F7=\"\",\"\",IF(F7>E7,\"FAIL\",\"PASS\"))","v":""}]
[null,"Flash point, T.O.C., °F","T 79",158,"--",null,{"$f":"IF(F8=\"\",\"\",IF(F8<D8,\"FAIL\",\"PASS\"))","v":""}]
[null,"Distillation test:","T 78"]
[null,"  Distillate, percentage by volume of total\n  distillate to 680°F"]
[null,"        to 437°F",null,0,0,null,{"$f":"IF(F11=\"\",\"\",IF(F11=0,\"PASS\",\"FAIL\"))","v":""}]
[null,"        to 500°F",null,0,5,null,{"$f":"IF(F12=\"\",\"\",IF(F12>E12,\"FAIL\", IF(F12<0,\"FAIL\",\"PASS\")))","v":""}]
[null,"        to 600°F",null,30,70,null,{"$f":"IF(F13=\"\",\"\",IF(F13<D13,\"FAIL\",IF(F13>E13,\"FAIL\",\"PASS\")))","v":""}]
[null,"  Residue from distillation, volume %",null,78,100,null,{"$f":"IF(F14=\"\",\"\",IF(F14<D14,\"FAIL\",IF(F14>E14,\"FAIL\",\"PASS\")))","v":""}]
[null,"Tests on distillation residue:"]
{"$rows_left_out":40}
{"sheet":"9202-NVM Approval","index":9,"n_rows":49,"n_cols":7,"rows_kept":49,"cut":false,"hidden":false,"merged":[[48,6,48,7],[36,1,36,2],[36,3,36,5],[37,1,37,2],[37,3,37,5],[38,1,38,6],[40,3,40,4],[41,3,41,4],[43,3,43,4],[45,3,45,4],[46,3,46,4],[35,1,35,6],[24,3,24,4],[25,3,25,4],[26,3,26,4],[27,3,27,4],[28,3,28,4],[29,3,29,4],[30,3,30,4],[31,3,31,4],[32,1,32,6],[33,2,33,4],[34,2,34,4],[0,1,1,6],[2,2,2,6],[3,1,3,6],[15,1,15,6],[21,1,21,6],[22,1,23,1],[22,2,22,4],[22,5,23,5],[22,6,23,6],[23,3,23,4]]}
[null,"DMS - 9202 NVM (Non-Volatile Material)\nAsphaltic Concrete Patching Material (Stockpile Storage or Bagged)"]
[]
[null,"Sample ID:"]
[null,"Asphalt Material Properties for NVM Binder"]
[null,"Property","Test Procedure","Min","Max","Sample Data","Meet\nRequirement?"]
[null,"Flash point, T.O.C., °F","T 79",174,"--",null,{"$f":"IF(F6=\"\",\"\",IF(F6<D6,\"FAIL\",\"PASS\"))","v":""}]
[null,"Distillation test:","T 78"]
[null,"  Distillate, percentage by volume of total\n  distillate to 680°F"]
[null,"        to 437°F",null,0,0,null,{"$f":"IF(F9=\"\",\"\",IF(F9=0,\"PASS\",\"FAIL\"))","v":""}]
[null,"        to 500°F",null,0,0,null,{"$f":"IF(F10=\"\",\"\",IF(F10>E10,\"FAIL\", IF(F10<0,\"FAIL\",\"PASS\")))","v":""}]
[null,"        to 600°F",null,0,0,null,{"$f":"IF(F11=\"\",\"\",IF(F11<D11,\"FAIL\",IF(F11>E11,\"FAIL\",\"PASS\")))","v":""}]
[null,"  Residue from distillation, volume %",null,82,100,null,{"$f":"IF(F12=\"\",\"\",IF(F12<D12,\"FAIL\",IF(F12>E12,\"FAIL\",\"PASS\")))","v":""}]
[null,"Tests on distillation residue:"]
[null,"  Penetration, 100 g, 5 sec., 77°F","T 49",180,"--",null,{"$f":"IF(F14=\"\",\"\",IF(F14<D14,\"FAIL\",\"PASS\"))","v":""}]
[null,"  Solubility in trichloroethylene1, %","T 44",99,"--",null,{"$f":"IF(F15=\"\",\"\",IF(F15<D15,\"FAIL\",\"PASS\"))","v":""}]
{"$rows_left_out":35}
{"sheet":"9203 Approval","index":10,"n_rows":49,"n_cols":6,"rows_kept":49,"cut":false,"hidden":false,"merged":[[39,3,39,4],[41,3,41,4],[43,3,43,4],[44,3,44,4],[48,5,48,7],[38,3,38,4],[17,1,17,5],[19,1,19,5],[20,1,20,5],[25,1,25,5],[28,1,28,5],[32,1,32,5],[34,1,35,1],[34,2,35,2],[34,3,35,3],[34,4,35,4],[34,5,35,5],[15,1,15,5],[0,1,1,5],[2,2,2,5],[3,1,3,5],[6,1,6,5],[7,2,7,3]]}
[null,"9203 - Table 1\nClass I Dense Graded Rapid-Curing Asphalt Concrete"]
[]
[null,"Sample ID:"]
[null,"Asphalt Content Exclusive of Volatiles"]
[null,null,"Min","Max","Sample Data","Meet\nSpecification?"]
[null,"% by Weight",4,6.5,null,{"$f":"IF(E6=\"\",\"\",IF(E6<C6,\"FAIL\",IF(E6>D6,\"FAIL\",\"PASS\")))","v":""}]
[null,"Aggregate Gradation (% Passing by Weight)"]
[null,"Sieve Size","Gradation",null,"Sample\nGradation","Meet\nSpecification?"]
[null,"1/2\"",100,100,null,{"$f":"IF(E9=\"\",\"\",IF(E9<C9,\"FAIL\",IF(E9>D9,\"FAIL\",\"PASS\")))","v":""}]
[null,"3/8\"",95,100,null,""]
[null,"1/4\"",80,95,null,""]
[null,"No. 10",30,45,null,""]
[null,"No. 40",8,20,null,""]
[null,"No. 80",5,10,null,""]
[null,"No. 200",2,8,null,""]
{"$rows_left_out":34}