{"text_format":"1","workbook":"xlsx","n_sheets":7,"sheets":["Sieve Analysis","Sieve Analysis - OAG","RX","Revisions","Cummulative Mechanical Analysis","Passing Mechanical Analysis","Gradations"],"not_rendered":{"charts":5,"images":1,"macros":1,"external_links":0,"defined_names":256,"comments":1,"pivot_tables":0},"unopened":[{"sheet":"Cummulative Mechanical Analysis","index":4,"reason":"not_a_worksheet"},{"sheet":"Passing Mechanical Analysis","index":5,"reason":"not_a_worksheet"}],"bounds":{"document_bytes":16777216,"sheet_cells":100000,"rows_first":2000,"rows_last":500,"rows_between":2000,"halvings":0,"cell_chars":16384,"cell_head_chars":4096},"cells_cut":0,"cells_raw":0,"read":"whole","date_system":"1900"}

{"sheet":"Sieve Analysis","index":0,"n_rows":57,"n_cols":11,"rows_kept":57,"cut":false,"hidden":false,"merged":[[41,1,42,8],[44,1,44,8],[56,1,56,3],[52,6,52,8],[48,2,48,4],[50,2,50,4],[47,2,47,4],[52,1,52,3],[43,1,43,8],[45,2,45,4],[46,2,46,4],[39,3,39,4],[23,6,24,6],[36,4,36,5],[34,3,34,6],[37,4,37,5],[23,3,24,3],[23,5,24,5],[23,4,24,4],[10,3,10,4],[11,3,11,4],[12,3,12,4],[15,3,15,8],[10,7,10,8],[11,7,11,8],[12,7,12,8],[13,7,13,8],[13,3,13,4],[14,3,14,8],[0,0,0,1],[9,7,9,8],[9,3,9,4],[8,3,8,4],[7,7,7,8],[8,7,8,8],[7,3,7,4],[23,1,24,1],[16,3,16,4],[23,8,24,8],[16,7,16,8],[23,7,24,7]]}
["TxDOT Manuals >",null,null,"Tex-401-A","Tex-402-A"]
[null,"TEXAS DEPARTMENT OF TRANSPORTATION",null,null,null,null,null,null,null,null,176]
[null,null,null,null,null,null,null,null,null,null,3]
[null,null,null,null,null,null,null,null,null,null,"tx401-2.xlsm::45503.654421"]
[null,"SIEVE ANALYSIS FOR FINE & COARSE AGGREGATE",null,null,null,null,null,null,null,null,"Sieve Analysis"]
[null,"Tex-401-A"]
[null,null,null,null,null,null,null,null,{"$f":"\"TX401-2 :: File Version: \" & TEXT(MID(sn,SEARCH(\"::\",sn,1)+2,20),\"mm/dd/yy hh:mm:ss\")","v":"TX401-2 :: File Version: 07/30/24 15:42:22"}]
[null,null,"SAMPLE ID:",null,null,null,"SAMPLED DATE:"]
[null,null,"TEST NUMBER:",null,null,null,"LETTING DATE:"]
[null,null,"SAMPLE STATUS:",null,null,null,"CONTROLLING CSJ:"]
[null,null,"COUNTY:",null,null,null,"SPEC YEAR:"]
[null,null,"SAMPLED BY:",null,null,null,"SPEC ITEM:"]
[null,null,"SAMPLE LOCATION:",null,null,null,"SPECIAL PROVISION:"]
[null,null,"MATERIAL CODE:",null,null,null,"GRADE:"]
[null,null,"MATERIAL NAME:"]
[null,null,"PRODUCER:"]
[null,null,"AREA ENGINEER:",null,null,null,"PROJECT MANAGER:"]
[]
[null,null,"COURSE\\LIFT:",null,"STATION:",null,null,"DIST. FROM CL:"]
[]
[null,{"$f":"IF(Field4<>\"OAG\", \"Sieve Analysis\", \"Use the Sieve Analysis - OAG sheet to input data. Input tester information below.\")","v":"Sieve Analysis"}]
[null,"Tex-401-A"]
[]
[null,"Sieve Size",null,{"$f":"IF(C24=\"Cumulative\",\"Individual\",\"Cumulative\") & \" Weight Retained, (g)\"","v":"Cumulative Weight Retained, (g)"},"Cumulative Percent Retained, %","Cumulative Percent Passing, %",{"$f":"\"Lower \"&IF(SpecYear>=\"2004\",\"Passing\" &\" Spec Limit, %\",IF(Grade<>\"fbf\",\"Retained\",\"Passing\")&\" Spec Limit, %\")","v":"Lower Retained Spec Limit, %"},{"$f":"\"Upper \"&IF(SpecYear>=\"2004\",\"Passing\" &\" Spec Limit, %\",IF(Grade<>\"fbf\",\"Retained\",\"Passing\")&\" Spec Limit, %\")","v":"Upper Retained Spec Limit, %"},"Within Master Grading"]
[null,null,{"$f":"IF(C24=\"\",\"Individual\",\"Cumulative\") & \" Weight Retained, (g)\"","v":"Individual Weight Retained, (g)"}]
[null,{"$f":"IF(ISERROR(INDEX(INDIRECT(\"grade\"&Grade),1,IF(SpecYear=\"\",\"\",IF(SpecYear=\"1995\",4,3)))),\"\",IF(INDEX(INDIRECT(\"grade\"&Grade),1,IF(SpecYear=\"\",6,IF(SpecYear=\"1995\",4,3)))=0,\"\",INDEX(INDIRECT(\"grade\"&Grade),1,IF(SpecYear=\"\",\"\",IF(SpecYear=\"1995\",4,3)))))","v":""},null,{"$f":"IF($C26=\"\",\"\",$C26)","v":""},{"$f":"IF($C26=\"\",\"\",IF(retainedMethod=\"Cumulative\",C26/Total*100,D26/Total*100))","v":""},{"$f":"IF(E26=\"\",\"\",100-E26)","v":""},{"$f":"IF(SpecYear>=\"2004\",IF(ISERROR(INDEX(INDIRECT(\"grade\"&Grade),1,8)),\"\",INDEX(INDIRECT(\"grade\"&Grade),1,8)),IF(ISERROR(INDEX(INDIRECT(\"grade\"&Grade),1,5)),\"\",INDEX(INDIRECT(\"grade\"&Grade),1,5)))","v":""},{"$f":"IF(SpecYear>=\"2004\",IF(ISERROR(INDEX(INDIRECT(\"grade\"&Grade),1,7)),\"\",INDEX(INDIRECT(\"grade\"&Grade),1,7)),IF(ISERROR(INDEX(INDIRECT(\"grade\"&Grade),1,6)),\"\",INDEX(INDIRECT(\"grade\"&Grade),1,6)))","v":""},{"$f":"IF(F26=\"\",\"\",IF(SpecYear>=\"2004\",IF(AND($F26>=$G26,$F26<=$H26),\"Yes\",\"No\"),IF(Grade=\"FBF\",IF(AND($F26>=$G26,$F26<=$H26),\"Yes\",\"No\"),IF(AND($E26<=$H26,$E26>=$G26),\"Yes\",\"No\"))))","v":""}]
[null,{"$f":"IF(ISERROR(INDEX(INDIRECT(\"grade\"&Grade),2,IF(SpecYear=\"\",\"\",IF(SpecYear=\"1995\",4,3)))),\"\",IF(INDEX(INDIRECT(\"grade\"&Grade),2,IF(SpecYear=\"\",6,IF(SpecYear=\"1995\",4,3)))=0,\"\",INDEX(INDIRECT(\"grade\"&Grade),2,IF(SpecYear=\"\",\"\",IF(SpecYear=\"1995\",4,3)))))","v":""},null,{"$f":"IF(C27=\"\",\"\",IF(retainedMethod=\"Cumulative\",($C27-$C26),SUM($C$26:$C27)))","v":""},"",{"$f":"IF(E27=\"\",\"\",100-E27)","v":""},{"$f":"IF(SpecYear>=\"2004\",IF(ISERROR(INDEX(INDIRECT(\"grade\"&Grade),2,8)),\"\",INDEX(INDIRECT(\"grade\"&Grade),2,8)),IF(ISERROR(INDEX(INDIRECT(\"grade\"&Grade),2,5)),\"\",INDEX(INDIRECT(\"grade\"&Grade),2,5)))","v":""},{"$f":"IF(SpecYear>=\"2004\",IF(ISERROR(INDEX(INDIRECT(\"grade\"&Grade),2,7)),\"\",INDEX(INDIRECT(\"grade\"&Grade),2,7)),IF(ISERROR(INDEX(INDIRECT(\"grade\"&Grade),2,6)),\"\",INDEX(INDIRECT(\"grade\"&Grade),2,6)))","v":""},""]
[null,{"$f":"IF(ISERROR(INDEX(INDIRECT(\"grade\"&Grade),3,IF(SpecYear=\"\",\"\",IF(SpecYear=\"1995\",4,3)))),\"\",IF(INDEX(INDIRECT(\"grade\"&Grade),3,IF(SpecYear=\"\",6,IF(SpecYear=\"1995\",4,3)))=0,\"\",INDEX(INDIRECT(\"grade\"&Grade),3,IF(SpecYear=\"\",\"\",IF(SpecYear=\"1995\",4,3)))))","v":""},null,{"$f":"IF(C28=\"\",\"\",IF(retainedMethod=\"Cumulative\",($C28-$C27),SUM($C$26:$C28)))","v":""},{"$f":"IF($C28=\"\",\"\",IF(retainedMethod=\"Cumulative\",C28/Total*100,D28/Total*100))","v":""},"",{"$f":"IF(SpecYear>=\"2004\",IF(ISERROR(INDEX(INDIRECT(\"grade\"&Grade),3,8)),\"\",INDEX(INDIRECT(\"grade\"&Grade),3,8)),IF(ISERROR(INDEX(INDIRECT(\"grade\"&Grade),3,5)),\"\",INDEX(INDIRECT(\"grade\"&Grade),3,5)))","v":""},{"$f":"IF(SpecYear>=\"2004\",IF(ISERROR(INDEX(INDIRECT(\"grade\"&Grade),3,7)),\"\",INDEX(INDIRECT(\"grade\"&Grade),3,7)),IF(ISERROR(INDEX(INDIRECT(\"grade\"&Grade),3,6)),\"\",INDEX(INDIRECT(\"grade\"&Grade),3,6)))","v":""},""]
[null,{"$f":"IF(ISERROR(INDEX(INDIRECT(\"grade\"&Grade),4,IF(SpecYear=\"\",\"\",IF(SpecYear=\"1995\",4,3)))),\"\",IF(INDEX(INDIRECT(\"grade\"&Grade),4,IF(SpecYear=\"\",6,IF(SpecYear=\"1995\",4,3)))=0,\"\",INDEX(INDIRECT(\"grade\"&Grade),4,IF(SpecYear=\"\",\"\",IF(SpecYear=\"1995\",4,3)))))","v":""},null,{"$f":"IF(C29=\"\",\"\",IF(retainedMethod=\"Cumulative\",($C29-$C28),SUM($C$26:$C29)))","v":""},"","",{"$f":"IF(SpecYear>=\"2004\",IF(ISERROR(INDEX(INDIRECT(\"grade\"&Grade),4,8)),\"\",INDEX(INDIRECT(\"grade\"&Grade),4,8)),IF(ISERROR(INDEX(INDIRECT(\"grade\"&Grade),4,5)),\"\",INDEX(INDIRECT(\"grade\"&Grade),4,5)))","v":""},{"$f":"IF(SpecYear>=\"2004\",IF(ISERROR(INDEX(INDIRECT(\"grade\"&Grade),4,7)),\"\",INDEX(INDIRECT(\"grade\"&Grade),4,7)),IF(ISERROR(INDEX(INDIRECT(\"grade\"&Grade),4,6)),\"\",INDEX(INDIRECT(\"grade\"&Grade),4,6)))","v":""},""]
[null,{"$f":"IF(ISERROR(INDEX(INDIRECT(\"grade\"&Grade),5,IF(SpecYear=\"\",\"\",IF(SpecYear=\"1995\",4,3)))),\"\",IF(INDEX(INDIRECT(\"grade\"&Grade),5,IF(SpecYear=\"\",6,IF(SpecYear=\"1995\",4,3)))=0,\"\",INDEX(INDIRECT(\"grade\"&Grade),5,IF(SpecYear=\"\",\"\",IF(SpecYear=\"1995\",4,3)))))","v":""},null,{"$f":"IF(C30=\"\",\"\",IF(retainedMethod=\"Cumulative\",($C30-$C29),SUM($C$26:$C30)))","v":""},"","",{"$f":"IF(SpecYear>=\"2004\",IF(ISERROR(INDEX(INDIRECT(\"grade\"&Grade),5,8)),\"\",INDEX(INDIRECT(\"grade\"&Grade),5,8)),IF(ISERROR(INDEX(INDIRECT(\"grade\"&Grade),5,5)),\"\",INDEX(INDIRECT(\"grade\"&Grade),5,5)))","v":""},{"$f":"IF(SpecYear>=\"2004\",IF(ISERROR(INDEX(INDIRECT(\"grade\"&Grade),5,7)),\"\",INDEX(INDIRECT(\"grade\"&Grade),5,7)),IF(ISERROR(INDEX(INDIRECT(\"grade\"&Grade),5,6)),\"\",INDEX(INDIRECT(\"grade\"&Grade),5,6)))","v":""},""]
[null,{"$f":"IF(ISERROR(INDEX(INDIRECT(\"grade\"&Grade),6,IF(SpecYear=\"\",\"\",IF(SpecYear=\"1995\",4,3)))),\"\",IF(INDEX(INDIRECT(\"grade\"&Grade),6,IF(SpecYear=\"\",6,IF(SpecYear=\"1995\",4,3)))=0,\"\",INDEX(INDIRECT(\"grade\"&Grade),6,IF(SpecYear=\"\",\"\",IF(SpecYear=\"1995\",4,3)))))","v":""},null,{"$f":"IF(C31=\"\",\"\",IF(retainedMethod=\"Cumulative\",($C31-$C30),SUM($C$26:$C31)))","v":""},"","",{"$f":"IF(SpecYear>=\"2004\",IF(ISERROR(INDEX(INDIRECT(\"grade\"&Grade),6,8)),\"\",INDEX(INDIRECT(\"grade\"&Grade),6,8)),IF(ISERROR(INDEX(INDIRECT(\"grade\"&Grade),6,5)),\"\",INDEX(INDIRECT(\"grade\"&Grade),6,5)))","v":""},{"$f":"IF(SpecYear>=\"2004\",IF(ISERROR(INDEX(INDIRECT(\"grade\"&Grade),6,7)),\"\",INDEX(INDIRECT(\"grade\"&Grade),6,7)),IF(ISERROR(INDEX(INDIRECT(\"grade\"&Grade),6,6)),\"\",INDEX(INDIRECT(\"grade\"&Grade),6,6)))","v":""},""]
[null,{"$f":"IF(ISERROR(INDEX(INDIRECT(\"grade\"&Grade),7,IF(SpecYear=\"\",\"\",IF(SpecYear=\"1995\",4,3)))),\"\",IF(INDEX(INDIRECT(\"grade\"&Grade),7,IF(SpecYear=\"\",6,IF(SpecYear=\"1995\",4,3)))=0,\"\",INDEX(INDIRECT(\"grade\"&Grade),7,IF(SpecYear=\"\",\"\",IF(SpecYear=\"1995\",4,3)))))","v":""},null,{"$f":"IF(C32=\"\",\"\",IF(retainedMethod=\"Cumulative\",($C32-$C31),SUM($C$26:$C32)))","v":""},"","",{"$f":"IF(SpecYear>=\"2004\",IF(ISERROR(INDEX(INDIRECT(\"grade\"&Grade),7,8)),\"\",INDEX(INDIRECT(\"grade\"&Grade),7,8)),IF(ISERROR(INDEX(INDIRECT(\"grade\"&Grade),7,5)),\"\",INDEX(INDIRECT(\"grade\"&Grade),7,5)))","v":""},{"$f":"IF(SpecYear>=\"2004\",IF(ISERROR(INDEX(INDIRECT(\"grade\"&Grade),7,7)),\"\",INDEX(INDIRECT(\"grade\"&Grade),7,7)),IF(ISERROR(INDEX(INDIRECT(\"grade\"&Grade),7,6)),\"\",INDEX(INDIRECT(\"grade\"&Grade),7,6)))","v":""},""]
[null,{"$f":"IF(ISERROR(INDEX(INDIRECT(\"grade\"&Grade),8,IF(SpecYear=\"\",\"\",IF(SpecYear=\"1995\",4,3)))),\"\",IF(INDEX(INDIRECT(\"grade\"&Grade),8,IF(SpecYear=\"\",6,IF(SpecYear=\"1995\",4,3)))=0,\"\",INDEX(INDIRECT(\"grade\"&Grade),8,IF(SpecYear=\"\",\"\",IF(SpecYear=\"1995\",4,3)))))","v":""},null,{"$f":"IF(C33=\"\",\"\",IF(retainedMethod=\"Cumulative\",($C33-$C32),SUM($C$26:$C33)))","v":""},"","",{"$f":"IF(SpecYear>=\"2004\",IF(ISERROR(INDEX(INDIRECT(\"grade\"&Grade),8,8)),\"\",INDEX(INDIRECT(\"grade\"&Grade),8,8)),IF(ISERROR(INDEX(INDIRECT(\"grade\"&Grade),8,5)),\"\",INDEX(INDIRECT(\"grade\"&Grade),8,5)))","v":""},{"$f":"IF(SpecYear>=\"2004\",IF(ISERROR(INDEX(INDIRECT(\"grade\"&Grade),8,7)),\"\",INDEX(INDIRECT(\"grade\"&Grade),8,7)),IF(ISERROR(INDEX(INDIRECT(\"grade\"&Grade),8,6)),\"\",INDEX(INDIRECT(\"grade\"&Grade),8,6)))","v":""},""]
[null,{"$f":"IF(retainedMethod=\"cumulative\",\"Total:\",\"-\" & OFFSET(B34,-(COUNTBLANK(B26:B33)+1),0))","v":"-"}]
[null,"Total:",{"$f":"IF(ISERROR(IF(retainedMethod=\"Cumulative\",pan,SUM(C26:C34))),\"\",IF(retainedMethod=\"Cumulative\",pan,SUM(C26:C34)))","v":0},"Does The Average Sand Equivalent Exceed 85?"]
[]
[null,null,null,null,"Fineness Modulus"]
[null,null,null,null,"Tex-402-A"]
[]
[null,null,null,"Fineness Modulus:",null,{"$f":"SUM(E27:E32)/100","v":0},"<-- Not within Tolerance"]
[null,"Remarks:",{"$f":"NOW()","v":"2024-07-30T15:42:22.190"}]
[]
[]
[]
[]
[null,"Sample Method:","Sampled By:",null,null,"Sampled Date:"]
[null,"TX400"]
[null,"Test Method:","Tested By:",null,null,"Tested Date:"]
[null,"TX401"]
[]
[null,"TX402"]
[null,"Test Stamp Code:",null,null,"Omit Test:","Completed Date:","Reviewed By:"]
[]
[null,"Locked By:","TxDOT:","District:","Area:"]
[]
[null,"Authorized By:",null,null,"Authorized Date:","Version:"]
[null,null,null,null,null,{"$f":"IF(OR(AuthorizedDate>44159, ISBLANK(AuthorizedDate)), 1, 0)","v":1}]

{"sheet":"Sieve Analysis - OAG","index":1,"n_rows":33,"n_cols":16,"rows_kept":33,"cut":false,"hidden":false,"merged":[[0,0,0,1],[26,3,29,8],[30,3,30,8],[31,3,31,8],[32,3,32,8]]}
["TxDOT Manuals >",null,null,"Tex-401-A","Tex-402-A"]
[null,"TEXAS DEPARTMENT OF TRANSPORTATION",null,null,null,null,null,null,null,null,78]
[null,null,null,null,null,null,null,null,null,null,2]
[null,null,null,null,null,null,null,null,null,null,"tx401-2.xlsm::42286.453183"]
[null,"Tex-401-A: SIEVE ANALYSIS FOR FINE & COARSE AGGREGATE"]
[null,"Tex-470-A: OPTOMIZED AGGREGATE GRADATION FOR HYDRAULIC CEMENT CONCRETE MIX DESIGNS"]
[]
[null,"Sieve Analysis - OAG",null,"Tex-470-A"]
[null,"Sieve Size","Sieve Size\n(in)","Coarse Agg. 1\n% Passing","Coarse Agg. 2\n% Passing","Intermediate Agg. 1\n% Passing","Intermediate Agg. 2\n% Passing","Fine Agg. 1\n% Passing","Fine Agg. 2\n% Passing","Combined %\nPassing","Combined Cumulative % Retained","Combined % Retained",null,"Min range","Max range"]
[null,"2 1/2 in",2.5,null,null,null,null,null,null,{"$f":"IF(ISERROR(D10*$D$25+E10*$E$25+F10*$F$25+G10*$G$25+H10*$H$25+I10*$I$25),\"\",IF(version >=1, ROUND((D10*$D$25+E10*$E$25+F10*$F$25+G10*$G$25+H10*$H$25+I10*$I$25),1), ROUND((D10*$D$25+E10*$E$25+F10*$F$25+G10*$G$25+H10*$H$25+I10*I25),1)))","v":0},{"$f":"IF(ISERROR(100-J10),\"\",100-J10)","v":100},{"$f":"K10","v":100},{"$f":"IF(OR(L10>O10, L10<N10), \"Out of Tolerance\", \"\")","v":"Out of Tolerance"}]
[null,"2 in",2,null,null,null,null,null,null,0,{"$f":"IF(ISERROR(100-J11),\"\",100-J11)","v":100},{"$f":"IF(ISERROR(K11-K10),\"\",K11-K10)","v":0},""]
[null,"1 1/2 in",1.5,null,null,null,null,null,null,0,100,{"$f":"IF(ISERROR(K12-K11),\"\",K12-K11)","v":0},"",null,3]
[null,"1 in",1,null,null,null,null,null,null,0,100,0,"",null,16]
[null,"3/4 in",0.75,null,null,null,null,null,null,0,100,0,"",0,20]
[null,"1/2 in",0.5,null,null,null,null,null,null,0,100,0,"Out of Tolerance",4,20]
[null,"3/8 in",0.375,null,null,null,null,null,null,0,100,0,"Out of Tolerance",4,20]
[null,"No. 4",0.187,null,null,null,null,null,null,0,100,0,"Out of Tolerance",4,20]
[null,"No. 8",9.2999999999999999E-2,null,null,null,null,null,null,0,100,0,"",0,12]
[null,"No. 16",4.7E-2,null,null,null,null,null,null,0,100,0,"",0,12]
[null,"No. 30",2.4E-2,null,null,null,null,null,null,0,100,0,"Out of Tolerance",4,20]
[null,"No. 50",1.2E-2,null,null,null,null,null,null,0,100,0,"Out of Tolerance",4,20]
[null,"No. 100",6.0000000000000001E-3,null,null,null,null,null,null,0,100,0,"",0,10]
[null,"No. 200",3.0000000000000001E-3,null,null,null,null,null,null,0,100,0,"",null,2]
[null,"Pan",0,null,null,null,null,null,null,0,100,0]
[null,"Percent of Total Agg.",null,null,null,null,null,null,null,{"$f":"SUM(D25:I25)","v":0},{"$f":"IF(J25>1, \"<-- WARNING! Check aggregate percentages\", \"\")","v":""}]
[]
[null,null,null,{"$f":"IF(AND(N33=\"True\", O33=\"True\", P33=\"True\"), \"This Optimized Gradation meets the requirements of Tex-470-A.\", \"This Optimized Gradation DOES NOT meet the requirements of Tex-470-A.\")","v":"This Optimized Gradation DOES NOT meet the requirements of Tex-470-A."}]
[]
[]
[]
[null,null,null,"Check Gradation"]
[null,null,null,{"$f":"CONCATENATE(\"Check Sum of Sieves No. 8 - No. 30: >15% required, Current value = \", ROUND(SUM(L18:L20),1))","v":"Check Sum of Sieves No. 8 - No. 30: >15% required, Current value = 0"}]
[null,null,null,{"$f":"CONCATENATE(\"Check Sum of Sieves No. 30 - No. 200: between 24% and 34% required, Current value = \", ROUND(SUM(L20:L23),1))","v":"Check Sum of Sieves No. 30 - No. 200: between 24% and 34% required, Current value = 0"},null,null,null,null,null,null,null,null,null,{"$f":"IF(AND(M10=\"\", M11=\"\", M12=\"\", M13=\"\", M14=\"\", M15=\"\", M16=\"\", M17=\"\", M18=\"\", M19=\"\", M20=\"\", M21=\"\", M22=\"\", M23=\"\"), \"True\", \"False\")","v":"False"},{"$f":"IF(SUM(L18:L20)>15, \"True\", \"False\")","v":"False"},{"$f":"IF(AND(SUM(L20:L23)>=24, SUM(L20:L23)<=34), \"True\", \"False\")","v":"False"}]

{"sheet":"RX","index":2,"n_rows":213,"n_cols":10,"rows_kept":213,"cut":false,"hidden":true,"merged":[]}
[211]
["Fld_nbr","Value","Sheet","Desc_1","Desc_2","Desc_3","Desc_4","Desc_5","Desc_6","Desc_7"]
[1,{"$f":"IF('Sieve Analysis'!$B$42=\"\",\"\",'Sieve Analysis'!$B$42)","v":""},{"$f":"IF('Sieve Analysis'!$K$5=\"\",\"\",'Sieve Analysis'!$K$5)","v":"Sieve Analysis"},{"$f":"IF('Sieve Analysis'!$B$41=\"\",\"\",'Sieve Analysis'!$B$41)","v":"Remarks:"}]
[2,{"$f":"IF('Sieve Analysis'!$D$19=\"\",\"\",'Sieve Analysis'!$D$19)","v":""},{"$f":"IF('Sieve Analysis'!$K$5=\"\",\"\",'Sieve Analysis'!$K$5)","v":"Sieve Analysis"},{"$f":"IF('Sieve Analysis'!$C$19=\"\",\"\",'Sieve Analysis'!$C$19)","v":"COURSE\\LIFT:"}]
[3,{"$f":"IF('Sieve Analysis'!$C$49=\"\",\"\",'Sieve Analysis'!$C$49)","v":""},{"$f":"IF('Sieve Analysis'!$K$5=\"\",\"\",'Sieve Analysis'!$K$5)","v":"Sieve Analysis"},{"$f":"IF(\"Tested By \"=\"\",\"\",\"Tested By \")","v":"Tested By "},{"$f":"IF('Sieve Analysis'!$B$49=\"\",\"\",'Sieve Analysis'!$B$49)","v":"TX401"}]
[4,{"$f":"IF('Sieve Analysis'!$F$49=\"\",\"\",'Sieve Analysis'!$F$49)","v":""},{"$f":"IF('Sieve Analysis'!$K$5=\"\",\"\",'Sieve Analysis'!$K$5)","v":"Sieve Analysis"},{"$f":"IF(\"Tested Date \"=\"\",\"\",\"Tested Date \")","v":"Tested Date "},{"$f":"IF('Sieve Analysis'!$B$49=\"\",\"\",'Sieve Analysis'!$B$49)","v":"TX401"}]
[5,{"$f":"IF('Sieve Analysis'!$C$51=\"\",\"\",'Sieve Analysis'!$C$51)","v":""},{"$f":"IF('Sieve Analysis'!$K$5=\"\",\"\",'Sieve Analysis'!$K$5)","v":"Sieve Analysis"},{"$f":"IF(\"Tested By \"=\"\",\"\",\"Tested By \")","v":"Tested By "},{"$f":"IF('Sieve Analysis'!$B$51=\"\",\"\",'Sieve Analysis'!$B$51)","v":"TX402"}]
[6,{"$f":"IF('Sieve Analysis'!$F$51=\"\",\"\",'Sieve Analysis'!$F$51)","v":""},{"$f":"IF('Sieve Analysis'!$K$5=\"\",\"\",'Sieve Analysis'!$K$5)","v":"Sieve Analysis"},{"$f":"IF(\"Tested Date \"=\"\",\"\",\"Tested Date \")","v":"Tested Date "},{"$f":"IF('Sieve Analysis'!$B$51=\"\",\"\",'Sieve Analysis'!$B$51)","v":"TX402"}]
[7,{"$f":"IF('Sieve Analysis'!$C$26=\"\",\"\",'Sieve Analysis'!$C$26)","v":""},{"$f":"IF('Sieve Analysis'!$K$5=\"\",\"\",'Sieve Analysis'!$K$5)","v":"Sieve Analysis"},{"$f":"IF('Sieve Analysis'!$B$22=\"\",\"\",'Sieve Analysis'!$B$22)","v":"Tex-401-A"},{"$f":"IF('Sieve Analysis'!$C$25=\"\",\"\",'Sieve Analysis'!$C$25)","v":"Individual Weight Retained, (g)"},{"$f":"IF('Sieve Analysis'!$B$24=\"\",\"\",'Sieve Analysis'!$B$24)","v":"Sieve Size"},{"$f":"IF('Sieve Analysis'!$B$26=\"\",\"\",'Sieve Analysis'!$B$26)","v":""}]
[8,{"$f":"IF('Sieve Analysis'!$D$26=\"\",\"\",'Sieve Analysis'!$D$26)","v":""},{"$f":"IF('Sieve Analysis'!$K$5=\"\",\"\",'Sieve Analysis'!$K$5)","v":"Sieve Analysis"},{"$f":"IF('Sieve Analysis'!$B$22=\"\",\"\",'Sieve Analysis'!$B$22)","v":"Tex-401-A"},{"$f":"IF('Sieve Analysis'!$D$24=\"\",\"\",'Sieve Analysis'!$D$24)","v":"Cumulative Weight Retained, (g)"},{"$f":"IF('Sieve Analysis'!$B$24=\"\",\"\",'Sieve Analysis'!$B$24)","v":"Sieve Size"},{"$f":"IF('Sieve Analysis'!$B$26=\"\",\"\",'Sieve Analysis'!$B$26)","v":""}]
[9,{"$f":"IF('Sieve Analysis'!$E$26=\"\",\"\",'Sieve Analysis'!$E$26)","v":""},{"$f":"IF('Sieve Analysis'!$K$5=\"\",\"\",'Sieve Analysis'!$K$5)","v":"Sieve Analysis"},{"$f":"IF('Sieve Analysis'!$B$22=\"\",\"\",'Sieve Analysis'!$B$22)","v":"Tex-401-A"},{"$f":"IF('Sieve Analysis'!$E$24=\"\",\"\",'Sieve Analysis'!$E$24)","v":"Cumulative Percent Retained, %"},{"$f":"IF('Sieve Analysis'!$B$24=\"\",\"\",'Sieve Analysis'!$B$24)","v":"Sieve Size"},{"$f":"IF('Sieve Analysis'!$B$26=\"\",\"\",'Sieve Analysis'!$B$26)","v":""}]
[10,{"$f":"IF('Sieve Analysis'!$F$26=\"\",\"\",'Sieve Analysis'!$F$26)","v":""},{"$f":"IF('Sieve Analysis'!$K$5=\"\",\"\",'Sieve Analysis'!$K$5)","v":"Sieve Analysis"},{"$f":"IF('Sieve Analysis'!$B$22=\"\",\"\",'Sieve Analysis'!$B$22)","v":"Tex-401-A"},{"$f":"IF('Sieve Analysis'!$F$24=\"\",\"\",'Sieve Analysis'!$F$24)","v":"Cumulative Percent Passing, %"},{"$f":"IF('Sieve Analysis'!$B$24=\"\",\"\",'Sieve Analysis'!$B$24)","v":"Sieve Size"},{"$f":"IF('Sieve Analysis'!$B$26=\"\",\"\",'Sieve Analysis'!$B$26)","v":""}]
[11,{"$f":"IF('Sieve Analysis'!$G$26=\"\",\"\",'Sieve Analysis'!$G$26)","v":""},{"$f":"IF('Sieve Analysis'!$K$5=\"\",\"\",'Sieve Analysis'!$K$5)","v":"Sieve Analysis"},{"$f":"IF('Sieve Analysis'!$B$22=\"\",\"\",'Sieve Analysis'!$B$22)","v":"Tex-401-A"},{"$f":"IF('Sieve Analysis'!$G$24=\"\",\"\",'Sieve Analysis'!$G$24)","v":"Lower Retained Spec Limit, %"},{"$f":"IF('Sieve Analysis'!$B$24=\"\",\"\",'Sieve Analysis'!$B$24)","v":"Sieve Size"},{"$f":"IF('Sieve Analysis'!$B$26=\"\",\"\",'Sieve Analysis'!$B$26)","v":""}]
[12,{"$f":"IF('Sieve Analysis'!$H$26=\"\",\"\",'Sieve Analysis'!$H$26)","v":""},{"$f":"IF('Sieve Analysis'!$K$5=\"\",\"\",'Sieve Analysis'!$K$5)","v":"Sieve Analysis"},{"$f":"IF('Sieve Analysis'!$B$22=\"\",\"\",'Sieve Analysis'!$B$22)","v":"Tex-401-A"},{"$f":"IF('Sieve Analysis'!$H$24=\"\",\"\",'Sieve Analysis'!$H$24)","v":"Upper Retained Spec Limit, %"},{"$f":"IF('Sieve Analysis'!$B$24=\"\",\"\",'Sieve Analysis'!$B$24)","v":"Sieve Size"},{"$f":"IF('Sieve Analysis'!$B$26=\"\",\"\",'Sieve Analysis'!$B$26)","v":""}]
[13,{"$f":"IF('Sieve Analysis'!$I$26=\"\",\"\",'Sieve Analysis'!$I$26)","v":""},{"$f":"IF('Sieve Analysis'!$K$5=\"\",\"\",'Sieve Analysis'!$K$5)","v":"Sieve Analysis"},{"$f":"IF('Sieve Analysis'!$B$22=\"\",\"\",'Sieve Analysis'!$B$22)","v":"Tex-401-A"},{"$f":"IF('Sieve Analysis'!$I$24=\"\",\"\",'Sieve Analysis'!$I$24)","v":"Within Master Grading"},{"$f":"IF('Sieve Analysis'!$B$24=\"\",\"\",'Sieve Analysis'!$B$24)","v":"Sieve Size"},{"$f":"IF('Sieve Analysis'!$B$26=\"\",\"\",'Sieve Analysis'!$B$26)","v":""}]
[14,{"$f":"IF('Sieve Analysis'!$C$27=\"\",\"\",'Sieve Analysis'!$C$27)","v":""},{"$f":"IF('Sieve Analysis'!$K$5=\"\",\"\",'Sieve Analysis'!$K$5)","v":"Sieve Analysis"},{"$f":"IF('Sieve Analysis'!$B$22=\"\",\"\",'Sieve Analysis'!$B$22)","v":"Tex-401-A"},{"$f":"IF('Sieve Analysis'!$C$25=\"\",\"\",'Sieve Analysis'!$C$25)","v":"Individual Weight Retained, (g)"},{"$f":"IF('Sieve Analysis'!$B$24=\"\",\"\",'Sieve Analysis'!$B$24)","v":"Sieve Size"},{"$f":"IF('Sieve Analysis'!$B$27=\"\",\"\",'Sieve Analysis'!$B$27)","v":""}]
[15,{"$f":"IF('Sieve Analysis'!$D$27=\"\",\"\",'Sieve Analysis'!$D$27)","v":""},{"$f":"IF('Sieve Analysis'!$K$5=\"\",\"\",'Sieve Analysis'!$K$5)","v":"Sieve Analysis"},{"$f":"IF('Sieve Analysis'!$B$22=\"\",\"\",'Sieve Analysis'!$B$22)","v":"Tex-401-A"},{"$f":"IF('Sieve Analysis'!$D$24=\"\",\"\",'Sieve Analysis'!$D$24)","v":"Cumulative Weight Retained, (g)"},{"$f":"IF('Sieve Analysis'!$B$24=\"\",\"\",'Sieve Analysis'!$B$24)","v":"Sieve Size"},{"$f":"IF('Sieve Analysis'!$B$27=\"\",\"\",'Sieve Analysis'!$B$27)","v":""}]
[16,{"$f":"IF('Sieve Analysis'!$E$27=\"\",\"\",'Sieve Analysis'!$E$27)","v":""},{"$f":"IF('Sieve Analysis'!$K$5=\"\",\"\",'Sieve Analysis'!$K$5)","v":"Sieve Analysis"},{"$f":"IF('Sieve Analysis'!$B$22=\"\",\"\",'Sieve Analysis'!$B$22)","v":"Tex-401-A"},{"$f":"IF('Sieve Analysis'!$E$24=\"\",\"\",'Sieve Analysis'!$E$24)","v":"Cumulative Percent Retained, %"},{"$f":"IF('Sieve Analysis'!$B$24=\"\",\"\",'Sieve Analysis'!$B$24)","v":"Sieve Size"},{"$f":"IF('Sieve Analysis'!$B$27=\"\",\"\",'Sieve Analysis'!$B$27)","v":""}]
[17,{"$f":"IF('Sieve Analysis'!$F$27=\"\",\"\",'Sieve Analysis'!$F$27)","v":""},{"$f":"IF('Sieve Analysis'!$K$5=\"\",\"\",'Sieve Analysis'!$K$5)","v":"Sieve Analysis"},{"$f":"IF('Sieve Analysis'!$B$22=\"\",\"\",'Sieve Analysis'!$B$22)","v":"Tex-401-A"},{"$f":"IF('Sieve Analysis'!$F$24=\"\",\"\",'Sieve Analysis'!$F$24)","v":"Cumulative Percent Passing, %"},{"$f":"IF('Sieve Analysis'!$B$24=\"\",\"\",'Sieve Analysis'!$B$24)","v":"Sieve Size"},{"$f":"IF('Sieve Analysis'!$B$27=\"\",\"\",'Sieve Analysis'!$B$27)","v":""}]
[18,{"$f":"IF('Sieve Analysis'!$G$27=\"\",\"\",'Sieve Analysis'!$G$27)","v":""},{"$f":"IF('Sieve Analysis'!$K$5=\"\",\"\",'Sieve Analysis'!$K$5)","v":"Sieve Analysis"},{"$f":"IF('Sieve Analysis'!$B$22=\"\",\"\",'Sieve Analysis'!$B$22)","v":"Tex-401-A"},{"$f":"IF('Sieve Analysis'!$G$24=\"\",\"\",'Sieve Analysis'!$G$24)","v":"Lower Retained Spec Limit, %"},{"$f":"IF('Sieve Analysis'!$B$24=\"\",\"\",'Sieve Analysis'!$B$24)","v":"Sieve Size"},{"$f":"IF('Sieve Analysis'!$B$27=\"\",\"\",'Sieve Analysis'!$B$27)","v":""}]
[19,{"$f":"IF('Sieve Analysis'!$H$27=\"\",\"\",'Sieve Analysis'!$H$27)","v":""},{"$f":"IF('Sieve Analysis'!$K$5=\"\",\"\",'Sieve Analysis'!$K$5)","v":"Sieve Analysis"},{"$f":"IF('Sieve Analysis'!$B$22=\"\",\"\",'Sieve Analysis'!$B$22)","v":"Tex-401-A"},{"$f":"IF('Sieve Analysis'!$H$24=\"\",\"\",'Sieve Analysis'!$H$24)","v":"Upper Retained Spec Limit, %"},{"$f":"IF('Sieve Analysis'!$B$24=\"\",\"\",'Sieve Analysis'!$B$24)","v":"Sieve Size"},{"$f":"IF('Sieve Analysis'!$B$27=\"\",\"\",'Sieve Analysis'!$B$27)","v":""}]
[20,{"$f":"IF('Sieve Analysis'!$I$27=\"\",\"\",'Sieve Analysis'!$I$27)","v":""},{"$f":"IF('Sieve Analysis'!$K$5=\"\",\"\",'Sieve Analysis'!$K$5)","v":"Sieve Analysis"},{"$f":"IF('Sieve Analysis'!$B$22=\"\",\"\",'Sieve Analysis'!$B$22)","v":"Tex-401-A"},{"$f":"IF('Sieve Analysis'!$I$24=\"\",\"\",'Sieve Analysis'!$I$24)","v":"Within Master Grading"},{"$f":"IF('Sieve Analysis'!$B$24=\"\",\"\",'Sieve Analysis'!$B$24)","v":"Sieve Size"},{"$f":"IF('Sieve Analysis'!$B$27=\"\",\"\",'Sieve Analysis'!$B$27)","v":""}]
[21,{"$f":"IF('Sieve Analysis'!$C$28=\"\",\"\",'Sieve Analysis'!$C$28)","v":""},{"$f":"IF('Sieve Analysis'!$K$5=\"\",\"\",'Sieve Analysis'!$K$5)","v":"Sieve Analysis"},{"$f":"IF('Sieve Analysis'!$B$22=\"\",\"\",'Sieve Analysis'!$B$22)","v":"Tex-401-A"},{"$f":"IF('Sieve Analysis'!$C$25=\"\",\"\",'Sieve Analysis'!$C$25)","v":"Individual Weight Retained, (g)"},{"$f":"IF('Sieve Analysis'!$B$24=\"\",\"\",'Sieve Analysis'!$B$24)","v":"Sieve Size"},{"$f":"IF('Sieve Analysis'!$B$28=\"\",\"\",'Sieve Analysis'!$B$28)","v":""}]
[22,{"$f":"IF('Sieve Analysis'!$D$28=\"\",\"\",'Sieve Analysis'!$D$28)","v":""},{"$f":"IF('Sieve Analysis'!$K$5=\"\",\"\",'Sieve Analysis'!$K$5)","v":"Sieve Analysis"},{"$f":"IF('Sieve Analysis'!$B$22=\"\",\"\",'Sieve Analysis'!$B$22)","v":"Tex-401-A"},{"$f":"IF('Sieve Analysis'!$D$24=\"\",\"\",'Sieve Analysis'!$D$24)","v":"Cumulative Weight Retained, (g)"},{"$f":"IF('Sieve Analysis'!$B$24=\"\",\"\",'Sieve Analysis'!$B$24)","v":"Sieve Size"},{"$f":"IF('Sieve Analysis'!$B$28=\"\",\"\",'Sieve Analysis'!$B$28)","v":""}]
[23,{"$f":"IF('Sieve Analysis'!$E$28=\"\",\"\",'Sieve Analysis'!$E$28)","v":""},{"$f":"IF('Sieve Analysis'!$K$5=\"\",\"\",'Sieve Analysis'!$K$5)","v":"Sieve Analysis"},{"$f":"IF('Sieve Analysis'!$B$22=\"\",\"\",'Sieve Analysis'!$B$22)","v":"Tex-401-A"},{"$f":"IF('Sieve Analysis'!$E$24=\"\",\"\",'Sieve Analysis'!$E$24)","v":"Cumulative Percent Retained, %"},{"$f":"IF('Sieve Analysis'!$B$24=\"\",\"\",'Sieve Analysis'!$B$24)","v":"Sieve Size"},{"$f":"IF('Sieve Analysis'!$B$28=\"\",\"\",'Sieve Analysis'!$B$28)","v":""}]
[24,{"$f":"IF('Sieve Analysis'!$F$28=\"\",\"\",'Sieve Analysis'!$F$28)","v":""},{"$f":"IF('Sieve Analysis'!$K$5=\"\",\"\",'Sieve Analysis'!$K$5)","v":"Sieve Analysis"},{"$f":"IF('Sieve Analysis'!$B$22=\"\",\"\",'Sieve Analysis'!$B$22)","v":"Tex-401-A"},{"$f":"IF('Sieve Analysis'!$F$24=\"\",\"\",'Sieve Analysis'!$F$24)","v":"Cumulative Percent Passing, %"},{"$f":"IF('Sieve Analysis'!$B$24=\"\",\"\",'Sieve Analysis'!$B$24)","v":"Sieve Size"},{"$f":"IF('Sieve Analysis'!$B$28=\"\",\"\",'Sieve Analysis'!$B$28)","v":""}]
[25,{"$f":"IF('Sieve Analysis'!$G$28=\"\",\"\",'Sieve Analysis'!$G$28)","v":""},{"$f":"IF('Sieve Analysis'!$K$5=\"\",\"\",'Sieve Analysis'!$K$5)","v":"Sieve Analysis"},{"$f":"IF('Sieve Analysis'!$B$22=\"\",\"\",'Sieve Analysis'!$B$22)","v":"Tex-401-A"},{"$f":"IF('Sieve Analysis'!$G$24=\"\",\"\",'Sieve Analysis'!$G$24)","v":"Lower Retained Spec Limit, %"},{"$f":"IF('Sieve Analysis'!$B$24=\"\",\"\",'Sieve Analysis'!$B$24)","v":"Sieve Size"},{"$f":"IF('Sieve Analysis'!$B$28=\"\",\"\",'Sieve Analysis'!$B$28)","v":""}]
[26,{"$f":"IF('Sieve Analysis'!$H$28=\"\",\"\",'Sieve Analysis'!$H$28)","v":""},{"$f":"IF('Sieve Analysis'!$K$5=\"\",\"\",'Sieve Analysis'!$K$5)","v":"Sieve Analysis"},{"$f":"IF('Sieve Analysis'!$B$22=\"\",\"\",'Sieve Analysis'!$B$22)","v":"Tex-401-A"},{"$f":"IF('Sieve Analysis'!$H$24=\"\",\"\",'Sieve Analysis'!$H$24)","v":"Upper Retained Spec Limit, %"},{"$f":"IF('Sieve Analysis'!$B$24=\"\",\"\",'Sieve Analysis'!$B$24)","v":"Sieve Size"},{"$f":"IF('Sieve Analysis'!$B$28=\"\",\"\",'Sieve Analysis'!$B$28)","v":""}]
[27,{"$f":"IF('Sieve Analysis'!$I$28=\"\",\"\",'Sieve Analysis'!$I$28)","v":""},{"$f":"IF('Sieve Analysis'!$K$5=\"\",\"\",'Sieve Analysis'!$K$5)","v":"Sieve Analysis"},{"$f":"IF('Sieve Analysis'!$B$22=\"\",\"\",'Sieve Analysis'!$B$22)","v":"Tex-401-A"},{"$f":"IF('Sieve Analysis'!$I$24=\"\",\"\",'Sieve Analysis'!$I$24)","v":"Within Master Grading"},{"$f":"IF('Sieve Analysis'!$B$24=\"\",\"\",'Sieve Analysis'!$B$24)","v":"Sieve Size"},{"$f":"IF('Sieve Analysis'!$B$28=\"\",\"\",'Sieve Analysis'!$B$28)","v":""}]
[28,{"$f":"IF('Sieve Analysis'!$C$29=\"\",\"\",'Sieve Analysis'!$C$29)","v":""},{"$f":"IF('Sieve Analysis'!$K$5=\"\",\"\",'Sieve Analysis'!$K$5)","v":"Sieve Analysis"},{"$f":"IF('Sieve Analysis'!$B$22=\"\",\"\",'Sieve Analysis'!$B$22)","v":"Tex-401-A"},{"$f":"IF('Sieve Analysis'!$C$25=\"\",\"\",'Sieve Analysis'!$C$25)","v":"Individual Weight Retained, (g)"},{"$f":"IF('Sieve Analysis'!$B$24=\"\",\"\",'Sieve Analysis'!$B$24)","v":"Sieve Size"},{"$f":"IF('Sieve Analysis'!$B$29=\"\",\"\",'Sieve Analysis'!$B$29)","v":""}]
[29,{"$f":"IF('Sieve Analysis'!$D$29=\"\",\"\",'Sieve Analysis'!$D$29)","v":""},{"$f":"IF('Sieve Analysis'!$K$5=\"\",\"\",'Sieve Analysis'!$K$5)","v":"Sieve Analysis"},{"$f":"IF('Sieve Analysis'!$B$22=\"\",\"\",'Sieve Analysis'!$B$22)","v":"Tex-401-A"},{"$f":"IF('Sieve Analysis'!$D$24=\"\",\"\",'Sieve Analysis'!$D$24)","v":"Cumulative Weight Retained, (g)"},{"$f":"IF('Sieve Analysis'!$B$24=\"\",\"\",'Sieve Analysis'!$B$24)","v":"Sieve Size"},{"$f":"IF('Sieve Analysis'!$B$29=\"\",\"\",'Sieve Analysis'!$B$29)","v":""}]
[30,{"$f":"IF('Sieve Analysis'!$E$29=\"\",\"\",'Sieve Analysis'!$E$29)","v":""},{"$f":"IF('Sieve Analysis'!$K$5=\"\",\"\",'Sieve Analysis'!$K$5)","v":"Sieve Analysis"},{"$f":"IF('Sieve Analysis'!$B$22=\"\",\"\",'Sieve Analysis'!$B$22)","v":"Tex-401-A"},{"$f":"IF('Sieve Analysis'!$E$24=\"\",\"\",'Sieve Analysis'!$E$24)","v":"Cumulative Percent Retained, %"},{"$f":"IF('Sieve Analysis'!$B$24=\"\",\"\",'Sieve Analysis'!$B$24)","v":"Sieve Size"},{"$f":"IF('Sieve Analysis'!$B$29=\"\",\"\",'Sieve Analysis'!$B$29)","v":""}]
[31,{"$f":"IF('Sieve Analysis'!$F$29=\"\",\"\",'Sieve Analysis'!$F$29)","v":""},{"$f":"IF('Sieve Analysis'!$K$5=\"\",\"\",'Sieve Analysis'!$K$5)","v":"Sieve Analysis"},{"$f":"IF('Sieve Analysis'!$B$22=\"\",\"\",'Sieve Analysis'!$B$22)","v":"Tex-401-A"},{"$f":"IF('Sieve Analysis'!$F$24=\"\",\"\",'Sieve Analysis'!$F$24)","v":"Cumulative Percent Passing, %"},{"$f":"IF('Sieve Analysis'!$B$24=\"\",\"\",'Sieve Analysis'!$B$24)","v":"Sieve Size"},{"$f":"IF('Sieve Analysis'!$B$29=\"\",\"\",'Sieve Analysis'!$B$29)","v":""}]
[32,{"$f":"IF('Sieve Analysis'!$G$29=\"\",\"\",'Sieve Analysis'!$G$29)","v":""},{"$f":"IF('Sieve Analysis'!$K$5=\"\",\"\",'Sieve Analysis'!$K$5)","v":"Sieve Analysis"},{"$f":"IF('Sieve Analysis'!$B$22=\"\",\"\",'Sieve Analysis'!$B$22)","v":"Tex-401-A"},{"$f":"IF('Sieve Analysis'!$G$24=\"\",\"\",'Sieve Analysis'!$G$24)","v":"Lower Retained Spec Limit, %"},{"$f":"IF('Sieve Analysis'!$B$24=\"\",\"\",'Sieve Analysis'!$B$24)","v":"Sieve Size"},{"$f":"IF('Sieve Analysis'!$B$29=\"\",\"\",'Sieve Analysis'!$B$29)","v":""}]
[33,{"$f":"IF('Sieve Analysis'!$H$29=\"\",\"\",'Sieve Analysis'!$H$29)","v":""},{"$f":"IF('Sieve Analysis'!$K$5=\"\",\"\",'Sieve Analysis'!$K$5)","v":"Sieve Analysis"},{"$f":"IF('Sieve Analysis'!$B$22=\"\",\"\",'Sieve Analysis'!$B$22)","v":"Tex-401-A"},{"$f":"IF('Sieve Analysis'!$H$24=\"\",\"\",'Sieve Analysis'!$H$24)","v":"Upper Retained Spec Limit, %"},{"$f":"IF('Sieve Analysis'!$B$24=\"\",\"\",'Sieve Analysis'!$B$24)","v":"Sieve Size"},{"$f":"IF('Sieve Analysis'!$B$29=\"\",\"\",'Sieve Analysis'!$B$29)","v":""}]
[34,{"$f":"IF('Sieve Analysis'!$I$29=\"\",\"\",'Sieve Analysis'!$I$29)","v":""},{"$f":"IF('Sieve Analysis'!$K$5=\"\",\"\",'Sieve Analysis'!$K$5)","v":"Sieve Analysis"},{"$f":"IF('Sieve Analysis'!$B$22=\"\",\"\",'Sieve Analysis'!$B$22)","v":"Tex-401-A"},{"$f":"IF('Sieve Analysis'!$I$24=\"\",\"\",'Sieve Analysis'!$I$24)","v":"Within Master Grading"},{"$f":"IF('Sieve Analysis'!$B$24=\"\",\"\",'Sieve Analysis'!$B$24)","v":"Sieve Size"},{"$f":"IF('Sieve Analysis'!$B$29=\"\",\"\",'Sieve Analysis'!$B$29)","v":""}]
[35,{"$f":"IF('Sieve Analysis'!$C$30=\"\",\"\",'Sieve Analysis'!$C$30)","v":""},{"$f":"IF('Sieve Analysis'!$K$5=\"\",\"\",'Sieve Analysis'!$K$5)","v":"Sieve Analysis"},{"$f":"IF('Sieve Analysis'!$B$22=\"\",\"\",'Sieve Analysis'!$B$22)","v":"Tex-401-A"},{"$f":"IF('Sieve Analysis'!$C$25=\"\",\"\",'Sieve Analysis'!$C$25)","v":"Individual Weight Retained, (g)"},{"$f":"IF('Sieve Analysis'!$B$24=\"\",\"\",'Sieve Analysis'!$B$24)","v":"Sieve Size"},{"$f":"IF('Sieve Analysis'!$B$30=\"\",\"\",'Sieve Analysis'!$B$30)","v":""}]
[36,{"$f":"IF('Sieve Analysis'!$D$30=\"\",\"\",'Sieve Analysis'!$D$30)","v":""},{"$f":"IF('Sieve Analysis'!$K$5=\"\",\"\",'Sieve Analysis'!$K$5)","v":"Sieve Analysis"},{"$f":"IF('Sieve Analysis'!$B$22=\"\",\"\",'Sieve Analysis'!$B$22)","v":"Tex-401-A"},{"$f":"IF('Sieve Analysis'!$D$24=\"\",\"\",'Sieve Analysis'!$D$24)","v":"Cumulative Weight Retained, (g)"},{"$f":"IF('Sieve Analysis'!$B$24=\"\",\"\",'Sieve Analysis'!$B$24)","v":"Sieve Size"},{"$f":"IF('Sieve Analysis'!$B$30=\"\",\"\",'Sieve Analysis'!$B$30)","v":""}]
[37,{"$f":"IF('Sieve Analysis'!$E$30=\"\",\"\",'Sieve Analysis'!$E$30)","v":""},{"$f":"IF('Sieve Analysis'!$K$5=\"\",\"\",'Sieve Analysis'!$K$5)","v":"Sieve Analysis"},{"$f":"IF('Sieve Analysis'!$B$22=\"\",\"\",'Sieve Analysis'!$B$22)","v":"Tex-401-A"},{"$f":"IF('Sieve Analysis'!$E$24=\"\",\"\",'Sieve Analysis'!$E$24)","v":"Cumulative Percent Retained, %"},{"$f":"IF('Sieve Analysis'!$B$24=\"\",\"\",'Sieve Analysis'!$B$24)","v":"Sieve Size"},{"$f":"IF('Sieve Analysis'!$B$30=\"\",\"\",'Sieve Analysis'!$B$30)","v":""}]
[38,{"$f":"IF('Sieve Analysis'!$F$30=\"\",\"\",'Sieve Analysis'!$F$30)","v":""},{"$f":"IF('Sieve Analysis'!$K$5=\"\",\"\",'Sieve Analysis'!$K$5)","v":"Sieve Analysis"},{"$f":"IF('Sieve Analysis'!$B$22=\"\",\"\",'Sieve Analysis'!$B$22)","v":"Tex-401-A"},{"$f":"IF('Sieve Analysis'!$F$24=\"\",\"\",'Sieve Analysis'!$F$24)","v":"Cumulative Percent Passing, %"},{"$f":"IF('Sieve Analysis'!$B$24=\"\",\"\",'Sieve Analysis'!$B$24)","v":"Sieve Size"},{"$f":"IF('Sieve Analysis'!$B$30=\"\",\"\",'Sieve Analysis'!$B$30)","v":""}]
[39,{"$f":"IF('Sieve Analysis'!$G$30=\"\",\"\",'Sieve Analysis'!$G$30)","v":""},{"$f":"IF('Sieve Analysis'!$K$5=\"\",\"\",'Sieve Analysis'!$K$5)","v":"Sieve Analysis"},{"$f":"IF('Sieve Analysis'!$B$22=\"\",\"\",'Sieve Analysis'!$B$22)","v":"Tex-401-A"},{"$f":"IF('Sieve Analysis'!$G$24=\"\",\"\",'Sieve Analysis'!$G$24)","v":"Lower Retained Spec Limit, %"},{"$f":"IF('Sieve Analysis'!$B$24=\"\",\"\",'Sieve Analysis'!$B$24)","v":"Sieve Size"},{"$f":"IF('Sieve Analysis'!$B$30=\"\",\"\",'Sieve Analysis'!$B$30)","v":""}]
[40,{"$f":"IF('Sieve Analysis'!$H$30=\"\",\"\",'Sieve Analysis'!$H$30)","v":""},{"$f":"IF('Sieve Analysis'!$K$5=\"\",\"\",'Sieve Analysis'!$K$5)","v":"Sieve Analysis"},{"$f":"IF('Sieve Analysis'!$B$22=\"\",\"\",'Sieve Analysis'!$B$22)","v":"Tex-401-A"},{"$f":"IF('Sieve Analysis'!$H$24=\"\",\"\",'Sieve Analysis'!$H$24)","v":"Upper Retained Spec Limit, %"},{"$f":"IF('Sieve Analysis'!$B$24=\"\",\"\",'Sieve Analysis'!$B$24)","v":"Sieve Size"},{"$f":"IF('Sieve Analysis'!$B$30=\"\",\"\",'Sieve Analysis'!$B$30)","v":""}]
[41,{"$f":"IF('Sieve Analysis'!$I$30=\"\",\"\",'Sieve Analysis'!$I$30)","v":""},{"$f":"IF('Sieve Analysis'!$K$5=\"\",\"\",'Sieve Analysis'!$K$5)","v":"Sieve Analysis"},{"$f":"IF('Sieve Analysis'!$B$22=\"\",\"\",'Sieve Analysis'!$B$22)","v":"Tex-401-A"},{"$f":"IF('Sieve Analysis'!$I$24=\"\",\"\",'Sieve Analysis'!$I$24)","v":"Within Master Grading"},{"$f":"IF('Sieve Analysis'!$B$24=\"\",\"\",'Sieve Analysis'!$B$24)","v":"Sieve Size"},{"$f":"IF('Sieve Analysis'!$B$30=\"\",\"\",'Sieve Analysis'!$B$30)","v":""}]
[42,{"$f":"IF('Sieve Analysis'!$C$31=\"\",\"\",'Sieve Analysis'!$C$31)","v":""},{"$f":"IF('Sieve Analysis'!$K$5=\"\",\"\",'Sieve Analysis'!$K$5)","v":"Sieve Analysis"},{"$f":"IF('Sieve Analysis'!$B$22=\"\",\"\",'Sieve Analysis'!$B$22)","v":"Tex-401-A"},{"$f":"IF('Sieve Analysis'!$C$25=\"\",\"\",'Sieve Analysis'!$C$25)","v":"Individual Weight Retained, (g)"},{"$f":"IF('Sieve Analysis'!$B$24=\"\",\"\",'Sieve Analysis'!$B$24)","v":"Sieve Size"},{"$f":"IF('Sieve Analysis'!$B$31=\"\",\"\",'Sieve Analysis'!$B$31)","v":""}]
[43,{"$f":"IF('Sieve Analysis'!$D$31=\"\",\"\",'Sieve Analysis'!$D$31)","v":""},{"$f":"IF('Sieve Analysis'!$K$5=\"\",\"\",'Sieve Analysis'!$K$5)","v":"Sieve Analysis"},{"$f":"IF('Sieve Analysis'!$B$22=\"\",\"\",'Sieve Analysis'!$B$22)","v":"Tex-401-A"},{"$f":"IF('Sieve Analysis'!$D$24=\"\",\"\",'Sieve Analysis'!$D$24)","v":"Cumulative Weight Retained, (g)"},{"$f":"IF('Sieve Analysis'!$B$24=\"\",\"\",'Sieve Analysis'!$B$24)","v":"Sieve Size"},{"$f":"IF('Sieve Analysis'!$B$31=\"\",\"\",'Sieve Analysis'!$B$31)","v":""}]
[44,{"$f":"IF('Sieve Analysis'!$E$31=\"\",\"\",'Sieve Analysis'!$E$31)","v":""},{"$f":"IF('Sieve Analysis'!$K$5=\"\",\"\",'Sieve Analysis'!$K$5)","v":"Sieve Analysis"},{"$f":"IF('Sieve Analysis'!$B$22=\"\",\"\",'Sieve Analysis'!$B$22)","v":"Tex-401-A"},{"$f":"IF('Sieve Analysis'!$E$24=\"\",\"\",'Sieve Analysis'!$E$24)","v":"Cumulative Percent Retained, %"},{"$f":"IF('Sieve Analysis'!$B$24=\"\",\"\",'Sieve Analysis'!$B$24)","v":"Sieve Size"},{"$f":"IF('Sieve Analysis'!$B$31=\"\",\"\",'Sieve Analysis'!$B$31)","v":""}]
[45,{"$f":"IF('Sieve Analysis'!$F$31=\"\",\"\",'Sieve Analysis'!$F$31)","v":""},{"$f":"IF('Sieve Analysis'!$K$5=\"\",\"\",'Sieve Analysis'!$K$5)","v":"Sieve Analysis"},{"$f":"IF('Sieve Analysis'!$B$22=\"\",\"\",'Sieve Analysis'!$B$22)","v":"Tex-401-A"},{"$f":"IF('Sieve Analysis'!$F$24=\"\",\"\",'Sieve Analysis'!$F$24)","v":"Cumulative Percent Passing, %"},{"$f":"IF('Sieve Analysis'!$B$24=\"\",\"\",'Sieve Analysis'!$B$24)","v":"Sieve Size"},{"$f":"IF('Sieve Analysis'!$B$31=\"\",\"\",'Sieve Analysis'!$B$31)","v":""}]
[46,{"$f":"IF('Sieve Analysis'!$G$31=\"\",\"\",'Sieve Analysis'!$G$31)","v":""},{"$f":"IF('Sieve Analysis'!$K$5=\"\",\"\",'Sieve Analysis'!$K$5)","v":"Sieve Analysis"},{"$f":"IF('Sieve Analysis'!$B$22=\"\",\"\",'Sieve Analysis'!$B$22)","v":"Tex-401-A"},{"$f":"IF('Sieve Analysis'!$G$24=\"\",\"\",'Sieve Analysis'!$G$24)","v":"Lower Retained Spec Limit, %"},{"$f":"IF('Sieve Analysis'!$B$24=\"\",\"\",'Sieve Analysis'!$B$24)","v":"Sieve Size"},{"$f":"IF('Sieve Analysis'!$B$31=\"\",\"\",'Sieve Analysis'!$B$31)","v":""}]
[47,{"$f":"IF('Sieve Analysis'!$H$31=\"\",\"\",'Sieve Analysis'!$H$31)","v":""},{"$f":"IF('Sieve Analysis'!$K$5=\"\",\"\",'Sieve Analysis'!$K$5)","v":"Sieve Analysis"},{"$f":"IF('Sieve Analysis'!$B$22=\"\",\"\",'Sieve Analysis'!$B$22)","v":"Tex-401-A"},{"$f":"IF('Sieve Analysis'!$H$24=\"\",\"\",'Sieve Analysis'!$H$24)","v":"Upper Retained Spec Limit, %"},{"$f":"IF('Sieve Analysis'!$B$24=\"\",\"\",'Sieve Analysis'!$B$24)","v":"Sieve Size"},{"$f":"IF('Sieve Analysis'!$B$31=\"\",\"\",'Sieve Analysis'!$B$31)","v":""}]
[48,{"$f":"IF('Sieve Analysis'!$I$31=\"\",\"\",'Sieve Analysis'!$I$31)","v":""},{"$f":"IF('Sieve Analysis'!$K$5=\"\",\"\",'Sieve Analysis'!$K$5)","v":"Sieve Analysis"},{"$f":"IF('Sieve Analysis'!$B$22=\"\",\"\",'Sieve Analysis'!$B$22)","v":"Tex-401-A"},{"$f":"IF('Sieve Analysis'!$I$24=\"\",\"\",'Sieve Analysis'!$I$24)","v":"Within Master Grading"},{"$f":"IF('Sieve Analysis'!$B$24=\"\",\"\",'Sieve Analysis'!$B$24)","v":"Sieve Size"},{"$f":"IF('Sieve Analysis'!$B$31=\"\",\"\",'Sieve Analysis'!$B$31)","v":""}]
[49,{"$f":"IF('Sieve Analysis'!$C$32=\"\",\"\",'Sieve Analysis'!$C$32)","v":""},{"$f":"IF('Sieve Analysis'!$K$5=\"\",\"\",'Sieve Analysis'!$K$5)","v":"Sieve Analysis"},{"$f":"IF('Sieve Analysis'!$B$22=\"\",\"\",'Sieve Analysis'!$B$22)","v":"Tex-401-A"},{"$f":"IF('Sieve Analysis'!$C$25=\"\",\"\",'Sieve Analysis'!$C$25)","v":"Individual Weight Retained, (g)"},{"$f":"IF('Sieve Analysis'!$B$24=\"\",\"\",'Sieve Analysis'!$B$24)","v":"Sieve Size"},{"$f":"IF('Sieve Analysis'!$B$32=\"\",\"\",'Sieve Analysis'!$B$32)","v":""}]
[50,{"$f":"IF('Sieve Analysis'!$D$32=\"\",\"\",'Sieve Analysis'!$D$32)","v":""},{"$f":"IF('Sieve Analysis'!$K$5=\"\",\"\",'Sieve Analysis'!$K$5)","v":"Sieve Analysis"},{"$f":"IF('Sieve Analysis'!$B$22=\"\",\"\",'Sieve Analysis'!$B$22)","v":"Tex-401-A"},{"$f":"IF('Sieve Analysis'!$D$24=\"\",\"\",'Sieve Analysis'!$D$24)","v":"Cumulative Weight Retained, (g)"},{"$f":"IF('Sieve Analysis'!$B$24=\"\",\"\",'Sieve Analysis'!$B$24)","v":"Sieve Size"},{"$f":"IF('Sieve Analysis'!$B$32=\"\",\"\",'Sieve Analysis'!$B$32)","v":""}]
[51,{"$f":"IF('Sieve Analysis'!$E$32=\"\",\"\",'Sieve Analysis'!$E$32)","v":""},{"$f":"IF('Sieve Analysis'!$K$5=\"\",\"\",'Sieve Analysis'!$K$5)","v":"Sieve Analysis"},{"$f":"IF('Sieve Analysis'!$B$22=\"\",\"\",'Sieve Analysis'!$B$22)","v":"Tex-401-A"},{"$f":"IF('Sieve Analysis'!$E$24=\"\",\"\",'Sieve Analysis'!$E$24)","v":"Cumulative Percent Retained, %"},{"$f":"IF('Sieve Analysis'!$B$24=\"\",\"\",'Sieve Analysis'!$B$24)","v":"Sieve Size"},{"$f":"IF('Sieve Analysis'!$B$32=\"\",\"\",'Sieve Analysis'!$B$32)","v":""}]
[52,{"$f":"IF('Sieve Analysis'!$F$32=\"\",\"\",'Sieve Analysis'!$F$32)","v":""},{"$f":"IF('Sieve Analysis'!$K$5=\"\",\"\",'Sieve Analysis'!$K$5)","v":"Sieve Analysis"},{"$f":"IF('Sieve Analysis'!$B$22=\"\",\"\",'Sieve Analysis'!$B$22)","v":"Tex-401-A"},{"$f":"IF('Sieve Analysis'!$F$24=\"\",\"\",'Sieve Analysis'!$F$24)","v":"Cumulative Percent Passing, %"},{"$f":"IF('Sieve Analysis'!$B$24=\"\",\"\",'Sieve Analysis'!$B$24)","v":"Sieve Size"},{"$f":"IF('Sieve Analysis'!$B$32=\"\",\"\",'Sieve Analysis'!$B$32)","v":""}]
[53,{"$f":"IF('Sieve Analysis'!$G$32=\"\",\"\",'Sieve Analysis'!$G$32)","v":""},{"$f":"IF('Sieve Analysis'!$K$5=\"\",\"\",'Sieve Analysis'!$K$5)","v":"Sieve Analysis"},{"$f":"IF('Sieve Analysis'!$B$22=\"\",\"\",'Sieve Analysis'!$B$22)","v":"Tex-401-A"},{"$f":"IF('Sieve Analysis'!$G$24=\"\",\"\",'Sieve Analysis'!$G$24)","v":"Lower Retained Spec Limit, %"},{"$f":"IF('Sieve Analysis'!$B$24=\"\",\"\",'Sieve Analysis'!$B$24)","v":"Sieve Size"},{"$f":"IF('Sieve Analysis'!$B$32=\"\",\"\",'Sieve Analysis'!$B$32)","v":""}]
[54,{"$f":"IF('Sieve Analysis'!$H$32=\"\",\"\",'Sieve Analysis'!$H$32)","v":""},{"$f":"IF('Sieve Analysis'!$K$5=\"\",\"\",'Sieve Analysis'!$K$5)","v":"Sieve Analysis"},{"$f":"IF('Sieve Analysis'!$B$22=\"\",\"\",'Sieve Analysis'!$B$22)","v":"Tex-401-A"},{"$f":"IF('Sieve Analysis'!$H$24=\"\",\"\",'Sieve Analysis'!$H$24)","v":"Upper Retained Spec Limit, %"},{"$f":"IF('Sieve Analysis'!$B$24=\"\",\"\",'Sieve Analysis'!$B$24)","v":"Sieve Size"},{"$f":"IF('Sieve Analysis'!$B$32=\"\",\"\",'Sieve Analysis'!$B$32)","v":""}]
[55,{"$f":"IF('Sieve Analysis'!$I$32=\"\",\"\",'Sieve Analysis'!$I$32)","v":""},{"$f":"IF('Sieve Analysis'!$K$5=\"\",\"\",'Sieve Analysis'!$K$5)","v":"Sieve Analysis"},{"$f":"IF('Sieve Analysis'!$B$22=\"\",\"\",'Sieve Analysis'!$B$22)","v":"Tex-401-A"},{"$f":"IF('Sieve Analysis'!$I$24=\"\",\"\",'Sieve Analysis'!$I$24)","v":"Within Master Grading"},{"$f":"IF('Sieve Analysis'!$B$24=\"\",\"\",'Sieve Analysis'!$B$24)","v":"Sieve Size"},{"$f":"IF('Sieve Analysis'!$B$32=\"\",\"\",'Sieve Analysis'!$B$32)","v":""}]
[56,{"$f":"IF('Sieve Analysis'!$C$33=\"\",\"\",'Sieve Analysis'!$C$33)","v":""},{"$f":"IF('Sieve Analysis'!$K$5=\"\",\"\",'Sieve Analysis'!$K$5)","v":"Sieve Analysis"},{"$f":"IF('Sieve Analysis'!$B$22=\"\",\"\",'Sieve Analysis'!$B$22)","v":"Tex-401-A"},{"$f":"IF('Sieve Analysis'!$C$25=\"\",\"\",'Sieve Analysis'!$C$25)","v":"Individual Weight Retained, (g)"},{"$f":"IF('Sieve Analysis'!$B$24=\"\",\"\",'Sieve Analysis'!$B$24)","v":"Sieve Size"},{"$f":"IF('Sieve Analysis'!$B$33=\"\",\"\",'Sieve Analysis'!$B$33)","v":""}]
[57,{"$f":"IF('Sieve Analysis'!$D$33=\"\",\"\",'Sieve Analysis'!$D$33)","v":""},{"$f":"IF('Sieve Analysis'!$K$5=\"\",\"\",'Sieve Analysis'!$K$5)","v":"Sieve Analysis"},{"$f":"IF('Sieve Analysis'!$B$22=\"\",\"\",'Sieve Analysis'!$B$22)","v":"Tex-401-A"},{"$f":"IF('Sieve Analysis'!$D$24=\"\",\"\",'Sieve Analysis'!$D$24)","v":"Cumulative Weight Retained, (g)"},{"$f":"IF('Sieve Analysis'!$B$24=\"\",\"\",'Sieve Analysis'!$B$24)","v":"Sieve Size"},{"$f":"IF('Sieve Analysis'!$B$33=\"\",\"\",'Sieve Analysis'!$B$33)","v":""}]
[58,{"$f":"IF('Sieve Analysis'!$E$33=\"\",\"\",'Sieve Analysis'!$E$33)","v":""},{"$f":"IF('Sieve Analysis'!$K$5=\"\",\"\",'Sieve Analysis'!$K$5)","v":"Sieve Analysis"},{"$f":"IF('Sieve Analysis'!$B$22=\"\",\"\",'Sieve Analysis'!$B$22)","v":"Tex-401-A"},{"$f":"IF('Sieve Analysis'!$E$24=\"\",\"\",'Sieve Analysis'!$E$24)","v":"Cumulative Percent Retained, %"},{"$f":"IF('Sieve Analysis'!$B$24=\"\",\"\",'Sieve Analysis'!$B$24)","v":"Sieve Size"},{"$f":"IF('Sieve Analysis'!$B$33=\"\",\"\",'Sieve Analysis'!$B$33)","v":""}]
[59,{"$f":"IF('Sieve Analysis'!$F$33=\"\",\"\",'Sieve Analysis'!$F$33)","v":""},{"$f":"IF('Sieve Analysis'!$K$5=\"\",\"\",'Sieve Analysis'!$K$5)","v":"Sieve Analysis"},{"$f":"IF('Sieve Analysis'!$B$22=\"\",\"\",'Sieve Analysis'!$B$22)","v":"Tex-401-A"},{"$f":"IF('Sieve Analysis'!$F$24=\"\",\"\",'Sieve Analysis'!$F$24)","v":"Cumulative Percent Passing, %"},{"$f":"IF('Sieve Analysis'!$B$24=\"\",\"\",'Sieve Analysis'!$B$24)","v":"Sieve Size"},{"$f":"IF('Sieve Analysis'!$B$33=\"\",\"\",'Sieve Analysis'!$B$33)","v":""}]
[60,{"$f":"IF('Sieve Analysis'!$G$33=\"\",\"\",'Sieve Analysis'!$G$33)","v":""},{"$f":"IF('Sieve Analysis'!$K$5=\"\",\"\",'Sieve Analysis'!$K$5)","v":"Sieve Analysis"},{"$f":"IF('Sieve Analysis'!$B$22=\"\",\"\",'Sieve Analysis'!$B$22)","v":"Tex-401-A"},{"$f":"IF('Sieve Analysis'!$G$24=\"\",\"\",'Sieve Analysis'!$G$24)","v":"Lower Retained Spec Limit, %"},{"$f":"IF('Sieve Analysis'!$B$24=\"\",\"\",'Sieve Analysis'!$B$24)","v":"Sieve Size"},{"$f":"IF('Sieve Analysis'!$B$33=\"\",\"\",'Sieve Analysis'!$B$33)","v":""}]
[61,{"$f":"IF('Sieve Analysis'!$H$33=\"\",\"\",'Sieve Analysis'!$H$33)","v":""},{"$f":"IF('Sieve Analysis'!$K$5=\"\",\"\",'Sieve Analysis'!$K$5)","v":"Sieve Analysis"},{"$f":"IF('Sieve Analysis'!$B$22=\"\",\"\",'Sieve Analysis'!$B$22)","v":"Tex-401-A"},{"$f":"IF('Sieve Analysis'!$H$24=\"\",\"\",'Sieve Analysis'!$H$24)","v":"Upper Retained Spec Limit, %"},{"$f":"IF('Sieve Analysis'!$B$24=\"\",\"\",'Sieve Analysis'!$B$24)","v":"Sieve Size"},{"$f":"IF('Sieve Analysis'!$B$33=\"\",\"\",'Sieve Analysis'!$B$33)","v":""}]
[62,{"$f":"IF('Sieve Analysis'!$I$33=\"\",\"\",'Sieve Analysis'!$I$33)","v":""},{"$f":"IF('Sieve Analysis'!$K$5=\"\",\"\",'Sieve Analysis'!$K$5)","v":"Sieve Analysis"},{"$f":"IF('Sieve Analysis'!$B$22=\"\",\"\",'Sieve Analysis'!$B$22)","v":"Tex-401-A"},{"$f":"IF('Sieve Analysis'!$I$24=\"\",\"\",'Sieve Analysis'!$I$24)","v":"Within Master Grading"},{"$f":"IF('Sieve Analysis'!$B$24=\"\",\"\",'Sieve Analysis'!$B$24)","v":"Sieve Size"},{"$f":"IF('Sieve Analysis'!$B$33=\"\",\"\",'Sieve Analysis'!$B$33)","v":""}]
[63,{"$f":"IF('Sieve Analysis'!$C$34=\"\",\"\",'Sieve Analysis'!$C$34)","v":""},{"$f":"IF('Sieve Analysis'!$K$5=\"\",\"\",'Sieve Analysis'!$K$5)","v":"Sieve Analysis"},{"$f":"IF('Sieve Analysis'!$B$22=\"\",\"\",'Sieve Analysis'!$B$22)","v":"Tex-401-A"},{"$f":"IF('Sieve Analysis'!$C$25=\"\",\"\",'Sieve Analysis'!$C$25)","v":"Individual Weight Retained, (g)"},{"$f":"IF('Sieve Analysis'!$B$24=\"\",\"\",'Sieve Analysis'!$B$24)","v":"Sieve Size"},{"$f":"IF('Sieve Analysis'!$B$34=\"\",\"\",'Sieve Analysis'!$B$34)","v":"-"}]
[64,{"$f":"IF('Sieve Analysis'!$C$35=\"\",\"\",'Sieve Analysis'!$C$35)","v":0},{"$f":"IF('Sieve Analysis'!$K$5=\"\",\"\",'Sieve Analysis'!$K$5)","v":"Sieve Analysis"},{"$f":"IF('Sieve Analysis'!$B$22=\"\",\"\",'Sieve Analysis'!$B$22)","v":"Tex-401-A"},{"$f":"IF('Sieve Analysis'!$C$25=\"\",\"\",'Sieve Analysis'!$C$25)","v":"Individual Weight Retained, (g)"},{"$f":"IF('Sieve Analysis'!$B$24=\"\",\"\",'Sieve Analysis'!$B$24)","v":"Sieve Size"},{"$f":"IF('Sieve Analysis'!$B$35=\"\",\"\",'Sieve Analysis'!$B$35)","v":"Total:"}]
[65,{"$f":"IF('Sieve Analysis'!$H$35=\"\",\"\",'Sieve Analysis'!$H$35)","v":""},{"$f":"IF('Sieve Analysis'!$K$5=\"\",\"\",'Sieve Analysis'!$K$5)","v":"Sieve Analysis"},{"$f":"IF('Sieve Analysis'!$B$22=\"\",\"\",'Sieve Analysis'!$B$22)","v":"Tex-401-A"},{"$f":"IF('Sieve Analysis'!$D$35=\"\",\"\",'Sieve Analysis'!$D$35)","v":"Does The Average Sand Equivalent Exceed 85?"}]
[66,{"$f":"IF('Sieve Analysis'!$E$40=\"\",\"\",'Sieve Analysis'!$E$40)","v":""},{"$f":"IF('Sieve Analysis'!$K$5=\"\",\"\",'Sieve Analysis'!$K$5)","v":"Sieve Analysis"},{"$f":"IF('Sieve Analysis'!$E$38=\"\",\"\",'Sieve Analysis'!$E$38)","v":"Tex-402-A"},{"$f":"IF('Sieve Analysis'!$C$40=\"\",\"\",'Sieve Analysis'!$C$40)","v":""}]
[67,{"$f":"IF('Sieve Analysis'!$H$40=\"\",\"\",'Sieve Analysis'!$H$40)","v":""},{"$f":"IF('Sieve Analysis'!$K$5=\"\",\"\",'Sieve Analysis'!$K$5)","v":"Sieve Analysis"},{"$f":"IF('Sieve Analysis'!$E$38=\"\",\"\",'Sieve Analysis'!$E$38)","v":"Tex-402-A"},{"$f":"IF('Sieve Analysis'!$F$40=\"\",\"\",'Sieve Analysis'!$F$40)","v":0}]
[68,{"$f":"IF('Sieve Analysis - OAG'!D10=\"\",\"\",'Sieve Analysis - OAG'!D10)","v":""},{"$f":"IF('Sieve Analysis - OAG'!$B$8=\"\",\"\",'Sieve Analysis - OAG'!$B$8)","v":"Sieve Analysis - OAG"},{"$f":"IF('Sieve Analysis - OAG'!$D$8=\"\",\"\",'Sieve Analysis - OAG'!$D$8)","v":"Tex-470-A"},{"$f":"IF('Sieve Analysis - OAG'!$D$9=\"\",\"\",'Sieve Analysis - OAG'!$D$9)","v":"Coarse Agg. 1\n% Passing"},{"$f":"IF('Sieve Analysis - OAG'!$B$9=\"\",\"\",'Sieve Analysis - OAG'!$B$9)","v":"Sieve Size"},{"$f":"IF('Sieve Analysis - OAG'!$B$10=\"\",\"\",'Sieve Analysis - OAG'!$B$10)","v":"2 1/2 in"}]
[69,{"$f":"IF('Sieve Analysis - OAG'!D11=\"\",\"\",'Sieve Analysis - OAG'!D11)","v":""},{"$f":"IF('Sieve Analysis - OAG'!$B$8=\"\",\"\",'Sieve Analysis - OAG'!$B$8)","v":"Sieve Analysis - OAG"},{"$f":"IF('Sieve Analysis - OAG'!$D$8=\"\",\"\",'Sieve Analysis - OAG'!$D$8)","v":"Tex-470-A"},{"$f":"IF('Sieve Analysis - OAG'!$D$9=\"\",\"\",'Sieve Analysis - OAG'!$D$9)","v":"Coarse Agg. 1\n% Passing"},{"$f":"IF('Sieve Analysis - OAG'!$B$9=\"\",\"\",'Sieve Analysis - OAG'!$B$9)","v":"Sieve Size"},{"$f":"IF('Sieve Analysis - OAG'!$B$11=\"\",\"\",'Sieve Analysis - OAG'!$B$11)","v":"2 in"}]
[70,{"$f":"IF('Sieve Analysis - OAG'!D12=\"\",\"\",'Sieve Analysis - OAG'!D12)","v":""},{"$f":"IF('Sieve Analysis - OAG'!$B$8=\"\",\"\",'Sieve Analysis - OAG'!$B$8)","v":"Sieve Analysis - OAG"},{"$f":"IF('Sieve Analysis - OAG'!$D$8=\"\",\"\",'Sieve Analysis - OAG'!$D$8)","v":"Tex-470-A"},{"$f":"IF('Sieve Analysis - OAG'!$D$9=\"\",\"\",'Sieve Analysis - OAG'!$D$9)","v":"Coarse Agg. 1\n% Passing"},{"$f":"IF('Sieve Analysis - OAG'!$B$9=\"\",\"\",'Sieve Analysis - OAG'!$B$9)","v":"Sieve Size"},{"$f":"IF('Sieve Analysis - OAG'!$B$12=\"\",\"\",'Sieve Analysis - OAG'!$B$12)","v":"1 1/2 in"}]
[71,{"$f":"IF('Sieve Analysis - OAG'!D13=\"\",\"\",'Sieve Analysis - OAG'!D13)","v":""},{"$f":"IF('Sieve Analysis - OAG'!$B$8=\"\",\"\",'Sieve Analysis - OAG'!$B$8)","v":"Sieve Analysis - OAG"},{"$f":"IF('Sieve Analysis - OAG'!$D$8=\"\",\"\",'Sieve Analysis - OAG'!$D$8)","v":"Tex-470-A"},{"$f":"IF('Sieve Analysis - OAG'!$D$9=\"\",\"\",'Sieve Analysis - OAG'!$D$9)","v":"Coarse Agg. 1\n% Passing"},{"$f":"IF('Sieve Analysis - OAG'!$B$9=\"\",\"\",'Sieve Analysis - OAG'!$B$9)","v":"Sieve Size"},{"$f":"IF('Sieve Analysis - OAG'!$B$13=\"\",\"\",'Sieve Analysis - OAG'!$B$13)","v":"1 in"}]
[72,{"$f":"IF('Sieve Analysis - OAG'!D14=\"\",\"\",'Sieve Analysis - OAG'!D14)","v":""},{"$f":"IF('Sieve Analysis - OAG'!$B$8=\"\",\"\",'Sieve Analysis - OAG'!$B$8)","v":"Sieve Analysis - OAG"},{"$f":"IF('Sieve Analysis - OAG'!$D$8=\"\",\"\",'Sieve Analysis - OAG'!$D$8)","v":"Tex-470-A"},{"$f":"IF('Sieve Analysis - OAG'!$D$9=\"\",\"\",'Sieve Analysis - OAG'!$D$9)","v":"Coarse Agg. 1\n% Passing"},{"$f":"IF('Sieve Analysis - OAG'!$B$9=\"\",\"\",'Sieve Analysis - OAG'!$B$9)","v":"Sieve Size"},{"$f":"IF('Sieve Analysis - OAG'!$B$14=\"\",\"\",'Sieve Analysis - OAG'!$B$14)","v":"3/4 in"}]
[73,{"$f":"IF('Sieve Analysis - OAG'!D15=\"\",\"\",'Sieve Analysis - OAG'!D15)","v":""},{"$f":"IF('Sieve Analysis - OAG'!$B$8=\"\",\"\",'Sieve Analysis - OAG'!$B$8)","v":"Sieve Analysis - OAG"},{"$f":"IF('Sieve Analysis - OAG'!$D$8=\"\",\"\",'Sieve Analysis - OAG'!$D$8)","v":"Tex-470-A"},{"$f":"IF('Sieve Analysis - OAG'!$D$9=\"\",\"\",'Sieve Analysis - OAG'!$D$9)","v":"Coarse Agg. 1\n% Passing"},{"$f":"IF('Sieve Analysis - OAG'!$B$9=\"\",\"\",'Sieve Analysis - OAG'!$B$9)","v":"Sieve Size"},{"$f":"IF('Sieve Analysis - OAG'!$B$15=\"\",\"\",'Sieve Analysis - OAG'!$B$15)","v":"1/2 in"}]
[74,{"$f":"IF('Sieve Analysis - OAG'!D16=\"\",\"\",'Sieve Analysis - OAG'!D16)","v":""},{"$f":"IF('Sieve Analysis - OAG'!$B$8=\"\",\"\",'Sieve Analysis - OAG'!$B$8)","v":"Sieve Analysis - OAG"},{"$f":"IF('Sieve Analysis - OAG'!$D$8=\"\",\"\",'Sieve Analysis - OAG'!$D$8)","v":"Tex-470-A"},{"$f":"IF('Sieve Analysis - OAG'!$D$9=\"\",\"\",'Sieve Analysis - OAG'!$D$9)","v":"Coarse Agg. 1\n% Passing"},{"$f":"IF('Sieve Analysis - OAG'!$B$9=\"\",\"\",'Sieve Analysis - OAG'!$B$9)","v":"Sieve Size"},{"$f":"IF('Sieve Analysis - OAG'!$B$16=\"\",\"\",'Sieve Analysis - OAG'!$B$16)","v":"3/8 in"}]
[75,{"$f":"IF('Sieve Analysis - OAG'!D17=\"\",\"\",'Sieve Analysis - OAG'!D17)","v":""},{"$f":"IF('Sieve Analysis - OAG'!$B$8=\"\",\"\",'Sieve Analysis - OAG'!$B$8)","v":"Sieve Analysis - OAG"},{"$f":"IF('Sieve Analysis - OAG'!$D$8=\"\",\"\",'Sieve Analysis - OAG'!$D$8)","v":"Tex-470-A"},{"$f":"IF('Sieve Analysis - OAG'!$D$9=\"\",\"\",'Sieve Analysis - OAG'!$D$9)","v":"Coarse Agg. 1\n% Passing"},{"$f":"IF('Sieve Analysis - OAG'!$B$9=\"\",\"\",'Sieve Analysis - OAG'!$B$9)","v":"Sieve Size"},{"$f":"IF('Sieve Analysis - OAG'!$B$17=\"\",\"\",'Sieve Analysis - OAG'!$B$17)","v":"No. 4"}]
[76,{"$f":"IF('Sieve Analysis - OAG'!D18=\"\",\"\",'Sieve Analysis - OAG'!D18)","v":""},{"$f":"IF('Sieve Analysis - OAG'!$B$8=\"\",\"\",'Sieve Analysis - OAG'!$B$8)","v":"Sieve Analysis - OAG"},{"$f":"IF('Sieve Analysis - OAG'!$D$8=\"\",\"\",'Sieve Analysis - OAG'!$D$8)","v":"Tex-470-A"},{"$f":"IF('Sieve Analysis - OAG'!$D$9=\"\",\"\",'Sieve Analysis - OAG'!$D$9)","v":"Coarse Agg. 1\n% Passing"},{"$f":"IF('Sieve Analysis - OAG'!$B$9=\"\",\"\",'Sieve Analysis - OAG'!$B$9)","v":"Sieve Size"},{"$f":"IF('Sieve Analysis - OAG'!$B$18=\"\",\"\",'Sieve Analysis - OAG'!$B$18)","v":"No. 8"}]
[77,{"$f":"IF('Sieve Analysis - OAG'!D19=\"\",\"\",'Sieve Analysis - OAG'!D19)","v":""},{"$f":"IF('Sieve Analysis - OAG'!$B$8=\"\",\"\",'Sieve Analysis - OAG'!$B$8)","v":"Sieve Analysis - OAG"},{"$f":"IF('Sieve Analysis - OAG'!$D$8=\"\",\"\",'Sieve Analysis - OAG'!$D$8)","v":"Tex-470-A"},{"$f":"IF('Sieve Analysis - OAG'!$D$9=\"\",\"\",'Sieve Analysis - OAG'!$D$9)","v":"Coarse Agg. 1\n% Passing"},{"$f":"IF('Sieve Analysis - OAG'!$B$9=\"\",\"\",'Sieve Analysis - OAG'!$B$9)","v":"Sieve Size"},{"$f":"IF('Sieve Analysis - OAG'!$B$19=\"\",\"\",'Sieve Analysis - OAG'!$B$19)","v":"No. 16"}]
[78,{"$f":"IF('Sieve Analysis - OAG'!D20=\"\",\"\",'Sieve Analysis - OAG'!D20)","v":""},{"$f":"IF('Sieve Analysis - OAG'!$B$8=\"\",\"\",'Sieve Analysis - OAG'!$B$8)","v":"Sieve Analysis - OAG"},{"$f":"IF('Sieve Analysis - OAG'!$D$8=\"\",\"\",'Sieve Analysis - OAG'!$D$8)","v":"Tex-470-A"},{"$f":"IF('Sieve Analysis - OAG'!$D$9=\"\",\"\",'Sieve Analysis - OAG'!$D$9)","v":"Coarse Agg. 1\n% Passing"},{"$f":"IF('Sieve Analysis - OAG'!$B$9=\"\",\"\",'Sieve Analysis - OAG'!$B$9)","v":"Sieve Size"},{"$f":"IF('Sieve Analysis - OAG'!$B$20=\"\",\"\",'Sieve Analysis - OAG'!$B$20)","v":"No. 30"}]
[79,{"$f":"IF('Sieve Analysis - OAG'!D21=\"\",\"\",'Sieve Analysis - OAG'!D21)","v":""},{"$f":"IF('Sieve Analysis - OAG'!$B$8=\"\",\"\",'Sieve Analysis - OAG'!$B$8)","v":"Sieve Analysis - OAG"},{"$f":"IF('Sieve Analysis - OAG'!$D$8=\"\",\"\",'Sieve Analysis - OAG'!$D$8)","v":"Tex-470-A"},{"$f":"IF('Sieve Analysis - OAG'!$D$9=\"\",\"\",'Sieve Analysis - OAG'!$D$9)","v":"Coarse Agg. 1\n% Passing"},{"$f":"IF('Sieve Analysis - OAG'!$B$9=\"\",\"\",'Sieve Analysis - OAG'!$B$9)","v":"Sieve Size"},{"$f":"IF('Sieve Analysis - OAG'!$B$21=\"\",\"\",'Sieve Analysis - OAG'!$B$21)","v":"No. 50"}]
[80,{"$f":"IF('Sieve Analysis - OAG'!D22=\"\",\"\",'Sieve Analysis - OAG'!D22)","v":""},{"$f":"IF('Sieve Analysis - OAG'!$B$8=\"\",\"\",'Sieve Analysis - OAG'!$B$8)","v":"Sieve Analysis - OAG"},{"$f":"IF('Sieve Analysis - OAG'!$D$8=\"\",\"\",'Sieve Analysis - OAG'!$D$8)","v":"Tex-470-A"},{"$f":"IF('Sieve Analysis - OAG'!$D$9=\"\",\"\",'Sieve Analysis - OAG'!$D$9)","v":"Coarse Agg. 1\n% Passing"},{"$f":"IF('Sieve Analysis - OAG'!$B$9=\"\",\"\",'Sieve Analysis - OAG'!$B$9)","v":"Sieve Size"},{"$f":"IF('Sieve Analysis - OAG'!$B$22=\"\",\"\",'Sieve Analysis - OAG'!$B$22)","v":"No. 100"}]
[81,{"$f":"IF('Sieve Analysis - OAG'!D23=\"\",\"\",'Sieve Analysis - OAG'!D23)","v":""},{"$f":"IF('Sieve Analysis - OAG'!$B$8=\"\",\"\",'Sieve Analysis - OAG'!$B$8)","v":"Sieve Analysis - OAG"},{"$f":"IF('Sieve Analysis - OAG'!$D$8=\"\",\"\",'Sieve Analysis - OAG'!$D$8)","v":"Tex-470-A"},{"$f":"IF('Sieve Analysis - OAG'!$D$9=\"\",\"\",'Sieve Analysis - OAG'!$D$9)","v":"Coarse Agg. 1\n% Passing"},{"$f":"IF('Sieve Analysis - OAG'!$B$9=\"\",\"\",'Sieve Analysis - OAG'!$B$9)","v":"Sieve Size"},{"$f":"IF('Sieve Analysis - OAG'!$B$23=\"\",\"\",'Sieve Analysis - OAG'!$B$23)","v":"No. 200"}]
[82,{"$f":"IF('Sieve Analysis - OAG'!D24=\"\",\"\",'Sieve Analysis - OAG'!D24)","v":""},{"$f":"IF('Sieve Analysis - OAG'!$B$8=\"\",\"\",'Sieve Analysis - OAG'!$B$8)","v":"Sieve Analysis - OAG"},{"$f":"IF('Sieve Analysis - OAG'!$D$8=\"\",\"\",'Sieve Analysis - OAG'!$D$8)","v":"Tex-470-A"},{"$f":"IF('Sieve Analysis - OAG'!$D$9=\"\",\"\",'Sieve Analysis - OAG'!$D$9)","v":"Coarse Agg. 1\n% Passing"},{"$f":"IF('Sieve Analysis - OAG'!$B$9=\"\",\"\",'Sieve Analysis - OAG'!$B$9)","v":"Sieve Size"},{"$f":"IF('Sieve Analysis - OAG'!$B$24=\"\",\"\",'Sieve Analysis - OAG'!$B$24)","v":"Pan"}]
[83,{"$f":"IF('Sieve Analysis - OAG'!D25=\"\",\"\",'Sieve Analysis - OAG'!D25)","v":""},{"$f":"IF('Sieve Analysis - OAG'!$B$8=\"\",\"\",'Sieve Analysis - OAG'!$B$8)","v":"Sieve Analysis - OAG"},{"$f":"IF('Sieve Analysis - OAG'!$D$8=\"\",\"\",'Sieve Analysis - OAG'!$D$8)","v":"Tex-470-A"},{"$f":"IF('Sieve Analysis - OAG'!$D$9=\"\",\"\",'Sieve Analysis - OAG'!$D$9)","v":"Coarse Agg. 1\n% Passing"},{"$f":"IF('Sieve Analysis - OAG'!$B$9=\"\",\"\",'Sieve Analysis - OAG'!$B$9)","v":"Sieve Size"},{"$f":"IF('Sieve Analysis - OAG'!$B$25=\"\",\"\",'Sieve Analysis - OAG'!$B$25)","v":"Percent of Total Agg."}]
[84,{"$f":"IF('Sieve Analysis - OAG'!$E10=\"\",\"\",'Sieve Analysis - OAG'!$E10)","v":""},{"$f":"IF('Sieve Analysis - OAG'!$B$8=\"\",\"\",'Sieve Analysis - OAG'!$B$8)","v":"Sieve Analysis - OAG"},{"$f":"IF('Sieve Analysis - OAG'!$D$8=\"\",\"\",'Sieve Analysis - OAG'!$D$8)","v":"Tex-470-A"},{"$f":"IF('Sieve Analysis - OAG'!E$9=\"\",\"\",'Sieve Analysis - OAG'!$E$9)","v":"Coarse Agg. 2\n% Passing"},{"$f":"IF('Sieve Analysis - OAG'!$B$9=\"\",\"\",'Sieve Analysis - OAG'!$B$9)","v":"Sieve Size"},{"$f":"IF('Sieve Analysis - OAG'!$B$10=\"\",\"\",'Sieve Analysis - OAG'!$B$10)","v":"2 1/2 in"}]
[85,{"$f":"IF('Sieve Analysis - OAG'!$E11=\"\",\"\",'Sieve Analysis - OAG'!$E11)","v":""},{"$f":"IF('Sieve Analysis - OAG'!$B$8=\"\",\"\",'Sieve Analysis - OAG'!$B$8)","v":"Sieve Analysis - OAG"},{"$f":"IF('Sieve Analysis - OAG'!$D$8=\"\",\"\",'Sieve Analysis - OAG'!$D$8)","v":"Tex-470-A"},{"$f":"IF('Sieve Analysis - OAG'!E$9=\"\",\"\",'Sieve Analysis - OAG'!$E$9)","v":"Coarse Agg. 2\n% Passing"},{"$f":"IF('Sieve Analysis - OAG'!$B$9=\"\",\"\",'Sieve Analysis - OAG'!$B$9)","v":"Sieve Size"},{"$f":"IF('Sieve Analysis - OAG'!$B$11=\"\",\"\",'Sieve Analysis - OAG'!$B$11)","v":"2 in"}]
[86,{"$f":"IF('Sieve Analysis - OAG'!$E12=\"\",\"\",'Sieve Analysis - OAG'!$E12)","v":""},{"$f":"IF('Sieve Analysis - OAG'!$B$8=\"\",\"\",'Sieve Analysis - OAG'!$B$8)","v":"Sieve Analysis - OAG"},{"$f":"IF('Sieve Analysis - OAG'!$D$8=\"\",\"\",'Sieve Analysis - OAG'!$D$8)","v":"Tex-470-A"},{"$f":"IF('Sieve Analysis - OAG'!E$9=\"\",\"\",'Sieve Analysis - OAG'!$E$9)","v":"Coarse Agg. 2\n% Passing"},{"$f":"IF('Sieve Analysis - OAG'!$B$9=\"\",\"\",'Sieve Analysis - OAG'!$B$9)","v":"Sieve Size"},{"$f":"IF('Sieve Analysis - OAG'!$B$12=\"\",\"\",'Sieve Analysis - OAG'!$B$12)","v":"1 1/2 in"}]
[87,{"$f":"IF('Sieve Analysis - OAG'!$E13=\"\",\"\",'Sieve Analysis - OAG'!$E13)","v":""},{"$f":"IF('Sieve Analysis - OAG'!$B$8=\"\",\"\",'Sieve Analysis - OAG'!$B$8)","v":"Sieve Analysis - OAG"},{"$f":"IF('Sieve Analysis - OAG'!$D$8=\"\",\"\",'Sieve Analysis - OAG'!$D$8)","v":"Tex-470-A"},{"$f":"IF('Sieve Analysis - OAG'!E$9=\"\",\"\",'Sieve Analysis - OAG'!$E$9)","v":"Coarse Agg. 2\n% Passing"},{"$f":"IF('Sieve Analysis - OAG'!$B$9=\"\",\"\",'Sieve Analysis - OAG'!$B$9)","v":"Sieve Size"},{"$f":"IF('Sieve Analysis - OAG'!$B$13=\"\",\"\",'Sieve Analysis - OAG'!$B$13)","v":"1 in"}]
[88,{"$f":"IF('Sieve Analysis - OAG'!$E14=\"\",\"\",'Sieve Analysis - OAG'!$E14)","v":""},{"$f":"IF('Sieve Analysis - OAG'!$B$8=\"\",\"\",'Sieve Analysis - OAG'!$B$8)","v":"Sieve Analysis - OAG"},{"$f":"IF('Sieve Analysis - OAG'!$D$8=\"\",\"\",'Sieve Analysis - OAG'!$D$8)","v":"Tex-470-A"},{"$f":"IF('Sieve Analysis - OAG'!E$9=\"\",\"\",'Sieve Analysis - OAG'!$E$9)","v":"Coarse Agg. 2\n% Passing"},{"$f":"IF('Sieve Analysis - OAG'!$B$9=\"\",\"\",'Sieve Analysis - OAG'!$B$9)","v":"Sieve Size"},{"$f":"IF('Sieve Analysis - OAG'!$B$14=\"\",\"\",'Sieve Analysis - OAG'!$B$14)","v":"3/4 in"}]
[89,{"$f":"IF('Sieve Analysis - OAG'!$E15=\"\",\"\",'Sieve Analysis - OAG'!$E15)","v":""},{"$f":"IF('Sieve Analysis - OAG'!$B$8=\"\",\"\",'Sieve Analysis - OAG'!$B$8)","v":"Sieve Analysis - OAG"},{"$f":"IF('Sieve Analysis - OAG'!$D$8=\"\",\"\",'Sieve Analysis - OAG'!$D$8)","v":"Tex-470-A"},{"$f":"IF('Sieve Analysis - OAG'!E$9=\"\",\"\",'Sieve Analysis - OAG'!$E$9)","v":"Coarse Agg. 2\n% Passing"},{"$f":"IF('Sieve Analysis - OAG'!$B$9=\"\",\"\",'Sieve Analysis - OAG'!$B$9)","v":"Sieve Size"},{"$f":"IF('Sieve Analysis - OAG'!$B$15=\"\",\"\",'Sieve Analysis - OAG'!$B$15)","v":"1/2 in"}]
[90,{"$f":"IF('Sieve Analysis - OAG'!$E16=\"\",\"\",'Sieve Analysis - OAG'!$E16)","v":""},{"$f":"IF('Sieve Analysis - OAG'!$B$8=\"\",\"\",'Sieve Analysis - OAG'!$B$8)","v":"Sieve Analysis - OAG"},{"$f":"IF('Sieve Analysis - OAG'!$D$8=\"\",\"\",'Sieve Analysis - OAG'!$D$8)","v":"Tex-470-A"},{"$f":"IF('Sieve Analysis - OAG'!E$9=\"\",\"\",'Sieve Analysis - OAG'!$E$9)","v":"Coarse Agg. 2\n% Passing"},{"$f":"IF('Sieve Analysis - OAG'!$B$9=\"\",\"\",'Sieve Analysis - OAG'!$B$9)","v":"Sieve Size"},{"$f":"IF('Sieve Analysis - OAG'!$B$16=\"\",\"\",'Sieve Analysis - OAG'!$B$16)","v":"3/8 in"}]
[91,{"$f":"IF('Sieve Analysis - OAG'!$E17=\"\",\"\",'Sieve Analysis - OAG'!$E17)","v":""},{"$f":"IF('Sieve Analysis - OAG'!$B$8=\"\",\"\",'Sieve Analysis - OAG'!$B$8)","v":"Sieve Analysis - OAG"},{"$f":"IF('Sieve Analysis - OAG'!$D$8=\"\",\"\",'Sieve Analysis - OAG'!$D$8)","v":"Tex-470-A"},{"$f":"IF('Sieve Analysis - OAG'!E$9=\"\",\"\",'Sieve Analysis - OAG'!$E$9)","v":"Coarse Agg. 2\n% Passing"},{"$f":"IF('Sieve Analysis - OAG'!$B$9=\"\",\"\",'Sieve Analysis - OAG'!$B$9)","v":"Sieve Size"},{"$f":"IF('Sieve Analysis - OAG'!$B$17=\"\",\"\",'Sieve Analysis - OAG'!$B$17)","v":"No. 4"}]
[92,{"$f":"IF('Sieve Analysis - OAG'!$E18=\"\",\"\",'Sieve Analysis - OAG'!$E18)","v":""},{"$f":"IF('Sieve Analysis - OAG'!$B$8=\"\",\"\",'Sieve Analysis - OAG'!$B$8)","v":"Sieve Analysis - OAG"},{"$f":"IF('Sieve Analysis - OAG'!$D$8=\"\",\"\",'Sieve Analysis - OAG'!$D$8)","v":"Tex-470-A"},{"$f":"IF('Sieve Analysis - OAG'!E$9=\"\",\"\",'Sieve Analysis - OAG'!$E$9)","v":"Coarse Agg. 2\n% Passing"},{"$f":"IF('Sieve Analysis - OAG'!$B$9=\"\",\"\",'Sieve Analysis - OAG'!$B$9)","v":"Sieve Size"},{"$f":"IF('Sieve Analysis - OAG'!$B$18=\"\",\"\",'Sieve Analysis - OAG'!$B$18)","v":"No. 8"}]
[93,{"$f":"IF('Sieve Analysis - OAG'!$E19=\"\",\"\",'Sieve Analysis - OAG'!$E19)","v":""},{"$f":"IF('Sieve Analysis - OAG'!$B$8=\"\",\"\",'Sieve Analysis - OAG'!$B$8)","v":"Sieve Analysis - OAG"},{"$f":"IF('Sieve Analysis - OAG'!$D$8=\"\",\"\",'Sieve Analysis - OAG'!$D$8)","v":"Tex-470-A"},{"$f":"IF('Sieve Analysis - OAG'!E$9=\"\",\"\",'Sieve Analysis - OAG'!$E$9)","v":"Coarse Agg. 2\n% Passing"},{"$f":"IF('Sieve Analysis - OAG'!$B$9=\"\",\"\",'Sieve Analysis - OAG'!$B$9)","v":"Sieve Size"},{"$f":"IF('Sieve Analysis - OAG'!$B$19=\"\",\"\",'Sieve Analysis - OAG'!$B$19)","v":"No. 16"}]
[94,{"$f":"IF('Sieve Analysis - OAG'!$E20=\"\",\"\",'Sieve Analysis - OAG'!$E20)","v":""},{"$f":"IF('Sieve Analysis - OAG'!$B$8=\"\",\"\",'Sieve Analysis - OAG'!$B$8)","v":"Sieve Analysis - OAG"},{"$f":"IF('Sieve Analysis - OAG'!$D$8=\"\",\"\",'Sieve Analysis - OAG'!$D$8)","v":"Tex-470-A"},{"$f":"IF('Sieve Analysis - OAG'!E$9=\"\",\"\",'Sieve Analysis - OAG'!$E$9)","v":"Coarse Agg. 2\n% Passing"},{"$f":"IF('Sieve Analysis - OAG'!$B$9=\"\",\"\",'Sieve Analysis - OAG'!$B$9)","v":"Sieve Size"},{"$f":"IF('Sieve Analysis - OAG'!$B$20=\"\",\"\",'Sieve Analysis - OAG'!$B$20)","v":"No. 30"}]
[95,{"$f":"IF('Sieve Analysis - OAG'!$E21=\"\",\"\",'Sieve Analysis - OAG'!$E21)","v":""},{"$f":"IF('Sieve Analysis - OAG'!$B$8=\"\",\"\",'Sieve Analysis - OAG'!$B$8)","v":"Sieve Analysis - OAG"},{"$f":"IF('Sieve Analysis - OAG'!$D$8=\"\",\"\",'Sieve Analysis - OAG'!$D$8)","v":"Tex-470-A"},{"$f":"IF('Sieve Analysis - OAG'!E$9=\"\",\"\",'Sieve Analysis - OAG'!$E$9)","v":"Coarse Agg. 2\n% Passing"},{"$f":"IF('Sieve Analysis - OAG'!$B$9=\"\",\"\",'Sieve Analysis - OAG'!$B$9)","v":"Sieve Size"},{"$f":"IF('Sieve Analysis - OAG'!$B$21=\"\",\"\",'Sieve Analysis - OAG'!$B$21)","v":"No. 50"}]
[96,{"$f":"IF('Sieve Analysis - OAG'!$E22=\"\",\"\",'Sieve Analysis - OAG'!$E22)","v":""},{"$f":"IF('Sieve Analysis - OAG'!$B$8=\"\",\"\",'Sieve Analysis - OAG'!$B$8)","v":"Sieve Analysis - OAG"},{"$f":"IF('Sieve Analysis - OAG'!$D$8=\"\",\"\",'Sieve Analysis - OAG'!$D$8)","v":"Tex-470-A"},{"$f":"IF('Sieve Analysis - OAG'!E$9=\"\",\"\",'Sieve Analysis - OAG'!$E$9)","v":"Coarse Agg. 2\n% Passing"},{"$f":"IF('Sieve Analysis - OAG'!$B$9=\"\",\"\",'Sieve Analysis - OAG'!$B$9)","v":"Sieve Size"},{"$f":"IF('Sieve Analysis - OAG'!$B$22=\"\",\"\",'Sieve Analysis - OAG'!$B$22)","v":"No. 100"}]
[97,{"$f":"IF('Sieve Analysis - OAG'!$E23=\"\",\"\",'Sieve Analysis - OAG'!$E23)","v":""},{"$f":"IF('Sieve Analysis - OAG'!$B$8=\"\",\"\",'Sieve Analysis - OAG'!$B$8)","v":"Sieve Analysis - OAG"},{"$f":"IF('Sieve Analysis - OAG'!$D$8=\"\",\"\",'Sieve Analysis - OAG'!$D$8)","v":"Tex-470-A"},{"$f":"IF('Sieve Analysis - OAG'!E$9=\"\",\"\",'Sieve Analysis - OAG'!$E$9)","v":"Coarse Agg. 2\n% Passing"},{"$f":"IF('Sieve Analysis - OAG'!$B$9=\"\",\"\",'Sieve Analysis - OAG'!$B$9)","v":"Sieve Size"},{"$f":"IF('Sieve Analysis - OAG'!$B$23=\"\",\"\",'Sieve Analysis - OAG'!$B$23)","v":"No. 200"}]
[98,{"$f":"IF('Sieve Analysis - OAG'!$E24=\"\",\"\",'Sieve Analysis - OAG'!$E24)","v":""},{"$f":"IF('Sieve Analysis - OAG'!$B$8=\"\",\"\",'Sieve Analysis - OAG'!$B$8)","v":"Sieve Analysis - OAG"},{"$f":"IF('Sieve Analysis - OAG'!$D$8=\"\",\"\",'Sieve Analysis - OAG'!$D$8)","v":"Tex-470-A"},{"$f":"IF('Sieve Analysis - OAG'!E$9=\"\",\"\",'Sieve Analysis - OAG'!$E$9)","v":"Coarse Agg. 2\n% Passing"},{"$f":"IF('Sieve Analysis - OAG'!$B$9=\"\",\"\",'Sieve Analysis - OAG'!$B$9)","v":"Sieve Size"},{"$f":"IF('Sieve Analysis - OAG'!$B$24=\"\",\"\",'Sieve Analysis - OAG'!$B$24)","v":"Pan"}]
[99,{"$f":"IF('Sieve Analysis - OAG'!$E25=\"\",\"\",'Sieve Analysis - OAG'!$E25)","v":""},{"$f":"IF('Sieve Analysis - OAG'!$B$8=\"\",\"\",'Sieve Analysis - OAG'!$B$8)","v":"Sieve Analysis - OAG"},{"$f":"IF('Sieve Analysis - OAG'!$D$8=\"\",\"\",'Sieve Analysis - OAG'!$D$8)","v":"Tex-470-A"},{"$f":"IF('Sieve Analysis - OAG'!E$9=\"\",\"\",'Sieve Analysis - OAG'!$E$9)","v":"Coarse Agg. 2\n% Passing"},{"$f":"IF('Sieve Analysis - OAG'!$B$9=\"\",\"\",'Sieve Analysis - OAG'!$B$9)","v":"Sieve Size"},{"$f":"IF('Sieve Analysis - OAG'!$B$25=\"\",\"\",'Sieve Analysis - OAG'!$B$25)","v":"Percent of Total Agg."}]
[100,{"$f":"IF('Sieve Analysis - OAG'!F10=\"\",\"\",'Sieve Analysis - OAG'!F10)","v":""},{"$f":"IF('Sieve Analysis - OAG'!$B$8=\"\",\"\",'Sieve Analysis - OAG'!$B$8)","v":"Sieve Analysis - OAG"},{"$f":"IF('Sieve Analysis - OAG'!$D$8=\"\",\"\",'Sieve Analysis - OAG'!$D$8)","v":"Tex-470-A"},{"$f":"IF('Sieve Analysis - OAG'!$F$9=\"\",\"\",'Sieve Analysis - OAG'!$F$9)","v":"Intermediate Agg. 1\n% Passing"},{"$f":"IF('Sieve Analysis - OAG'!$B$9=\"\",\"\",'Sieve Analysis - OAG'!$B$9)","v":"Sieve Size"},{"$f":"IF('Sieve Analysis - OAG'!$B$10=\"\",\"\",'Sieve Analysis - OAG'!$B$10)","v":"2 1/2 in"}]
[101,{"$f":"IF('Sieve Analysis - OAG'!F11=\"\",\"\",'Sieve Analysis - OAG'!F11)","v":""},{"$f":"IF('Sieve Analysis - OAG'!$B$8=\"\",\"\",'Sieve Analysis - OAG'!$B$8)","v":"Sieve Analysis - OAG"},{"$f":"IF('Sieve Analysis - OAG'!$D$8=\"\",\"\",'Sieve Analysis - OAG'!$D$8)","v":"Tex-470-A"},{"$f":"IF('Sieve Analysis - OAG'!$F$9=\"\",\"\",'Sieve Analysis - OAG'!$F$9)","v":"Intermediate Agg. 1\n% Passing"},{"$f":"IF('Sieve Analysis - OAG'!$B$9=\"\",\"\",'Sieve Analysis - OAG'!$B$9)","v":"Sieve Size"},{"$f":"IF('Sieve Analysis - OAG'!$B$11=\"\",\"\",'Sieve Analysis - OAG'!$B$11)","v":"2 in"}]
[102,{"$f":"IF('Sieve Analysis - OAG'!F12=\"\",\"\",'Sieve Analysis - OAG'!F12)","v":""},{"$f":"IF('Sieve Analysis - OAG'!$B$8=\"\",\"\",'Sieve Analysis - OAG'!$B$8)","v":"Sieve Analysis - OAG"},{"$f":"IF('Sieve Analysis - OAG'!$D$8=\"\",\"\",'Sieve Analysis - OAG'!$D$8)","v":"Tex-470-A"},{"$f":"IF('Sieve Analysis - OAG'!$F$9=\"\",\"\",'Sieve Analysis - OAG'!$F$9)","v":"Intermediate Agg. 1\n% Passing"},{"$f":"IF('Sieve Analysis - OAG'!$B$9=\"\",\"\",'Sieve Analysis - OAG'!$B$9)","v":"Sieve Size"},{"$f":"IF('Sieve Analysis - OAG'!$B$12=\"\",\"\",'Sieve Analysis - OAG'!$B$12)","v":"1 1/2 in"}]
[103,{"$f":"IF('Sieve Analysis - OAG'!F13=\"\",\"\",'Sieve Analysis - OAG'!F13)","v":""},{"$f":"IF('Sieve Analysis - OAG'!$B$8=\"\",\"\",'Sieve Analysis - OAG'!$B$8)","v":"Sieve Analysis - OAG"},{"$f":"IF('Sieve Analysis - OAG'!$D$8=\"\",\"\",'Sieve Analysis - OAG'!$D$8)","v":"Tex-470-A"},{"$f":"IF('Sieve Analysis - OAG'!$F$9=\"\",\"\",'Sieve Analysis - OAG'!$F$9)","v":"Intermediate Agg. 1\n% Passing"},{"$f":"IF('Sieve Analysis - OAG'!$B$9=\"\",\"\",'Sieve Analysis - OAG'!$B$9)","v":"Sieve Size"},{"$f":"IF('Sieve Analysis - OAG'!$B$13=\"\",\"\",'Sieve Analysis - OAG'!$B$13)","v":"1 in"}]
[104,{"$f":"IF('Sieve Analysis - OAG'!F14=\"\",\"\",'Sieve Analysis - OAG'!F14)","v":""},{"$f":"IF('Sieve Analysis - OAG'!$B$8=\"\",\"\",'Sieve Analysis - OAG'!$B$8)","v":"Sieve Analysis - OAG"},{"$f":"IF('Sieve Analysis - OAG'!$D$8=\"\",\"\",'Sieve Analysis - OAG'!$D$8)","v":"Tex-470-A"},{"$f":"IF('Sieve Analysis - OAG'!$F$9=\"\",\"\",'Sieve Analysis - OAG'!$F$9)","v":"Intermediate Agg. 1\n% Passing"},{"$f":"IF('Sieve Analysis - OAG'!$B$9=\"\",\"\",'Sieve Analysis - OAG'!$B$9)","v":"Sieve Size"},{"$f":"IF('Sieve Analysis - OAG'!$B$14=\"\",\"\",'Sieve Analysis - OAG'!$B$14)","v":"3/4 in"}]
[105,{"$f":"IF('Sieve Analysis - OAG'!F15=\"\",\"\",'Sieve Analysis - OAG'!F15)","v":""},{"$f":"IF('Sieve Analysis - OAG'!$B$8=\"\",\"\",'Sieve Analysis - OAG'!$B$8)","v":"Sieve Analysis - OAG"},{"$f":"IF('Sieve Analysis - OAG'!$D$8=\"\",\"\",'Sieve Analysis - OAG'!$D$8)","v":"Tex-470-A"},{"$f":"IF('Sieve Analysis - OAG'!$F$9=\"\",\"\",'Sieve Analysis - OAG'!$F$9)","v":"Intermediate Agg. 1\n% Passing"},{"$f":"IF('Sieve Analysis - OAG'!$B$9=\"\",\"\",'Sieve Analysis - OAG'!$B$9)","v":"Sieve Size"},{"$f":"IF('Sieve Analysis - OAG'!$B$15=\"\",\"\",'Sieve Analysis - OAG'!$B$15)","v":"1/2 in"}]
[106,{"$f":"IF('Sieve Analysis - OAG'!F16=\"\",\"\",'Sieve Analysis - OAG'!F16)","v":""},{"$f":"IF('Sieve Analysis - OAG'!$B$8=\"\",\"\",'Sieve Analysis - OAG'!$B$8)","v":"Sieve Analysis - OAG"},{"$f":"IF('Sieve Analysis - OAG'!$D$8=\"\",\"\",'Sieve Analysis - OAG'!$D$8)","v":"Tex-470-A"},{"$f":"IF('Sieve Analysis - OAG'!$F$9=\"\",\"\",'Sieve Analysis - OAG'!$F$9)","v":"Intermediate Agg. 1\n% Passing"},{"$f":"IF('Sieve Analysis - OAG'!$B$9=\"\",\"\",'Sieve Analysis - OAG'!$B$9)","v":"Sieve Size"},{"$f":"IF('Sieve Analysis - OAG'!$B$16=\"\",\"\",'Sieve Analysis - OAG'!$B$16)","v":"3/8 in"}]
[107,{"$f":"IF('Sieve Analysis - OAG'!F17=\"\",\"\",'Sieve Analysis - OAG'!F17)","v":""},{"$f":"IF('Sieve Analysis - OAG'!$B$8=\"\",\"\",'Sieve Analysis - OAG'!$B$8)","v":"Sieve Analysis - OAG"},{"$f":"IF('Sieve Analysis - OAG'!$D$8=\"\",\"\",'Sieve Analysis - OAG'!$D$8)","v":"Tex-470-A"},{"$f":"IF('Sieve Analysis - OAG'!$F$9=\"\",\"\",'Sieve Analysis - OAG'!$F$9)","v":"Intermediate Agg. 1\n% Passing"},{"$f":"IF('Sieve Analysis - OAG'!$B$9=\"\",\"\",'Sieve Analysis - OAG'!$B$9)","v":"Sieve Size"},{"$f":"IF('Sieve Analysis - OAG'!$B$17=\"\",\"\",'Sieve Analysis - OAG'!$B$17)","v":"No. 4"}]
[108,{"$f":"IF('Sieve Analysis - OAG'!F18=\"\",\"\",'Sieve Analysis - OAG'!F18)","v":""},{"$f":"IF('Sieve Analysis - OAG'!$B$8=\"\",\"\",'Sieve Analysis - OAG'!$B$8)","v":"Sieve Analysis - OAG"},{"$f":"IF('Sieve Analysis - OAG'!$D$8=\"\",\"\",'Sieve Analysis - OAG'!$D$8)","v":"Tex-470-A"},{"$f":"IF('Sieve Analysis - OAG'!$F$9=\"\",\"\",'Sieve Analysis - OAG'!$F$9)","v":"Intermediate Agg. 1\n% Passing"},{"$f":"IF('Sieve Analysis - OAG'!$B$9=\"\",\"\",'Sieve Analysis - OAG'!$B$9)","v":"Sieve Size"},{"$f":"IF('Sieve Analysis - OAG'!$B$18=\"\",\"\",'Sieve Analysis - OAG'!$B$18)","v":"No. 8"}]
[109,{"$f":"IF('Sieve Analysis - OAG'!F19=\"\",\"\",'Sieve Analysis - OAG'!F19)","v":""},{"$f":"IF('Sieve Analysis - OAG'!$B$8=\"\",\"\",'Sieve Analysis - OAG'!$B$8)","v":"Sieve Analysis - OAG"},{"$f":"IF('Sieve Analysis - OAG'!$D$8=\"\",\"\",'Sieve Analysis - OAG'!$D$8)","v":"Tex-470-A"},{"$f":"IF('Sieve Analysis - OAG'!$F$9=\"\",\"\",'Sieve Analysis - OAG'!$F$9)","v":"Intermediate Agg. 1\n% Passing"},{"$f":"IF('Sieve Analysis - OAG'!$B$9=\"\",\"\",'Sieve Analysis - OAG'!$B$9)","v":"Sieve Size"},{"$f":"IF('Sieve Analysis - OAG'!$B$19=\"\",\"\",'Sieve Analysis - OAG'!$B$19)","v":"No. 16"}]
[110,{"$f":"IF('Sieve Analysis - OAG'!F20=\"\",\"\",'Sieve Analysis - OAG'!F20)","v":""},{"$f":"IF('Sieve Analysis - OAG'!$B$8=\"\",\"\",'Sieve Analysis - OAG'!$B$8)","v":"Sieve Analysis - OAG"},{"$f":"IF('Sieve Analysis - OAG'!$D$8=\"\",\"\",'Sieve Analysis - OAG'!$D$8)","v":"Tex-470-A"},{"$f":"IF('Sieve Analysis - OAG'!$F$9=\"\",\"\",'Sieve Analysis - OAG'!$F$9)","v":"Intermediate Agg. 1\n% Passing"},{"$f":"IF('Sieve Analysis - OAG'!$B$9=\"\",\"\",'Sieve Analysis - OAG'!$B$9)","v":"Sieve Size"},{"$f":"IF('Sieve Analysis - OAG'!$B$20=\"\",\"\",'Sieve Analysis - OAG'!$B$20)","v":"No. 30"}]
[111,{"$f":"IF('Sieve Analysis - OAG'!F21=\"\",\"\",'Sieve Analysis - OAG'!F21)","v":""},{"$f":"IF('Sieve Analysis - OAG'!$B$8=\"\",\"\",'Sieve Analysis - OAG'!$B$8)","v":"Sieve Analysis - OAG"},{"$f":"IF('Sieve Analysis - OAG'!$D$8=\"\",\"\",'Sieve Analysis - OAG'!$D$8)","v":"Tex-470-A"},{"$f":"IF('Sieve Analysis - OAG'!$F$9=\"\",\"\",'Sieve Analysis - OAG'!$F$9)","v":"Intermediate Agg. 1\n% Passing"},{"$f":"IF('Sieve Analysis - OAG'!$B$9=\"\",\"\",'Sieve Analysis - OAG'!$B$9)","v":"Sieve Size"},{"$f":"IF('Sieve Analysis - OAG'!$B$21=\"\",\"\",'Sieve Analysis - OAG'!$B$21)","v":"No. 50"}]
[112,{"$f":"IF('Sieve Analysis - OAG'!F22=\"\",\"\",'Sieve Analysis - OAG'!F22)","v":""},{"$f":"IF('Sieve Analysis - OAG'!$B$8=\"\",\"\",'Sieve Analysis - OAG'!$B$8)","v":"Sieve Analysis - OAG"},{"$f":"IF('Sieve Analysis - OAG'!$D$8=\"\",\"\",'Sieve Analysis - OAG'!$D$8)","v":"Tex-470-A"},{"$f":"IF('Sieve Analysis - OAG'!$F$9=\"\",\"\",'Sieve Analysis - OAG'!$F$9)","v":"Intermediate Agg. 1\n% Passing"},{"$f":"IF('Sieve Analysis - OAG'!$B$9=\"\",\"\",'Sieve Analysis - OAG'!$B$9)","v":"Sieve Size"},{"$f":"IF('Sieve Analysis - OAG'!$B$22=\"\",\"\",'Sieve Analysis - OAG'!$B$22)","v":"No. 100"}]
[113,{"$f":"IF('Sieve Analysis - OAG'!F23=\"\",\"\",'Sieve Analysis - OAG'!F23)","v":""},{"$f":"IF('Sieve Analysis - OAG'!$B$8=\"\",\"\",'Sieve Analysis - OAG'!$B$8)","v":"Sieve Analysis - OAG"},{"$f":"IF('Sieve Analysis - OAG'!$D$8=\"\",\"\",'Sieve Analysis - OAG'!$D$8)","v":"Tex-470-A"},{"$f":"IF('Sieve Analysis - OAG'!$F$9=\"\",\"\",'Sieve Analysis - OAG'!$F$9)","v":"Intermediate Agg. 1\n% Passing"},{"$f":"IF('Sieve Analysis - OAG'!$B$9=\"\",\"\",'Sieve Analysis - OAG'!$B$9)","v":"Sieve Size"},{"$f":"IF('Sieve Analysis - OAG'!$B$23=\"\",\"\",'Sieve Analysis - OAG'!$B$23)","v":"No. 200"}]
[114,{"$f":"IF('Sieve Analysis - OAG'!F24=\"\",\"\",'Sieve Analysis - OAG'!F24)","v":""},{"$f":"IF('Sieve Analysis - OAG'!$B$8=\"\",\"\",'Sieve Analysis - OAG'!$B$8)","v":"Sieve Analysis - OAG"},{"$f":"IF('Sieve Analysis - OAG'!$D$8=\"\",\"\",'Sieve Analysis - OAG'!$D$8)","v":"Tex-470-A"},{"$f":"IF('Sieve Analysis - OAG'!$F$9=\"\",\"\",'Sieve Analysis - OAG'!$F$9)","v":"Intermediate Agg. 1\n% Passing"},{"$f":"IF('Sieve Analysis - OAG'!$B$9=\"\",\"\",'Sieve Analysis - OAG'!$B$9)","v":"Sieve Size"},{"$f":"IF('Sieve Analysis - OAG'!$B$24=\"\",\"\",'Sieve Analysis - OAG'!$B$24)","v":"Pan"}]
[115,{"$f":"IF('Sieve Analysis - OAG'!F25=\"\",\"\",'Sieve Analysis - OAG'!F25)","v":""},{"$f":"IF('Sieve Analysis - OAG'!$B$8=\"\",\"\",'Sieve Analysis - OAG'!$B$8)","v":"Sieve Analysis - OAG"},{"$f":"IF('Sieve Analysis - OAG'!$D$8=\"\",\"\",'Sieve Analysis - OAG'!$D$8)","v":"Tex-470-A"},{"$f":"IF('Sieve Analysis - OAG'!$F$9=\"\",\"\",'Sieve Analysis - OAG'!$F$9)","v":"Intermediate Agg. 1\n% Passing"},{"$f":"IF('Sieve Analysis - OAG'!$B$9=\"\",\"\",'Sieve Analysis - OAG'!$B$9)","v":"Sieve Size"},{"$f":"IF('Sieve Analysis - OAG'!$B$25=\"\",\"\",'Sieve Analysis - OAG'!$B$25)","v":"Percent of Total Agg."}]
[116,{"$f":"IF('Sieve Analysis - OAG'!G10=\"\",\"\",'Sieve Analysis - OAG'!G10)","v":""},{"$f":"IF('Sieve Analysis - OAG'!$B$8=\"\",\"\",'Sieve Analysis - OAG'!$B$8)","v":"Sieve Analysis - OAG"},{"$f":"IF('Sieve Analysis - OAG'!$D$8=\"\",\"\",'Sieve Analysis - OAG'!$D$8)","v":"Tex-470-A"},{"$f":"IF('Sieve Analysis - OAG'!$G$9=\"\",\"\",'Sieve Analysis - OAG'!$G$9)","v":"Intermediate Agg. 2\n% Passing"},{"$f":"IF('Sieve Analysis - OAG'!$B$9=\"\",\"\",'Sieve Analysis - OAG'!$B$9)","v":"Sieve Size"},{"$f":"IF('Sieve Analysis - OAG'!$B$10=\"\",\"\",'Sieve Analysis - OAG'!$B$10)","v":"2 1/2 in"}]
[117,{"$f":"IF('Sieve Analysis - OAG'!G11=\"\",\"\",'Sieve Analysis - OAG'!G11)","v":""},{"$f":"IF('Sieve Analysis - OAG'!$B$8=\"\",\"\",'Sieve Analysis - OAG'!$B$8)","v":"Sieve Analysis - OAG"},{"$f":"IF('Sieve Analysis - OAG'!$D$8=\"\",\"\",'Sieve Analysis - OAG'!$D$8)","v":"Tex-470-A"},{"$f":"IF('Sieve Analysis - OAG'!$G$9=\"\",\"\",'Sieve Analysis - OAG'!$G$9)","v":"Intermediate Agg. 2\n% Passing"},{"$f":"IF('Sieve Analysis - OAG'!$B$9=\"\",\"\",'Sieve Analysis - OAG'!$B$9)","v":"Sieve Size"},{"$f":"IF('Sieve Analysis - OAG'!$B$11=\"\",\"\",'Sieve Analysis - OAG'!$B$11)","v":"2 in"}]
[118,{"$f":"IF('Sieve Analysis - OAG'!G12=\"\",\"\",'Sieve Analysis - OAG'!G12)","v":""},{"$f":"IF('Sieve Analysis - OAG'!$B$8=\"\",\"\",'Sieve Analysis - OAG'!$B$8)","v":"Sieve Analysis - OAG"},{"$f":"IF('Sieve Analysis - OAG'!$D$8=\"\",\"\",'Sieve Analysis - OAG'!$D$8)","v":"Tex-470-A"},{"$f":"IF('Sieve Analysis - OAG'!$G$9=\"\",\"\",'Sieve Analysis - OAG'!$G$9)","v":"Intermediate Agg. 2\n% Passing"},{"$f":"IF('Sieve Analysis - OAG'!$B$9=\"\",\"\",'Sieve Analysis - OAG'!$B$9)","v":"Sieve Size"},{"$f":"IF('Sieve Analysis - OAG'!$B$12=\"\",\"\",'Sieve Analysis - OAG'!$B$12)","v":"1 1/2 in"}]
[119,{"$f":"IF('Sieve Analysis - OAG'!G13=\"\",\"\",'Sieve Analysis - OAG'!G13)","v":""},{"$f":"IF('Sieve Analysis - OAG'!$B$8=\"\",\"\",'Sieve Analysis - OAG'!$B$8)","v":"Sieve Analysis - OAG"},{"$f":"IF('Sieve Analysis - OAG'!$D$8=\"\",\"\",'Sieve Analysis - OAG'!$D$8)","v":"Tex-470-A"},{"$f":"IF('Sieve Analysis - OAG'!$G$9=\"\",\"\",'Sieve Analysis - OAG'!$G$9)","v":"Intermediate Agg. 2\n% Passing"},{"$f":"IF('Sieve Analysis - OAG'!$B$9=\"\",\"\",'Sieve Analysis - OAG'!$B$9)","v":"Sieve Size"},{"$f":"IF('Sieve Analysis - OAG'!$B$13=\"\",\"\",'Sieve Analysis - OAG'!$B$13)","v":"1 in"}]
[120,{"$f":"IF('Sieve Analysis - OAG'!G14=\"\",\"\",'Sieve Analysis - OAG'!G14)","v":""},{"$f":"IF('Sieve Analysis - OAG'!$B$8=\"\",\"\",'Sieve Analysis - OAG'!$B$8)","v":"Sieve Analysis - OAG"},{"$f":"IF('Sieve Analysis - OAG'!$D$8=\"\",\"\",'Sieve Analysis - OAG'!$D$8)","v":"Tex-470-A"},{"$f":"IF('Sieve Analysis - OAG'!$G$9=\"\",\"\",'Sieve Analysis - OAG'!$G$9)","v":"Intermediate Agg. 2\n% Passing"},{"$f":"IF('Sieve Analysis - OAG'!$B$9=\"\",\"\",'Sieve Analysis - OAG'!$B$9)","v":"Sieve Size"},{"$f":"IF('Sieve Analysis - OAG'!$B$14=\"\",\"\",'Sieve Analysis - OAG'!$B$14)","v":"3/4 in"}]
[121,{"$f":"IF('Sieve Analysis - OAG'!G15=\"\",\"\",'Sieve Analysis - OAG'!G15)","v":""},{"$f":"IF('Sieve Analysis - OAG'!$B$8=\"\",\"\",'Sieve Analysis - OAG'!$B$8)","v":"Sieve Analysis - OAG"},{"$f":"IF('Sieve Analysis - OAG'!$D$8=\"\",\"\",'Sieve Analysis - OAG'!$D$8)","v":"Tex-470-A"},{"$f":"IF('Sieve Analysis - OAG'!$G$9=\"\",\"\",'Sieve Analysis - OAG'!$G$9)","v":"Intermediate Agg. 2\n% Passing"},{"$f":"IF('Sieve Analysis - OAG'!$B$9=\"\",\"\",'Sieve Analysis - OAG'!$B$9)","v":"Sieve Size"},{"$f":"IF('Sieve Analysis - OAG'!$B$15=\"\",\"\",'Sieve Analysis - OAG'!$B$15)","v":"1/2 in"}]
[122,{"$f":"IF('Sieve Analysis - OAG'!G16=\"\",\"\",'Sieve Analysis - OAG'!G16)","v":""},{"$f":"IF('Sieve Analysis - OAG'!$B$8=\"\",\"\",'Sieve Analysis - OAG'!$B$8)","v":"Sieve Analysis - OAG"},{"$f":"IF('Sieve Analysis - OAG'!$D$8=\"\",\"\",'Sieve Analysis - OAG'!$D$8)","v":"Tex-470-A"},{"$f":"IF('Sieve Analysis - OAG'!$G$9=\"\",\"\",'Sieve Analysis - OAG'!$G$9)","v":"Intermediate Agg. 2\n% Passing"},{"$f":"IF('Sieve Analysis - OAG'!$B$9=\"\",\"\",'Sieve Analysis - OAG'!$B$9)","v":"Sieve Size"},{"$f":"IF('Sieve Analysis - OAG'!$B$16=\"\",\"\",'Sieve Analysis - OAG'!$B$16)","v":"3/8 in"}]
[123,{"$f":"IF('Sieve Analysis - OAG'!G17=\"\",\"\",'Sieve Analysis - OAG'!G17)","v":""},{"$f":"IF('Sieve Analysis - OAG'!$B$8=\"\",\"\",'Sieve Analysis - OAG'!$B$8)","v":"Sieve Analysis - OAG"},{"$f":"IF('Sieve Analysis - OAG'!$D$8=\"\",\"\",'Sieve Analysis - OAG'!$D$8)","v":"Tex-470-A"},{"$f":"IF('Sieve Analysis - OAG'!$G$9=\"\",\"\",'Sieve Analysis - OAG'!$G$9)","v":"Intermediate Agg. 2\n% Passing"},{"$f":"IF('Sieve Analysis - OAG'!$B$9=\"\",\"\",'Sieve Analysis - OAG'!$B$9)","v":"Sieve Size"},{"$f":"IF('Sieve Analysis - OAG'!$B$17=\"\",\"\",'Sieve Analysis - OAG'!$B$17)","v":"No. 4"}]
[124,{"$f":"IF('Sieve Analysis - OAG'!G18=\"\",\"\",'Sieve Analysis - OAG'!G18)","v":""},{"$f":"IF('Sieve Analysis - OAG'!$B$8=\"\",\"\",'Sieve Analysis - OAG'!$B$8)","v":"Sieve Analysis - OAG"},{"$f":"IF('Sieve Analysis - OAG'!$D$8=\"\",\"\",'Sieve Analysis - OAG'!$D$8)","v":"Tex-470-A"},{"$f":"IF('Sieve Analysis - OAG'!$G$9=\"\",\"\",'Sieve Analysis - OAG'!$G$9)","v":"Intermediate Agg. 2\n% Passing"},{"$f":"IF('Sieve Analysis - OAG'!$B$9=\"\",\"\",'Sieve Analysis - OAG'!$B$9)","v":"Sieve Size"},{"$f":"IF('Sieve Analysis - OAG'!$B$18=\"\",\"\",'Sieve Analysis - OAG'!$B$18)","v":"No. 8"}]
[125,{"$f":"IF('Sieve Analysis - OAG'!G19=\"\",\"\",'Sieve Analysis - OAG'!G19)","v":""},{"$f":"IF('Sieve Analysis - OAG'!$B$8=\"\",\"\",'Sieve Analysis - OAG'!$B$8)","v":"Sieve Analysis - OAG"},{"$f":"IF('Sieve Analysis - OAG'!$D$8=\"\",\"\",'Sieve Analysis - OAG'!$D$8)","v":"Tex-470-A"},{"$f":"IF('Sieve Analysis - OAG'!$G$9=\"\",\"\",'Sieve Analysis - OAG'!$G$9)","v":"Intermediate Agg. 2\n% Passing"},{"$f":"IF('Sieve Analysis - OAG'!$B$9=\"\",\"\",'Sieve Analysis - OAG'!$B$9)","v":"Sieve Size"},{"$f":"IF('Sieve Analysis - OAG'!$B$19=\"\",\"\",'Sieve Analysis - OAG'!$B$19)","v":"No. 16"}]
[126,{"$f":"IF('Sieve Analysis - OAG'!G20=\"\",\"\",'Sieve Analysis - OAG'!G20)","v":""},{"$f":"IF('Sieve Analysis - OAG'!$B$8=\"\",\"\",'Sieve Analysis - OAG'!$B$8)","v":"Sieve Analysis - OAG"},{"$f":"IF('Sieve Analysis - OAG'!$D$8=\"\",\"\",'Sieve Analysis - OAG'!$D$8)","v":"Tex-470-A"},{"$f":"IF('Sieve Analysis - OAG'!$G$9=\"\",\"\",'Sieve Analysis - OAG'!$G$9)","v":"Intermediate Agg. 2\n% Passing"},{"$f":"IF('Sieve Analysis - OAG'!$B$9=\"\",\"\",'Sieve Analysis - OAG'!$B$9)","v":"Sieve Size"},{"$f":"IF('Sieve Analysis - OAG'!$B$20=\"\",\"\",'Sieve Analysis - OAG'!$B$20)","v":"No. 30"}]
[127,{"$f":"IF('Sieve Analysis - OAG'!G21=\"\",\"\",'Sieve Analysis - OAG'!G21)","v":""},{"$f":"IF('Sieve Analysis - OAG'!$B$8=\"\",\"\",'Sieve Analysis - OAG'!$B$8)","v":"Sieve Analysis - OAG"},{"$f":"IF('Sieve Analysis - OAG'!$D$8=\"\",\"\",'Sieve Analysis - OAG'!$D$8)","v":"Tex-470-A"},{"$f":"IF('Sieve Analysis - OAG'!$G$9=\"\",\"\",'Sieve Analysis - OAG'!$G$9)","v":"Intermediate Agg. 2\n% Passing"},{"$f":"IF('Sieve Analysis - OAG'!$B$9=\"\",\"\",'Sieve Analysis - OAG'!$B$9)","v":"Sieve Size"},{"$f":"IF('Sieve Analysis - OAG'!$B$21=\"\",\"\",'Sieve Analysis - OAG'!$B$21)","v":"No. 50"}]
[128,{"$f":"IF('Sieve Analysis - OAG'!G22=\"\",\"\",'Sieve Analysis - OAG'!G22)","v":""},{"$f":"IF('Sieve Analysis - OAG'!$B$8=\"\",\"\",'Sieve Analysis - OAG'!$B$8)","v":"Sieve Analysis - OAG"},{"$f":"IF('Sieve Analysis - OAG'!$D$8=\"\",\"\",'Sieve Analysis - OAG'!$D$8)","v":"Tex-470-A"},{"$f":"IF('Sieve Analysis - OAG'!$G$9=\"\",\"\",'Sieve Analysis - OAG'!$G$9)","v":"Intermediate Agg. 2\n% Passing"},{"$f":"IF('Sieve Analysis - OAG'!$B$9=\"\",\"\",'Sieve Analysis - OAG'!$B$9)","v":"Sieve Size"},{"$f":"IF('Sieve Analysis - OAG'!$B$22=\"\",\"\",'Sieve Analysis - OAG'!$B$22)","v":"No. 100"}]
[129,{"$f":"IF('Sieve Analysis - OAG'!G23=\"\",\"\",'Sieve Analysis - OAG'!G23)","v":""},{"$f":"IF('Sieve Analysis - OAG'!$B$8=\"\",\"\",'Sieve Analysis - OAG'!$B$8)","v":"Sieve Analysis - OAG"},{"$f":"IF('Sieve Analysis - OAG'!$D$8=\"\",\"\",'Sieve Analysis - OAG'!$D$8)","v":"Tex-470-A"},{"$f":"IF('Sieve Analysis - OAG'!$G$9=\"\",\"\",'Sieve Analysis - OAG'!$G$9)","v":"Intermediate Agg. 2\n% Passing"},{"$f":"IF('Sieve Analysis - OAG'!$B$9=\"\",\"\",'Sieve Analysis - OAG'!$B$9)","v":"Sieve Size"},{"$f":"IF('Sieve Analysis - OAG'!$B$23=\"\",\"\",'Sieve Analysis - OAG'!$B$23)","v":"No. 200"}]
[130,{"$f":"IF('Sieve Analysis - OAG'!G24=\"\",\"\",'Sieve Analysis - OAG'!G24)","v":""},{"$f":"IF('Sieve Analysis - OAG'!$B$8=\"\",\"\",'Sieve Analysis - OAG'!$B$8)","v":"Sieve Analysis - OAG"},{"$f":"IF('Sieve Analysis - OAG'!$D$8=\"\",\"\",'Sieve Analysis - OAG'!$D$8)","v":"Tex-470-A"},{"$f":"IF('Sieve Analysis - OAG'!$G$9=\"\",\"\",'Sieve Analysis - OAG'!$G$9)","v":"Intermediate Agg. 2\n% Passing"},{"$f":"IF('Sieve Analysis - OAG'!$B$9=\"\",\"\",'Sieve Analysis - OAG'!$B$9)","v":"Sieve Size"},{"$f":"IF('Sieve Analysis - OAG'!$B$24=\"\",\"\",'Sieve Analysis - OAG'!$B$24)","v":"Pan"}]
[131,{"$f":"IF('Sieve Analysis - OAG'!G25=\"\",\"\",'Sieve Analysis - OAG'!G25)","v":""},{"$f":"IF('Sieve Analysis - OAG'!$B$8=\"\",\"\",'Sieve Analysis - OAG'!$B$8)","v":"Sieve Analysis - OAG"},{"$f":"IF('Sieve Analysis - OAG'!$D$8=\"\",\"\",'Sieve Analysis - OAG'!$D$8)","v":"Tex-470-A"},{"$f":"IF('Sieve Analysis - OAG'!$G$9=\"\",\"\",'Sieve Analysis - OAG'!$G$9)","v":"Intermediate Agg. 2\n% Passing"},{"$f":"IF('Sieve Analysis - OAG'!$B$9=\"\",\"\",'Sieve Analysis - OAG'!$B$9)","v":"Sieve Size"},{"$f":"IF('Sieve Analysis - OAG'!$B$25=\"\",\"\",'Sieve Analysis - OAG'!$B$25)","v":"Percent of Total Agg."}]
[132,{"$f":"IF('Sieve Analysis - OAG'!H10=\"\",\"\",'Sieve Analysis - OAG'!H10)","v":""},{"$f":"IF('Sieve Analysis - OAG'!$B$8=\"\",\"\",'Sieve Analysis - OAG'!$B$8)","v":"Sieve Analysis - OAG"},{"$f":"IF('Sieve Analysis - OAG'!$D$8=\"\",\"\",'Sieve Analysis - OAG'!$D$8)","v":"Tex-470-A"},{"$f":"IF('Sieve Analysis - OAG'!$H$9=\"\",\"\",'Sieve Analysis - OAG'!$H$9)","v":"Fine Agg. 1\n% Passing"},{"$f":"IF('Sieve Analysis - OAG'!$B$9=\"\",\"\",'Sieve Analysis - OAG'!$B$9)","v":"Sieve Size"},{"$f":"IF('Sieve Analysis - OAG'!$B$10=\"\",\"\",'Sieve Analysis - OAG'!$B$10)","v":"2 1/2 in"}]
[133,{"$f":"IF('Sieve Analysis - OAG'!H11=\"\",\"\",'Sieve Analysis - OAG'!H11)","v":""},{"$f":"IF('Sieve Analysis - OAG'!$B$8=\"\",\"\",'Sieve Analysis - OAG'!$B$8)","v":"Sieve Analysis - OAG"},{"$f":"IF('Sieve Analysis - OAG'!$D$8=\"\",\"\",'Sieve Analysis - OAG'!$D$8)","v":"Tex-470-A"},{"$f":"IF('Sieve Analysis - OAG'!$H$9=\"\",\"\",'Sieve Analysis - OAG'!$H$9)","v":"Fine Agg. 1\n% Passing"},{"$f":"IF('Sieve Analysis - OAG'!$B$9=\"\",\"\",'Sieve Analysis - OAG'!$B$9)","v":"Sieve Size"},{"$f":"IF('Sieve Analysis - OAG'!$B$11=\"\",\"\",'Sieve Analysis - OAG'!$B$11)","v":"2 in"}]
[134,{"$f":"IF('Sieve Analysis - OAG'!H12=\"\",\"\",'Sieve Analysis - OAG'!H12)","v":""},{"$f":"IF('Sieve Analysis - OAG'!$B$8=\"\",\"\",'Sieve Analysis - OAG'!$B$8)","v":"Sieve Analysis - OAG"},{"$f":"IF('Sieve Analysis - OAG'!$D$8=\"\",\"\",'Sieve Analysis - OAG'!$D$8)","v":"Tex-470-A"},{"$f":"IF('Sieve Analysis - OAG'!$H$9=\"\",\"\",'Sieve Analysis - OAG'!$H$9)","v":"Fine Agg. 1\n% Passing"},{"$f":"IF('Sieve Analysis - OAG'!$B$9=\"\",\"\",'Sieve Analysis - OAG'!$B$9)","v":"Sieve Size"},{"$f":"IF('Sieve Analysis - OAG'!$B$12=\"\",\"\",'Sieve Analysis - OAG'!$B$12)","v":"1 1/2 in"}]
[135,{"$f":"IF('Sieve Analysis - OAG'!H13=\"\",\"\",'Sieve Analysis - OAG'!H13)","v":""},{"$f":"IF('Sieve Analysis - OAG'!$B$8=\"\",\"\",'Sieve Analysis - OAG'!$B$8)","v":"Sieve Analysis - OAG"},{"$f":"IF('Sieve Analysis - OAG'!$D$8=\"\",\"\",'Sieve Analysis - OAG'!$D$8)","v":"Tex-470-A"},{"$f":"IF('Sieve Analysis - OAG'!$H$9=\"\",\"\",'Sieve Analysis - OAG'!$H$9)","v":"Fine Agg. 1\n% Passing"},{"$f":"IF('Sieve Analysis - OAG'!$B$9=\"\",\"\",'Sieve Analysis - OAG'!$B$9)","v":"Sieve Size"},{"$f":"IF('Sieve Analysis - OAG'!$B$13=\"\",\"\",'Sieve Analysis - OAG'!$B$13)","v":"1 in"}]
[136,{"$f":"IF('Sieve Analysis - OAG'!H14=\"\",\"\",'Sieve Analysis - OAG'!H14)","v":""},{"$f":"IF('Sieve Analysis - OAG'!$B$8=\"\",\"\",'Sieve Analysis - OAG'!$B$8)","v":"Sieve Analysis - OAG"},{"$f":"IF('Sieve Analysis - OAG'!$D$8=\"\",\"\",'Sieve Analysis - OAG'!$D$8)","v":"Tex-470-A"},{"$f":"IF('Sieve Analysis - OAG'!$H$9=\"\",\"\",'Sieve Analysis - OAG'!$H$9)","v":"Fine Agg. 1\n% Passing"},{"$f":"IF('Sieve Analysis - OAG'!$B$9=\"\",\"\",'Sieve Analysis - OAG'!$B$9)","v":"Sieve Size"},{"$f":"IF('Sieve Analysis - OAG'!$B$14=\"\",\"\",'Sieve Analysis - OAG'!$B$14)","v":"3/4 in"}]
[137,{"$f":"IF('Sieve Analysis - OAG'!H15=\"\",\"\",'Sieve Analysis - OAG'!H15)","v":""},{"$f":"IF('Sieve Analysis - OAG'!$B$8=\"\",\"\",'Sieve Analysis - OAG'!$B$8)","v":"Sieve Analysis - OAG"},{"$f":"IF('Sieve Analysis - OAG'!$D$8=\"\",\"\",'Sieve Analysis - OAG'!$D$8)","v":"Tex-470-A"},{"$f":"IF('Sieve Analysis - OAG'!$H$9=\"\",\"\",'Sieve Analysis - OAG'!$H$9)","v":"Fine Agg. 1\n% Passing"},{"$f":"IF('Sieve Analysis - OAG'!$B$9=\"\",\"\",'Sieve Analysis - OAG'!$B$9)","v":"Sieve Size"},{"$f":"IF('Sieve Analysis - OAG'!$B$15=\"\",\"\",'Sieve Analysis - OAG'!$B$15)","v":"1/2 in"}]
[138,{"$f":"IF('Sieve Analysis - OAG'!H16=\"\",\"\",'Sieve Analysis - OAG'!H16)","v":""},{"$f":"IF('Sieve Analysis - OAG'!$B$8=\"\",\"\",'Sieve Analysis - OAG'!$B$8)","v":"Sieve Analysis - OAG"},{"$f":"IF('Sieve Analysis - OAG'!$D$8=\"\",\"\",'Sieve Analysis - OAG'!$D$8)","v":"Tex-470-A"},{"$f":"IF('Sieve Analysis - OAG'!$H$9=\"\",\"\",'Sieve Analysis - OAG'!$H$9)","v":"Fine Agg. 1\n% Passing"},{"$f":"IF('Sieve Analysis - OAG'!$B$9=\"\",\"\",'Sieve Analysis - OAG'!$B$9)","v":"Sieve Size"},{"$f":"IF('Sieve Analysis - OAG'!$B$16=\"\",\"\",'Sieve Analysis - OAG'!$B$16)","v":"3/8 in"}]
[139,{"$f":"IF('Sieve Analysis - OAG'!H17=\"\",\"\",'Sieve Analysis - OAG'!H17)","v":""},{"$f":"IF('Sieve Analysis - OAG'!$B$8=\"\",\"\",'Sieve Analysis - OAG'!$B$8)","v":"Sieve Analysis - OAG"},{"$f":"IF('Sieve Analysis - OAG'!$D$8=\"\",\"\",'Sieve Analysis - OAG'!$D$8)","v":"Tex-470-A"},{"$f":"IF('Sieve Analysis - OAG'!$H$9=\"\",\"\",'Sieve Analysis - OAG'!$H$9)","v":"Fine Agg. 1\n% Passing"},{"$f":"IF('Sieve Analysis - OAG'!$B$9=\"\",\"\",'Sieve Analysis - OAG'!$B$9)","v":"Sieve Size"},{"$f":"IF('Sieve Analysis - OAG'!$B$17=\"\",\"\",'Sieve Analysis - OAG'!$B$17)","v":"No. 4"}]
[140,{"$f":"IF('Sieve Analysis - OAG'!H18=\"\",\"\",'Sieve Analysis - OAG'!H18)","v":""},{"$f":"IF('Sieve Analysis - OAG'!$B$8=\"\",\"\",'Sieve Analysis - OAG'!$B$8)","v":"Sieve Analysis - OAG"},{"$f":"IF('Sieve Analysis - OAG'!$D$8=\"\",\"\",'Sieve Analysis - OAG'!$D$8)","v":"Tex-470-A"},{"$f":"IF('Sieve Analysis - OAG'!$H$9=\"\",\"\",'Sieve Analysis - OAG'!$H$9)","v":"Fine Agg. 1\n% Passing"},{"$f":"IF('Sieve Analysis - OAG'!$B$9=\"\",\"\",'Sieve Analysis - OAG'!$B$9)","v":"Sieve Size"},{"$f":"IF('Sieve Analysis - OAG'!$B$18=\"\",\"\",'Sieve Analysis - OAG'!$B$18)","v":"No. 8"}]
[141,{"$f":"IF('Sieve Analysis - OAG'!H19=\"\",\"\",'Sieve Analysis - OAG'!H19)","v":""},{"$f":"IF('Sieve Analysis - OAG'!$B$8=\"\",\"\",'Sieve Analysis - OAG'!$B$8)","v":"Sieve Analysis - OAG"},{"$f":"IF('Sieve Analysis - OAG'!$D$8=\"\",\"\",'Sieve Analysis - OAG'!$D$8)","v":"Tex-470-A"},{"$f":"IF('Sieve Analysis - OAG'!$H$9=\"\",\"\",'Sieve Analysis - OAG'!$H$9)","v":"Fine Agg. 1\n% Passing"},{"$f":"IF('Sieve Analysis - OAG'!$B$9=\"\",\"\",'Sieve Analysis - OAG'!$B$9)","v":"Sieve Size"},{"$f":"IF('Sieve Analysis - OAG'!$B$19=\"\",\"\",'Sieve Analysis - OAG'!$B$19)","v":"No. 16"}]
[142,{"$f":"IF('Sieve Analysis - OAG'!H20=\"\",\"\",'Sieve Analysis - OAG'!H20)","v":""},{"$f":"IF('Sieve Analysis - OAG'!$B$8=\"\",\"\",'Sieve Analysis - OAG'!$B$8)","v":"Sieve Analysis - OAG"},{"$f":"IF('Sieve Analysis - OAG'!$D$8=\"\",\"\",'Sieve Analysis - OAG'!$D$8)","v":"Tex-470-A"},{"$f":"IF('Sieve Analysis - OAG'!$H$9=\"\",\"\",'Sieve Analysis - OAG'!$H$9)","v":"Fine Agg. 1\n% Passing"},{"$f":"IF('Sieve Analysis - OAG'!$B$9=\"\",\"\",'Sieve Analysis - OAG'!$B$9)","v":"Sieve Size"},{"$f":"IF('Sieve Analysis - OAG'!$B$20=\"\",\"\",'Sieve Analysis - OAG'!$B$20)","v":"No. 30"}]
[143,{"$f":"IF('Sieve Analysis - OAG'!H21=\"\",\"\",'Sieve Analysis - OAG'!H21)","v":""},{"$f":"IF('Sieve Analysis - OAG'!$B$8=\"\",\"\",'Sieve Analysis - OAG'!$B$8)","v":"Sieve Analysis - OAG"},{"$f":"IF('Sieve Analysis - OAG'!$D$8=\"\",\"\",'Sieve Analysis - OAG'!$D$8)","v":"Tex-470-A"},{"$f":"IF('Sieve Analysis - OAG'!$H$9=\"\",\"\",'Sieve Analysis - OAG'!$H$9)","v":"Fine Agg. 1\n% Passing"},{"$f":"IF('Sieve Analysis - OAG'!$B$9=\"\",\"\",'Sieve Analysis - OAG'!$B$9)","v":"Sieve Size"},{"$f":"IF('Sieve Analysis - OAG'!$B$21=\"\",\"\",'Sieve Analysis - OAG'!$B$21)","v":"No. 50"}]
[144,{"$f":"IF('Sieve Analysis - OAG'!H22=\"\",\"\",'Sieve Analysis - OAG'!H22)","v":""},{"$f":"IF('Sieve Analysis - OAG'!$B$8=\"\",\"\",'Sieve Analysis - OAG'!$B$8)","v":"Sieve Analysis - OAG"},{"$f":"IF('Sieve Analysis - OAG'!$D$8=\"\",\"\",'Sieve Analysis - OAG'!$D$8)","v":"Tex-470-A"},{"$f":"IF('Sieve Analysis - OAG'!$H$9=\"\",\"\",'Sieve Analysis - OAG'!$H$9)","v":"Fine Agg. 1\n% Passing"},{"$f":"IF('Sieve Analysis - OAG'!$B$9=\"\",\"\",'Sieve Analysis - OAG'!$B$9)","v":"Sieve Size"},{"$f":"IF('Sieve Analysis - OAG'!$B$22=\"\",\"\",'Sieve Analysis - OAG'!$B$22)","v":"No. 100"}]
[145,{"$f":"IF('Sieve Analysis - OAG'!H23=\"\",\"\",'Sieve Analysis - OAG'!H23)","v":""},{"$f":"IF('Sieve Analysis - OAG'!$B$8=\"\",\"\",'Sieve Analysis - OAG'!$B$8)","v":"Sieve Analysis - OAG"},{"$f":"IF('Sieve Analysis - OAG'!$D$8=\"\",\"\",'Sieve Analysis - OAG'!$D$8)","v":"Tex-470-A"},{"$f":"IF('Sieve Analysis - OAG'!$H$9=\"\",\"\",'Sieve Analysis - OAG'!$H$9)","v":"Fine Agg. 1\n% Passing"},{"$f":"IF('Sieve Analysis - OAG'!$B$9=\"\",\"\",'Sieve Analysis - OAG'!$B$9)","v":"Sieve Size"},{"$f":"IF('Sieve Analysis - OAG'!$B$23=\"\",\"\",'Sieve Analysis - OAG'!$B$23)","v":"No. 200"}]
[146,{"$f":"IF('Sieve Analysis - OAG'!H24=\"\",\"\",'Sieve Analysis - OAG'!H24)","v":""},{"$f":"IF('Sieve Analysis - OAG'!$B$8=\"\",\"\",'Sieve Analysis - OAG'!$B$8)","v":"Sieve Analysis - OAG"},{"$f":"IF('Sieve Analysis - OAG'!$D$8=\"\",\"\",'Sieve Analysis - OAG'!$D$8)","v":"Tex-470-A"},{"$f":"IF('Sieve Analysis - OAG'!$H$9=\"\",\"\",'Sieve Analysis - OAG'!$H$9)","v":"Fine Agg. 1\n% Passing"},{"$f":"IF('Sieve Analysis - OAG'!$B$9=\"\",\"\",'Sieve Analysis - OAG'!$B$9)","v":"Sieve Size"},{"$f":"IF('Sieve Analysis - OAG'!$B$24=\"\",\"\",'Sieve Analysis - OAG'!$B$24)","v":"Pan"}]
[147,{"$f":"IF('Sieve Analysis - OAG'!H25=\"\",\"\",'Sieve Analysis - OAG'!H25)","v":""},{"$f":"IF('Sieve Analysis - OAG'!$B$8=\"\",\"\",'Sieve Analysis - OAG'!$B$8)","v":"Sieve Analysis - OAG"},{"$f":"IF('Sieve Analysis - OAG'!$D$8=\"\",\"\",'Sieve Analysis - OAG'!$D$8)","v":"Tex-470-A"},{"$f":"IF('Sieve Analysis - OAG'!$H$9=\"\",\"\",'Sieve Analysis - OAG'!$H$9)","v":"Fine Agg. 1\n% Passing"},{"$f":"IF('Sieve Analysis - OAG'!$B$9=\"\",\"\",'Sieve Analysis - OAG'!$B$9)","v":"Sieve Size"},{"$f":"IF('Sieve Analysis - OAG'!$B$25=\"\",\"\",'Sieve Analysis - OAG'!$B$25)","v":"Percent of Total Agg."}]
[148,{"$f":"IF('Sieve Analysis - OAG'!I10=\"\",\"\",'Sieve Analysis - OAG'!I10)","v":""},{"$f":"IF('Sieve Analysis - OAG'!$B$8=\"\",\"\",'Sieve Analysis - OAG'!$B$8)","v":"Sieve Analysis - OAG"},{"$f":"IF('Sieve Analysis - OAG'!$D$8=\"\",\"\",'Sieve Analysis - OAG'!$D$8)","v":"Tex-470-A"},{"$f":"IF('Sieve Analysis - OAG'!$I$9=\"\",\"\",'Sieve Analysis - OAG'!$I$9)","v":"Fine Agg. 2\n% Passing"},{"$f":"IF('Sieve Analysis - OAG'!$B$9=\"\",\"\",'Sieve Analysis - OAG'!$B$9)","v":"Sieve Size"},{"$f":"IF('Sieve Analysis - OAG'!$B$10=\"\",\"\",'Sieve Analysis - OAG'!$B$10)","v":"2 1/2 in"}]
[149,{"$f":"IF('Sieve Analysis - OAG'!I11=\"\",\"\",'Sieve Analysis - OAG'!I11)","v":""},{"$f":"IF('Sieve Analysis - OAG'!$B$8=\"\",\"\",'Sieve Analysis - OAG'!$B$8)","v":"Sieve Analysis - OAG"},{"$f":"IF('Sieve Analysis - OAG'!$D$8=\"\",\"\",'Sieve Analysis - OAG'!$D$8)","v":"Tex-470-A"},{"$f":"IF('Sieve Analysis - OAG'!$I$9=\"\",\"\",'Sieve Analysis - OAG'!$I$9)","v":"Fine Agg. 2\n% Passing"},{"$f":"IF('Sieve Analysis - OAG'!$B$9=\"\",\"\",'Sieve Analysis - OAG'!$B$9)","v":"Sieve Size"},{"$f":"IF('Sieve Analysis - OAG'!$B$11=\"\",\"\",'Sieve Analysis - OAG'!$B$11)","v":"2 in"}]
[150,{"$f":"IF('Sieve Analysis - OAG'!I12=\"\",\"\",'Sieve Analysis - OAG'!I12)","v":""},{"$f":"IF('Sieve Analysis - OAG'!$B$8=\"\",\"\",'Sieve Analysis - OAG'!$B$8)","v":"Sieve Analysis - OAG"},{"$f":"IF('Sieve Analysis - OAG'!$D$8=\"\",\"\",'Sieve Analysis - OAG'!$D$8)","v":"Tex-470-A"},{"$f":"IF('Sieve Analysis - OAG'!$I$9=\"\",\"\",'Sieve Analysis - OAG'!$I$9)","v":"Fine Agg. 2\n% Passing"},{"$f":"IF('Sieve Analysis - OAG'!$B$9=\"\",\"\",'Sieve Analysis - OAG'!$B$9)","v":"Sieve Size"},{"$f":"IF('Sieve Analysis - OAG'!$B$12=\"\",\"\",'Sieve Analysis - OAG'!$B$12)","v":"1 1/2 in"}]
[151,{"$f":"IF('Sieve Analysis - OAG'!I13=\"\",\"\",'Sieve Analysis - OAG'!I13)","v":""},{"$f":"IF('Sieve Analysis - OAG'!$B$8=\"\",\"\",'Sieve Analysis - OAG'!$B$8)","v":"Sieve Analysis - OAG"},{"$f":"IF('Sieve Analysis - OAG'!$D$8=\"\",\"\",'Sieve Analysis - OAG'!$D$8)","v":"Tex-470-A"},{"$f":"IF('Sieve Analysis - OAG'!$I$9=\"\",\"\",'Sieve Analysis - OAG'!$I$9)","v":"Fine Agg. 2\n% Passing"},{"$f":"IF('Sieve Analysis - OAG'!$B$9=\"\",\"\",'Sieve Analysis - OAG'!$B$9)","v":"Sieve Size"},{"$f":"IF('Sieve Analysis - OAG'!$B$13=\"\",\"\",'Sieve Analysis - OAG'!$B$13)","v":"1 in"}]
[152,{"$f":"IF('Sieve Analysis - OAG'!I14=\"\",\"\",'Sieve Analysis - OAG'!I14)","v":""},{"$f":"IF('Sieve Analysis - OAG'!$B$8=\"\",\"\",'Sieve Analysis - OAG'!$B$8)","v":"Sieve Analysis - OAG"},{"$f":"IF('Sieve Analysis - OAG'!$D$8=\"\",\"\",'Sieve Analysis - OAG'!$D$8)","v":"Tex-470-A"},{"$f":"IF('Sieve Analysis - OAG'!$I$9=\"\",\"\",'Sieve Analysis - OAG'!$I$9)","v":"Fine Agg. 2\n% Passing"},{"$f":"IF('Sieve Analysis - OAG'!$B$9=\"\",\"\",'Sieve Analysis - OAG'!$B$9)","v":"Sieve Size"},{"$f":"IF('Sieve Analysis - OAG'!$B$14=\"\",\"\",'Sieve Analysis - OAG'!$B$14)","v":"3/4 in"}]
[153,{"$f":"IF('Sieve Analysis - OAG'!I15=\"\",\"\",'Sieve Analysis - OAG'!I15)","v":""},{"$f":"IF('Sieve Analysis - OAG'!$B$8=\"\",\"\",'Sieve Analysis - OAG'!$B$8)","v":"Sieve Analysis - OAG"},{"$f":"IF('Sieve Analysis - OAG'!$D$8=\"\",\"\",'Sieve Analysis - OAG'!$D$8)","v":"Tex-470-A"},{"$f":"IF('Sieve Analysis - OAG'!$I$9=\"\",\"\",'Sieve Analysis - OAG'!$I$9)","v":"Fine Agg. 2\n% Passing"},{"$f":"IF('Sieve Analysis - OAG'!$B$9=\"\",\"\",'Sieve Analysis - OAG'!$B$9)","v":"Sieve Size"},{"$f":"IF('Sieve Analysis - OAG'!$B$15=\"\",\"\",'Sieve Analysis - OAG'!$B$15)","v":"1/2 in"}]
[154,{"$f":"IF('Sieve Analysis - OAG'!I16=\"\",\"\",'Sieve Analysis - OAG'!I16)","v":""},{"$f":"IF('Sieve Analysis - OAG'!$B$8=\"\",\"\",'Sieve Analysis - OAG'!$B$8)","v":"Sieve Analysis - OAG"},{"$f":"IF('Sieve Analysis - OAG'!$D$8=\"\",\"\",'Sieve Analysis - OAG'!$D$8)","v":"Tex-470-A"},{"$f":"IF('Sieve Analysis - OAG'!$I$9=\"\",\"\",'Sieve Analysis - OAG'!$I$9)","v":"Fine Agg. 2\n% Passing"},{"$f":"IF('Sieve Analysis - OAG'!$B$9=\"\",\"\",'Sieve Analysis - OAG'!$B$9)","v":"Sieve Size"},{"$f":"IF('Sieve Analysis - OAG'!$B$16=\"\",\"\",'Sieve Analysis - OAG'!$B$16)","v":"3/8 in"}]
[155,{"$f":"IF('Sieve Analysis - OAG'!I17=\"\",\"\",'Sieve Analysis - OAG'!I17)","v":""},{"$f":"IF('Sieve Analysis - OAG'!$B$8=\"\",\"\",'Sieve Analysis - OAG'!$B$8)","v":"Sieve Analysis - OAG"},{"$f":"IF('Sieve Analysis - OAG'!$D$8=\"\",\"\",'Sieve Analysis - OAG'!$D$8)","v":"Tex-470-A"},{"$f":"IF('Sieve Analysis - OAG'!$I$9=\"\",\"\",'Sieve Analysis - OAG'!$I$9)","v":"Fine Agg. 2\n% Passing"},{"$f":"IF('Sieve Analysis - OAG'!$B$9=\"\",\"\",'Sieve Analysis - OAG'!$B$9)","v":"Sieve Size"},{"$f":"IF('Sieve Analysis - OAG'!$B$17=\"\",\"\",'Sieve Analysis - OAG'!$B$17)","v":"No. 4"}]
[156,{"$f":"IF('Sieve Analysis - OAG'!I18=\"\",\"\",'Sieve Analysis - OAG'!I18)","v":""},{"$f":"IF('Sieve Analysis - OAG'!$B$8=\"\",\"\",'Sieve Analysis - OAG'!$B$8)","v":"Sieve Analysis - OAG"},{"$f":"IF('Sieve Analysis - OAG'!$D$8=\"\",\"\",'Sieve Analysis - OAG'!$D$8)","v":"Tex-470-A"},{"$f":"IF('Sieve Analysis - OAG'!$I$9=\"\",\"\",'Sieve Analysis - OAG'!$I$9)","v":"Fine Agg. 2\n% Passing"},{"$f":"IF('Sieve Analysis - OAG'!$B$9=\"\",\"\",'Sieve Analysis - OAG'!$B$9)","v":"Sieve Size"},{"$f":"IF('Sieve Analysis - OAG'!$B$18=\"\",\"\",'Sieve Analysis - OAG'!$B$18)","v":"No. 8"}]
[157,{"$f":"IF('Sieve Analysis - OAG'!I19=\"\",\"\",'Sieve Analysis - OAG'!I19)","v":""},{"$f":"IF('Sieve Analysis - OAG'!$B$8=\"\",\"\",'Sieve Analysis - OAG'!$B$8)","v":"Sieve Analysis - OAG"},{"$f":"IF('Sieve Analysis - OAG'!$D$8=\"\",\"\",'Sieve Analysis - OAG'!$D$8)","v":"Tex-470-A"},{"$f":"IF('Sieve Analysis - OAG'!$I$9=\"\",\"\",'Sieve Analysis - OAG'!$I$9)","v":"Fine Agg. 2\n% Passing"},{"$f":"IF('Sieve Analysis - OAG'!$B$9=\"\",\"\",'Sieve Analysis - OAG'!$B$9)","v":"Sieve Size"},{"$f":"IF('Sieve Analysis - OAG'!$B$19=\"\",\"\",'Sieve Analysis - OAG'!$B$19)","v":"No. 16"}]
[158,{"$f":"IF('Sieve Analysis - OAG'!I20=\"\",\"\",'Sieve Analysis - OAG'!I20)","v":""},{"$f":"IF('Sieve Analysis - OAG'!$B$8=\"\",\"\",'Sieve Analysis - OAG'!$B$8)","v":"Sieve Analysis - OAG"},{"$f":"IF('Sieve Analysis - OAG'!$D$8=\"\",\"\",'Sieve Analysis - OAG'!$D$8)","v":"Tex-470-A"},{"$f":"IF('Sieve Analysis - OAG'!$I$9=\"\",\"\",'Sieve Analysis - OAG'!$I$9)","v":"Fine Agg. 2\n% Passing"},{"$f":"IF('Sieve Analysis - OAG'!$B$9=\"\",\"\",'Sieve Analysis - OAG'!$B$9)","v":"Sieve Size"},{"$f":"IF('Sieve Analysis - OAG'!$B$20=\"\",\"\",'Sieve Analysis - OAG'!$B$20)","v":"No. 30"}]
[159,{"$f":"IF('Sieve Analysis - OAG'!I21=\"\",\"\",'Sieve Analysis - OAG'!I21)","v":""},{"$f":"IF('Sieve Analysis - OAG'!$B$8=\"\",\"\",'Sieve Analysis - OAG'!$B$8)","v":"Sieve Analysis - OAG"},{"$f":"IF('Sieve Analysis - OAG'!$D$8=\"\",\"\",'Sieve Analysis - OAG'!$D$8)","v":"Tex-470-A"},{"$f":"IF('Sieve Analysis - OAG'!$I$9=\"\",\"\",'Sieve Analysis - OAG'!$I$9)","v":"Fine Agg. 2\n% Passing"},{"$f":"IF('Sieve Analysis - OAG'!$B$9=\"\",\"\",'Sieve Analysis - OAG'!$B$9)","v":"Sieve Size"},{"$f":"IF('Sieve Analysis - OAG'!$B$21=\"\",\"\",'Sieve Analysis - OAG'!$B$21)","v":"No. 50"}]
[160,{"$f":"IF('Sieve Analysis - OAG'!I22=\"\",\"\",'Sieve Analysis - OAG'!I22)","v":""},{"$f":"IF('Sieve Analysis - OAG'!$B$8=\"\",\"\",'Sieve Analysis - OAG'!$B$8)","v":"Sieve Analysis - OAG"},{"$f":"IF('Sieve Analysis - OAG'!$D$8=\"\",\"\",'Sieve Analysis - OAG'!$D$8)","v":"Tex-470-A"},{"$f":"IF('Sieve Analysis - OAG'!$I$9=\"\",\"\",'Sieve Analysis - OAG'!$I$9)","v":"Fine Agg. 2\n% Passing"},{"$f":"IF('Sieve Analysis - OAG'!$B$9=\"\",\"\",'Sieve Analysis - OAG'!$B$9)","v":"Sieve Size"},{"$f":"IF('Sieve Analysis - OAG'!$B$22=\"\",\"\",'Sieve Analysis - OAG'!$B$22)","v":"No. 100"}]
[161,{"$f":"IF('Sieve Analysis - OAG'!I23=\"\",\"\",'Sieve Analysis - OAG'!I23)","v":""},{"$f":"IF('Sieve Analysis - OAG'!$B$8=\"\",\"\",'Sieve Analysis - OAG'!$B$8)","v":"Sieve Analysis - OAG"},{"$f":"IF('Sieve Analysis - OAG'!$D$8=\"\",\"\",'Sieve Analysis - OAG'!$D$8)","v":"Tex-470-A"},{"$f":"IF('Sieve Analysis - OAG'!$I$9=\"\",\"\",'Sieve Analysis - OAG'!$I$9)","v":"Fine Agg. 2\n% Passing"},{"$f":"IF('Sieve Analysis - OAG'!$B$9=\"\",\"\",'Sieve Analysis - OAG'!$B$9)","v":"Sieve Size"},{"$f":"IF('Sieve Analysis - OAG'!$B$23=\"\",\"\",'Sieve Analysis - OAG'!$B$23)","v":"No. 200"}]
[162,{"$f":"IF('Sieve Analysis - OAG'!I24=\"\",\"\",'Sieve Analysis - OAG'!I24)","v":""},{"$f":"IF('Sieve Analysis - OAG'!$B$8=\"\",\"\",'Sieve Analysis - OAG'!$B$8)","v":"Sieve Analysis - OAG"},{"$f":"IF('Sieve Analysis - OAG'!$D$8=\"\",\"\",'Sieve Analysis - OAG'!$D$8)","v":"Tex-470-A"},{"$f":"IF('Sieve Analysis - OAG'!$I$9=\"\",\"\",'Sieve Analysis - OAG'!$I$9)","v":"Fine Agg. 2\n% Passing"},{"$f":"IF('Sieve Analysis - OAG'!$B$9=\"\",\"\",'Sieve Analysis - OAG'!$B$9)","v":"Sieve Size"},{"$f":"IF('Sieve Analysis - OAG'!$B$24=\"\",\"\",'Sieve Analysis - OAG'!$B$24)","v":"Pan"}]
[163,{"$f":"IF('Sieve Analysis - OAG'!I25=\"\",\"\",'Sieve Analysis - OAG'!I25)","v":""},{"$f":"IF('Sieve Analysis - OAG'!$B$8=\"\",\"\",'Sieve Analysis - OAG'!$B$8)","v":"Sieve Analysis - OAG"},{"$f":"IF('Sieve Analysis - OAG'!$D$8=\"\",\"\",'Sieve Analysis - OAG'!$D$8)","v":"Tex-470-A"},{"$f":"IF('Sieve Analysis - OAG'!$I$9=\"\",\"\",'Sieve Analysis - OAG'!$I$9)","v":"Fine Agg. 2\n% Passing"},{"$f":"IF('Sieve Analysis - OAG'!$B$9=\"\",\"\",'Sieve Analysis - OAG'!$B$9)","v":"Sieve Size"},{"$f":"IF('Sieve Analysis - OAG'!$B$25=\"\",\"\",'Sieve Analysis - OAG'!$B$25)","v":"Percent of Total Agg."}]
[164,{"$f":"IF('Sieve Analysis - OAG'!J10=\"\",\"\",'Sieve Analysis - OAG'!J10)","v":0},{"$f":"IF('Sieve Analysis - OAG'!$B$8=\"\",\"\",'Sieve Analysis - OAG'!$B$8)","v":"Sieve Analysis - OAG"},{"$f":"IF('Sieve Analysis - OAG'!$D$8=\"\",\"\",'Sieve Analysis - OAG'!$D$8)","v":"Tex-470-A"},{"$f":"IF('Sieve Analysis - OAG'!$J$9=\"\",\"\",'Sieve Analysis - OAG'!$J$9)","v":"Combined %\nPassing"},{"$f":"IF('Sieve Analysis - OAG'!$B$9=\"\",\"\",'Sieve Analysis - OAG'!$B$9)","v":"Sieve Size"},{"$f":"IF('Sieve Analysis - OAG'!$B$10=\"\",\"\",'Sieve Analysis - OAG'!$B$10)","v":"2 1/2 in"}]
[165,{"$f":"IF('Sieve Analysis - OAG'!J11=\"\",\"\",'Sieve Analysis - OAG'!J11)","v":0},{"$f":"IF('Sieve Analysis - OAG'!$B$8=\"\",\"\",'Sieve Analysis - OAG'!$B$8)","v":"Sieve Analysis - OAG"},{"$f":"IF('Sieve Analysis - OAG'!$D$8=\"\",\"\",'Sieve Analysis - OAG'!$D$8)","v":"Tex-470-A"},{"$f":"IF('Sieve Analysis - OAG'!$J$9=\"\",\"\",'Sieve Analysis - OAG'!$J$9)","v":"Combined %\nPassing"},{"$f":"IF('Sieve Analysis - OAG'!$B$9=\"\",\"\",'Sieve Analysis - OAG'!$B$9)","v":"Sieve Size"},{"$f":"IF('Sieve Analysis - OAG'!$B$11=\"\",\"\",'Sieve Analysis - OAG'!$B$11)","v":"2 in"}]
[166,{"$f":"IF('Sieve Analysis - OAG'!J12=\"\",\"\",'Sieve Analysis - OAG'!J12)","v":0},{"$f":"IF('Sieve Analysis - OAG'!$B$8=\"\",\"\",'Sieve Analysis - OAG'!$B$8)","v":"Sieve Analysis - OAG"},{"$f":"IF('Sieve Analysis - OAG'!$D$8=\"\",\"\",'Sieve Analysis - OAG'!$D$8)","v":"Tex-470-A"},{"$f":"IF('Sieve Analysis - OAG'!$J$9=\"\",\"\",'Sieve Analysis - OAG'!$J$9)","v":"Combined %\nPassing"},{"$f":"IF('Sieve Analysis - OAG'!$B$9=\"\",\"\",'Sieve Analysis - OAG'!$B$9)","v":"Sieve Size"},{"$f":"IF('Sieve Analysis - OAG'!$B$12=\"\",\"\",'Sieve Analysis - OAG'!$B$12)","v":"1 1/2 in"}]
[167,{"$f":"IF('Sieve Analysis - OAG'!J13=\"\",\"\",'Sieve Analysis - OAG'!J13)","v":0},{"$f":"IF('Sieve Analysis - OAG'!$B$8=\"\",\"\",'Sieve Analysis - OAG'!$B$8)","v":"Sieve Analysis - OAG"},{"$f":"IF('Sieve Analysis - OAG'!$D$8=\"\",\"\",'Sieve Analysis - OAG'!$D$8)","v":"Tex-470-A"},{"$f":"IF('Sieve Analysis - OAG'!$J$9=\"\",\"\",'Sieve Analysis - OAG'!$J$9)","v":"Combined %\nPassing"},{"$f":"IF('Sieve Analysis - OAG'!$B$9=\"\",\"\",'Sieve Analysis - OAG'!$B$9)","v":"Sieve Size"},{"$f":"IF('Sieve Analysis - OAG'!$B$13=\"\",\"\",'Sieve Analysis - OAG'!$B$13)","v":"1 in"}]
[168,{"$f":"IF('Sieve Analysis - OAG'!J14=\"\",\"\",'Sieve Analysis - OAG'!J14)","v":0},{"$f":"IF('Sieve Analysis - OAG'!$B$8=\"\",\"\",'Sieve Analysis - OAG'!$B$8)","v":"Sieve Analysis - OAG"},{"$f":"IF('Sieve Analysis - OAG'!$D$8=\"\",\"\",'Sieve Analysis - OAG'!$D$8)","v":"Tex-470-A"},{"$f":"IF('Sieve Analysis - OAG'!$J$9=\"\",\"\",'Sieve Analysis - OAG'!$J$9)","v":"Combined %\nPassing"},{"$f":"IF('Sieve Analysis - OAG'!$B$9=\"\",\"\",'Sieve Analysis - OAG'!$B$9)","v":"Sieve Size"},{"$f":"IF('Sieve Analysis - OAG'!$B$14=\"\",\"\",'Sieve Analysis - OAG'!$B$14)","v":"3/4 in"}]
[169,{"$f":"IF('Sieve Analysis - OAG'!J15=\"\",\"\",'Sieve Analysis - OAG'!J15)","v":0},{"$f":"IF('Sieve Analysis - OAG'!$B$8=\"\",\"\",'Sieve Analysis - OAG'!$B$8)","v":"Sieve Analysis - OAG"},{"$f":"IF('Sieve Analysis - OAG'!$D$8=\"\",\"\",'Sieve Analysis - OAG'!$D$8)","v":"Tex-470-A"},{"$f":"IF('Sieve Analysis - OAG'!$J$9=\"\",\"\",'Sieve Analysis - OAG'!$J$9)","v":"Combined %\nPassing"},{"$f":"IF('Sieve Analysis - OAG'!$B$9=\"\",\"\",'Sieve Analysis - OAG'!$B$9)","v":"Sieve Size"},{"$f":"IF('Sieve Analysis - OAG'!$B$15=\"\",\"\",'Sieve Analysis - OAG'!$B$15)","v":"1/2 in"}]
[170,{"$f":"IF('Sieve Analysis - OAG'!J16=\"\",\"\",'Sieve Analysis - OAG'!J16)","v":0},{"$f":"IF('Sieve Analysis - OAG'!$B$8=\"\",\"\",'Sieve Analysis - OAG'!$B$8)","v":"Sieve Analysis - OAG"},{"$f":"IF('Sieve Analysis - OAG'!$D$8=\"\",\"\",'Sieve Analysis - OAG'!$D$8)","v":"Tex-470-A"},{"$f":"IF('Sieve Analysis - OAG'!$J$9=\"\",\"\",'Sieve Analysis - OAG'!$J$9)","v":"Combined %\nPassing"},{"$f":"IF('Sieve Analysis - OAG'!$B$9=\"\",\"\",'Sieve Analysis - OAG'!$B$9)","v":"Sieve Size"},{"$f":"IF('Sieve Analysis - OAG'!$B$16=\"\",\"\",'Sieve Analysis - OAG'!$B$16)","v":"3/8 in"}]
[171,{"$f":"IF('Sieve Analysis - OAG'!J17=\"\",\"\",'Sieve Analysis - OAG'!J17)","v":0},{"$f":"IF('Sieve Analysis - OAG'!$B$8=\"\",\"\",'Sieve Analysis - OAG'!$B$8)","v":"Sieve Analysis - OAG"},{"$f":"IF('Sieve Analysis - OAG'!$D$8=\"\",\"\",'Sieve Analysis - OAG'!$D$8)","v":"Tex-470-A"},{"$f":"IF('Sieve Analysis - OAG'!$J$9=\"\",\"\",'Sieve Analysis - OAG'!$J$9)","v":"Combined %\nPassing"},{"$f":"IF('Sieve Analysis - OAG'!$B$9=\"\",\"\",'Sieve Analysis - OAG'!$B$9)","v":"Sieve Size"},{"$f":"IF('Sieve Analysis - OAG'!$B$17=\"\",\"\",'Sieve Analysis - OAG'!$B$17)","v":"No. 4"}]
[172,{"$f":"IF('Sieve Analysis - OAG'!J18=\"\",\"\",'Sieve Analysis - OAG'!J18)","v":0},{"$f":"IF('Sieve Analysis - OAG'!$B$8=\"\",\"\",'Sieve Analysis - OAG'!$B$8)","v":"Sieve Analysis - OAG"},{"$f":"IF('Sieve Analysis - OAG'!$D$8=\"\",\"\",'Sieve Analysis - OAG'!$D$8)","v":"Tex-470-A"},{"$f":"IF('Sieve Analysis - OAG'!$J$9=\"\",\"\",'Sieve Analysis - OAG'!$J$9)","v":"Combined %\nPassing"},{"$f":"IF('Sieve Analysis - OAG'!$B$9=\"\",\"\",'Sieve Analysis - OAG'!$B$9)","v":"Sieve Size"},{"$f":"IF('Sieve Analysis - OAG'!$B$18=\"\",\"\",'Sieve Analysis - OAG'!$B$18)","v":"No. 8"}]
[173,{"$f":"IF('Sieve Analysis - OAG'!J19=\"\",\"\",'Sieve Analysis - OAG'!J19)","v":0},{"$f":"IF('Sieve Analysis - OAG'!$B$8=\"\",\"\",'Sieve Analysis - OAG'!$B$8)","v":"Sieve Analysis - OAG"},{"$f":"IF('Sieve Analysis - OAG'!$D$8=\"\",\"\",'Sieve Analysis - OAG'!$D$8)","v":"Tex-470-A"},{"$f":"IF('Sieve Analysis - OAG'!$J$9=\"\",\"\",'Sieve Analysis - OAG'!$J$9)","v":"Combined %\nPassing"},{"$f":"IF('Sieve Analysis - OAG'!$B$9=\"\",\"\",'Sieve Analysis - OAG'!$B$9)","v":"Sieve Size"},{"$f":"IF('Sieve Analysis - OAG'!$B$19=\"\",\"\",'Sieve Analysis - OAG'!$B$19)","v":"No. 16"}]
[174,{"$f":"IF('Sieve Analysis - OAG'!J20=\"\",\"\",'Sieve Analysis - OAG'!J20)","v":0},{"$f":"IF('Sieve Analysis - OAG'!$B$8=\"\",\"\",'Sieve Analysis - OAG'!$B$8)","v":"Sieve Analysis - OAG"},{"$f":"IF('Sieve Analysis - OAG'!$D$8=\"\",\"\",'Sieve Analysis - OAG'!$D$8)","v":"Tex-470-A"},{"$f":"IF('Sieve Analysis - OAG'!$J$9=\"\",\"\",'Sieve Analysis - OAG'!$J$9)","v":"Combined %\nPassing"},{"$f":"IF('Sieve Analysis - OAG'!$B$9=\"\",\"\",'Sieve Analysis - OAG'!$B$9)","v":"Sieve Size"},{"$f":"IF('Sieve Analysis - OAG'!$B$20=\"\",\"\",'Sieve Analysis - OAG'!$B$20)","v":"No. 30"}]
[175,{"$f":"IF('Sieve Analysis - OAG'!J21=\"\",\"\",'Sieve Analysis - OAG'!J21)","v":0},{"$f":"IF('Sieve Analysis - OAG'!$B$8=\"\",\"\",'Sieve Analysis - OAG'!$B$8)","v":"Sieve Analysis - OAG"},{"$f":"IF('Sieve Analysis - OAG'!$D$8=\"\",\"\",'Sieve Analysis - OAG'!$D$8)","v":"Tex-470-A"},{"$f":"IF('Sieve Analysis - OAG'!$J$9=\"\",\"\",'Sieve Analysis - OAG'!$J$9)","v":"Combined %\nPassing"},{"$f":"IF('Sieve Analysis - OAG'!$B$9=\"\",\"\",'Sieve Analysis - OAG'!$B$9)","v":"Sieve Size"},{"$f":"IF('Sieve Analysis - OAG'!$B$21=\"\",\"\",'Sieve Analysis - OAG'!$B$21)","v":"No. 50"}]
[176,{"$f":"IF('Sieve Analysis - OAG'!J22=\"\",\"\",'Sieve Analysis - OAG'!J22)","v":0},{"$f":"IF('Sieve Analysis - OAG'!$B$8=\"\",\"\",'Sieve Analysis - OAG'!$B$8)","v":"Sieve Analysis - OAG"},{"$f":"IF('Sieve Analysis - OAG'!$D$8=\"\",\"\",'Sieve Analysis - OAG'!$D$8)","v":"Tex-470-A"},{"$f":"IF('Sieve Analysis - OAG'!$J$9=\"\",\"\",'Sieve Analysis - OAG'!$J$9)","v":"Combined %\nPassing"},{"$f":"IF('Sieve Analysis - OAG'!$B$9=\"\",\"\",'Sieve Analysis - OAG'!$B$9)","v":"Sieve Size"},{"$f":"IF('Sieve Analysis - OAG'!$B$22=\"\",\"\",'Sieve Analysis - OAG'!$B$22)","v":"No. 100"}]
[177,{"$f":"IF('Sieve Analysis - OAG'!J23=\"\",\"\",'Sieve Analysis - OAG'!J23)","v":0},{"$f":"IF('Sieve Analysis - OAG'!$B$8=\"\",\"\",'Sieve Analysis - OAG'!$B$8)","v":"Sieve Analysis - OAG"},{"$f":"IF('Sieve Analysis - OAG'!$D$8=\"\",\"\",'Sieve Analysis - OAG'!$D$8)","v":"Tex-470-A"},{"$f":"IF('Sieve Analysis - OAG'!$J$9=\"\",\"\",'Sieve Analysis - OAG'!$J$9)","v":"Combined %\nPassing"},{"$f":"IF('Sieve Analysis - OAG'!$B$9=\"\",\"\",'Sieve Analysis - OAG'!$B$9)","v":"Sieve Size"},{"$f":"IF('Sieve Analysis - OAG'!$B$23=\"\",\"\",'Sieve Analysis - OAG'!$B$23)","v":"No. 200"}]
[178,{"$f":"IF('Sieve Analysis - OAG'!J24=\"\",\"\",'Sieve Analysis - OAG'!J24)","v":0},{"$f":"IF('Sieve Analysis - OAG'!$B$8=\"\",\"\",'Sieve Analysis - OAG'!$B$8)","v":"Sieve Analysis - OAG"},{"$f":"IF('Sieve Analysis - OAG'!$D$8=\"\",\"\",'Sieve Analysis - OAG'!$D$8)","v":"Tex-470-A"},{"$f":"IF('Sieve Analysis - OAG'!$J$9=\"\",\"\",'Sieve Analysis - OAG'!$J$9)","v":"Combined %\nPassing"},{"$f":"IF('Sieve Analysis - OAG'!$B$9=\"\",\"\",'Sieve Analysis - OAG'!$B$9)","v":"Sieve Size"},{"$f":"IF('Sieve Analysis - OAG'!$B$24=\"\",\"\",'Sieve Analysis - OAG'!$B$24)","v":"Pan"}]
[179,{"$f":"IF('Sieve Analysis - OAG'!J25=\"\",\"\",'Sieve Analysis - OAG'!J25)","v":0},{"$f":"IF('Sieve Analysis - OAG'!$B$8=\"\",\"\",'Sieve Analysis - OAG'!$B$8)","v":"Sieve Analysis - OAG"},{"$f":"IF('Sieve Analysis - OAG'!$D$8=\"\",\"\",'Sieve Analysis - OAG'!$D$8)","v":"Tex-470-A"},{"$f":"IF('Sieve Analysis - OAG'!$J$9=\"\",\"\",'Sieve Analysis - OAG'!$J$9)","v":"Combined %\nPassing"},{"$f":"IF('Sieve Analysis - OAG'!$B$9=\"\",\"\",'Sieve Analysis - OAG'!$B$9)","v":"Sieve Size"},{"$f":"IF('Sieve Analysis - OAG'!$B$25=\"\",\"\",'Sieve Analysis - OAG'!$B$25)","v":"Percent of Total Agg."}]
[180,{"$f":"IF('Sieve Analysis - OAG'!K10=\"\",\"\",'Sieve Analysis - OAG'!K10)","v":100},{"$f":"IF('Sieve Analysis - OAG'!$B$8=\"\",\"\",'Sieve Analysis - OAG'!$B$8)","v":"Sieve Analysis - OAG"},{"$f":"IF('Sieve Analysis - OAG'!$D$8=\"\",\"\",'Sieve Analysis - OAG'!$D$8)","v":"Tex-470-A"},{"$f":"IF('Sieve Analysis - OAG'!$K$9=\"\",\"\",'Sieve Analysis - OAG'!$K$9)","v":"Combined Cumulative % Retained"},{"$f":"IF('Sieve Analysis - OAG'!$B$9=\"\",\"\",'Sieve Analysis - OAG'!$B$9)","v":"Sieve Size"},{"$f":"IF('Sieve Analysis - OAG'!$B$10=\"\",\"\",'Sieve Analysis - OAG'!$B$10)","v":"2 1/2 in"}]
[181,{"$f":"IF('Sieve Analysis - OAG'!K11=\"\",\"\",'Sieve Analysis - OAG'!K11)","v":100},{"$f":"IF('Sieve Analysis - OAG'!$B$8=\"\",\"\",'Sieve Analysis - OAG'!$B$8)","v":"Sieve Analysis - OAG"},{"$f":"IF('Sieve Analysis - OAG'!$D$8=\"\",\"\",'Sieve Analysis - OAG'!$D$8)","v":"Tex-470-A"},{"$f":"IF('Sieve Analysis - OAG'!$K$9=\"\",\"\",'Sieve Analysis - OAG'!$K$9)","v":"Combined Cumulative % Retained"},{"$f":"IF('Sieve Analysis - OAG'!$B$9=\"\",\"\",'Sieve Analysis - OAG'!$B$9)","v":"Sieve Size"},{"$f":"IF('Sieve Analysis - OAG'!$B$11=\"\",\"\",'Sieve Analysis - OAG'!$B$11)","v":"2 in"}]
[182,{"$f":"IF('Sieve Analysis - OAG'!K12=\"\",\"\",'Sieve Analysis - OAG'!K12)","v":100},{"$f":"IF('Sieve Analysis - OAG'!$B$8=\"\",\"\",'Sieve Analysis - OAG'!$B$8)","v":"Sieve Analysis - OAG"},{"$f":"IF('Sieve Analysis - OAG'!$D$8=\"\",\"\",'Sieve Analysis - OAG'!$D$8)","v":"Tex-470-A"},{"$f":"IF('Sieve Analysis - OAG'!$K$9=\"\",\"\",'Sieve Analysis - OAG'!$K$9)","v":"Combined Cumulative % Retained"},{"$f":"IF('Sieve Analysis - OAG'!$B$9=\"\",\"\",'Sieve Analysis - OAG'!$B$9)","v":"Sieve Size"},{"$f":"IF('Sieve Analysis - OAG'!$B$12=\"\",\"\",'Sieve Analysis - OAG'!$B$12)","v":"1 1/2 in"}]
[183,{"$f":"IF('Sieve Analysis - OAG'!K13=\"\",\"\",'Sieve Analysis - OAG'!K13)","v":100},{"$f":"IF('Sieve Analysis - OAG'!$B$8=\"\",\"\",'Sieve Analysis - OAG'!$B$8)","v":"Sieve Analysis - OAG"},{"$f":"IF('Sieve Analysis - OAG'!$D$8=\"\",\"\",'Sieve Analysis - OAG'!$D$8)","v":"Tex-470-A"},{"$f":"IF('Sieve Analysis - OAG'!$K$9=\"\",\"\",'Sieve Analysis - OAG'!$K$9)","v":"Combined Cumulative % Retained"},{"$f":"IF('Sieve Analysis - OAG'!$B$9=\"\",\"\",'Sieve Analysis - OAG'!$B$9)","v":"Sieve Size"},{"$f":"IF('Sieve Analysis - OAG'!$B$13=\"\",\"\",'Sieve Analysis - OAG'!$B$13)","v":"1 in"}]
[184,{"$f":"IF('Sieve Analysis - OAG'!K14=\"\",\"\",'Sieve Analysis - OAG'!K14)","v":100},{"$f":"IF('Sieve Analysis - OAG'!$B$8=\"\",\"\",'Sieve Analysis - OAG'!$B$8)","v":"Sieve Analysis - OAG"},{"$f":"IF('Sieve Analysis - OAG'!$D$8=\"\",\"\",'Sieve Analysis - OAG'!$D$8)","v":"Tex-470-A"},{"$f":"IF('Sieve Analysis - OAG'!$K$9=\"\",\"\",'Sieve Analysis - OAG'!$K$9)","v":"Combined Cumulative % Retained"},{"$f":"IF('Sieve Analysis - OAG'!$B$9=\"\",\"\",'Sieve Analysis - OAG'!$B$9)","v":"Sieve Size"},{"$f":"IF('Sieve Analysis - OAG'!$B$14=\"\",\"\",'Sieve Analysis - OAG'!$B$14)","v":"3/4 in"}]
[185,{"$f":"IF('Sieve Analysis - OAG'!K15=\"\",\"\",'Sieve Analysis - OAG'!K15)","v":100},{"$f":"IF('Sieve Analysis - OAG'!$B$8=\"\",\"\",'Sieve Analysis - OAG'!$B$8)","v":"Sieve Analysis - OAG"},{"$f":"IF('Sieve Analysis - OAG'!$D$8=\"\",\"\",'Sieve Analysis - OAG'!$D$8)","v":"Tex-470-A"},{"$f":"IF('Sieve Analysis - OAG'!$K$9=\"\",\"\",'Sieve Analysis - OAG'!$K$9)","v":"Combined Cumulative % Retained"},{"$f":"IF('Sieve Analysis - OAG'!$B$9=\"\",\"\",'Sieve Analysis - OAG'!$B$9)","v":"Sieve Size"},{"$f":"IF('Sieve Analysis - OAG'!$B$15=\"\",\"\",'Sieve Analysis - OAG'!$B$15)","v":"1/2 in"}]
[186,{"$f":"IF('Sieve Analysis - OAG'!K16=\"\",\"\",'Sieve Analysis - OAG'!K16)","v":100},{"$f":"IF('Sieve Analysis - OAG'!$B$8=\"\",\"\",'Sieve Analysis - OAG'!$B$8)","v":"Sieve Analysis - OAG"},{"$f":"IF('Sieve Analysis - OAG'!$D$8=\"\",\"\",'Sieve Analysis - OAG'!$D$8)","v":"Tex-470-A"},{"$f":"IF('Sieve Analysis - OAG'!$K$9=\"\",\"\",'Sieve Analysis - OAG'!$K$9)","v":"Combined Cumulative % Retained"},{"$f":"IF('Sieve Analysis - OAG'!$B$9=\"\",\"\",'Sieve Analysis - OAG'!$B$9)","v":"Sieve Size"},{"$f":"IF('Sieve Analysis - OAG'!$B$16=\"\",\"\",'Sieve Analysis - OAG'!$B$16)","v":"3/8 in"}]
[187,{"$f":"IF('Sieve Analysis - OAG'!K17=\"\",\"\",'Sieve Analysis - OAG'!K17)","v":100},{"$f":"IF('Sieve Analysis - OAG'!$B$8=\"\",\"\",'Sieve Analysis - OAG'!$B$8)","v":"Sieve Analysis - OAG"},{"$f":"IF('Sieve Analysis - OAG'!$D$8=\"\",\"\",'Sieve Analysis - OAG'!$D$8)","v":"Tex-470-A"},{"$f":"IF('Sieve Analysis - OAG'!$K$9=\"\",\"\",'Sieve Analysis - OAG'!$K$9)","v":"Combined Cumulative % Retained"},{"$f":"IF('Sieve Analysis - OAG'!$B$9=\"\",\"\",'Sieve Analysis - OAG'!$B$9)","v":"Sieve Size"},{"$f":"IF('Sieve Analysis - OAG'!$B$17=\"\",\"\",'Sieve Analysis - OAG'!$B$17)","v":"No. 4"}]
[188,{"$f":"IF('Sieve Analysis - OAG'!K18=\"\",\"\",'Sieve Analysis - OAG'!K18)","v":100},{"$f":"IF('Sieve Analysis - OAG'!$B$8=\"\",\"\",'Sieve Analysis - OAG'!$B$8)","v":"Sieve Analysis - OAG"},{"$f":"IF('Sieve Analysis - OAG'!$D$8=\"\",\"\",'Sieve Analysis - OAG'!$D$8)","v":"Tex-470-A"},{"$f":"IF('Sieve Analysis - OAG'!$K$9=\"\",\"\",'Sieve Analysis - OAG'!$K$9)","v":"Combined Cumulative % Retained"},{"$f":"IF('Sieve Analysis - OAG'!$B$9=\"\",\"\",'Sieve Analysis - OAG'!$B$9)","v":"Sieve Size"},{"$f":"IF('Sieve Analysis - OAG'!$B$18=\"\",\"\",'Sieve Analysis - OAG'!$B$18)","v":"No. 8"}]
[189,{"$f":"IF('Sieve Analysis - OAG'!K19=\"\",\"\",'Sieve Analysis - OAG'!K19)","v":100},{"$f":"IF('Sieve Analysis - OAG'!$B$8=\"\",\"\",'Sieve Analysis - OAG'!$B$8)","v":"Sieve Analysis - OAG"},{"$f":"IF('Sieve Analysis - OAG'!$D$8=\"\",\"\",'Sieve Analysis - OAG'!$D$8)","v":"Tex-470-A"},{"$f":"IF('Sieve Analysis - OAG'!$K$9=\"\",\"\",'Sieve Analysis - OAG'!$K$9)","v":"Combined Cumulative % Retained"},{"$f":"IF('Sieve Analysis - OAG'!$B$9=\"\",\"\",'Sieve Analysis - OAG'!$B$9)","v":"Sieve Size"},{"$f":"IF('Sieve Analysis - OAG'!$B$19=\"\",\"\",'Sieve Analysis - OAG'!$B$19)","v":"No. 16"}]
[190,{"$f":"IF('Sieve Analysis - OAG'!K20=\"\",\"\",'Sieve Analysis - OAG'!K20)","v":100},{"$f":"IF('Sieve Analysis - OAG'!$B$8=\"\",\"\",'Sieve Analysis - OAG'!$B$8)","v":"Sieve Analysis - OAG"},{"$f":"IF('Sieve Analysis - OAG'!$D$8=\"\",\"\",'Sieve Analysis - OAG'!$D$8)","v":"Tex-470-A"},{"$f":"IF('Sieve Analysis - OAG'!$K$9=\"\",\"\",'Sieve Analysis - OAG'!$K$9)","v":"Combined Cumulative % Retained"},{"$f":"IF('Sieve Analysis - OAG'!$B$9=\"\",\"\",'Sieve Analysis - OAG'!$B$9)","v":"Sieve Size"},{"$f":"IF('Sieve Analysis - OAG'!$B$20=\"\",\"\",'Sieve Analysis - OAG'!$B$20)","v":"No. 30"}]
[191,{"$f":"IF('Sieve Analysis - OAG'!K21=\"\",\"\",'Sieve Analysis - OAG'!K21)","v":100},{"$f":"IF('Sieve Analysis - OAG'!$B$8=\"\",\"\",'Sieve Analysis - OAG'!$B$8)","v":"Sieve Analysis - OAG"},{"$f":"IF('Sieve Analysis - OAG'!$D$8=\"\",\"\",'Sieve Analysis - OAG'!$D$8)","v":"Tex-470-A"},{"$f":"IF('Sieve Analysis - OAG'!$K$9=\"\",\"\",'Sieve Analysis - OAG'!$K$9)","v":"Combined Cumulative % Retained"},{"$f":"IF('Sieve Analysis - OAG'!$B$9=\"\",\"\",'Sieve Analysis - OAG'!$B$9)","v":"Sieve Size"},{"$f":"IF('Sieve Analysis - OAG'!$B$21=\"\",\"\",'Sieve Analysis - OAG'!$B$21)","v":"No. 50"}]
[192,{"$f":"IF('Sieve Analysis - OAG'!K22=\"\",\"\",'Sieve Analysis - OAG'!K22)","v":100},{"$f":"IF('Sieve Analysis - OAG'!$B$8=\"\",\"\",'Sieve Analysis - OAG'!$B$8)","v":"Sieve Analysis - OAG"},{"$f":"IF('Sieve Analysis - OAG'!$D$8=\"\",\"\",'Sieve Analysis - OAG'!$D$8)","v":"Tex-470-A"},{"$f":"IF('Sieve Analysis - OAG'!$K$9=\"\",\"\",'Sieve Analysis - OAG'!$K$9)","v":"Combined Cumulative % Retained"},{"$f":"IF('Sieve Analysis - OAG'!$B$9=\"\",\"\",'Sieve Analysis - OAG'!$B$9)","v":"Sieve Size"},{"$f":"IF('Sieve Analysis - OAG'!$B$22=\"\",\"\",'Sieve Analysis - OAG'!$B$22)","v":"No. 100"}]
[193,{"$f":"IF('Sieve Analysis - OAG'!K23=\"\",\"\",'Sieve Analysis - OAG'!K23)","v":100},{"$f":"IF('Sieve Analysis - OAG'!$B$8=\"\",\"\",'Sieve Analysis - OAG'!$B$8)","v":"Sieve Analysis - OAG"},{"$f":"IF('Sieve Analysis - OAG'!$D$8=\"\",\"\",'Sieve Analysis - OAG'!$D$8)","v":"Tex-470-A"},{"$f":"IF('Sieve Analysis - OAG'!$K$9=\"\",\"\",'Sieve Analysis - OAG'!$K$9)","v":"Combined Cumulative % Retained"},{"$f":"IF('Sieve Analysis - OAG'!$B$9=\"\",\"\",'Sieve Analysis - OAG'!$B$9)","v":"Sieve Size"},{"$f":"IF('Sieve Analysis - OAG'!$B$23=\"\",\"\",'Sieve Analysis - OAG'!$B$23)","v":"No. 200"}]
[194,{"$f":"IF('Sieve Analysis - OAG'!K24=\"\",\"\",'Sieve Analysis - OAG'!K24)","v":100},{"$f":"IF('Sieve Analysis - OAG'!$B$8=\"\",\"\",'Sieve Analysis - OAG'!$B$8)","v":"Sieve Analysis - OAG"},{"$f":"IF('Sieve Analysis - OAG'!$D$8=\"\",\"\",'Sieve Analysis - OAG'!$D$8)","v":"Tex-470-A"},{"$f":"IF('Sieve Analysis - OAG'!$K$9=\"\",\"\",'Sieve Analysis - OAG'!$K$9)","v":"Combined Cumulative % Retained"},{"$f":"IF('Sieve Analysis - OAG'!$B$9=\"\",\"\",'Sieve Analysis - OAG'!$B$9)","v":"Sieve Size"},{"$f":"IF('Sieve Analysis - OAG'!$B$24=\"\",\"\",'Sieve Analysis - OAG'!$B$24)","v":"Pan"}]
[195,{"$f":"IF('Sieve Analysis - OAG'!L10=\"\",\"\",'Sieve Analysis - OAG'!L10)","v":100},{"$f":"IF('Sieve Analysis - OAG'!$B$8=\"\",\"\",'Sieve Analysis - OAG'!$B$8)","v":"Sieve Analysis - OAG"},{"$f":"IF('Sieve Analysis - OAG'!$D$8=\"\",\"\",'Sieve Analysis - OAG'!$D$8)","v":"Tex-470-A"},{"$f":"IF('Sieve Analysis - OAG'!$L$9=\"\",\"\",'Sieve Analysis - OAG'!$L$9)","v":"Combined % Retained"},{"$f":"IF('Sieve Analysis - OAG'!$B$9=\"\",\"\",'Sieve Analysis - OAG'!$B$9)","v":"Sieve Size"},{"$f":"IF('Sieve Analysis - OAG'!$B$10=\"\",\"\",'Sieve Analysis - OAG'!$B$10)","v":"2 1/2 in"}]
[196,{"$f":"IF('Sieve Analysis - OAG'!L11=\"\",\"\",'Sieve Analysis - OAG'!L11)","v":0},{"$f":"IF('Sieve Analysis - OAG'!$B$8=\"\",\"\",'Sieve Analysis - OAG'!$B$8)","v":"Sieve Analysis - OAG"},{"$f":"IF('Sieve Analysis - OAG'!$D$8=\"\",\"\",'Sieve Analysis - OAG'!$D$8)","v":"Tex-470-A"},{"$f":"IF('Sieve Analysis - OAG'!$L$9=\"\",\"\",'Sieve Analysis - OAG'!$L$9)","v":"Combined % Retained"},{"$f":"IF('Sieve Analysis - OAG'!$B$9=\"\",\"\",'Sieve Analysis - OAG'!$B$9)","v":"Sieve Size"},{"$f":"IF('Sieve Analysis - OAG'!$B$11=\"\",\"\",'Sieve Analysis - OAG'!$B$11)","v":"2 in"}]
[197,{"$f":"IF('Sieve Analysis - OAG'!L12=\"\",\"\",'Sieve Analysis - OAG'!L12)","v":0},{"$f":"IF('Sieve Analysis - OAG'!$B$8=\"\",\"\",'Sieve Analysis - OAG'!$B$8)","v":"Sieve Analysis - OAG"},{"$f":"IF('Sieve Analysis - OAG'!$D$8=\"\",\"\",'Sieve Analysis - OAG'!$D$8)","v":"Tex-470-A"},{"$f":"IF('Sieve Analysis - OAG'!$L$9=\"\",\"\",'Sieve Analysis - OAG'!$L$9)","v":"Combined % Retained"},{"$f":"IF('Sieve Analysis - OAG'!$B$9=\"\",\"\",'Sieve Analysis - OAG'!$B$9)","v":"Sieve Size"},{"$f":"IF('Sieve Analysis - OAG'!$B$12=\"\",\"\",'Sieve Analysis - OAG'!$B$12)","v":"1 1/2 in"}]
[198,{"$f":"IF('Sieve Analysis - OAG'!L13=\"\",\"\",'Sieve Analysis - OAG'!L13)","v":0},{"$f":"IF('Sieve Analysis - OAG'!$B$8=\"\",\"\",'Sieve Analysis - OAG'!$B$8)","v":"Sieve Analysis - OAG"},{"$f":"IF('Sieve Analysis - OAG'!$D$8=\"\",\"\",'Sieve Analysis - OAG'!$D$8)","v":"Tex-470-A"},{"$f":"IF('Sieve Analysis - OAG'!$L$9=\"\",\"\",'Sieve Analysis - OAG'!$L$9)","v":"Combined % Retained"},{"$f":"IF('Sieve Analysis - OAG'!$B$9=\"\",\"\",'Sieve Analysis - OAG'!$B$9)","v":"Sieve Size"},{"$f":"IF('Sieve Analysis - OAG'!$B$13=\"\",\"\",'Sieve Analysis - OAG'!$B$13)","v":"1 in"}]
[199,{"$f":"IF('Sieve Analysis - OAG'!L14=\"\",\"\",'Sieve Analysis - OAG'!L14)","v":0},{"$f":"IF('Sieve Analysis - OAG'!$B$8=\"\",\"\",'Sieve Analysis - OAG'!$B$8)","v":"Sieve Analysis - OAG"},{"$f":"IF('Sieve Analysis - OAG'!$D$8=\"\",\"\",'Sieve Analysis - OAG'!$D$8)","v":"Tex-470-A"},{"$f":"IF('Sieve Analysis - OAG'!$L$9=\"\",\"\",'Sieve Analysis - OAG'!$L$9)","v":"Combined % Retained"},{"$f":"IF('Sieve Analysis - OAG'!$B$9=\"\",\"\",'Sieve Analysis - OAG'!$B$9)","v":"Sieve Size"},{"$f":"IF('Sieve Analysis - OAG'!$B$14=\"\",\"\",'Sieve Analysis - OAG'!$B$14)","v":"3/4 in"}]
[200,{"$f":"IF('Sieve Analysis - OAG'!L15=\"\",\"\",'Sieve Analysis - OAG'!L15)","v":0},{"$f":"IF('Sieve Analysis - OAG'!$B$8=\"\",\"\",'Sieve Analysis - OAG'!$B$8)","v":"Sieve Analysis - OAG"},{"$f":"IF('Sieve Analysis - OAG'!$D$8=\"\",\"\",'Sieve Analysis - OAG'!$D$8)","v":"Tex-470-A"},{"$f":"IF('Sieve Analysis - OAG'!$L$9=\"\",\"\",'Sieve Analysis - OAG'!$L$9)","v":"Combined % Retained"},{"$f":"IF('Sieve Analysis - OAG'!$B$9=\"\",\"\",'Sieve Analysis - OAG'!$B$9)","v":"Sieve Size"},{"$f":"IF('Sieve Analysis - OAG'!$B$15=\"\",\"\",'Sieve Analysis - OAG'!$B$15)","v":"1/2 in"}]
[201,{"$f":"IF('Sieve Analysis - OAG'!L16=\"\",\"\",'Sieve Analysis - OAG'!L16)","v":0},{"$f":"IF('Sieve Analysis - OAG'!$B$8=\"\",\"\",'Sieve Analysis - OAG'!$B$8)","v":"Sieve Analysis - OAG"},{"$f":"IF('Sieve Analysis - OAG'!$D$8=\"\",\"\",'Sieve Analysis - OAG'!$D$8)","v":"Tex-470-A"},{"$f":"IF('Sieve Analysis - OAG'!$L$9=\"\",\"\",'Sieve Analysis - OAG'!$L$9)","v":"Combined % Retained"},{"$f":"IF('Sieve Analysis - OAG'!$B$9=\"\",\"\",'Sieve Analysis - OAG'!$B$9)","v":"Sieve Size"},{"$f":"IF('Sieve Analysis - OAG'!$B$16=\"\",\"\",'Sieve Analysis - OAG'!$B$16)","v":"3/8 in"}]
[202,{"$f":"IF('Sieve Analysis - OAG'!L17=\"\",\"\",'Sieve Analysis - OAG'!L17)","v":0},{"$f":"IF('Sieve Analysis - OAG'!$B$8=\"\",\"\",'Sieve Analysis - OAG'!$B$8)","v":"Sieve Analysis - OAG"},{"$f":"IF('Sieve Analysis - OAG'!$D$8=\"\",\"\",'Sieve Analysis - OAG'!$D$8)","v":"Tex-470-A"},{"$f":"IF('Sieve Analysis - OAG'!$L$9=\"\",\"\",'Sieve Analysis - OAG'!$L$9)","v":"Combined % Retained"},{"$f":"IF('Sieve Analysis - OAG'!$B$9=\"\",\"\",'Sieve Analysis - OAG'!$B$9)","v":"Sieve Size"},{"$f":"IF('Sieve Analysis - OAG'!$B$17=\"\",\"\",'Sieve Analysis - OAG'!$B$17)","v":"No. 4"}]
[203,{"$f":"IF('Sieve Analysis - OAG'!L18=\"\",\"\",'Sieve Analysis - OAG'!L18)","v":0},{"$f":"IF('Sieve Analysis - OAG'!$B$8=\"\",\"\",'Sieve Analysis - OAG'!$B$8)","v":"Sieve Analysis - OAG"},{"$f":"IF('Sieve Analysis - OAG'!$D$8=\"\",\"\",'Sieve Analysis - OAG'!$D$8)","v":"Tex-470-A"},{"$f":"IF('Sieve Analysis - OAG'!$L$9=\"\",\"\",'Sieve Analysis - OAG'!$L$9)","v":"Combined % Retained"},{"$f":"IF('Sieve Analysis - OAG'!$B$9=\"\",\"\",'Sieve Analysis - OAG'!$B$9)","v":"Sieve Size"},{"$f":"IF('Sieve Analysis - OAG'!$B$18=\"\",\"\",'Sieve Analysis - OAG'!$B$18)","v":"No. 8"}]
[204,{"$f":"IF('Sieve Analysis - OAG'!L19=\"\",\"\",'Sieve Analysis - OAG'!L19)","v":0},{"$f":"IF('Sieve Analysis - OAG'!$B$8=\"\",\"\",'Sieve Analysis - OAG'!$B$8)","v":"Sieve Analysis - OAG"},{"$f":"IF('Sieve Analysis - OAG'!$D$8=\"\",\"\",'Sieve Analysis - OAG'!$D$8)","v":"Tex-470-A"},{"$f":"IF('Sieve Analysis - OAG'!$L$9=\"\",\"\",'Sieve Analysis - OAG'!$L$9)","v":"Combined % Retained"},{"$f":"IF('Sieve Analysis - OAG'!$B$9=\"\",\"\",'Sieve Analysis - OAG'!$B$9)","v":"Sieve Size"},{"$f":"IF('Sieve Analysis - OAG'!$B$19=\"\",\"\",'Sieve Analysis - OAG'!$B$19)","v":"No. 16"}]
[205,{"$f":"IF('Sieve Analysis - OAG'!L20=\"\",\"\",'Sieve Analysis - OAG'!L20)","v":0},{"$f":"IF('Sieve Analysis - OAG'!$B$8=\"\",\"\",'Sieve Analysis - OAG'!$B$8)","v":"Sieve Analysis - OAG"},{"$f":"IF('Sieve Analysis - OAG'!$D$8=\"\",\"\",'Sieve Analysis - OAG'!$D$8)","v":"Tex-470-A"},{"$f":"IF('Sieve Analysis - OAG'!$L$9=\"\",\"\",'Sieve Analysis - OAG'!$L$9)","v":"Combined % Retained"},{"$f":"IF('Sieve Analysis - OAG'!$B$9=\"\",\"\",'Sieve Analysis - OAG'!$B$9)","v":"Sieve Size"},{"$f":"IF('Sieve Analysis - OAG'!$B$20=\"\",\"\",'Sieve Analysis - OAG'!$B$20)","v":"No. 30"}]
[206,{"$f":"IF('Sieve Analysis - OAG'!L21=\"\",\"\",'Sieve Analysis - OAG'!L21)","v":0},{"$f":"IF('Sieve Analysis - OAG'!$B$8=\"\",\"\",'Sieve Analysis - OAG'!$B$8)","v":"Sieve Analysis - OAG"},{"$f":"IF('Sieve Analysis - OAG'!$D$8=\"\",\"\",'Sieve Analysis - OAG'!$D$8)","v":"Tex-470-A"},{"$f":"IF('Sieve Analysis - OAG'!$L$9=\"\",\"\",'Sieve Analysis - OAG'!$L$9)","v":"Combined % Retained"},{"$f":"IF('Sieve Analysis - OAG'!$B$9=\"\",\"\",'Sieve Analysis - OAG'!$B$9)","v":"Sieve Size"},{"$f":"IF('Sieve Analysis - OAG'!$B$21=\"\",\"\",'Sieve Analysis - OAG'!$B$21)","v":"No. 50"}]
[207,{"$f":"IF('Sieve Analysis - OAG'!L22=\"\",\"\",'Sieve Analysis - OAG'!L22)","v":0},{"$f":"IF('Sieve Analysis - OAG'!$B$8=\"\",\"\",'Sieve Analysis - OAG'!$B$8)","v":"Sieve Analysis - OAG"},{"$f":"IF('Sieve Analysis - OAG'!$D$8=\"\",\"\",'Sieve Analysis - OAG'!$D$8)","v":"Tex-470-A"},{"$f":"IF('Sieve Analysis - OAG'!$L$9=\"\",\"\",'Sieve Analysis - OAG'!$L$9)","v":"Combined % Retained"},{"$f":"IF('Sieve Analysis - OAG'!$B$9=\"\",\"\",'Sieve Analysis - OAG'!$B$9)","v":"Sieve Size"},{"$f":"IF('Sieve Analysis - OAG'!$B$22=\"\",\"\",'Sieve Analysis - OAG'!$B$22)","v":"No. 100"}]
[208,{"$f":"IF('Sieve Analysis - OAG'!L23=\"\",\"\",'Sieve Analysis - OAG'!L23)","v":0},{"$f":"IF('Sieve Analysis - OAG'!$B$8=\"\",\"\",'Sieve Analysis - OAG'!$B$8)","v":"Sieve Analysis - OAG"},{"$f":"IF('Sieve Analysis - OAG'!$D$8=\"\",\"\",'Sieve Analysis - OAG'!$D$8)","v":"Tex-470-A"},{"$f":"IF('Sieve Analysis - OAG'!$L$9=\"\",\"\",'Sieve Analysis - OAG'!$L$9)","v":"Combined % Retained"},{"$f":"IF('Sieve Analysis - OAG'!$B$9=\"\",\"\",'Sieve Analysis - OAG'!$B$9)","v":"Sieve Size"},{"$f":"IF('Sieve Analysis - OAG'!$B$23=\"\",\"\",'Sieve Analysis - OAG'!$B$23)","v":"No. 200"}]
[209,{"$f":"IF('Sieve Analysis - OAG'!L24=\"\",\"\",'Sieve Analysis - OAG'!L24)","v":0},{"$f":"IF('Sieve Analysis - OAG'!$B$8=\"\",\"\",'Sieve Analysis - OAG'!$B$8)","v":"Sieve Analysis - OAG"},{"$f":"IF('Sieve Analysis - OAG'!$D$8=\"\",\"\",'Sieve Analysis - OAG'!$D$8)","v":"Tex-470-A"},{"$f":"IF('Sieve Analysis - OAG'!$L$9=\"\",\"\",'Sieve Analysis - OAG'!$L$9)","v":"Combined % Retained"},{"$f":"IF('Sieve Analysis - OAG'!$B$9=\"\",\"\",'Sieve Analysis - OAG'!$B$9)","v":"Sieve Size"},{"$f":"IF('Sieve Analysis - OAG'!$B$24=\"\",\"\",'Sieve Analysis - OAG'!$B$24)","v":"Pan"}]
[210,{"$f":"IF('Sieve Analysis'!$C$47=\"\",\"\",'Sieve Analysis'!$C$47)","v":""},{"$f":"IF('Sieve Analysis'!$K$5=\"\",\"\",'Sieve Analysis'!$K$5)","v":"Sieve Analysis"},{"$f":"IF(\"Sampled By \"=\"\",\"\",\"Sampled By \")","v":"Sampled By "},{"$f":"IF('Sieve Analysis'!$B$47=\"\",\"\",'Sieve Analysis'!$B$47)","v":"TX400"}]
[211,{"$f":"IF('Sieve Analysis'!$F$47=\"\",\"\",'Sieve Analysis'!$F$47)","v":""},{"$f":"IF('Sieve Analysis'!$K$5=\"\",\"\",'Sieve Analysis'!$K$5)","v":"Sieve Analysis"},{"$f":"IF(\"Sampled Date \"=\"\",\"\",\"Sampled Date \")","v":"Sampled Date "},{"$f":"IF('Sieve Analysis'!$B$47=\"\",\"\",'Sieve Analysis'!$B$47)","v":"TX400"}]

{"sheet":"Revisions","index":3,"n_rows":15,"n_cols":3,"rows_kept":15,"cut":false,"hidden":true,"merged":[]}
["Date","Changes","By"]
["2005-05-10","Cell B25 to B32 formula change from  =IF(ISERROR(INDEX(INDIRECT(\"grade\"&Grade),1,IF(SpecYear=\"\",\"\",IF(SpecYear=\"1993\",3,4)))),\"\",IF(INDEX(INDIRECT(\"grade\"&Grade),1,IF(SpecYear=\"\",6,IF(SpecYear=\"1995\",4,3)))=0,\"\",INDEX(INDIRECT(\"grade\"&Grade),1,IF(SpecYear=\"\",\"\",IF(SpecYear=\"1993\",3,4)))))  to =IF(ISERROR(INDEX(INDIRECT(\"grade\"&Grade),1,IF(SpecYear=\"\",\"\",IF(SpecYear=\"1995\",4,3)))),\"\",IF(INDEX(INDIRECT(\"grade\"&Grade),1,IF(SpecYear=\"\",6,IF(SpecYear=\"1995\",4,3)))=0,\"\",INDEX(INDIRECT(\"grade\"&Grade),1,IF(SpecYear=\"\",\"\",IF(SpecYear=\"1995\",4,3)))))","Joe Liu"]
[]
[]
["2007-08-30","Cell G25 Table Column Title                                                                                                                                           =\"Lower \"&IF(Grade<>\"fbf\",\"Retained\",\"Passing\")&\" Spec Limit, %\"                                                                                               TO                                                                                                                                                                                =\"Lower \"&IF(SpecYear=\"2004\",\"Passing\" &\" Spec Limit, %\",IF(Grade<>\"fbf\",\"Retained\",\"Passing\")&\" Spec Limit, %\")","Jaime Gandara"]
[]
["2007-08-30","CELL H25 Table Colum Title                                                                                                                                          =\"Upper \" & IF(Grade<>\"fbf\",\"Retained\", \"Passing\") & \" Spec Limit, %\"                                                                                               TO                                                                                                                                                                                =\"Upper \"&IF(SpecYear=\"2004\",\"Passing\" &\" Spec Limit, %\",IF(Grade<>\"fbf\",\"Retained\",\"Passing\")&\" Spec Limit, %\")"]
[]
["2007-08-30","CELL G26 to G30 formula change =IF(SpecYear=\"\",\"\",IF(ISERROR(INDEX(INDIRECT(\"grade\"&Grade),1,5)),\"\",INDEX(INDIRECT(\"grade\"&Grade),1,5)))                                                                                               TO                                                                                                  =IF(SpecYear=\"2004\",IF(ISERROR(INDEX(INDIRECT(\"grade\"&Grade),1,7)),\"\",INDEX(INDIRECT(\"grade\"&Grade),1,7)),IF(ISERROR(INDEX(INDIRECT(\"grade\"&Grade),1,5)),\"\",INDEX(INDIRECT(\"grade\"&Grade),1,5)))"]
[]
["8/30/207","CELL H26 to H30 formula change =IF(SpecYear=\"\",\"\",IF(ISERROR(INDEX(INDIRECT(\"grade\"&Grade),1,6)),\"\",INDEX(INDIRECT(\"grade\"&Grade),1,6)))                                                                                               TO                                                                                                  =IF(SpecYear=\"2004\",IF(ISERROR(INDEX(INDIRECT(\"grade\"&Grade),1,7)),\"\",INDEX(INDIRECT(\"grade\"&Grade),1,7)),IF(ISERROR(INDEX(INDIRECT(\"grade\"&Grade),1,6)),\"\",INDEX(INDIRECT(\"grade\"&Grade),1,6)))"]
[]
["8/30/207","CELL I26 to I30 formula change =IF(E26=\"\",\"\",IF(Grade=\"FBF\",IF(AND($F26>=$G26,$F26<=$H26),\"Yes\",\"No\"),IF(AND($E26<=$H26,$E26>=$G26),\"Yes\",\"No\")))                                                                                           TO                                                        =IF(F26=\"\",\"\",IF(SpecYear=\"2004\",IF(AND($F26>=$G26,$F26<=$H26),\"Yes\",\"No\"),IF(Grade=\"FBF\",IF(AND($F26>=$G26,$F26<=$H26),\"Yes\",\"No\"),IF(AND($E26<=$H26,$E26>=$G26),\"Yes\",\"No\"))))"]
[]
["2016-12-14","Added \"OAG\" to Grade selection, added conditional formatting to refer to \"Sieve Analysis - OAG\" when \"OAG\" selected"]

{"sheet":"Gradations","index":6,"n_rows":108,"n_cols":14,"rows_kept":108,"cut":false,"hidden":true,"merged":[[1,0,5,0],[26,0,30,0],[21,0,25,0],[16,0,20,0],[54,0,61,0],[46,0,53,0],[38,0,45,0],[34,0,37,0],[31,0,33,0],[11,0,15,0],[6,0,10,0],[62,0,69,0],[84,0,89,0],[90,0,96,0],[74,0,77,0],[78,0,83,0],[98,6,99,6],[98,7,99,7],[98,2,99,2],[70,0,71,0],[72,0,73,0],[98,3,99,3],[98,4,99,4],[98,0,99,0],[98,1,99,1]]}
["Grade","Size mm","1993 & 2004 Sieve Size","1995 Sieve Size","Min","Max","Passing Min","Passing Max",null,"English","Metric","Selection","size"]
["GRADE 1",63,"2-1/2\"","63.0 mm",0,0,{"$f":"100-E2","v":100},{"$f":"100-F2","v":100},null,"5\"","125 mm",{"$f":"IF(SpecYear=\"\",\"\",IF(SpecYear=\"1995\",K2,J2))","v":""},125]
[null,50,"2\"","50.0 mm",0,20,{"$f":"100-E3","v":100},{"$f":"100-F3","v":80},null,"4.24\"","106 mm","",106]
[null,37.5,"1-1/2\"","37.5 mm",15,50,85,50,null,"4\"","100 mm","",100]
[null,19,"3/4\"","19.0 mm",60,80,40,20,null,"3.5\"","90 mm","",90]
[null,4.75,"No.4","4.75 mm",{"$f":"IF(OR(SpecYear=\"2014\",SpecYear=\"2024\"),90,95)","v":95},100,5,0,"<<<","3\"","75 mm","",75,"<<< changes min to 90 if 2014 otherwise 95"]
["GRADE 2",50,"2\"","50.0 mm",0,0,100,100,null,"2.5\"","63 mm","",63]
[null,37.5,"1-1/2\"","37.5 mm",0,5,100,95,null,"2.12\"","53 mm","",53]
[null,19,"3/4\"","19.0 mm",30,65,70,35,null,"2\"","50 mm",{"$f":"IF(SpecYear=\"\",\"\",IF(SpecYear=\"1995\",K9,J9))","v":""},50]
[null,9.5,"3/8\"","9.5 mm",70,90,30,10,null,"1-3/4\"","45 mm","",45]
[null,4.75,"No.4","4.75 mm",{"$f":"IF(OR(SpecYear=\"2014\",SpecYear=\"2024\"),90,95)","v":95},100,5,0,"<<<","1-1/2\"","37.5 mm","",37.5,"<<< changes min to 90 if 2014 otherwise 95"]
["GRADE 3",50,"2\"","50.0 mm",0,0,100,100,null,"1-1/4\"","31.5 mm","",31.5]
[null,37.5,"1-1/2\"","37.5 mm",0,5,100,95,null,"1\"","25 mm","",25]
[null,19,"3/4\"","19.0 mm",10,40,90,60,null,"7/8\"","22.4 mm","",22.4]
[null,12.5,"1/2\"","12.5 mm",40,75,60,25,null,"3/4\"","19 mm","",19]
[null,4.75,"No.4","4.75 mm",{"$f":"IF(OR(SpecYear=\"2014\",SpecYear=\"2024\"),90,95)","v":95},100,5,0,"<<<","5/8\"","16 mm","",16,"<<< changes min to 90 if 2014 otherwise 95"]
["GRADE 4",37.5,"1-1/2\"","37.5 mm",0,0,100,100,null,"1/2\"","12.5 mm","",12.5]
[null,25,"1\"","25.0 mm",0,5,100,95,null,"7/16\"","11.2 mm","",11.2]
[null,12.5,"1/2\"","12.5 mm",40,75,60,25,null,"3/8\"","9.5 mm","",9.5]
[null,4.75,"No.4","4.75 mm",90,100,10,0,null,"5/16\"","8 mm","",8]
[null,2.36,"No.8","2.36 mm",95,100,5,0,null,"1/4\"","6.3 mm","",6.3]
["GRADE 5",25,"1\"","25.0 mm",0,0,100,100,null,"No. 4","4.75 mm","",4.75]
[null,19,"3/4\"","19.0 mm",0,10,100,90,null,"No. 6","3.35 mm","",3.35]
[null,9.5,"3/8\"","9.5 mm",45,80,55,20,null,"No. 8","2.36 mm","",2.36]
[null,4.75,"No.4","4.75 mm",90,100,10,0,null,"No. 10","2 mm","",2]
[null,2.36,"No.8","2.36 mm",95,100,5,0,null,"No. 14","1.4 mm","",1.4]
["GRADE 6",19,"3/4\"","19.0 mm",0,0,100,100,null,"No. 16","1.18 mm","",1.18]
[null,12.5,"1/2\"","12.5 mm",0,10,100,90,null,"No. 20","850 µm","",0.85]
[null,9.5,"3/8\"","9.5 mm",30,60,70,40,null,"No. 30","600 µm","",0.6]
[null,4.75,"No.4","4.75 mm",85,100,15,0,null,"No. 40","425 µm","",0.42499999999999999]
[null,2.36,"No.8","2.36 mm",95,100,5,0,null,"No. 50","300 µm","",0.3]
["GRADE 7",12.5,"1/2\"","12.5 mm",0,0,100,100,null,"No. 80","180 µm","",0.18]
[null,9.5,"3/8\"","9.5 mm",5,30,95,70,null,"No. 100","150 µm","",0.15]
[null,4.75,"No.4","4.75 mm",75,100,25,0,null,"No. 200","75 µm","",7.4999999999999997E-2]
["GRADE 8",12.5,"1/2\"","12.5 mm",0,0,100,100]
[null,9.5,"3/8\"","9.5 mm",0,5,100,95]
[null,4.75,"No.4","4.75 mm",35,80,65,20]
[null,2.36,"No.8","2.36 mm",90,100,10,0]
["Grade FA",9.5,"3/8\"","9.5 mm",0,0,100,100]
[null,4.75,"No.4","4.75 mm",0,5,100,95]
[null,2.36,"No.8","2.36 mm",0,20,100,80]
[null,1.18,"No.16","1.18 mm",15,50,85,50]
[null,0.6,"No.30","600 µm",35,75,65,25]
[null,0.3,"No.50","300 µm",65,{"$f":"IF(Sand_Eq=\"Yes\",94,90)","v":90},35,{"$f":"100-F44","v":10},"<< moves to 94 if Sand Equivalence"]
[null,0.15,"No.100","150 µm",90,100,10,0]
[null,7.4999999999999997E-2,"No.200","75 µm",97,100,3,0]
["Grade FA Manufactured",9.5,"3/8\"","9.5 mm",0,0,100,100]
[null,4.75,"No.4","4.75 mm",0,5,100,95]
[null,2.36,"No.8","2.36 mm",0,20,100,80]
[null,1.18,"No.16","1.18 mm",15,50,85,50]
[null,0.6,"No.30","600 µm",35,75,65,25]
[null,0.3,"No.50","300 µm",65,{"$f":"IF(Sand_Eq=\"Yes\",94,90)","v":90},35,10,"<< moves to 94 if Sand Equivalence"]
[null,0.15,"No.100","150 µm",90,100,10,0]
[null,7.4999999999999997E-2,"No.200","75 µm",94,100,6,0]
["Grade FA-Shown On Plans",9.5,"3/8\"","9.5 mm",null,null,{"$f":"IF(F55=\"\",\"\",F55)","v":""},{"$f":"IF(E55=\"\",\"\",E55)","v":""}]
[null,4.75,"No.4","4.75 mm",null,null,"",""]
[null,2.36,"No.8","2.36 mm",null,null,"",""]
[null,1.18,"No.16","1.18 mm",null,null,"",""]
[null,0.6,"No.30","600 µm",null,null,"",""]
[null,0.3,"No.50","300 µm",null,null,"",""]
[null,0.15,"No.100","150 µm",null,null,"",""]
[null,7.4999999999999997E-2,"No.200","75 µm",null,null,"",""]
["Grade Other",null,null,null,null,null,"",""]
[null,null,null,null,null,null,"",""]
[null,null,null,null,null,null,"",""]
[null,null,null,null,null,null,"",""]
[null,null,null,null,null,null,"",""]
[null,null,null,null,null,null,"",""]
[null,null,null,null,null,null,"",""]
[null,null,null,null,null,null,"",""]
["Grade MF",0.6,"No.30","600 µm",0,0,{"$f":"100-E71","v":100},{"$f":"100-F71","v":100}]
[null,7.4999999999999997E-2,"No.200","75 µm",0,35,{"$f":"100-E72","v":100},{"$f":"100-F72","v":65}]
["Grade_FBF",19,"3/4\"","19 mm",100,100,100,100,"< passing not retained"]
[null,7.4999999999999997E-2,"No.200","75 µm",0,30,30,0]
["Grade A",9.5,"3/8\"","9.5 mm",0,0,100,100]
[null,4.75,"No.4","4.75 mm",0,10,100,90]
[null,0.85,"No.20","850 µm",35,65,65,35]
[null,0.3,"No.50","300 µm",75,100,25,0]
["Grade B",37.5,"1-1/2\"","37.5 mm",0,0,100,100]
[null,19,"3/4\"","19.0 mm",0,10,100,90]
[null,9.5,"3/8\"","9.5 mm",15,35,85,65]
[null,4.75,"No.4","4.75 mm",35,55,65,45]
[null,0.85,"No.20","850 µm",35,65,65,35]
[null,0.3,"No.50","300 µm",75,100,25,0]
["Grade C",50,"2\"","50.0 mm",0,0,100,100]
[null,37.5,"1-1/2\"","37.5 mm",0,10,100,90]
[null,19,"3/4\"","19.0 mm",20,40,80,60]
[null,4.75,"No.4","4.75 mm",40,60,60,40]
[null,0.85,"No.20","850 µm",35,65,65,35]
[null,0.3,"No.50","300 µm",75,100,25,0]
["Grade D",9.5,"3/8\"","9.5 mm",0,0,100,100]
[null,4.75,"No.4","4.75 mm",0,5,100,95]
[null,2.36,"No.8","2.36 mm",0,20,100,80]
[null,1.18,"No.16","1.18 mm",15,50,85,50]
[null,0.6,"No.30","600 µm",40,75,60,25]
[null,0.3,"No.50","300 µm",70,90,30,10]
[null,0.15,"No.100","150 µm",90,100,10,0]
[]
["size","Cumulative Percent Retained","Cumulative Percent Passing","Passing Lower Limit","Passing Upper Limit",null,"Retained Lower Limit","Retained Upper Limit"]
["size"]
[{"$f":"IF(ISERROR(INDEX(INDIRECT(\"grade\"&Grade),1,2)),\"\",INDEX(INDIRECT(\"grade\"&Grade),1,2))","v":""},{"$f":"'Sieve Analysis'!E26","v":""},{"$f":"IF(B101=\"\",\"\",100-B101)","v":""},{"$f":"IF(SpecYear=\"2004\",'Sieve Analysis'!G26,100-'Sieve Analysis'!G26)","v":{"$error":"#VALUE!"}},{"$f":"IF(SpecYear=\"2004\",'Sieve Analysis'!H26,100-'Sieve Analysis'!H26)","v":{"$error":"#VALUE!"}},null,{"$f":"IF(SpecYear=\"2004\",100-'Sieve Analysis'!H26,'Sieve Analysis'!H26)","v":""},{"$f":"IF(SpecYear=\"2004\",100-'Sieve Analysis'!G26,'Sieve Analysis'!G26)","v":""}]
[{"$f":"IF(ISERROR(INDEX(INDIRECT(\"grade\"&Grade),2,2)),\"\",INDEX(INDIRECT(\"grade\"&Grade),2,2))","v":""},{"$f":"'Sieve Analysis'!E27","v":""},"",{"$f":"IF(SpecYear=\"2004\",'Sieve Analysis'!G27,100-'Sieve Analysis'!G27)","v":{"$error":"#VALUE!"}},{"$f":"IF(SpecYear=\"2004\",'Sieve Analysis'!H27,100-'Sieve Analysis'!H27)","v":{"$error":"#VALUE!"}},null,{"$f":"IF(SpecYear=\"2004\",100-'Sieve Analysis'!H27,'Sieve Analysis'!H27)","v":""},{"$f":"IF(SpecYear=\"2004\",100-'Sieve Analysis'!G27,'Sieve Analysis'!G27)","v":""}]
[{"$f":"IF(ISERROR(INDEX(INDIRECT(\"grade\"&Grade),3,2)),\"\",INDEX(INDIRECT(\"grade\"&Grade),3,2))","v":""},{"$f":"'Sieve Analysis'!E28","v":""},"",{"$f":"IF(SpecYear=\"2004\",'Sieve Analysis'!G28,100-'Sieve Analysis'!G28)","v":{"$error":"#VALUE!"}},{"$f":"IF(SpecYear=\"2004\",'Sieve Analysis'!H28,100-'Sieve Analysis'!H28)","v":{"$error":"#VALUE!"}},null,{"$f":"IF(SpecYear=\"2004\",100-'Sieve Analysis'!H28,'Sieve Analysis'!H28)","v":""},{"$f":"IF(SpecYear=\"2004\",100-'Sieve Analysis'!G28,'Sieve Analysis'!G28)","v":""}]
[{"$f":"IF(ISERROR(INDEX(INDIRECT(\"grade\"&Grade),4,2)),\"\",INDEX(INDIRECT(\"grade\"&Grade),4,2))","v":""},{"$f":"'Sieve Analysis'!E29","v":""},"",{"$f":"IF(SpecYear=\"2004\",'Sieve Analysis'!G29,100-'Sieve Analysis'!G29)","v":{"$error":"#VALUE!"}},{"$f":"IF(SpecYear=\"2004\",'Sieve Analysis'!H29,100-'Sieve Analysis'!H29)","v":{"$error":"#VALUE!"}},null,{"$f":"IF(SpecYear=\"2004\",100-'Sieve Analysis'!H29,'Sieve Analysis'!H29)","v":""},{"$f":"IF(SpecYear=\"2004\",100-'Sieve Analysis'!G29,'Sieve Analysis'!G29)","v":""}]
[{"$f":"IF(ISERROR(INDEX(INDIRECT(\"grade\"&Grade),5,2)),\"\",INDEX(INDIRECT(\"grade\"&Grade),5,2))","v":""},{"$f":"'Sieve Analysis'!E30","v":""},"",{"$f":"IF(SpecYear=\"2004\",'Sieve Analysis'!G30,100-'Sieve Analysis'!G30)","v":{"$error":"#VALUE!"}},{"$f":"IF(SpecYear=\"2004\",'Sieve Analysis'!H30,100-'Sieve Analysis'!H30)","v":{"$error":"#VALUE!"}},null,{"$f":"IF(SpecYear=\"2004\",100-'Sieve Analysis'!H30,'Sieve Analysis'!H30)","v":""},{"$f":"IF(SpecYear=\"2004\",100-'Sieve Analysis'!G30,'Sieve Analysis'!G30)","v":""}]
[{"$f":"IF(ISERROR(INDEX(INDIRECT(\"grade\"&Grade),6,2)),\"\",INDEX(INDIRECT(\"grade\"&Grade),6,2))","v":""},{"$f":"'Sieve Analysis'!E31","v":""},"",{"$f":"IF(SpecYear=\"2004\",'Sieve Analysis'!G31,100-'Sieve Analysis'!G31)","v":{"$error":"#VALUE!"}},{"$f":"IF(SpecYear=\"2004\",'Sieve Analysis'!H31,100-'Sieve Analysis'!H31)","v":{"$error":"#VALUE!"}},null,{"$f":"IF(SpecYear=\"2004\",100-'Sieve Analysis'!H31,'Sieve Analysis'!H31)","v":""},{"$f":"IF(SpecYear=\"2004\",100-'Sieve Analysis'!G31,'Sieve Analysis'!G31)","v":""}]
[{"$f":"IF(ISERROR(INDEX(INDIRECT(\"grade\"&Grade),7,2)),\"\",INDEX(INDIRECT(\"grade\"&Grade),7,2))","v":""},{"$f":"'Sieve Analysis'!E32","v":""},"",{"$f":"IF(SpecYear=\"2004\",'Sieve Analysis'!G32,100-'Sieve Analysis'!G32)","v":{"$error":"#VALUE!"}},{"$f":"IF(SpecYear=\"2004\",'Sieve Analysis'!H32,100-'Sieve Analysis'!H32)","v":{"$error":"#VALUE!"}},null,{"$f":"IF(SpecYear=\"2004\",100-'Sieve Analysis'!H32,'Sieve Analysis'!H32)","v":""},{"$f":"IF(SpecYear=\"2004\",100-'Sieve Analysis'!G32,'Sieve Analysis'!G32)","v":""}]
[{"$f":"IF(ISERROR(INDEX(INDIRECT(\"grade\"&Grade),8,2)),\"\",INDEX(INDIRECT(\"grade\"&Grade),8,2))","v":""},{"$f":"'Sieve Analysis'!E33","v":""},"",{"$f":"IF(SpecYear=\"2004\",'Sieve Analysis'!G33,100-'Sieve Analysis'!G33)","v":{"$error":"#VALUE!"}},{"$f":"IF(SpecYear=\"2004\",'Sieve Analysis'!H33,100-'Sieve Analysis'!H33)","v":{"$error":"#VALUE!"}},null,{"$f":"IF(SpecYear=\"2004\",100-'Sieve Analysis'!H33,'Sieve Analysis'!H33)","v":""},{"$f":"IF(SpecYear=\"2004\",100-'Sieve Analysis'!G33,'Sieve Analysis'!G33)","v":""}]