{"text_format":"1","workbook":"xlsx","n_sheets":3,"sheets":["Tex-404-A","Reference","RX"],"not_rendered":{"charts":0,"images":1,"macros":1,"external_links":0,"defined_names":114,"comments":1,"pivot_tables":0},"unopened":[],"bounds":{"document_bytes":16777216,"sheet_cells":100000,"rows_first":2000,"rows_last":500,"rows_between":2000,"halvings":0,"cell_chars":16384,"cell_head_chars":4096},"cells_cut":0,"cells_raw":0,"read":"whole","date_system":"1900"}

{"sheet":"Tex-404-A","index":0,"n_rows":64,"n_cols":11,"rows_kept":64,"cut":false,"hidden":false,"merged":[[25,9,27,9],[36,8,38,8],[36,9,39,9],[25,8,27,8],[29,1,31,1],[36,1,39,1],[25,6,27,6],[25,4,27,4],[36,3,38,3],[0,0,0,1],[11,7,11,8],[36,5,38,5],[36,6,38,6],[36,7,38,7],[12,7,12,8],[15,3,15,8],[13,3,13,4],[7,7,7,8],[8,3,8,4],[16,7,16,8],[7,3,7,4],[10,3,10,4],[10,7,10,8],[8,7,8,8],[9,7,9,8],[64,1,64,3],[58,2,58,4],[11,3,11,4],[12,3,12,4],[16,3,16,4],[21,4,21,5],[20,1,20,8],[14,3,14,8],[13,7,13,8],[50,1,50,8],[9,3,9,4],[36,4,38,4],[25,3,27,3],[60,6,60,8],[25,1,28,1],[36,2,38,2],[25,2,27,2],[48,1,49,8],[25,7,27,7],[60,1,60,3],[57,2,57,4],[51,1,51,8],[25,5,27,5],[53,2,53,4],[54,2,54,4],[56,2,56,4]]}
["TxDOT Manuals >",null,null,"Tex-404-A"]
[null,"TEXAS DEPARTMENT OF TRANSPORTATION",null,null,null,null,null,null,null,null,62]
[null,null,null,null,null,null,null,null,null,null,3]
[null,null,null,null,null,null,null,null,null,null,"tx404.xlsm::45505.597743"]
[null,"UNIT WEIGHT OF LIGHTWEIGHT SURFACE TREATMENT AGGREGATES "]
[null,"Tex-404-A"]
[null,null,null,null,null,null,null,null,{"$f":"\"File Version: \" & TEXT(MID(sn,SEARCH(\"::\",sn,1)+2,20),\"mm/dd/yy hh:mm:ss\")","v":"File Version: 08/01/24 14:20:45"}]
[null,null,"SAMPLE ID:",null,null,null,"SAMPLED DATE:"]
[null,null,"TEST NUMBER:",null,null,null,"LETTING DATE:"]
[null,null,"SAMPLE STATUS:",null,null,null,"CONTROLLING CSJ:"]
[null,null,"COUNTY:",null,null,null,"SPEC YEAR:"]
[null,null,"SAMPLED BY:",null,null,null,"SPEC ITEM:"]
[null,null,"SAMPLE LOCATION:",null,null,null,"SPECIAL PROVISION:"]
[null,null,"MATERIAL CODE:",null,null,null,"GRADE:"]
[null,null,"MATERIAL NAME:"]
[null,null,"PRODUCER:"]
[null,null,"AREA ENGINEER:",null,null,null,"PROJECT MANAGER:"]
[]
[null,null,"COURSE\\LIFT:",null,"STATION:",null,null,"DIST. FROM CL:"]
[]
[null,"Determining Unit Weight (Mass) of Aggregates - Tex-404-A"]
[null,null,null,"for"]
[]
[null,"Source Acceptance"]
[]
[null,"Sample ID","Weight of Sample + Tare","Tare Weight","Sample Weight","Volume of Container","Wet Unit Weight of Aggregate","Moisture Content","Dry Unit Weight of Aggregate",{"$f":" \"Within \" & IF(SpecYear=\"\",\"\",\"(\"& IF(SpecYear=\"1995\",Reference!$C$4,Reference!$A$4) &\"-\"& IF(SpecYear=\"1995\",Reference!$D$4,Reference!$B$4)&\") \") & IF(SpecYear=\"\",\"\",IF(SpecYear<>\"1995\",\"(pcf)\",\"(Kg/m³)\"))","v":"Within "}]
[]
[]
[null,null,{"$f":"IF(SpecYear=\"\",\"\",IF(SpecYear<>\"1995\",\"( lbs. )\",\"( Kg )\"))","v":""},{"$f":"IF(SpecYear=\"\",\"\",IF(SpecYear<>\"1995\",\"( lbs. )\",\"( Kg )\"))","v":""},{"$f":"IF(SpecYear=\"\",\"\",IF(SpecYear<>\"1995\",\"( lbs. )\",\"( Kg )\"))","v":""},{"$f":"IF(SpecYear=\"\",\"\",IF(SpecYear<>\"1995\",\"( Cubic ft. )\",\"( Cubic M )\"))","v":""},{"$f":"IF(SpecYear=\"\",\"\",IF(SpecYear<>\"1995\",\"( pcf )\",\"( Kg/m³ )\"))","v":""},"( % )",{"$f":"IF(SpecYear=\"\",\"\",IF(SpecYear<>\"1995\",\"( pcf )\",\"( Kg/m³ )\"))","v":""},"Specs"]
[1,null,null,null,{"$f":"IF(C30=\"\",\"\",+C30-D30)","v":""},null,{"$f":"IF($C30=0,\"\",IF(SpecYear=\"1995\",ROUND(E30/$F30,0),ROUND(E30/$F30,1)))","v":""},null,{"$f":"IF($C30=0,\"\",IF(SpecYear=\"1995\",ROUND(E30/(1+H30) /$F30,0),ROUND(E30/(1+H30)/$F30,1)))","v":""},{"$f":"IF(AGGR<>\"Lightweight Aggregate\",\"\",IF($C30=0,\"\",IF(AND($I30>=IF(SpecYear=\"1995\",Reference!$C$4,Reference!$A$4),$I30<=IF(SpecYear=\"1995\",Reference!$D$4,Reference!$B$4)),\"Yes\",\"No\")))","v":""}]
[2,null,null,null,{"$f":"IF(C31=\"\",\"\",+C31-D31)","v":""},null,{"$f":"IF($C31=0,\"\",IF(SpecYear=\"1995\",ROUND(E31/$F31,0),ROUND(E31/$F31,1)))","v":""},null,{"$f":"IF($C31=0,\"\",IF(SpecYear=\"1995\",ROUND(E31/(1+H31) /$F31,0),ROUND(E31/(1+H31)/$F31,1)))","v":""},{"$f":"IF(AGGR<>\"Lightweight Aggregate\",\"\",IF($C31=0,\"\",IF(AND($I31>=IF(SpecYear=\"1995\",Reference!$C$4,Reference!$A$4),$I31<=IF(SpecYear=\"1995\",Reference!$D$4,Reference!$B$4)),\"Yes\",\"No\")))","v":""}]
[3,null,null,null,{"$f":"IF(C32=\"\",\"\",+C32-D32)","v":""},null,{"$f":"IF($C32=0,\"\",IF(SpecYear=\"1995\",ROUND(E32/$F32,0),ROUND(E32/$F32,1)))","v":""},null,{"$f":"IF($C32=0,\"\",IF(SpecYear=\"1995\",ROUND(E32/(1+H32) /$F32,0),ROUND(E32/(1+H32)/$F32,1)))","v":""},{"$f":"IF(AGGR<>\"Lightweight Aggregate\",\"\",IF($C32=0,\"\",IF(AND($I32>=IF(SpecYear=\"1995\",Reference!$C$4,Reference!$A$4),$I32<=IF(SpecYear=\"1995\",Reference!$D$4,Reference!$B$4)),\"Yes\",\"No\")))","v":""}]
[null,null,null,null,null,null,null,"Average:",{"$f":"IF(AND(I30=\"\",I31=\"\",I32=\"\"),\"\",IF(SpecYear=\"1995\",ROUND(IF(ISERROR(AVERAGE(I30:I32)),0,AVERAGE(I30:I32)),0),ROUND(IF(ISERROR(AVERAGE(I30:I32)),0,AVERAGE(I30:I32)),1)))","v":""},{"$f":"IF(AGGR<>\"Lightweight Aggregate\",\"\",IF($I33=0,\"\",IF(AND($I33>=IF(SpecYear=\"1995\",Reference!$C$4,Reference!$A$4),$I33<=IF(SpecYear=\"1995\",Reference!$D$4,Reference!$B$4)),\"Yes\",\"No\")))","v":""}]
[]
[null,"Project Samples"]
[]
[null,"Shipment ID","Weight of Sample + Tare","Tare Weight","Sample Weight","Volume of Container","Moisture Content","Dry Unit Weight of Aggregate",{"$f":" \"Within \" & IF(SpecYear=\"\",\"\",\"(\"& IF(SpecYear=\"1995\",Reference!$C$4,Reference!$A$4) &\"-\"& IF(SpecYear=\"1995\",Reference!$D$4,Reference!$B$4)&\") \") & IF(SpecYear=\"\",\"\",IF(SpecYear<>\"1995\",\"(pcf)\",\"(Kg/m³)\"))","v":"Within "},"Accept if within 6% of Source"]
[]
[]
[null,null,{"$f":"IF(SpecYear=\"\",\"\",IF(SpecYear<>\"1995\",\"( lbs. )\",\"( Kg )\"))","v":""},{"$f":"IF(SpecYear=\"\",\"\",IF(SpecYear<>\"1995\",\"( lbs. )\",\"( Kg )\"))","v":""},{"$f":"IF(SpecYear=\"\",\"\",IF(SpecYear<>\"1995\",\"( lbs. )\",\"( Kg )\"))","v":""},{"$f":"IF(SpecYear=\"\",\"\",IF(SpecYear<>\"1995\",\"( Cubic ft. )\",\"( Cubic M )\"))","v":""},"( % )",{"$f":"IF(SpecYear=\"\",\"\",IF(SpecYear<>\"1995\",\"( pcf )\",\"( Kg/m³ )\"))","v":""},"Specs"]
[1,null,null,null,{"$f":"IF(C41=\"\",\"\",+C41-D41)","v":""},null,null,{"$f":"IF($C41=0,\"\",IF(SpecYear=\"1995\",ROUND(E41/(1+G41) /$F41,0),ROUND(E41/(1+G41)/$F41,1)))","v":""},{"$f":"IF(AGGR<>\"Lightweight Aggregate\",\"\",IF($E41=\"\",\"\",IF(AND($H41>=IF(SpecYear=\"1995\",Reference!$C$4,Reference!$A$4),$H41<=IF(SpecYear=\"1995\",Reference!$D$4,Reference!$B$4)),\"Yes\",\"No\")))","v":""},{"$f":"IF(AGGR<>\"Lightweight Aggregate\",\"\",IF($E41=\"\",\"\",IF(AND($H41>=ROUND($I$33*0.94,0),$H41<=ROUND($I$33*1.06,0)),\"Accept\",\"Reject\")))","v":""}]
[2,null,null,null,"",null,null,"",{"$f":"IF(AGGR<>\"Lightweight Aggregate\",\"\",IF($E42=\"\",\"\",IF(AND($H42>=IF(SpecYear=\"1995\",Reference!$C$4,Reference!$A$4),$H42<=IF(SpecYear=\"1995\",Reference!$D$4,Reference!$B$4)),\"Yes\",\"No\")))","v":""},""]
[3,null,null,null,"",null,null,"",{"$f":"IF(AGGR<>\"Lightweight Aggregate\",\"\",IF($E43=\"\",\"\",IF(AND($H43>=IF(SpecYear=\"1995\",Reference!$C$4,Reference!$A$4),$H43<=IF(SpecYear=\"1995\",Reference!$D$4,Reference!$B$4)),\"Yes\",\"No\")))","v":""},""]
[4,null,null,null,"",null,null,"",{"$f":"IF(AGGR<>\"Lightweight Aggregate\",\"\",IF($E44=\"\",\"\",IF(AND($H44>=IF(SpecYear=\"1995\",Reference!$C$4,Reference!$A$4),$H44<=IF(SpecYear=\"1995\",Reference!$D$4,Reference!$B$4)),\"Yes\",\"No\")))","v":""},""]
[5,null,null,null,"",null,null,"",{"$f":"IF(AGGR<>\"Lightweight Aggregate\",\"\",IF($E45=\"\",\"\",IF(AND($H45>=IF(SpecYear=\"1995\",Reference!$C$4,Reference!$A$4),$H45<=IF(SpecYear=\"1995\",Reference!$D$4,Reference!$B$4)),\"Yes\",\"No\")))","v":""},""]
[6,null,null,null,"",null,null,"",{"$f":"IF(AGGR<>\"Lightweight Aggregate\",\"\",IF($E46=\"\",\"\",IF(AND($H46>=IF(SpecYear=\"1995\",Reference!$C$4,Reference!$A$4),$H46<=IF(SpecYear=\"1995\",Reference!$D$4,Reference!$B$4)),\"Yes\",\"No\")))","v":""},""]
[7,null,null,null,"",null,null,"",{"$f":"IF(AGGR<>\"Lightweight Aggregate\",\"\",IF($E47=\"\",\"\",IF(AND($H47>=IF(SpecYear=\"1995\",Reference!$C$4,Reference!$A$4),$H47<=IF(SpecYear=\"1995\",Reference!$D$4,Reference!$B$4)),\"Yes\",\"No\")))","v":""},""]
[null,"Remarks:",{"$f":"NOW()","v":"2024-08-01T14:20:45.780"}]
[]
[]
[]
[]
[]
[null,"Sample Method:","Sampled By:",null,null,"Sampled Date:"]
[null,"TX221"]
[]
[null,"TX400"]
[null,"Test Method:","Tested By:",null,null,"Tested Date:"]
[null,"TX404"]
[null,"Test Stamp Code:",null,null,"Omit Test:","Completed Date:","Reviewed By:"]
[]
[null,"Locked By:","TxDOT:","District:","Area:"]
[]
[null,"Authorized By:",null,null,"Authorized Date:"]

{"sheet":"Reference","index":1,"n_rows":4,"n_cols":4,"rows_kept":4,"cut":false,"hidden":true,"merged":[[1,0,1,1],[1,2,1,3],[0,0,0,3]]}
["Spec Limits"]
["English",null,"Metric"]
["Lower","Upper","Lower","Upper"]
[35,60,560,960]

{"sheet":"RX","index":2,"n_rows":101,"n_cols":9,"rows_kept":101,"cut":false,"hidden":true,"merged":[]}
[99]
["Fld_nbr","Value","Desc_1","Desc_2","Desc_3","Desc_4","Desc_5","Desc_6","Desc_7"]
[1,{"$f":"IF('Tex-404-A'!$B$49=\"\",\"\",'Tex-404-A'!$B$49)","v":""},{"$f":"'Tex-404-A'!$B$48","v":"Remarks:"}]
[2,{"$f":"IF('Tex-404-A'!$D$19=\"\",\"\",'Tex-404-A'!$D$19)","v":""},{"$f":"IF('Tex-404-A'!$C$19=\"\",\"\",'Tex-404-A'!$C$19)","v":"COURSE\\LIFT:"}]
[3,{"$f":"IF('Tex-404-A'!$C$59=\"\",\"\",'Tex-404-A'!$C$59)","v":""},"Tested By ",{"$f":"IF('Tex-404-A'!$B$59=\"\",\"\",'Tex-404-A'!$B$59)","v":"TX404"}]
[4,{"$f":"IF('Tex-404-A'!$F$59=\"\",\"\",'Tex-404-A'!$F$59)","v":""},"Tested Date ",{"$f":"IF('Tex-404-A'!$B$59=\"\",\"\",'Tex-404-A'!$B$59)","v":"TX404"}]
[5,{"$f":"IF('Tex-404-A'!$E$22=\"\",\"\",'Tex-404-A'!$E$22)","v":""},{"$f":"IF('Tex-404-A'!$B$6=\"\",\"\",'Tex-404-A'!$B$6)","v":"Tex-404-A"},{"$f":"IF('Tex-404-A'!$B$21=\"\",\"\",'Tex-404-A'!$B$21)","v":"Determining Unit Weight (Mass) of Aggregates - Tex-404-A"},{"$f":"IF('Tex-404-A'!$D$22=\"\",\"\",'Tex-404-A'!$D$22)","v":"for"}]
[6,{"$f":"IF('Tex-404-A'!$B$30=\"\",\"\",'Tex-404-A'!$B$30)","v":""},{"$f":"IF('Tex-404-A'!$B$6=\"\",\"\",'Tex-404-A'!$B$6)","v":"Tex-404-A"},{"$f":"IF('Tex-404-A'!$B$26=\"\",\"\",'Tex-404-A'!$B$26)","v":"Sample ID"}]
[7,{"$f":"IF('Tex-404-A'!$C$30=\"\",\"\",'Tex-404-A'!$C$30)","v":""},{"$f":"IF('Tex-404-A'!$B$6=\"\",\"\",'Tex-404-A'!$B$6)","v":"Tex-404-A"},{"$f":"IF('Tex-404-A'!$A$30=\"\",\"\",'Tex-404-A'!$A$30)","v":1},{"$f":"IF('Tex-404-A'!$C$26=\"\",\"\",'Tex-404-A'!$C$26)","v":"Weight of Sample + Tare"},{"$f":"IF('Tex-404-A'!$C$29=\"\",\"\",'Tex-404-A'!$C$29)","v":""}]
[8,{"$f":"IF('Tex-404-A'!$D$30=\"\",\"\",'Tex-404-A'!$D$30)","v":""},{"$f":"IF('Tex-404-A'!$B$6=\"\",\"\",'Tex-404-A'!$B$6)","v":"Tex-404-A"},{"$f":"IF('Tex-404-A'!$A$30=\"\",\"\",'Tex-404-A'!$A$30)","v":1},{"$f":"IF('Tex-404-A'!$D$26=\"\",\"\",'Tex-404-A'!$D$26)","v":"Tare Weight"},{"$f":"IF('Tex-404-A'!$D$29=\"\",\"\",'Tex-404-A'!$D$29)","v":""}]
[9,{"$f":"IF('Tex-404-A'!$E$30=\"\",\"\",'Tex-404-A'!$E$30)","v":""},{"$f":"IF('Tex-404-A'!$B$6=\"\",\"\",'Tex-404-A'!$B$6)","v":"Tex-404-A"},{"$f":"IF('Tex-404-A'!$A$30=\"\",\"\",'Tex-404-A'!$A$30)","v":1},{"$f":"IF('Tex-404-A'!$E$26=\"\",\"\",'Tex-404-A'!$E$26)","v":"Sample Weight"},{"$f":"IF('Tex-404-A'!$E$29=\"\",\"\",'Tex-404-A'!$E$29)","v":""}]
[10,{"$f":"IF('Tex-404-A'!$F$30=\"\",\"\",'Tex-404-A'!$F$30)","v":""},{"$f":"IF('Tex-404-A'!$B$6=\"\",\"\",'Tex-404-A'!$B$6)","v":"Tex-404-A"},{"$f":"IF('Tex-404-A'!$A$30=\"\",\"\",'Tex-404-A'!$A$30)","v":1},{"$f":"IF('Tex-404-A'!$F$26=\"\",\"\",'Tex-404-A'!$F$26)","v":"Volume of Container"},{"$f":"IF('Tex-404-A'!$F$29=\"\",\"\",'Tex-404-A'!$F$29)","v":""}]
[11,{"$f":"IF('Tex-404-A'!$G$30=\"\",\"\",'Tex-404-A'!$G$30)","v":""},{"$f":"IF('Tex-404-A'!$B$6=\"\",\"\",'Tex-404-A'!$B$6)","v":"Tex-404-A"},{"$f":"IF('Tex-404-A'!$A$30=\"\",\"\",'Tex-404-A'!$A$30)","v":1},{"$f":"IF('Tex-404-A'!$G$26=\"\",\"\",'Tex-404-A'!$G$26)","v":"Wet Unit Weight of Aggregate"},{"$f":"IF('Tex-404-A'!$G$29=\"\",\"\",'Tex-404-A'!$G$29)","v":""}]
[12,{"$f":"IF('Tex-404-A'!$H$30=\"\",\"\",'Tex-404-A'!$H$30)","v":""},{"$f":"IF('Tex-404-A'!$B$6=\"\",\"\",'Tex-404-A'!$B$6)","v":"Tex-404-A"},{"$f":"IF('Tex-404-A'!$A$30=\"\",\"\",'Tex-404-A'!$A$30)","v":1},{"$f":"IF('Tex-404-A'!$H$26=\"\",\"\",'Tex-404-A'!$H$26)","v":"Moisture Content"},{"$f":"IF('Tex-404-A'!$H$29=\"\",\"\",'Tex-404-A'!$H$29)","v":"( % )"}]
[13,{"$f":"IF('Tex-404-A'!$I$30=\"\",\"\",'Tex-404-A'!$I$30)","v":""},{"$f":"IF('Tex-404-A'!$B$6=\"\",\"\",'Tex-404-A'!$B$6)","v":"Tex-404-A"},{"$f":"IF('Tex-404-A'!$A$30=\"\",\"\",'Tex-404-A'!$A$30)","v":1},{"$f":"IF('Tex-404-A'!$I$26=\"\",\"\",'Tex-404-A'!$I$26)","v":"Dry Unit Weight of Aggregate"},{"$f":"IF('Tex-404-A'!$I$29=\"\",\"\",'Tex-404-A'!$I$29)","v":""}]
[14,{"$f":"IF('Tex-404-A'!$J$30=\"\",\"\",'Tex-404-A'!$J$30)","v":""},{"$f":"IF('Tex-404-A'!$B$6=\"\",\"\",'Tex-404-A'!$B$6)","v":"Tex-404-A"},{"$f":"IF('Tex-404-A'!$A$30=\"\",\"\",'Tex-404-A'!$A$30)","v":1},{"$f":"IF('Tex-404-A'!$J$26=\"\",\"\",'Tex-404-A'!$J$26)","v":"Within "},{"$f":"IF('Tex-404-A'!$J$29=\"\",\"\",'Tex-404-A'!$J$29)","v":"Specs"}]
[15,{"$f":"IF('Tex-404-A'!$C$31=\"\",\"\",'Tex-404-A'!$C$31)","v":""},{"$f":"IF('Tex-404-A'!$B$6=\"\",\"\",'Tex-404-A'!$B$6)","v":"Tex-404-A"},{"$f":"IF('Tex-404-A'!$A$31=\"\",\"\",'Tex-404-A'!$A$31)","v":2},{"$f":"IF('Tex-404-A'!$C$26=\"\",\"\",'Tex-404-A'!$C$26)","v":"Weight of Sample + Tare"},{"$f":"IF('Tex-404-A'!$C$29=\"\",\"\",'Tex-404-A'!$C$29)","v":""}]
[16,{"$f":"IF('Tex-404-A'!$D$31=\"\",\"\",'Tex-404-A'!$D$31)","v":""},{"$f":"IF('Tex-404-A'!$B$6=\"\",\"\",'Tex-404-A'!$B$6)","v":"Tex-404-A"},{"$f":"IF('Tex-404-A'!$A$31=\"\",\"\",'Tex-404-A'!$A$31)","v":2},{"$f":"IF('Tex-404-A'!$D$26=\"\",\"\",'Tex-404-A'!$D$26)","v":"Tare Weight"},{"$f":"IF('Tex-404-A'!$D$29=\"\",\"\",'Tex-404-A'!$D$29)","v":""}]
[17,{"$f":"IF('Tex-404-A'!$E$31=\"\",\"\",'Tex-404-A'!$E$31)","v":""},{"$f":"IF('Tex-404-A'!$B$6=\"\",\"\",'Tex-404-A'!$B$6)","v":"Tex-404-A"},{"$f":"IF('Tex-404-A'!$A$31=\"\",\"\",'Tex-404-A'!$A$31)","v":2},{"$f":"IF('Tex-404-A'!$E$26=\"\",\"\",'Tex-404-A'!$E$26)","v":"Sample Weight"},{"$f":"IF('Tex-404-A'!$E$29=\"\",\"\",'Tex-404-A'!$E$29)","v":""}]
[18,{"$f":"IF('Tex-404-A'!$F$31=\"\",\"\",'Tex-404-A'!$F$31)","v":""},{"$f":"IF('Tex-404-A'!$B$6=\"\",\"\",'Tex-404-A'!$B$6)","v":"Tex-404-A"},{"$f":"IF('Tex-404-A'!$A$31=\"\",\"\",'Tex-404-A'!$A$31)","v":2},{"$f":"IF('Tex-404-A'!$F$26=\"\",\"\",'Tex-404-A'!$F$26)","v":"Volume of Container"},{"$f":"IF('Tex-404-A'!$F$29=\"\",\"\",'Tex-404-A'!$F$29)","v":""}]
[19,{"$f":"IF('Tex-404-A'!$G$31=\"\",\"\",'Tex-404-A'!$G$31)","v":""},{"$f":"IF('Tex-404-A'!$B$6=\"\",\"\",'Tex-404-A'!$B$6)","v":"Tex-404-A"},{"$f":"IF('Tex-404-A'!$A$31=\"\",\"\",'Tex-404-A'!$A$31)","v":2},{"$f":"IF('Tex-404-A'!$G$26=\"\",\"\",'Tex-404-A'!$G$26)","v":"Wet Unit Weight of Aggregate"},{"$f":"IF('Tex-404-A'!$G$29=\"\",\"\",'Tex-404-A'!$G$29)","v":""}]
[20,{"$f":"IF('Tex-404-A'!$H$31=\"\",\"\",'Tex-404-A'!$H$31)","v":""},{"$f":"IF('Tex-404-A'!$B$6=\"\",\"\",'Tex-404-A'!$B$6)","v":"Tex-404-A"},{"$f":"IF('Tex-404-A'!$A$31=\"\",\"\",'Tex-404-A'!$A$31)","v":2},{"$f":"IF('Tex-404-A'!$H$26=\"\",\"\",'Tex-404-A'!$H$26)","v":"Moisture Content"},{"$f":"IF('Tex-404-A'!$H$29=\"\",\"\",'Tex-404-A'!$H$29)","v":"( % )"}]
[21,{"$f":"IF('Tex-404-A'!$I$31=\"\",\"\",'Tex-404-A'!$I$31)","v":""},{"$f":"IF('Tex-404-A'!$B$6=\"\",\"\",'Tex-404-A'!$B$6)","v":"Tex-404-A"},{"$f":"IF('Tex-404-A'!$A$31=\"\",\"\",'Tex-404-A'!$A$31)","v":2},{"$f":"IF('Tex-404-A'!$I$26=\"\",\"\",'Tex-404-A'!$I$26)","v":"Dry Unit Weight of Aggregate"},{"$f":"IF('Tex-404-A'!$I$29=\"\",\"\",'Tex-404-A'!$I$29)","v":""}]
[22,{"$f":"IF('Tex-404-A'!$J$31=\"\",\"\",'Tex-404-A'!$J$31)","v":""},{"$f":"IF('Tex-404-A'!$B$6=\"\",\"\",'Tex-404-A'!$B$6)","v":"Tex-404-A"},{"$f":"IF('Tex-404-A'!$A$31=\"\",\"\",'Tex-404-A'!$A$31)","v":2},{"$f":"IF('Tex-404-A'!$J$26=\"\",\"\",'Tex-404-A'!$J$26)","v":"Within "},{"$f":"IF('Tex-404-A'!$J$29=\"\",\"\",'Tex-404-A'!$J$29)","v":"Specs"}]
[23,{"$f":"IF('Tex-404-A'!$C$32=\"\",\"\",'Tex-404-A'!$C$32)","v":""},{"$f":"IF('Tex-404-A'!$B$6=\"\",\"\",'Tex-404-A'!$B$6)","v":"Tex-404-A"},{"$f":"IF('Tex-404-A'!$A$32=\"\",\"\",'Tex-404-A'!$A$32)","v":3},{"$f":"IF('Tex-404-A'!$C$26=\"\",\"\",'Tex-404-A'!$C$26)","v":"Weight of Sample + Tare"},{"$f":"IF('Tex-404-A'!$C$29=\"\",\"\",'Tex-404-A'!$C$29)","v":""}]
[24,{"$f":"IF('Tex-404-A'!$D$32=\"\",\"\",'Tex-404-A'!$D$32)","v":""},{"$f":"IF('Tex-404-A'!$B$6=\"\",\"\",'Tex-404-A'!$B$6)","v":"Tex-404-A"},{"$f":"IF('Tex-404-A'!$A$32=\"\",\"\",'Tex-404-A'!$A$32)","v":3},{"$f":"IF('Tex-404-A'!$D$26=\"\",\"\",'Tex-404-A'!$D$26)","v":"Tare Weight"},{"$f":"IF('Tex-404-A'!$D$29=\"\",\"\",'Tex-404-A'!$D$29)","v":""}]
[25,{"$f":"IF('Tex-404-A'!$E$32=\"\",\"\",'Tex-404-A'!$E$32)","v":""},{"$f":"IF('Tex-404-A'!$B$6=\"\",\"\",'Tex-404-A'!$B$6)","v":"Tex-404-A"},{"$f":"IF('Tex-404-A'!$A$32=\"\",\"\",'Tex-404-A'!$A$32)","v":3},{"$f":"IF('Tex-404-A'!$E$26=\"\",\"\",'Tex-404-A'!$E$26)","v":"Sample Weight"},{"$f":"IF('Tex-404-A'!$E$29=\"\",\"\",'Tex-404-A'!$E$29)","v":""}]
[26,{"$f":"IF('Tex-404-A'!$F$32=\"\",\"\",'Tex-404-A'!$F$32)","v":""},{"$f":"IF('Tex-404-A'!$B$6=\"\",\"\",'Tex-404-A'!$B$6)","v":"Tex-404-A"},{"$f":"IF('Tex-404-A'!$A$32=\"\",\"\",'Tex-404-A'!$A$32)","v":3},{"$f":"IF('Tex-404-A'!$F$26=\"\",\"\",'Tex-404-A'!$F$26)","v":"Volume of Container"},{"$f":"IF('Tex-404-A'!$F$29=\"\",\"\",'Tex-404-A'!$F$29)","v":""}]
[27,{"$f":"IF('Tex-404-A'!$G$32=\"\",\"\",'Tex-404-A'!$G$32)","v":""},{"$f":"IF('Tex-404-A'!$B$6=\"\",\"\",'Tex-404-A'!$B$6)","v":"Tex-404-A"},{"$f":"IF('Tex-404-A'!$A$32=\"\",\"\",'Tex-404-A'!$A$32)","v":3},{"$f":"IF('Tex-404-A'!$G$26=\"\",\"\",'Tex-404-A'!$G$26)","v":"Wet Unit Weight of Aggregate"},{"$f":"IF('Tex-404-A'!$G$29=\"\",\"\",'Tex-404-A'!$G$29)","v":""}]
[28,{"$f":"IF('Tex-404-A'!$H$32=\"\",\"\",'Tex-404-A'!$H$32)","v":""},{"$f":"IF('Tex-404-A'!$B$6=\"\",\"\",'Tex-404-A'!$B$6)","v":"Tex-404-A"},{"$f":"IF('Tex-404-A'!$A$32=\"\",\"\",'Tex-404-A'!$A$32)","v":3},{"$f":"IF('Tex-404-A'!$H$26=\"\",\"\",'Tex-404-A'!$H$26)","v":"Moisture Content"},{"$f":"IF('Tex-404-A'!$H$29=\"\",\"\",'Tex-404-A'!$H$29)","v":"( % )"}]
[29,{"$f":"IF('Tex-404-A'!$I$32=\"\",\"\",'Tex-404-A'!$I$32)","v":""},{"$f":"IF('Tex-404-A'!$B$6=\"\",\"\",'Tex-404-A'!$B$6)","v":"Tex-404-A"},{"$f":"IF('Tex-404-A'!$A$32=\"\",\"\",'Tex-404-A'!$A$32)","v":3},{"$f":"IF('Tex-404-A'!$I$26=\"\",\"\",'Tex-404-A'!$I$26)","v":"Dry Unit Weight of Aggregate"},{"$f":"IF('Tex-404-A'!$I$29=\"\",\"\",'Tex-404-A'!$I$29)","v":""}]
[30,{"$f":"IF('Tex-404-A'!$J$32=\"\",\"\",'Tex-404-A'!$J$32)","v":""},{"$f":"IF('Tex-404-A'!$B$6=\"\",\"\",'Tex-404-A'!$B$6)","v":"Tex-404-A"},{"$f":"IF('Tex-404-A'!$A$32=\"\",\"\",'Tex-404-A'!$A$32)","v":3},{"$f":"IF('Tex-404-A'!$J$26=\"\",\"\",'Tex-404-A'!$J$26)","v":"Within "},{"$f":"IF('Tex-404-A'!$J$29=\"\",\"\",'Tex-404-A'!$J$29)","v":"Specs"}]
[31,{"$f":"IF('Tex-404-A'!$I$33=\"\",\"\",'Tex-404-A'!$I$33)","v":""},{"$f":"IF('Tex-404-A'!$B$6=\"\",\"\",'Tex-404-A'!$B$6)","v":"Tex-404-A"},{"$f":"IF('Tex-404-A'!$H$33=\"\",\"\",'Tex-404-A'!$H$33)","v":"Average:"},{"$f":"IF('Tex-404-A'!$I$26=\"\",\"\",'Tex-404-A'!$I$26)","v":"Dry Unit Weight of Aggregate"},{"$f":"IF('Tex-404-A'!$I$29=\"\",\"\",'Tex-404-A'!$I$29)","v":""}]
[32,{"$f":"IF('Tex-404-A'!$J$33=\"\",\"\",'Tex-404-A'!$J$33)","v":""},{"$f":"IF('Tex-404-A'!$B$6=\"\",\"\",'Tex-404-A'!$B$6)","v":"Tex-404-A"},{"$f":"IF('Tex-404-A'!$H$33=\"\",\"\",'Tex-404-A'!$H$33)","v":"Average:"},{"$f":"IF('Tex-404-A'!$J$26=\"\",\"\",'Tex-404-A'!$J$26)","v":"Within "},{"$f":"IF('Tex-404-A'!$J$29=\"\",\"\",'Tex-404-A'!$J$29)","v":"Specs"}]
[33,{"$f":"IF('Tex-404-A'!$B$41=\"\",\"\",'Tex-404-A'!$B$41)","v":""},{"$f":"IF('Tex-404-A'!$B$6=\"\",\"\",'Tex-404-A'!$B$6)","v":"Tex-404-A"},{"$f":"IF('Tex-404-A'!$A$41=\"\",\"\",'Tex-404-A'!$A$41)","v":1},{"$f":"IF('Tex-404-A'!$B$37=\"\",\"\",'Tex-404-A'!$B$37)","v":"Shipment ID"}]
[34,{"$f":"IF('Tex-404-A'!$C$41=\"\",\"\",'Tex-404-A'!$C$41)","v":""},{"$f":"IF('Tex-404-A'!$B$6=\"\",\"\",'Tex-404-A'!$B$6)","v":"Tex-404-A"},{"$f":"IF('Tex-404-A'!$A$41=\"\",\"\",'Tex-404-A'!$A$41)","v":1},{"$f":"IF('Tex-404-A'!$C$37=\"\",\"\",'Tex-404-A'!$C$37)","v":"Weight of Sample + Tare"},{"$f":"IF('Tex-404-A'!$C$40=\"\",\"\",'Tex-404-A'!$C$40)","v":""}]
[35,{"$f":"IF('Tex-404-A'!$D$41=\"\",\"\",'Tex-404-A'!$D$41)","v":""},{"$f":"IF('Tex-404-A'!$B$6=\"\",\"\",'Tex-404-A'!$B$6)","v":"Tex-404-A"},{"$f":"IF('Tex-404-A'!$A$41=\"\",\"\",'Tex-404-A'!$A$41)","v":1},{"$f":"IF('Tex-404-A'!$D$37=\"\",\"\",'Tex-404-A'!$D$37)","v":"Tare Weight"},{"$f":"IF('Tex-404-A'!$D$40=\"\",\"\",'Tex-404-A'!$D$40)","v":""}]
[36,{"$f":"IF('Tex-404-A'!$E$41=\"\",\"\",'Tex-404-A'!$E$41)","v":""},{"$f":"IF('Tex-404-A'!$B$6=\"\",\"\",'Tex-404-A'!$B$6)","v":"Tex-404-A"},{"$f":"IF('Tex-404-A'!$A$41=\"\",\"\",'Tex-404-A'!$A$41)","v":1},{"$f":"IF('Tex-404-A'!$E$37=\"\",\"\",'Tex-404-A'!$E$37)","v":"Sample Weight"},{"$f":"IF('Tex-404-A'!$E$40=\"\",\"\",'Tex-404-A'!$E$40)","v":""}]
[37,{"$f":"IF('Tex-404-A'!$F$41=\"\",\"\",'Tex-404-A'!$F$41)","v":""},{"$f":"IF('Tex-404-A'!$B$6=\"\",\"\",'Tex-404-A'!$B$6)","v":"Tex-404-A"},{"$f":"IF('Tex-404-A'!$A$41=\"\",\"\",'Tex-404-A'!$A$41)","v":1},{"$f":"IF('Tex-404-A'!$F$37=\"\",\"\",'Tex-404-A'!$F$37)","v":"Volume of Container"},{"$f":"IF('Tex-404-A'!$F$40=\"\",\"\",'Tex-404-A'!$F$40)","v":""}]
[38,{"$f":"IF('Tex-404-A'!$G$41=\"\",\"\",'Tex-404-A'!$G$41)","v":""},{"$f":"IF('Tex-404-A'!$B$6=\"\",\"\",'Tex-404-A'!$B$6)","v":"Tex-404-A"},{"$f":"IF('Tex-404-A'!$A$41=\"\",\"\",'Tex-404-A'!$A$41)","v":1},{"$f":"IF('Tex-404-A'!$G$37=\"\",\"\",'Tex-404-A'!$G$37)","v":"Moisture Content"},{"$f":"IF('Tex-404-A'!$G$40=\"\",\"\",'Tex-404-A'!$G$40)","v":"( % )"}]
[39,{"$f":"IF('Tex-404-A'!$H$41=\"\",\"\",'Tex-404-A'!$H$41)","v":""},{"$f":"IF('Tex-404-A'!$B$6=\"\",\"\",'Tex-404-A'!$B$6)","v":"Tex-404-A"},{"$f":"IF('Tex-404-A'!$A$41=\"\",\"\",'Tex-404-A'!$A$41)","v":1},{"$f":"IF('Tex-404-A'!$H$37=\"\",\"\",'Tex-404-A'!$H$37)","v":"Dry Unit Weight of Aggregate"},{"$f":"IF('Tex-404-A'!$H$40=\"\",\"\",'Tex-404-A'!$H$40)","v":""}]
[40,{"$f":"IF('Tex-404-A'!$I$41=\"\",\"\",'Tex-404-A'!$I$41)","v":""},{"$f":"IF('Tex-404-A'!$B$6=\"\",\"\",'Tex-404-A'!$B$6)","v":"Tex-404-A"},{"$f":"IF('Tex-404-A'!$A$41=\"\",\"\",'Tex-404-A'!$A$41)","v":1},{"$f":"IF('Tex-404-A'!$I$37=\"\",\"\",'Tex-404-A'!$I$37)","v":"Within "},{"$f":"IF('Tex-404-A'!$I$40=\"\",\"\",'Tex-404-A'!$I$40)","v":"Specs"}]
[41,{"$f":"IF('Tex-404-A'!$J$41=\"\",\"\",'Tex-404-A'!$J$41)","v":""},{"$f":"IF('Tex-404-A'!$B$6=\"\",\"\",'Tex-404-A'!$B$6)","v":"Tex-404-A"},{"$f":"IF('Tex-404-A'!$A$41=\"\",\"\",'Tex-404-A'!$A$41)","v":1},{"$f":"IF('Tex-404-A'!$J$37=\"\",\"\",'Tex-404-A'!$J$37)","v":"Accept if within 6% of Source"}]
[42,{"$f":"IF('Tex-404-A'!$B$42=\"\",\"\",'Tex-404-A'!$B$42)","v":""},{"$f":"IF('Tex-404-A'!$B$6=\"\",\"\",'Tex-404-A'!$B$6)","v":"Tex-404-A"},{"$f":"IF('Tex-404-A'!$A$42=\"\",\"\",'Tex-404-A'!$A$42)","v":2},{"$f":"IF('Tex-404-A'!$B$37=\"\",\"\",'Tex-404-A'!$B$37)","v":"Shipment ID"}]
[43,{"$f":"IF('Tex-404-A'!$C$42=\"\",\"\",'Tex-404-A'!$C$42)","v":""},{"$f":"IF('Tex-404-A'!$B$6=\"\",\"\",'Tex-404-A'!$B$6)","v":"Tex-404-A"},{"$f":"IF('Tex-404-A'!$A$42=\"\",\"\",'Tex-404-A'!$A$42)","v":2},{"$f":"IF('Tex-404-A'!$C$37=\"\",\"\",'Tex-404-A'!$C$37)","v":"Weight of Sample + Tare"},{"$f":"IF('Tex-404-A'!$C$40=\"\",\"\",'Tex-404-A'!$C$40)","v":""}]
[44,{"$f":"IF('Tex-404-A'!$D$42=\"\",\"\",'Tex-404-A'!$D$42)","v":""},{"$f":"IF('Tex-404-A'!$B$6=\"\",\"\",'Tex-404-A'!$B$6)","v":"Tex-404-A"},{"$f":"IF('Tex-404-A'!$A$42=\"\",\"\",'Tex-404-A'!$A$42)","v":2},{"$f":"IF('Tex-404-A'!$D$37=\"\",\"\",'Tex-404-A'!$D$37)","v":"Tare Weight"},{"$f":"IF('Tex-404-A'!$D$40=\"\",\"\",'Tex-404-A'!$D$40)","v":""}]
[45,{"$f":"IF('Tex-404-A'!$E$42=\"\",\"\",'Tex-404-A'!$E$42)","v":""},{"$f":"IF('Tex-404-A'!$B$6=\"\",\"\",'Tex-404-A'!$B$6)","v":"Tex-404-A"},{"$f":"IF('Tex-404-A'!$A$42=\"\",\"\",'Tex-404-A'!$A$42)","v":2},{"$f":"IF('Tex-404-A'!$E$37=\"\",\"\",'Tex-404-A'!$E$37)","v":"Sample Weight"},{"$f":"IF('Tex-404-A'!$E$40=\"\",\"\",'Tex-404-A'!$E$40)","v":""}]
[46,{"$f":"IF('Tex-404-A'!$F$42=\"\",\"\",'Tex-404-A'!$F$42)","v":""},{"$f":"IF('Tex-404-A'!$B$6=\"\",\"\",'Tex-404-A'!$B$6)","v":"Tex-404-A"},{"$f":"IF('Tex-404-A'!$A$42=\"\",\"\",'Tex-404-A'!$A$42)","v":2},{"$f":"IF('Tex-404-A'!$F$37=\"\",\"\",'Tex-404-A'!$F$37)","v":"Volume of Container"},{"$f":"IF('Tex-404-A'!$F$40=\"\",\"\",'Tex-404-A'!$F$40)","v":""}]
[47,{"$f":"IF('Tex-404-A'!$G$42=\"\",\"\",'Tex-404-A'!$G$42)","v":""},{"$f":"IF('Tex-404-A'!$B$6=\"\",\"\",'Tex-404-A'!$B$6)","v":"Tex-404-A"},{"$f":"IF('Tex-404-A'!$A$42=\"\",\"\",'Tex-404-A'!$A$42)","v":2},{"$f":"IF('Tex-404-A'!$G$37=\"\",\"\",'Tex-404-A'!$G$37)","v":"Moisture Content"},{"$f":"IF('Tex-404-A'!$G$40=\"\",\"\",'Tex-404-A'!$G$40)","v":"( % )"}]
[48,{"$f":"IF('Tex-404-A'!$H$42=\"\",\"\",'Tex-404-A'!$H$42)","v":""},{"$f":"IF('Tex-404-A'!$B$6=\"\",\"\",'Tex-404-A'!$B$6)","v":"Tex-404-A"},{"$f":"IF('Tex-404-A'!$A$42=\"\",\"\",'Tex-404-A'!$A$42)","v":2},{"$f":"IF('Tex-404-A'!$H$37=\"\",\"\",'Tex-404-A'!$H$37)","v":"Dry Unit Weight of Aggregate"},{"$f":"IF('Tex-404-A'!$H$40=\"\",\"\",'Tex-404-A'!$H$40)","v":""}]
[49,{"$f":"IF('Tex-404-A'!$I$42=\"\",\"\",'Tex-404-A'!$I$42)","v":""},{"$f":"IF('Tex-404-A'!$B$6=\"\",\"\",'Tex-404-A'!$B$6)","v":"Tex-404-A"},{"$f":"IF('Tex-404-A'!$A$42=\"\",\"\",'Tex-404-A'!$A$42)","v":2},{"$f":"IF('Tex-404-A'!$I$37=\"\",\"\",'Tex-404-A'!$I$37)","v":"Within "},{"$f":"IF('Tex-404-A'!$I$40=\"\",\"\",'Tex-404-A'!$I$40)","v":"Specs"}]
[50,{"$f":"IF('Tex-404-A'!$J$42=\"\",\"\",'Tex-404-A'!$J$42)","v":""},{"$f":"IF('Tex-404-A'!$B$6=\"\",\"\",'Tex-404-A'!$B$6)","v":"Tex-404-A"},{"$f":"IF('Tex-404-A'!$A$42=\"\",\"\",'Tex-404-A'!$A$42)","v":2},{"$f":"IF('Tex-404-A'!$J$37=\"\",\"\",'Tex-404-A'!$J$37)","v":"Accept if within 6% of Source"}]
[51,{"$f":"IF('Tex-404-A'!$B$43=\"\",\"\",'Tex-404-A'!$B$43)","v":""},{"$f":"IF('Tex-404-A'!$B$6=\"\",\"\",'Tex-404-A'!$B$6)","v":"Tex-404-A"},{"$f":"IF('Tex-404-A'!$A$43=\"\",\"\",'Tex-404-A'!$A$43)","v":3},{"$f":"IF('Tex-404-A'!$B$37=\"\",\"\",'Tex-404-A'!$B$37)","v":"Shipment ID"}]
[52,{"$f":"IF('Tex-404-A'!$C$43=\"\",\"\",'Tex-404-A'!$C$43)","v":""},{"$f":"IF('Tex-404-A'!$B$6=\"\",\"\",'Tex-404-A'!$B$6)","v":"Tex-404-A"},{"$f":"IF('Tex-404-A'!$A$43=\"\",\"\",'Tex-404-A'!$A$43)","v":3},{"$f":"IF('Tex-404-A'!$C$37=\"\",\"\",'Tex-404-A'!$C$37)","v":"Weight of Sample + Tare"},{"$f":"IF('Tex-404-A'!$C$40=\"\",\"\",'Tex-404-A'!$C$40)","v":""}]
[53,{"$f":"IF('Tex-404-A'!$D$43=\"\",\"\",'Tex-404-A'!$D$43)","v":""},{"$f":"IF('Tex-404-A'!$B$6=\"\",\"\",'Tex-404-A'!$B$6)","v":"Tex-404-A"},{"$f":"IF('Tex-404-A'!$A$43=\"\",\"\",'Tex-404-A'!$A$43)","v":3},{"$f":"IF('Tex-404-A'!$D$37=\"\",\"\",'Tex-404-A'!$D$37)","v":"Tare Weight"},{"$f":"IF('Tex-404-A'!$D$40=\"\",\"\",'Tex-404-A'!$D$40)","v":""}]
[54,{"$f":"IF('Tex-404-A'!$E$43=\"\",\"\",'Tex-404-A'!$E$43)","v":""},{"$f":"IF('Tex-404-A'!$B$6=\"\",\"\",'Tex-404-A'!$B$6)","v":"Tex-404-A"},{"$f":"IF('Tex-404-A'!$A$43=\"\",\"\",'Tex-404-A'!$A$43)","v":3},{"$f":"IF('Tex-404-A'!$E$37=\"\",\"\",'Tex-404-A'!$E$37)","v":"Sample Weight"},{"$f":"IF('Tex-404-A'!$E$40=\"\",\"\",'Tex-404-A'!$E$40)","v":""}]
[55,{"$f":"IF('Tex-404-A'!$F$43=\"\",\"\",'Tex-404-A'!$F$43)","v":""},{"$f":"IF('Tex-404-A'!$B$6=\"\",\"\",'Tex-404-A'!$B$6)","v":"Tex-404-A"},{"$f":"IF('Tex-404-A'!$A$43=\"\",\"\",'Tex-404-A'!$A$43)","v":3},{"$f":"IF('Tex-404-A'!$F$37=\"\",\"\",'Tex-404-A'!$F$37)","v":"Volume of Container"},{"$f":"IF('Tex-404-A'!$F$40=\"\",\"\",'Tex-404-A'!$F$40)","v":""}]
[56,{"$f":"IF('Tex-404-A'!$G$43=\"\",\"\",'Tex-404-A'!$G$43)","v":""},{"$f":"IF('Tex-404-A'!$B$6=\"\",\"\",'Tex-404-A'!$B$6)","v":"Tex-404-A"},{"$f":"IF('Tex-404-A'!$A$43=\"\",\"\",'Tex-404-A'!$A$43)","v":3},{"$f":"IF('Tex-404-A'!$G$37=\"\",\"\",'Tex-404-A'!$G$37)","v":"Moisture Content"},{"$f":"IF('Tex-404-A'!$G$40=\"\",\"\",'Tex-404-A'!$G$40)","v":"( % )"}]
[57,{"$f":"IF('Tex-404-A'!$H$43=\"\",\"\",'Tex-404-A'!$H$43)","v":""},{"$f":"IF('Tex-404-A'!$B$6=\"\",\"\",'Tex-404-A'!$B$6)","v":"Tex-404-A"},{"$f":"IF('Tex-404-A'!$A$43=\"\",\"\",'Tex-404-A'!$A$43)","v":3},{"$f":"IF('Tex-404-A'!$H$37=\"\",\"\",'Tex-404-A'!$H$37)","v":"Dry Unit Weight of Aggregate"},{"$f":"IF('Tex-404-A'!$H$40=\"\",\"\",'Tex-404-A'!$H$40)","v":""}]
[58,{"$f":"IF('Tex-404-A'!$I$43=\"\",\"\",'Tex-404-A'!$I$43)","v":""},{"$f":"IF('Tex-404-A'!$B$6=\"\",\"\",'Tex-404-A'!$B$6)","v":"Tex-404-A"},{"$f":"IF('Tex-404-A'!$A$43=\"\",\"\",'Tex-404-A'!$A$43)","v":3},{"$f":"IF('Tex-404-A'!$I$37=\"\",\"\",'Tex-404-A'!$I$37)","v":"Within "},{"$f":"IF('Tex-404-A'!$I$40=\"\",\"\",'Tex-404-A'!$I$40)","v":"Specs"}]
[59,{"$f":"IF('Tex-404-A'!$J$43=\"\",\"\",'Tex-404-A'!$J$43)","v":""},{"$f":"IF('Tex-404-A'!$B$6=\"\",\"\",'Tex-404-A'!$B$6)","v":"Tex-404-A"},{"$f":"IF('Tex-404-A'!$A$43=\"\",\"\",'Tex-404-A'!$A$43)","v":3},{"$f":"IF('Tex-404-A'!$J$37=\"\",\"\",'Tex-404-A'!$J$37)","v":"Accept if within 6% of Source"}]
[60,{"$f":"IF('Tex-404-A'!$B$44=\"\",\"\",'Tex-404-A'!$B$44)","v":""},{"$f":"IF('Tex-404-A'!$B$6=\"\",\"\",'Tex-404-A'!$B$6)","v":"Tex-404-A"},{"$f":"IF('Tex-404-A'!$A$44=\"\",\"\",'Tex-404-A'!$A$44)","v":4},{"$f":"IF('Tex-404-A'!$B$37=\"\",\"\",'Tex-404-A'!$B$37)","v":"Shipment ID"}]
[61,{"$f":"IF('Tex-404-A'!$C$44=\"\",\"\",'Tex-404-A'!$C$44)","v":""},{"$f":"IF('Tex-404-A'!$B$6=\"\",\"\",'Tex-404-A'!$B$6)","v":"Tex-404-A"},{"$f":"IF('Tex-404-A'!$A$44=\"\",\"\",'Tex-404-A'!$A$44)","v":4},{"$f":"IF('Tex-404-A'!$C$37=\"\",\"\",'Tex-404-A'!$C$37)","v":"Weight of Sample + Tare"},{"$f":"IF('Tex-404-A'!$C$40=\"\",\"\",'Tex-404-A'!$C$40)","v":""}]
[62,{"$f":"IF('Tex-404-A'!$D$44=\"\",\"\",'Tex-404-A'!$D$44)","v":""},{"$f":"IF('Tex-404-A'!$B$6=\"\",\"\",'Tex-404-A'!$B$6)","v":"Tex-404-A"},{"$f":"IF('Tex-404-A'!$A$44=\"\",\"\",'Tex-404-A'!$A$44)","v":4},{"$f":"IF('Tex-404-A'!$D$37=\"\",\"\",'Tex-404-A'!$D$37)","v":"Tare Weight"},{"$f":"IF('Tex-404-A'!$D$40=\"\",\"\",'Tex-404-A'!$D$40)","v":""}]
[63,{"$f":"IF('Tex-404-A'!$E$44=\"\",\"\",'Tex-404-A'!$E$44)","v":""},{"$f":"IF('Tex-404-A'!$B$6=\"\",\"\",'Tex-404-A'!$B$6)","v":"Tex-404-A"},{"$f":"IF('Tex-404-A'!$A$44=\"\",\"\",'Tex-404-A'!$A$44)","v":4},{"$f":"IF('Tex-404-A'!$E$37=\"\",\"\",'Tex-404-A'!$E$37)","v":"Sample Weight"},{"$f":"IF('Tex-404-A'!$E$40=\"\",\"\",'Tex-404-A'!$E$40)","v":""}]
[64,{"$f":"IF('Tex-404-A'!$F$44=\"\",\"\",'Tex-404-A'!$F$44)","v":""},{"$f":"IF('Tex-404-A'!$B$6=\"\",\"\",'Tex-404-A'!$B$6)","v":"Tex-404-A"},{"$f":"IF('Tex-404-A'!$A$44=\"\",\"\",'Tex-404-A'!$A$44)","v":4},{"$f":"IF('Tex-404-A'!$F$37=\"\",\"\",'Tex-404-A'!$F$37)","v":"Volume of Container"},{"$f":"IF('Tex-404-A'!$F$40=\"\",\"\",'Tex-404-A'!$F$40)","v":""}]
[65,{"$f":"IF('Tex-404-A'!$G$44=\"\",\"\",'Tex-404-A'!$G$44)","v":""},{"$f":"IF('Tex-404-A'!$B$6=\"\",\"\",'Tex-404-A'!$B$6)","v":"Tex-404-A"},{"$f":"IF('Tex-404-A'!$A$44=\"\",\"\",'Tex-404-A'!$A$44)","v":4},{"$f":"IF('Tex-404-A'!$G$37=\"\",\"\",'Tex-404-A'!$G$37)","v":"Moisture Content"},{"$f":"IF('Tex-404-A'!$G$40=\"\",\"\",'Tex-404-A'!$G$40)","v":"( % )"}]
[66,{"$f":"IF('Tex-404-A'!$H$44=\"\",\"\",'Tex-404-A'!$H$44)","v":""},{"$f":"IF('Tex-404-A'!$B$6=\"\",\"\",'Tex-404-A'!$B$6)","v":"Tex-404-A"},{"$f":"IF('Tex-404-A'!$A$44=\"\",\"\",'Tex-404-A'!$A$44)","v":4},{"$f":"IF('Tex-404-A'!$H$37=\"\",\"\",'Tex-404-A'!$H$37)","v":"Dry Unit Weight of Aggregate"},{"$f":"IF('Tex-404-A'!$H$40=\"\",\"\",'Tex-404-A'!$H$40)","v":""}]
[67,{"$f":"IF('Tex-404-A'!$I$44=\"\",\"\",'Tex-404-A'!$I$44)","v":""},{"$f":"IF('Tex-404-A'!$B$6=\"\",\"\",'Tex-404-A'!$B$6)","v":"Tex-404-A"},{"$f":"IF('Tex-404-A'!$A$44=\"\",\"\",'Tex-404-A'!$A$44)","v":4},{"$f":"IF('Tex-404-A'!$I$37=\"\",\"\",'Tex-404-A'!$I$37)","v":"Within "},{"$f":"IF('Tex-404-A'!$I$40=\"\",\"\",'Tex-404-A'!$I$40)","v":"Specs"}]
[68,{"$f":"IF('Tex-404-A'!$J$44=\"\",\"\",'Tex-404-A'!$J$44)","v":""},{"$f":"IF('Tex-404-A'!$B$6=\"\",\"\",'Tex-404-A'!$B$6)","v":"Tex-404-A"},{"$f":"IF('Tex-404-A'!$A$44=\"\",\"\",'Tex-404-A'!$A$44)","v":4},{"$f":"IF('Tex-404-A'!$J$37=\"\",\"\",'Tex-404-A'!$J$37)","v":"Accept if within 6% of Source"}]
[69,{"$f":"IF('Tex-404-A'!$B$45=\"\",\"\",'Tex-404-A'!$B$45)","v":""},{"$f":"IF('Tex-404-A'!$B$6=\"\",\"\",'Tex-404-A'!$B$6)","v":"Tex-404-A"},{"$f":"IF('Tex-404-A'!$A$45=\"\",\"\",'Tex-404-A'!$A$45)","v":5},{"$f":"IF('Tex-404-A'!$B$37=\"\",\"\",'Tex-404-A'!$B$37)","v":"Shipment ID"}]
[70,{"$f":"IF('Tex-404-A'!$C$45=\"\",\"\",'Tex-404-A'!$C$45)","v":""},{"$f":"IF('Tex-404-A'!$B$6=\"\",\"\",'Tex-404-A'!$B$6)","v":"Tex-404-A"},{"$f":"IF('Tex-404-A'!$A$45=\"\",\"\",'Tex-404-A'!$A$45)","v":5},{"$f":"IF('Tex-404-A'!$C$37=\"\",\"\",'Tex-404-A'!$C$37)","v":"Weight of Sample + Tare"},{"$f":"IF('Tex-404-A'!$C$40=\"\",\"\",'Tex-404-A'!$C$40)","v":""}]
[71,{"$f":"IF('Tex-404-A'!$D$45=\"\",\"\",'Tex-404-A'!$D$45)","v":""},{"$f":"IF('Tex-404-A'!$B$6=\"\",\"\",'Tex-404-A'!$B$6)","v":"Tex-404-A"},{"$f":"IF('Tex-404-A'!$A$45=\"\",\"\",'Tex-404-A'!$A$45)","v":5},{"$f":"IF('Tex-404-A'!$D$37=\"\",\"\",'Tex-404-A'!$D$37)","v":"Tare Weight"},{"$f":"IF('Tex-404-A'!$D$40=\"\",\"\",'Tex-404-A'!$D$40)","v":""}]
[72,{"$f":"IF('Tex-404-A'!$E$45=\"\",\"\",'Tex-404-A'!$E$45)","v":""},{"$f":"IF('Tex-404-A'!$B$6=\"\",\"\",'Tex-404-A'!$B$6)","v":"Tex-404-A"},{"$f":"IF('Tex-404-A'!$A$45=\"\",\"\",'Tex-404-A'!$A$45)","v":5},{"$f":"IF('Tex-404-A'!$E$37=\"\",\"\",'Tex-404-A'!$E$37)","v":"Sample Weight"},{"$f":"IF('Tex-404-A'!$E$40=\"\",\"\",'Tex-404-A'!$E$40)","v":""}]
[73,{"$f":"IF('Tex-404-A'!$F$45=\"\",\"\",'Tex-404-A'!$F$45)","v":""},{"$f":"IF('Tex-404-A'!$B$6=\"\",\"\",'Tex-404-A'!$B$6)","v":"Tex-404-A"},{"$f":"IF('Tex-404-A'!$A$45=\"\",\"\",'Tex-404-A'!$A$45)","v":5},{"$f":"IF('Tex-404-A'!$F$37=\"\",\"\",'Tex-404-A'!$F$37)","v":"Volume of Container"},{"$f":"IF('Tex-404-A'!$F$40=\"\",\"\",'Tex-404-A'!$F$40)","v":""}]
[74,{"$f":"IF('Tex-404-A'!$G$45=\"\",\"\",'Tex-404-A'!$G$45)","v":""},{"$f":"IF('Tex-404-A'!$B$6=\"\",\"\",'Tex-404-A'!$B$6)","v":"Tex-404-A"},{"$f":"IF('Tex-404-A'!$A$45=\"\",\"\",'Tex-404-A'!$A$45)","v":5},{"$f":"IF('Tex-404-A'!$G$37=\"\",\"\",'Tex-404-A'!$G$37)","v":"Moisture Content"},{"$f":"IF('Tex-404-A'!$G$40=\"\",\"\",'Tex-404-A'!$G$40)","v":"( % )"}]
[75,{"$f":"IF('Tex-404-A'!$H$45=\"\",\"\",'Tex-404-A'!$H$45)","v":""},{"$f":"IF('Tex-404-A'!$B$6=\"\",\"\",'Tex-404-A'!$B$6)","v":"Tex-404-A"},{"$f":"IF('Tex-404-A'!$A$45=\"\",\"\",'Tex-404-A'!$A$45)","v":5},{"$f":"IF('Tex-404-A'!$H$37=\"\",\"\",'Tex-404-A'!$H$37)","v":"Dry Unit Weight of Aggregate"},{"$f":"IF('Tex-404-A'!$H$40=\"\",\"\",'Tex-404-A'!$H$40)","v":""}]
[76,{"$f":"IF('Tex-404-A'!$I$45=\"\",\"\",'Tex-404-A'!$I$45)","v":""},{"$f":"IF('Tex-404-A'!$B$6=\"\",\"\",'Tex-404-A'!$B$6)","v":"Tex-404-A"},{"$f":"IF('Tex-404-A'!$A$45=\"\",\"\",'Tex-404-A'!$A$45)","v":5},{"$f":"IF('Tex-404-A'!$I$37=\"\",\"\",'Tex-404-A'!$I$37)","v":"Within "},{"$f":"IF('Tex-404-A'!$I$40=\"\",\"\",'Tex-404-A'!$I$40)","v":"Specs"}]
[77,{"$f":"IF('Tex-404-A'!$J$45=\"\",\"\",'Tex-404-A'!$J$45)","v":""},{"$f":"IF('Tex-404-A'!$B$6=\"\",\"\",'Tex-404-A'!$B$6)","v":"Tex-404-A"},{"$f":"IF('Tex-404-A'!$A$45=\"\",\"\",'Tex-404-A'!$A$45)","v":5},{"$f":"IF('Tex-404-A'!$J$37=\"\",\"\",'Tex-404-A'!$J$37)","v":"Accept if within 6% of Source"}]
[78,{"$f":"IF('Tex-404-A'!$B$46=\"\",\"\",'Tex-404-A'!$B$46)","v":""},{"$f":"IF('Tex-404-A'!$B$6=\"\",\"\",'Tex-404-A'!$B$6)","v":"Tex-404-A"},{"$f":"IF('Tex-404-A'!$A$46=\"\",\"\",'Tex-404-A'!$A$46)","v":6},{"$f":"IF('Tex-404-A'!$B$37=\"\",\"\",'Tex-404-A'!$B$37)","v":"Shipment ID"}]
[79,{"$f":"IF('Tex-404-A'!$C$46=\"\",\"\",'Tex-404-A'!$C$46)","v":""},{"$f":"IF('Tex-404-A'!$B$6=\"\",\"\",'Tex-404-A'!$B$6)","v":"Tex-404-A"},{"$f":"IF('Tex-404-A'!$A$46=\"\",\"\",'Tex-404-A'!$A$46)","v":6},{"$f":"IF('Tex-404-A'!$C$37=\"\",\"\",'Tex-404-A'!$C$37)","v":"Weight of Sample + Tare"},{"$f":"IF('Tex-404-A'!$C$40=\"\",\"\",'Tex-404-A'!$C$40)","v":""}]
[80,{"$f":"IF('Tex-404-A'!$D$46=\"\",\"\",'Tex-404-A'!$D$46)","v":""},{"$f":"IF('Tex-404-A'!$B$6=\"\",\"\",'Tex-404-A'!$B$6)","v":"Tex-404-A"},{"$f":"IF('Tex-404-A'!$A$46=\"\",\"\",'Tex-404-A'!$A$46)","v":6},{"$f":"IF('Tex-404-A'!$D$37=\"\",\"\",'Tex-404-A'!$D$37)","v":"Tare Weight"},{"$f":"IF('Tex-404-A'!$D$40=\"\",\"\",'Tex-404-A'!$D$40)","v":""}]
[81,{"$f":"IF('Tex-404-A'!$E$46=\"\",\"\",'Tex-404-A'!$E$46)","v":""},{"$f":"IF('Tex-404-A'!$B$6=\"\",\"\",'Tex-404-A'!$B$6)","v":"Tex-404-A"},{"$f":"IF('Tex-404-A'!$A$46=\"\",\"\",'Tex-404-A'!$A$46)","v":6},{"$f":"IF('Tex-404-A'!$E$37=\"\",\"\",'Tex-404-A'!$E$37)","v":"Sample Weight"},{"$f":"IF('Tex-404-A'!$E$40=\"\",\"\",'Tex-404-A'!$E$40)","v":""}]
[82,{"$f":"IF('Tex-404-A'!$F$46=\"\",\"\",'Tex-404-A'!$F$46)","v":""},{"$f":"IF('Tex-404-A'!$B$6=\"\",\"\",'Tex-404-A'!$B$6)","v":"Tex-404-A"},{"$f":"IF('Tex-404-A'!$A$46=\"\",\"\",'Tex-404-A'!$A$46)","v":6},{"$f":"IF('Tex-404-A'!$F$37=\"\",\"\",'Tex-404-A'!$F$37)","v":"Volume of Container"},{"$f":"IF('Tex-404-A'!$F$40=\"\",\"\",'Tex-404-A'!$F$40)","v":""}]
[83,{"$f":"IF('Tex-404-A'!$G$46=\"\",\"\",'Tex-404-A'!$G$46)","v":""},{"$f":"IF('Tex-404-A'!$B$6=\"\",\"\",'Tex-404-A'!$B$6)","v":"Tex-404-A"},{"$f":"IF('Tex-404-A'!$A$46=\"\",\"\",'Tex-404-A'!$A$46)","v":6},{"$f":"IF('Tex-404-A'!$G$37=\"\",\"\",'Tex-404-A'!$G$37)","v":"Moisture Content"},{"$f":"IF('Tex-404-A'!$G$40=\"\",\"\",'Tex-404-A'!$G$40)","v":"( % )"}]
[84,{"$f":"IF('Tex-404-A'!$H$46=\"\",\"\",'Tex-404-A'!$H$46)","v":""},{"$f":"IF('Tex-404-A'!$B$6=\"\",\"\",'Tex-404-A'!$B$6)","v":"Tex-404-A"},{"$f":"IF('Tex-404-A'!$A$46=\"\",\"\",'Tex-404-A'!$A$46)","v":6},{"$f":"IF('Tex-404-A'!$H$37=\"\",\"\",'Tex-404-A'!$H$37)","v":"Dry Unit Weight of Aggregate"},{"$f":"IF('Tex-404-A'!$H$40=\"\",\"\",'Tex-404-A'!$H$40)","v":""}]
[85,{"$f":"IF('Tex-404-A'!$I$46=\"\",\"\",'Tex-404-A'!$I$46)","v":""},{"$f":"IF('Tex-404-A'!$B$6=\"\",\"\",'Tex-404-A'!$B$6)","v":"Tex-404-A"},{"$f":"IF('Tex-404-A'!$A$46=\"\",\"\",'Tex-404-A'!$A$46)","v":6},{"$f":"IF('Tex-404-A'!$I$37=\"\",\"\",'Tex-404-A'!$I$37)","v":"Within "},{"$f":"IF('Tex-404-A'!$I$40=\"\",\"\",'Tex-404-A'!$I$40)","v":"Specs"}]
[86,{"$f":"IF('Tex-404-A'!$J$46=\"\",\"\",'Tex-404-A'!$J$46)","v":""},{"$f":"IF('Tex-404-A'!$B$6=\"\",\"\",'Tex-404-A'!$B$6)","v":"Tex-404-A"},{"$f":"IF('Tex-404-A'!$A$46=\"\",\"\",'Tex-404-A'!$A$46)","v":6},{"$f":"IF('Tex-404-A'!$J$37=\"\",\"\",'Tex-404-A'!$J$37)","v":"Accept if within 6% of Source"}]
[87,{"$f":"IF('Tex-404-A'!$B$47=\"\",\"\",'Tex-404-A'!$B$47)","v":""},{"$f":"IF('Tex-404-A'!$B$6=\"\",\"\",'Tex-404-A'!$B$6)","v":"Tex-404-A"},{"$f":"IF('Tex-404-A'!$A$47=\"\",\"\",'Tex-404-A'!$A$47)","v":7},{"$f":"IF('Tex-404-A'!$B$37=\"\",\"\",'Tex-404-A'!$B$37)","v":"Shipment ID"}]
[88,{"$f":"IF('Tex-404-A'!$C$47=\"\",\"\",'Tex-404-A'!$C$47)","v":""},{"$f":"IF('Tex-404-A'!$B$6=\"\",\"\",'Tex-404-A'!$B$6)","v":"Tex-404-A"},{"$f":"IF('Tex-404-A'!$A$47=\"\",\"\",'Tex-404-A'!$A$47)","v":7},{"$f":"IF('Tex-404-A'!$C$37=\"\",\"\",'Tex-404-A'!$C$37)","v":"Weight of Sample + Tare"},{"$f":"IF('Tex-404-A'!$C$40=\"\",\"\",'Tex-404-A'!$C$40)","v":""}]
[89,{"$f":"IF('Tex-404-A'!$D$47=\"\",\"\",'Tex-404-A'!$D$47)","v":""},{"$f":"IF('Tex-404-A'!$B$6=\"\",\"\",'Tex-404-A'!$B$6)","v":"Tex-404-A"},{"$f":"IF('Tex-404-A'!$A$47=\"\",\"\",'Tex-404-A'!$A$47)","v":7},{"$f":"IF('Tex-404-A'!$D$37=\"\",\"\",'Tex-404-A'!$D$37)","v":"Tare Weight"},{"$f":"IF('Tex-404-A'!$D$40=\"\",\"\",'Tex-404-A'!$D$40)","v":""}]
[90,{"$f":"IF('Tex-404-A'!$E$47=\"\",\"\",'Tex-404-A'!$E$47)","v":""},{"$f":"IF('Tex-404-A'!$B$6=\"\",\"\",'Tex-404-A'!$B$6)","v":"Tex-404-A"},{"$f":"IF('Tex-404-A'!$A$47=\"\",\"\",'Tex-404-A'!$A$47)","v":7},{"$f":"IF('Tex-404-A'!$E$37=\"\",\"\",'Tex-404-A'!$E$37)","v":"Sample Weight"},{"$f":"IF('Tex-404-A'!$E$40=\"\",\"\",'Tex-404-A'!$E$40)","v":""}]
[91,{"$f":"IF('Tex-404-A'!$F$47=\"\",\"\",'Tex-404-A'!$F$47)","v":""},{"$f":"IF('Tex-404-A'!$B$6=\"\",\"\",'Tex-404-A'!$B$6)","v":"Tex-404-A"},{"$f":"IF('Tex-404-A'!$A$47=\"\",\"\",'Tex-404-A'!$A$47)","v":7},{"$f":"IF('Tex-404-A'!$F$37=\"\",\"\",'Tex-404-A'!$F$37)","v":"Volume of Container"},{"$f":"IF('Tex-404-A'!$F$40=\"\",\"\",'Tex-404-A'!$F$40)","v":""}]
[92,{"$f":"IF('Tex-404-A'!$G$47=\"\",\"\",'Tex-404-A'!$G$47)","v":""},{"$f":"IF('Tex-404-A'!$B$6=\"\",\"\",'Tex-404-A'!$B$6)","v":"Tex-404-A"},{"$f":"IF('Tex-404-A'!$A$47=\"\",\"\",'Tex-404-A'!$A$47)","v":7},{"$f":"IF('Tex-404-A'!$G$37=\"\",\"\",'Tex-404-A'!$G$37)","v":"Moisture Content"},{"$f":"IF('Tex-404-A'!$G$40=\"\",\"\",'Tex-404-A'!$G$40)","v":"( % )"}]
[93,{"$f":"IF('Tex-404-A'!$H$47=\"\",\"\",'Tex-404-A'!$H$47)","v":""},{"$f":"IF('Tex-404-A'!$B$6=\"\",\"\",'Tex-404-A'!$B$6)","v":"Tex-404-A"},{"$f":"IF('Tex-404-A'!$A$47=\"\",\"\",'Tex-404-A'!$A$47)","v":7},{"$f":"IF('Tex-404-A'!$H$37=\"\",\"\",'Tex-404-A'!$H$37)","v":"Dry Unit Weight of Aggregate"},{"$f":"IF('Tex-404-A'!$H$40=\"\",\"\",'Tex-404-A'!$H$40)","v":""}]
[94,{"$f":"IF('Tex-404-A'!$I$47=\"\",\"\",'Tex-404-A'!$I$47)","v":""},{"$f":"IF('Tex-404-A'!$B$6=\"\",\"\",'Tex-404-A'!$B$6)","v":"Tex-404-A"},{"$f":"IF('Tex-404-A'!$A$47=\"\",\"\",'Tex-404-A'!$A$47)","v":7},{"$f":"IF('Tex-404-A'!$I$37=\"\",\"\",'Tex-404-A'!$I$37)","v":"Within "},{"$f":"IF('Tex-404-A'!$I$40=\"\",\"\",'Tex-404-A'!$I$40)","v":"Specs"}]
[95,{"$f":"IF('Tex-404-A'!$J$47=\"\",\"\",'Tex-404-A'!$J$47)","v":""},{"$f":"IF('Tex-404-A'!$B$6=\"\",\"\",'Tex-404-A'!$B$6)","v":"Tex-404-A"},{"$f":"IF('Tex-404-A'!$A$47=\"\",\"\",'Tex-404-A'!$A$47)","v":7},{"$f":"IF('Tex-404-A'!$J$37=\"\",\"\",'Tex-404-A'!$J$37)","v":"Accept if within 6% of Source"}]
[96,{"$f":"IF('Tex-404-A'!$C$55=\"\",\"\",'Tex-404-A'!$C$55)","v":""},"Sampled By ",{"$f":"IF('Tex-404-A'!$B$55=\"\",\"\",'Tex-404-A'!$B$55)","v":"TX221"}]
[97,{"$f":"IF('Tex-404-A'!$F$55=\"\",\"\",'Tex-404-A'!$F$55)","v":""},"Sampled Date ",{"$f":"IF('Tex-404-A'!$B$55=\"\",\"\",'Tex-404-A'!$B$55)","v":"TX221"}]
[98,{"$f":"IF('Tex-404-A'!$C$57=\"\",\"\",'Tex-404-A'!$C$57)","v":""},"Sampled By ",{"$f":"IF('Tex-404-A'!$B$57=\"\",\"\",'Tex-404-A'!$B$57)","v":"TX400"}]
[99,{"$f":"IF('Tex-404-A'!$F$57=\"\",\"\",'Tex-404-A'!$F$57)","v":""},"Sampled Date ",{"$f":"IF('Tex-404-A'!$B$57=\"\",\"\",'Tex-404-A'!$B$57)","v":"TX400"}]