{"text_format":"1","workbook":"xlsx","n_sheets":4,"sheets":["LA Wear","RX","Revisions","Sieves"],"not_rendered":{"charts":0,"images":1,"macros":1,"external_links":0,"defined_names":75,"comments":1,"pivot_tables":0},"unopened":[],"bounds":{"document_bytes":16777216,"sheet_cells":100000,"rows_first":2000,"rows_last":500,"rows_between":2000,"halvings":0,"cell_chars":16384,"cell_head_chars":4096},"cells_cut":0,"cells_raw":0,"read":"whole","date_system":"1900"}

{"sheet":"LA Wear","index":0,"n_rows":58,"n_cols":11,"rows_kept":58,"cut":false,"hidden":false,"merged":[[42,1,43,8],[52,2,52,4],[16,3,16,4],[16,7,16,8],[32,6,34,6],[47,2,47,4],[48,2,48,4],[50,2,50,4],[54,1,54,3],[0,0,0,1],[58,1,58,3],[54,6,54,8],[32,2,34,2],[24,2,24,6],[32,4,34,4],[10,7,10,8],[11,7,11,8],[44,1,44,8],[45,1,45,8],[13,7,13,8],[13,3,13,4],[32,3,34,3],[32,5,34,5],[51,2,51,4],[15,3,15,8],[7,3,7,4],[7,7,7,8],[8,7,8,8],[8,3,8,4],[12,7,12,8],[10,3,10,4],[9,7,9,8],[9,3,9,4],[11,3,11,4],[12,3,12,4],[14,3,14,8]]}
["TxDOT Manuals >",null,null,"Tex-410-A"]
[null,"TEXAS DEPARTMENT OF TRANSPORTATION",null,null,null,null,null,null,null,null,19]
[null,null,null,null,null,null,null,null,null,null,3]
[null,null,null,null,null,null,null,null,null,null,"tx410.xlsm::45505.602951"]
[null,"RESISTANCE TO DEGRADATION BY ABRASION & IMPACT IN LOS ANGELES MACHINE"]
[null,"Tex-410-A "]
[null,null,null,null,null,null,null,null,{"$f":"\"File Version: \" & TEXT(MID(sn,SEARCH(\"::\",sn,1)+2,20),\"mm/dd/yy hh:mm:ss\")","v":"File Version: 08/01/24 14:28:15"}]
[null,null,"SAMPLE ID:",null,null,null,"SAMPLED DATE:"]
[null,null,"TEST NUMBER:",null,null,null,"LETTING DATE:"]
[null,null,"SAMPLE STATUS:",null,null,null,"CONTROLLING CSJ:"]
[null,null,"COUNTY:",null,null,null,"SPEC YEAR:"]
[null,null,"SAMPLED BY:",null,null,null,"SPEC ITEM:"]
[null,null,"SAMPLE LOCATION:",null,null,null,"SPECIAL PROVISION:"]
[null,null,"MATERIAL CODE:",null,null,null,"GRADE/LA Abrasion Type:"]
[null,null,"MATERIAL NAME:"]
[null,null,"PRODUCER:"]
[null,null,"AREA ENGINEER:",null,null,null,"PROJECT MANAGER:"]
[]
[null,null,"COURSE\\LIFT:",null,"STATION:",null,null,"DIST. FROM CL:"]
[]
[]
[null,null,null,null,"Number of Spheres:",{"$f":"IF(ISERROR(INDEX(INDIRECT(\"type\" & LAType),1,7)),\"\",INDEX(INDIRECT(\"type\" & LAType),1,7))","v":""}]
[null,null,null,null,"Weight of Charge (g):",{"$f":"IF(ISERROR(INDEX(INDIRECT(\"type\" & LAType),1,8)),\"\",INDEX(INDIRECT(\"type\" & LAType),1,8))","v":""}]
[]
[null,null,"SAMPLE PREPARATION"]
[null,null,"Passing Sieve","Retained Sieve","Projected Weight (g)","Actual Weight (g)","Within Range"]
[null,null,{"$f":"IF(ISERROR(IF(SpecYear=\"\",\"\",INDEX(INDIRECT(\"type\" & LAType),1,IF(SpecYear =\"1995\",4,2)))),\"\",IF(SpecYear=\"\",\"\",INDEX(INDIRECT(\"type\" & LAType),1,IF(SpecYear =\"1995\",4,2))))","v":""},{"$f":"IF(ISERROR(IF(SpecYear=\"\",\"\",INDEX(INDIRECT(\"type\" & LAType),1,IF(SpecYear =\"1995\",5,3)))),\"\",IF(SpecYear=\"\",\"\",INDEX(INDIRECT(\"type\" & LAType),1,IF(SpecYear =\"1995\",5,3))))","v":""},{"$f":"IF(ISERROR(IF(SpecYear=\"\",\"\",INDEX(INDIRECT(\"type\" & LAType),1,6))),\"\",IF(SpecYear=\"\",\"\",INDEX(INDIRECT(\"type\" & LAType),1,6)))","v":""},null,{"$f":"IF(F27=\"\",\"\",+IF(SQRT((+F27-VALUE(LEFT($E27,4)))^2)>VALUE(RIGHT($E27,2)),\"No\",\"Yes\"))","v":""}]
[null,null,{"$f":"IF(ISERROR(IF(SpecYear=\"\",\"\",INDEX(INDIRECT(\"type\" & LAType),2,IF(SpecYear =\"1995\",4,2)))),\"\",IF(SpecYear=\"\",\"\",INDEX(INDIRECT(\"type\" & LAType),2,IF(SpecYear =\"1995\",4,2))))","v":""},{"$f":"IF(ISERROR(IF(SpecYear=\"\",\"\",INDEX(INDIRECT(\"type\" & LAType),2,IF(SpecYear =\"1995\",5,3)))),\"\",IF(SpecYear=\"\",\"\",INDEX(INDIRECT(\"type\" & LAType),2,IF(SpecYear =\"1995\",5,3))))","v":""},{"$f":"IF(ISERROR(IF(SpecYear=\"\",\"\",INDEX(INDIRECT(\"type\" & LAType),2,6))),\"\",IF(SpecYear=\"\",\"\",INDEX(INDIRECT(\"type\" & LAType),2,6)))","v":""},null,{"$f":"IF(F28=\"\",\"\",+IF(SQRT((+F28-VALUE(LEFT($E28,4)))^2)>VALUE(RIGHT($E28,2)),\"No\",\"Yes\"))","v":""}]
[null,null,{"$f":"IF(ISERROR(IF(SpecYear=\"\",\"\",INDEX(INDIRECT(\"type\" & LAType),3,IF(SpecYear =\"1995\",4,2)))),\"\",IF(SpecYear=\"\",\"\",INDEX(INDIRECT(\"type\" & LAType),3,IF(SpecYear =\"1995\",4,2))))","v":""},{"$f":"IF(ISERROR(IF(SpecYear=\"\",\"\",INDEX(INDIRECT(\"type\" & LAType),3,IF(SpecYear =\"1995\",5,3)))),\"\",IF(SpecYear=\"\",\"\",INDEX(INDIRECT(\"type\" & LAType),3,IF(SpecYear =\"1995\",5,3))))","v":""},{"$f":"IF(ISERROR(IF(SpecYear=\"\",\"\",INDEX(INDIRECT(\"type\" & LAType),3,6))),\"\",IF(SpecYear=\"\",\"\",INDEX(INDIRECT(\"type\" & LAType),3,6)))","v":""},null,{"$f":"IF(F29=\"\",\"\",+IF(SQRT((+F29-VALUE(LEFT($E29,4)))^2)>VALUE(RIGHT($E29,2)),\"No\",\"Yes\"))","v":""}]
[null,null,{"$f":"IF(ISERROR(IF(SpecYear=\"\",\"\",INDEX(INDIRECT(\"type\" & LAType),4,IF(SpecYear =\"1995\",4,2)))),\"\",IF(SpecYear=\"\",\"\",INDEX(INDIRECT(\"type\" & LAType),4,IF(SpecYear =\"1995\",4,2))))","v":""},{"$f":"IF(ISERROR(IF(SpecYear=\"\",\"\",INDEX(INDIRECT(\"type\" & LAType),4,IF(SpecYear =\"1995\",5,3)))),\"\",IF(SpecYear=\"\",\"\",INDEX(INDIRECT(\"type\" & LAType),4,IF(SpecYear =\"1995\",5,3))))","v":""},{"$f":"IF(ISERROR(IF(SpecYear=\"\",\"\",INDEX(INDIRECT(\"type\" & LAType),4,6))),\"\",IF(SpecYear=\"\",\"\",INDEX(INDIRECT(\"type\" & LAType),4,6)))","v":""},null,{"$f":"IF(F30=\"\",\"\",+IF(SQRT((+F30-VALUE(LEFT($E30,4)))^2)>VALUE(RIGHT($E30,2)),\"No\",\"Yes\"))","v":""}]
[null,null,null,null,"Total:",{"$f":"IF(COUNTBLANK(F27:F30)=4,\"\",SUM(F27:F30))","v":""}]
[]
[null,null,"Sieve","Initial Weight (g)","Final Weight (g)","Loss of Weight (g) ","% Loss"]
[]
[]
[null,null,{"$f":"IF(SpecYear=\"\",\"\",IF(SpecYear=\"1995\",\"1.7 mm\",\"No.12\"))","v":""},{"$f":"+F31","v":""},null,{"$f":"IF(Field12=\"\",\"\",(D36-E36))","v":""},{"$f":"IF(F36=\"\",\"\",IF(D36>0,+F36/D36,0))","v":""}]
[]
[]
[null,null,null,null,"LA Abrasion Value:",{"$f":"+G36","v":""}]
[]
[]
[null,"Remarks:",{"$f":"NOW()","v":"2024-08-01T14:28:15.470"}]
[]
[]
[]
[]
[]
[null,"Sample Method:","Sampled By:",null,null,"Sampled Date:"]
[null,"TX221"]
[]
[null,"TX400"]
[null,"Test Method:","Tested By:",null,null,"Tested Date:"]
[null,"TX410"]
[null,"Test Stamp Code:",null,null,"Omit Test:","Completed Date:","Reviewed By:"]
[]
[null,"Locked By:","TxDOT:","District:","Area:"]
[]
[null,"Authorized By:",null,null,"Authorized Date:"]

{"sheet":"RX","index":1,"n_rows":25,"n_cols":9,"rows_kept":25,"cut":false,"hidden":true,"merged":[]}
[23]
["Fld_nbr","Value","Desc_1","Desc_2","Desc_3","Desc_4","Desc_5","Desc_6","Desc_7"]
[1,{"$f":"IF('LA Wear'!$B$43=\"\",\"\",'LA Wear'!$B$43)","v":""},{"$f":"'LA Wear'!$B$42","v":"Remarks:"}]
[2,{"$f":"IF('LA Wear'!$D$19=\"\",\"\",'LA Wear'!$D$19)","v":""},{"$f":"IF('LA Wear'!$C$19=\"\",\"\",'LA Wear'!$C$19)","v":"COURSE\\LIFT:"}]
[3,{"$f":"IF('LA Wear'!$C$53=\"\",\"\",'LA Wear'!$C$53)","v":""},"Tested By ",{"$f":"IF('LA Wear'!$B$53=\"\",\"\",'LA Wear'!$B$53)","v":"TX410"}]
[4,{"$f":"IF('LA Wear'!$F$53=\"\",\"\",'LA Wear'!$F$53)","v":""},"Tested Date ",{"$f":"IF('LA Wear'!$B$53=\"\",\"\",'LA Wear'!$B$53)","v":"TX410"}]
[5,{"$f":"IF('LA Wear'!$F$27=\"\",\"\",'LA Wear'!$F$27)","v":""},{"$f":"IF('LA Wear'!$B$6=\"\",\"\",'LA Wear'!$B$6)","v":"Tex-410-A "},{"$f":"IF('LA Wear'!$F$26=\"\",\"\",'LA Wear'!$F$26)","v":"Actual Weight (g)"},{"$f":"IF('LA Wear'!$C$26=\"\",\"\",'LA Wear'!$C$26)","v":"Passing Sieve"},{"$f":"IF('LA Wear'!$C$27=\"\",\"\",'LA Wear'!$C$27)","v":""},{"$f":"IF('LA Wear'!$D$26=\"\",\"\",'LA Wear'!$D$26)","v":"Retained Sieve"},{"$f":"IF('LA Wear'!$D$27=\"\",\"\",'LA Wear'!$D$27)","v":""}]
[6,{"$f":"IF('LA Wear'!$G$27=\"\",\"\",'LA Wear'!$G$27)","v":""},{"$f":"IF('LA Wear'!$B$6=\"\",\"\",'LA Wear'!$B$6)","v":"Tex-410-A "},{"$f":"IF('LA Wear'!$G$26=\"\",\"\",'LA Wear'!$G$26)","v":"Within Range"},{"$f":"IF('LA Wear'!$C$26=\"\",\"\",'LA Wear'!$C$26)","v":"Passing Sieve"},{"$f":"IF('LA Wear'!$C$27=\"\",\"\",'LA Wear'!$C$27)","v":""},{"$f":"IF('LA Wear'!$D$26=\"\",\"\",'LA Wear'!$D$26)","v":"Retained Sieve"},{"$f":"IF('LA Wear'!$D$27=\"\",\"\",'LA Wear'!$D$27)","v":""}]
[7,{"$f":"IF('LA Wear'!$F$28=\"\",\"\",'LA Wear'!$F$28)","v":""},{"$f":"IF('LA Wear'!$B$6=\"\",\"\",'LA Wear'!$B$6)","v":"Tex-410-A "},{"$f":"IF('LA Wear'!$F$26=\"\",\"\",'LA Wear'!$F$26)","v":"Actual Weight (g)"},{"$f":"IF('LA Wear'!$C$26=\"\",\"\",'LA Wear'!$C$26)","v":"Passing Sieve"},{"$f":"IF('LA Wear'!$C$28=\"\",\"\",'LA Wear'!$C$28)","v":""},{"$f":"IF('LA Wear'!$D$26=\"\",\"\",'LA Wear'!$D$26)","v":"Retained Sieve"},{"$f":"IF('LA Wear'!$D$28=\"\",\"\",'LA Wear'!$D$28)","v":""}]
[8,{"$f":"IF('LA Wear'!$G$28=\"\",\"\",'LA Wear'!$G$28)","v":""},{"$f":"IF('LA Wear'!$B$6=\"\",\"\",'LA Wear'!$B$6)","v":"Tex-410-A "},{"$f":"IF('LA Wear'!$G$26=\"\",\"\",'LA Wear'!$G$26)","v":"Within Range"},{"$f":"IF('LA Wear'!$C$26=\"\",\"\",'LA Wear'!$C$26)","v":"Passing Sieve"},{"$f":"IF('LA Wear'!$C$28=\"\",\"\",'LA Wear'!$C$28)","v":""},{"$f":"IF('LA Wear'!$D$26=\"\",\"\",'LA Wear'!$D$26)","v":"Retained Sieve"},{"$f":"IF('LA Wear'!$D$28=\"\",\"\",'LA Wear'!$D$28)","v":""}]
[9,{"$f":"IF('LA Wear'!$F$29=\"\",\"\",'LA Wear'!$F$29)","v":""},{"$f":"IF('LA Wear'!$B$6=\"\",\"\",'LA Wear'!$B$6)","v":"Tex-410-A "},{"$f":"IF('LA Wear'!$F$26=\"\",\"\",'LA Wear'!$F$26)","v":"Actual Weight (g)"},{"$f":"IF('LA Wear'!$C$26=\"\",\"\",'LA Wear'!$C$26)","v":"Passing Sieve"},{"$f":"IF('LA Wear'!$C$29=\"\",\"\",'LA Wear'!$C$29)","v":""},{"$f":"IF('LA Wear'!$D$26=\"\",\"\",'LA Wear'!$D$26)","v":"Retained Sieve"},{"$f":"IF('LA Wear'!$D$29=\"\",\"\",'LA Wear'!$D$29)","v":""}]
[10,{"$f":"IF('LA Wear'!$G$29=\"\",\"\",'LA Wear'!$G$29)","v":""},{"$f":"IF('LA Wear'!$B$6=\"\",\"\",'LA Wear'!$B$6)","v":"Tex-410-A "},{"$f":"IF('LA Wear'!$G$26=\"\",\"\",'LA Wear'!$G$26)","v":"Within Range"},{"$f":"IF('LA Wear'!$C$26=\"\",\"\",'LA Wear'!$C$26)","v":"Passing Sieve"},{"$f":"IF('LA Wear'!$C$29=\"\",\"\",'LA Wear'!$C$29)","v":""},{"$f":"IF('LA Wear'!$D$26=\"\",\"\",'LA Wear'!$D$26)","v":"Retained Sieve"},{"$f":"IF('LA Wear'!$D$29=\"\",\"\",'LA Wear'!$D$29)","v":""}]
[11,{"$f":"IF('LA Wear'!$F$30=\"\",\"\",'LA Wear'!$F$30)","v":""},{"$f":"IF('LA Wear'!$B$6=\"\",\"\",'LA Wear'!$B$6)","v":"Tex-410-A "},{"$f":"IF('LA Wear'!$F$26=\"\",\"\",'LA Wear'!$F$26)","v":"Actual Weight (g)"},{"$f":"IF('LA Wear'!$C$26=\"\",\"\",'LA Wear'!$C$26)","v":"Passing Sieve"},{"$f":"IF('LA Wear'!$C$30=\"\",\"\",'LA Wear'!$C$30)","v":""},{"$f":"IF('LA Wear'!$D$26=\"\",\"\",'LA Wear'!$D$26)","v":"Retained Sieve"},{"$f":"IF('LA Wear'!$D$30=\"\",\"\",'LA Wear'!$D$30)","v":""}]
[12,{"$f":"IF('LA Wear'!$G$30=\"\",\"\",'LA Wear'!$G$30)","v":""},{"$f":"IF('LA Wear'!$B$6=\"\",\"\",'LA Wear'!$B$6)","v":"Tex-410-A "},{"$f":"IF('LA Wear'!$G$26=\"\",\"\",'LA Wear'!$G$26)","v":"Within Range"},{"$f":"IF('LA Wear'!$C$26=\"\",\"\",'LA Wear'!$C$26)","v":"Passing Sieve"},{"$f":"IF('LA Wear'!$C$30=\"\",\"\",'LA Wear'!$C$30)","v":""},{"$f":"IF('LA Wear'!$D$26=\"\",\"\",'LA Wear'!$D$26)","v":"Retained Sieve"},{"$f":"IF('LA Wear'!$D$30=\"\",\"\",'LA Wear'!$D$30)","v":""}]
[13,{"$f":"IF('LA Wear'!$F$31=\"\",\"\",'LA Wear'!$F$31)","v":""},{"$f":"IF('LA Wear'!$B$6=\"\",\"\",'LA Wear'!$B$6)","v":"Tex-410-A "},{"$f":"IF('LA Wear'!$F$26=\"\",\"\",'LA Wear'!$F$26)","v":"Actual Weight (g)"},{"$f":"IF('LA Wear'!$E$31=\"\",\"\",'LA Wear'!$E$31)","v":"Total:"}]
[14,{"$f":"IF('LA Wear'!$C$36=\"\",\"\",'LA Wear'!$C$36)","v":""},{"$f":"IF('LA Wear'!$B$6=\"\",\"\",'LA Wear'!$B$6)","v":"Tex-410-A "},{"$f":"IF('LA Wear'!$C$33=\"\",\"\",'LA Wear'!$C$33)","v":"Sieve"}]
[15,{"$f":"IF('LA Wear'!$D$36=\"\",\"\",'LA Wear'!$D$36)","v":""},{"$f":"IF('LA Wear'!$B$6=\"\",\"\",'LA Wear'!$B$6)","v":"Tex-410-A "},{"$f":"IF('LA Wear'!$D$33=\"\",\"\",'LA Wear'!$D$33)","v":"Initial Weight (g)"}]
[16,{"$f":"IF('LA Wear'!$E$36=\"\",\"\",'LA Wear'!$E$36)","v":""},{"$f":"IF('LA Wear'!$B$6=\"\",\"\",'LA Wear'!$B$6)","v":"Tex-410-A "},{"$f":"IF('LA Wear'!$E$33=\"\",\"\",'LA Wear'!$E$33)","v":"Final Weight (g)"}]
[17,{"$f":"IF('LA Wear'!$F$36=\"\",\"\",'LA Wear'!$F$36)","v":""},{"$f":"IF('LA Wear'!$B$6=\"\",\"\",'LA Wear'!$B$6)","v":"Tex-410-A "},{"$f":"IF('LA Wear'!$F$33=\"\",\"\",'LA Wear'!$F$33)","v":"Loss of Weight (g) "}]
[18,{"$f":"IF('LA Wear'!$G$36=\"\",\"\",'LA Wear'!$G$36)","v":""},{"$f":"IF('LA Wear'!$B$6=\"\",\"\",'LA Wear'!$B$6)","v":"Tex-410-A "},{"$f":"IF('LA Wear'!$G$33=\"\",\"\",'LA Wear'!$G$33)","v":"% Loss"}]
[19,{"$f":"IF('LA Wear'!$F$39=\"\",\"\",'LA Wear'!$F$39)","v":""},{"$f":"IF('LA Wear'!$B$6=\"\",\"\",'LA Wear'!$B$6)","v":"Tex-410-A "},{"$f":"IF('LA Wear'!$E$39=\"\",\"\",'LA Wear'!$E$39)","v":"LA Abrasion Value:"}]
[20,{"$f":"IF('LA Wear'!$C$49=\"\",\"\",'LA Wear'!$C$49)","v":""},"Sampled By ",{"$f":"IF('LA Wear'!$B$49=\"\",\"\",'LA Wear'!$B$49)","v":"TX221"}]
[21,{"$f":"IF('LA Wear'!$F$49=\"\",\"\",'LA Wear'!$F$49)","v":""},"Sampled Date ",{"$f":"IF('LA Wear'!$B$49=\"\",\"\",'LA Wear'!$B$49)","v":"TX221"}]
[22,{"$f":"IF('LA Wear'!$C$51=\"\",\"\",'LA Wear'!$C$51)","v":""},"Sampled By ",{"$f":"IF('LA Wear'!$B$51=\"\",\"\",'LA Wear'!$B$51)","v":"TX400"}]
[23,{"$f":"IF('LA Wear'!$F$51=\"\",\"\",'LA Wear'!$F$51)","v":""},"Sampled Date ",{"$f":"IF('LA Wear'!$B$51=\"\",\"\",'LA Wear'!$B$51)","v":"TX400"}]

{"sheet":"Revisions","index":2,"n_rows":2,"n_cols":3,"rows_kept":2,"cut":false,"hidden":true,"merged":[]}
["Date","Changes","By"]
["2005-05-13","Cell C27 formula change from  =IF(ISERROR(IF(SpecYear=\"\",\"\",INDEX(INDIRECT(\"type\" & LAType),1,IF(SpecYear =\"1993\",2,4)))),\"\",IF(SpecYear=\"\",\"\",INDEX(INDIRECT(\"type\" & LAType),1,IF(SpecYear =\"1993\",2,4)))) to =IF(ISERROR(IF(SpecYear=\"\",\"\",INDEX(INDIRECT(\"type\" & LAType),1,IF(SpecYear =\"1995\",4,2)))),\"\",IF(SpecYear=\"\",\"\",INDEX(INDIRECT(\"type\" & LAType),1,IF(SpecYear =\"1995\",4,2))))","Joe Liu"]

{"sheet":"Sieves","index":3,"n_rows":11,"n_cols":8,"rows_kept":11,"cut":false,"hidden":true,"merged":[[8,0,9,0],[0,6,1,6],[0,7,1,7],[0,5,1,5],[0,3,0,4],[0,0,1,0],[2,0,5,0],[6,0,7,0],[0,1,0,2]]}
["LA Abrasion Type",1993,null,1995,null,"Projected Charge","Number of Spheres","Weight of Charge"]
[null,"retained","passing ","retained","passing"]
["A","1 1/2\"","1\"","37.5 mm","25.0 mm","1250 ± 25",12,"5000 ± 25"]
[null,"1\"","3/4\"","25.0 mm","19.0 mm","1250 ± 25"]
[null,"3/4\"","1/2\"","19.0 mm","12.5 mm","1250 ± 10"]
[null,"1/2\"","3/8\"","12.5 mm","9.5 mm","1250 ± 10"]
["B","3/4\"","1/2\"","19.0 mm","12.5 mm","2500 ± 10",11,"4584 ± 25"]
[null,"1/2\"","3/8\"","12.5 mm","9.5 mm","2500 ± 10"]
["C","3/8\"","1/4\"","9.5 mm","6.3 mm","2500 ± 10",8,"3330 ± 20"]
[null,"1/4\"","No.4","6.3 mm","4.75 mm","2500 ± 10"]
["D","No.4","No.8","4.75 mm","2.36 mm","5000 ± 10",6,"2500 ± 15"]