{"text_format":"1","workbook":"xlsx","n_sheets":4,"sheets":["Soundness","Revision","RX","Sieves"],"not_rendered":{"charts":0,"images":1,"macros":1,"external_links":0,"defined_names":181,"comments":1,"pivot_tables":0},"unopened":[],"bounds":{"document_bytes":16777216,"sheet_cells":100000,"rows_first":2000,"rows_last":500,"rows_between":2000,"halvings":0,"cell_chars":16384,"cell_head_chars":4096},"cells_cut":0,"cells_raw":0,"read":"whole","date_system":"1900"}

{"sheet":"Soundness","index":0,"n_rows":83,"n_cols":11,"rows_kept":83,"cut":false,"hidden":false,"merged":[[59,7,59,8],[55,2,55,3],[55,1,58,1],[52,2,52,3],[50,2,50,3],[55,7,58,8],[57,2,57,3],[58,2,58,3],[56,2,56,3],[51,2,51,3],[53,2,53,3],[79,6,79,8],[77,2,77,4],[62,2,62,3],[60,1,63,1],[61,2,61,3],[67,1,68,8],[63,2,63,3],[60,2,60,3],[60,7,63,8],[79,1,79,3],[69,1,69,8],[70,1,70,8],[76,2,76,4],[72,2,72,4],[73,2,73,4],[75,2,75,4],[36,3,36,4],[47,2,47,3],[23,2,25,2],[11,3,11,4],[83,1,83,3],[50,1,53,1],[40,1,43,1],[45,2,45,3],[46,2,46,3],[40,2,40,3],[45,1,48,1],[41,2,41,3],[42,2,42,3],[43,2,43,3],[48,2,48,3],[8,3,8,4],[12,7,12,8],[13,7,13,8],[21,3,25,3],[21,4,25,4],[21,8,25,8],[21,6,25,6],[21,5,25,5],[16,3,16,4],[15,3,15,8],[14,3,14,8],[13,3,13,4],[44,7,44,8],[49,7,49,8],[54,7,54,8],[50,7,53,8],[45,7,48,8],[0,0,0,1],[21,1,22,2],[16,7,16,8],[40,7,43,8],[38,7,38,8],[21,7,25,7],[23,1,25,1],[7,3,7,4],[7,7,7,8],[12,3,12,4],[9,3,9,4],[10,3,10,4],[8,7,8,8],[9,7,9,8],[10,7,10,8],[11,7,11,8]]}
["TxDOT Manuals >",null,null,"Tex-411-A"]
[null,"TEXAS DEPARTMENT OF TRANSPORTATION",null,null,null,null,null,null,null,null,118]
[null,null,null,null,null,null,null,null,null,null,3]
[null,null,null,null,null,null,null,null,null,null,"tx411m.xlsm::45772.290023"]
[null,"MAGNESIUM SULFATE SOUNDNESS"]
[null,"Tex-411-A "]
[null,null,null,null,null,null,null,null,{"$f":"\"File Version: \" & TEXT(MID(sn,SEARCH(\"::\",sn,1)+2,20),\"mm/dd/yy hh:mm:ss\")","v":"File Version: 04/25/25 06:57:38"}]
[null,null,"SAMPLE ID:",null,null,null,"SAMPLED DATE:"]
[null,null,"TEST NUMBER:",null,null,null,"LETTING DATE:"]
[null,null,"SAMPLE STATUS:",null,null,null,"CONTROLLING CSJ:"]
[null,null,"COUNTY:",null,null,null,"SPEC YEAR:"]
[null,null,"SAMPLED BY:",null,null,null,"SPEC ITEM:"]
[null,null,"SAMPLE LOCATION:",null,null,null,"SPECIAL PROVISION:"]
[null,null,"MATERIAL CODE:",null,null,null,"GRADE:"]
[null,null,"MATERIAL NAME:"]
[null,null,"PRODUCER:"]
[null,null,"AREA ENGINEER:",null,null,null,"PROJECT MANAGER:"]
[]
[null,null,"COURSE\\LIFT:",null,"STATION:",null,null,"DIST. FROM CL:"]
[]
[]
[null,"Particle Size Range",null,"Initial Weight (g)","Final Weight (g)","Loss of Weight (g)","% Loss","Normalized Individual Percent Retained","Weighted Average % Loss"]
[]
[null,"Passing","Retained"]
[]
[]
[null,{"$f":"IF(ISERROR(IF(SpecYear=\"\",\"\",INDEX(INDIRECT(Grade),1,IF(SpecYear=\"1995\",4,2)))),\"\",IF(SpecYear=\"\",\"\",INDEX(INDIRECT(Grade),1,IF(SpecYear=\"1995\",4,2))))","v":""},{"$f":"IF(ISERROR(IF(SpecYear=\"\",\"\",INDEX(INDIRECT(Grade),1,IF(SpecYear=\"1995\",5,3)))),\"\",IF(SpecYear=\"\",\"\",INDEX(INDIRECT(Grade),1,IF(SpecYear=\"1995\",5,3))))","v":""},null,null,{"$f":"IF(COUNTBLANK($D$27:$E$34)=16,\"\",D27-E27)","v":""},{"$f":"IF(COUNTBLANK($D$27:$E$34)=16,\"\",IF(D27>0,+F27/D27,0))","v":""},{"$f":"IF(COUNTBLANK($D$27:$E$34)=16,\"\",IF(ISERROR(INDEX(INDIRECT(Grade),1,6)),\"\",INDEX(INDIRECT(Grade),1,6)))","v":""},{"$f":"IF(COUNTBLANK($D$27:$E$34)=16,\"\",H27*G27)","v":""}]
[null,{"$f":"IF(ISERROR(IF(SpecYear=\"\",\"\",INDEX(INDIRECT(Grade),2,IF(SpecYear=\"1995\",4,2)))),\"\",IF(SpecYear=\"\",\"\",INDEX(INDIRECT(Grade),2,IF(SpecYear=\"1995\",4,2))))","v":""},{"$f":"IF(ISERROR(IF(SpecYear=\"\",\"\",INDEX(INDIRECT(Grade),2,IF(SpecYear=\"1995\",5,3)))),\"\",IF(SpecYear=\"\",\"\",INDEX(INDIRECT(Grade),2,IF(SpecYear=\"1995\",5,3))))","v":""},null,null,{"$f":"IF(COUNTBLANK($D$27:$E$34)=16,\"\",D28-E28)","v":""},{"$f":"IF(COUNTBLANK($D$27:$E$34)=16,\"\",IF(D28>0,+F28/D28,0))","v":""},{"$f":"IF(COUNTBLANK($D$27:$E$34)=16,\"\",IF(ISERROR(INDEX(INDIRECT(Grade),2,6)),\"\",INDEX(INDIRECT(Grade),2,6)))","v":""},{"$f":"IF(COUNTBLANK($D$27:$E$34)=16,\"\",H28*G28)","v":""}]
[null,{"$f":"IF(ISERROR(IF(SpecYear=\"\",\"\",INDEX(INDIRECT(Grade),3,IF(SpecYear=\"1995\",4,2)))),\"\",IF(SpecYear=\"\",\"\",INDEX(INDIRECT(Grade),3,IF(SpecYear=\"1995\",4,2))))","v":""},{"$f":"IF(ISERROR(IF(SpecYear=\"\",\"\",INDEX(INDIRECT(Grade),3,IF(SpecYear=\"1995\",5,3)))),\"\",IF(SpecYear=\"\",\"\",INDEX(INDIRECT(Grade),3,IF(SpecYear=\"1995\",5,3))))","v":""},null,null,"","",{"$f":"IF(COUNTBLANK($D$27:$E$34)=16,\"\",IF(ISERROR(INDEX(INDIRECT(Grade),3,6)),\"\",INDEX(INDIRECT(Grade),3,6)))","v":""},""]
[null,{"$f":"IF(ISERROR(IF(SpecYear=\"\",\"\",INDEX(INDIRECT(Grade),4,IF(SpecYear=\"1995\",4,2)))),\"\",IF(SpecYear=\"\",\"\",INDEX(INDIRECT(Grade),4,IF(SpecYear=\"1995\",4,2))))","v":""},{"$f":"IF(ISERROR(IF(SpecYear=\"\",\"\",INDEX(INDIRECT(Grade),4,IF(SpecYear=\"1995\",5,3)))),\"\",IF(SpecYear=\"\",\"\",INDEX(INDIRECT(Grade),4,IF(SpecYear=\"1995\",5,3))))","v":""},null,null,"","",{"$f":"IF(COUNTBLANK($D$27:$E$34)=16,\"\",IF(ISERROR(INDEX(INDIRECT(Grade),4,6)),\"\",INDEX(INDIRECT(Grade),4,6)))","v":""},""]
[null,{"$f":"IF(ISERROR(IF(SpecYear=\"\",\"\",INDEX(INDIRECT(Grade),5,IF(SpecYear=\"1995\",4,2)))),\"\",IF(SpecYear=\"\",\"\",INDEX(INDIRECT(Grade),5,IF(SpecYear=\"1995\",4,2))))","v":""},{"$f":"IF(ISERROR(IF(SpecYear=\"\",\"\",INDEX(INDIRECT(Grade),5,IF(SpecYear=\"1995\",5,3)))),\"\",IF(SpecYear=\"\",\"\",INDEX(INDIRECT(Grade),5,IF(SpecYear=\"1995\",5,3))))","v":""},null,null,"","",{"$f":"IF(COUNTBLANK($D$27:$E$34)=16,\"\",IF(ISERROR(INDEX(INDIRECT(Grade),5,6)),\"\",INDEX(INDIRECT(Grade),5,6)))","v":""},""]
[null,{"$f":"IF(ISERROR(IF(SpecYear=\"\",\"\",INDEX(INDIRECT(Grade),6,IF(SpecYear=\"1995\",4,2)))),\"\",IF(SpecYear=\"\",\"\",INDEX(INDIRECT(Grade),6,IF(SpecYear=\"1995\",4,2))))","v":""},{"$f":"IF(ISERROR(IF(SpecYear=\"\",\"\",INDEX(INDIRECT(Grade),6,IF(SpecYear=\"1995\",5,3)))),\"\",IF(SpecYear=\"\",\"\",INDEX(INDIRECT(Grade),6,IF(SpecYear=\"1995\",5,3))))","v":""},null,null,"","",{"$f":"IF(COUNTBLANK($D$27:$E$34)=16,\"\",IF(ISERROR(INDEX(INDIRECT(Grade),6,6)),\"\",INDEX(INDIRECT(Grade),6,6)))","v":""},""]
[null,{"$f":"IF(ISERROR(IF(SpecYear=\"\",\"\",INDEX(INDIRECT(Grade),7,IF(SpecYear=\"1995\",4,2)))),\"\",IF(SpecYear=\"\",\"\",INDEX(INDIRECT(Grade),7,IF(SpecYear=\"1995\",4,2))))","v":""},{"$f":"IF(ISERROR(IF(SpecYear=\"\",\"\",INDEX(INDIRECT(Grade),7,IF(SpecYear=\"1995\",5,3)))),\"\",IF(SpecYear=\"\",\"\",INDEX(INDIRECT(Grade),7,IF(SpecYear=\"1995\",5,3))))","v":""},null,null,"","",{"$f":"IF(COUNTBLANK($D$27:$E$34)=16,\"\",IF(ISERROR(INDEX(INDIRECT(Grade),7,6)),\"\",INDEX(INDIRECT(Grade),7,6)))","v":""},""]
[null,{"$f":"IF(ISERROR(IF(SpecYear=\"\",\"\",INDEX(INDIRECT(Grade),8,IF(SpecYear=\"1995\",4,2)))),\"\",IF(SpecYear=\"\",\"\",INDEX(INDIRECT(Grade),8,IF(SpecYear=\"1995\",4,2))))","v":""},{"$f":"IF(ISERROR(IF(SpecYear=\"\",\"\",INDEX(INDIRECT(Grade),8,IF(SpecYear=\"1995\",5,3)))),\"\",IF(SpecYear=\"\",\"\",INDEX(INDIRECT(Grade),8,IF(SpecYear=\"1995\",5,3))))","v":""},null,null,"",{"$f":"IF(COUNTBLANK($D$27:$E$34)=16,\"\",IF(D34>0,+F34/D34,0))","v":""},{"$f":"IF(COUNTBLANK($D$27:$E$34)=16,\"\",IF(ISERROR(INDEX(INDIRECT(Grade),8,6)),\"\",INDEX(INDIRECT(Grade),8,6)))","v":""},{"$f":"IF(COUNTBLANK($D$27:$E$34)=16,\"\",H34*G34)","v":""}]
[null,null,null,null,null,"Total:",{"$f":"IF(COUNTBLANK($D$27:$E$34)=16,\"\",SUM(G27:G34)*100)","v":""},{"$f":"IF(COUNTBLANK($D$27:$E$34)=16,\"\",SUM(H27:H34)*100)","v":""},{"$f":"IF(COUNTBLANK($D$27:$E$34)=16,\"\",SUM(I27:I34)*100)","v":""}]
[]
[null,null,null,"Soundness Loss:",null,{"$f":"$I$35","v":""}]
[]
[null,"CYCLE","PHASE",null,"DATE","TIME IN","TIME OUT","REMARKS"]
[]
[null,"I","In solution"]
[null,null,"Out of Solution"]
[null,null,"In oven"]
[null,null,"Out of oven"]
[null,null,null,null,null," "," "," "]
[null,"II","In solution"]
[null,null,"Out of Solution"]
[null,null,"In oven"]
[null,null,"Out of oven"]
[null,null,null,null," "," "," "," "]
[null,"III","In solution"]
[null,null,"Out of Solution"]
[null,null,"In oven"]
[null,null,"Out of oven"]
[null,null,null,null," "," "," "," "]
[null,"IV","In solution"]
[null,null,"Out of Solution"]
[null,null,"In oven"]
[null,null,"Out of oven"]
[null,null,null,null," "," "," "," "]
[null,"V","In solution"]
[null," ","Out of Solution"]
[null,null,"In oven"]
[null,null,"Out of oven"]
[]
[]
[null,"Remarks:",{"$f":"NOW()","v":"2025-04-28T08:48:22.950"}]
[]
[]
[]
[]
[]
[null,"Sample Method:","Sampled By:",null,null,"Sampled Date:"]
[null,"TX221"]
[]
[null,"TX400"]
[null,"Test Method:","Tested By:",null,null,"Tested Date:"]
[null,"TX411"]
[null,"Test Stamp Code:",null,null,"Omit Test:","Completed Date:","Reviewed By:"]
[]
[null,"Locked By:","TxDOT:","District:","Area:"]
[]
[null,"Authorized By:",null,null,"Authorized Date:"]

{"sheet":"Revision","index":1,"n_rows":5,"n_cols":10,"rows_kept":5,"cut":false,"hidden":true,"merged":[[1,9,4,9],[1,0,4,0],[0,1,0,8],[1,1,1,8],[2,1,2,8],[3,1,3,8],[4,1,4,8]]}
["Date","Changes",null,null,null,null,null,null,null,"By"]
["2025-04-11","Added custon gradation form for backfill",null,null,null,null,null,null,null,"Syeda Rahman"]
[null,"Added 2024 specification grades"]
[null,"Added fields91-118 to enable clearing data from the custon gradation form"]
[null,"Added the Revision sheet "]

{"sheet":"RX","index":2,"n_rows":126,"n_cols":9,"rows_kept":126,"cut":false,"hidden":true,"merged":[]}
[124]
["Fld_nbr","Value","Desc_1","Desc_2","Desc_3","Desc_4","Desc_5","Desc_6","Desc_7"]
[1,{"$f":"IF(Soundness!$B$68=\"\",\"\",Soundness!$B$68)","v":""},{"$f":"Soundness!$B$67","v":"Remarks:"}]
[2,{"$f":"IF(Soundness!$D$19=\"\",\"\",Soundness!$D$19)","v":""},{"$f":"IF(Soundness!$C$19=\"\",\"\",Soundness!$C$19)","v":"COURSE\\LIFT:"}]
[3,{"$f":"IF(Soundness!$C$78=\"\",\"\",Soundness!$C$78)","v":""},"Tested By ",{"$f":"IF(Soundness!$B$78=\"\",\"\",Soundness!$B$78)","v":"TX411"}]
[4,{"$f":"IF(Soundness!$F$78=\"\",\"\",Soundness!$F$78)","v":""},"Tested Date ",{"$f":"IF(Soundness!$B$78=\"\",\"\",Soundness!$B$78)","v":"TX411"}]
[5,{"$f":"IF(Soundness!$D$27=\"\",\"\",Soundness!$D$27)","v":""},{"$f":"IF(Soundness!$B$6=\"\",\"\",Soundness!$B$6)","v":"Tex-411-A "},{"$f":"IF(Soundness!$B$24=\"\",\"\",Soundness!$B$24)","v":"Passing"},{"$f":"IF(Soundness!$B$27=\"\",\"\",Soundness!$B$27)","v":""},{"$f":"IF(Soundness!$B$22=\"\",\"\",Soundness!$B$22)","v":"Particle Size Range"},{"$f":"IF(Soundness!$C$24=\"\",\"\",Soundness!$C$24)","v":"Retained"},{"$f":"IF(Soundness!$C$27=\"\",\"\",Soundness!$C$27)","v":""},{"$f":"IF(Soundness!$D$22=\"\",\"\",Soundness!$D$22)","v":"Initial Weight (g)"}]
[6,{"$f":"IF(Soundness!$E$27=\"\",\"\",Soundness!$E$27)","v":""},{"$f":"IF(Soundness!$B$6=\"\",\"\",Soundness!$B$6)","v":"Tex-411-A "},{"$f":"IF(Soundness!$B$24=\"\",\"\",Soundness!$B$24)","v":"Passing"},{"$f":"IF(Soundness!$B$27=\"\",\"\",Soundness!$B$27)","v":""},{"$f":"IF(Soundness!$B$22=\"\",\"\",Soundness!$B$22)","v":"Particle Size Range"},{"$f":"IF(Soundness!$C$24=\"\",\"\",Soundness!$C$24)","v":"Retained"},{"$f":"IF(Soundness!$C$27=\"\",\"\",Soundness!$C$27)","v":""},{"$f":"IF(Soundness!$E$22=\"\",\"\",Soundness!$E$22)","v":"Final Weight (g)"}]
[7,{"$f":"IF(Soundness!$F$27=\"\",\"\",Soundness!$F$27)","v":""},{"$f":"IF(Soundness!$B$6=\"\",\"\",Soundness!$B$6)","v":"Tex-411-A "},{"$f":"IF(Soundness!$B$24=\"\",\"\",Soundness!$B$24)","v":"Passing"},{"$f":"IF(Soundness!$B$27=\"\",\"\",Soundness!$B$27)","v":""},{"$f":"IF(Soundness!$B$22=\"\",\"\",Soundness!$B$22)","v":"Particle Size Range"},{"$f":"IF(Soundness!$C$24=\"\",\"\",Soundness!$C$24)","v":"Retained"},{"$f":"IF(Soundness!$C$27=\"\",\"\",Soundness!$C$27)","v":""},{"$f":"IF(Soundness!$F$22=\"\",\"\",Soundness!$F$22)","v":"Loss of Weight (g)"}]
[8,{"$f":"IF(Soundness!$G$27=\"\",\"\",Soundness!$G$27)","v":""},{"$f":"IF(Soundness!$B$6=\"\",\"\",Soundness!$B$6)","v":"Tex-411-A "},{"$f":"IF(Soundness!$B$24=\"\",\"\",Soundness!$B$24)","v":"Passing"},{"$f":"IF(Soundness!$B$27=\"\",\"\",Soundness!$B$27)","v":""},{"$f":"IF(Soundness!$B$22=\"\",\"\",Soundness!$B$22)","v":"Particle Size Range"},{"$f":"IF(Soundness!$C$24=\"\",\"\",Soundness!$C$24)","v":"Retained"},{"$f":"IF(Soundness!$C$27=\"\",\"\",Soundness!$C$27)","v":""},{"$f":"IF(Soundness!$G$22=\"\",\"\",Soundness!$G$22)","v":"% Loss"}]
[9,{"$f":"IF(Soundness!$H$27=\"\",\"\",Soundness!$H$27)","v":""},{"$f":"IF(Soundness!$B$6=\"\",\"\",Soundness!$B$6)","v":"Tex-411-A "},{"$f":"IF(Soundness!$B$24=\"\",\"\",Soundness!$B$24)","v":"Passing"},{"$f":"IF(Soundness!$B$27=\"\",\"\",Soundness!$B$27)","v":""},{"$f":"IF(Soundness!$B$22=\"\",\"\",Soundness!$B$22)","v":"Particle Size Range"},{"$f":"IF(Soundness!$C$24=\"\",\"\",Soundness!$C$24)","v":"Retained"},{"$f":"IF(Soundness!$C$27=\"\",\"\",Soundness!$C$27)","v":""},{"$f":"IF(Soundness!$H$22=\"\",\"\",Soundness!$H$22)","v":"Normalized Individual Percent Retained"}]
[10,{"$f":"IF(Soundness!$I$27=\"\",\"\",Soundness!$I$27)","v":""},{"$f":"IF(Soundness!$B$6=\"\",\"\",Soundness!$B$6)","v":"Tex-411-A "},{"$f":"IF(Soundness!$B$24=\"\",\"\",Soundness!$B$24)","v":"Passing"},{"$f":"IF(Soundness!$B$27=\"\",\"\",Soundness!$B$27)","v":""},{"$f":"IF(Soundness!$B$22=\"\",\"\",Soundness!$B$22)","v":"Particle Size Range"},{"$f":"IF(Soundness!$C$24=\"\",\"\",Soundness!$C$24)","v":"Retained"},{"$f":"IF(Soundness!$C$27=\"\",\"\",Soundness!$C$27)","v":""},{"$f":"IF(Soundness!$I$22=\"\",\"\",Soundness!$I$22)","v":"Weighted Average % Loss"}]
[11,{"$f":"IF(Soundness!$D$28=\"\",\"\",Soundness!$D$28)","v":""},{"$f":"IF(Soundness!$B$6=\"\",\"\",Soundness!$B$6)","v":"Tex-411-A "},{"$f":"IF(Soundness!$B$24=\"\",\"\",Soundness!$B$24)","v":"Passing"},{"$f":"IF(Soundness!$B$28=\"\",\"\",Soundness!$B$28)","v":""},{"$f":"IF(Soundness!$B$22=\"\",\"\",Soundness!$B$22)","v":"Particle Size Range"},{"$f":"IF(Soundness!$C$24=\"\",\"\",Soundness!$C$24)","v":"Retained"},{"$f":"IF(Soundness!$C$28=\"\",\"\",Soundness!$C$28)","v":""},{"$f":"IF(Soundness!$D$22=\"\",\"\",Soundness!$D$22)","v":"Initial Weight (g)"}]
[12,{"$f":"IF(Soundness!$E$28=\"\",\"\",Soundness!$E$28)","v":""},{"$f":"IF(Soundness!$B$6=\"\",\"\",Soundness!$B$6)","v":"Tex-411-A "},{"$f":"IF(Soundness!$B$24=\"\",\"\",Soundness!$B$24)","v":"Passing"},{"$f":"IF(Soundness!$B$28=\"\",\"\",Soundness!$B$28)","v":""},{"$f":"IF(Soundness!$B$22=\"\",\"\",Soundness!$B$22)","v":"Particle Size Range"},{"$f":"IF(Soundness!$C$24=\"\",\"\",Soundness!$C$24)","v":"Retained"},{"$f":"IF(Soundness!$C$28=\"\",\"\",Soundness!$C$28)","v":""},{"$f":"IF(Soundness!$E$22=\"\",\"\",Soundness!$E$22)","v":"Final Weight (g)"}]
[13,{"$f":"IF(Soundness!$F$28=\"\",\"\",Soundness!$F$28)","v":""},{"$f":"IF(Soundness!$B$6=\"\",\"\",Soundness!$B$6)","v":"Tex-411-A "},{"$f":"IF(Soundness!$B$24=\"\",\"\",Soundness!$B$24)","v":"Passing"},{"$f":"IF(Soundness!$B$28=\"\",\"\",Soundness!$B$28)","v":""},{"$f":"IF(Soundness!$B$22=\"\",\"\",Soundness!$B$22)","v":"Particle Size Range"},{"$f":"IF(Soundness!$C$24=\"\",\"\",Soundness!$C$24)","v":"Retained"},{"$f":"IF(Soundness!$C$28=\"\",\"\",Soundness!$C$28)","v":""},{"$f":"IF(Soundness!$F$22=\"\",\"\",Soundness!$F$22)","v":"Loss of Weight (g)"}]
[14,{"$f":"IF(Soundness!$G$28=\"\",\"\",Soundness!$G$28)","v":""},{"$f":"IF(Soundness!$B$6=\"\",\"\",Soundness!$B$6)","v":"Tex-411-A "},{"$f":"IF(Soundness!$B$24=\"\",\"\",Soundness!$B$24)","v":"Passing"},{"$f":"IF(Soundness!$B$28=\"\",\"\",Soundness!$B$28)","v":""},{"$f":"IF(Soundness!$B$22=\"\",\"\",Soundness!$B$22)","v":"Particle Size Range"},{"$f":"IF(Soundness!$C$24=\"\",\"\",Soundness!$C$24)","v":"Retained"},{"$f":"IF(Soundness!$C$28=\"\",\"\",Soundness!$C$28)","v":""},{"$f":"IF(Soundness!$G$22=\"\",\"\",Soundness!$G$22)","v":"% Loss"}]
[15,{"$f":"IF(Soundness!$H$28=\"\",\"\",Soundness!$H$28)","v":""},{"$f":"IF(Soundness!$B$6=\"\",\"\",Soundness!$B$6)","v":"Tex-411-A "},{"$f":"IF(Soundness!$B$24=\"\",\"\",Soundness!$B$24)","v":"Passing"},{"$f":"IF(Soundness!$B$28=\"\",\"\",Soundness!$B$28)","v":""},{"$f":"IF(Soundness!$B$22=\"\",\"\",Soundness!$B$22)","v":"Particle Size Range"},{"$f":"IF(Soundness!$C$24=\"\",\"\",Soundness!$C$24)","v":"Retained"},{"$f":"IF(Soundness!$C$28=\"\",\"\",Soundness!$C$28)","v":""},{"$f":"IF(Soundness!$H$22=\"\",\"\",Soundness!$H$22)","v":"Normalized Individual Percent Retained"}]
[16,{"$f":"IF(Soundness!$I$28=\"\",\"\",Soundness!$I$28)","v":""},{"$f":"IF(Soundness!$B$6=\"\",\"\",Soundness!$B$6)","v":"Tex-411-A "},{"$f":"IF(Soundness!$B$24=\"\",\"\",Soundness!$B$24)","v":"Passing"},{"$f":"IF(Soundness!$B$28=\"\",\"\",Soundness!$B$28)","v":""},{"$f":"IF(Soundness!$B$22=\"\",\"\",Soundness!$B$22)","v":"Particle Size Range"},{"$f":"IF(Soundness!$C$24=\"\",\"\",Soundness!$C$24)","v":"Retained"},{"$f":"IF(Soundness!$C$28=\"\",\"\",Soundness!$C$28)","v":""},{"$f":"IF(Soundness!$I$22=\"\",\"\",Soundness!$I$22)","v":"Weighted Average % Loss"}]
[17,{"$f":"IF(Soundness!$D$29=\"\",\"\",Soundness!$D$29)","v":""},{"$f":"IF(Soundness!$B$6=\"\",\"\",Soundness!$B$6)","v":"Tex-411-A "},{"$f":"IF(Soundness!$B$24=\"\",\"\",Soundness!$B$24)","v":"Passing"},{"$f":"IF(Soundness!$B$29=\"\",\"\",Soundness!$B$29)","v":""},{"$f":"IF(Soundness!$B$22=\"\",\"\",Soundness!$B$22)","v":"Particle Size Range"},{"$f":"IF(Soundness!$C$24=\"\",\"\",Soundness!$C$24)","v":"Retained"},{"$f":"IF(Soundness!$C$29=\"\",\"\",Soundness!$C$29)","v":""},{"$f":"IF(Soundness!$D$22=\"\",\"\",Soundness!$D$22)","v":"Initial Weight (g)"}]
[18,{"$f":"IF(Soundness!$E$29=\"\",\"\",Soundness!$E$29)","v":""},{"$f":"IF(Soundness!$B$6=\"\",\"\",Soundness!$B$6)","v":"Tex-411-A "},{"$f":"IF(Soundness!$B$24=\"\",\"\",Soundness!$B$24)","v":"Passing"},{"$f":"IF(Soundness!$B$29=\"\",\"\",Soundness!$B$29)","v":""},{"$f":"IF(Soundness!$B$22=\"\",\"\",Soundness!$B$22)","v":"Particle Size Range"},{"$f":"IF(Soundness!$C$24=\"\",\"\",Soundness!$C$24)","v":"Retained"},{"$f":"IF(Soundness!$C$29=\"\",\"\",Soundness!$C$29)","v":""},{"$f":"IF(Soundness!$E$22=\"\",\"\",Soundness!$E$22)","v":"Final Weight (g)"}]
[19,{"$f":"IF(Soundness!$F$29=\"\",\"\",Soundness!$F$29)","v":""},{"$f":"IF(Soundness!$B$6=\"\",\"\",Soundness!$B$6)","v":"Tex-411-A "},{"$f":"IF(Soundness!$B$24=\"\",\"\",Soundness!$B$24)","v":"Passing"},{"$f":"IF(Soundness!$B$29=\"\",\"\",Soundness!$B$29)","v":""},{"$f":"IF(Soundness!$B$22=\"\",\"\",Soundness!$B$22)","v":"Particle Size Range"},{"$f":"IF(Soundness!$C$24=\"\",\"\",Soundness!$C$24)","v":"Retained"},{"$f":"IF(Soundness!$C$29=\"\",\"\",Soundness!$C$29)","v":""},{"$f":"IF(Soundness!$F$22=\"\",\"\",Soundness!$F$22)","v":"Loss of Weight (g)"}]
[20,{"$f":"IF(Soundness!$G$29=\"\",\"\",Soundness!$G$29)","v":""},{"$f":"IF(Soundness!$B$6=\"\",\"\",Soundness!$B$6)","v":"Tex-411-A "},{"$f":"IF(Soundness!$B$24=\"\",\"\",Soundness!$B$24)","v":"Passing"},{"$f":"IF(Soundness!$B$29=\"\",\"\",Soundness!$B$29)","v":""},{"$f":"IF(Soundness!$B$22=\"\",\"\",Soundness!$B$22)","v":"Particle Size Range"},{"$f":"IF(Soundness!$C$24=\"\",\"\",Soundness!$C$24)","v":"Retained"},{"$f":"IF(Soundness!$C$29=\"\",\"\",Soundness!$C$29)","v":""},{"$f":"IF(Soundness!$G$22=\"\",\"\",Soundness!$G$22)","v":"% Loss"}]
[21,{"$f":"IF(Soundness!$H$29=\"\",\"\",Soundness!$H$29)","v":""},{"$f":"IF(Soundness!$B$6=\"\",\"\",Soundness!$B$6)","v":"Tex-411-A "},{"$f":"IF(Soundness!$B$24=\"\",\"\",Soundness!$B$24)","v":"Passing"},{"$f":"IF(Soundness!$B$29=\"\",\"\",Soundness!$B$29)","v":""},{"$f":"IF(Soundness!$B$22=\"\",\"\",Soundness!$B$22)","v":"Particle Size Range"},{"$f":"IF(Soundness!$C$24=\"\",\"\",Soundness!$C$24)","v":"Retained"},{"$f":"IF(Soundness!$C$29=\"\",\"\",Soundness!$C$29)","v":""},{"$f":"IF(Soundness!$H$22=\"\",\"\",Soundness!$H$22)","v":"Normalized Individual Percent Retained"}]
[22,{"$f":"IF(Soundness!$I$29=\"\",\"\",Soundness!$I$29)","v":""},{"$f":"IF(Soundness!$B$6=\"\",\"\",Soundness!$B$6)","v":"Tex-411-A "},{"$f":"IF(Soundness!$B$24=\"\",\"\",Soundness!$B$24)","v":"Passing"},{"$f":"IF(Soundness!$B$29=\"\",\"\",Soundness!$B$29)","v":""},{"$f":"IF(Soundness!$B$22=\"\",\"\",Soundness!$B$22)","v":"Particle Size Range"},{"$f":"IF(Soundness!$C$24=\"\",\"\",Soundness!$C$24)","v":"Retained"},{"$f":"IF(Soundness!$C$29=\"\",\"\",Soundness!$C$29)","v":""},{"$f":"IF(Soundness!$I$22=\"\",\"\",Soundness!$I$22)","v":"Weighted Average % Loss"}]
[23,{"$f":"IF(Soundness!$D$30=\"\",\"\",Soundness!$D$30)","v":""},{"$f":"IF(Soundness!$B$6=\"\",\"\",Soundness!$B$6)","v":"Tex-411-A "},{"$f":"IF(Soundness!$B$24=\"\",\"\",Soundness!$B$24)","v":"Passing"},{"$f":"IF(Soundness!$B$30=\"\",\"\",Soundness!$B$30)","v":""},{"$f":"IF(Soundness!$B$22=\"\",\"\",Soundness!$B$22)","v":"Particle Size Range"},{"$f":"IF(Soundness!$C$24=\"\",\"\",Soundness!$C$24)","v":"Retained"},{"$f":"IF(Soundness!$C$30=\"\",\"\",Soundness!$C$30)","v":""},{"$f":"IF(Soundness!$D$22=\"\",\"\",Soundness!$D$22)","v":"Initial Weight (g)"}]
[24,{"$f":"IF(Soundness!$E$30=\"\",\"\",Soundness!$E$30)","v":""},{"$f":"IF(Soundness!$B$6=\"\",\"\",Soundness!$B$6)","v":"Tex-411-A "},{"$f":"IF(Soundness!$B$24=\"\",\"\",Soundness!$B$24)","v":"Passing"},{"$f":"IF(Soundness!$B$30=\"\",\"\",Soundness!$B$30)","v":""},{"$f":"IF(Soundness!$B$22=\"\",\"\",Soundness!$B$22)","v":"Particle Size Range"},{"$f":"IF(Soundness!$C$24=\"\",\"\",Soundness!$C$24)","v":"Retained"},{"$f":"IF(Soundness!$C$30=\"\",\"\",Soundness!$C$30)","v":""},{"$f":"IF(Soundness!$E$22=\"\",\"\",Soundness!$E$22)","v":"Final Weight (g)"}]
[25,{"$f":"IF(Soundness!$F$30=\"\",\"\",Soundness!$F$30)","v":""},{"$f":"IF(Soundness!$B$6=\"\",\"\",Soundness!$B$6)","v":"Tex-411-A "},{"$f":"IF(Soundness!$B$24=\"\",\"\",Soundness!$B$24)","v":"Passing"},{"$f":"IF(Soundness!$B$30=\"\",\"\",Soundness!$B$30)","v":""},{"$f":"IF(Soundness!$B$22=\"\",\"\",Soundness!$B$22)","v":"Particle Size Range"},{"$f":"IF(Soundness!$C$24=\"\",\"\",Soundness!$C$24)","v":"Retained"},{"$f":"IF(Soundness!$C$30=\"\",\"\",Soundness!$C$30)","v":""},{"$f":"IF(Soundness!$F$22=\"\",\"\",Soundness!$F$22)","v":"Loss of Weight (g)"}]
[26,{"$f":"IF(Soundness!$G$30=\"\",\"\",Soundness!$G$30)","v":""},{"$f":"IF(Soundness!$B$6=\"\",\"\",Soundness!$B$6)","v":"Tex-411-A "},{"$f":"IF(Soundness!$B$24=\"\",\"\",Soundness!$B$24)","v":"Passing"},{"$f":"IF(Soundness!$B$30=\"\",\"\",Soundness!$B$30)","v":""},{"$f":"IF(Soundness!$B$22=\"\",\"\",Soundness!$B$22)","v":"Particle Size Range"},{"$f":"IF(Soundness!$C$24=\"\",\"\",Soundness!$C$24)","v":"Retained"},{"$f":"IF(Soundness!$C$30=\"\",\"\",Soundness!$C$30)","v":""},{"$f":"IF(Soundness!$G$22=\"\",\"\",Soundness!$G$22)","v":"% Loss"}]
[27,{"$f":"IF(Soundness!$H$30=\"\",\"\",Soundness!$H$30)","v":""},{"$f":"IF(Soundness!$B$6=\"\",\"\",Soundness!$B$6)","v":"Tex-411-A "},{"$f":"IF(Soundness!$B$24=\"\",\"\",Soundness!$B$24)","v":"Passing"},{"$f":"IF(Soundness!$B$30=\"\",\"\",Soundness!$B$30)","v":""},{"$f":"IF(Soundness!$B$22=\"\",\"\",Soundness!$B$22)","v":"Particle Size Range"},{"$f":"IF(Soundness!$C$24=\"\",\"\",Soundness!$C$24)","v":"Retained"},{"$f":"IF(Soundness!$C$30=\"\",\"\",Soundness!$C$30)","v":""},{"$f":"IF(Soundness!$H$22=\"\",\"\",Soundness!$H$22)","v":"Normalized Individual Percent Retained"}]
[28,{"$f":"IF(Soundness!$I$30=\"\",\"\",Soundness!$I$30)","v":""},{"$f":"IF(Soundness!$B$6=\"\",\"\",Soundness!$B$6)","v":"Tex-411-A "},{"$f":"IF(Soundness!$B$24=\"\",\"\",Soundness!$B$24)","v":"Passing"},{"$f":"IF(Soundness!$B$30=\"\",\"\",Soundness!$B$30)","v":""},{"$f":"IF(Soundness!$B$22=\"\",\"\",Soundness!$B$22)","v":"Particle Size Range"},{"$f":"IF(Soundness!$C$24=\"\",\"\",Soundness!$C$24)","v":"Retained"},{"$f":"IF(Soundness!$C$30=\"\",\"\",Soundness!$C$30)","v":""},{"$f":"IF(Soundness!$I$22=\"\",\"\",Soundness!$I$22)","v":"Weighted Average % Loss"}]
[29,{"$f":"IF(Soundness!$D$31=\"\",\"\",Soundness!$D$31)","v":""},{"$f":"IF(Soundness!$B$6=\"\",\"\",Soundness!$B$6)","v":"Tex-411-A "},{"$f":"IF(Soundness!$B$24=\"\",\"\",Soundness!$B$24)","v":"Passing"},{"$f":"IF(Soundness!$B$31=\"\",\"\",Soundness!$B$31)","v":""},{"$f":"IF(Soundness!$B$22=\"\",\"\",Soundness!$B$22)","v":"Particle Size Range"},{"$f":"IF(Soundness!$C$24=\"\",\"\",Soundness!$C$24)","v":"Retained"},{"$f":"IF(Soundness!$C$31=\"\",\"\",Soundness!$C$31)","v":""},{"$f":"IF(Soundness!$D$22=\"\",\"\",Soundness!$D$22)","v":"Initial Weight (g)"}]
[30,{"$f":"IF(Soundness!$E$31=\"\",\"\",Soundness!$E$31)","v":""},{"$f":"IF(Soundness!$B$6=\"\",\"\",Soundness!$B$6)","v":"Tex-411-A "},{"$f":"IF(Soundness!$B$24=\"\",\"\",Soundness!$B$24)","v":"Passing"},{"$f":"IF(Soundness!$B$31=\"\",\"\",Soundness!$B$31)","v":""},{"$f":"IF(Soundness!$B$22=\"\",\"\",Soundness!$B$22)","v":"Particle Size Range"},{"$f":"IF(Soundness!$C$24=\"\",\"\",Soundness!$C$24)","v":"Retained"},{"$f":"IF(Soundness!$C$31=\"\",\"\",Soundness!$C$31)","v":""},{"$f":"IF(Soundness!$E$22=\"\",\"\",Soundness!$E$22)","v":"Final Weight (g)"}]
[31,{"$f":"IF(Soundness!$F$31=\"\",\"\",Soundness!$F$31)","v":""},{"$f":"IF(Soundness!$B$6=\"\",\"\",Soundness!$B$6)","v":"Tex-411-A "},{"$f":"IF(Soundness!$B$24=\"\",\"\",Soundness!$B$24)","v":"Passing"},{"$f":"IF(Soundness!$B$31=\"\",\"\",Soundness!$B$31)","v":""},{"$f":"IF(Soundness!$B$22=\"\",\"\",Soundness!$B$22)","v":"Particle Size Range"},{"$f":"IF(Soundness!$C$24=\"\",\"\",Soundness!$C$24)","v":"Retained"},{"$f":"IF(Soundness!$C$31=\"\",\"\",Soundness!$C$31)","v":""},{"$f":"IF(Soundness!$F$22=\"\",\"\",Soundness!$F$22)","v":"Loss of Weight (g)"}]
[32,{"$f":"IF(Soundness!$G$31=\"\",\"\",Soundness!$G$31)","v":""},{"$f":"IF(Soundness!$B$6=\"\",\"\",Soundness!$B$6)","v":"Tex-411-A "},{"$f":"IF(Soundness!$B$24=\"\",\"\",Soundness!$B$24)","v":"Passing"},{"$f":"IF(Soundness!$B$31=\"\",\"\",Soundness!$B$31)","v":""},{"$f":"IF(Soundness!$B$22=\"\",\"\",Soundness!$B$22)","v":"Particle Size Range"},{"$f":"IF(Soundness!$C$24=\"\",\"\",Soundness!$C$24)","v":"Retained"},{"$f":"IF(Soundness!$C$31=\"\",\"\",Soundness!$C$31)","v":""},{"$f":"IF(Soundness!$G$22=\"\",\"\",Soundness!$G$22)","v":"% Loss"}]
[33,{"$f":"IF(Soundness!$H$31=\"\",\"\",Soundness!$H$31)","v":""},{"$f":"IF(Soundness!$B$6=\"\",\"\",Soundness!$B$6)","v":"Tex-411-A "},{"$f":"IF(Soundness!$B$24=\"\",\"\",Soundness!$B$24)","v":"Passing"},{"$f":"IF(Soundness!$B$31=\"\",\"\",Soundness!$B$31)","v":""},{"$f":"IF(Soundness!$B$22=\"\",\"\",Soundness!$B$22)","v":"Particle Size Range"},{"$f":"IF(Soundness!$C$24=\"\",\"\",Soundness!$C$24)","v":"Retained"},{"$f":"IF(Soundness!$C$31=\"\",\"\",Soundness!$C$31)","v":""},{"$f":"IF(Soundness!$H$22=\"\",\"\",Soundness!$H$22)","v":"Normalized Individual Percent Retained"}]
[34,{"$f":"IF(Soundness!$I$31=\"\",\"\",Soundness!$I$31)","v":""},{"$f":"IF(Soundness!$B$6=\"\",\"\",Soundness!$B$6)","v":"Tex-411-A "},{"$f":"IF(Soundness!$B$24=\"\",\"\",Soundness!$B$24)","v":"Passing"},{"$f":"IF(Soundness!$B$31=\"\",\"\",Soundness!$B$31)","v":""},{"$f":"IF(Soundness!$B$22=\"\",\"\",Soundness!$B$22)","v":"Particle Size Range"},{"$f":"IF(Soundness!$C$24=\"\",\"\",Soundness!$C$24)","v":"Retained"},{"$f":"IF(Soundness!$C$31=\"\",\"\",Soundness!$C$31)","v":""},{"$f":"IF(Soundness!$I$22=\"\",\"\",Soundness!$I$22)","v":"Weighted Average % Loss"}]
[35,{"$f":"IF(Soundness!$D$32=\"\",\"\",Soundness!$D$32)","v":""},{"$f":"IF(Soundness!$B$6=\"\",\"\",Soundness!$B$6)","v":"Tex-411-A "},{"$f":"IF(Soundness!$B$24=\"\",\"\",Soundness!$B$24)","v":"Passing"},{"$f":"IF(Soundness!$B$32=\"\",\"\",Soundness!$B$32)","v":""},{"$f":"IF(Soundness!$B$22=\"\",\"\",Soundness!$B$22)","v":"Particle Size Range"},{"$f":"IF(Soundness!$C$24=\"\",\"\",Soundness!$C$24)","v":"Retained"},{"$f":"IF(Soundness!$C$32=\"\",\"\",Soundness!$C$32)","v":""},{"$f":"IF(Soundness!$D$22=\"\",\"\",Soundness!$D$22)","v":"Initial Weight (g)"}]
[36,{"$f":"IF(Soundness!$E$32=\"\",\"\",Soundness!$E$32)","v":""},{"$f":"IF(Soundness!$B$6=\"\",\"\",Soundness!$B$6)","v":"Tex-411-A "},{"$f":"IF(Soundness!$B$24=\"\",\"\",Soundness!$B$24)","v":"Passing"},{"$f":"IF(Soundness!$B$32=\"\",\"\",Soundness!$B$32)","v":""},{"$f":"IF(Soundness!$B$22=\"\",\"\",Soundness!$B$22)","v":"Particle Size Range"},{"$f":"IF(Soundness!$C$24=\"\",\"\",Soundness!$C$24)","v":"Retained"},{"$f":"IF(Soundness!$C$32=\"\",\"\",Soundness!$C$32)","v":""},{"$f":"IF(Soundness!$E$22=\"\",\"\",Soundness!$E$22)","v":"Final Weight (g)"}]
[37,{"$f":"IF(Soundness!$F$32=\"\",\"\",Soundness!$F$32)","v":""},{"$f":"IF(Soundness!$B$6=\"\",\"\",Soundness!$B$6)","v":"Tex-411-A "},{"$f":"IF(Soundness!$B$24=\"\",\"\",Soundness!$B$24)","v":"Passing"},{"$f":"IF(Soundness!$B$32=\"\",\"\",Soundness!$B$32)","v":""},{"$f":"IF(Soundness!$B$22=\"\",\"\",Soundness!$B$22)","v":"Particle Size Range"},{"$f":"IF(Soundness!$C$24=\"\",\"\",Soundness!$C$24)","v":"Retained"},{"$f":"IF(Soundness!$C$32=\"\",\"\",Soundness!$C$32)","v":""},{"$f":"IF(Soundness!$F$22=\"\",\"\",Soundness!$F$22)","v":"Loss of Weight (g)"}]
[38,{"$f":"IF(Soundness!$G$32=\"\",\"\",Soundness!$G$32)","v":""},{"$f":"IF(Soundness!$B$6=\"\",\"\",Soundness!$B$6)","v":"Tex-411-A "},{"$f":"IF(Soundness!$B$24=\"\",\"\",Soundness!$B$24)","v":"Passing"},{"$f":"IF(Soundness!$B$32=\"\",\"\",Soundness!$B$32)","v":""},{"$f":"IF(Soundness!$B$22=\"\",\"\",Soundness!$B$22)","v":"Particle Size Range"},{"$f":"IF(Soundness!$C$24=\"\",\"\",Soundness!$C$24)","v":"Retained"},{"$f":"IF(Soundness!$C$32=\"\",\"\",Soundness!$C$32)","v":""},{"$f":"IF(Soundness!$G$22=\"\",\"\",Soundness!$G$22)","v":"% Loss"}]
[39,{"$f":"IF(Soundness!$H$32=\"\",\"\",Soundness!$H$32)","v":""},{"$f":"IF(Soundness!$B$6=\"\",\"\",Soundness!$B$6)","v":"Tex-411-A "},{"$f":"IF(Soundness!$B$24=\"\",\"\",Soundness!$B$24)","v":"Passing"},{"$f":"IF(Soundness!$B$32=\"\",\"\",Soundness!$B$32)","v":""},{"$f":"IF(Soundness!$B$22=\"\",\"\",Soundness!$B$22)","v":"Particle Size Range"},{"$f":"IF(Soundness!$C$24=\"\",\"\",Soundness!$C$24)","v":"Retained"},{"$f":"IF(Soundness!$C$32=\"\",\"\",Soundness!$C$32)","v":""},{"$f":"IF(Soundness!$H$22=\"\",\"\",Soundness!$H$22)","v":"Normalized Individual Percent Retained"}]
[40,{"$f":"IF(Soundness!$I$32=\"\",\"\",Soundness!$I$32)","v":""},{"$f":"IF(Soundness!$B$6=\"\",\"\",Soundness!$B$6)","v":"Tex-411-A "},{"$f":"IF(Soundness!$B$24=\"\",\"\",Soundness!$B$24)","v":"Passing"},{"$f":"IF(Soundness!$B$32=\"\",\"\",Soundness!$B$32)","v":""},{"$f":"IF(Soundness!$B$22=\"\",\"\",Soundness!$B$22)","v":"Particle Size Range"},{"$f":"IF(Soundness!$C$24=\"\",\"\",Soundness!$C$24)","v":"Retained"},{"$f":"IF(Soundness!$C$32=\"\",\"\",Soundness!$C$32)","v":""},{"$f":"IF(Soundness!$I$22=\"\",\"\",Soundness!$I$22)","v":"Weighted Average % Loss"}]
[41,{"$f":"IF(Soundness!$D$33=\"\",\"\",Soundness!$D$33)","v":""},{"$f":"IF(Soundness!$B$6=\"\",\"\",Soundness!$B$6)","v":"Tex-411-A "},{"$f":"IF(Soundness!$B$24=\"\",\"\",Soundness!$B$24)","v":"Passing"},{"$f":"IF(Soundness!$B$33=\"\",\"\",Soundness!$B$33)","v":""},{"$f":"IF(Soundness!$B$22=\"\",\"\",Soundness!$B$22)","v":"Particle Size Range"},{"$f":"IF(Soundness!$C$24=\"\",\"\",Soundness!$C$24)","v":"Retained"},{"$f":"IF(Soundness!$C$33=\"\",\"\",Soundness!$C$33)","v":""},{"$f":"IF(Soundness!$D$22=\"\",\"\",Soundness!$D$22)","v":"Initial Weight (g)"}]
[42,{"$f":"IF(Soundness!$E$33=\"\",\"\",Soundness!$E$33)","v":""},{"$f":"IF(Soundness!$B$6=\"\",\"\",Soundness!$B$6)","v":"Tex-411-A "},{"$f":"IF(Soundness!$B$24=\"\",\"\",Soundness!$B$24)","v":"Passing"},{"$f":"IF(Soundness!$B$33=\"\",\"\",Soundness!$B$33)","v":""},{"$f":"IF(Soundness!$B$22=\"\",\"\",Soundness!$B$22)","v":"Particle Size Range"},{"$f":"IF(Soundness!$C$24=\"\",\"\",Soundness!$C$24)","v":"Retained"},{"$f":"IF(Soundness!$C$33=\"\",\"\",Soundness!$C$33)","v":""},{"$f":"IF(Soundness!$E$22=\"\",\"\",Soundness!$E$22)","v":"Final Weight (g)"}]
[43,{"$f":"IF(Soundness!$F$33=\"\",\"\",Soundness!$F$33)","v":""},{"$f":"IF(Soundness!$B$6=\"\",\"\",Soundness!$B$6)","v":"Tex-411-A "},{"$f":"IF(Soundness!$B$24=\"\",\"\",Soundness!$B$24)","v":"Passing"},{"$f":"IF(Soundness!$B$33=\"\",\"\",Soundness!$B$33)","v":""},{"$f":"IF(Soundness!$B$22=\"\",\"\",Soundness!$B$22)","v":"Particle Size Range"},{"$f":"IF(Soundness!$C$24=\"\",\"\",Soundness!$C$24)","v":"Retained"},{"$f":"IF(Soundness!$C$33=\"\",\"\",Soundness!$C$33)","v":""},{"$f":"IF(Soundness!$F$22=\"\",\"\",Soundness!$F$22)","v":"Loss of Weight (g)"}]
[44,{"$f":"IF(Soundness!$G$33=\"\",\"\",Soundness!$G$33)","v":""},{"$f":"IF(Soundness!$B$6=\"\",\"\",Soundness!$B$6)","v":"Tex-411-A "},{"$f":"IF(Soundness!$B$24=\"\",\"\",Soundness!$B$24)","v":"Passing"},{"$f":"IF(Soundness!$B$33=\"\",\"\",Soundness!$B$33)","v":""},{"$f":"IF(Soundness!$B$22=\"\",\"\",Soundness!$B$22)","v":"Particle Size Range"},{"$f":"IF(Soundness!$C$24=\"\",\"\",Soundness!$C$24)","v":"Retained"},{"$f":"IF(Soundness!$C$33=\"\",\"\",Soundness!$C$33)","v":""},{"$f":"IF(Soundness!$G$22=\"\",\"\",Soundness!$G$22)","v":"% Loss"}]
[45,{"$f":"IF(Soundness!$H$33=\"\",\"\",Soundness!$H$33)","v":""},{"$f":"IF(Soundness!$B$6=\"\",\"\",Soundness!$B$6)","v":"Tex-411-A "},{"$f":"IF(Soundness!$B$24=\"\",\"\",Soundness!$B$24)","v":"Passing"},{"$f":"IF(Soundness!$B$33=\"\",\"\",Soundness!$B$33)","v":""},{"$f":"IF(Soundness!$B$22=\"\",\"\",Soundness!$B$22)","v":"Particle Size Range"},{"$f":"IF(Soundness!$C$24=\"\",\"\",Soundness!$C$24)","v":"Retained"},{"$f":"IF(Soundness!$C$33=\"\",\"\",Soundness!$C$33)","v":""},{"$f":"IF(Soundness!$H$22=\"\",\"\",Soundness!$H$22)","v":"Normalized Individual Percent Retained"}]
[46,{"$f":"IF(Soundness!$I$33=\"\",\"\",Soundness!$I$33)","v":""},{"$f":"IF(Soundness!$B$6=\"\",\"\",Soundness!$B$6)","v":"Tex-411-A "},{"$f":"IF(Soundness!$B$24=\"\",\"\",Soundness!$B$24)","v":"Passing"},{"$f":"IF(Soundness!$B$33=\"\",\"\",Soundness!$B$33)","v":""},{"$f":"IF(Soundness!$B$22=\"\",\"\",Soundness!$B$22)","v":"Particle Size Range"},{"$f":"IF(Soundness!$C$24=\"\",\"\",Soundness!$C$24)","v":"Retained"},{"$f":"IF(Soundness!$C$33=\"\",\"\",Soundness!$C$33)","v":""},{"$f":"IF(Soundness!$I$22=\"\",\"\",Soundness!$I$22)","v":"Weighted Average % Loss"}]
[47,{"$f":"IF(Soundness!$D$34=\"\",\"\",Soundness!$D$34)","v":""},{"$f":"IF(Soundness!$B$6=\"\",\"\",Soundness!$B$6)","v":"Tex-411-A "},{"$f":"IF(Soundness!$B$24=\"\",\"\",Soundness!$B$24)","v":"Passing"},{"$f":"IF(Soundness!$B$34=\"\",\"\",Soundness!$B$34)","v":""},{"$f":"IF(Soundness!$B$22=\"\",\"\",Soundness!$B$22)","v":"Particle Size Range"},{"$f":"IF(Soundness!$C$24=\"\",\"\",Soundness!$C$24)","v":"Retained"},{"$f":"IF(Soundness!$C$34=\"\",\"\",Soundness!$C$34)","v":""},{"$f":"IF(Soundness!$D$22=\"\",\"\",Soundness!$D$22)","v":"Initial Weight (g)"}]
[48,{"$f":"IF(Soundness!$E$34=\"\",\"\",Soundness!$E$34)","v":""},{"$f":"IF(Soundness!$B$6=\"\",\"\",Soundness!$B$6)","v":"Tex-411-A "},{"$f":"IF(Soundness!$B$24=\"\",\"\",Soundness!$B$24)","v":"Passing"},{"$f":"IF(Soundness!$B$34=\"\",\"\",Soundness!$B$34)","v":""},{"$f":"IF(Soundness!$B$22=\"\",\"\",Soundness!$B$22)","v":"Particle Size Range"},{"$f":"IF(Soundness!$C$24=\"\",\"\",Soundness!$C$24)","v":"Retained"},{"$f":"IF(Soundness!$C$34=\"\",\"\",Soundness!$C$34)","v":""},{"$f":"IF(Soundness!$E$22=\"\",\"\",Soundness!$E$22)","v":"Final Weight (g)"}]
[49,{"$f":"IF(Soundness!$F$34=\"\",\"\",Soundness!$F$34)","v":""},{"$f":"IF(Soundness!$B$6=\"\",\"\",Soundness!$B$6)","v":"Tex-411-A "},{"$f":"IF(Soundness!$B$24=\"\",\"\",Soundness!$B$24)","v":"Passing"},{"$f":"IF(Soundness!$B$34=\"\",\"\",Soundness!$B$34)","v":""},{"$f":"IF(Soundness!$B$22=\"\",\"\",Soundness!$B$22)","v":"Particle Size Range"},{"$f":"IF(Soundness!$C$24=\"\",\"\",Soundness!$C$24)","v":"Retained"},{"$f":"IF(Soundness!$C$34=\"\",\"\",Soundness!$C$34)","v":""},{"$f":"IF(Soundness!$F$22=\"\",\"\",Soundness!$F$22)","v":"Loss of Weight (g)"}]
[50,{"$f":"IF(Soundness!$G$34=\"\",\"\",Soundness!$G$34)","v":""},{"$f":"IF(Soundness!$B$6=\"\",\"\",Soundness!$B$6)","v":"Tex-411-A "},{"$f":"IF(Soundness!$B$24=\"\",\"\",Soundness!$B$24)","v":"Passing"},{"$f":"IF(Soundness!$B$34=\"\",\"\",Soundness!$B$34)","v":""},{"$f":"IF(Soundness!$B$22=\"\",\"\",Soundness!$B$22)","v":"Particle Size Range"},{"$f":"IF(Soundness!$C$24=\"\",\"\",Soundness!$C$24)","v":"Retained"},{"$f":"IF(Soundness!$C$34=\"\",\"\",Soundness!$C$34)","v":""},{"$f":"IF(Soundness!$G$22=\"\",\"\",Soundness!$G$22)","v":"% Loss"}]
[51,{"$f":"IF(Soundness!$H$34=\"\",\"\",Soundness!$H$34)","v":""},{"$f":"IF(Soundness!$B$6=\"\",\"\",Soundness!$B$6)","v":"Tex-411-A "},{"$f":"IF(Soundness!$B$24=\"\",\"\",Soundness!$B$24)","v":"Passing"},{"$f":"IF(Soundness!$B$34=\"\",\"\",Soundness!$B$34)","v":""},{"$f":"IF(Soundness!$B$22=\"\",\"\",Soundness!$B$22)","v":"Particle Size Range"},{"$f":"IF(Soundness!$C$24=\"\",\"\",Soundness!$C$24)","v":"Retained"},{"$f":"IF(Soundness!$C$34=\"\",\"\",Soundness!$C$34)","v":""},{"$f":"IF(Soundness!$H$22=\"\",\"\",Soundness!$H$22)","v":"Normalized Individual Percent Retained"}]
[52,{"$f":"IF(Soundness!$I$34=\"\",\"\",Soundness!$I$34)","v":""},{"$f":"IF(Soundness!$B$6=\"\",\"\",Soundness!$B$6)","v":"Tex-411-A "},{"$f":"IF(Soundness!$B$24=\"\",\"\",Soundness!$B$24)","v":"Passing"},{"$f":"IF(Soundness!$B$34=\"\",\"\",Soundness!$B$34)","v":""},{"$f":"IF(Soundness!$B$22=\"\",\"\",Soundness!$B$22)","v":"Particle Size Range"},{"$f":"IF(Soundness!$C$24=\"\",\"\",Soundness!$C$24)","v":"Retained"},{"$f":"IF(Soundness!$C$34=\"\",\"\",Soundness!$C$34)","v":""},{"$f":"IF(Soundness!$I$22=\"\",\"\",Soundness!$I$22)","v":"Weighted Average % Loss"}]
[53,{"$f":"IF(Soundness!$G$35=\"\",\"\",Soundness!$G$35)","v":""},{"$f":"IF(Soundness!$B$6=\"\",\"\",Soundness!$B$6)","v":"Tex-411-A "},{"$f":"IF(Soundness!$F$35=\"\",\"\",Soundness!$F$35)","v":"Total:"},{"$f":"IF(Soundness!$G$22=\"\",\"\",Soundness!$G$22)","v":"% Loss"}]
[54,{"$f":"IF(Soundness!$H$35=\"\",\"\",Soundness!$H$35)","v":""},{"$f":"IF(Soundness!$B$6=\"\",\"\",Soundness!$B$6)","v":"Tex-411-A "},{"$f":"IF(Soundness!$F$35=\"\",\"\",Soundness!$F$35)","v":"Total:"},{"$f":"IF(Soundness!$H$22=\"\",\"\",Soundness!$H$22)","v":"Normalized Individual Percent Retained"}]
[55,{"$f":"IF(Soundness!$I$35=\"\",\"\",Soundness!$I$35)","v":""},{"$f":"IF(Soundness!$B$6=\"\",\"\",Soundness!$B$6)","v":"Tex-411-A "},{"$f":"IF(Soundness!$F$35=\"\",\"\",Soundness!$F$35)","v":"Total:"},{"$f":"IF(Soundness!$I$22=\"\",\"\",Soundness!$I$22)","v":"Weighted Average % Loss"}]
[56,{"$f":"IF(Soundness!$E$41=\"\",\"\",Soundness!$E$41)","v":""},{"$f":"IF(Soundness!$B$6=\"\",\"\",Soundness!$B$6)","v":"Tex-411-A "},{"$f":"IF(Soundness!$B$39=\"\",\"\",Soundness!$B$39)","v":"CYCLE"},{"$f":"IF(Soundness!$B$41=\"\",\"\",Soundness!$B$41)","v":"I"},{"$f":"IF(Soundness!$C$41=\"\",\"\",Soundness!$C$41)","v":"In solution"},{"$f":"IF(Soundness!$E$39=\"\",\"\",Soundness!$E$39)","v":"DATE"}]
[57,{"$f":"IF(Soundness!$F$41=\"\",\"\",Soundness!$F$41)","v":""},{"$f":"IF(Soundness!$B$6=\"\",\"\",Soundness!$B$6)","v":"Tex-411-A "},{"$f":"IF(Soundness!$B$39=\"\",\"\",Soundness!$B$39)","v":"CYCLE"},{"$f":"IF(Soundness!$B$41=\"\",\"\",Soundness!$B$41)","v":"I"},{"$f":"IF(Soundness!$C$41=\"\",\"\",Soundness!$C$41)","v":"In solution"},{"$f":"IF(Soundness!$F$39=\"\",\"\",Soundness!$F$39)","v":"TIME IN"}]
[58,{"$f":"IF(Soundness!$G$41=\"\",\"\",Soundness!$G$41)","v":""},{"$f":"IF(Soundness!$B$6=\"\",\"\",Soundness!$B$6)","v":"Tex-411-A "},{"$f":"IF(Soundness!$B$39=\"\",\"\",Soundness!$B$39)","v":"CYCLE"},{"$f":"IF(Soundness!$B$41=\"\",\"\",Soundness!$B$41)","v":"I"},{"$f":"IF(Soundness!$C$41=\"\",\"\",Soundness!$C$41)","v":"In solution"},{"$f":"IF(Soundness!$G$39=\"\",\"\",Soundness!$G$39)","v":"TIME OUT"}]
[59,{"$f":"IF(Soundness!$H$41=\"\",\"\",Soundness!$H$41)","v":""},{"$f":"IF(Soundness!$B$6=\"\",\"\",Soundness!$B$6)","v":"Tex-411-A "},{"$f":"IF(Soundness!$B$39=\"\",\"\",Soundness!$B$39)","v":"CYCLE"},{"$f":"IF(Soundness!$B$41=\"\",\"\",Soundness!$B$41)","v":"I"},{"$f":"IF(Soundness!$C$41=\"\",\"\",Soundness!$C$41)","v":"In solution"},{"$f":"IF(Soundness!$H$39=\"\",\"\",Soundness!$H$39)","v":"REMARKS"}]
[60,{"$f":"IF(Soundness!$E$42=\"\",\"\",Soundness!$E$42)","v":""},{"$f":"IF(Soundness!$B$6=\"\",\"\",Soundness!$B$6)","v":"Tex-411-A "},{"$f":"IF(Soundness!$B$39=\"\",\"\",Soundness!$B$39)","v":"CYCLE"},{"$f":"IF(Soundness!$B$41=\"\",\"\",Soundness!$B$41)","v":"I"},{"$f":"IF(Soundness!$C$42=\"\",\"\",Soundness!$C$42)","v":"Out of Solution"},{"$f":"IF(Soundness!$E$39=\"\",\"\",Soundness!$E$39)","v":"DATE"}]
[61,{"$f":"IF(Soundness!$F$42=\"\",\"\",Soundness!$F$42)","v":""},{"$f":"IF(Soundness!$B$6=\"\",\"\",Soundness!$B$6)","v":"Tex-411-A "},{"$f":"IF(Soundness!$B$39=\"\",\"\",Soundness!$B$39)","v":"CYCLE"},{"$f":"IF(Soundness!$B$41=\"\",\"\",Soundness!$B$41)","v":"I"},{"$f":"IF(Soundness!$C$42=\"\",\"\",Soundness!$C$42)","v":"Out of Solution"},{"$f":"IF(Soundness!$F$39=\"\",\"\",Soundness!$F$39)","v":"TIME IN"}]
[62,{"$f":"IF(Soundness!$G$42=\"\",\"\",Soundness!$G$42)","v":""},{"$f":"IF(Soundness!$B$6=\"\",\"\",Soundness!$B$6)","v":"Tex-411-A "},{"$f":"IF(Soundness!$B$39=\"\",\"\",Soundness!$B$39)","v":"CYCLE"},{"$f":"IF(Soundness!$B$41=\"\",\"\",Soundness!$B$41)","v":"I"},{"$f":"IF(Soundness!$C$42=\"\",\"\",Soundness!$C$42)","v":"Out of Solution"},{"$f":"IF(Soundness!$G$39=\"\",\"\",Soundness!$G$39)","v":"TIME OUT"}]
[63,{"$f":"IF(Soundness!$E$43=\"\",\"\",Soundness!$E$43)","v":""},{"$f":"IF(Soundness!$B$6=\"\",\"\",Soundness!$B$6)","v":"Tex-411-A "},{"$f":"IF(Soundness!$B$39=\"\",\"\",Soundness!$B$39)","v":"CYCLE"},{"$f":"IF(Soundness!$B$41=\"\",\"\",Soundness!$B$41)","v":"I"},{"$f":"IF(Soundness!$C$43=\"\",\"\",Soundness!$C$43)","v":"In oven"},{"$f":"IF(Soundness!$E$39=\"\",\"\",Soundness!$E$39)","v":"DATE"}]
[64,{"$f":"IF(Soundness!$F$43=\"\",\"\",Soundness!$F$43)","v":""},{"$f":"IF(Soundness!$B$6=\"\",\"\",Soundness!$B$6)","v":"Tex-411-A "},{"$f":"IF(Soundness!$B$39=\"\",\"\",Soundness!$B$39)","v":"CYCLE"},{"$f":"IF(Soundness!$B$41=\"\",\"\",Soundness!$B$41)","v":"I"},{"$f":"IF(Soundness!$C$43=\"\",\"\",Soundness!$C$43)","v":"In oven"},{"$f":"IF(Soundness!$F$39=\"\",\"\",Soundness!$F$39)","v":"TIME IN"}]
[65,{"$f":"IF(Soundness!$G$43=\"\",\"\",Soundness!$G$43)","v":""},{"$f":"IF(Soundness!$B$6=\"\",\"\",Soundness!$B$6)","v":"Tex-411-A "},{"$f":"IF(Soundness!$B$39=\"\",\"\",Soundness!$B$39)","v":"CYCLE"},{"$f":"IF(Soundness!$B$41=\"\",\"\",Soundness!$B$41)","v":"I"},{"$f":"IF(Soundness!$C$43=\"\",\"\",Soundness!$C$43)","v":"In oven"},{"$f":"IF(Soundness!$G$39=\"\",\"\",Soundness!$G$39)","v":"TIME OUT"}]
[66,{"$f":"IF(Soundness!$E$44=\"\",\"\",Soundness!$E$44)","v":""},{"$f":"IF(Soundness!$B$6=\"\",\"\",Soundness!$B$6)","v":"Tex-411-A "},{"$f":"IF(Soundness!$B$39=\"\",\"\",Soundness!$B$39)","v":"CYCLE"},{"$f":"IF(Soundness!$B$41=\"\",\"\",Soundness!$B$41)","v":"I"},{"$f":"IF(Soundness!$C$44=\"\",\"\",Soundness!$C$44)","v":"Out of oven"},{"$f":"IF(Soundness!$E$39=\"\",\"\",Soundness!$E$39)","v":"DATE"}]
[67,{"$f":"IF(Soundness!$F$44=\"\",\"\",Soundness!$F$44)","v":""},{"$f":"IF(Soundness!$B$6=\"\",\"\",Soundness!$B$6)","v":"Tex-411-A "},{"$f":"IF(Soundness!$B$39=\"\",\"\",Soundness!$B$39)","v":"CYCLE"},{"$f":"IF(Soundness!$B$41=\"\",\"\",Soundness!$B$41)","v":"I"},{"$f":"IF(Soundness!$C$44=\"\",\"\",Soundness!$C$44)","v":"Out of oven"},{"$f":"IF(Soundness!$F$39=\"\",\"\",Soundness!$F$39)","v":"TIME IN"}]
[68,{"$f":"IF(Soundness!$G$44=\"\",\"\",Soundness!$G$44)","v":""},{"$f":"IF(Soundness!$B$6=\"\",\"\",Soundness!$B$6)","v":"Tex-411-A "},{"$f":"IF(Soundness!$B$39=\"\",\"\",Soundness!$B$39)","v":"CYCLE"},{"$f":"IF(Soundness!$B$41=\"\",\"\",Soundness!$B$41)","v":"I"},{"$f":"IF(Soundness!$C$44=\"\",\"\",Soundness!$C$44)","v":"Out of oven"},{"$f":"IF(Soundness!$G$39=\"\",\"\",Soundness!$G$39)","v":"TIME OUT"}]
[69,{"$f":"IF(Soundness!$E$46=\"\",\"\",Soundness!$E$46)","v":""},{"$f":"IF(Soundness!$B$6=\"\",\"\",Soundness!$B$6)","v":"Tex-411-A "},{"$f":"IF(Soundness!$B$39=\"\",\"\",Soundness!$B$39)","v":"CYCLE"},{"$f":"IF(Soundness!$B$46=\"\",\"\",Soundness!$B$46)","v":"II"},{"$f":"IF(Soundness!$C$46=\"\",\"\",Soundness!$C$46)","v":"In solution"},{"$f":"IF(Soundness!$E$39=\"\",\"\",Soundness!$E$39)","v":"DATE"}]
[70,{"$f":"IF(Soundness!$F$46=\"\",\"\",Soundness!$F$46)","v":""},{"$f":"IF(Soundness!$B$6=\"\",\"\",Soundness!$B$6)","v":"Tex-411-A "},{"$f":"IF(Soundness!$B$39=\"\",\"\",Soundness!$B$39)","v":"CYCLE"},{"$f":"IF(Soundness!$B$46=\"\",\"\",Soundness!$B$46)","v":"II"},{"$f":"IF(Soundness!$C$46=\"\",\"\",Soundness!$C$46)","v":"In solution"},{"$f":"IF(Soundness!$F$39=\"\",\"\",Soundness!$F$39)","v":"TIME IN"}]
[71,{"$f":"IF(Soundness!$G$46=\"\",\"\",Soundness!$G$46)","v":""},{"$f":"IF(Soundness!$B$6=\"\",\"\",Soundness!$B$6)","v":"Tex-411-A "},{"$f":"IF(Soundness!$B$39=\"\",\"\",Soundness!$B$39)","v":"CYCLE"},{"$f":"IF(Soundness!$B$46=\"\",\"\",Soundness!$B$46)","v":"II"},{"$f":"IF(Soundness!$C$46=\"\",\"\",Soundness!$C$46)","v":"In solution"},{"$f":"IF(Soundness!$G$39=\"\",\"\",Soundness!$G$39)","v":"TIME OUT"}]
[72,{"$f":"IF(Soundness!$H$46=\"\",\"\",Soundness!$H$46)","v":""},{"$f":"IF(Soundness!$B$6=\"\",\"\",Soundness!$B$6)","v":"Tex-411-A "},{"$f":"IF(Soundness!$B$39=\"\",\"\",Soundness!$B$39)","v":"CYCLE"},{"$f":"IF(Soundness!$B$46=\"\",\"\",Soundness!$B$46)","v":"II"},{"$f":"IF(Soundness!$C$46=\"\",\"\",Soundness!$C$46)","v":"In solution"},{"$f":"IF(Soundness!$H$39=\"\",\"\",Soundness!$H$39)","v":"REMARKS"}]
[73,{"$f":"IF(Soundness!$E$47=\"\",\"\",Soundness!$E$47)","v":""},{"$f":"IF(Soundness!$B$6=\"\",\"\",Soundness!$B$6)","v":"Tex-411-A "},{"$f":"IF(Soundness!$B$39=\"\",\"\",Soundness!$B$39)","v":"CYCLE"},{"$f":"IF(Soundness!$B$46=\"\",\"\",Soundness!$B$46)","v":"II"},{"$f":"IF(Soundness!$C$47=\"\",\"\",Soundness!$C$47)","v":"Out of Solution"},{"$f":"IF(Soundness!$E$39=\"\",\"\",Soundness!$E$39)","v":"DATE"}]
[74,{"$f":"IF(Soundness!$F$47=\"\",\"\",Soundness!$F$47)","v":""},{"$f":"IF(Soundness!$B$6=\"\",\"\",Soundness!$B$6)","v":"Tex-411-A "},{"$f":"IF(Soundness!$B$39=\"\",\"\",Soundness!$B$39)","v":"CYCLE"},{"$f":"IF(Soundness!$B$46=\"\",\"\",Soundness!$B$46)","v":"II"},{"$f":"IF(Soundness!$C$47=\"\",\"\",Soundness!$C$47)","v":"Out of Solution"},{"$f":"IF(Soundness!$F$39=\"\",\"\",Soundness!$F$39)","v":"TIME IN"}]
[75,{"$f":"IF(Soundness!$G$47=\"\",\"\",Soundness!$G$47)","v":""},{"$f":"IF(Soundness!$B$6=\"\",\"\",Soundness!$B$6)","v":"Tex-411-A "},{"$f":"IF(Soundness!$B$39=\"\",\"\",Soundness!$B$39)","v":"CYCLE"},{"$f":"IF(Soundness!$B$46=\"\",\"\",Soundness!$B$46)","v":"II"},{"$f":"IF(Soundness!$C$47=\"\",\"\",Soundness!$C$47)","v":"Out of Solution"},{"$f":"IF(Soundness!$G$39=\"\",\"\",Soundness!$G$39)","v":"TIME OUT"}]
[76,{"$f":"IF(Soundness!$E$48=\"\",\"\",Soundness!$E$48)","v":""},{"$f":"IF(Soundness!$B$6=\"\",\"\",Soundness!$B$6)","v":"Tex-411-A "},{"$f":"IF(Soundness!$B$39=\"\",\"\",Soundness!$B$39)","v":"CYCLE"},{"$f":"IF(Soundness!$B$46=\"\",\"\",Soundness!$B$46)","v":"II"},{"$f":"IF(Soundness!$C$48=\"\",\"\",Soundness!$C$48)","v":"In oven"},{"$f":"IF(Soundness!$E$39=\"\",\"\",Soundness!$E$39)","v":"DATE"}]
[77,{"$f":"IF(Soundness!$F$48=\"\",\"\",Soundness!$F$48)","v":""},{"$f":"IF(Soundness!$B$6=\"\",\"\",Soundness!$B$6)","v":"Tex-411-A "},{"$f":"IF(Soundness!$B$39=\"\",\"\",Soundness!$B$39)","v":"CYCLE"},{"$f":"IF(Soundness!$B$46=\"\",\"\",Soundness!$B$46)","v":"II"},{"$f":"IF(Soundness!$C$48=\"\",\"\",Soundness!$C$48)","v":"In oven"},{"$f":"IF(Soundness!$F$39=\"\",\"\",Soundness!$F$39)","v":"TIME IN"}]
[78,{"$f":"IF(Soundness!$G$48=\"\",\"\",Soundness!$G$48)","v":""},{"$f":"IF(Soundness!$B$6=\"\",\"\",Soundness!$B$6)","v":"Tex-411-A "},{"$f":"IF(Soundness!$B$39=\"\",\"\",Soundness!$B$39)","v":"CYCLE"},{"$f":"IF(Soundness!$B$46=\"\",\"\",Soundness!$B$46)","v":"II"},{"$f":"IF(Soundness!$C$48=\"\",\"\",Soundness!$C$48)","v":"In oven"},{"$f":"IF(Soundness!$G$39=\"\",\"\",Soundness!$G$39)","v":"TIME OUT"}]
[79,{"$f":"IF(Soundness!$E$49=\"\",\"\",Soundness!$E$49)","v":""},{"$f":"IF(Soundness!$B$6=\"\",\"\",Soundness!$B$6)","v":"Tex-411-A "},{"$f":"IF(Soundness!$B$39=\"\",\"\",Soundness!$B$39)","v":"CYCLE"},{"$f":"IF(Soundness!$B$46=\"\",\"\",Soundness!$B$46)","v":"II"},{"$f":"IF(Soundness!$C$49=\"\",\"\",Soundness!$C$49)","v":"Out of oven"},{"$f":"IF(Soundness!$E$39=\"\",\"\",Soundness!$E$39)","v":"DATE"}]
[80,{"$f":"IF(Soundness!$F$49=\"\",\"\",Soundness!$F$49)","v":""},{"$f":"IF(Soundness!$B$6=\"\",\"\",Soundness!$B$6)","v":"Tex-411-A "},{"$f":"IF(Soundness!$B$39=\"\",\"\",Soundness!$B$39)","v":"CYCLE"},{"$f":"IF(Soundness!$B$46=\"\",\"\",Soundness!$B$46)","v":"II"},{"$f":"IF(Soundness!$C$49=\"\",\"\",Soundness!$C$49)","v":"Out of oven"},{"$f":"IF(Soundness!$F$39=\"\",\"\",Soundness!$F$39)","v":"TIME IN"}]
[81,{"$f":"IF(Soundness!$G$49=\"\",\"\",Soundness!$G$49)","v":""},{"$f":"IF(Soundness!$B$6=\"\",\"\",Soundness!$B$6)","v":"Tex-411-A "},{"$f":"IF(Soundness!$B$39=\"\",\"\",Soundness!$B$39)","v":"CYCLE"},{"$f":"IF(Soundness!$B$46=\"\",\"\",Soundness!$B$46)","v":"II"},{"$f":"IF(Soundness!$C$49=\"\",\"\",Soundness!$C$49)","v":"Out of oven"},{"$f":"IF(Soundness!$G$39=\"\",\"\",Soundness!$G$39)","v":"TIME OUT"}]
[82,{"$f":"IF(Soundness!$E$51=\"\",\"\",Soundness!$E$51)","v":""},{"$f":"IF(Soundness!$B$6=\"\",\"\",Soundness!$B$6)","v":"Tex-411-A "},{"$f":"IF(Soundness!$B$39=\"\",\"\",Soundness!$B$39)","v":"CYCLE"},{"$f":"IF(Soundness!$B$51=\"\",\"\",Soundness!$B$51)","v":"III"},{"$f":"IF(Soundness!$C$51=\"\",\"\",Soundness!$C$51)","v":"In solution"},{"$f":"IF(Soundness!$E$39=\"\",\"\",Soundness!$E$39)","v":"DATE"}]
[83,{"$f":"IF(Soundness!$F$51=\"\",\"\",Soundness!$F$51)","v":""},{"$f":"IF(Soundness!$B$6=\"\",\"\",Soundness!$B$6)","v":"Tex-411-A "},{"$f":"IF(Soundness!$B$39=\"\",\"\",Soundness!$B$39)","v":"CYCLE"},{"$f":"IF(Soundness!$B$51=\"\",\"\",Soundness!$B$51)","v":"III"},{"$f":"IF(Soundness!$C$51=\"\",\"\",Soundness!$C$51)","v":"In solution"},{"$f":"IF(Soundness!$F$39=\"\",\"\",Soundness!$F$39)","v":"TIME IN"}]
[84,{"$f":"IF(Soundness!$G$51=\"\",\"\",Soundness!$G$51)","v":""},{"$f":"IF(Soundness!$B$6=\"\",\"\",Soundness!$B$6)","v":"Tex-411-A "},{"$f":"IF(Soundness!$B$39=\"\",\"\",Soundness!$B$39)","v":"CYCLE"},{"$f":"IF(Soundness!$B$51=\"\",\"\",Soundness!$B$51)","v":"III"},{"$f":"IF(Soundness!$C$51=\"\",\"\",Soundness!$C$51)","v":"In solution"},{"$f":"IF(Soundness!$G$39=\"\",\"\",Soundness!$G$39)","v":"TIME OUT"}]
[85,{"$f":"IF(Soundness!$H$51=\"\",\"\",Soundness!$H$51)","v":""},{"$f":"IF(Soundness!$B$6=\"\",\"\",Soundness!$B$6)","v":"Tex-411-A "},{"$f":"IF(Soundness!$B$39=\"\",\"\",Soundness!$B$39)","v":"CYCLE"},{"$f":"IF(Soundness!$B$51=\"\",\"\",Soundness!$B$51)","v":"III"},{"$f":"IF(Soundness!$C$51=\"\",\"\",Soundness!$C$51)","v":"In solution"},{"$f":"IF(Soundness!$H$39=\"\",\"\",Soundness!$H$39)","v":"REMARKS"}]
[86,{"$f":"IF(Soundness!$E$52=\"\",\"\",Soundness!$E$52)","v":""},{"$f":"IF(Soundness!$B$6=\"\",\"\",Soundness!$B$6)","v":"Tex-411-A "},{"$f":"IF(Soundness!$B$39=\"\",\"\",Soundness!$B$39)","v":"CYCLE"},{"$f":"IF(Soundness!$B$51=\"\",\"\",Soundness!$B$51)","v":"III"},{"$f":"IF(Soundness!$C$52=\"\",\"\",Soundness!$C$52)","v":"Out of Solution"},{"$f":"IF(Soundness!$E$39=\"\",\"\",Soundness!$E$39)","v":"DATE"}]
[87,{"$f":"IF(Soundness!$F$52=\"\",\"\",Soundness!$F$52)","v":""},{"$f":"IF(Soundness!$B$6=\"\",\"\",Soundness!$B$6)","v":"Tex-411-A "},{"$f":"IF(Soundness!$B$39=\"\",\"\",Soundness!$B$39)","v":"CYCLE"},{"$f":"IF(Soundness!$B$51=\"\",\"\",Soundness!$B$51)","v":"III"},{"$f":"IF(Soundness!$C$52=\"\",\"\",Soundness!$C$52)","v":"Out of Solution"},{"$f":"IF(Soundness!$F$39=\"\",\"\",Soundness!$F$39)","v":"TIME IN"}]
[88,{"$f":"IF(Soundness!$G$52=\"\",\"\",Soundness!$G$52)","v":""},{"$f":"IF(Soundness!$B$6=\"\",\"\",Soundness!$B$6)","v":"Tex-411-A "},{"$f":"IF(Soundness!$B$39=\"\",\"\",Soundness!$B$39)","v":"CYCLE"},{"$f":"IF(Soundness!$B$51=\"\",\"\",Soundness!$B$51)","v":"III"},{"$f":"IF(Soundness!$C$52=\"\",\"\",Soundness!$C$52)","v":"Out of Solution"},{"$f":"IF(Soundness!$G$39=\"\",\"\",Soundness!$G$39)","v":"TIME OUT"}]
[89,{"$f":"IF(Soundness!$E$53=\"\",\"\",Soundness!$E$53)","v":""},{"$f":"IF(Soundness!$B$6=\"\",\"\",Soundness!$B$6)","v":"Tex-411-A "},{"$f":"IF(Soundness!$B$39=\"\",\"\",Soundness!$B$39)","v":"CYCLE"},{"$f":"IF(Soundness!$B$51=\"\",\"\",Soundness!$B$51)","v":"III"},{"$f":"IF(Soundness!$C$53=\"\",\"\",Soundness!$C$53)","v":"In oven"},{"$f":"IF(Soundness!$E$39=\"\",\"\",Soundness!$E$39)","v":"DATE"}]
[90,{"$f":"IF(Soundness!$F$53=\"\",\"\",Soundness!$F$53)","v":""},{"$f":"IF(Soundness!$B$6=\"\",\"\",Soundness!$B$6)","v":"Tex-411-A "},{"$f":"IF(Soundness!$B$39=\"\",\"\",Soundness!$B$39)","v":"CYCLE"},{"$f":"IF(Soundness!$B$51=\"\",\"\",Soundness!$B$51)","v":"III"},{"$f":"IF(Soundness!$C$53=\"\",\"\",Soundness!$C$53)","v":"In oven"},{"$f":"IF(Soundness!$F$39=\"\",\"\",Soundness!$F$39)","v":"TIME IN"}]
[91,{"$f":"IF(Soundness!$G$53=\"\",\"\",Soundness!$G$53)","v":""},{"$f":"IF(Soundness!$B$6=\"\",\"\",Soundness!$B$6)","v":"Tex-411-A "},{"$f":"IF(Soundness!$B$39=\"\",\"\",Soundness!$B$39)","v":"CYCLE"},{"$f":"IF(Soundness!$B$51=\"\",\"\",Soundness!$B$51)","v":"III"},{"$f":"IF(Soundness!$C$53=\"\",\"\",Soundness!$C$53)","v":"In oven"},{"$f":"IF(Soundness!$G$39=\"\",\"\",Soundness!$G$39)","v":"TIME OUT"}]
[92,{"$f":"IF(Soundness!$E$54=\"\",\"\",Soundness!$E$54)","v":""},{"$f":"IF(Soundness!$B$6=\"\",\"\",Soundness!$B$6)","v":"Tex-411-A "},{"$f":"IF(Soundness!$B$39=\"\",\"\",Soundness!$B$39)","v":"CYCLE"},{"$f":"IF(Soundness!$B$51=\"\",\"\",Soundness!$B$51)","v":"III"},{"$f":"IF(Soundness!$C$54=\"\",\"\",Soundness!$C$54)","v":"Out of oven"},{"$f":"IF(Soundness!$E$39=\"\",\"\",Soundness!$E$39)","v":"DATE"}]
[93,{"$f":"IF(Soundness!$F$54=\"\",\"\",Soundness!$F$54)","v":""},{"$f":"IF(Soundness!$B$6=\"\",\"\",Soundness!$B$6)","v":"Tex-411-A "},{"$f":"IF(Soundness!$B$39=\"\",\"\",Soundness!$B$39)","v":"CYCLE"},{"$f":"IF(Soundness!$B$51=\"\",\"\",Soundness!$B$51)","v":"III"},{"$f":"IF(Soundness!$C$54=\"\",\"\",Soundness!$C$54)","v":"Out of oven"},{"$f":"IF(Soundness!$F$39=\"\",\"\",Soundness!$F$39)","v":"TIME IN"}]
[94,{"$f":"IF(Soundness!$G$54=\"\",\"\",Soundness!$G$54)","v":""},{"$f":"IF(Soundness!$B$6=\"\",\"\",Soundness!$B$6)","v":"Tex-411-A "},{"$f":"IF(Soundness!$B$39=\"\",\"\",Soundness!$B$39)","v":"CYCLE"},{"$f":"IF(Soundness!$B$51=\"\",\"\",Soundness!$B$51)","v":"III"},{"$f":"IF(Soundness!$C$54=\"\",\"\",Soundness!$C$54)","v":"Out of oven"},{"$f":"IF(Soundness!$G$39=\"\",\"\",Soundness!$G$39)","v":"TIME OUT"}]
[95,{"$f":"IF(Soundness!$E$56=\"\",\"\",Soundness!$E$56)","v":""},{"$f":"IF(Soundness!$B$6=\"\",\"\",Soundness!$B$6)","v":"Tex-411-A "},{"$f":"IF(Soundness!$B$39=\"\",\"\",Soundness!$B$39)","v":"CYCLE"},{"$f":"IF(Soundness!$B$56=\"\",\"\",Soundness!$B$56)","v":"IV"},{"$f":"IF(Soundness!$C$56=\"\",\"\",Soundness!$C$56)","v":"In solution"},{"$f":"IF(Soundness!$E$39=\"\",\"\",Soundness!$E$39)","v":"DATE"}]
[96,{"$f":"IF(Soundness!$F$56=\"\",\"\",Soundness!$F$56)","v":""},{"$f":"IF(Soundness!$B$6=\"\",\"\",Soundness!$B$6)","v":"Tex-411-A "},{"$f":"IF(Soundness!$B$39=\"\",\"\",Soundness!$B$39)","v":"CYCLE"},{"$f":"IF(Soundness!$B$56=\"\",\"\",Soundness!$B$56)","v":"IV"},{"$f":"IF(Soundness!$C$56=\"\",\"\",Soundness!$C$56)","v":"In solution"},{"$f":"IF(Soundness!$F$39=\"\",\"\",Soundness!$F$39)","v":"TIME IN"}]
[97,{"$f":"IF(Soundness!$G$56=\"\",\"\",Soundness!$G$56)","v":""},{"$f":"IF(Soundness!$B$6=\"\",\"\",Soundness!$B$6)","v":"Tex-411-A "},{"$f":"IF(Soundness!$B$39=\"\",\"\",Soundness!$B$39)","v":"CYCLE"},{"$f":"IF(Soundness!$B$56=\"\",\"\",Soundness!$B$56)","v":"IV"},{"$f":"IF(Soundness!$C$56=\"\",\"\",Soundness!$C$56)","v":"In solution"},{"$f":"IF(Soundness!$G$39=\"\",\"\",Soundness!$G$39)","v":"TIME OUT"}]
[98,{"$f":"IF(Soundness!$H$56=\"\",\"\",Soundness!$H$56)","v":""},{"$f":"IF(Soundness!$B$6=\"\",\"\",Soundness!$B$6)","v":"Tex-411-A "},{"$f":"IF(Soundness!$B$39=\"\",\"\",Soundness!$B$39)","v":"CYCLE"},{"$f":"IF(Soundness!$B$56=\"\",\"\",Soundness!$B$56)","v":"IV"},{"$f":"IF(Soundness!$C$56=\"\",\"\",Soundness!$C$56)","v":"In solution"},{"$f":"IF(Soundness!$H$39=\"\",\"\",Soundness!$H$39)","v":"REMARKS"}]
[99,{"$f":"IF(Soundness!$E$57=\"\",\"\",Soundness!$E$57)","v":""},{"$f":"IF(Soundness!$B$6=\"\",\"\",Soundness!$B$6)","v":"Tex-411-A "},{"$f":"IF(Soundness!$B$39=\"\",\"\",Soundness!$B$39)","v":"CYCLE"},{"$f":"IF(Soundness!$B$56=\"\",\"\",Soundness!$B$56)","v":"IV"},{"$f":"IF(Soundness!$C$57=\"\",\"\",Soundness!$C$57)","v":"Out of Solution"},{"$f":"IF(Soundness!$E$39=\"\",\"\",Soundness!$E$39)","v":"DATE"}]
[100,{"$f":"IF(Soundness!$F$57=\"\",\"\",Soundness!$F$57)","v":""},{"$f":"IF(Soundness!$B$6=\"\",\"\",Soundness!$B$6)","v":"Tex-411-A "},{"$f":"IF(Soundness!$B$39=\"\",\"\",Soundness!$B$39)","v":"CYCLE"},{"$f":"IF(Soundness!$B$56=\"\",\"\",Soundness!$B$56)","v":"IV"},{"$f":"IF(Soundness!$C$57=\"\",\"\",Soundness!$C$57)","v":"Out of Solution"},{"$f":"IF(Soundness!$F$39=\"\",\"\",Soundness!$F$39)","v":"TIME IN"}]
[101,{"$f":"IF(Soundness!$G$57=\"\",\"\",Soundness!$G$57)","v":""},{"$f":"IF(Soundness!$B$6=\"\",\"\",Soundness!$B$6)","v":"Tex-411-A "},{"$f":"IF(Soundness!$B$39=\"\",\"\",Soundness!$B$39)","v":"CYCLE"},{"$f":"IF(Soundness!$B$56=\"\",\"\",Soundness!$B$56)","v":"IV"},{"$f":"IF(Soundness!$C$57=\"\",\"\",Soundness!$C$57)","v":"Out of Solution"},{"$f":"IF(Soundness!$G$39=\"\",\"\",Soundness!$G$39)","v":"TIME OUT"}]
[102,{"$f":"IF(Soundness!$E$58=\"\",\"\",Soundness!$E$58)","v":""},{"$f":"IF(Soundness!$B$6=\"\",\"\",Soundness!$B$6)","v":"Tex-411-A "},{"$f":"IF(Soundness!$B$39=\"\",\"\",Soundness!$B$39)","v":"CYCLE"},{"$f":"IF(Soundness!$B$56=\"\",\"\",Soundness!$B$56)","v":"IV"},{"$f":"IF(Soundness!$C$58=\"\",\"\",Soundness!$C$58)","v":"In oven"},{"$f":"IF(Soundness!$E$39=\"\",\"\",Soundness!$E$39)","v":"DATE"}]
[103,{"$f":"IF(Soundness!$F$58=\"\",\"\",Soundness!$F$58)","v":""},{"$f":"IF(Soundness!$B$6=\"\",\"\",Soundness!$B$6)","v":"Tex-411-A "},{"$f":"IF(Soundness!$B$39=\"\",\"\",Soundness!$B$39)","v":"CYCLE"},{"$f":"IF(Soundness!$B$56=\"\",\"\",Soundness!$B$56)","v":"IV"},{"$f":"IF(Soundness!$C$58=\"\",\"\",Soundness!$C$58)","v":"In oven"},{"$f":"IF(Soundness!$F$39=\"\",\"\",Soundness!$F$39)","v":"TIME IN"}]
[104,{"$f":"IF(Soundness!$G$58=\"\",\"\",Soundness!$G$58)","v":""},{"$f":"IF(Soundness!$B$6=\"\",\"\",Soundness!$B$6)","v":"Tex-411-A "},{"$f":"IF(Soundness!$B$39=\"\",\"\",Soundness!$B$39)","v":"CYCLE"},{"$f":"IF(Soundness!$B$56=\"\",\"\",Soundness!$B$56)","v":"IV"},{"$f":"IF(Soundness!$C$58=\"\",\"\",Soundness!$C$58)","v":"In oven"},{"$f":"IF(Soundness!$G$39=\"\",\"\",Soundness!$G$39)","v":"TIME OUT"}]
[105,{"$f":"IF(Soundness!$E$59=\"\",\"\",Soundness!$E$59)","v":""},{"$f":"IF(Soundness!$B$6=\"\",\"\",Soundness!$B$6)","v":"Tex-411-A "},{"$f":"IF(Soundness!$B$39=\"\",\"\",Soundness!$B$39)","v":"CYCLE"},{"$f":"IF(Soundness!$B$56=\"\",\"\",Soundness!$B$56)","v":"IV"},{"$f":"IF(Soundness!$C$59=\"\",\"\",Soundness!$C$59)","v":"Out of oven"},{"$f":"IF(Soundness!$E$39=\"\",\"\",Soundness!$E$39)","v":"DATE"}]
[106,{"$f":"IF(Soundness!$F$59=\"\",\"\",Soundness!$F$59)","v":""},{"$f":"IF(Soundness!$B$6=\"\",\"\",Soundness!$B$6)","v":"Tex-411-A "},{"$f":"IF(Soundness!$B$39=\"\",\"\",Soundness!$B$39)","v":"CYCLE"},{"$f":"IF(Soundness!$B$56=\"\",\"\",Soundness!$B$56)","v":"IV"},{"$f":"IF(Soundness!$C$59=\"\",\"\",Soundness!$C$59)","v":"Out of oven"},{"$f":"IF(Soundness!$F$39=\"\",\"\",Soundness!$F$39)","v":"TIME IN"}]
[107,{"$f":"IF(Soundness!$G$59=\"\",\"\",Soundness!$G$59)","v":""},{"$f":"IF(Soundness!$B$6=\"\",\"\",Soundness!$B$6)","v":"Tex-411-A "},{"$f":"IF(Soundness!$B$39=\"\",\"\",Soundness!$B$39)","v":"CYCLE"},{"$f":"IF(Soundness!$B$56=\"\",\"\",Soundness!$B$56)","v":"IV"},{"$f":"IF(Soundness!$C$59=\"\",\"\",Soundness!$C$59)","v":"Out of oven"},{"$f":"IF(Soundness!$G$39=\"\",\"\",Soundness!$G$39)","v":"TIME OUT"}]
[108,{"$f":"IF(Soundness!$E$61=\"\",\"\",Soundness!$E$61)","v":""},{"$f":"IF(Soundness!$B$6=\"\",\"\",Soundness!$B$6)","v":"Tex-411-A "},{"$f":"IF(Soundness!$B$39=\"\",\"\",Soundness!$B$39)","v":"CYCLE"},{"$f":"IF(Soundness!$B$61=\"\",\"\",Soundness!$B$61)","v":"V"},{"$f":"IF(Soundness!$C$61=\"\",\"\",Soundness!$C$61)","v":"In solution"},{"$f":"IF(Soundness!$E$39=\"\",\"\",Soundness!$E$39)","v":"DATE"}]
[109,{"$f":"IF(Soundness!$F$61=\"\",\"\",Soundness!$F$61)","v":""},{"$f":"IF(Soundness!$B$6=\"\",\"\",Soundness!$B$6)","v":"Tex-411-A "},{"$f":"IF(Soundness!$B$39=\"\",\"\",Soundness!$B$39)","v":"CYCLE"},{"$f":"IF(Soundness!$B$61=\"\",\"\",Soundness!$B$61)","v":"V"},{"$f":"IF(Soundness!$C$61=\"\",\"\",Soundness!$C$61)","v":"In solution"},{"$f":"IF(Soundness!$F$39=\"\",\"\",Soundness!$F$39)","v":"TIME IN"}]
[110,{"$f":"IF(Soundness!$G$61=\"\",\"\",Soundness!$G$61)","v":""},{"$f":"IF(Soundness!$B$6=\"\",\"\",Soundness!$B$6)","v":"Tex-411-A "},{"$f":"IF(Soundness!$B$39=\"\",\"\",Soundness!$B$39)","v":"CYCLE"},{"$f":"IF(Soundness!$B$61=\"\",\"\",Soundness!$B$61)","v":"V"},{"$f":"IF(Soundness!$C$61=\"\",\"\",Soundness!$C$61)","v":"In solution"},{"$f":"IF(Soundness!$G$39=\"\",\"\",Soundness!$G$39)","v":"TIME OUT"}]
[111,{"$f":"IF(Soundness!$H$61=\"\",\"\",Soundness!$H$61)","v":""},{"$f":"IF(Soundness!$B$6=\"\",\"\",Soundness!$B$6)","v":"Tex-411-A "},{"$f":"IF(Soundness!$B$39=\"\",\"\",Soundness!$B$39)","v":"CYCLE"},{"$f":"IF(Soundness!$B$61=\"\",\"\",Soundness!$B$61)","v":"V"},{"$f":"IF(Soundness!$C$61=\"\",\"\",Soundness!$C$61)","v":"In solution"},{"$f":"IF(Soundness!$H$39=\"\",\"\",Soundness!$H$39)","v":"REMARKS"}]
[112,{"$f":"IF(Soundness!$E$62=\"\",\"\",Soundness!$E$62)","v":""},{"$f":"IF(Soundness!$B$6=\"\",\"\",Soundness!$B$6)","v":"Tex-411-A "},{"$f":"IF(Soundness!$B$39=\"\",\"\",Soundness!$B$39)","v":"CYCLE"},{"$f":"IF(Soundness!$B$61=\"\",\"\",Soundness!$B$61)","v":"V"},{"$f":"IF(Soundness!$C$62=\"\",\"\",Soundness!$C$62)","v":"Out of Solution"},{"$f":"IF(Soundness!$E$39=\"\",\"\",Soundness!$E$39)","v":"DATE"}]
[113,{"$f":"IF(Soundness!$F$62=\"\",\"\",Soundness!$F$62)","v":""},{"$f":"IF(Soundness!$B$6=\"\",\"\",Soundness!$B$6)","v":"Tex-411-A "},{"$f":"IF(Soundness!$B$39=\"\",\"\",Soundness!$B$39)","v":"CYCLE"},{"$f":"IF(Soundness!$B$61=\"\",\"\",Soundness!$B$61)","v":"V"},{"$f":"IF(Soundness!$C$62=\"\",\"\",Soundness!$C$62)","v":"Out of Solution"},{"$f":"IF(Soundness!$F$39=\"\",\"\",Soundness!$F$39)","v":"TIME IN"}]
[114,{"$f":"IF(Soundness!$G$62=\"\",\"\",Soundness!$G$62)","v":""},{"$f":"IF(Soundness!$B$6=\"\",\"\",Soundness!$B$6)","v":"Tex-411-A "},{"$f":"IF(Soundness!$B$39=\"\",\"\",Soundness!$B$39)","v":"CYCLE"},{"$f":"IF(Soundness!$B$61=\"\",\"\",Soundness!$B$61)","v":"V"},{"$f":"IF(Soundness!$C$62=\"\",\"\",Soundness!$C$62)","v":"Out of Solution"},{"$f":"IF(Soundness!$G$39=\"\",\"\",Soundness!$G$39)","v":"TIME OUT"}]
[115,{"$f":"IF(Soundness!$E$63=\"\",\"\",Soundness!$E$63)","v":""},{"$f":"IF(Soundness!$B$6=\"\",\"\",Soundness!$B$6)","v":"Tex-411-A "},{"$f":"IF(Soundness!$B$39=\"\",\"\",Soundness!$B$39)","v":"CYCLE"},{"$f":"IF(Soundness!$B$61=\"\",\"\",Soundness!$B$61)","v":"V"},{"$f":"IF(Soundness!$C$63=\"\",\"\",Soundness!$C$63)","v":"In oven"},{"$f":"IF(Soundness!$E$39=\"\",\"\",Soundness!$E$39)","v":"DATE"}]
[116,{"$f":"IF(Soundness!$F$63=\"\",\"\",Soundness!$F$63)","v":""},{"$f":"IF(Soundness!$B$6=\"\",\"\",Soundness!$B$6)","v":"Tex-411-A "},{"$f":"IF(Soundness!$B$39=\"\",\"\",Soundness!$B$39)","v":"CYCLE"},{"$f":"IF(Soundness!$B$61=\"\",\"\",Soundness!$B$61)","v":"V"},{"$f":"IF(Soundness!$C$63=\"\",\"\",Soundness!$C$63)","v":"In oven"},{"$f":"IF(Soundness!$F$39=\"\",\"\",Soundness!$F$39)","v":"TIME IN"}]
[117,{"$f":"IF(Soundness!$G$63=\"\",\"\",Soundness!$G$63)","v":""},{"$f":"IF(Soundness!$B$6=\"\",\"\",Soundness!$B$6)","v":"Tex-411-A "},{"$f":"IF(Soundness!$B$39=\"\",\"\",Soundness!$B$39)","v":"CYCLE"},{"$f":"IF(Soundness!$B$61=\"\",\"\",Soundness!$B$61)","v":"V"},{"$f":"IF(Soundness!$C$63=\"\",\"\",Soundness!$C$63)","v":"In oven"},{"$f":"IF(Soundness!$G$39=\"\",\"\",Soundness!$G$39)","v":"TIME OUT"}]
[118,{"$f":"IF(Soundness!$E$64=\"\",\"\",Soundness!$E$64)","v":""},{"$f":"IF(Soundness!$B$6=\"\",\"\",Soundness!$B$6)","v":"Tex-411-A "},{"$f":"IF(Soundness!$B$39=\"\",\"\",Soundness!$B$39)","v":"CYCLE"},{"$f":"IF(Soundness!$B$61=\"\",\"\",Soundness!$B$61)","v":"V"},{"$f":"IF(Soundness!$C$64=\"\",\"\",Soundness!$C$64)","v":"Out of oven"},{"$f":"IF(Soundness!$E$39=\"\",\"\",Soundness!$E$39)","v":"DATE"}]
[119,{"$f":"IF(Soundness!$F$64=\"\",\"\",Soundness!$F$64)","v":""},{"$f":"IF(Soundness!$B$6=\"\",\"\",Soundness!$B$6)","v":"Tex-411-A "},{"$f":"IF(Soundness!$B$39=\"\",\"\",Soundness!$B$39)","v":"CYCLE"},{"$f":"IF(Soundness!$B$61=\"\",\"\",Soundness!$B$61)","v":"V"},{"$f":"IF(Soundness!$C$64=\"\",\"\",Soundness!$C$64)","v":"Out of oven"},{"$f":"IF(Soundness!$F$39=\"\",\"\",Soundness!$F$39)","v":"TIME IN"}]
[120,{"$f":"IF(Soundness!$G$64=\"\",\"\",Soundness!$G$64)","v":""},{"$f":"IF(Soundness!$B$6=\"\",\"\",Soundness!$B$6)","v":"Tex-411-A "},{"$f":"IF(Soundness!$B$39=\"\",\"\",Soundness!$B$39)","v":"CYCLE"},{"$f":"IF(Soundness!$B$61=\"\",\"\",Soundness!$B$61)","v":"V"},{"$f":"IF(Soundness!$C$64=\"\",\"\",Soundness!$C$64)","v":"Out of oven"},{"$f":"IF(Soundness!$G$39=\"\",\"\",Soundness!$G$39)","v":"TIME OUT"}]
[121,{"$f":"IF(Soundness!$C$74=\"\",\"\",Soundness!$C$74)","v":""},"Sampled By ",{"$f":"IF(Soundness!$B$74=\"\",\"\",Soundness!$B$74)","v":"TX221"}]
[122,{"$f":"IF(Soundness!$F$74=\"\",\"\",Soundness!$F$74)","v":""},"Sampled Date ",{"$f":"IF(Soundness!$B$74=\"\",\"\",Soundness!$B$74)","v":"TX221"}]
[123,{"$f":"IF(Soundness!$C$76=\"\",\"\",Soundness!$C$76)","v":""},"Sampled By ",{"$f":"IF(Soundness!$B$76=\"\",\"\",Soundness!$B$76)","v":"TX400"}]
[124,{"$f":"IF(Soundness!$F$76=\"\",\"\",Soundness!$F$76)","v":""},"Sampled Date ",{"$f":"IF(Soundness!$B$76=\"\",\"\",Soundness!$B$76)","v":"TX400"}]

{"sheet":"Sieves","index":3,"n_rows":41,"n_cols":16,"rows_kept":41,"cut":false,"hidden":true,"merged":[[0,14,0,15],[33,0,40,0],[25,0,32,0],[0,1,0,2],[19,0,20,0],[21,0,24,0],[0,3,0,4],[0,5,1,5],[0,0,1,0],[14,0,18,0],[11,0,13,0],[7,0,8,0],[9,0,10,0],[2,0,6,0]]}
["Material","English",null,"Metric",null,"Normalized Gradations",null,null,null,"English","Metric","Selection","size",null,"Spec year"]
[null,"Passing Sieve","Retained Sieve","Passing Sieve","Retained Sieve",null,null,null,null,"3\"","75 mm",{"$f":"IF(SpecYear=\"\",\"\",IF(SpecYear=\"1995\",K2,J2))","v":""},75,null,"Others",2024]
["Concrete Fine Aggr.","No. 4","No. 8","4.75 mm","2.36 mm",0.1,null,null,null,"2.5\"","63 mm","",63,null,"CONC_FINE_AGGR","CONC_COARSE_AGGR"]
[null,"No. 8","No. 16","2.36 mm","1.18 mm",0.23,null,null,null,"2.12\"","53 mm","",53,null,"CONC_COARSE_AGGR","SURFACE_TREATMENT"]
[null,"No. 16","No. 30","1.18 mm","600 µm",0.22,null,null,null,"2\"","50 mm","",50,null,"SURFACE_TREATMENT","HMAC"]
[null,"No. 30","No. 50","600 µm","300 µm",0.22,null,null,null,"1-3/4\"","45 mm","",45,null,"HMAC","MICRO_SURFACE"]
[null,"No. 50","-","300 µm","-",0.23,{"$f":"SUM(F3:F7)","v":1},null,null,"1-1/2\"","37.5 mm","",37.5,null,"MICRO_SURFACE","ROCK_RIPRAP"]
["Conc. Coarse Aggr.","3/4\"","3/8\"","19.0 mm","9.5 mm",0.66,null,null,null,"1-1/4\"","31.5 mm","",31.5,null,"ROCK_RIPRAP","MSE_BACKFILL"]
[null,"3/8\"","No. 4","9.5 mm","4.75 mm",0.34,{"$f":"SUM(F8:F9)","v":1},null,null,"1\"","25 mm","",25,null,"ROCK_RIPRAP_BEDDING"]
["Surface Treatment","1/2\"","3/8\"","12.5 mm","9.5 mm",0.28000000000000003,null,null,null,"7/8\"","22.4 mm","",22.4,null,"BASE_MATERIAL"]
[null,"3/8\"","No. 4","9.5 mm","4.75 mm",0.72,{"$f":"SUM(F10:F11)","v":1},null,null,"3/4\"","19 mm","",19,null,"MSE_BACKFILL"]
["HMAC","1/2\"","3/8\"","12.5 mm","9.5 mm",{"$f":"IF(SpecYear=\"2024\", 28%,13%)","v":0.13},null,null,null,"5/8\"","16 mm","",16]
[null,"3/8\"","No. 4","9.5 mm","4.75 mm",{"$f":"IF(SpecYear=\"2024\", 42%,50%)","v":0.5},null,null,null,"1/2\"","12.5 mm","",12.5]
[null,"No. 4","No. 8","4.75 mm","2.36 mm",{"$f":"IF(SpecYear=\"2024\", 30%,37%)","v":0.37},{"$f":"SUM(F12:F14)","v":1},null,null,"7/16\"","11.2 mm","",11.2]
["Micro-Surface","No. 4","No. 8","4.75 mm","2.36 mm",{"$f":"IF(SpecYear=\"2024\", 55%,17%)","v":0.17},null,null,null,"3/8\"","9.5 mm","",9.5]
[null,"No. 8","No. 16","2.36 mm","1.18 mm",{"$f":"IF(SpecYear=\"2024\", 24%,23%)","v":0.23},null,null,null,"5/16\"","8 mm","",8]
[null,"No. 16","No. 30","1.18 mm","600 µm",{"$f":"IF(SpecYear=\"2024\", 13%,20%)","v":0.2},null,null,null,"1/4\"","6.3 mm","",6.3]
[null,"No. 30","No. 50","600 µm","300 µm",{"$f":"IF(SpecYear=\"2024\", 8%,14%)","v":0.14000000000000001},null,null,null,"No. 4","4.75 mm","",4.8]
[null,{"$f":"IF(SpecYear=\"2024\",\"\",\"No. 50\"\"\")","v":"No. 50\""},{"$f":"IF(SpecYear=\"2024\",\"\",\"-\"\"\")","v":"-\""},{"$f":"IF(SpecYear=\"2024\",\"\",\"300 µm\"\"\")","v":"300 µm\""},{"$f":"IF(SpecYear=\"2024\",\"\",\"-\"\"\")","v":"-\""},{"$f":"IF(SpecYear=\"2024\", \"\",26%)","v":0.26},{"$f":"SUM(F15:F19)","v":1},null,null,"No. 6","3.35 mm","",3.4]
["Rock Riprap","2-1/2\"","1-1/2\"","63 mm","37.5 mm",{"$f":"IF(SpecYear=\"2024\", 100%,70%)","v":0.7},null,null,null,"No. 8","2.36 mm","",2.4]
[null,{"$f":"IF(SpecYear=\"2024\",\"\",\"1-1/2\"\"\")","v":"1-1/2\""},{"$f":"IF(SpecYear=\"2024\",\"\",\"3/4\"\"\")","v":"3/4\""},{"$f":"IF(SpecYear=\"2024\",\"\",\"37.5 mm\")","v":"37.5 mm"},{"$f":"IF(SpecYear=\"2024\",\"\",\"19.0 mm\")","v":"19.0 mm"},{"$f":"IF(SpecYear=\"2024\", \"\",30%)","v":0.3},{"$f":"SUM(F20:F21)","v":1},null,null,"No. 10","2 mm","",2]
["Rock Riprap Bedding","2-1/2\"","1-1/2\"","63 mm","37.5 mm",0.24,null,null,null,"No. 14","1.4 mm","",1.4]
[null,"1-1/2\"","3/4\"","37.5 mm","19.0 mm",0.39,null,null,null,"No. 16","1.18 mm","",1.2]
[null,"3/4\"","3/8\"","19.0 mm","9.5 mm",0.24,null,null,null,"No. 20","850 µm","",0.9]
[null,"3/8\"","No. 4","9.5 mm","4.75 mm",0.13,{"$f":"SUM(F22:F25)","v":1},null,null,"No. 30","600 µm","",0.6]
["Base Material","1-1/2\"","3/4\"","37.5 mm","19.0 mm",0.26,null,null,null,"No. 40","425 µm","",0.4]
[null,"3/4\"","3/8\"","19.0 mm","9.5 mm",0.13,null,null,null,"No. 50","300 µm","",0.3]
[null,"3/8\"","No. 4","9.5 mm","4.75 mm",0.15]
[null,"No. 4","No. 8","4.75 mm","2.36 mm",7.0000000000000007E-2]
[null,"No. 8","No. 16","2.36 mm","1.18 mm",0.08]
[null,"No. 16","No. 30","1.18 mm","600 µm",0.06]
[null,"No. 30","No. 50","600 µm","300 µm",0.05]
[null,"No. 50","-","300 µm","-",0.2,{"$f":"SUM(F26:F33)","v":1}]
["MSE Backfill",null,null,null,null,{"$f":"H34/100","v":0}]
[null,null,null,null,null,{"$f":"H35/100","v":0}]
[null,null,null,null,null,0]
[null,null,null,null,null,0]
[null,null,null,null,null,0]
[null,null,null,null,null,0]
[null,null,null,null,null,0]
[null,null,null,null,null,0,{"$f":"SUM(F34:F41)","v":0}]