{"text_format":"1","workbook":"xlsx","n_sheets":5,"sheets":["Tex-415,18,24,48-A","RX","Spec. Strengths","Revisions","L to D Lookup"],"not_rendered":{"charts":0,"images":1,"macros":1,"external_links":0,"defined_names":241,"comments":1,"pivot_tables":0},"unopened":[],"bounds":{"document_bytes":16777216,"sheet_cells":100000,"rows_first":2000,"rows_last":500,"rows_between":2000,"halvings":0,"cell_chars":16384,"cell_head_chars":4096},"cells_cut":0,"cells_raw":0,"read":"whole","date_system":"1900"}

{"sheet":"Tex-415,18,24,48-A","index":0,"n_rows":90,"n_cols":12,"rows_kept":90,"cut":false,"hidden":false,"merged":[[29,9,31,9],[38,2,39,2],[38,10,39,10],[43,3,44,3],[42,9,44,9],[36,10,37,10],[34,10,35,10],[34,2,35,2],[0,0,0,1],[11,3,11,4],[7,3,7,4],[8,3,8,4],[9,3,9,4],[10,3,10,4],[26,1,26,11],[25,1,25,11],[27,5,27,7],[27,1,27,3],[7,7,7,8],[8,7,8,8],[9,7,9,8],[10,7,10,8],[16,3,16,4],[11,7,11,8],[13,7,13,8],[14,3,14,8],[23,4,23,5],[15,3,15,8],[16,7,16,8],[12,7,12,8],[21,4,21,6],[22,4,22,6],[12,3,12,4],[13,3,13,4],[89,1,89,3],[79,2,79,4],[75,2,75,4],[77,2,77,4],[70,1,70,8],[85,6,85,8],[85,1,85,3],[74,2,74,4],[81,2,81,4],[83,2,83,4],[72,2,72,4],[73,2,73,4],[69,1,69,8],[67,1,68,8],[63,2,64,2],[55,1,56,1],[55,4,56,4],[57,2,58,2],[53,1,53,9],[41,1,41,10],[42,8,44,8],[47,10,48,10],[42,1,44,1],[42,4,44,4],[42,2,44,2],[49,10,50,10],[45,10,46,10],[42,6,44,6],[57,9,58,9],[42,5,44,5],[47,2,48,2],[45,2,46,2],[55,2,56,2],[49,2,50,2],[42,7,44,7],[55,6,56,6],[55,0,56,0],[38,11,39,11],[29,11,31,11],[29,0,31,0],[42,0,44,0],[32,11,33,11],[34,11,35,11],[36,11,37,11],[51,10,52,10],[51,2,52,2],[55,7,56,7],[55,5,56,5],[29,5,31,5],[29,4,31,4],[29,10,31,10],[29,6,31,6],[30,3,31,3],[29,8,31,8],[29,7,31,7],[36,2,37,2],[29,1,31,1],[32,10,33,10],[29,2,31,2],[32,2,33,2],[63,9,64,9],[40,1,40,10],[61,9,62,9],[55,3,56,3],[42,10,44,10],[55,9,56,9],[55,8,56,8],[59,2,60,2],[61,2,62,2],[54,1,54,9],[59,9,60,9]]}
["TxDOT Manuals >",null,null,"Tex-418-A","Tex-448-A","Tex-424-A","Tex-415-A"]
[null,"TEXAS DEPARTMENT OF TRANSPORTATION",null,null,null,null,null,null,null,null,160]
[null,null,null,null,null,null,null,null,null,null,6]
[null,null,null,null,null,null,null,null,null,null,"tx418,48.xlsm::45170.326551"]
[null,"HYDRAULIC CEMENT CONCRETE REPORT "]
[null,"Tex-415,18,24,48-A"]
[null,null,null,null,null,null,null,null,{"$f":"\"TX 418, 48 :: File Version: \" & TEXT(MID(sn,SEARCH(\"::\",sn,1)+2,20),\"mm/dd/yy hh:mm:ss\")","v":"TX 418, 48 :: File Version: 09/01/23 07:50:14"}]
[null,null,"SAMPLE ID:",null,null,null,"SAMPLED DATE:"]
[null,null,"TEST NUMBER:",null,null,null,"LETTING DATE:"]
[null,null,"SAMPLE STATUS:",null,null,null,"CONTROLLING CSJ:"]
[null,null,"COUNTY:",null,null,null,"SPEC YEAR:"]
[null,null,"SAMPLED BY:",null,null,null,"SPEC ITEM:"]
[null,null,"SAMPLE LOCATION:",null,null,null,"SPECIAL PROVISION:"]
[null,null,"MATERIAL CODE:",null,null,null,"CLASS:"]
[null,null,"MATERIAL NAME:"]
[null,null,"PRODUCER:",""]
[null,null,"AREA ENGINEER:",null,null,null,"PROJECT MANAGER:"]
[]
[null,null,"COURSE\\LIFT:",null,"STATION:",null,null,"DIST. FROM CL:"]
[]
[]
[null,null,null,null,"SLUMP"]
[null,null,null,null,"Tex-415-A"]
[null,"Mix Design #",null,null,{"$f":"\"Slump \" & IF(SpecYear=\"\",\"\",IF(SpecYear=\"1995\",\"(millimeters):\",\"(inches):\"))","v":"Slump "}]
[]
[null,"COMPRESSIVE STRENGTH"]
[null,"Tex-418-A"]
[null,{"$f":"\"7-Day Target Strength \" & IF(SpecYear=\"\",\"\",IF(SpecYear=\"1995\",\"( MPa )\",\"( psi )\")) & \" :\"","v":"7-Day Target Strength  :"},null,null,null,{"$f":"\"28-Day Design Strength f'c \" & IF(SpecYear=\"\",\"\",IF(SpecYear=\"1995\",\"( MPa )\",\"( psi )\")) & \" :\"","v":"28-Day Design Strength f'c  :"},null,null,{"$f":"IF(ISBLANK(H14),\"\",IF(SpecYear=\"1993\",VLOOKUP(H14,'Spec. Strengths'!A5:D19,2),IF(SpecYear=\"1995\",VLOOKUP(H14,'Spec. Strengths'!A5:D19,3),VLOOKUP(H14,'Spec. Strengths'!A5:D19,4))))","v":""},null,{"$f":"IF(I28=\"Input at right\",J28,I28)","v":""}]
[]
["Cylinder","Cylinder Number","Age (Days)",null,{"$f":" \"Length of Cylinder \" & IF(SpecYear=\"\",\"\",IF(SpecYear=\"1995\",\"(millimeter)\",\"(inches)\"))","v":"Length of Cylinder "},"Length to Diameter Ratio",{"$f":"\"Max Load \" & IF(SpecYear=\"\",\"\",IF(SpecYear=\"1995\",\"(N*)\",\"(Lbs.)\"))","v":"Max Load "},"Failure Type","Correction Factor",{"$f":"\"Compressive Strength \" & IF(SpecYear=\"\",\"\",IF(SpecYear=\"1995\",\"(MPa)\",\"(psi)\"))","v":"Compressive Strength "},{"$f":"\"Compressive Strength Average \" & IF(SpecYear=\"\",\"\",IF(SpecYear=\"1995\",\"(MPa)\",\"(psi)\"))","v":"Compressive Strength Average "},"Meets Strength Requirement"]
[null,null,null,{"$f":"+CircumDiameter1& \" of Cylinder \" & IF(SpecYear=\"\",\"\",IF(SpecYear=\"1995\",\"(millimeter)\",\"(inches)\"))","v":" of Cylinder "}]
[]
[1,null,null,null,null,{"$f":"IF(ISERROR(IF(CircumDiameter1=\"circumference\",$E33/(SQRT($D33/PI())*2),($E33/$D33))),\"\",IF(CircumDiameter1=\"circumference\",$E33/(SQRT($D33/PI())*2),($E33/$D33)))","v":""},null,null,{"$f":"IF(F33=\"\",\"\",IF(F33<1,\"CHK SIZES\",IF(F33>1.8,1,VLOOKUP(F33,CorrectionFactors,2))))","v":""},{"$f":"IF(ISERROR(IF(SpecYear=\"1993\",'L to D Lookup'!$E12,'L to D Lookup'!$F12)),0,IF(SpecYear=\"1993\",'L to D Lookup'!$E12,'L to D Lookup'!$F12))","v":""},{"$f":"IF(ISERROR(IF(SpecYear=\"1995\",ROUND(AVERAGE(J33:J34),2),ROUND(AVERAGE(J33:J34),-1))),\"\",IF(SpecYear=\"1995\",ROUND(AVERAGE(J33:J34),2),ROUND(AVERAGE(J33:J34),-1)))","v":""},{"$f":"IF(NOT(OR(C33=7,C33=28)),\"\",IF(AND(C33=7,K33>=$E$28,NOT(ISBLANK(G33))),\"Yes\",IF(AND(C33=28,K33>=$K$28,NOT(ISBLANK(G33))),\"Yes\",\"No\")))","v":""}]
[2,null,null,null,null,{"$f":"IF(ISERROR(IF(CircumDiameter1=\"circumference\",$E34/(SQRT($D34/PI())*2),($E34/$D34))),\"\",IF(CircumDiameter1=\"circumference\",$E34/(SQRT($D34/PI())*2),($E34/$D34)))","v":""},null,null,"",{"$f":"IF(ISERROR(IF(SpecYear=\"1993\",'L to D Lookup'!$E13,'L to D Lookup'!$F13)),0,IF(SpecYear=\"1993\",'L to D Lookup'!$E13,'L to D Lookup'!$F13))","v":""}]
[3,null,null,null,null,"",null,null,"",{"$f":"IF(ISERROR(IF(SpecYear=\"1993\",'L to D Lookup'!$E14,'L to D Lookup'!$F14)),0,IF(SpecYear=\"1993\",'L to D Lookup'!$E14,'L to D Lookup'!$F14))","v":""},{"$f":"IF(ISERROR(IF(SpecYear=\"1995\",ROUND(AVERAGE(J35:J36),2),ROUND(AVERAGE(J35:J36),-1))),\"\",IF(SpecYear=\"1995\",ROUND(AVERAGE(J35:J36),2),ROUND(AVERAGE(J35:J36),-1)))","v":""},{"$f":"IF(NOT(OR(C35=7,C35=28)),\"\",IF(AND(C35=7,K35>=$E$28,NOT(ISBLANK(G35))),\"Yes\",IF(AND(C35=28,K35>=$K$28,NOT(ISBLANK(G35))),\"Yes\",\"No\")))","v":""}]
[4,null,null,null,null,"",null,null,"",{"$f":"IF(ISERROR(IF(SpecYear=\"1993\",'L to D Lookup'!$E15,'L to D Lookup'!$F15)),0,IF(SpecYear=\"1993\",'L to D Lookup'!$E15,'L to D Lookup'!$F15))","v":""}]
[5,null,null,null,null,"",null,null,"",{"$f":"IF(ISERROR(IF(SpecYear=\"1993\",'L to D Lookup'!$E16,'L to D Lookup'!$F16)),0,IF(SpecYear=\"1993\",'L to D Lookup'!$E16,'L to D Lookup'!$F16))","v":""},{"$f":"IF(ISERROR(IF(SpecYear=\"1995\",ROUND(AVERAGE(J37:J38),2),ROUND(AVERAGE(J37:J38),-1))),\"\",IF(SpecYear=\"1995\",ROUND(AVERAGE(J37:J38),2),ROUND(AVERAGE(J37:J38),-1)))","v":""},{"$f":"IF(NOT(OR(C37=7,C37=28)),\"\",IF(AND(C37=7,K37>=$E$28,NOT(ISBLANK(G37))),\"Yes\",IF(AND(C37=28,K37>=$K$28,NOT(ISBLANK(G37))),\"Yes\",\"No\")))","v":""}]
[6,null,null,null,null,"",null,null,"",{"$f":"IF(ISERROR(IF(SpecYear=\"1993\",'L to D Lookup'!$E17,'L to D Lookup'!$F17)),0,IF(SpecYear=\"1993\",'L to D Lookup'!$E17,'L to D Lookup'!$F17))","v":""}]
[7,null,null,null,null,"",null,null,"",{"$f":"IF(ISERROR(IF(SpecYear=\"1993\",'L to D Lookup'!$E18,'L to D Lookup'!$F18)),0,IF(SpecYear=\"1993\",'L to D Lookup'!$E18,'L to D Lookup'!$F18))","v":""},{"$f":"IF(ISERROR(IF(SpecYear=\"1995\",ROUND(AVERAGE(J39:J40),2),ROUND(AVERAGE(J39:J40),-1))),\"\",IF(SpecYear=\"1995\",ROUND(AVERAGE(J39:J40),2),ROUND(AVERAGE(J39:J40),-1)))","v":""},{"$f":"IF(NOT(OR(C39=7,C39=28)),\"\",IF(AND(C39=7,K39>=$E$28,NOT(ISBLANK(G39))),\"Yes\",IF(AND(C39=28,K39>=$K$28,NOT(ISBLANK(G39))),\"Yes\",\"No\")))","v":""}]
[8,null,null,null,null,"",null,null,"",{"$f":"IF(ISERROR(IF(SpecYear=\"1993\",'L to D Lookup'!$E19,'L to D Lookup'!$F19)),0,IF(SpecYear=\"1993\",'L to D Lookup'!$E19,'L to D Lookup'!$F19))","v":""}]
[null,"TESTING OF DRILLED CORES"]
[null,"Tex-424-A"]
["Core","Core Number","Age (Days)",null,{"$f":"\"Length of Core \" & IF(SpecYear=\"\",\"\",IF(SpecYear=\"1995\",\"(millimeter)\",\"(inches)\"))","v":"Length of Core "},"Length to Diameter Ratio",{"$f":"\"Max Load \" & IF(SpecYear=\"\",\"\",IF(SpecYear=\"1995\",\"(N*)\",\"(Lbs.)\"))","v":"Max Load "},"Failure Type","Correction Factor",{"$f":"\"Compressive Strength \" &  IF(SpecYear=\"\",\"\",IF(SpecYear=\"1995\",\"(MPa)\",\"(psi)\"))","v":"Compressive Strength "},{"$f":"\"Compressive Strength Average \" &  IF(SpecYear=\"\",\"\",IF(SpecYear=\"1995\",\"(Mpa)\",\"(psi)\"))","v":"Compressive Strength Average "}]
[null,null,null,{"$f":"CircumDiameter2 &\" of Core \"&IF(SpecYear=\"\",\"\",IF(SpecYear=\"1995\",\"(millimeter)\",\"(inches)\"))","v":" of Core "}]
[]
[1,null,null,null,null,{"$f":"IF(ISERROR(IF(CircumDiameter2=\"circumference\",$E46/(SQRT($D46/PI())*2),($E46/$D46))),\"\",IF(CircumDiameter2=\"circumference\",$E46/(SQRT($D46/PI())*2),($E46/$D46)))","v":""},null,null,{"$f":"IF(F46=\"\",\"\",IF(F46<1,\"CHK SIZES\",IF(F46>2.1,\"CHK SIZES\",VLOOKUP(F46,CorrectionFactors,2))))","v":""},{"$f":"IF(ISERROR(IF(SpecYear=\"1993\",'L to D Lookup'!$E22,'L to D Lookup'!$F22)),0,IF(SpecYear=\"1993\",'L to D Lookup'!$E22,'L to D Lookup'!$F22))","v":""},{"$f":"IF(ISERROR(IF(SpecYear=\"1995\",ROUND(AVERAGE(J46:J47),2),ROUND(AVERAGE(J46:J47),-1))),\"\",IF(SpecYear=\"1995\",ROUND(AVERAGE(J46:J47),2),ROUND(AVERAGE(J46:J47),-1)))","v":""}]
[2,null,null,null,null,{"$f":"IF(ISERROR(IF(CircumDiameter2=\"circumference\",$E47/(SQRT($D47/PI())*2),($E47/$D47))),\"\",IF(CircumDiameter2=\"circumference\",$E47/(SQRT($D47/PI())*2),($E47/$D47)))","v":""},null,null,"",{"$f":"IF(ISERROR(IF(SpecYear=\"1993\",'L to D Lookup'!$E23,'L to D Lookup'!$F23)),0,IF(SpecYear=\"1993\",'L to D Lookup'!$E23,'L to D Lookup'!$F23))","v":""}]
[3,null,null,null,null,"",null,null,"",{"$f":"IF(ISERROR(IF(SpecYear=\"1993\",'L to D Lookup'!$E24,'L to D Lookup'!$F24)),0,IF(SpecYear=\"1993\",'L to D Lookup'!$E24,'L to D Lookup'!$F24))","v":""},{"$f":"IF(ISERROR(IF(SpecYear=\"1995\",ROUND(AVERAGE(J48:J49),2),ROUND(AVERAGE(J48:J49),-1))),\"\",IF(SpecYear=\"1995\",ROUND(AVERAGE(J48:J49),2),ROUND(AVERAGE(J48:J49),-1)))","v":""}]
[4,null,null,null,null,"",null,null,"",{"$f":"IF(ISERROR(IF(SpecYear=\"1993\",'L to D Lookup'!$E25,'L to D Lookup'!$F25)),0,IF(SpecYear=\"1993\",'L to D Lookup'!$E25,'L to D Lookup'!$F25))","v":""}]
[5,null,null,null,null,"",null,null,"",{"$f":"IF(ISERROR(IF(SpecYear=\"1993\",'L to D Lookup'!$E26,'L to D Lookup'!$F26)),0,IF(SpecYear=\"1993\",'L to D Lookup'!$E26,'L to D Lookup'!$F26))","v":""},{"$f":"IF(ISERROR(IF(SpecYear=\"1995\",ROUND(AVERAGE(J50:J51),2),ROUND(AVERAGE(J50:J51),-1))),\"\",IF(SpecYear=\"1995\",ROUND(AVERAGE(J50:J51),2),ROUND(AVERAGE(J50:J51),-1)))","v":""}]
[6,null,null,null,null,"",null,null,"",{"$f":"IF(ISERROR(IF(SpecYear=\"1993\",'L to D Lookup'!$E27,'L to D Lookup'!$F27)),0,IF(SpecYear=\"1993\",'L to D Lookup'!$E27,'L to D Lookup'!$F27))","v":""}]
[7,null,null,null,null,"",null,null,"",{"$f":"IF(ISERROR(IF(SpecYear=\"1993\",'L to D Lookup'!$E28,'L to D Lookup'!$F28)),0,IF(SpecYear=\"1993\",'L to D Lookup'!$E28,'L to D Lookup'!$F28))","v":""},{"$f":"IF(ISERROR(IF(SpecYear=\"1995\",ROUND(AVERAGE(J52:J53),2),ROUND(AVERAGE(J52:J53),-1))),\"\",IF(SpecYear=\"1995\",ROUND(AVERAGE(J52:J53),2),ROUND(AVERAGE(J52:J53),-1)))","v":""}]
[8,null,null,null,null,"",null,null,"",{"$f":"IF(ISERROR(IF(SpecYear=\"1993\",'L to D Lookup'!$E29,'L to D Lookup'!$F29)),0,IF(SpecYear=\"1993\",'L to D Lookup'!$E29,'L to D Lookup'!$F29))","v":""}]
[null,"FLEXURAL STRENGTH"]
[null,"Tex-448-A"]
["Beam","Beam Number","Age (Days)",{"$f":"\"Width of Beam \" & IF(SpecYear=\"\",\"\",IF(SpecYear=\"1995\",\"(millimeter)\",\"(inches)\"))","v":"Width of Beam "},{"$f":"\"Depth of Beam \" & IF(SpecYear=\"\",\"\",IF(SpecYear=\"1995\",\"(millimeter)\",\"(inches)\"))","v":"Depth of Beam "},{"$f":"\"Span Length \" & IF(SpecYear=\"\",\"\",IF(SpecYear=\"1995\",\"(millimeter)\",\"(inches)\"))","v":"Span Length "},{"$f":"\"Max Recording \" & IF(SpecYear=\"\",\"\",IF(SpecYear=\"1995\",\"(kN)\",\"(Lbs.)\"))","v":"Max Recording "},{"$f":"\"*Failure Location \" & IF(SpecYear=\"\",\"\",IF(SpecYear=\"1995\",\"(millimeter)\",\"(inches)\"))","v":"*Failure Location "},{"$f":"\"Modulus of Rupture \" & IF(SpecYear=\"\",\"\",IF(SpecYear=\"1995\",\"(KPa)\",\"(psi)\"))","v":"Modulus of Rupture "},{"$f":"\"Modulus of Rupture (avg) \" &IF(SpecYear=\"\",\"\",IF(SpecYear=\"1995\",\"(KPa)\",\"(psi)\"))","v":"Modulus of Rupture (avg) "}]
[]
[1,null,null,null,null,{"$f":"IF(OR(E58=0,SpecYear=\"\"),\"\",IF(SpecYear=\"1995\",457,18))","v":""},null,null,{"$f":"IF(SpecYear=\"1995\",'L to D Lookup'!$F2,'L to D Lookup'!$E2)","v":""},{"$f":"IF(ISERROR(IF(SpecYear=\"1995\",ROUND(AVERAGE(I58:I59)*2,-2)/2,ROUND(AVERAGE(I58:I59)*2,-1)/2)),\"\",IF(SpecYear=\"1995\",ROUND(AVERAGE(I58:I59)*2,-2)/2,ROUND(AVERAGE(I58:I59)*2,-1)/2))","v":""}]
[2,null,null,null,null,"",null,null,{"$f":"IF(SpecYear=\"1995\",'L to D Lookup'!$F3,'L to D Lookup'!$E3)","v":""}]
[3,null,null,null,null,"",null,null,{"$f":"IF(SpecYear=\"1995\",'L to D Lookup'!$F4,'L to D Lookup'!$E4)","v":""},{"$f":"IF(ISERROR(IF(SpecYear=\"1995\",ROUND(AVERAGE(I60:I61)*2,-2)/2,ROUND(AVERAGE(I60:I61)*2,-1)/2)),\"\",IF(SpecYear=\"1995\",ROUND(AVERAGE(I60:I61)*2,-2)/2,ROUND(AVERAGE(I60:I61)*2,-1)/2))","v":""}]
[4,null,null,null,null,"",null,null,{"$f":"IF(SpecYear=\"1995\",'L to D Lookup'!$F5,'L to D Lookup'!$E5)","v":""}]
[5,null,null,null,null,"",null,null,{"$f":"IF(SpecYear=\"1995\",'L to D Lookup'!$F6,'L to D Lookup'!$E6)","v":""},{"$f":"IF(ISERROR(IF(SpecYear=\"1995\",ROUND(AVERAGE(I62:I63)*2,-2)/2,ROUND(AVERAGE(I62:I63)*2,-1)/2)),\"\",IF(SpecYear=\"1995\",ROUND(AVERAGE(I62:I63)*2,-2)/2,ROUND(AVERAGE(I62:I63)*2,-1)/2))","v":""}]
[6,null,null,null,null,"",null,null,{"$f":"IF(SpecYear=\"1995\",'L to D Lookup'!$F7,'L to D Lookup'!$E7)","v":""}]
[7,null,null,null,null,"",null,null,{"$f":"IF(SpecYear=\"1995\",'L to D Lookup'!$F8,'L to D Lookup'!$E8)","v":""},{"$f":"IF(ISERROR(IF(SpecYear=\"1995\",ROUND(AVERAGE(I64:I65)*2,-2)/2,ROUND(AVERAGE(I64:I65)*2,-1)/2)),\"\",IF(SpecYear=\"1995\",ROUND(AVERAGE(I64:I65)*2,-2)/2,ROUND(AVERAGE(I64:I65)*2,-1)/2))","v":""}]
[8,null,null,null,null,"",null,null,{"$f":"IF(SpecYear=\"1995\",'L to D Lookup'!$F9,'L to D Lookup'!$E9)","v":""}]
["* When outside the middle 1/3, distance from the line of the fracture to the nearest support measured along the bottom of the beam."]
[null,"Remarks:",{"$f":"NOW()","v":"2023-09-01T07:50:14.570"}]
[]
[]
[]
[]
[]
[null,"Sample Method:","Sampled By:",null,null,"Sampled Date:"]
[null,"TX407"," ",null,null," "]
[null,"Test Method:","Tested By:",null,null,"Tested Date:"]
[null,"TX415"," ",null,null," "]
[]
[null,"TX418"," ",null,null," "]
[]
[null,"TX424"," ",null,null," "]
[]
[null,"TX448"," ",null,null," "]
[]
[null,"TX424,III"," ",null,null," "]
[null,"Test Stamp Code:",null,null,"Omit Test:","Completed Date:","Reviewed By:"]
[]
[null,"Locked By:","TxDOT:","District:","Area:"]
[null,"","","",""]
[null,"Authorized By:",null,null,"Authorized Date:"]
[null,null,null,null,null,{"$f":"IF(OR(ISBLANK(AuthorizedDate), AuthorizedDate>=43144), 1, 0)","v":1}]

{"sheet":"RX","index":1,"n_rows":232,"n_cols":9,"rows_kept":232,"cut":false,"hidden":true,"merged":[]}
[{"$f":"COUNTA(A3:A5000)","v":230}]
["Fld_nbr","Value","Desc_1","Desc_2","Desc_3","Desc_4","Desc_5","Desc_6","Desc_7"]
[1,{"$f":"IF('Tex-415,18,24,48-A'!$B$68=\"\",\"\",'Tex-415,18,24,48-A'!$B$68)","v":""},{"$f":"'Tex-415,18,24,48-A'!$B$67","v":"Remarks:"}]
[2,{"$f":"IF('Tex-415,18,24,48-A'!$D$19=\"\",\"\",'Tex-415,18,24,48-A'!$D$19)","v":""},{"$f":"IF('Tex-415,18,24,48-A'!$C$19=\"\",\"\",'Tex-415,18,24,48-A'!$C$19)","v":"COURSE\\LIFT:"}]
[3,{"$f":"IF('Tex-415,18,24,48-A'!$C$76=\"\",\"\",'Tex-415,18,24,48-A'!$C$76)","v":" "},"Tested By ",{"$f":"IF('Tex-415,18,24,48-A'!$B$76=\"\",\"\",'Tex-415,18,24,48-A'!$B$76)","v":"TX415"}]
[4,{"$f":"IF('Tex-415,18,24,48-A'!$F$76=\"\",\"\",'Tex-415,18,24,48-A'!$F$76)","v":" "},"Tested Date ",{"$f":"IF('Tex-415,18,24,48-A'!$B$76=\"\",\"\",'Tex-415,18,24,48-A'!$B$76)","v":"TX415"}]
[5,{"$f":"IF('Tex-415,18,24,48-A'!$C$78=\"\",\"\",'Tex-415,18,24,48-A'!$C$78)","v":" "},"Tested By ",{"$f":"IF('Tex-415,18,24,48-A'!$B$78=\"\",\"\",'Tex-415,18,24,48-A'!$B$78)","v":"TX418"}]
[6,{"$f":"IF('Tex-415,18,24,48-A'!$F$78=\"\",\"\",'Tex-415,18,24,48-A'!$F$78)","v":" "},"Tested Date ",{"$f":"IF('Tex-415,18,24,48-A'!$B$78=\"\",\"\",'Tex-415,18,24,48-A'!$B$78)","v":"TX418"}]
[7,{"$f":"IF('Tex-415,18,24,48-A'!$C$80=\"\",\"\",'Tex-415,18,24,48-A'!$C$80)","v":" "},"Tested By ",{"$f":"IF('Tex-415,18,24,48-A'!$B$80=\"\",\"\",'Tex-415,18,24,48-A'!$B$80)","v":"TX424"}]
[8,{"$f":"IF('Tex-415,18,24,48-A'!$F$80=\"\",\"\",'Tex-415,18,24,48-A'!$F$80)","v":" "},"Tested Date ",{"$f":"IF('Tex-415,18,24,48-A'!$B$80=\"\",\"\",'Tex-415,18,24,48-A'!$B$80)","v":"TX424"}]
[9,{"$f":"IF('Tex-415,18,24,48-A'!$C$82=\"\",\"\",'Tex-415,18,24,48-A'!$C$82)","v":" "},"Tested By ",{"$f":"IF('Tex-415,18,24,48-A'!$B$82=\"\",\"\",'Tex-415,18,24,48-A'!$B$82)","v":"TX448"}]
[10,{"$f":"IF('Tex-415,18,24,48-A'!$F$82=\"\",\"\",'Tex-415,18,24,48-A'!$F$82)","v":" "},"Tested Date ",{"$f":"IF('Tex-415,18,24,48-A'!$B$82=\"\",\"\",'Tex-415,18,24,48-A'!$B$82)","v":"TX448"}]
[11,{"$f":"IF('Tex-415,18,24,48-A'!$C$24=\"\",\"\",'Tex-415,18,24,48-A'!$C$24)","v":""},{"$f":"IF('Tex-415,18,24,48-A'!$B$6=\"\",\"\",'Tex-415,18,24,48-A'!$B$6)","v":"Tex-415,18,24,48-A"},{"$f":"IF('Tex-415,18,24,48-A'!$B$24=\"\",\"\",'Tex-415,18,24,48-A'!$B$24)","v":"Mix Design #"}]
[12,{"$f":"IF('Tex-415,18,24,48-A'!$G$24=\"\",\"\",'Tex-415,18,24,48-A'!$G$24)","v":""},{"$f":"IF('Tex-415,18,24,48-A'!$E$23=\"\",\"\",'Tex-415,18,24,48-A'!$E$23)","v":"Tex-415-A"},{"$f":"IF('Tex-415,18,24,48-A'!$E$24=\"\",\"\",'Tex-415,18,24,48-A'!$E$24)","v":"Slump "}]
[13,{"$f":"IF('Tex-415,18,24,48-A'!$E$28=\"\",\"\",'Tex-415,18,24,48-A'!$E$28)","v":""},{"$f":"IF('Tex-415,18,24,48-A'!$B$27=\"\",\"\",'Tex-415,18,24,48-A'!$B$27)","v":"Tex-418-A"},{"$f":"IF('Tex-415,18,24,48-A'!$B$28=\"\",\"\",'Tex-415,18,24,48-A'!$B$28)","v":"7-Day Target Strength  :"}]
[14,{"$f":"IF('Tex-415,18,24,48-A'!$I$28=\"\",\"\",'Tex-415,18,24,48-A'!$I$28)","v":""},{"$f":"IF('Tex-415,18,24,48-A'!$B$27=\"\",\"\",'Tex-415,18,24,48-A'!$B$27)","v":"Tex-418-A"},{"$f":"IF('Tex-415,18,24,48-A'!$F$28=\"\",\"\",'Tex-415,18,24,48-A'!$F$28)","v":"28-Day Design Strength f'c  :"}]
[15,{"$f":"IF('Tex-415,18,24,48-A'!$B$33=\"\",\"\",'Tex-415,18,24,48-A'!$B$33)","v":""},{"$f":"IF('Tex-415,18,24,48-A'!$B$27=\"\",\"\",'Tex-415,18,24,48-A'!$B$27)","v":"Tex-418-A"},{"$f":"IF('Tex-415,18,24,48-A'!$A$30=\"\",\"\",'Tex-415,18,24,48-A'!$A$30)","v":"Cylinder"},{"$f":"IF('Tex-415,18,24,48-A'!$A$33=\"\",\"\",'Tex-415,18,24,48-A'!$A$33)","v":1},{"$f":"IF('Tex-415,18,24,48-A'!$B$30=\"\",\"\",'Tex-415,18,24,48-A'!$B$30)","v":"Cylinder Number"}]
[16,{"$f":"IF('Tex-415,18,24,48-A'!$C$33=\"\",\"\",'Tex-415,18,24,48-A'!$C$33)","v":""},{"$f":"IF('Tex-415,18,24,48-A'!$B$27=\"\",\"\",'Tex-415,18,24,48-A'!$B$27)","v":"Tex-418-A"},{"$f":"IF('Tex-415,18,24,48-A'!$A$30=\"\",\"\",'Tex-415,18,24,48-A'!$A$30)","v":"Cylinder"},{"$f":"IF('Tex-415,18,24,48-A'!$A$33=\"\",\"\",'Tex-415,18,24,48-A'!$A$33)","v":1},{"$f":"IF('Tex-415,18,24,48-A'!$C$30=\"\",\"\",'Tex-415,18,24,48-A'!$C$30)","v":"Age (Days)"}]
[17,{"$f":"IF('Tex-415,18,24,48-A'!$D$33=\"\",\"\",'Tex-415,18,24,48-A'!$D$33)","v":""},{"$f":"IF('Tex-415,18,24,48-A'!$B$27=\"\",\"\",'Tex-415,18,24,48-A'!$B$27)","v":"Tex-418-A"},{"$f":"IF('Tex-415,18,24,48-A'!$A$30=\"\",\"\",'Tex-415,18,24,48-A'!$A$30)","v":"Cylinder"},{"$f":"IF('Tex-415,18,24,48-A'!$A$33=\"\",\"\",'Tex-415,18,24,48-A'!$A$33)","v":1},{"$f":"IF('Tex-415,18,24,48-A'!$D$31=\"\",\"\",'Tex-415,18,24,48-A'!$D$31)","v":" of Cylinder "}]
[18,{"$f":"IF('Tex-415,18,24,48-A'!$E$33=\"\",\"\",'Tex-415,18,24,48-A'!$E$33)","v":""},{"$f":"IF('Tex-415,18,24,48-A'!$B$27=\"\",\"\",'Tex-415,18,24,48-A'!$B$27)","v":"Tex-418-A"},{"$f":"IF('Tex-415,18,24,48-A'!$A$30=\"\",\"\",'Tex-415,18,24,48-A'!$A$30)","v":"Cylinder"},{"$f":"IF('Tex-415,18,24,48-A'!$A$33=\"\",\"\",'Tex-415,18,24,48-A'!$A$33)","v":1},{"$f":"IF('Tex-415,18,24,48-A'!$E$30=\"\",\"\",'Tex-415,18,24,48-A'!$E$30)","v":"Length of Cylinder "}]
[19,{"$f":"IF('Tex-415,18,24,48-A'!$F$33=\"\",\"\",'Tex-415,18,24,48-A'!$F$33)","v":""},{"$f":"IF('Tex-415,18,24,48-A'!$B$27=\"\",\"\",'Tex-415,18,24,48-A'!$B$27)","v":"Tex-418-A"},{"$f":"IF('Tex-415,18,24,48-A'!$A$30=\"\",\"\",'Tex-415,18,24,48-A'!$A$30)","v":"Cylinder"},{"$f":"IF('Tex-415,18,24,48-A'!$A$33=\"\",\"\",'Tex-415,18,24,48-A'!$A$33)","v":1},{"$f":"IF('Tex-415,18,24,48-A'!$F$30=\"\",\"\",'Tex-415,18,24,48-A'!$F$30)","v":"Length to Diameter Ratio"}]
[20,{"$f":"IF('Tex-415,18,24,48-A'!$G$33=\"\",\"\",'Tex-415,18,24,48-A'!$G$33)","v":""},{"$f":"IF('Tex-415,18,24,48-A'!$B$27=\"\",\"\",'Tex-415,18,24,48-A'!$B$27)","v":"Tex-418-A"},{"$f":"IF('Tex-415,18,24,48-A'!$A$30=\"\",\"\",'Tex-415,18,24,48-A'!$A$30)","v":"Cylinder"},{"$f":"IF('Tex-415,18,24,48-A'!$A$33=\"\",\"\",'Tex-415,18,24,48-A'!$A$33)","v":1},{"$f":"IF('Tex-415,18,24,48-A'!$G$30=\"\",\"\",'Tex-415,18,24,48-A'!$G$30)","v":"Max Load "}]
[21,{"$f":"IF('Tex-415,18,24,48-A'!$H$33=\"\",\"\",'Tex-415,18,24,48-A'!$H$33)","v":""},{"$f":"IF('Tex-415,18,24,48-A'!$B$27=\"\",\"\",'Tex-415,18,24,48-A'!$B$27)","v":"Tex-418-A"},{"$f":"IF('Tex-415,18,24,48-A'!$A$30=\"\",\"\",'Tex-415,18,24,48-A'!$A$30)","v":"Cylinder"},{"$f":"IF('Tex-415,18,24,48-A'!$A$33=\"\",\"\",'Tex-415,18,24,48-A'!$A$33)","v":1},{"$f":"IF('Tex-415,18,24,48-A'!$H$30=\"\",\"\",'Tex-415,18,24,48-A'!$H$30)","v":"Failure Type"}]
[22,{"$f":"IF('Tex-415,18,24,48-A'!$I$33=\"\",\"\",'Tex-415,18,24,48-A'!$I$33)","v":""},{"$f":"IF('Tex-415,18,24,48-A'!$B$27=\"\",\"\",'Tex-415,18,24,48-A'!$B$27)","v":"Tex-418-A"},{"$f":"IF('Tex-415,18,24,48-A'!$A$30=\"\",\"\",'Tex-415,18,24,48-A'!$A$30)","v":"Cylinder"},{"$f":"IF('Tex-415,18,24,48-A'!$A$33=\"\",\"\",'Tex-415,18,24,48-A'!$A$33)","v":1},{"$f":"IF('Tex-415,18,24,48-A'!$I$30=\"\",\"\",'Tex-415,18,24,48-A'!$I$30)","v":"Correction Factor"}]
[23,{"$f":"IF('Tex-415,18,24,48-A'!$J$33=\"\",\"\",'Tex-415,18,24,48-A'!$J$33)","v":""},{"$f":"IF('Tex-415,18,24,48-A'!$B$27=\"\",\"\",'Tex-415,18,24,48-A'!$B$27)","v":"Tex-418-A"},{"$f":"IF('Tex-415,18,24,48-A'!$A$30=\"\",\"\",'Tex-415,18,24,48-A'!$A$30)","v":"Cylinder"},{"$f":"IF('Tex-415,18,24,48-A'!$A$33=\"\",\"\",'Tex-415,18,24,48-A'!$A$33)","v":1},{"$f":"IF('Tex-415,18,24,48-A'!$J$30=\"\",\"\",'Tex-415,18,24,48-A'!$J$30)","v":"Compressive Strength "}]
[24,{"$f":"IF('Tex-415,18,24,48-A'!$K$33=\"\",\"\",'Tex-415,18,24,48-A'!$K$33)","v":""},{"$f":"IF('Tex-415,18,24,48-A'!$B$27=\"\",\"\",'Tex-415,18,24,48-A'!$B$27)","v":"Tex-418-A"},{"$f":"IF('Tex-415,18,24,48-A'!$A$30=\"\",\"\",'Tex-415,18,24,48-A'!$A$30)","v":"Cylinder"},{"$f":"IF('Tex-415,18,24,48-A'!$A$33=\"\",\"\",'Tex-415,18,24,48-A'!$A$33)","v":1},{"$f":"IF('Tex-415,18,24,48-A'!$K$30=\"\",\"\",'Tex-415,18,24,48-A'!$K$30)","v":"Compressive Strength Average "}]
[25,{"$f":"IF('Tex-415,18,24,48-A'!$L$33=\"\",\"\",'Tex-415,18,24,48-A'!$L$33)","v":""},{"$f":"IF('Tex-415,18,24,48-A'!$B$27=\"\",\"\",'Tex-415,18,24,48-A'!$B$27)","v":"Tex-418-A"},{"$f":"IF('Tex-415,18,24,48-A'!$A$30=\"\",\"\",'Tex-415,18,24,48-A'!$A$30)","v":"Cylinder"},{"$f":"IF('Tex-415,18,24,48-A'!$A$33=\"\",\"\",'Tex-415,18,24,48-A'!$A$33)","v":1},{"$f":"IF('Tex-415,18,24,48-A'!$L$30=\"\",\"\",'Tex-415,18,24,48-A'!$L$30)","v":"Meets Strength Requirement"}]
[26,{"$f":"IF('Tex-415,18,24,48-A'!$B$34=\"\",\"\",'Tex-415,18,24,48-A'!$B$34)","v":""},{"$f":"IF('Tex-415,18,24,48-A'!$B$27=\"\",\"\",'Tex-415,18,24,48-A'!$B$27)","v":"Tex-418-A"},{"$f":"IF('Tex-415,18,24,48-A'!$A$30=\"\",\"\",'Tex-415,18,24,48-A'!$A$30)","v":"Cylinder"},{"$f":"IF('Tex-415,18,24,48-A'!$A$34=\"\",\"\",'Tex-415,18,24,48-A'!$A$34)","v":2},{"$f":"IF('Tex-415,18,24,48-A'!$B$30=\"\",\"\",'Tex-415,18,24,48-A'!$B$30)","v":"Cylinder Number"}]
[27,{"$f":"IF('Tex-415,18,24,48-A'!$D$34=\"\",\"\",'Tex-415,18,24,48-A'!$D$34)","v":""},{"$f":"IF('Tex-415,18,24,48-A'!$B$27=\"\",\"\",'Tex-415,18,24,48-A'!$B$27)","v":"Tex-418-A"},{"$f":"IF('Tex-415,18,24,48-A'!$A$30=\"\",\"\",'Tex-415,18,24,48-A'!$A$30)","v":"Cylinder"},{"$f":"IF('Tex-415,18,24,48-A'!$A$34=\"\",\"\",'Tex-415,18,24,48-A'!$A$34)","v":2},{"$f":"IF('Tex-415,18,24,48-A'!$D$31=\"\",\"\",'Tex-415,18,24,48-A'!$D$31)","v":" of Cylinder "}]
[28,{"$f":"IF('Tex-415,18,24,48-A'!$E$34=\"\",\"\",'Tex-415,18,24,48-A'!$E$34)","v":""},{"$f":"IF('Tex-415,18,24,48-A'!$B$27=\"\",\"\",'Tex-415,18,24,48-A'!$B$27)","v":"Tex-418-A"},{"$f":"IF('Tex-415,18,24,48-A'!$A$30=\"\",\"\",'Tex-415,18,24,48-A'!$A$30)","v":"Cylinder"},{"$f":"IF('Tex-415,18,24,48-A'!$A$34=\"\",\"\",'Tex-415,18,24,48-A'!$A$34)","v":2},{"$f":"IF('Tex-415,18,24,48-A'!$E$30=\"\",\"\",'Tex-415,18,24,48-A'!$E$30)","v":"Length of Cylinder "}]
[29,{"$f":"IF('Tex-415,18,24,48-A'!$F$34=\"\",\"\",'Tex-415,18,24,48-A'!$F$34)","v":""},{"$f":"IF('Tex-415,18,24,48-A'!$B$27=\"\",\"\",'Tex-415,18,24,48-A'!$B$27)","v":"Tex-418-A"},{"$f":"IF('Tex-415,18,24,48-A'!$A$30=\"\",\"\",'Tex-415,18,24,48-A'!$A$30)","v":"Cylinder"},{"$f":"IF('Tex-415,18,24,48-A'!$A$34=\"\",\"\",'Tex-415,18,24,48-A'!$A$34)","v":2},{"$f":"IF('Tex-415,18,24,48-A'!$F$30=\"\",\"\",'Tex-415,18,24,48-A'!$F$30)","v":"Length to Diameter Ratio"}]
[30,{"$f":"IF('Tex-415,18,24,48-A'!$G$34=\"\",\"\",'Tex-415,18,24,48-A'!$G$34)","v":""},{"$f":"IF('Tex-415,18,24,48-A'!$B$27=\"\",\"\",'Tex-415,18,24,48-A'!$B$27)","v":"Tex-418-A"},{"$f":"IF('Tex-415,18,24,48-A'!$A$30=\"\",\"\",'Tex-415,18,24,48-A'!$A$30)","v":"Cylinder"},{"$f":"IF('Tex-415,18,24,48-A'!$A$34=\"\",\"\",'Tex-415,18,24,48-A'!$A$34)","v":2},{"$f":"IF('Tex-415,18,24,48-A'!$G$30=\"\",\"\",'Tex-415,18,24,48-A'!$G$30)","v":"Max Load "}]
[31,{"$f":"IF('Tex-415,18,24,48-A'!$H$34=\"\",\"\",'Tex-415,18,24,48-A'!$H$34)","v":""},{"$f":"IF('Tex-415,18,24,48-A'!$B$27=\"\",\"\",'Tex-415,18,24,48-A'!$B$27)","v":"Tex-418-A"},{"$f":"IF('Tex-415,18,24,48-A'!$A$30=\"\",\"\",'Tex-415,18,24,48-A'!$A$30)","v":"Cylinder"},{"$f":"IF('Tex-415,18,24,48-A'!$A$34=\"\",\"\",'Tex-415,18,24,48-A'!$A$34)","v":2},{"$f":"IF('Tex-415,18,24,48-A'!$H$30=\"\",\"\",'Tex-415,18,24,48-A'!$H$30)","v":"Failure Type"}]
[32,{"$f":"IF('Tex-415,18,24,48-A'!$I$34=\"\",\"\",'Tex-415,18,24,48-A'!$I$34)","v":""},{"$f":"IF('Tex-415,18,24,48-A'!$B$27=\"\",\"\",'Tex-415,18,24,48-A'!$B$27)","v":"Tex-418-A"},{"$f":"IF('Tex-415,18,24,48-A'!$A$30=\"\",\"\",'Tex-415,18,24,48-A'!$A$30)","v":"Cylinder"},{"$f":"IF('Tex-415,18,24,48-A'!$A$34=\"\",\"\",'Tex-415,18,24,48-A'!$A$34)","v":2},{"$f":"IF('Tex-415,18,24,48-A'!$I$30=\"\",\"\",'Tex-415,18,24,48-A'!$I$30)","v":"Correction Factor"}]
[33,{"$f":"IF('Tex-415,18,24,48-A'!$J$34=\"\",\"\",'Tex-415,18,24,48-A'!$J$34)","v":""},{"$f":"IF('Tex-415,18,24,48-A'!$B$27=\"\",\"\",'Tex-415,18,24,48-A'!$B$27)","v":"Tex-418-A"},{"$f":"IF('Tex-415,18,24,48-A'!$A$30=\"\",\"\",'Tex-415,18,24,48-A'!$A$30)","v":"Cylinder"},{"$f":"IF('Tex-415,18,24,48-A'!$A$34=\"\",\"\",'Tex-415,18,24,48-A'!$A$34)","v":2},{"$f":"IF('Tex-415,18,24,48-A'!$J$30=\"\",\"\",'Tex-415,18,24,48-A'!$J$30)","v":"Compressive Strength "}]
[34,{"$f":"IF('Tex-415,18,24,48-A'!$B$35=\"\",\"\",'Tex-415,18,24,48-A'!$B$35)","v":""},{"$f":"IF('Tex-415,18,24,48-A'!$B$27=\"\",\"\",'Tex-415,18,24,48-A'!$B$27)","v":"Tex-418-A"},{"$f":"IF('Tex-415,18,24,48-A'!$A$30=\"\",\"\",'Tex-415,18,24,48-A'!$A$30)","v":"Cylinder"},{"$f":"IF('Tex-415,18,24,48-A'!$A$35=\"\",\"\",'Tex-415,18,24,48-A'!$A$35)","v":3},{"$f":"IF('Tex-415,18,24,48-A'!$B$30=\"\",\"\",'Tex-415,18,24,48-A'!$B$30)","v":"Cylinder Number"}]
[35,{"$f":"IF('Tex-415,18,24,48-A'!$C$35=\"\",\"\",'Tex-415,18,24,48-A'!$C$35)","v":""},{"$f":"IF('Tex-415,18,24,48-A'!$B$27=\"\",\"\",'Tex-415,18,24,48-A'!$B$27)","v":"Tex-418-A"},{"$f":"IF('Tex-415,18,24,48-A'!$A$30=\"\",\"\",'Tex-415,18,24,48-A'!$A$30)","v":"Cylinder"},{"$f":"IF('Tex-415,18,24,48-A'!$A$35=\"\",\"\",'Tex-415,18,24,48-A'!$A$35)","v":3},{"$f":"IF('Tex-415,18,24,48-A'!$C$30=\"\",\"\",'Tex-415,18,24,48-A'!$C$30)","v":"Age (Days)"}]
[36,{"$f":"IF('Tex-415,18,24,48-A'!$D$35=\"\",\"\",'Tex-415,18,24,48-A'!$D$35)","v":""},{"$f":"IF('Tex-415,18,24,48-A'!$B$27=\"\",\"\",'Tex-415,18,24,48-A'!$B$27)","v":"Tex-418-A"},{"$f":"IF('Tex-415,18,24,48-A'!$A$30=\"\",\"\",'Tex-415,18,24,48-A'!$A$30)","v":"Cylinder"},{"$f":"IF('Tex-415,18,24,48-A'!$A$35=\"\",\"\",'Tex-415,18,24,48-A'!$A$35)","v":3},{"$f":"IF('Tex-415,18,24,48-A'!$D$31=\"\",\"\",'Tex-415,18,24,48-A'!$D$31)","v":" of Cylinder "}]
[37,{"$f":"IF('Tex-415,18,24,48-A'!$E$35=\"\",\"\",'Tex-415,18,24,48-A'!$E$35)","v":""},{"$f":"IF('Tex-415,18,24,48-A'!$B$27=\"\",\"\",'Tex-415,18,24,48-A'!$B$27)","v":"Tex-418-A"},{"$f":"IF('Tex-415,18,24,48-A'!$A$30=\"\",\"\",'Tex-415,18,24,48-A'!$A$30)","v":"Cylinder"},{"$f":"IF('Tex-415,18,24,48-A'!$A$35=\"\",\"\",'Tex-415,18,24,48-A'!$A$35)","v":3},{"$f":"IF('Tex-415,18,24,48-A'!$E$30=\"\",\"\",'Tex-415,18,24,48-A'!$E$30)","v":"Length of Cylinder "}]
[38,{"$f":"IF('Tex-415,18,24,48-A'!$F$35=\"\",\"\",'Tex-415,18,24,48-A'!$F$35)","v":""},{"$f":"IF('Tex-415,18,24,48-A'!$B$27=\"\",\"\",'Tex-415,18,24,48-A'!$B$27)","v":"Tex-418-A"},{"$f":"IF('Tex-415,18,24,48-A'!$A$30=\"\",\"\",'Tex-415,18,24,48-A'!$A$30)","v":"Cylinder"},{"$f":"IF('Tex-415,18,24,48-A'!$A$35=\"\",\"\",'Tex-415,18,24,48-A'!$A$35)","v":3},{"$f":"IF('Tex-415,18,24,48-A'!$F$30=\"\",\"\",'Tex-415,18,24,48-A'!$F$30)","v":"Length to Diameter Ratio"}]
[39,{"$f":"IF('Tex-415,18,24,48-A'!$G$35=\"\",\"\",'Tex-415,18,24,48-A'!$G$35)","v":""},{"$f":"IF('Tex-415,18,24,48-A'!$B$27=\"\",\"\",'Tex-415,18,24,48-A'!$B$27)","v":"Tex-418-A"},{"$f":"IF('Tex-415,18,24,48-A'!$A$30=\"\",\"\",'Tex-415,18,24,48-A'!$A$30)","v":"Cylinder"},{"$f":"IF('Tex-415,18,24,48-A'!$A$35=\"\",\"\",'Tex-415,18,24,48-A'!$A$35)","v":3},{"$f":"IF('Tex-415,18,24,48-A'!$G$30=\"\",\"\",'Tex-415,18,24,48-A'!$G$30)","v":"Max Load "}]
[40,{"$f":"IF('Tex-415,18,24,48-A'!$H$35=\"\",\"\",'Tex-415,18,24,48-A'!$H$35)","v":""},{"$f":"IF('Tex-415,18,24,48-A'!$B$27=\"\",\"\",'Tex-415,18,24,48-A'!$B$27)","v":"Tex-418-A"},{"$f":"IF('Tex-415,18,24,48-A'!$A$30=\"\",\"\",'Tex-415,18,24,48-A'!$A$30)","v":"Cylinder"},{"$f":"IF('Tex-415,18,24,48-A'!$A$35=\"\",\"\",'Tex-415,18,24,48-A'!$A$35)","v":3},{"$f":"IF('Tex-415,18,24,48-A'!$H$30=\"\",\"\",'Tex-415,18,24,48-A'!$H$30)","v":"Failure Type"}]
[41,{"$f":"IF('Tex-415,18,24,48-A'!$I$35=\"\",\"\",'Tex-415,18,24,48-A'!$I$35)","v":""},{"$f":"IF('Tex-415,18,24,48-A'!$B$27=\"\",\"\",'Tex-415,18,24,48-A'!$B$27)","v":"Tex-418-A"},{"$f":"IF('Tex-415,18,24,48-A'!$A$30=\"\",\"\",'Tex-415,18,24,48-A'!$A$30)","v":"Cylinder"},{"$f":"IF('Tex-415,18,24,48-A'!$A$35=\"\",\"\",'Tex-415,18,24,48-A'!$A$35)","v":3},{"$f":"IF('Tex-415,18,24,48-A'!$I$30=\"\",\"\",'Tex-415,18,24,48-A'!$I$30)","v":"Correction Factor"}]
[42,{"$f":"IF('Tex-415,18,24,48-A'!$J$35=\"\",\"\",'Tex-415,18,24,48-A'!$J$35)","v":""},{"$f":"IF('Tex-415,18,24,48-A'!$B$27=\"\",\"\",'Tex-415,18,24,48-A'!$B$27)","v":"Tex-418-A"},{"$f":"IF('Tex-415,18,24,48-A'!$A$30=\"\",\"\",'Tex-415,18,24,48-A'!$A$30)","v":"Cylinder"},{"$f":"IF('Tex-415,18,24,48-A'!$A$35=\"\",\"\",'Tex-415,18,24,48-A'!$A$35)","v":3},{"$f":"IF('Tex-415,18,24,48-A'!$J$30=\"\",\"\",'Tex-415,18,24,48-A'!$J$30)","v":"Compressive Strength "}]
[43,{"$f":"IF('Tex-415,18,24,48-A'!$K$35=\"\",\"\",'Tex-415,18,24,48-A'!$K$35)","v":""},{"$f":"IF('Tex-415,18,24,48-A'!$B$27=\"\",\"\",'Tex-415,18,24,48-A'!$B$27)","v":"Tex-418-A"},{"$f":"IF('Tex-415,18,24,48-A'!$A$30=\"\",\"\",'Tex-415,18,24,48-A'!$A$30)","v":"Cylinder"},{"$f":"IF('Tex-415,18,24,48-A'!$A$35=\"\",\"\",'Tex-415,18,24,48-A'!$A$35)","v":3},{"$f":"IF('Tex-415,18,24,48-A'!$K$30=\"\",\"\",'Tex-415,18,24,48-A'!$K$30)","v":"Compressive Strength Average "}]
[44,{"$f":"IF('Tex-415,18,24,48-A'!$L$35=\"\",\"\",'Tex-415,18,24,48-A'!$L$35)","v":""},{"$f":"IF('Tex-415,18,24,48-A'!$B$27=\"\",\"\",'Tex-415,18,24,48-A'!$B$27)","v":"Tex-418-A"},{"$f":"IF('Tex-415,18,24,48-A'!$A$30=\"\",\"\",'Tex-415,18,24,48-A'!$A$30)","v":"Cylinder"},{"$f":"IF('Tex-415,18,24,48-A'!$A$35=\"\",\"\",'Tex-415,18,24,48-A'!$A$35)","v":3},{"$f":"IF('Tex-415,18,24,48-A'!$L$30=\"\",\"\",'Tex-415,18,24,48-A'!$L$30)","v":"Meets Strength Requirement"}]
[45,{"$f":"IF('Tex-415,18,24,48-A'!$B$36=\"\",\"\",'Tex-415,18,24,48-A'!$B$36)","v":""},{"$f":"IF('Tex-415,18,24,48-A'!$B$27=\"\",\"\",'Tex-415,18,24,48-A'!$B$27)","v":"Tex-418-A"},{"$f":"IF('Tex-415,18,24,48-A'!$A$30=\"\",\"\",'Tex-415,18,24,48-A'!$A$30)","v":"Cylinder"},{"$f":"IF('Tex-415,18,24,48-A'!$A$36=\"\",\"\",'Tex-415,18,24,48-A'!$A$36)","v":4},{"$f":"IF('Tex-415,18,24,48-A'!$B$30=\"\",\"\",'Tex-415,18,24,48-A'!$B$30)","v":"Cylinder Number"}]
[46,{"$f":"IF('Tex-415,18,24,48-A'!$D$36=\"\",\"\",'Tex-415,18,24,48-A'!$D$36)","v":""},{"$f":"IF('Tex-415,18,24,48-A'!$B$27=\"\",\"\",'Tex-415,18,24,48-A'!$B$27)","v":"Tex-418-A"},{"$f":"IF('Tex-415,18,24,48-A'!$A$30=\"\",\"\",'Tex-415,18,24,48-A'!$A$30)","v":"Cylinder"},{"$f":"IF('Tex-415,18,24,48-A'!$A$36=\"\",\"\",'Tex-415,18,24,48-A'!$A$36)","v":4},{"$f":"IF('Tex-415,18,24,48-A'!$D$31=\"\",\"\",'Tex-415,18,24,48-A'!$D$31)","v":" of Cylinder "}]
[47,{"$f":"IF('Tex-415,18,24,48-A'!$E$36=\"\",\"\",'Tex-415,18,24,48-A'!$E$36)","v":""},{"$f":"IF('Tex-415,18,24,48-A'!$B$27=\"\",\"\",'Tex-415,18,24,48-A'!$B$27)","v":"Tex-418-A"},{"$f":"IF('Tex-415,18,24,48-A'!$A$30=\"\",\"\",'Tex-415,18,24,48-A'!$A$30)","v":"Cylinder"},{"$f":"IF('Tex-415,18,24,48-A'!$A$36=\"\",\"\",'Tex-415,18,24,48-A'!$A$36)","v":4},{"$f":"IF('Tex-415,18,24,48-A'!$E$30=\"\",\"\",'Tex-415,18,24,48-A'!$E$30)","v":"Length of Cylinder "}]
[48,{"$f":"IF('Tex-415,18,24,48-A'!$F$36=\"\",\"\",'Tex-415,18,24,48-A'!$F$36)","v":""},{"$f":"IF('Tex-415,18,24,48-A'!$B$27=\"\",\"\",'Tex-415,18,24,48-A'!$B$27)","v":"Tex-418-A"},{"$f":"IF('Tex-415,18,24,48-A'!$A$30=\"\",\"\",'Tex-415,18,24,48-A'!$A$30)","v":"Cylinder"},{"$f":"IF('Tex-415,18,24,48-A'!$A$36=\"\",\"\",'Tex-415,18,24,48-A'!$A$36)","v":4},{"$f":"IF('Tex-415,18,24,48-A'!$F$30=\"\",\"\",'Tex-415,18,24,48-A'!$F$30)","v":"Length to Diameter Ratio"}]
[49,{"$f":"IF('Tex-415,18,24,48-A'!$G$36=\"\",\"\",'Tex-415,18,24,48-A'!$G$36)","v":""},{"$f":"IF('Tex-415,18,24,48-A'!$B$27=\"\",\"\",'Tex-415,18,24,48-A'!$B$27)","v":"Tex-418-A"},{"$f":"IF('Tex-415,18,24,48-A'!$A$30=\"\",\"\",'Tex-415,18,24,48-A'!$A$30)","v":"Cylinder"},{"$f":"IF('Tex-415,18,24,48-A'!$A$36=\"\",\"\",'Tex-415,18,24,48-A'!$A$36)","v":4},{"$f":"IF('Tex-415,18,24,48-A'!$G$30=\"\",\"\",'Tex-415,18,24,48-A'!$G$30)","v":"Max Load "}]
[50,{"$f":"IF('Tex-415,18,24,48-A'!$H$36=\"\",\"\",'Tex-415,18,24,48-A'!$H$36)","v":""},{"$f":"IF('Tex-415,18,24,48-A'!$B$27=\"\",\"\",'Tex-415,18,24,48-A'!$B$27)","v":"Tex-418-A"},{"$f":"IF('Tex-415,18,24,48-A'!$A$30=\"\",\"\",'Tex-415,18,24,48-A'!$A$30)","v":"Cylinder"},{"$f":"IF('Tex-415,18,24,48-A'!$A$36=\"\",\"\",'Tex-415,18,24,48-A'!$A$36)","v":4},{"$f":"IF('Tex-415,18,24,48-A'!$H$30=\"\",\"\",'Tex-415,18,24,48-A'!$H$30)","v":"Failure Type"}]
[51,{"$f":"IF('Tex-415,18,24,48-A'!$I$36=\"\",\"\",'Tex-415,18,24,48-A'!$I$36)","v":""},{"$f":"IF('Tex-415,18,24,48-A'!$B$27=\"\",\"\",'Tex-415,18,24,48-A'!$B$27)","v":"Tex-418-A"},{"$f":"IF('Tex-415,18,24,48-A'!$A$30=\"\",\"\",'Tex-415,18,24,48-A'!$A$30)","v":"Cylinder"},{"$f":"IF('Tex-415,18,24,48-A'!$A$36=\"\",\"\",'Tex-415,18,24,48-A'!$A$36)","v":4},{"$f":"IF('Tex-415,18,24,48-A'!$I$30=\"\",\"\",'Tex-415,18,24,48-A'!$I$30)","v":"Correction Factor"}]
[52,{"$f":"IF('Tex-415,18,24,48-A'!$J$36=\"\",\"\",'Tex-415,18,24,48-A'!$J$36)","v":""},{"$f":"IF('Tex-415,18,24,48-A'!$B$27=\"\",\"\",'Tex-415,18,24,48-A'!$B$27)","v":"Tex-418-A"},{"$f":"IF('Tex-415,18,24,48-A'!$A$30=\"\",\"\",'Tex-415,18,24,48-A'!$A$30)","v":"Cylinder"},{"$f":"IF('Tex-415,18,24,48-A'!$A$36=\"\",\"\",'Tex-415,18,24,48-A'!$A$36)","v":4},{"$f":"IF('Tex-415,18,24,48-A'!$J$30=\"\",\"\",'Tex-415,18,24,48-A'!$J$30)","v":"Compressive Strength "}]
[53,{"$f":"IF('Tex-415,18,24,48-A'!$B$37=\"\",\"\",'Tex-415,18,24,48-A'!$B$37)","v":""},{"$f":"IF('Tex-415,18,24,48-A'!$B$27=\"\",\"\",'Tex-415,18,24,48-A'!$B$27)","v":"Tex-418-A"},{"$f":"IF('Tex-415,18,24,48-A'!$A$30=\"\",\"\",'Tex-415,18,24,48-A'!$A$30)","v":"Cylinder"},{"$f":"IF('Tex-415,18,24,48-A'!$A$37=\"\",\"\",'Tex-415,18,24,48-A'!$A$37)","v":5},{"$f":"IF('Tex-415,18,24,48-A'!$B$30=\"\",\"\",'Tex-415,18,24,48-A'!$B$30)","v":"Cylinder Number"}]
[54,{"$f":"IF('Tex-415,18,24,48-A'!$C$37=\"\",\"\",'Tex-415,18,24,48-A'!$C$37)","v":""},{"$f":"IF('Tex-415,18,24,48-A'!$B$27=\"\",\"\",'Tex-415,18,24,48-A'!$B$27)","v":"Tex-418-A"},{"$f":"IF('Tex-415,18,24,48-A'!$A$30=\"\",\"\",'Tex-415,18,24,48-A'!$A$30)","v":"Cylinder"},{"$f":"IF('Tex-415,18,24,48-A'!$A$37=\"\",\"\",'Tex-415,18,24,48-A'!$A$37)","v":5},{"$f":"IF('Tex-415,18,24,48-A'!$C$30=\"\",\"\",'Tex-415,18,24,48-A'!$C$30)","v":"Age (Days)"}]
[55,{"$f":"IF('Tex-415,18,24,48-A'!$D$37=\"\",\"\",'Tex-415,18,24,48-A'!$D$37)","v":""},{"$f":"IF('Tex-415,18,24,48-A'!$B$27=\"\",\"\",'Tex-415,18,24,48-A'!$B$27)","v":"Tex-418-A"},{"$f":"IF('Tex-415,18,24,48-A'!$A$30=\"\",\"\",'Tex-415,18,24,48-A'!$A$30)","v":"Cylinder"},{"$f":"IF('Tex-415,18,24,48-A'!$A$37=\"\",\"\",'Tex-415,18,24,48-A'!$A$37)","v":5},{"$f":"IF('Tex-415,18,24,48-A'!$D$31=\"\",\"\",'Tex-415,18,24,48-A'!$D$31)","v":" of Cylinder "}]
[56,{"$f":"IF('Tex-415,18,24,48-A'!$E$37=\"\",\"\",'Tex-415,18,24,48-A'!$E$37)","v":""},{"$f":"IF('Tex-415,18,24,48-A'!$B$27=\"\",\"\",'Tex-415,18,24,48-A'!$B$27)","v":"Tex-418-A"},{"$f":"IF('Tex-415,18,24,48-A'!$A$30=\"\",\"\",'Tex-415,18,24,48-A'!$A$30)","v":"Cylinder"},{"$f":"IF('Tex-415,18,24,48-A'!$A$37=\"\",\"\",'Tex-415,18,24,48-A'!$A$37)","v":5},{"$f":"IF('Tex-415,18,24,48-A'!$E$30=\"\",\"\",'Tex-415,18,24,48-A'!$E$30)","v":"Length of Cylinder "}]
[57,{"$f":"IF('Tex-415,18,24,48-A'!$F$37=\"\",\"\",'Tex-415,18,24,48-A'!$F$37)","v":""},{"$f":"IF('Tex-415,18,24,48-A'!$B$27=\"\",\"\",'Tex-415,18,24,48-A'!$B$27)","v":"Tex-418-A"},{"$f":"IF('Tex-415,18,24,48-A'!$A$30=\"\",\"\",'Tex-415,18,24,48-A'!$A$30)","v":"Cylinder"},{"$f":"IF('Tex-415,18,24,48-A'!$A$37=\"\",\"\",'Tex-415,18,24,48-A'!$A$37)","v":5},{"$f":"IF('Tex-415,18,24,48-A'!$F$30=\"\",\"\",'Tex-415,18,24,48-A'!$F$30)","v":"Length to Diameter Ratio"}]
[58,{"$f":"IF('Tex-415,18,24,48-A'!$G$37=\"\",\"\",'Tex-415,18,24,48-A'!$G$37)","v":""},{"$f":"IF('Tex-415,18,24,48-A'!$B$27=\"\",\"\",'Tex-415,18,24,48-A'!$B$27)","v":"Tex-418-A"},{"$f":"IF('Tex-415,18,24,48-A'!$A$30=\"\",\"\",'Tex-415,18,24,48-A'!$A$30)","v":"Cylinder"},{"$f":"IF('Tex-415,18,24,48-A'!$A$37=\"\",\"\",'Tex-415,18,24,48-A'!$A$37)","v":5},{"$f":"IF('Tex-415,18,24,48-A'!$G$30=\"\",\"\",'Tex-415,18,24,48-A'!$G$30)","v":"Max Load "}]
[59,{"$f":"IF('Tex-415,18,24,48-A'!$H$37=\"\",\"\",'Tex-415,18,24,48-A'!$H$37)","v":""},{"$f":"IF('Tex-415,18,24,48-A'!$B$27=\"\",\"\",'Tex-415,18,24,48-A'!$B$27)","v":"Tex-418-A"},{"$f":"IF('Tex-415,18,24,48-A'!$A$30=\"\",\"\",'Tex-415,18,24,48-A'!$A$30)","v":"Cylinder"},{"$f":"IF('Tex-415,18,24,48-A'!$A$37=\"\",\"\",'Tex-415,18,24,48-A'!$A$37)","v":5},{"$f":"IF('Tex-415,18,24,48-A'!$H$30=\"\",\"\",'Tex-415,18,24,48-A'!$H$30)","v":"Failure Type"}]
[60,{"$f":"IF('Tex-415,18,24,48-A'!$I$37=\"\",\"\",'Tex-415,18,24,48-A'!$I$37)","v":""},{"$f":"IF('Tex-415,18,24,48-A'!$B$27=\"\",\"\",'Tex-415,18,24,48-A'!$B$27)","v":"Tex-418-A"},{"$f":"IF('Tex-415,18,24,48-A'!$A$30=\"\",\"\",'Tex-415,18,24,48-A'!$A$30)","v":"Cylinder"},{"$f":"IF('Tex-415,18,24,48-A'!$A$37=\"\",\"\",'Tex-415,18,24,48-A'!$A$37)","v":5},{"$f":"IF('Tex-415,18,24,48-A'!$I$30=\"\",\"\",'Tex-415,18,24,48-A'!$I$30)","v":"Correction Factor"}]
[61,{"$f":"IF('Tex-415,18,24,48-A'!$J$37=\"\",\"\",'Tex-415,18,24,48-A'!$J$37)","v":""},{"$f":"IF('Tex-415,18,24,48-A'!$B$27=\"\",\"\",'Tex-415,18,24,48-A'!$B$27)","v":"Tex-418-A"},{"$f":"IF('Tex-415,18,24,48-A'!$A$30=\"\",\"\",'Tex-415,18,24,48-A'!$A$30)","v":"Cylinder"},{"$f":"IF('Tex-415,18,24,48-A'!$A$37=\"\",\"\",'Tex-415,18,24,48-A'!$A$37)","v":5},{"$f":"IF('Tex-415,18,24,48-A'!$J$30=\"\",\"\",'Tex-415,18,24,48-A'!$J$30)","v":"Compressive Strength "}]
[62,{"$f":"IF('Tex-415,18,24,48-A'!$K$37=\"\",\"\",'Tex-415,18,24,48-A'!$K$37)","v":""},{"$f":"IF('Tex-415,18,24,48-A'!$B$27=\"\",\"\",'Tex-415,18,24,48-A'!$B$27)","v":"Tex-418-A"},{"$f":"IF('Tex-415,18,24,48-A'!$A$30=\"\",\"\",'Tex-415,18,24,48-A'!$A$30)","v":"Cylinder"},{"$f":"IF('Tex-415,18,24,48-A'!$A$37=\"\",\"\",'Tex-415,18,24,48-A'!$A$37)","v":5},{"$f":"IF('Tex-415,18,24,48-A'!$K$30=\"\",\"\",'Tex-415,18,24,48-A'!$K$30)","v":"Compressive Strength Average "}]
[63,{"$f":"IF('Tex-415,18,24,48-A'!$L$37=\"\",\"\",'Tex-415,18,24,48-A'!$L$37)","v":""},{"$f":"IF('Tex-415,18,24,48-A'!$B$27=\"\",\"\",'Tex-415,18,24,48-A'!$B$27)","v":"Tex-418-A"},{"$f":"IF('Tex-415,18,24,48-A'!$A$30=\"\",\"\",'Tex-415,18,24,48-A'!$A$30)","v":"Cylinder"},{"$f":"IF('Tex-415,18,24,48-A'!$A$37=\"\",\"\",'Tex-415,18,24,48-A'!$A$37)","v":5},{"$f":"IF('Tex-415,18,24,48-A'!$L$30=\"\",\"\",'Tex-415,18,24,48-A'!$L$30)","v":"Meets Strength Requirement"}]
[64,{"$f":"IF('Tex-415,18,24,48-A'!$B$38=\"\",\"\",'Tex-415,18,24,48-A'!$B$38)","v":""},{"$f":"IF('Tex-415,18,24,48-A'!$B$27=\"\",\"\",'Tex-415,18,24,48-A'!$B$27)","v":"Tex-418-A"},{"$f":"IF('Tex-415,18,24,48-A'!$A$30=\"\",\"\",'Tex-415,18,24,48-A'!$A$30)","v":"Cylinder"},{"$f":"IF('Tex-415,18,24,48-A'!$A$38=\"\",\"\",'Tex-415,18,24,48-A'!$A$38)","v":6},{"$f":"IF('Tex-415,18,24,48-A'!$B$30=\"\",\"\",'Tex-415,18,24,48-A'!$B$30)","v":"Cylinder Number"}]
[65,{"$f":"IF('Tex-415,18,24,48-A'!$D$38=\"\",\"\",'Tex-415,18,24,48-A'!$D$38)","v":""},{"$f":"IF('Tex-415,18,24,48-A'!$B$27=\"\",\"\",'Tex-415,18,24,48-A'!$B$27)","v":"Tex-418-A"},{"$f":"IF('Tex-415,18,24,48-A'!$A$30=\"\",\"\",'Tex-415,18,24,48-A'!$A$30)","v":"Cylinder"},{"$f":"IF('Tex-415,18,24,48-A'!$A$38=\"\",\"\",'Tex-415,18,24,48-A'!$A$38)","v":6},{"$f":"IF('Tex-415,18,24,48-A'!$D$31=\"\",\"\",'Tex-415,18,24,48-A'!$D$31)","v":" of Cylinder "}]
[66,{"$f":"IF('Tex-415,18,24,48-A'!$E$38=\"\",\"\",'Tex-415,18,24,48-A'!$E$38)","v":""},{"$f":"IF('Tex-415,18,24,48-A'!$B$27=\"\",\"\",'Tex-415,18,24,48-A'!$B$27)","v":"Tex-418-A"},{"$f":"IF('Tex-415,18,24,48-A'!$A$30=\"\",\"\",'Tex-415,18,24,48-A'!$A$30)","v":"Cylinder"},{"$f":"IF('Tex-415,18,24,48-A'!$A$38=\"\",\"\",'Tex-415,18,24,48-A'!$A$38)","v":6},{"$f":"IF('Tex-415,18,24,48-A'!$E$30=\"\",\"\",'Tex-415,18,24,48-A'!$E$30)","v":"Length of Cylinder "}]
[67,{"$f":"IF('Tex-415,18,24,48-A'!$F$38=\"\",\"\",'Tex-415,18,24,48-A'!$F$38)","v":""},{"$f":"IF('Tex-415,18,24,48-A'!$B$27=\"\",\"\",'Tex-415,18,24,48-A'!$B$27)","v":"Tex-418-A"},{"$f":"IF('Tex-415,18,24,48-A'!$A$30=\"\",\"\",'Tex-415,18,24,48-A'!$A$30)","v":"Cylinder"},{"$f":"IF('Tex-415,18,24,48-A'!$A$38=\"\",\"\",'Tex-415,18,24,48-A'!$A$38)","v":6},{"$f":"IF('Tex-415,18,24,48-A'!$F$30=\"\",\"\",'Tex-415,18,24,48-A'!$F$30)","v":"Length to Diameter Ratio"}]
[68,{"$f":"IF('Tex-415,18,24,48-A'!$G$38=\"\",\"\",'Tex-415,18,24,48-A'!$G$38)","v":""},{"$f":"IF('Tex-415,18,24,48-A'!$B$27=\"\",\"\",'Tex-415,18,24,48-A'!$B$27)","v":"Tex-418-A"},{"$f":"IF('Tex-415,18,24,48-A'!$A$30=\"\",\"\",'Tex-415,18,24,48-A'!$A$30)","v":"Cylinder"},{"$f":"IF('Tex-415,18,24,48-A'!$A$38=\"\",\"\",'Tex-415,18,24,48-A'!$A$38)","v":6},{"$f":"IF('Tex-415,18,24,48-A'!$G$30=\"\",\"\",'Tex-415,18,24,48-A'!$G$30)","v":"Max Load "}]
[69,{"$f":"IF('Tex-415,18,24,48-A'!$H$38=\"\",\"\",'Tex-415,18,24,48-A'!$H$38)","v":""},{"$f":"IF('Tex-415,18,24,48-A'!$B$27=\"\",\"\",'Tex-415,18,24,48-A'!$B$27)","v":"Tex-418-A"},{"$f":"IF('Tex-415,18,24,48-A'!$A$30=\"\",\"\",'Tex-415,18,24,48-A'!$A$30)","v":"Cylinder"},{"$f":"IF('Tex-415,18,24,48-A'!$A$38=\"\",\"\",'Tex-415,18,24,48-A'!$A$38)","v":6},{"$f":"IF('Tex-415,18,24,48-A'!$H$30=\"\",\"\",'Tex-415,18,24,48-A'!$H$30)","v":"Failure Type"}]
[70,{"$f":"IF('Tex-415,18,24,48-A'!$I$38=\"\",\"\",'Tex-415,18,24,48-A'!$I$38)","v":""},{"$f":"IF('Tex-415,18,24,48-A'!$B$27=\"\",\"\",'Tex-415,18,24,48-A'!$B$27)","v":"Tex-418-A"},{"$f":"IF('Tex-415,18,24,48-A'!$A$30=\"\",\"\",'Tex-415,18,24,48-A'!$A$30)","v":"Cylinder"},{"$f":"IF('Tex-415,18,24,48-A'!$A$38=\"\",\"\",'Tex-415,18,24,48-A'!$A$38)","v":6},{"$f":"IF('Tex-415,18,24,48-A'!$I$30=\"\",\"\",'Tex-415,18,24,48-A'!$I$30)","v":"Correction Factor"}]
[71,{"$f":"IF('Tex-415,18,24,48-A'!$J$38=\"\",\"\",'Tex-415,18,24,48-A'!$J$38)","v":""},{"$f":"IF('Tex-415,18,24,48-A'!$B$27=\"\",\"\",'Tex-415,18,24,48-A'!$B$27)","v":"Tex-418-A"},{"$f":"IF('Tex-415,18,24,48-A'!$A$30=\"\",\"\",'Tex-415,18,24,48-A'!$A$30)","v":"Cylinder"},{"$f":"IF('Tex-415,18,24,48-A'!$A$38=\"\",\"\",'Tex-415,18,24,48-A'!$A$38)","v":6},{"$f":"IF('Tex-415,18,24,48-A'!$J$30=\"\",\"\",'Tex-415,18,24,48-A'!$J$30)","v":"Compressive Strength "}]
[72,{"$f":"IF('Tex-415,18,24,48-A'!$B$39=\"\",\"\",'Tex-415,18,24,48-A'!$B$39)","v":""},{"$f":"IF('Tex-415,18,24,48-A'!$B$27=\"\",\"\",'Tex-415,18,24,48-A'!$B$27)","v":"Tex-418-A"},{"$f":"IF('Tex-415,18,24,48-A'!$A$30=\"\",\"\",'Tex-415,18,24,48-A'!$A$30)","v":"Cylinder"},{"$f":"IF('Tex-415,18,24,48-A'!$A$39=\"\",\"\",'Tex-415,18,24,48-A'!$A$39)","v":7},{"$f":"IF('Tex-415,18,24,48-A'!$B$30=\"\",\"\",'Tex-415,18,24,48-A'!$B$30)","v":"Cylinder Number"}]
[73,{"$f":"IF('Tex-415,18,24,48-A'!$C$39=\"\",\"\",'Tex-415,18,24,48-A'!$C$39)","v":""},{"$f":"IF('Tex-415,18,24,48-A'!$B$27=\"\",\"\",'Tex-415,18,24,48-A'!$B$27)","v":"Tex-418-A"},{"$f":"IF('Tex-415,18,24,48-A'!$A$30=\"\",\"\",'Tex-415,18,24,48-A'!$A$30)","v":"Cylinder"},{"$f":"IF('Tex-415,18,24,48-A'!$A$39=\"\",\"\",'Tex-415,18,24,48-A'!$A$39)","v":7},{"$f":"IF('Tex-415,18,24,48-A'!$C$30=\"\",\"\",'Tex-415,18,24,48-A'!$C$30)","v":"Age (Days)"}]
[74,{"$f":"IF('Tex-415,18,24,48-A'!$D$39=\"\",\"\",'Tex-415,18,24,48-A'!$D$39)","v":""},{"$f":"IF('Tex-415,18,24,48-A'!$B$27=\"\",\"\",'Tex-415,18,24,48-A'!$B$27)","v":"Tex-418-A"},{"$f":"IF('Tex-415,18,24,48-A'!$A$30=\"\",\"\",'Tex-415,18,24,48-A'!$A$30)","v":"Cylinder"},{"$f":"IF('Tex-415,18,24,48-A'!$A$39=\"\",\"\",'Tex-415,18,24,48-A'!$A$39)","v":7},{"$f":"IF('Tex-415,18,24,48-A'!$D$31=\"\",\"\",'Tex-415,18,24,48-A'!$D$31)","v":" of Cylinder "}]
[75,{"$f":"IF('Tex-415,18,24,48-A'!$E$39=\"\",\"\",'Tex-415,18,24,48-A'!$E$39)","v":""},{"$f":"IF('Tex-415,18,24,48-A'!$B$27=\"\",\"\",'Tex-415,18,24,48-A'!$B$27)","v":"Tex-418-A"},{"$f":"IF('Tex-415,18,24,48-A'!$A$30=\"\",\"\",'Tex-415,18,24,48-A'!$A$30)","v":"Cylinder"},{"$f":"IF('Tex-415,18,24,48-A'!$A$39=\"\",\"\",'Tex-415,18,24,48-A'!$A$39)","v":7},{"$f":"IF('Tex-415,18,24,48-A'!$E$30=\"\",\"\",'Tex-415,18,24,48-A'!$E$30)","v":"Length of Cylinder "}]
[76,{"$f":"IF('Tex-415,18,24,48-A'!$F$39=\"\",\"\",'Tex-415,18,24,48-A'!$F$39)","v":""},{"$f":"IF('Tex-415,18,24,48-A'!$B$27=\"\",\"\",'Tex-415,18,24,48-A'!$B$27)","v":"Tex-418-A"},{"$f":"IF('Tex-415,18,24,48-A'!$A$30=\"\",\"\",'Tex-415,18,24,48-A'!$A$30)","v":"Cylinder"},{"$f":"IF('Tex-415,18,24,48-A'!$A$39=\"\",\"\",'Tex-415,18,24,48-A'!$A$39)","v":7},{"$f":"IF('Tex-415,18,24,48-A'!$F$30=\"\",\"\",'Tex-415,18,24,48-A'!$F$30)","v":"Length to Diameter Ratio"}]
[77,{"$f":"IF('Tex-415,18,24,48-A'!$G$39=\"\",\"\",'Tex-415,18,24,48-A'!$G$39)","v":""},{"$f":"IF('Tex-415,18,24,48-A'!$B$27=\"\",\"\",'Tex-415,18,24,48-A'!$B$27)","v":"Tex-418-A"},{"$f":"IF('Tex-415,18,24,48-A'!$A$30=\"\",\"\",'Tex-415,18,24,48-A'!$A$30)","v":"Cylinder"},{"$f":"IF('Tex-415,18,24,48-A'!$A$39=\"\",\"\",'Tex-415,18,24,48-A'!$A$39)","v":7},{"$f":"IF('Tex-415,18,24,48-A'!$G$30=\"\",\"\",'Tex-415,18,24,48-A'!$G$30)","v":"Max Load "}]
[78,{"$f":"IF('Tex-415,18,24,48-A'!$H$39=\"\",\"\",'Tex-415,18,24,48-A'!$H$39)","v":""},{"$f":"IF('Tex-415,18,24,48-A'!$B$27=\"\",\"\",'Tex-415,18,24,48-A'!$B$27)","v":"Tex-418-A"},{"$f":"IF('Tex-415,18,24,48-A'!$A$30=\"\",\"\",'Tex-415,18,24,48-A'!$A$30)","v":"Cylinder"},{"$f":"IF('Tex-415,18,24,48-A'!$A$39=\"\",\"\",'Tex-415,18,24,48-A'!$A$39)","v":7},{"$f":"IF('Tex-415,18,24,48-A'!$H$30=\"\",\"\",'Tex-415,18,24,48-A'!$H$30)","v":"Failure Type"}]
[79,{"$f":"IF('Tex-415,18,24,48-A'!$I$39=\"\",\"\",'Tex-415,18,24,48-A'!$I$39)","v":""},{"$f":"IF('Tex-415,18,24,48-A'!$B$27=\"\",\"\",'Tex-415,18,24,48-A'!$B$27)","v":"Tex-418-A"},{"$f":"IF('Tex-415,18,24,48-A'!$A$30=\"\",\"\",'Tex-415,18,24,48-A'!$A$30)","v":"Cylinder"},{"$f":"IF('Tex-415,18,24,48-A'!$A$39=\"\",\"\",'Tex-415,18,24,48-A'!$A$39)","v":7},{"$f":"IF('Tex-415,18,24,48-A'!$I$30=\"\",\"\",'Tex-415,18,24,48-A'!$I$30)","v":"Correction Factor"}]
[80,{"$f":"IF('Tex-415,18,24,48-A'!$J$39=\"\",\"\",'Tex-415,18,24,48-A'!$J$39)","v":""},{"$f":"IF('Tex-415,18,24,48-A'!$B$27=\"\",\"\",'Tex-415,18,24,48-A'!$B$27)","v":"Tex-418-A"},{"$f":"IF('Tex-415,18,24,48-A'!$A$30=\"\",\"\",'Tex-415,18,24,48-A'!$A$30)","v":"Cylinder"},{"$f":"IF('Tex-415,18,24,48-A'!$A$39=\"\",\"\",'Tex-415,18,24,48-A'!$A$39)","v":7},{"$f":"IF('Tex-415,18,24,48-A'!$J$30=\"\",\"\",'Tex-415,18,24,48-A'!$J$30)","v":"Compressive Strength "}]
[81,{"$f":"IF('Tex-415,18,24,48-A'!$K$39=\"\",\"\",'Tex-415,18,24,48-A'!$K$39)","v":""},{"$f":"IF('Tex-415,18,24,48-A'!$B$27=\"\",\"\",'Tex-415,18,24,48-A'!$B$27)","v":"Tex-418-A"},{"$f":"IF('Tex-415,18,24,48-A'!$A$30=\"\",\"\",'Tex-415,18,24,48-A'!$A$30)","v":"Cylinder"},{"$f":"IF('Tex-415,18,24,48-A'!$A$39=\"\",\"\",'Tex-415,18,24,48-A'!$A$39)","v":7},{"$f":"IF('Tex-415,18,24,48-A'!$K$30=\"\",\"\",'Tex-415,18,24,48-A'!$K$30)","v":"Compressive Strength Average "}]
[82,{"$f":"IF('Tex-415,18,24,48-A'!$L$39=\"\",\"\",'Tex-415,18,24,48-A'!$L$39)","v":""},{"$f":"IF('Tex-415,18,24,48-A'!$B$27=\"\",\"\",'Tex-415,18,24,48-A'!$B$27)","v":"Tex-418-A"},{"$f":"IF('Tex-415,18,24,48-A'!$A$30=\"\",\"\",'Tex-415,18,24,48-A'!$A$30)","v":"Cylinder"},{"$f":"IF('Tex-415,18,24,48-A'!$A$39=\"\",\"\",'Tex-415,18,24,48-A'!$A$39)","v":7},{"$f":"IF('Tex-415,18,24,48-A'!$L$30=\"\",\"\",'Tex-415,18,24,48-A'!$L$30)","v":"Meets Strength Requirement"}]
[83,{"$f":"IF('Tex-415,18,24,48-A'!$B$40=\"\",\"\",'Tex-415,18,24,48-A'!$B$40)","v":""},{"$f":"IF('Tex-415,18,24,48-A'!$B$27=\"\",\"\",'Tex-415,18,24,48-A'!$B$27)","v":"Tex-418-A"},{"$f":"IF('Tex-415,18,24,48-A'!$A$30=\"\",\"\",'Tex-415,18,24,48-A'!$A$30)","v":"Cylinder"},{"$f":"IF('Tex-415,18,24,48-A'!$A$40=\"\",\"\",'Tex-415,18,24,48-A'!$A$40)","v":8},{"$f":"IF('Tex-415,18,24,48-A'!$B$30=\"\",\"\",'Tex-415,18,24,48-A'!$B$30)","v":"Cylinder Number"}]
[84,{"$f":"IF('Tex-415,18,24,48-A'!$D$40=\"\",\"\",'Tex-415,18,24,48-A'!$D$40)","v":""},{"$f":"IF('Tex-415,18,24,48-A'!$B$27=\"\",\"\",'Tex-415,18,24,48-A'!$B$27)","v":"Tex-418-A"},{"$f":"IF('Tex-415,18,24,48-A'!$A$30=\"\",\"\",'Tex-415,18,24,48-A'!$A$30)","v":"Cylinder"},{"$f":"IF('Tex-415,18,24,48-A'!$A$40=\"\",\"\",'Tex-415,18,24,48-A'!$A$40)","v":8},{"$f":"IF('Tex-415,18,24,48-A'!$D$31=\"\",\"\",'Tex-415,18,24,48-A'!$D$31)","v":" of Cylinder "}]
[85,{"$f":"IF('Tex-415,18,24,48-A'!$E$40=\"\",\"\",'Tex-415,18,24,48-A'!$E$40)","v":""},{"$f":"IF('Tex-415,18,24,48-A'!$B$27=\"\",\"\",'Tex-415,18,24,48-A'!$B$27)","v":"Tex-418-A"},{"$f":"IF('Tex-415,18,24,48-A'!$A$30=\"\",\"\",'Tex-415,18,24,48-A'!$A$30)","v":"Cylinder"},{"$f":"IF('Tex-415,18,24,48-A'!$A$40=\"\",\"\",'Tex-415,18,24,48-A'!$A$40)","v":8},{"$f":"IF('Tex-415,18,24,48-A'!$E$30=\"\",\"\",'Tex-415,18,24,48-A'!$E$30)","v":"Length of Cylinder "}]
[86,{"$f":"IF('Tex-415,18,24,48-A'!$F$40=\"\",\"\",'Tex-415,18,24,48-A'!$F$40)","v":""},{"$f":"IF('Tex-415,18,24,48-A'!$B$27=\"\",\"\",'Tex-415,18,24,48-A'!$B$27)","v":"Tex-418-A"},{"$f":"IF('Tex-415,18,24,48-A'!$A$30=\"\",\"\",'Tex-415,18,24,48-A'!$A$30)","v":"Cylinder"},{"$f":"IF('Tex-415,18,24,48-A'!$A$40=\"\",\"\",'Tex-415,18,24,48-A'!$A$40)","v":8},{"$f":"IF('Tex-415,18,24,48-A'!$F$30=\"\",\"\",'Tex-415,18,24,48-A'!$F$30)","v":"Length to Diameter Ratio"}]
[87,{"$f":"IF('Tex-415,18,24,48-A'!$G$40=\"\",\"\",'Tex-415,18,24,48-A'!$G$40)","v":""},{"$f":"IF('Tex-415,18,24,48-A'!$B$27=\"\",\"\",'Tex-415,18,24,48-A'!$B$27)","v":"Tex-418-A"},{"$f":"IF('Tex-415,18,24,48-A'!$A$30=\"\",\"\",'Tex-415,18,24,48-A'!$A$30)","v":"Cylinder"},{"$f":"IF('Tex-415,18,24,48-A'!$A$40=\"\",\"\",'Tex-415,18,24,48-A'!$A$40)","v":8},{"$f":"IF('Tex-415,18,24,48-A'!$G$30=\"\",\"\",'Tex-415,18,24,48-A'!$G$30)","v":"Max Load "}]
[88,{"$f":"IF('Tex-415,18,24,48-A'!$H$40=\"\",\"\",'Tex-415,18,24,48-A'!$H$40)","v":""},{"$f":"IF('Tex-415,18,24,48-A'!$B$27=\"\",\"\",'Tex-415,18,24,48-A'!$B$27)","v":"Tex-418-A"},{"$f":"IF('Tex-415,18,24,48-A'!$A$30=\"\",\"\",'Tex-415,18,24,48-A'!$A$30)","v":"Cylinder"},{"$f":"IF('Tex-415,18,24,48-A'!$A$40=\"\",\"\",'Tex-415,18,24,48-A'!$A$40)","v":8},{"$f":"IF('Tex-415,18,24,48-A'!$H$30=\"\",\"\",'Tex-415,18,24,48-A'!$H$30)","v":"Failure Type"}]
[89,{"$f":"IF('Tex-415,18,24,48-A'!$I$40=\"\",\"\",'Tex-415,18,24,48-A'!$I$40)","v":""},{"$f":"IF('Tex-415,18,24,48-A'!$B$27=\"\",\"\",'Tex-415,18,24,48-A'!$B$27)","v":"Tex-418-A"},{"$f":"IF('Tex-415,18,24,48-A'!$A$30=\"\",\"\",'Tex-415,18,24,48-A'!$A$30)","v":"Cylinder"},{"$f":"IF('Tex-415,18,24,48-A'!$A$40=\"\",\"\",'Tex-415,18,24,48-A'!$A$40)","v":8},{"$f":"IF('Tex-415,18,24,48-A'!$I$30=\"\",\"\",'Tex-415,18,24,48-A'!$I$30)","v":"Correction Factor"}]
[90,{"$f":"IF('Tex-415,18,24,48-A'!$J$40=\"\",\"\",'Tex-415,18,24,48-A'!$J$40)","v":""},{"$f":"IF('Tex-415,18,24,48-A'!$B$27=\"\",\"\",'Tex-415,18,24,48-A'!$B$27)","v":"Tex-418-A"},{"$f":"IF('Tex-415,18,24,48-A'!$A$30=\"\",\"\",'Tex-415,18,24,48-A'!$A$30)","v":"Cylinder"},{"$f":"IF('Tex-415,18,24,48-A'!$A$40=\"\",\"\",'Tex-415,18,24,48-A'!$A$40)","v":8},{"$f":"IF('Tex-415,18,24,48-A'!$J$30=\"\",\"\",'Tex-415,18,24,48-A'!$J$30)","v":"Compressive Strength "}]
[91,{"$f":"IF('Tex-415,18,24,48-A'!$B$46=\"\",\"\",'Tex-415,18,24,48-A'!$B$46)","v":""},{"$f":"IF('Tex-415,18,24,48-A'!$B$42=\"\",\"\",'Tex-415,18,24,48-A'!$B$42)","v":"Tex-424-A"},{"$f":"IF('Tex-415,18,24,48-A'!$A$43=\"\",\"\",'Tex-415,18,24,48-A'!$A$43)","v":"Core"},{"$f":"IF('Tex-415,18,24,48-A'!$A$46=\"\",\"\",'Tex-415,18,24,48-A'!$A$46)","v":1},{"$f":"IF('Tex-415,18,24,48-A'!$B$43=\"\",\"\",'Tex-415,18,24,48-A'!$B$43)","v":"Core Number"}]
[92,{"$f":"IF('Tex-415,18,24,48-A'!$C$46=\"\",\"\",'Tex-415,18,24,48-A'!$C$46)","v":""},{"$f":"IF('Tex-415,18,24,48-A'!$B$42=\"\",\"\",'Tex-415,18,24,48-A'!$B$42)","v":"Tex-424-A"},{"$f":"IF('Tex-415,18,24,48-A'!$A$43=\"\",\"\",'Tex-415,18,24,48-A'!$A$43)","v":"Core"},{"$f":"IF('Tex-415,18,24,48-A'!$A$46=\"\",\"\",'Tex-415,18,24,48-A'!$A$46)","v":1},{"$f":"IF('Tex-415,18,24,48-A'!$C$43=\"\",\"\",'Tex-415,18,24,48-A'!$C$43)","v":"Age (Days)"}]
[93,{"$f":"IF('Tex-415,18,24,48-A'!$D$46=\"\",\"\",'Tex-415,18,24,48-A'!$D$46)","v":""},{"$f":"IF('Tex-415,18,24,48-A'!$B$42=\"\",\"\",'Tex-415,18,24,48-A'!$B$42)","v":"Tex-424-A"},{"$f":"IF('Tex-415,18,24,48-A'!$A$43=\"\",\"\",'Tex-415,18,24,48-A'!$A$43)","v":"Core"},{"$f":"IF('Tex-415,18,24,48-A'!$A$46=\"\",\"\",'Tex-415,18,24,48-A'!$A$46)","v":1},{"$f":"IF('Tex-415,18,24,48-A'!$D$44=\"\",\"\",'Tex-415,18,24,48-A'!$D$44)","v":" of Core "}]
[94,{"$f":"IF('Tex-415,18,24,48-A'!$E$46=\"\",\"\",'Tex-415,18,24,48-A'!$E$46)","v":""},{"$f":"IF('Tex-415,18,24,48-A'!$B$42=\"\",\"\",'Tex-415,18,24,48-A'!$B$42)","v":"Tex-424-A"},{"$f":"IF('Tex-415,18,24,48-A'!$A$43=\"\",\"\",'Tex-415,18,24,48-A'!$A$43)","v":"Core"},{"$f":"IF('Tex-415,18,24,48-A'!$A$46=\"\",\"\",'Tex-415,18,24,48-A'!$A$46)","v":1},{"$f":"IF('Tex-415,18,24,48-A'!$E$43=\"\",\"\",'Tex-415,18,24,48-A'!$E$43)","v":"Length of Core "}]
[95,{"$f":"IF('Tex-415,18,24,48-A'!$F$46=\"\",\"\",'Tex-415,18,24,48-A'!$F$46)","v":""},{"$f":"IF('Tex-415,18,24,48-A'!$B$42=\"\",\"\",'Tex-415,18,24,48-A'!$B$42)","v":"Tex-424-A"},{"$f":"IF('Tex-415,18,24,48-A'!$A$43=\"\",\"\",'Tex-415,18,24,48-A'!$A$43)","v":"Core"},{"$f":"IF('Tex-415,18,24,48-A'!$A$46=\"\",\"\",'Tex-415,18,24,48-A'!$A$46)","v":1},{"$f":"IF('Tex-415,18,24,48-A'!$F$43=\"\",\"\",'Tex-415,18,24,48-A'!$F$43)","v":"Length to Diameter Ratio"}]
[96,{"$f":"IF('Tex-415,18,24,48-A'!$G$46=\"\",\"\",'Tex-415,18,24,48-A'!$G$46)","v":""},{"$f":"IF('Tex-415,18,24,48-A'!$B$42=\"\",\"\",'Tex-415,18,24,48-A'!$B$42)","v":"Tex-424-A"},{"$f":"IF('Tex-415,18,24,48-A'!$A$43=\"\",\"\",'Tex-415,18,24,48-A'!$A$43)","v":"Core"},{"$f":"IF('Tex-415,18,24,48-A'!$A$46=\"\",\"\",'Tex-415,18,24,48-A'!$A$46)","v":1},{"$f":"IF('Tex-415,18,24,48-A'!$G$43=\"\",\"\",'Tex-415,18,24,48-A'!$G$43)","v":"Max Load "}]
[97,{"$f":"IF('Tex-415,18,24,48-A'!$H$46=\"\",\"\",'Tex-415,18,24,48-A'!$H$46)","v":""},{"$f":"IF('Tex-415,18,24,48-A'!$B$42=\"\",\"\",'Tex-415,18,24,48-A'!$B$42)","v":"Tex-424-A"},{"$f":"IF('Tex-415,18,24,48-A'!$A$43=\"\",\"\",'Tex-415,18,24,48-A'!$A$43)","v":"Core"},{"$f":"IF('Tex-415,18,24,48-A'!$A$46=\"\",\"\",'Tex-415,18,24,48-A'!$A$46)","v":1},{"$f":"IF('Tex-415,18,24,48-A'!$H$43=\"\",\"\",'Tex-415,18,24,48-A'!$H$43)","v":"Failure Type"}]
[98,{"$f":"IF('Tex-415,18,24,48-A'!$I$46=\"\",\"\",'Tex-415,18,24,48-A'!$I$46)","v":""},{"$f":"IF('Tex-415,18,24,48-A'!$B$42=\"\",\"\",'Tex-415,18,24,48-A'!$B$42)","v":"Tex-424-A"},{"$f":"IF('Tex-415,18,24,48-A'!$A$43=\"\",\"\",'Tex-415,18,24,48-A'!$A$43)","v":"Core"},{"$f":"IF('Tex-415,18,24,48-A'!$A$46=\"\",\"\",'Tex-415,18,24,48-A'!$A$46)","v":1},{"$f":"IF('Tex-415,18,24,48-A'!$I$43=\"\",\"\",'Tex-415,18,24,48-A'!$I$43)","v":"Correction Factor"}]
[99,{"$f":"IF('Tex-415,18,24,48-A'!$J$46=\"\",\"\",'Tex-415,18,24,48-A'!$J$46)","v":""},{"$f":"IF('Tex-415,18,24,48-A'!$B$42=\"\",\"\",'Tex-415,18,24,48-A'!$B$42)","v":"Tex-424-A"},{"$f":"IF('Tex-415,18,24,48-A'!$A$43=\"\",\"\",'Tex-415,18,24,48-A'!$A$43)","v":"Core"},{"$f":"IF('Tex-415,18,24,48-A'!$A$46=\"\",\"\",'Tex-415,18,24,48-A'!$A$46)","v":1},{"$f":"IF('Tex-415,18,24,48-A'!$J$43=\"\",\"\",'Tex-415,18,24,48-A'!$J$43)","v":"Compressive Strength "}]
[100,{"$f":"IF('Tex-415,18,24,48-A'!$K$46=\"\",\"\",'Tex-415,18,24,48-A'!$K$46)","v":""},{"$f":"IF('Tex-415,18,24,48-A'!$B$42=\"\",\"\",'Tex-415,18,24,48-A'!$B$42)","v":"Tex-424-A"},{"$f":"IF('Tex-415,18,24,48-A'!$A$43=\"\",\"\",'Tex-415,18,24,48-A'!$A$43)","v":"Core"},{"$f":"IF('Tex-415,18,24,48-A'!$A$46=\"\",\"\",'Tex-415,18,24,48-A'!$A$46)","v":1},{"$f":"IF('Tex-415,18,24,48-A'!$K$43=\"\",\"\",'Tex-415,18,24,48-A'!$K$43)","v":"Compressive Strength Average "}]
[101,{"$f":"IF('Tex-415,18,24,48-A'!$B$47=\"\",\"\",'Tex-415,18,24,48-A'!$B$47)","v":""},{"$f":"IF('Tex-415,18,24,48-A'!$B$42=\"\",\"\",'Tex-415,18,24,48-A'!$B$42)","v":"Tex-424-A"},{"$f":"IF('Tex-415,18,24,48-A'!$A$43=\"\",\"\",'Tex-415,18,24,48-A'!$A$43)","v":"Core"},{"$f":"IF('Tex-415,18,24,48-A'!$A$47=\"\",\"\",'Tex-415,18,24,48-A'!$A$47)","v":2},{"$f":"IF('Tex-415,18,24,48-A'!$B$43=\"\",\"\",'Tex-415,18,24,48-A'!$B$43)","v":"Core Number"}]
[102,{"$f":"IF('Tex-415,18,24,48-A'!$D$47=\"\",\"\",'Tex-415,18,24,48-A'!$D$47)","v":""},{"$f":"IF('Tex-415,18,24,48-A'!$B$42=\"\",\"\",'Tex-415,18,24,48-A'!$B$42)","v":"Tex-424-A"},{"$f":"IF('Tex-415,18,24,48-A'!$A$43=\"\",\"\",'Tex-415,18,24,48-A'!$A$43)","v":"Core"},{"$f":"IF('Tex-415,18,24,48-A'!$A$47=\"\",\"\",'Tex-415,18,24,48-A'!$A$47)","v":2},{"$f":"IF('Tex-415,18,24,48-A'!$D$44=\"\",\"\",'Tex-415,18,24,48-A'!$D$44)","v":" of Core "}]
[103,{"$f":"IF('Tex-415,18,24,48-A'!$E$47=\"\",\"\",'Tex-415,18,24,48-A'!$E$47)","v":""},{"$f":"IF('Tex-415,18,24,48-A'!$B$42=\"\",\"\",'Tex-415,18,24,48-A'!$B$42)","v":"Tex-424-A"},{"$f":"IF('Tex-415,18,24,48-A'!$A$43=\"\",\"\",'Tex-415,18,24,48-A'!$A$43)","v":"Core"},{"$f":"IF('Tex-415,18,24,48-A'!$A$47=\"\",\"\",'Tex-415,18,24,48-A'!$A$47)","v":2},{"$f":"IF('Tex-415,18,24,48-A'!$E$43=\"\",\"\",'Tex-415,18,24,48-A'!$E$43)","v":"Length of Core "}]
[104,{"$f":"IF('Tex-415,18,24,48-A'!$F$47=\"\",\"\",'Tex-415,18,24,48-A'!$F$47)","v":""},{"$f":"IF('Tex-415,18,24,48-A'!$B$42=\"\",\"\",'Tex-415,18,24,48-A'!$B$42)","v":"Tex-424-A"},{"$f":"IF('Tex-415,18,24,48-A'!$A$43=\"\",\"\",'Tex-415,18,24,48-A'!$A$43)","v":"Core"},{"$f":"IF('Tex-415,18,24,48-A'!$A$47=\"\",\"\",'Tex-415,18,24,48-A'!$A$47)","v":2},{"$f":"IF('Tex-415,18,24,48-A'!$F$43=\"\",\"\",'Tex-415,18,24,48-A'!$F$43)","v":"Length to Diameter Ratio"}]
[105,{"$f":"IF('Tex-415,18,24,48-A'!$G$47=\"\",\"\",'Tex-415,18,24,48-A'!$G$47)","v":""},{"$f":"IF('Tex-415,18,24,48-A'!$B$42=\"\",\"\",'Tex-415,18,24,48-A'!$B$42)","v":"Tex-424-A"},{"$f":"IF('Tex-415,18,24,48-A'!$A$43=\"\",\"\",'Tex-415,18,24,48-A'!$A$43)","v":"Core"},{"$f":"IF('Tex-415,18,24,48-A'!$A$47=\"\",\"\",'Tex-415,18,24,48-A'!$A$47)","v":2},{"$f":"IF('Tex-415,18,24,48-A'!$G$43=\"\",\"\",'Tex-415,18,24,48-A'!$G$43)","v":"Max Load "}]
[106,{"$f":"IF('Tex-415,18,24,48-A'!$H$47=\"\",\"\",'Tex-415,18,24,48-A'!$H$47)","v":""},{"$f":"IF('Tex-415,18,24,48-A'!$B$42=\"\",\"\",'Tex-415,18,24,48-A'!$B$42)","v":"Tex-424-A"},{"$f":"IF('Tex-415,18,24,48-A'!$A$43=\"\",\"\",'Tex-415,18,24,48-A'!$A$43)","v":"Core"},{"$f":"IF('Tex-415,18,24,48-A'!$A$47=\"\",\"\",'Tex-415,18,24,48-A'!$A$47)","v":2},{"$f":"IF('Tex-415,18,24,48-A'!$H$43=\"\",\"\",'Tex-415,18,24,48-A'!$H$43)","v":"Failure Type"}]
[107,{"$f":"IF('Tex-415,18,24,48-A'!$I$47=\"\",\"\",'Tex-415,18,24,48-A'!$I$47)","v":""},{"$f":"IF('Tex-415,18,24,48-A'!$B$42=\"\",\"\",'Tex-415,18,24,48-A'!$B$42)","v":"Tex-424-A"},{"$f":"IF('Tex-415,18,24,48-A'!$A$43=\"\",\"\",'Tex-415,18,24,48-A'!$A$43)","v":"Core"},{"$f":"IF('Tex-415,18,24,48-A'!$A$47=\"\",\"\",'Tex-415,18,24,48-A'!$A$47)","v":2},{"$f":"IF('Tex-415,18,24,48-A'!$I$43=\"\",\"\",'Tex-415,18,24,48-A'!$I$43)","v":"Correction Factor"}]
[108,{"$f":"IF('Tex-415,18,24,48-A'!$J$47=\"\",\"\",'Tex-415,18,24,48-A'!$J$47)","v":""},{"$f":"IF('Tex-415,18,24,48-A'!$B$42=\"\",\"\",'Tex-415,18,24,48-A'!$B$42)","v":"Tex-424-A"},{"$f":"IF('Tex-415,18,24,48-A'!$A$43=\"\",\"\",'Tex-415,18,24,48-A'!$A$43)","v":"Core"},{"$f":"IF('Tex-415,18,24,48-A'!$A$47=\"\",\"\",'Tex-415,18,24,48-A'!$A$47)","v":2},{"$f":"IF('Tex-415,18,24,48-A'!$J$43=\"\",\"\",'Tex-415,18,24,48-A'!$J$43)","v":"Compressive Strength "}]
[109,{"$f":"IF('Tex-415,18,24,48-A'!$B$48=\"\",\"\",'Tex-415,18,24,48-A'!$B$48)","v":""},{"$f":"IF('Tex-415,18,24,48-A'!$B$42=\"\",\"\",'Tex-415,18,24,48-A'!$B$42)","v":"Tex-424-A"},{"$f":"IF('Tex-415,18,24,48-A'!$A$43=\"\",\"\",'Tex-415,18,24,48-A'!$A$43)","v":"Core"},{"$f":"IF('Tex-415,18,24,48-A'!$A$48=\"\",\"\",'Tex-415,18,24,48-A'!$A$48)","v":3},{"$f":"IF('Tex-415,18,24,48-A'!$B$43=\"\",\"\",'Tex-415,18,24,48-A'!$B$43)","v":"Core Number"}]
[110,{"$f":"IF('Tex-415,18,24,48-A'!$C$48=\"\",\"\",'Tex-415,18,24,48-A'!$C$48)","v":""},{"$f":"IF('Tex-415,18,24,48-A'!$B$42=\"\",\"\",'Tex-415,18,24,48-A'!$B$42)","v":"Tex-424-A"},{"$f":"IF('Tex-415,18,24,48-A'!$A$43=\"\",\"\",'Tex-415,18,24,48-A'!$A$43)","v":"Core"},{"$f":"IF('Tex-415,18,24,48-A'!$A$48=\"\",\"\",'Tex-415,18,24,48-A'!$A$48)","v":3},{"$f":"IF('Tex-415,18,24,48-A'!$C$43=\"\",\"\",'Tex-415,18,24,48-A'!$C$43)","v":"Age (Days)"}]
[111,{"$f":"IF('Tex-415,18,24,48-A'!$D$48=\"\",\"\",'Tex-415,18,24,48-A'!$D$48)","v":""},{"$f":"IF('Tex-415,18,24,48-A'!$B$42=\"\",\"\",'Tex-415,18,24,48-A'!$B$42)","v":"Tex-424-A"},{"$f":"IF('Tex-415,18,24,48-A'!$A$43=\"\",\"\",'Tex-415,18,24,48-A'!$A$43)","v":"Core"},{"$f":"IF('Tex-415,18,24,48-A'!$A$48=\"\",\"\",'Tex-415,18,24,48-A'!$A$48)","v":3},{"$f":"IF('Tex-415,18,24,48-A'!$D$44=\"\",\"\",'Tex-415,18,24,48-A'!$D$44)","v":" of Core "}]
[112,{"$f":"IF('Tex-415,18,24,48-A'!$E$48=\"\",\"\",'Tex-415,18,24,48-A'!$E$48)","v":""},{"$f":"IF('Tex-415,18,24,48-A'!$B$42=\"\",\"\",'Tex-415,18,24,48-A'!$B$42)","v":"Tex-424-A"},{"$f":"IF('Tex-415,18,24,48-A'!$A$43=\"\",\"\",'Tex-415,18,24,48-A'!$A$43)","v":"Core"},{"$f":"IF('Tex-415,18,24,48-A'!$A$48=\"\",\"\",'Tex-415,18,24,48-A'!$A$48)","v":3},{"$f":"IF('Tex-415,18,24,48-A'!$E$43=\"\",\"\",'Tex-415,18,24,48-A'!$E$43)","v":"Length of Core "}]
[113,{"$f":"IF('Tex-415,18,24,48-A'!$F$48=\"\",\"\",'Tex-415,18,24,48-A'!$F$48)","v":""},{"$f":"IF('Tex-415,18,24,48-A'!$B$42=\"\",\"\",'Tex-415,18,24,48-A'!$B$42)","v":"Tex-424-A"},{"$f":"IF('Tex-415,18,24,48-A'!$A$43=\"\",\"\",'Tex-415,18,24,48-A'!$A$43)","v":"Core"},{"$f":"IF('Tex-415,18,24,48-A'!$A$48=\"\",\"\",'Tex-415,18,24,48-A'!$A$48)","v":3},{"$f":"IF('Tex-415,18,24,48-A'!$F$43=\"\",\"\",'Tex-415,18,24,48-A'!$F$43)","v":"Length to Diameter Ratio"}]
[114,{"$f":"IF('Tex-415,18,24,48-A'!$G$48=\"\",\"\",'Tex-415,18,24,48-A'!$G$48)","v":""},{"$f":"IF('Tex-415,18,24,48-A'!$B$42=\"\",\"\",'Tex-415,18,24,48-A'!$B$42)","v":"Tex-424-A"},{"$f":"IF('Tex-415,18,24,48-A'!$A$43=\"\",\"\",'Tex-415,18,24,48-A'!$A$43)","v":"Core"},{"$f":"IF('Tex-415,18,24,48-A'!$A$48=\"\",\"\",'Tex-415,18,24,48-A'!$A$48)","v":3},{"$f":"IF('Tex-415,18,24,48-A'!$G$43=\"\",\"\",'Tex-415,18,24,48-A'!$G$43)","v":"Max Load "}]
[115,{"$f":"IF('Tex-415,18,24,48-A'!$H$48=\"\",\"\",'Tex-415,18,24,48-A'!$H$48)","v":""},{"$f":"IF('Tex-415,18,24,48-A'!$B$42=\"\",\"\",'Tex-415,18,24,48-A'!$B$42)","v":"Tex-424-A"},{"$f":"IF('Tex-415,18,24,48-A'!$A$43=\"\",\"\",'Tex-415,18,24,48-A'!$A$43)","v":"Core"},{"$f":"IF('Tex-415,18,24,48-A'!$A$48=\"\",\"\",'Tex-415,18,24,48-A'!$A$48)","v":3},{"$f":"IF('Tex-415,18,24,48-A'!$H$43=\"\",\"\",'Tex-415,18,24,48-A'!$H$43)","v":"Failure Type"}]
[116,{"$f":"IF('Tex-415,18,24,48-A'!$I$48=\"\",\"\",'Tex-415,18,24,48-A'!$I$48)","v":""},{"$f":"IF('Tex-415,18,24,48-A'!$B$42=\"\",\"\",'Tex-415,18,24,48-A'!$B$42)","v":"Tex-424-A"},{"$f":"IF('Tex-415,18,24,48-A'!$A$43=\"\",\"\",'Tex-415,18,24,48-A'!$A$43)","v":"Core"},{"$f":"IF('Tex-415,18,24,48-A'!$A$48=\"\",\"\",'Tex-415,18,24,48-A'!$A$48)","v":3},{"$f":"IF('Tex-415,18,24,48-A'!$I$43=\"\",\"\",'Tex-415,18,24,48-A'!$I$43)","v":"Correction Factor"}]
[117,{"$f":"IF('Tex-415,18,24,48-A'!$J$48=\"\",\"\",'Tex-415,18,24,48-A'!$J$48)","v":""},{"$f":"IF('Tex-415,18,24,48-A'!$B$42=\"\",\"\",'Tex-415,18,24,48-A'!$B$42)","v":"Tex-424-A"},{"$f":"IF('Tex-415,18,24,48-A'!$A$43=\"\",\"\",'Tex-415,18,24,48-A'!$A$43)","v":"Core"},{"$f":"IF('Tex-415,18,24,48-A'!$A$48=\"\",\"\",'Tex-415,18,24,48-A'!$A$48)","v":3},{"$f":"IF('Tex-415,18,24,48-A'!$J$43=\"\",\"\",'Tex-415,18,24,48-A'!$J$43)","v":"Compressive Strength "}]
[118,{"$f":"IF('Tex-415,18,24,48-A'!$K$48=\"\",\"\",'Tex-415,18,24,48-A'!$K$48)","v":""},{"$f":"IF('Tex-415,18,24,48-A'!$B$42=\"\",\"\",'Tex-415,18,24,48-A'!$B$42)","v":"Tex-424-A"},{"$f":"IF('Tex-415,18,24,48-A'!$A$43=\"\",\"\",'Tex-415,18,24,48-A'!$A$43)","v":"Core"},{"$f":"IF('Tex-415,18,24,48-A'!$A$48=\"\",\"\",'Tex-415,18,24,48-A'!$A$48)","v":3},{"$f":"IF('Tex-415,18,24,48-A'!$K$43=\"\",\"\",'Tex-415,18,24,48-A'!$K$43)","v":"Compressive Strength Average "}]
[119,{"$f":"IF('Tex-415,18,24,48-A'!$B$49=\"\",\"\",'Tex-415,18,24,48-A'!$B$49)","v":""},{"$f":"IF('Tex-415,18,24,48-A'!$B$42=\"\",\"\",'Tex-415,18,24,48-A'!$B$42)","v":"Tex-424-A"},{"$f":"IF('Tex-415,18,24,48-A'!$A$43=\"\",\"\",'Tex-415,18,24,48-A'!$A$43)","v":"Core"},{"$f":"IF('Tex-415,18,24,48-A'!$A$49=\"\",\"\",'Tex-415,18,24,48-A'!$A$49)","v":4},{"$f":"IF('Tex-415,18,24,48-A'!$B$43=\"\",\"\",'Tex-415,18,24,48-A'!$B$43)","v":"Core Number"}]
[120,{"$f":"IF('Tex-415,18,24,48-A'!$D$49=\"\",\"\",'Tex-415,18,24,48-A'!$D$49)","v":""},{"$f":"IF('Tex-415,18,24,48-A'!$B$42=\"\",\"\",'Tex-415,18,24,48-A'!$B$42)","v":"Tex-424-A"},{"$f":"IF('Tex-415,18,24,48-A'!$A$43=\"\",\"\",'Tex-415,18,24,48-A'!$A$43)","v":"Core"},{"$f":"IF('Tex-415,18,24,48-A'!$A$49=\"\",\"\",'Tex-415,18,24,48-A'!$A$49)","v":4},{"$f":"IF('Tex-415,18,24,48-A'!$D$44=\"\",\"\",'Tex-415,18,24,48-A'!$D$44)","v":" of Core "}]
[121,{"$f":"IF('Tex-415,18,24,48-A'!$E$49=\"\",\"\",'Tex-415,18,24,48-A'!$E$49)","v":""},{"$f":"IF('Tex-415,18,24,48-A'!$B$42=\"\",\"\",'Tex-415,18,24,48-A'!$B$42)","v":"Tex-424-A"},{"$f":"IF('Tex-415,18,24,48-A'!$A$43=\"\",\"\",'Tex-415,18,24,48-A'!$A$43)","v":"Core"},{"$f":"IF('Tex-415,18,24,48-A'!$A$49=\"\",\"\",'Tex-415,18,24,48-A'!$A$49)","v":4},{"$f":"IF('Tex-415,18,24,48-A'!$E$43=\"\",\"\",'Tex-415,18,24,48-A'!$E$43)","v":"Length of Core "}]
[122,{"$f":"IF('Tex-415,18,24,48-A'!$F$49=\"\",\"\",'Tex-415,18,24,48-A'!$F$49)","v":""},{"$f":"IF('Tex-415,18,24,48-A'!$B$42=\"\",\"\",'Tex-415,18,24,48-A'!$B$42)","v":"Tex-424-A"},{"$f":"IF('Tex-415,18,24,48-A'!$A$43=\"\",\"\",'Tex-415,18,24,48-A'!$A$43)","v":"Core"},{"$f":"IF('Tex-415,18,24,48-A'!$A$49=\"\",\"\",'Tex-415,18,24,48-A'!$A$49)","v":4},{"$f":"IF('Tex-415,18,24,48-A'!$F$43=\"\",\"\",'Tex-415,18,24,48-A'!$F$43)","v":"Length to Diameter Ratio"}]
[123,{"$f":"IF('Tex-415,18,24,48-A'!$G$49=\"\",\"\",'Tex-415,18,24,48-A'!$G$49)","v":""},{"$f":"IF('Tex-415,18,24,48-A'!$B$42=\"\",\"\",'Tex-415,18,24,48-A'!$B$42)","v":"Tex-424-A"},{"$f":"IF('Tex-415,18,24,48-A'!$A$43=\"\",\"\",'Tex-415,18,24,48-A'!$A$43)","v":"Core"},{"$f":"IF('Tex-415,18,24,48-A'!$A$49=\"\",\"\",'Tex-415,18,24,48-A'!$A$49)","v":4},{"$f":"IF('Tex-415,18,24,48-A'!$G$43=\"\",\"\",'Tex-415,18,24,48-A'!$G$43)","v":"Max Load "}]
[124,{"$f":"IF('Tex-415,18,24,48-A'!$H$49=\"\",\"\",'Tex-415,18,24,48-A'!$H$49)","v":""},{"$f":"IF('Tex-415,18,24,48-A'!$B$42=\"\",\"\",'Tex-415,18,24,48-A'!$B$42)","v":"Tex-424-A"},{"$f":"IF('Tex-415,18,24,48-A'!$A$43=\"\",\"\",'Tex-415,18,24,48-A'!$A$43)","v":"Core"},{"$f":"IF('Tex-415,18,24,48-A'!$A$49=\"\",\"\",'Tex-415,18,24,48-A'!$A$49)","v":4},{"$f":"IF('Tex-415,18,24,48-A'!$H$43=\"\",\"\",'Tex-415,18,24,48-A'!$H$43)","v":"Failure Type"}]
[125,{"$f":"IF('Tex-415,18,24,48-A'!$I$49=\"\",\"\",'Tex-415,18,24,48-A'!$I$49)","v":""},{"$f":"IF('Tex-415,18,24,48-A'!$B$42=\"\",\"\",'Tex-415,18,24,48-A'!$B$42)","v":"Tex-424-A"},{"$f":"IF('Tex-415,18,24,48-A'!$A$43=\"\",\"\",'Tex-415,18,24,48-A'!$A$43)","v":"Core"},{"$f":"IF('Tex-415,18,24,48-A'!$A$49=\"\",\"\",'Tex-415,18,24,48-A'!$A$49)","v":4},{"$f":"IF('Tex-415,18,24,48-A'!$I$43=\"\",\"\",'Tex-415,18,24,48-A'!$I$43)","v":"Correction Factor"}]
[126,{"$f":"IF('Tex-415,18,24,48-A'!$J$49=\"\",\"\",'Tex-415,18,24,48-A'!$J$49)","v":""},{"$f":"IF('Tex-415,18,24,48-A'!$B$42=\"\",\"\",'Tex-415,18,24,48-A'!$B$42)","v":"Tex-424-A"},{"$f":"IF('Tex-415,18,24,48-A'!$A$43=\"\",\"\",'Tex-415,18,24,48-A'!$A$43)","v":"Core"},{"$f":"IF('Tex-415,18,24,48-A'!$A$49=\"\",\"\",'Tex-415,18,24,48-A'!$A$49)","v":4},{"$f":"IF('Tex-415,18,24,48-A'!$J$43=\"\",\"\",'Tex-415,18,24,48-A'!$J$43)","v":"Compressive Strength "}]
[127,{"$f":"IF('Tex-415,18,24,48-A'!$B$50=\"\",\"\",'Tex-415,18,24,48-A'!$B$50)","v":""},{"$f":"IF('Tex-415,18,24,48-A'!$B$42=\"\",\"\",'Tex-415,18,24,48-A'!$B$42)","v":"Tex-424-A"},{"$f":"IF('Tex-415,18,24,48-A'!$A$43=\"\",\"\",'Tex-415,18,24,48-A'!$A$43)","v":"Core"},{"$f":"IF('Tex-415,18,24,48-A'!$A$50=\"\",\"\",'Tex-415,18,24,48-A'!$A$50)","v":5},{"$f":"IF('Tex-415,18,24,48-A'!$B$43=\"\",\"\",'Tex-415,18,24,48-A'!$B$43)","v":"Core Number"}]
[128,{"$f":"IF('Tex-415,18,24,48-A'!$C$50=\"\",\"\",'Tex-415,18,24,48-A'!$C$50)","v":""},{"$f":"IF('Tex-415,18,24,48-A'!$B$42=\"\",\"\",'Tex-415,18,24,48-A'!$B$42)","v":"Tex-424-A"},{"$f":"IF('Tex-415,18,24,48-A'!$A$43=\"\",\"\",'Tex-415,18,24,48-A'!$A$43)","v":"Core"},{"$f":"IF('Tex-415,18,24,48-A'!$A$50=\"\",\"\",'Tex-415,18,24,48-A'!$A$50)","v":5},{"$f":"IF('Tex-415,18,24,48-A'!$C$43=\"\",\"\",'Tex-415,18,24,48-A'!$C$43)","v":"Age (Days)"}]
[129,{"$f":"IF('Tex-415,18,24,48-A'!$D$50=\"\",\"\",'Tex-415,18,24,48-A'!$D$50)","v":""},{"$f":"IF('Tex-415,18,24,48-A'!$B$42=\"\",\"\",'Tex-415,18,24,48-A'!$B$42)","v":"Tex-424-A"},{"$f":"IF('Tex-415,18,24,48-A'!$A$43=\"\",\"\",'Tex-415,18,24,48-A'!$A$43)","v":"Core"},{"$f":"IF('Tex-415,18,24,48-A'!$A$50=\"\",\"\",'Tex-415,18,24,48-A'!$A$50)","v":5},{"$f":"IF('Tex-415,18,24,48-A'!$D$44=\"\",\"\",'Tex-415,18,24,48-A'!$D$44)","v":" of Core "}]
[130,{"$f":"IF('Tex-415,18,24,48-A'!$E$50=\"\",\"\",'Tex-415,18,24,48-A'!$E$50)","v":""},{"$f":"IF('Tex-415,18,24,48-A'!$B$42=\"\",\"\",'Tex-415,18,24,48-A'!$B$42)","v":"Tex-424-A"},{"$f":"IF('Tex-415,18,24,48-A'!$A$43=\"\",\"\",'Tex-415,18,24,48-A'!$A$43)","v":"Core"},{"$f":"IF('Tex-415,18,24,48-A'!$A$50=\"\",\"\",'Tex-415,18,24,48-A'!$A$50)","v":5},{"$f":"IF('Tex-415,18,24,48-A'!$E$43=\"\",\"\",'Tex-415,18,24,48-A'!$E$43)","v":"Length of Core "}]
[131,{"$f":"IF('Tex-415,18,24,48-A'!$F$50=\"\",\"\",'Tex-415,18,24,48-A'!$F$50)","v":""},{"$f":"IF('Tex-415,18,24,48-A'!$B$42=\"\",\"\",'Tex-415,18,24,48-A'!$B$42)","v":"Tex-424-A"},{"$f":"IF('Tex-415,18,24,48-A'!$A$43=\"\",\"\",'Tex-415,18,24,48-A'!$A$43)","v":"Core"},{"$f":"IF('Tex-415,18,24,48-A'!$A$50=\"\",\"\",'Tex-415,18,24,48-A'!$A$50)","v":5},{"$f":"IF('Tex-415,18,24,48-A'!$F$43=\"\",\"\",'Tex-415,18,24,48-A'!$F$43)","v":"Length to Diameter Ratio"}]
[132,{"$f":"IF('Tex-415,18,24,48-A'!$G$50=\"\",\"\",'Tex-415,18,24,48-A'!$G$50)","v":""},{"$f":"IF('Tex-415,18,24,48-A'!$B$42=\"\",\"\",'Tex-415,18,24,48-A'!$B$42)","v":"Tex-424-A"},{"$f":"IF('Tex-415,18,24,48-A'!$A$43=\"\",\"\",'Tex-415,18,24,48-A'!$A$43)","v":"Core"},{"$f":"IF('Tex-415,18,24,48-A'!$A$50=\"\",\"\",'Tex-415,18,24,48-A'!$A$50)","v":5},{"$f":"IF('Tex-415,18,24,48-A'!$G$43=\"\",\"\",'Tex-415,18,24,48-A'!$G$43)","v":"Max Load "}]
[133,{"$f":"IF('Tex-415,18,24,48-A'!$H$50=\"\",\"\",'Tex-415,18,24,48-A'!$H$50)","v":""},{"$f":"IF('Tex-415,18,24,48-A'!$B$42=\"\",\"\",'Tex-415,18,24,48-A'!$B$42)","v":"Tex-424-A"},{"$f":"IF('Tex-415,18,24,48-A'!$A$43=\"\",\"\",'Tex-415,18,24,48-A'!$A$43)","v":"Core"},{"$f":"IF('Tex-415,18,24,48-A'!$A$50=\"\",\"\",'Tex-415,18,24,48-A'!$A$50)","v":5},{"$f":"IF('Tex-415,18,24,48-A'!$H$43=\"\",\"\",'Tex-415,18,24,48-A'!$H$43)","v":"Failure Type"}]
[134,{"$f":"IF('Tex-415,18,24,48-A'!$I$50=\"\",\"\",'Tex-415,18,24,48-A'!$I$50)","v":""},{"$f":"IF('Tex-415,18,24,48-A'!$B$42=\"\",\"\",'Tex-415,18,24,48-A'!$B$42)","v":"Tex-424-A"},{"$f":"IF('Tex-415,18,24,48-A'!$A$43=\"\",\"\",'Tex-415,18,24,48-A'!$A$43)","v":"Core"},{"$f":"IF('Tex-415,18,24,48-A'!$A$50=\"\",\"\",'Tex-415,18,24,48-A'!$A$50)","v":5},{"$f":"IF('Tex-415,18,24,48-A'!$I$43=\"\",\"\",'Tex-415,18,24,48-A'!$I$43)","v":"Correction Factor"}]
[135,{"$f":"IF('Tex-415,18,24,48-A'!$J$50=\"\",\"\",'Tex-415,18,24,48-A'!$J$50)","v":""},{"$f":"IF('Tex-415,18,24,48-A'!$B$42=\"\",\"\",'Tex-415,18,24,48-A'!$B$42)","v":"Tex-424-A"},{"$f":"IF('Tex-415,18,24,48-A'!$A$43=\"\",\"\",'Tex-415,18,24,48-A'!$A$43)","v":"Core"},{"$f":"IF('Tex-415,18,24,48-A'!$A$50=\"\",\"\",'Tex-415,18,24,48-A'!$A$50)","v":5},{"$f":"IF('Tex-415,18,24,48-A'!$J$43=\"\",\"\",'Tex-415,18,24,48-A'!$J$43)","v":"Compressive Strength "}]
[136,{"$f":"IF('Tex-415,18,24,48-A'!$K$50=\"\",\"\",'Tex-415,18,24,48-A'!$K$50)","v":""},{"$f":"IF('Tex-415,18,24,48-A'!$B$42=\"\",\"\",'Tex-415,18,24,48-A'!$B$42)","v":"Tex-424-A"},{"$f":"IF('Tex-415,18,24,48-A'!$A$43=\"\",\"\",'Tex-415,18,24,48-A'!$A$43)","v":"Core"},{"$f":"IF('Tex-415,18,24,48-A'!$A$50=\"\",\"\",'Tex-415,18,24,48-A'!$A$50)","v":5},{"$f":"IF('Tex-415,18,24,48-A'!$K$43=\"\",\"\",'Tex-415,18,24,48-A'!$K$43)","v":"Compressive Strength Average "}]
[137,{"$f":"IF('Tex-415,18,24,48-A'!$B$51=\"\",\"\",'Tex-415,18,24,48-A'!$B$51)","v":""},{"$f":"IF('Tex-415,18,24,48-A'!$B$42=\"\",\"\",'Tex-415,18,24,48-A'!$B$42)","v":"Tex-424-A"},{"$f":"IF('Tex-415,18,24,48-A'!$A$43=\"\",\"\",'Tex-415,18,24,48-A'!$A$43)","v":"Core"},{"$f":"IF('Tex-415,18,24,48-A'!$A$51=\"\",\"\",'Tex-415,18,24,48-A'!$A$51)","v":6},{"$f":"IF('Tex-415,18,24,48-A'!$B$43=\"\",\"\",'Tex-415,18,24,48-A'!$B$43)","v":"Core Number"}]
[138,{"$f":"IF('Tex-415,18,24,48-A'!$D$51=\"\",\"\",'Tex-415,18,24,48-A'!$D$51)","v":""},{"$f":"IF('Tex-415,18,24,48-A'!$B$42=\"\",\"\",'Tex-415,18,24,48-A'!$B$42)","v":"Tex-424-A"},{"$f":"IF('Tex-415,18,24,48-A'!$A$43=\"\",\"\",'Tex-415,18,24,48-A'!$A$43)","v":"Core"},{"$f":"IF('Tex-415,18,24,48-A'!$A$51=\"\",\"\",'Tex-415,18,24,48-A'!$A$51)","v":6},{"$f":"IF('Tex-415,18,24,48-A'!$D$44=\"\",\"\",'Tex-415,18,24,48-A'!$D$44)","v":" of Core "}]
[139,{"$f":"IF('Tex-415,18,24,48-A'!$E$51=\"\",\"\",'Tex-415,18,24,48-A'!$E$51)","v":""},{"$f":"IF('Tex-415,18,24,48-A'!$B$42=\"\",\"\",'Tex-415,18,24,48-A'!$B$42)","v":"Tex-424-A"},{"$f":"IF('Tex-415,18,24,48-A'!$A$43=\"\",\"\",'Tex-415,18,24,48-A'!$A$43)","v":"Core"},{"$f":"IF('Tex-415,18,24,48-A'!$A$51=\"\",\"\",'Tex-415,18,24,48-A'!$A$51)","v":6},{"$f":"IF('Tex-415,18,24,48-A'!$E$43=\"\",\"\",'Tex-415,18,24,48-A'!$E$43)","v":"Length of Core "}]
[140,{"$f":"IF('Tex-415,18,24,48-A'!$F$51=\"\",\"\",'Tex-415,18,24,48-A'!$F$51)","v":""},{"$f":"IF('Tex-415,18,24,48-A'!$B$42=\"\",\"\",'Tex-415,18,24,48-A'!$B$42)","v":"Tex-424-A"},{"$f":"IF('Tex-415,18,24,48-A'!$A$43=\"\",\"\",'Tex-415,18,24,48-A'!$A$43)","v":"Core"},{"$f":"IF('Tex-415,18,24,48-A'!$A$51=\"\",\"\",'Tex-415,18,24,48-A'!$A$51)","v":6},{"$f":"IF('Tex-415,18,24,48-A'!$F$43=\"\",\"\",'Tex-415,18,24,48-A'!$F$43)","v":"Length to Diameter Ratio"}]
[141,{"$f":"IF('Tex-415,18,24,48-A'!$G$51=\"\",\"\",'Tex-415,18,24,48-A'!$G$51)","v":""},{"$f":"IF('Tex-415,18,24,48-A'!$B$42=\"\",\"\",'Tex-415,18,24,48-A'!$B$42)","v":"Tex-424-A"},{"$f":"IF('Tex-415,18,24,48-A'!$A$43=\"\",\"\",'Tex-415,18,24,48-A'!$A$43)","v":"Core"},{"$f":"IF('Tex-415,18,24,48-A'!$A$51=\"\",\"\",'Tex-415,18,24,48-A'!$A$51)","v":6},{"$f":"IF('Tex-415,18,24,48-A'!$G$43=\"\",\"\",'Tex-415,18,24,48-A'!$G$43)","v":"Max Load "}]
[142,{"$f":"IF('Tex-415,18,24,48-A'!$H$51=\"\",\"\",'Tex-415,18,24,48-A'!$H$51)","v":""},{"$f":"IF('Tex-415,18,24,48-A'!$B$42=\"\",\"\",'Tex-415,18,24,48-A'!$B$42)","v":"Tex-424-A"},{"$f":"IF('Tex-415,18,24,48-A'!$A$43=\"\",\"\",'Tex-415,18,24,48-A'!$A$43)","v":"Core"},{"$f":"IF('Tex-415,18,24,48-A'!$A$51=\"\",\"\",'Tex-415,18,24,48-A'!$A$51)","v":6},{"$f":"IF('Tex-415,18,24,48-A'!$H$43=\"\",\"\",'Tex-415,18,24,48-A'!$H$43)","v":"Failure Type"}]
[143,{"$f":"IF('Tex-415,18,24,48-A'!$I$51=\"\",\"\",'Tex-415,18,24,48-A'!$I$51)","v":""},{"$f":"IF('Tex-415,18,24,48-A'!$B$42=\"\",\"\",'Tex-415,18,24,48-A'!$B$42)","v":"Tex-424-A"},{"$f":"IF('Tex-415,18,24,48-A'!$A$43=\"\",\"\",'Tex-415,18,24,48-A'!$A$43)","v":"Core"},{"$f":"IF('Tex-415,18,24,48-A'!$A$51=\"\",\"\",'Tex-415,18,24,48-A'!$A$51)","v":6},{"$f":"IF('Tex-415,18,24,48-A'!$I$43=\"\",\"\",'Tex-415,18,24,48-A'!$I$43)","v":"Correction Factor"}]
[144,{"$f":"IF('Tex-415,18,24,48-A'!$J$51=\"\",\"\",'Tex-415,18,24,48-A'!$J$51)","v":""},{"$f":"IF('Tex-415,18,24,48-A'!$B$42=\"\",\"\",'Tex-415,18,24,48-A'!$B$42)","v":"Tex-424-A"},{"$f":"IF('Tex-415,18,24,48-A'!$A$43=\"\",\"\",'Tex-415,18,24,48-A'!$A$43)","v":"Core"},{"$f":"IF('Tex-415,18,24,48-A'!$A$51=\"\",\"\",'Tex-415,18,24,48-A'!$A$51)","v":6},{"$f":"IF('Tex-415,18,24,48-A'!$J$43=\"\",\"\",'Tex-415,18,24,48-A'!$J$43)","v":"Compressive Strength "}]
[145,{"$f":"IF('Tex-415,18,24,48-A'!$B$52=\"\",\"\",'Tex-415,18,24,48-A'!$B$52)","v":""},{"$f":"IF('Tex-415,18,24,48-A'!$B$42=\"\",\"\",'Tex-415,18,24,48-A'!$B$42)","v":"Tex-424-A"},{"$f":"IF('Tex-415,18,24,48-A'!$A$43=\"\",\"\",'Tex-415,18,24,48-A'!$A$43)","v":"Core"},{"$f":"IF('Tex-415,18,24,48-A'!$A$52=\"\",\"\",'Tex-415,18,24,48-A'!$A$52)","v":7},{"$f":"IF('Tex-415,18,24,48-A'!$B$43=\"\",\"\",'Tex-415,18,24,48-A'!$B$43)","v":"Core Number"}]
[146,{"$f":"IF('Tex-415,18,24,48-A'!$C$52=\"\",\"\",'Tex-415,18,24,48-A'!$C$52)","v":""},{"$f":"IF('Tex-415,18,24,48-A'!$B$42=\"\",\"\",'Tex-415,18,24,48-A'!$B$42)","v":"Tex-424-A"},{"$f":"IF('Tex-415,18,24,48-A'!$A$43=\"\",\"\",'Tex-415,18,24,48-A'!$A$43)","v":"Core"},{"$f":"IF('Tex-415,18,24,48-A'!$A$52=\"\",\"\",'Tex-415,18,24,48-A'!$A$52)","v":7},{"$f":"IF('Tex-415,18,24,48-A'!$C$43=\"\",\"\",'Tex-415,18,24,48-A'!$C$43)","v":"Age (Days)"}]
[147,{"$f":"IF('Tex-415,18,24,48-A'!$D$52=\"\",\"\",'Tex-415,18,24,48-A'!$D$52)","v":""},{"$f":"IF('Tex-415,18,24,48-A'!$B$42=\"\",\"\",'Tex-415,18,24,48-A'!$B$42)","v":"Tex-424-A"},{"$f":"IF('Tex-415,18,24,48-A'!$A$43=\"\",\"\",'Tex-415,18,24,48-A'!$A$43)","v":"Core"},{"$f":"IF('Tex-415,18,24,48-A'!$A$52=\"\",\"\",'Tex-415,18,24,48-A'!$A$52)","v":7},{"$f":"IF('Tex-415,18,24,48-A'!$D$44=\"\",\"\",'Tex-415,18,24,48-A'!$D$44)","v":" of Core "}]
[148,{"$f":"IF('Tex-415,18,24,48-A'!$E$52=\"\",\"\",'Tex-415,18,24,48-A'!$E$52)","v":""},{"$f":"IF('Tex-415,18,24,48-A'!$B$42=\"\",\"\",'Tex-415,18,24,48-A'!$B$42)","v":"Tex-424-A"},{"$f":"IF('Tex-415,18,24,48-A'!$A$43=\"\",\"\",'Tex-415,18,24,48-A'!$A$43)","v":"Core"},{"$f":"IF('Tex-415,18,24,48-A'!$A$52=\"\",\"\",'Tex-415,18,24,48-A'!$A$52)","v":7},{"$f":"IF('Tex-415,18,24,48-A'!$E$43=\"\",\"\",'Tex-415,18,24,48-A'!$E$43)","v":"Length of Core "}]
[149,{"$f":"IF('Tex-415,18,24,48-A'!$F$52=\"\",\"\",'Tex-415,18,24,48-A'!$F$52)","v":""},{"$f":"IF('Tex-415,18,24,48-A'!$B$42=\"\",\"\",'Tex-415,18,24,48-A'!$B$42)","v":"Tex-424-A"},{"$f":"IF('Tex-415,18,24,48-A'!$A$43=\"\",\"\",'Tex-415,18,24,48-A'!$A$43)","v":"Core"},{"$f":"IF('Tex-415,18,24,48-A'!$A$52=\"\",\"\",'Tex-415,18,24,48-A'!$A$52)","v":7},{"$f":"IF('Tex-415,18,24,48-A'!$F$43=\"\",\"\",'Tex-415,18,24,48-A'!$F$43)","v":"Length to Diameter Ratio"}]
[150,{"$f":"IF('Tex-415,18,24,48-A'!$G$52=\"\",\"\",'Tex-415,18,24,48-A'!$G$52)","v":""},{"$f":"IF('Tex-415,18,24,48-A'!$B$42=\"\",\"\",'Tex-415,18,24,48-A'!$B$42)","v":"Tex-424-A"},{"$f":"IF('Tex-415,18,24,48-A'!$A$43=\"\",\"\",'Tex-415,18,24,48-A'!$A$43)","v":"Core"},{"$f":"IF('Tex-415,18,24,48-A'!$A$52=\"\",\"\",'Tex-415,18,24,48-A'!$A$52)","v":7},{"$f":"IF('Tex-415,18,24,48-A'!$G$43=\"\",\"\",'Tex-415,18,24,48-A'!$G$43)","v":"Max Load "}]
[151,{"$f":"IF('Tex-415,18,24,48-A'!$H$52=\"\",\"\",'Tex-415,18,24,48-A'!$H$52)","v":""},{"$f":"IF('Tex-415,18,24,48-A'!$B$42=\"\",\"\",'Tex-415,18,24,48-A'!$B$42)","v":"Tex-424-A"},{"$f":"IF('Tex-415,18,24,48-A'!$A$43=\"\",\"\",'Tex-415,18,24,48-A'!$A$43)","v":"Core"},{"$f":"IF('Tex-415,18,24,48-A'!$A$52=\"\",\"\",'Tex-415,18,24,48-A'!$A$52)","v":7},{"$f":"IF('Tex-415,18,24,48-A'!$H$43=\"\",\"\",'Tex-415,18,24,48-A'!$H$43)","v":"Failure Type"}]
[152,{"$f":"IF('Tex-415,18,24,48-A'!$I$52=\"\",\"\",'Tex-415,18,24,48-A'!$I$52)","v":""},{"$f":"IF('Tex-415,18,24,48-A'!$B$42=\"\",\"\",'Tex-415,18,24,48-A'!$B$42)","v":"Tex-424-A"},{"$f":"IF('Tex-415,18,24,48-A'!$A$43=\"\",\"\",'Tex-415,18,24,48-A'!$A$43)","v":"Core"},{"$f":"IF('Tex-415,18,24,48-A'!$A$52=\"\",\"\",'Tex-415,18,24,48-A'!$A$52)","v":7},{"$f":"IF('Tex-415,18,24,48-A'!$I$43=\"\",\"\",'Tex-415,18,24,48-A'!$I$43)","v":"Correction Factor"}]
[153,{"$f":"IF('Tex-415,18,24,48-A'!$J$52=\"\",\"\",'Tex-415,18,24,48-A'!$J$52)","v":""},{"$f":"IF('Tex-415,18,24,48-A'!$B$42=\"\",\"\",'Tex-415,18,24,48-A'!$B$42)","v":"Tex-424-A"},{"$f":"IF('Tex-415,18,24,48-A'!$A$43=\"\",\"\",'Tex-415,18,24,48-A'!$A$43)","v":"Core"},{"$f":"IF('Tex-415,18,24,48-A'!$A$52=\"\",\"\",'Tex-415,18,24,48-A'!$A$52)","v":7},{"$f":"IF('Tex-415,18,24,48-A'!$J$43=\"\",\"\",'Tex-415,18,24,48-A'!$J$43)","v":"Compressive Strength "}]
[154,{"$f":"IF('Tex-415,18,24,48-A'!$K$52=\"\",\"\",'Tex-415,18,24,48-A'!$K$52)","v":""},{"$f":"IF('Tex-415,18,24,48-A'!$B$42=\"\",\"\",'Tex-415,18,24,48-A'!$B$42)","v":"Tex-424-A"},{"$f":"IF('Tex-415,18,24,48-A'!$A$43=\"\",\"\",'Tex-415,18,24,48-A'!$A$43)","v":"Core"},{"$f":"IF('Tex-415,18,24,48-A'!$A$52=\"\",\"\",'Tex-415,18,24,48-A'!$A$52)","v":7},{"$f":"IF('Tex-415,18,24,48-A'!$K$43=\"\",\"\",'Tex-415,18,24,48-A'!$K$43)","v":"Compressive Strength Average "}]
[155,{"$f":"IF('Tex-415,18,24,48-A'!$B$53=\"\",\"\",'Tex-415,18,24,48-A'!$B$53)","v":""},{"$f":"IF('Tex-415,18,24,48-A'!$B$42=\"\",\"\",'Tex-415,18,24,48-A'!$B$42)","v":"Tex-424-A"},{"$f":"IF('Tex-415,18,24,48-A'!$A$43=\"\",\"\",'Tex-415,18,24,48-A'!$A$43)","v":"Core"},{"$f":"IF('Tex-415,18,24,48-A'!$A$53=\"\",\"\",'Tex-415,18,24,48-A'!$A$53)","v":8},{"$f":"IF('Tex-415,18,24,48-A'!$B$43=\"\",\"\",'Tex-415,18,24,48-A'!$B$43)","v":"Core Number"}]
[156,{"$f":"IF('Tex-415,18,24,48-A'!$D$53=\"\",\"\",'Tex-415,18,24,48-A'!$D$53)","v":""},{"$f":"IF('Tex-415,18,24,48-A'!$B$42=\"\",\"\",'Tex-415,18,24,48-A'!$B$42)","v":"Tex-424-A"},{"$f":"IF('Tex-415,18,24,48-A'!$A$43=\"\",\"\",'Tex-415,18,24,48-A'!$A$43)","v":"Core"},{"$f":"IF('Tex-415,18,24,48-A'!$A$53=\"\",\"\",'Tex-415,18,24,48-A'!$A$53)","v":8},{"$f":"IF('Tex-415,18,24,48-A'!$D$44=\"\",\"\",'Tex-415,18,24,48-A'!$D$44)","v":" of Core "}]
[157,{"$f":"IF('Tex-415,18,24,48-A'!$E$53=\"\",\"\",'Tex-415,18,24,48-A'!$E$53)","v":""},{"$f":"IF('Tex-415,18,24,48-A'!$B$42=\"\",\"\",'Tex-415,18,24,48-A'!$B$42)","v":"Tex-424-A"},{"$f":"IF('Tex-415,18,24,48-A'!$A$43=\"\",\"\",'Tex-415,18,24,48-A'!$A$43)","v":"Core"},{"$f":"IF('Tex-415,18,24,48-A'!$A$53=\"\",\"\",'Tex-415,18,24,48-A'!$A$53)","v":8},{"$f":"IF('Tex-415,18,24,48-A'!$E$43=\"\",\"\",'Tex-415,18,24,48-A'!$E$43)","v":"Length of Core "}]
[158,{"$f":"IF('Tex-415,18,24,48-A'!$F$53=\"\",\"\",'Tex-415,18,24,48-A'!$F$53)","v":""},{"$f":"IF('Tex-415,18,24,48-A'!$B$42=\"\",\"\",'Tex-415,18,24,48-A'!$B$42)","v":"Tex-424-A"},{"$f":"IF('Tex-415,18,24,48-A'!$A$43=\"\",\"\",'Tex-415,18,24,48-A'!$A$43)","v":"Core"},{"$f":"IF('Tex-415,18,24,48-A'!$A$53=\"\",\"\",'Tex-415,18,24,48-A'!$A$53)","v":8},{"$f":"IF('Tex-415,18,24,48-A'!$F$43=\"\",\"\",'Tex-415,18,24,48-A'!$F$43)","v":"Length to Diameter Ratio"}]
[159,{"$f":"IF('Tex-415,18,24,48-A'!$G$53=\"\",\"\",'Tex-415,18,24,48-A'!$G$53)","v":""},{"$f":"IF('Tex-415,18,24,48-A'!$B$42=\"\",\"\",'Tex-415,18,24,48-A'!$B$42)","v":"Tex-424-A"},{"$f":"IF('Tex-415,18,24,48-A'!$A$43=\"\",\"\",'Tex-415,18,24,48-A'!$A$43)","v":"Core"},{"$f":"IF('Tex-415,18,24,48-A'!$A$53=\"\",\"\",'Tex-415,18,24,48-A'!$A$53)","v":8},{"$f":"IF('Tex-415,18,24,48-A'!$G$43=\"\",\"\",'Tex-415,18,24,48-A'!$G$43)","v":"Max Load "}]
[160,{"$f":"IF('Tex-415,18,24,48-A'!$H$53=\"\",\"\",'Tex-415,18,24,48-A'!$H$53)","v":""},{"$f":"IF('Tex-415,18,24,48-A'!$B$42=\"\",\"\",'Tex-415,18,24,48-A'!$B$42)","v":"Tex-424-A"},{"$f":"IF('Tex-415,18,24,48-A'!$A$43=\"\",\"\",'Tex-415,18,24,48-A'!$A$43)","v":"Core"},{"$f":"IF('Tex-415,18,24,48-A'!$A$53=\"\",\"\",'Tex-415,18,24,48-A'!$A$53)","v":8},{"$f":"IF('Tex-415,18,24,48-A'!$H$43=\"\",\"\",'Tex-415,18,24,48-A'!$H$43)","v":"Failure Type"}]
[161,{"$f":"IF('Tex-415,18,24,48-A'!$I$53=\"\",\"\",'Tex-415,18,24,48-A'!$I$53)","v":""},{"$f":"IF('Tex-415,18,24,48-A'!$B$42=\"\",\"\",'Tex-415,18,24,48-A'!$B$42)","v":"Tex-424-A"},{"$f":"IF('Tex-415,18,24,48-A'!$A$43=\"\",\"\",'Tex-415,18,24,48-A'!$A$43)","v":"Core"},{"$f":"IF('Tex-415,18,24,48-A'!$A$53=\"\",\"\",'Tex-415,18,24,48-A'!$A$53)","v":8},{"$f":"IF('Tex-415,18,24,48-A'!$I$43=\"\",\"\",'Tex-415,18,24,48-A'!$I$43)","v":"Correction Factor"}]
[162,{"$f":"IF('Tex-415,18,24,48-A'!$J$53=\"\",\"\",'Tex-415,18,24,48-A'!$J$53)","v":""},{"$f":"IF('Tex-415,18,24,48-A'!$B$42=\"\",\"\",'Tex-415,18,24,48-A'!$B$42)","v":"Tex-424-A"},{"$f":"IF('Tex-415,18,24,48-A'!$A$43=\"\",\"\",'Tex-415,18,24,48-A'!$A$43)","v":"Core"},{"$f":"IF('Tex-415,18,24,48-A'!$A$53=\"\",\"\",'Tex-415,18,24,48-A'!$A$53)","v":8},{"$f":"IF('Tex-415,18,24,48-A'!$J$43=\"\",\"\",'Tex-415,18,24,48-A'!$J$43)","v":"Compressive Strength "}]
[163,{"$f":"IF('Tex-415,18,24,48-A'!$B$58=\"\",\"\",'Tex-415,18,24,48-A'!$B$58)","v":""},{"$f":"IF('Tex-415,18,24,48-A'!$B$55=\"\",\"\",'Tex-415,18,24,48-A'!$B$55)","v":"Tex-448-A"},{"$f":"IF('Tex-415,18,24,48-A'!$A$56=\"\",\"\",'Tex-415,18,24,48-A'!$A$56)","v":"Beam"},{"$f":"IF('Tex-415,18,24,48-A'!$A$58=\"\",\"\",'Tex-415,18,24,48-A'!$A$58)","v":1},{"$f":"IF('Tex-415,18,24,48-A'!$B$56=\"\",\"\",'Tex-415,18,24,48-A'!$B$56)","v":"Beam Number"}]
[164,{"$f":"IF('Tex-415,18,24,48-A'!$C$58=\"\",\"\",'Tex-415,18,24,48-A'!$C$58)","v":""},{"$f":"IF('Tex-415,18,24,48-A'!$B$55=\"\",\"\",'Tex-415,18,24,48-A'!$B$55)","v":"Tex-448-A"},{"$f":"IF('Tex-415,18,24,48-A'!$A$56=\"\",\"\",'Tex-415,18,24,48-A'!$A$56)","v":"Beam"},{"$f":"IF('Tex-415,18,24,48-A'!$A$58=\"\",\"\",'Tex-415,18,24,48-A'!$A$58)","v":1},{"$f":"IF('Tex-415,18,24,48-A'!$C$56=\"\",\"\",'Tex-415,18,24,48-A'!$C$56)","v":"Age (Days)"}]
[165,{"$f":"IF('Tex-415,18,24,48-A'!$D$58=\"\",\"\",'Tex-415,18,24,48-A'!$D$58)","v":""},{"$f":"IF('Tex-415,18,24,48-A'!$B$55=\"\",\"\",'Tex-415,18,24,48-A'!$B$55)","v":"Tex-448-A"},{"$f":"IF('Tex-415,18,24,48-A'!$A$56=\"\",\"\",'Tex-415,18,24,48-A'!$A$56)","v":"Beam"},{"$f":"IF('Tex-415,18,24,48-A'!$A$58=\"\",\"\",'Tex-415,18,24,48-A'!$A$58)","v":1},{"$f":"IF('Tex-415,18,24,48-A'!$D$56=\"\",\"\",'Tex-415,18,24,48-A'!$D$56)","v":"Width of Beam "}]
[166,{"$f":"IF('Tex-415,18,24,48-A'!$E$58=\"\",\"\",'Tex-415,18,24,48-A'!$E$58)","v":""},{"$f":"IF('Tex-415,18,24,48-A'!$B$55=\"\",\"\",'Tex-415,18,24,48-A'!$B$55)","v":"Tex-448-A"},{"$f":"IF('Tex-415,18,24,48-A'!$A$56=\"\",\"\",'Tex-415,18,24,48-A'!$A$56)","v":"Beam"},{"$f":"IF('Tex-415,18,24,48-A'!$A$58=\"\",\"\",'Tex-415,18,24,48-A'!$A$58)","v":1},{"$f":"IF('Tex-415,18,24,48-A'!$E$56=\"\",\"\",'Tex-415,18,24,48-A'!$E$56)","v":"Depth of Beam "}]
[167,{"$f":"IF('Tex-415,18,24,48-A'!$F$58=\"\",\"\",'Tex-415,18,24,48-A'!$F$58)","v":""},{"$f":"IF('Tex-415,18,24,48-A'!$B$55=\"\",\"\",'Tex-415,18,24,48-A'!$B$55)","v":"Tex-448-A"},{"$f":"IF('Tex-415,18,24,48-A'!$A$56=\"\",\"\",'Tex-415,18,24,48-A'!$A$56)","v":"Beam"},{"$f":"IF('Tex-415,18,24,48-A'!$A$58=\"\",\"\",'Tex-415,18,24,48-A'!$A$58)","v":1},{"$f":"IF('Tex-415,18,24,48-A'!$F$56=\"\",\"\",'Tex-415,18,24,48-A'!$F$56)","v":"Span Length "}]
[168,{"$f":"IF('Tex-415,18,24,48-A'!$G$58=\"\",\"\",'Tex-415,18,24,48-A'!$G$58)","v":""},{"$f":"IF('Tex-415,18,24,48-A'!$B$55=\"\",\"\",'Tex-415,18,24,48-A'!$B$55)","v":"Tex-448-A"},{"$f":"IF('Tex-415,18,24,48-A'!$A$56=\"\",\"\",'Tex-415,18,24,48-A'!$A$56)","v":"Beam"},{"$f":"IF('Tex-415,18,24,48-A'!$A$58=\"\",\"\",'Tex-415,18,24,48-A'!$A$58)","v":1},{"$f":"IF('Tex-415,18,24,48-A'!$G$56=\"\",\"\",'Tex-415,18,24,48-A'!$G$56)","v":"Max Recording "}]
[169,{"$f":"IF('Tex-415,18,24,48-A'!$H$58=\"\",\"\",'Tex-415,18,24,48-A'!$H$58)","v":""},{"$f":"IF('Tex-415,18,24,48-A'!$B$55=\"\",\"\",'Tex-415,18,24,48-A'!$B$55)","v":"Tex-448-A"},{"$f":"IF('Tex-415,18,24,48-A'!$A$56=\"\",\"\",'Tex-415,18,24,48-A'!$A$56)","v":"Beam"},{"$f":"IF('Tex-415,18,24,48-A'!$A$58=\"\",\"\",'Tex-415,18,24,48-A'!$A$58)","v":1},{"$f":"IF('Tex-415,18,24,48-A'!$H$56=\"\",\"\",'Tex-415,18,24,48-A'!$H$56)","v":"*Failure Location "}]
[170,{"$f":"IF('Tex-415,18,24,48-A'!$I$58=\"\",\"\",'Tex-415,18,24,48-A'!$I$58)","v":""},{"$f":"IF('Tex-415,18,24,48-A'!$B$55=\"\",\"\",'Tex-415,18,24,48-A'!$B$55)","v":"Tex-448-A"},{"$f":"IF('Tex-415,18,24,48-A'!$A$56=\"\",\"\",'Tex-415,18,24,48-A'!$A$56)","v":"Beam"},{"$f":"IF('Tex-415,18,24,48-A'!$A$58=\"\",\"\",'Tex-415,18,24,48-A'!$A$58)","v":1},{"$f":"IF('Tex-415,18,24,48-A'!$I$56=\"\",\"\",'Tex-415,18,24,48-A'!$I$56)","v":"Modulus of Rupture "}]
[171,{"$f":"IF('Tex-415,18,24,48-A'!$J$58=\"\",\"\",'Tex-415,18,24,48-A'!$J$58)","v":""},{"$f":"IF('Tex-415,18,24,48-A'!$B$55=\"\",\"\",'Tex-415,18,24,48-A'!$B$55)","v":"Tex-448-A"},{"$f":"IF('Tex-415,18,24,48-A'!$A$56=\"\",\"\",'Tex-415,18,24,48-A'!$A$56)","v":"Beam"},{"$f":"IF('Tex-415,18,24,48-A'!$A$58=\"\",\"\",'Tex-415,18,24,48-A'!$A$58)","v":1},{"$f":"IF('Tex-415,18,24,48-A'!$J$56=\"\",\"\",'Tex-415,18,24,48-A'!$J$56)","v":"Modulus of Rupture (avg) "}]
[172,{"$f":"IF('Tex-415,18,24,48-A'!$B$59=\"\",\"\",'Tex-415,18,24,48-A'!$B$59)","v":""},{"$f":"IF('Tex-415,18,24,48-A'!$B$55=\"\",\"\",'Tex-415,18,24,48-A'!$B$55)","v":"Tex-448-A"},{"$f":"IF('Tex-415,18,24,48-A'!$A$56=\"\",\"\",'Tex-415,18,24,48-A'!$A$56)","v":"Beam"},{"$f":"IF('Tex-415,18,24,48-A'!$A$59=\"\",\"\",'Tex-415,18,24,48-A'!$A$59)","v":2},{"$f":"IF('Tex-415,18,24,48-A'!$B$56=\"\",\"\",'Tex-415,18,24,48-A'!$B$56)","v":"Beam Number"}]
[173,{"$f":"IF('Tex-415,18,24,48-A'!$D$59=\"\",\"\",'Tex-415,18,24,48-A'!$D$59)","v":""},{"$f":"IF('Tex-415,18,24,48-A'!$B$55=\"\",\"\",'Tex-415,18,24,48-A'!$B$55)","v":"Tex-448-A"},{"$f":"IF('Tex-415,18,24,48-A'!$A$56=\"\",\"\",'Tex-415,18,24,48-A'!$A$56)","v":"Beam"},{"$f":"IF('Tex-415,18,24,48-A'!$A$59=\"\",\"\",'Tex-415,18,24,48-A'!$A$59)","v":2},{"$f":"IF('Tex-415,18,24,48-A'!$D$56=\"\",\"\",'Tex-415,18,24,48-A'!$D$56)","v":"Width of Beam "}]
[174,{"$f":"IF('Tex-415,18,24,48-A'!$E$59=\"\",\"\",'Tex-415,18,24,48-A'!$E$59)","v":""},{"$f":"IF('Tex-415,18,24,48-A'!$B$55=\"\",\"\",'Tex-415,18,24,48-A'!$B$55)","v":"Tex-448-A"},{"$f":"IF('Tex-415,18,24,48-A'!$A$56=\"\",\"\",'Tex-415,18,24,48-A'!$A$56)","v":"Beam"},{"$f":"IF('Tex-415,18,24,48-A'!$A$59=\"\",\"\",'Tex-415,18,24,48-A'!$A$59)","v":2},{"$f":"IF('Tex-415,18,24,48-A'!$E$56=\"\",\"\",'Tex-415,18,24,48-A'!$E$56)","v":"Depth of Beam "}]
[175,{"$f":"IF('Tex-415,18,24,48-A'!$F$59=\"\",\"\",'Tex-415,18,24,48-A'!$F$59)","v":""},{"$f":"IF('Tex-415,18,24,48-A'!$B$55=\"\",\"\",'Tex-415,18,24,48-A'!$B$55)","v":"Tex-448-A"},{"$f":"IF('Tex-415,18,24,48-A'!$A$56=\"\",\"\",'Tex-415,18,24,48-A'!$A$56)","v":"Beam"},{"$f":"IF('Tex-415,18,24,48-A'!$A$59=\"\",\"\",'Tex-415,18,24,48-A'!$A$59)","v":2},{"$f":"IF('Tex-415,18,24,48-A'!$F$56=\"\",\"\",'Tex-415,18,24,48-A'!$F$56)","v":"Span Length "}]
[176,{"$f":"IF('Tex-415,18,24,48-A'!$G$59=\"\",\"\",'Tex-415,18,24,48-A'!$G$59)","v":""},{"$f":"IF('Tex-415,18,24,48-A'!$B$55=\"\",\"\",'Tex-415,18,24,48-A'!$B$55)","v":"Tex-448-A"},{"$f":"IF('Tex-415,18,24,48-A'!$A$56=\"\",\"\",'Tex-415,18,24,48-A'!$A$56)","v":"Beam"},{"$f":"IF('Tex-415,18,24,48-A'!$A$59=\"\",\"\",'Tex-415,18,24,48-A'!$A$59)","v":2},{"$f":"IF('Tex-415,18,24,48-A'!$G$56=\"\",\"\",'Tex-415,18,24,48-A'!$G$56)","v":"Max Recording "}]
[177,{"$f":"IF('Tex-415,18,24,48-A'!$H$59=\"\",\"\",'Tex-415,18,24,48-A'!$H$59)","v":""},{"$f":"IF('Tex-415,18,24,48-A'!$B$55=\"\",\"\",'Tex-415,18,24,48-A'!$B$55)","v":"Tex-448-A"},{"$f":"IF('Tex-415,18,24,48-A'!$A$56=\"\",\"\",'Tex-415,18,24,48-A'!$A$56)","v":"Beam"},{"$f":"IF('Tex-415,18,24,48-A'!$A$59=\"\",\"\",'Tex-415,18,24,48-A'!$A$59)","v":2},{"$f":"IF('Tex-415,18,24,48-A'!$H$56=\"\",\"\",'Tex-415,18,24,48-A'!$H$56)","v":"*Failure Location "}]
[178,{"$f":"IF('Tex-415,18,24,48-A'!$I$59=\"\",\"\",'Tex-415,18,24,48-A'!$I$59)","v":""},{"$f":"IF('Tex-415,18,24,48-A'!$B$55=\"\",\"\",'Tex-415,18,24,48-A'!$B$55)","v":"Tex-448-A"},{"$f":"IF('Tex-415,18,24,48-A'!$A$56=\"\",\"\",'Tex-415,18,24,48-A'!$A$56)","v":"Beam"},{"$f":"IF('Tex-415,18,24,48-A'!$A$59=\"\",\"\",'Tex-415,18,24,48-A'!$A$59)","v":2},{"$f":"IF('Tex-415,18,24,48-A'!$I$56=\"\",\"\",'Tex-415,18,24,48-A'!$I$56)","v":"Modulus of Rupture "}]
[179,{"$f":"IF('Tex-415,18,24,48-A'!$B$60=\"\",\"\",'Tex-415,18,24,48-A'!$B$60)","v":""},{"$f":"IF('Tex-415,18,24,48-A'!$B$55=\"\",\"\",'Tex-415,18,24,48-A'!$B$55)","v":"Tex-448-A"},{"$f":"IF('Tex-415,18,24,48-A'!$A$56=\"\",\"\",'Tex-415,18,24,48-A'!$A$56)","v":"Beam"},{"$f":"IF('Tex-415,18,24,48-A'!$A$60=\"\",\"\",'Tex-415,18,24,48-A'!$A$60)","v":3},{"$f":"IF('Tex-415,18,24,48-A'!$B$56=\"\",\"\",'Tex-415,18,24,48-A'!$B$56)","v":"Beam Number"}]
[180,{"$f":"IF('Tex-415,18,24,48-A'!$C$60=\"\",\"\",'Tex-415,18,24,48-A'!$C$60)","v":""},{"$f":"IF('Tex-415,18,24,48-A'!$B$55=\"\",\"\",'Tex-415,18,24,48-A'!$B$55)","v":"Tex-448-A"},{"$f":"IF('Tex-415,18,24,48-A'!$A$56=\"\",\"\",'Tex-415,18,24,48-A'!$A$56)","v":"Beam"},{"$f":"IF('Tex-415,18,24,48-A'!$A$60=\"\",\"\",'Tex-415,18,24,48-A'!$A$60)","v":3},{"$f":"IF('Tex-415,18,24,48-A'!$C$56=\"\",\"\",'Tex-415,18,24,48-A'!$C$56)","v":"Age (Days)"}]
[181,{"$f":"IF('Tex-415,18,24,48-A'!$D$60=\"\",\"\",'Tex-415,18,24,48-A'!$D$60)","v":""},{"$f":"IF('Tex-415,18,24,48-A'!$B$55=\"\",\"\",'Tex-415,18,24,48-A'!$B$55)","v":"Tex-448-A"},{"$f":"IF('Tex-415,18,24,48-A'!$A$56=\"\",\"\",'Tex-415,18,24,48-A'!$A$56)","v":"Beam"},{"$f":"IF('Tex-415,18,24,48-A'!$A$60=\"\",\"\",'Tex-415,18,24,48-A'!$A$60)","v":3},{"$f":"IF('Tex-415,18,24,48-A'!$D$56=\"\",\"\",'Tex-415,18,24,48-A'!$D$56)","v":"Width of Beam "}]
[182,{"$f":"IF('Tex-415,18,24,48-A'!$E$60=\"\",\"\",'Tex-415,18,24,48-A'!$E$60)","v":""},{"$f":"IF('Tex-415,18,24,48-A'!$B$55=\"\",\"\",'Tex-415,18,24,48-A'!$B$55)","v":"Tex-448-A"},{"$f":"IF('Tex-415,18,24,48-A'!$A$56=\"\",\"\",'Tex-415,18,24,48-A'!$A$56)","v":"Beam"},{"$f":"IF('Tex-415,18,24,48-A'!$A$60=\"\",\"\",'Tex-415,18,24,48-A'!$A$60)","v":3},{"$f":"IF('Tex-415,18,24,48-A'!$E$56=\"\",\"\",'Tex-415,18,24,48-A'!$E$56)","v":"Depth of Beam "}]
[183,{"$f":"IF('Tex-415,18,24,48-A'!$F$60=\"\",\"\",'Tex-415,18,24,48-A'!$F$60)","v":""},{"$f":"IF('Tex-415,18,24,48-A'!$B$55=\"\",\"\",'Tex-415,18,24,48-A'!$B$55)","v":"Tex-448-A"},{"$f":"IF('Tex-415,18,24,48-A'!$A$56=\"\",\"\",'Tex-415,18,24,48-A'!$A$56)","v":"Beam"},{"$f":"IF('Tex-415,18,24,48-A'!$A$60=\"\",\"\",'Tex-415,18,24,48-A'!$A$60)","v":3},{"$f":"IF('Tex-415,18,24,48-A'!$F$56=\"\",\"\",'Tex-415,18,24,48-A'!$F$56)","v":"Span Length "}]
[184,{"$f":"IF('Tex-415,18,24,48-A'!$G$60=\"\",\"\",'Tex-415,18,24,48-A'!$G$60)","v":""},{"$f":"IF('Tex-415,18,24,48-A'!$B$55=\"\",\"\",'Tex-415,18,24,48-A'!$B$55)","v":"Tex-448-A"},{"$f":"IF('Tex-415,18,24,48-A'!$A$56=\"\",\"\",'Tex-415,18,24,48-A'!$A$56)","v":"Beam"},{"$f":"IF('Tex-415,18,24,48-A'!$A$60=\"\",\"\",'Tex-415,18,24,48-A'!$A$60)","v":3},{"$f":"IF('Tex-415,18,24,48-A'!$G$56=\"\",\"\",'Tex-415,18,24,48-A'!$G$56)","v":"Max Recording "}]
[185,{"$f":"IF('Tex-415,18,24,48-A'!$H$60=\"\",\"\",'Tex-415,18,24,48-A'!$H$60)","v":""},{"$f":"IF('Tex-415,18,24,48-A'!$B$55=\"\",\"\",'Tex-415,18,24,48-A'!$B$55)","v":"Tex-448-A"},{"$f":"IF('Tex-415,18,24,48-A'!$A$56=\"\",\"\",'Tex-415,18,24,48-A'!$A$56)","v":"Beam"},{"$f":"IF('Tex-415,18,24,48-A'!$A$60=\"\",\"\",'Tex-415,18,24,48-A'!$A$60)","v":3},{"$f":"IF('Tex-415,18,24,48-A'!$H$56=\"\",\"\",'Tex-415,18,24,48-A'!$H$56)","v":"*Failure Location "}]
[186,{"$f":"IF('Tex-415,18,24,48-A'!$I$60=\"\",\"\",'Tex-415,18,24,48-A'!$I$60)","v":""},{"$f":"IF('Tex-415,18,24,48-A'!$B$55=\"\",\"\",'Tex-415,18,24,48-A'!$B$55)","v":"Tex-448-A"},{"$f":"IF('Tex-415,18,24,48-A'!$A$56=\"\",\"\",'Tex-415,18,24,48-A'!$A$56)","v":"Beam"},{"$f":"IF('Tex-415,18,24,48-A'!$A$60=\"\",\"\",'Tex-415,18,24,48-A'!$A$60)","v":3},{"$f":"IF('Tex-415,18,24,48-A'!$I$56=\"\",\"\",'Tex-415,18,24,48-A'!$I$56)","v":"Modulus of Rupture "}]
[187,{"$f":"IF('Tex-415,18,24,48-A'!$J$60=\"\",\"\",'Tex-415,18,24,48-A'!$J$60)","v":""},{"$f":"IF('Tex-415,18,24,48-A'!$B$55=\"\",\"\",'Tex-415,18,24,48-A'!$B$55)","v":"Tex-448-A"},{"$f":"IF('Tex-415,18,24,48-A'!$A$56=\"\",\"\",'Tex-415,18,24,48-A'!$A$56)","v":"Beam"},{"$f":"IF('Tex-415,18,24,48-A'!$A$60=\"\",\"\",'Tex-415,18,24,48-A'!$A$60)","v":3},{"$f":"IF('Tex-415,18,24,48-A'!$J$56=\"\",\"\",'Tex-415,18,24,48-A'!$J$56)","v":"Modulus of Rupture (avg) "}]
[188,{"$f":"IF('Tex-415,18,24,48-A'!$B$61=\"\",\"\",'Tex-415,18,24,48-A'!$B$61)","v":""},{"$f":"IF('Tex-415,18,24,48-A'!$B$55=\"\",\"\",'Tex-415,18,24,48-A'!$B$55)","v":"Tex-448-A"},{"$f":"IF('Tex-415,18,24,48-A'!$A$56=\"\",\"\",'Tex-415,18,24,48-A'!$A$56)","v":"Beam"},{"$f":"IF('Tex-415,18,24,48-A'!$A$61=\"\",\"\",'Tex-415,18,24,48-A'!$A$61)","v":4},{"$f":"IF('Tex-415,18,24,48-A'!$B$56=\"\",\"\",'Tex-415,18,24,48-A'!$B$56)","v":"Beam Number"}]
[189,{"$f":"IF('Tex-415,18,24,48-A'!$D$61=\"\",\"\",'Tex-415,18,24,48-A'!$D$61)","v":""},{"$f":"IF('Tex-415,18,24,48-A'!$B$55=\"\",\"\",'Tex-415,18,24,48-A'!$B$55)","v":"Tex-448-A"},{"$f":"IF('Tex-415,18,24,48-A'!$A$56=\"\",\"\",'Tex-415,18,24,48-A'!$A$56)","v":"Beam"},{"$f":"IF('Tex-415,18,24,48-A'!$A$61=\"\",\"\",'Tex-415,18,24,48-A'!$A$61)","v":4},{"$f":"IF('Tex-415,18,24,48-A'!$D$56=\"\",\"\",'Tex-415,18,24,48-A'!$D$56)","v":"Width of Beam "}]
[190,{"$f":"IF('Tex-415,18,24,48-A'!$E$61=\"\",\"\",'Tex-415,18,24,48-A'!$E$61)","v":""},{"$f":"IF('Tex-415,18,24,48-A'!$B$55=\"\",\"\",'Tex-415,18,24,48-A'!$B$55)","v":"Tex-448-A"},{"$f":"IF('Tex-415,18,24,48-A'!$A$56=\"\",\"\",'Tex-415,18,24,48-A'!$A$56)","v":"Beam"},{"$f":"IF('Tex-415,18,24,48-A'!$A$61=\"\",\"\",'Tex-415,18,24,48-A'!$A$61)","v":4},{"$f":"IF('Tex-415,18,24,48-A'!$E$56=\"\",\"\",'Tex-415,18,24,48-A'!$E$56)","v":"Depth of Beam "}]
[191,{"$f":"IF('Tex-415,18,24,48-A'!$F$61=\"\",\"\",'Tex-415,18,24,48-A'!$F$61)","v":""},{"$f":"IF('Tex-415,18,24,48-A'!$B$55=\"\",\"\",'Tex-415,18,24,48-A'!$B$55)","v":"Tex-448-A"},{"$f":"IF('Tex-415,18,24,48-A'!$A$56=\"\",\"\",'Tex-415,18,24,48-A'!$A$56)","v":"Beam"},{"$f":"IF('Tex-415,18,24,48-A'!$A$61=\"\",\"\",'Tex-415,18,24,48-A'!$A$61)","v":4},{"$f":"IF('Tex-415,18,24,48-A'!$F$56=\"\",\"\",'Tex-415,18,24,48-A'!$F$56)","v":"Span Length "}]
[192,{"$f":"IF('Tex-415,18,24,48-A'!$G$61=\"\",\"\",'Tex-415,18,24,48-A'!$G$61)","v":""},{"$f":"IF('Tex-415,18,24,48-A'!$B$55=\"\",\"\",'Tex-415,18,24,48-A'!$B$55)","v":"Tex-448-A"},{"$f":"IF('Tex-415,18,24,48-A'!$A$56=\"\",\"\",'Tex-415,18,24,48-A'!$A$56)","v":"Beam"},{"$f":"IF('Tex-415,18,24,48-A'!$A$61=\"\",\"\",'Tex-415,18,24,48-A'!$A$61)","v":4},{"$f":"IF('Tex-415,18,24,48-A'!$G$56=\"\",\"\",'Tex-415,18,24,48-A'!$G$56)","v":"Max Recording "}]
[193,{"$f":"IF('Tex-415,18,24,48-A'!$H$61=\"\",\"\",'Tex-415,18,24,48-A'!$H$61)","v":""},{"$f":"IF('Tex-415,18,24,48-A'!$B$55=\"\",\"\",'Tex-415,18,24,48-A'!$B$55)","v":"Tex-448-A"},{"$f":"IF('Tex-415,18,24,48-A'!$A$56=\"\",\"\",'Tex-415,18,24,48-A'!$A$56)","v":"Beam"},{"$f":"IF('Tex-415,18,24,48-A'!$A$61=\"\",\"\",'Tex-415,18,24,48-A'!$A$61)","v":4},{"$f":"IF('Tex-415,18,24,48-A'!$H$56=\"\",\"\",'Tex-415,18,24,48-A'!$H$56)","v":"*Failure Location "}]
[194,{"$f":"IF('Tex-415,18,24,48-A'!$I$61=\"\",\"\",'Tex-415,18,24,48-A'!$I$61)","v":""},{"$f":"IF('Tex-415,18,24,48-A'!$B$55=\"\",\"\",'Tex-415,18,24,48-A'!$B$55)","v":"Tex-448-A"},{"$f":"IF('Tex-415,18,24,48-A'!$A$56=\"\",\"\",'Tex-415,18,24,48-A'!$A$56)","v":"Beam"},{"$f":"IF('Tex-415,18,24,48-A'!$A$61=\"\",\"\",'Tex-415,18,24,48-A'!$A$61)","v":4},{"$f":"IF('Tex-415,18,24,48-A'!$I$56=\"\",\"\",'Tex-415,18,24,48-A'!$I$56)","v":"Modulus of Rupture "}]
[195,{"$f":"IF('Tex-415,18,24,48-A'!$B$62=\"\",\"\",'Tex-415,18,24,48-A'!$B$62)","v":""},{"$f":"IF('Tex-415,18,24,48-A'!$B$55=\"\",\"\",'Tex-415,18,24,48-A'!$B$55)","v":"Tex-448-A"},{"$f":"IF('Tex-415,18,24,48-A'!$A$56=\"\",\"\",'Tex-415,18,24,48-A'!$A$56)","v":"Beam"},{"$f":"IF('Tex-415,18,24,48-A'!$A$62=\"\",\"\",'Tex-415,18,24,48-A'!$A$62)","v":5},{"$f":"IF('Tex-415,18,24,48-A'!$B$56=\"\",\"\",'Tex-415,18,24,48-A'!$B$56)","v":"Beam Number"}]
[196,{"$f":"IF('Tex-415,18,24,48-A'!$C$62=\"\",\"\",'Tex-415,18,24,48-A'!$C$62)","v":""},{"$f":"IF('Tex-415,18,24,48-A'!$B$55=\"\",\"\",'Tex-415,18,24,48-A'!$B$55)","v":"Tex-448-A"},{"$f":"IF('Tex-415,18,24,48-A'!$A$56=\"\",\"\",'Tex-415,18,24,48-A'!$A$56)","v":"Beam"},{"$f":"IF('Tex-415,18,24,48-A'!$A$62=\"\",\"\",'Tex-415,18,24,48-A'!$A$62)","v":5},{"$f":"IF('Tex-415,18,24,48-A'!$C$56=\"\",\"\",'Tex-415,18,24,48-A'!$C$56)","v":"Age (Days)"}]
[197,{"$f":"IF('Tex-415,18,24,48-A'!$D$62=\"\",\"\",'Tex-415,18,24,48-A'!$D$62)","v":""},{"$f":"IF('Tex-415,18,24,48-A'!$B$55=\"\",\"\",'Tex-415,18,24,48-A'!$B$55)","v":"Tex-448-A"},{"$f":"IF('Tex-415,18,24,48-A'!$A$56=\"\",\"\",'Tex-415,18,24,48-A'!$A$56)","v":"Beam"},{"$f":"IF('Tex-415,18,24,48-A'!$A$62=\"\",\"\",'Tex-415,18,24,48-A'!$A$62)","v":5},{"$f":"IF('Tex-415,18,24,48-A'!$D$56=\"\",\"\",'Tex-415,18,24,48-A'!$D$56)","v":"Width of Beam "}]
[198,{"$f":"IF('Tex-415,18,24,48-A'!$E$62=\"\",\"\",'Tex-415,18,24,48-A'!$E$62)","v":""},{"$f":"IF('Tex-415,18,24,48-A'!$B$55=\"\",\"\",'Tex-415,18,24,48-A'!$B$55)","v":"Tex-448-A"},{"$f":"IF('Tex-415,18,24,48-A'!$A$56=\"\",\"\",'Tex-415,18,24,48-A'!$A$56)","v":"Beam"},{"$f":"IF('Tex-415,18,24,48-A'!$A$62=\"\",\"\",'Tex-415,18,24,48-A'!$A$62)","v":5},{"$f":"IF('Tex-415,18,24,48-A'!$E$56=\"\",\"\",'Tex-415,18,24,48-A'!$E$56)","v":"Depth of Beam "}]
[199,{"$f":"IF('Tex-415,18,24,48-A'!$F$62=\"\",\"\",'Tex-415,18,24,48-A'!$F$62)","v":""},{"$f":"IF('Tex-415,18,24,48-A'!$B$55=\"\",\"\",'Tex-415,18,24,48-A'!$B$55)","v":"Tex-448-A"},{"$f":"IF('Tex-415,18,24,48-A'!$A$56=\"\",\"\",'Tex-415,18,24,48-A'!$A$56)","v":"Beam"},{"$f":"IF('Tex-415,18,24,48-A'!$A$62=\"\",\"\",'Tex-415,18,24,48-A'!$A$62)","v":5},{"$f":"IF('Tex-415,18,24,48-A'!$F$56=\"\",\"\",'Tex-415,18,24,48-A'!$F$56)","v":"Span Length "}]
[200,{"$f":"IF('Tex-415,18,24,48-A'!$G$62=\"\",\"\",'Tex-415,18,24,48-A'!$G$62)","v":""},{"$f":"IF('Tex-415,18,24,48-A'!$B$55=\"\",\"\",'Tex-415,18,24,48-A'!$B$55)","v":"Tex-448-A"},{"$f":"IF('Tex-415,18,24,48-A'!$A$56=\"\",\"\",'Tex-415,18,24,48-A'!$A$56)","v":"Beam"},{"$f":"IF('Tex-415,18,24,48-A'!$A$62=\"\",\"\",'Tex-415,18,24,48-A'!$A$62)","v":5},{"$f":"IF('Tex-415,18,24,48-A'!$G$56=\"\",\"\",'Tex-415,18,24,48-A'!$G$56)","v":"Max Recording "}]
[201,{"$f":"IF('Tex-415,18,24,48-A'!$H$62=\"\",\"\",'Tex-415,18,24,48-A'!$H$62)","v":""},{"$f":"IF('Tex-415,18,24,48-A'!$B$55=\"\",\"\",'Tex-415,18,24,48-A'!$B$55)","v":"Tex-448-A"},{"$f":"IF('Tex-415,18,24,48-A'!$A$56=\"\",\"\",'Tex-415,18,24,48-A'!$A$56)","v":"Beam"},{"$f":"IF('Tex-415,18,24,48-A'!$A$62=\"\",\"\",'Tex-415,18,24,48-A'!$A$62)","v":5},{"$f":"IF('Tex-415,18,24,48-A'!$H$56=\"\",\"\",'Tex-415,18,24,48-A'!$H$56)","v":"*Failure Location "}]
[202,{"$f":"IF('Tex-415,18,24,48-A'!$I$62=\"\",\"\",'Tex-415,18,24,48-A'!$I$62)","v":""},{"$f":"IF('Tex-415,18,24,48-A'!$B$55=\"\",\"\",'Tex-415,18,24,48-A'!$B$55)","v":"Tex-448-A"},{"$f":"IF('Tex-415,18,24,48-A'!$A$56=\"\",\"\",'Tex-415,18,24,48-A'!$A$56)","v":"Beam"},{"$f":"IF('Tex-415,18,24,48-A'!$A$62=\"\",\"\",'Tex-415,18,24,48-A'!$A$62)","v":5},{"$f":"IF('Tex-415,18,24,48-A'!$I$56=\"\",\"\",'Tex-415,18,24,48-A'!$I$56)","v":"Modulus of Rupture "}]
[203,{"$f":"IF('Tex-415,18,24,48-A'!$J$62=\"\",\"\",'Tex-415,18,24,48-A'!$J$62)","v":""},{"$f":"IF('Tex-415,18,24,48-A'!$B$55=\"\",\"\",'Tex-415,18,24,48-A'!$B$55)","v":"Tex-448-A"},{"$f":"IF('Tex-415,18,24,48-A'!$A$56=\"\",\"\",'Tex-415,18,24,48-A'!$A$56)","v":"Beam"},{"$f":"IF('Tex-415,18,24,48-A'!$A$62=\"\",\"\",'Tex-415,18,24,48-A'!$A$62)","v":5},{"$f":"IF('Tex-415,18,24,48-A'!$J$56=\"\",\"\",'Tex-415,18,24,48-A'!$J$56)","v":"Modulus of Rupture (avg) "}]
[204,{"$f":"IF('Tex-415,18,24,48-A'!$B$63=\"\",\"\",'Tex-415,18,24,48-A'!$B$63)","v":""},{"$f":"IF('Tex-415,18,24,48-A'!$B$55=\"\",\"\",'Tex-415,18,24,48-A'!$B$55)","v":"Tex-448-A"},{"$f":"IF('Tex-415,18,24,48-A'!$A$56=\"\",\"\",'Tex-415,18,24,48-A'!$A$56)","v":"Beam"},{"$f":"IF('Tex-415,18,24,48-A'!$A$63=\"\",\"\",'Tex-415,18,24,48-A'!$A$63)","v":6},{"$f":"IF('Tex-415,18,24,48-A'!$B$56=\"\",\"\",'Tex-415,18,24,48-A'!$B$56)","v":"Beam Number"}]
[205,{"$f":"IF('Tex-415,18,24,48-A'!$D$63=\"\",\"\",'Tex-415,18,24,48-A'!$D$63)","v":""},{"$f":"IF('Tex-415,18,24,48-A'!$B$55=\"\",\"\",'Tex-415,18,24,48-A'!$B$55)","v":"Tex-448-A"},{"$f":"IF('Tex-415,18,24,48-A'!$A$56=\"\",\"\",'Tex-415,18,24,48-A'!$A$56)","v":"Beam"},{"$f":"IF('Tex-415,18,24,48-A'!$A$63=\"\",\"\",'Tex-415,18,24,48-A'!$A$63)","v":6},{"$f":"IF('Tex-415,18,24,48-A'!$D$56=\"\",\"\",'Tex-415,18,24,48-A'!$D$56)","v":"Width of Beam "}]
[206,{"$f":"IF('Tex-415,18,24,48-A'!$E$63=\"\",\"\",'Tex-415,18,24,48-A'!$E$63)","v":""},{"$f":"IF('Tex-415,18,24,48-A'!$B$55=\"\",\"\",'Tex-415,18,24,48-A'!$B$55)","v":"Tex-448-A"},{"$f":"IF('Tex-415,18,24,48-A'!$A$56=\"\",\"\",'Tex-415,18,24,48-A'!$A$56)","v":"Beam"},{"$f":"IF('Tex-415,18,24,48-A'!$A$63=\"\",\"\",'Tex-415,18,24,48-A'!$A$63)","v":6},{"$f":"IF('Tex-415,18,24,48-A'!$E$56=\"\",\"\",'Tex-415,18,24,48-A'!$E$56)","v":"Depth of Beam "}]
[207,{"$f":"IF('Tex-415,18,24,48-A'!$F$63=\"\",\"\",'Tex-415,18,24,48-A'!$F$63)","v":""},{"$f":"IF('Tex-415,18,24,48-A'!$B$55=\"\",\"\",'Tex-415,18,24,48-A'!$B$55)","v":"Tex-448-A"},{"$f":"IF('Tex-415,18,24,48-A'!$A$56=\"\",\"\",'Tex-415,18,24,48-A'!$A$56)","v":"Beam"},{"$f":"IF('Tex-415,18,24,48-A'!$A$63=\"\",\"\",'Tex-415,18,24,48-A'!$A$63)","v":6},{"$f":"IF('Tex-415,18,24,48-A'!$F$56=\"\",\"\",'Tex-415,18,24,48-A'!$F$56)","v":"Span Length "}]
[208,{"$f":"IF('Tex-415,18,24,48-A'!$G$63=\"\",\"\",'Tex-415,18,24,48-A'!$G$63)","v":""},{"$f":"IF('Tex-415,18,24,48-A'!$B$55=\"\",\"\",'Tex-415,18,24,48-A'!$B$55)","v":"Tex-448-A"},{"$f":"IF('Tex-415,18,24,48-A'!$A$56=\"\",\"\",'Tex-415,18,24,48-A'!$A$56)","v":"Beam"},{"$f":"IF('Tex-415,18,24,48-A'!$A$63=\"\",\"\",'Tex-415,18,24,48-A'!$A$63)","v":6},{"$f":"IF('Tex-415,18,24,48-A'!$G$56=\"\",\"\",'Tex-415,18,24,48-A'!$G$56)","v":"Max Recording "}]
[209,{"$f":"IF('Tex-415,18,24,48-A'!$H$63=\"\",\"\",'Tex-415,18,24,48-A'!$H$63)","v":""},{"$f":"IF('Tex-415,18,24,48-A'!$B$55=\"\",\"\",'Tex-415,18,24,48-A'!$B$55)","v":"Tex-448-A"},{"$f":"IF('Tex-415,18,24,48-A'!$A$56=\"\",\"\",'Tex-415,18,24,48-A'!$A$56)","v":"Beam"},{"$f":"IF('Tex-415,18,24,48-A'!$A$63=\"\",\"\",'Tex-415,18,24,48-A'!$A$63)","v":6},{"$f":"IF('Tex-415,18,24,48-A'!$H$56=\"\",\"\",'Tex-415,18,24,48-A'!$H$56)","v":"*Failure Location "}]
[210,{"$f":"IF('Tex-415,18,24,48-A'!$I$63=\"\",\"\",'Tex-415,18,24,48-A'!$I$63)","v":""},{"$f":"IF('Tex-415,18,24,48-A'!$B$55=\"\",\"\",'Tex-415,18,24,48-A'!$B$55)","v":"Tex-448-A"},{"$f":"IF('Tex-415,18,24,48-A'!$A$56=\"\",\"\",'Tex-415,18,24,48-A'!$A$56)","v":"Beam"},{"$f":"IF('Tex-415,18,24,48-A'!$A$63=\"\",\"\",'Tex-415,18,24,48-A'!$A$63)","v":6},{"$f":"IF('Tex-415,18,24,48-A'!$I$56=\"\",\"\",'Tex-415,18,24,48-A'!$I$56)","v":"Modulus of Rupture "}]
[211,{"$f":"IF('Tex-415,18,24,48-A'!$B$64=\"\",\"\",'Tex-415,18,24,48-A'!$B$64)","v":""},{"$f":"IF('Tex-415,18,24,48-A'!$B$55=\"\",\"\",'Tex-415,18,24,48-A'!$B$55)","v":"Tex-448-A"},{"$f":"IF('Tex-415,18,24,48-A'!$A$56=\"\",\"\",'Tex-415,18,24,48-A'!$A$56)","v":"Beam"},{"$f":"IF('Tex-415,18,24,48-A'!$A$64=\"\",\"\",'Tex-415,18,24,48-A'!$A$64)","v":7},{"$f":"IF('Tex-415,18,24,48-A'!$B$56=\"\",\"\",'Tex-415,18,24,48-A'!$B$56)","v":"Beam Number"}]
[212,{"$f":"IF('Tex-415,18,24,48-A'!$C$64=\"\",\"\",'Tex-415,18,24,48-A'!$C$64)","v":""},{"$f":"IF('Tex-415,18,24,48-A'!$B$55=\"\",\"\",'Tex-415,18,24,48-A'!$B$55)","v":"Tex-448-A"},{"$f":"IF('Tex-415,18,24,48-A'!$A$56=\"\",\"\",'Tex-415,18,24,48-A'!$A$56)","v":"Beam"},{"$f":"IF('Tex-415,18,24,48-A'!$A$64=\"\",\"\",'Tex-415,18,24,48-A'!$A$64)","v":7},{"$f":"IF('Tex-415,18,24,48-A'!$C$56=\"\",\"\",'Tex-415,18,24,48-A'!$C$56)","v":"Age (Days)"}]
[213,{"$f":"IF('Tex-415,18,24,48-A'!$D$64=\"\",\"\",'Tex-415,18,24,48-A'!$D$64)","v":""},{"$f":"IF('Tex-415,18,24,48-A'!$B$55=\"\",\"\",'Tex-415,18,24,48-A'!$B$55)","v":"Tex-448-A"},{"$f":"IF('Tex-415,18,24,48-A'!$A$56=\"\",\"\",'Tex-415,18,24,48-A'!$A$56)","v":"Beam"},{"$f":"IF('Tex-415,18,24,48-A'!$A$64=\"\",\"\",'Tex-415,18,24,48-A'!$A$64)","v":7},{"$f":"IF('Tex-415,18,24,48-A'!$D$56=\"\",\"\",'Tex-415,18,24,48-A'!$D$56)","v":"Width of Beam "}]
[214,{"$f":"IF('Tex-415,18,24,48-A'!$E$64=\"\",\"\",'Tex-415,18,24,48-A'!$E$64)","v":""},{"$f":"IF('Tex-415,18,24,48-A'!$B$55=\"\",\"\",'Tex-415,18,24,48-A'!$B$55)","v":"Tex-448-A"},{"$f":"IF('Tex-415,18,24,48-A'!$A$56=\"\",\"\",'Tex-415,18,24,48-A'!$A$56)","v":"Beam"},{"$f":"IF('Tex-415,18,24,48-A'!$A$64=\"\",\"\",'Tex-415,18,24,48-A'!$A$64)","v":7},{"$f":"IF('Tex-415,18,24,48-A'!$E$56=\"\",\"\",'Tex-415,18,24,48-A'!$E$56)","v":"Depth of Beam "}]
[215,{"$f":"IF('Tex-415,18,24,48-A'!$F$64=\"\",\"\",'Tex-415,18,24,48-A'!$F$64)","v":""},{"$f":"IF('Tex-415,18,24,48-A'!$B$55=\"\",\"\",'Tex-415,18,24,48-A'!$B$55)","v":"Tex-448-A"},{"$f":"IF('Tex-415,18,24,48-A'!$A$56=\"\",\"\",'Tex-415,18,24,48-A'!$A$56)","v":"Beam"},{"$f":"IF('Tex-415,18,24,48-A'!$A$64=\"\",\"\",'Tex-415,18,24,48-A'!$A$64)","v":7},{"$f":"IF('Tex-415,18,24,48-A'!$F$56=\"\",\"\",'Tex-415,18,24,48-A'!$F$56)","v":"Span Length "}]
[216,{"$f":"IF('Tex-415,18,24,48-A'!$G$64=\"\",\"\",'Tex-415,18,24,48-A'!$G$64)","v":""},{"$f":"IF('Tex-415,18,24,48-A'!$B$55=\"\",\"\",'Tex-415,18,24,48-A'!$B$55)","v":"Tex-448-A"},{"$f":"IF('Tex-415,18,24,48-A'!$A$56=\"\",\"\",'Tex-415,18,24,48-A'!$A$56)","v":"Beam"},{"$f":"IF('Tex-415,18,24,48-A'!$A$64=\"\",\"\",'Tex-415,18,24,48-A'!$A$64)","v":7},{"$f":"IF('Tex-415,18,24,48-A'!$G$56=\"\",\"\",'Tex-415,18,24,48-A'!$G$56)","v":"Max Recording "}]
[217,{"$f":"IF('Tex-415,18,24,48-A'!$H$64=\"\",\"\",'Tex-415,18,24,48-A'!$H$64)","v":""},{"$f":"IF('Tex-415,18,24,48-A'!$B$55=\"\",\"\",'Tex-415,18,24,48-A'!$B$55)","v":"Tex-448-A"},{"$f":"IF('Tex-415,18,24,48-A'!$A$56=\"\",\"\",'Tex-415,18,24,48-A'!$A$56)","v":"Beam"},{"$f":"IF('Tex-415,18,24,48-A'!$A$64=\"\",\"\",'Tex-415,18,24,48-A'!$A$64)","v":7},{"$f":"IF('Tex-415,18,24,48-A'!$H$56=\"\",\"\",'Tex-415,18,24,48-A'!$H$56)","v":"*Failure Location "}]
[218,{"$f":"IF('Tex-415,18,24,48-A'!$I$64=\"\",\"\",'Tex-415,18,24,48-A'!$I$64)","v":""},{"$f":"IF('Tex-415,18,24,48-A'!$B$55=\"\",\"\",'Tex-415,18,24,48-A'!$B$55)","v":"Tex-448-A"},{"$f":"IF('Tex-415,18,24,48-A'!$A$56=\"\",\"\",'Tex-415,18,24,48-A'!$A$56)","v":"Beam"},{"$f":"IF('Tex-415,18,24,48-A'!$A$64=\"\",\"\",'Tex-415,18,24,48-A'!$A$64)","v":7},{"$f":"IF('Tex-415,18,24,48-A'!$I$56=\"\",\"\",'Tex-415,18,24,48-A'!$I$56)","v":"Modulus of Rupture "}]
[219,{"$f":"IF('Tex-415,18,24,48-A'!$J$64=\"\",\"\",'Tex-415,18,24,48-A'!$J$64)","v":""},{"$f":"IF('Tex-415,18,24,48-A'!$B$55=\"\",\"\",'Tex-415,18,24,48-A'!$B$55)","v":"Tex-448-A"},{"$f":"IF('Tex-415,18,24,48-A'!$A$56=\"\",\"\",'Tex-415,18,24,48-A'!$A$56)","v":"Beam"},{"$f":"IF('Tex-415,18,24,48-A'!$A$64=\"\",\"\",'Tex-415,18,24,48-A'!$A$64)","v":7},{"$f":"IF('Tex-415,18,24,48-A'!$J$56=\"\",\"\",'Tex-415,18,24,48-A'!$J$56)","v":"Modulus of Rupture (avg) "}]
[220,{"$f":"IF('Tex-415,18,24,48-A'!$B$65=\"\",\"\",'Tex-415,18,24,48-A'!$B$65)","v":""},{"$f":"IF('Tex-415,18,24,48-A'!$B$55=\"\",\"\",'Tex-415,18,24,48-A'!$B$55)","v":"Tex-448-A"},{"$f":"IF('Tex-415,18,24,48-A'!$A$56=\"\",\"\",'Tex-415,18,24,48-A'!$A$56)","v":"Beam"},{"$f":"IF('Tex-415,18,24,48-A'!$A$65=\"\",\"\",'Tex-415,18,24,48-A'!$A$65)","v":8},{"$f":"IF('Tex-415,18,24,48-A'!$B$56=\"\",\"\",'Tex-415,18,24,48-A'!$B$56)","v":"Beam Number"}]
[221,{"$f":"IF('Tex-415,18,24,48-A'!$D$65=\"\",\"\",'Tex-415,18,24,48-A'!$D$65)","v":""},{"$f":"IF('Tex-415,18,24,48-A'!$B$55=\"\",\"\",'Tex-415,18,24,48-A'!$B$55)","v":"Tex-448-A"},{"$f":"IF('Tex-415,18,24,48-A'!$A$56=\"\",\"\",'Tex-415,18,24,48-A'!$A$56)","v":"Beam"},{"$f":"IF('Tex-415,18,24,48-A'!$A$65=\"\",\"\",'Tex-415,18,24,48-A'!$A$65)","v":8},{"$f":"IF('Tex-415,18,24,48-A'!$D$56=\"\",\"\",'Tex-415,18,24,48-A'!$D$56)","v":"Width of Beam "}]
[222,{"$f":"IF('Tex-415,18,24,48-A'!$E$65=\"\",\"\",'Tex-415,18,24,48-A'!$E$65)","v":""},{"$f":"IF('Tex-415,18,24,48-A'!$B$55=\"\",\"\",'Tex-415,18,24,48-A'!$B$55)","v":"Tex-448-A"},{"$f":"IF('Tex-415,18,24,48-A'!$A$56=\"\",\"\",'Tex-415,18,24,48-A'!$A$56)","v":"Beam"},{"$f":"IF('Tex-415,18,24,48-A'!$A$65=\"\",\"\",'Tex-415,18,24,48-A'!$A$65)","v":8},{"$f":"IF('Tex-415,18,24,48-A'!$E$56=\"\",\"\",'Tex-415,18,24,48-A'!$E$56)","v":"Depth of Beam "}]
[223,{"$f":"IF('Tex-415,18,24,48-A'!$F$65=\"\",\"\",'Tex-415,18,24,48-A'!$F$65)","v":""},{"$f":"IF('Tex-415,18,24,48-A'!$B$55=\"\",\"\",'Tex-415,18,24,48-A'!$B$55)","v":"Tex-448-A"},{"$f":"IF('Tex-415,18,24,48-A'!$A$56=\"\",\"\",'Tex-415,18,24,48-A'!$A$56)","v":"Beam"},{"$f":"IF('Tex-415,18,24,48-A'!$A$65=\"\",\"\",'Tex-415,18,24,48-A'!$A$65)","v":8},{"$f":"IF('Tex-415,18,24,48-A'!$F$56=\"\",\"\",'Tex-415,18,24,48-A'!$F$56)","v":"Span Length "}]
[224,{"$f":"IF('Tex-415,18,24,48-A'!$G$65=\"\",\"\",'Tex-415,18,24,48-A'!$G$65)","v":""},{"$f":"IF('Tex-415,18,24,48-A'!$B$55=\"\",\"\",'Tex-415,18,24,48-A'!$B$55)","v":"Tex-448-A"},{"$f":"IF('Tex-415,18,24,48-A'!$A$56=\"\",\"\",'Tex-415,18,24,48-A'!$A$56)","v":"Beam"},{"$f":"IF('Tex-415,18,24,48-A'!$A$65=\"\",\"\",'Tex-415,18,24,48-A'!$A$65)","v":8},{"$f":"IF('Tex-415,18,24,48-A'!$G$56=\"\",\"\",'Tex-415,18,24,48-A'!$G$56)","v":"Max Recording "}]
[225,{"$f":"IF('Tex-415,18,24,48-A'!$H$65=\"\",\"\",'Tex-415,18,24,48-A'!$H$65)","v":""},{"$f":"IF('Tex-415,18,24,48-A'!$B$55=\"\",\"\",'Tex-415,18,24,48-A'!$B$55)","v":"Tex-448-A"},{"$f":"IF('Tex-415,18,24,48-A'!$A$56=\"\",\"\",'Tex-415,18,24,48-A'!$A$56)","v":"Beam"},{"$f":"IF('Tex-415,18,24,48-A'!$A$65=\"\",\"\",'Tex-415,18,24,48-A'!$A$65)","v":8},{"$f":"IF('Tex-415,18,24,48-A'!$H$56=\"\",\"\",'Tex-415,18,24,48-A'!$H$56)","v":"*Failure Location "}]
[226,{"$f":"IF('Tex-415,18,24,48-A'!$I$65=\"\",\"\",'Tex-415,18,24,48-A'!$I$65)","v":""},{"$f":"IF('Tex-415,18,24,48-A'!$B$55=\"\",\"\",'Tex-415,18,24,48-A'!$B$55)","v":"Tex-448-A"},{"$f":"IF('Tex-415,18,24,48-A'!$A$56=\"\",\"\",'Tex-415,18,24,48-A'!$A$56)","v":"Beam"},{"$f":"IF('Tex-415,18,24,48-A'!$A$65=\"\",\"\",'Tex-415,18,24,48-A'!$A$65)","v":8},{"$f":"IF('Tex-415,18,24,48-A'!$I$56=\"\",\"\",'Tex-415,18,24,48-A'!$I$56)","v":"Modulus of Rupture "}]
[227,{"$f":"IF('Tex-415,18,24,48-A'!$C$84=\"\",\"\",'Tex-415,18,24,48-A'!$C$84)","v":" "},"Tested By ",{"$f":"IF('Tex-415,18,24,48-A'!$B$84=\"\",\"\",'Tex-415,18,24,48-A'!$B$84)","v":"TX424,III"}]
[228,{"$f":"IF('Tex-415,18,24,48-A'!$F$84=\"\",\"\",'Tex-415,18,24,48-A'!$F$84)","v":" "},"Tested Date ",{"$f":"IF('Tex-415,18,24,48-A'!$B$84=\"\",\"\",'Tex-415,18,24,48-A'!$B$84)","v":"TX424,III"}]
[229,{"$f":"IF('Tex-415,18,24,48-A'!$C$74=\"\",\"\",'Tex-415,18,24,48-A'!$C$74)","v":" "},"Sampled By ",{"$f":"IF('Tex-415,18,24,48-A'!$B$74=\"\",\"\",'Tex-415,18,24,48-A'!$B$74)","v":"TX407"}]
[230,{"$f":"IF('Tex-415,18,24,48-A'!$F$74=\"\",\"\",'Tex-415,18,24,48-A'!$F$74)","v":" "},"Sampled Date ",{"$f":"IF('Tex-415,18,24,48-A'!$B$74=\"\",\"\",'Tex-415,18,24,48-A'!$B$74)","v":"TX407"}]

{"sheet":"Spec. Strengths","index":2,"n_rows":38,"n_cols":7,"rows_kept":38,"cut":false,"hidden":true,"merged":[[1,1,1,3],[1,0,2,0],[1,4,1,6],[20,0,21,0],[20,1,20,3],[20,4,20,6]]}
[]
["Concrete Class","Min. 28-Day Compressive Strength",null,null,"Min. 7-Day Compressive Strength"]
[null,1993,1995,2004,1993,1995,2004]
[null,"(psi)","(MPa)","(psi)","(psi)","(kPa)","(psi)"]
["A",3000,21,3000,"Not Applicable","Not Applicable","Not Applicable"]
["B",2000,14,2000,"Not Applicable","Not Applicable","Not Applicable"]
["C",3600,25,3600,"Not Applicable","Not Applicable","Not Applicable"]
["CO",4600,32,4600,"Not Applicable","Not Applicable","Not Applicable"]
["D",1500,10,1500,"Not Applicable","Not Applicable","Not Applicable"]
["DC",5500,38,5500,"Not Applicable","Not Applicable","Not Applicable"]
["E",3000,21,3000,"Not Applicable","Not Applicable","Not Applicable"]
["F","Input at right","Input at right","Input at right","Not Applicable","Not Applicable","Not Applicable"]
["H","Input at right","Input at right","Input at right","Not Applicable","Not Applicable","Not Applicable"]
["HES","NA","NA","Input at right","Not Applicable","Not Applicable","Not Applicable"]
["K","Input at right","Input at right","Input at right","Not Applicable","Not Applicable","Not Applicable"]
["LMC","NA","NA",4000,"Not Applicable","Not Applicable","Not Applicable"]
["P","NA","NA",4400,"Not Applicable","Not Applicable",3500]
["S",4000,28,4000,"Not Applicable","Not Applicable","Not Applicable"]
["SS",3600,25,"Input at right","Not Applicable","Not Applicable","Not Applicable"]
[]
["Concrete Class","Min. 28-Day Flexural Strength",null,null,"Min. 7-Day Flexural Strength"]
[null,1993,1995,2004,1993,1995,2004]
[null,"(psi)","(MPa)","(psi)","(psi)","(kPa)","(psi)"]
["A","Not Applicable","Not Applicable","Not Applicable",425,2930,"Not Applicable"]
["B","Not Applicable","Not Applicable","Not Applicable",280,1930,"Not Applicable"]
["C","Not Applicable","Not Applicable","Not Applicable",510,3520,"Not Applicable"]
["CO","Not Applicable","Not Applicable","Not Applicable",640,4410,"Not Applicable"]
["D","Not Applicable","Not Applicable","Not Applicable",215,1480,"Not Applicable"]
["DC","Not Applicable","Not Applicable","Not Applicable",720,4960,"Not Applicable"]
["E","Not Applicable","Not Applicable","Not Applicable",425,2930,"Not Applicable"]
["F","Not Applicable","Not Applicable","Not Applicable","(0.82*28-day)/6","Input at right","Not Applicable"]
["H","Not Applicable","Not Applicable","Not Applicable","Not Applicable","Not Applicable","Not Applicable"]
["HES","Not Applicable","Not Applicable","Not Applicable","Not Applicable","Not Applicable","Not Applicable"]
["K","Not Applicable","Not Applicable","Not Applicable","Input at right","Input at right","Not Applicable"]
["LMC","Not Applicable","Not Applicable","Not Applicable","Not Applicable","NA","Not Applicable"]
["P","Not Applicable","Not Applicable",680,555,3830,570]
["S","Not Applicable","Not Applicable","Not Applicable",570,3930,"Not Applicable"]
["SS","Not Applicable","Not Applicable","Not Applicable",510,3520,"Not Applicable"]

{"sheet":"Revisions","index":3,"n_rows":13,"n_cols":4,"rows_kept":13,"cut":false,"hidden":true,"merged":[]}
["Date","Changes","By","Comment"]
["2005-05-02","Added \"Spec. Strengths\" tab.","Jennifer Moore "]
["2005-05-02","Added row 27 information on \"Tex-415,18,24, & 48-A\" tab.","Jennifer Moore "]
["2005-05-02","Added conditional formatting to slump section of \"Tex-415,18,24 & 48-A\" tab.","Jennifer Moore "]
["2005-05-02","Added to validations list for Field4. ","Jennifer Moore "]
["2005-05-03","Fixed macro for hiding different sections on \"Tex-415,18,24 & 48-A\" tab.","Joe Liu"]
["2005-05-25","Sheet L to D Lookup cell D2,D3,D4 Unprotect, Add fields 151,152,153","Joe Liu"]
["2005-07-18","Added comment to E27.","Jennifer Moore "]
["2005-07-18","Added conditional formatting to cells K32:K39","Jennifer Moore "]
["2005-07-26","Correction formulas for cells L32:39","Jennifer Moore "]
["2005-08-01","Corrected formulas for cells I57:I64","Stephen Guerra"]
["2005-09-26","Add Mix Design - Field 156","Joe Liu"]
["2011-06-27","Added FF to the grade picklist.","Stewart"]

{"sheet":"L to D Lookup","index":4,"n_rows":112,"n_cols":6,"rows_kept":112,"cut":false,"hidden":true,"merged":[[0,2,0,3]]}
["Length to Diameter Ratio","Correction Factor","Display These Test Methods",null,"English MOR","Metric MOR"]
[1,0.87,"flexural",null,{"$f":"IF(ISERROR(IF('Tex-415,18,24,48-A'!$H58>('Tex-415,18,24,48-A'!$F58*0.05),\"RETEST\",IF('Tex-415,18,24,48-A'!H58=0,((('Tex-415,18,24,48-A'!$G58*6^3/'Tex-415,18,24,48-A'!F58)*'Tex-415,18,24,48-A'!$F58)/('Tex-415,18,24,48-A'!$D58*'Tex-415,18,24,48-A'!$E58^2)),3*((('Tex-415,18,24,48-A'!$G58*6^3/'Tex-415,18,24,48-A'!F58)*('Tex-415,18,24,48-A'!F58/3-'Tex-415,18,24,48-A'!$H58))/('Tex-415,18,24,48-A'!$D58*'Tex-415,18,24,48-A'!$E58^2))))),\"\",IF('Tex-415,18,24,48-A'!$H58>('Tex-415,18,24,48-A'!$F58*0.05),\"RETEST\",IF('Tex-415,18,24,48-A'!H58=0,((('Tex-415,18,24,48-A'!$G58*6^3/'Tex-415,18,24,48-A'!F58)*'Tex-415,18,24,48-A'!$F58)/('Tex-415,18,24,48-A'!$D58*'Tex-415,18,24,48-A'!$E58^2)),3*((('Tex-415,18,24,48-A'!$G58*6^3/'Tex-415,18,24,48-A'!F58)*('Tex-415,18,24,48-A'!F58/3-'Tex-415,18,24,48-A'!$H58))/('Tex-415,18,24,48-A'!$D58*'Tex-415,18,24,48-A'!$E58^2)))))","v":""},{"$f":"IF(ISERROR(IF('Tex-415,18,24,48-A'!$H58>('Tex-415,18,24,48-A'!$F58*0.05),\"RETEST\",IF('Tex-415,18,24,48-A'!H58=0,(((('Tex-415,18,24,48-A'!$G58*1000)*('Tex-415,18,24,48-A'!$F58))/(('Tex-415,18,24,48-A'!$D58)*(('Tex-415,18,24,48-A'!$E58))^2))),(3*((('Tex-415,18,24,48-A'!$G58*1000)*('Tex-415,18,24,48-A'!F58/3-'Tex-415,18,24,48-A'!$H58))/('Tex-415,18,24,48-A'!$D58*'Tex-415,18,24,48-A'!$E58^2)))))),\"\",IF('Tex-415,18,24,48-A'!$H58>('Tex-415,18,24,48-A'!$F58*0.05),\"RETEST\",IF('Tex-415,18,24,48-A'!H58=0,(((('Tex-415,18,24,48-A'!$G58*1000)*('Tex-415,18,24,48-A'!$F58))/(('Tex-415,18,24,48-A'!$D58)*(('Tex-415,18,24,48-A'!$E58))^2))),(3*((('Tex-415,18,24,48-A'!$G58*1000)*('Tex-415,18,24,48-A'!F58/3-'Tex-415,18,24,48-A'!$H58))/('Tex-415,18,24,48-A'!$D58*'Tex-415,18,24,48-A'!$E58^2))))))","v":""}]
[1.01,0.872,"compressive",null,{"$f":"IF(ISERROR(IF('Tex-415,18,24,48-A'!$H59>('Tex-415,18,24,48-A'!$F59*0.05),\"RETEST\",IF('Tex-415,18,24,48-A'!H59=0,((('Tex-415,18,24,48-A'!$G59*6^3/'Tex-415,18,24,48-A'!F59)*'Tex-415,18,24,48-A'!$F59)/('Tex-415,18,24,48-A'!$D59*'Tex-415,18,24,48-A'!$E59^2)),3*((('Tex-415,18,24,48-A'!$G59*6^3/'Tex-415,18,24,48-A'!F59)*('Tex-415,18,24,48-A'!F59/3-'Tex-415,18,24,48-A'!$H59))/('Tex-415,18,24,48-A'!$D59*'Tex-415,18,24,48-A'!$E59^2))))),\"\",IF('Tex-415,18,24,48-A'!$H59>('Tex-415,18,24,48-A'!$F59*0.05),\"RETEST\",IF('Tex-415,18,24,48-A'!H59=0,((('Tex-415,18,24,48-A'!$G59*6^3/'Tex-415,18,24,48-A'!F59)*'Tex-415,18,24,48-A'!$F59)/('Tex-415,18,24,48-A'!$D59*'Tex-415,18,24,48-A'!$E59^2)),3*((('Tex-415,18,24,48-A'!$G59*6^3/'Tex-415,18,24,48-A'!F59)*('Tex-415,18,24,48-A'!F59/3-'Tex-415,18,24,48-A'!$H59))/('Tex-415,18,24,48-A'!$D59*'Tex-415,18,24,48-A'!$E59^2)))))","v":""},{"$f":"IF(ISERROR(IF('Tex-415,18,24,48-A'!$H59>('Tex-415,18,24,48-A'!$F59*0.05),\"RETEST\",IF('Tex-415,18,24,48-A'!H59=0,(((('Tex-415,18,24,48-A'!$G59*1000)*('Tex-415,18,24,48-A'!$F59))/(('Tex-415,18,24,48-A'!$D59)*(('Tex-415,18,24,48-A'!$E59))^2))),(3*((('Tex-415,18,24,48-A'!$G59*1000)*('Tex-415,18,24,48-A'!F59/3-'Tex-415,18,24,48-A'!$H59))/('Tex-415,18,24,48-A'!$D59*'Tex-415,18,24,48-A'!$E59^2)))))),\"\",IF('Tex-415,18,24,48-A'!$H59>('Tex-415,18,24,48-A'!$F59*0.05),\"RETEST\",IF('Tex-415,18,24,48-A'!H59=0,(((('Tex-415,18,24,48-A'!$G59*1000)*('Tex-415,18,24,48-A'!$F59))/(('Tex-415,18,24,48-A'!$D59)*(('Tex-415,18,24,48-A'!$E59))^2))),(3*((('Tex-415,18,24,48-A'!$G59*1000)*('Tex-415,18,24,48-A'!F59/3-'Tex-415,18,24,48-A'!$H59))/('Tex-415,18,24,48-A'!$D59*'Tex-415,18,24,48-A'!$E59^2))))))","v":""}]
[1.02,0.875,"drilled cores",null,{"$f":"IF(ISERROR(IF('Tex-415,18,24,48-A'!$H60>('Tex-415,18,24,48-A'!$F60*0.05),\"RETEST\",IF('Tex-415,18,24,48-A'!H60=0,((('Tex-415,18,24,48-A'!$G60*6^3/'Tex-415,18,24,48-A'!F60)*'Tex-415,18,24,48-A'!$F60)/('Tex-415,18,24,48-A'!$D60*'Tex-415,18,24,48-A'!$E60^2)),3*((('Tex-415,18,24,48-A'!$G60*6^3/'Tex-415,18,24,48-A'!F60)*('Tex-415,18,24,48-A'!F60/3-'Tex-415,18,24,48-A'!$H60))/('Tex-415,18,24,48-A'!$D60*'Tex-415,18,24,48-A'!$E60^2))))),\"\",IF('Tex-415,18,24,48-A'!$H60>('Tex-415,18,24,48-A'!$F60*0.05),\"RETEST\",IF('Tex-415,18,24,48-A'!H60=0,((('Tex-415,18,24,48-A'!$G60*6^3/'Tex-415,18,24,48-A'!F60)*'Tex-415,18,24,48-A'!$F60)/('Tex-415,18,24,48-A'!$D60*'Tex-415,18,24,48-A'!$E60^2)),3*((('Tex-415,18,24,48-A'!$G60*6^3/'Tex-415,18,24,48-A'!F60)*('Tex-415,18,24,48-A'!F60/3-'Tex-415,18,24,48-A'!$H60))/('Tex-415,18,24,48-A'!$D60*'Tex-415,18,24,48-A'!$E60^2)))))","v":""},{"$f":"IF(ISERROR(IF('Tex-415,18,24,48-A'!$H60>('Tex-415,18,24,48-A'!$F60*0.05),\"RETEST\",IF('Tex-415,18,24,48-A'!H60=0,(((('Tex-415,18,24,48-A'!$G60*1000)*('Tex-415,18,24,48-A'!$F60))/(('Tex-415,18,24,48-A'!$D60)*(('Tex-415,18,24,48-A'!$E60))^2))),(3*((('Tex-415,18,24,48-A'!$G60*1000)*('Tex-415,18,24,48-A'!F60/3-'Tex-415,18,24,48-A'!$H60))/('Tex-415,18,24,48-A'!$D60*'Tex-415,18,24,48-A'!$E60^2)))))),\"\",IF('Tex-415,18,24,48-A'!$H60>('Tex-415,18,24,48-A'!$F60*0.05),\"RETEST\",IF('Tex-415,18,24,48-A'!H60=0,(((('Tex-415,18,24,48-A'!$G60*1000)*('Tex-415,18,24,48-A'!$F60))/(('Tex-415,18,24,48-A'!$D60)*(('Tex-415,18,24,48-A'!$E60))^2))),(3*((('Tex-415,18,24,48-A'!$G60*1000)*('Tex-415,18,24,48-A'!F60/3-'Tex-415,18,24,48-A'!$H60))/('Tex-415,18,24,48-A'!$D60*'Tex-415,18,24,48-A'!$E60^2))))))","v":""}]
[1.03,0.877,null,null,{"$f":"IF(ISERROR(IF('Tex-415,18,24,48-A'!$H61>('Tex-415,18,24,48-A'!$F61*0.05),\"RETEST\",IF('Tex-415,18,24,48-A'!H61=0,((('Tex-415,18,24,48-A'!$G61*6^3/'Tex-415,18,24,48-A'!F61)*'Tex-415,18,24,48-A'!$F61)/('Tex-415,18,24,48-A'!$D61*'Tex-415,18,24,48-A'!$E61^2)),3*((('Tex-415,18,24,48-A'!$G61*6^3/'Tex-415,18,24,48-A'!F61)*('Tex-415,18,24,48-A'!F61/3-'Tex-415,18,24,48-A'!$H61))/('Tex-415,18,24,48-A'!$D61*'Tex-415,18,24,48-A'!$E61^2))))),\"\",IF('Tex-415,18,24,48-A'!$H61>('Tex-415,18,24,48-A'!$F61*0.05),\"RETEST\",IF('Tex-415,18,24,48-A'!H61=0,((('Tex-415,18,24,48-A'!$G61*6^3/'Tex-415,18,24,48-A'!F61)*'Tex-415,18,24,48-A'!$F61)/('Tex-415,18,24,48-A'!$D61*'Tex-415,18,24,48-A'!$E61^2)),3*((('Tex-415,18,24,48-A'!$G61*6^3/'Tex-415,18,24,48-A'!F61)*('Tex-415,18,24,48-A'!F61/3-'Tex-415,18,24,48-A'!$H61))/('Tex-415,18,24,48-A'!$D61*'Tex-415,18,24,48-A'!$E61^2)))))","v":""},{"$f":"IF(ISERROR(IF('Tex-415,18,24,48-A'!$H61>('Tex-415,18,24,48-A'!$F61*0.05),\"RETEST\",IF('Tex-415,18,24,48-A'!H61=0,(((('Tex-415,18,24,48-A'!$G61*1000)*('Tex-415,18,24,48-A'!$F61))/(('Tex-415,18,24,48-A'!$D61)*(('Tex-415,18,24,48-A'!$E61))^2))),(3*((('Tex-415,18,24,48-A'!$G61*1000)*('Tex-415,18,24,48-A'!F61/3-'Tex-415,18,24,48-A'!$H61))/('Tex-415,18,24,48-A'!$D61*'Tex-415,18,24,48-A'!$E61^2)))))),\"\",IF('Tex-415,18,24,48-A'!$H61>('Tex-415,18,24,48-A'!$F61*0.05),\"RETEST\",IF('Tex-415,18,24,48-A'!H61=0,(((('Tex-415,18,24,48-A'!$G61*1000)*('Tex-415,18,24,48-A'!$F61))/(('Tex-415,18,24,48-A'!$D61)*(('Tex-415,18,24,48-A'!$E61))^2))),(3*((('Tex-415,18,24,48-A'!$G61*1000)*('Tex-415,18,24,48-A'!F61/3-'Tex-415,18,24,48-A'!$H61))/('Tex-415,18,24,48-A'!$D61*'Tex-415,18,24,48-A'!$E61^2))))))","v":""}]
[1.04,0.88,null,null,{"$f":"IF(ISERROR(IF('Tex-415,18,24,48-A'!$H62>('Tex-415,18,24,48-A'!$F62*0.05),\"RETEST\",IF('Tex-415,18,24,48-A'!H62=0,((('Tex-415,18,24,48-A'!$G62*6^3/'Tex-415,18,24,48-A'!F62)*'Tex-415,18,24,48-A'!$F62)/('Tex-415,18,24,48-A'!$D62*'Tex-415,18,24,48-A'!$E62^2)),3*((('Tex-415,18,24,48-A'!$G62*6^3/'Tex-415,18,24,48-A'!F62)*('Tex-415,18,24,48-A'!F62/3-'Tex-415,18,24,48-A'!$H62))/('Tex-415,18,24,48-A'!$D62*'Tex-415,18,24,48-A'!$E62^2))))),\"\",IF('Tex-415,18,24,48-A'!$H62>('Tex-415,18,24,48-A'!$F62*0.05),\"RETEST\",IF('Tex-415,18,24,48-A'!H62=0,((('Tex-415,18,24,48-A'!$G62*6^3/'Tex-415,18,24,48-A'!F62)*'Tex-415,18,24,48-A'!$F62)/('Tex-415,18,24,48-A'!$D62*'Tex-415,18,24,48-A'!$E62^2)),3*((('Tex-415,18,24,48-A'!$G62*6^3/'Tex-415,18,24,48-A'!F62)*('Tex-415,18,24,48-A'!F62/3-'Tex-415,18,24,48-A'!$H62))/('Tex-415,18,24,48-A'!$D62*'Tex-415,18,24,48-A'!$E62^2)))))","v":""},{"$f":"IF(ISERROR(IF('Tex-415,18,24,48-A'!$H62>('Tex-415,18,24,48-A'!$F62*0.05),\"RETEST\",IF('Tex-415,18,24,48-A'!H62=0,(((('Tex-415,18,24,48-A'!$G62*1000)*('Tex-415,18,24,48-A'!$F62))/(('Tex-415,18,24,48-A'!$D62)*(('Tex-415,18,24,48-A'!$E62))^2))),(3*((('Tex-415,18,24,48-A'!$G62*1000)*('Tex-415,18,24,48-A'!F62/3-'Tex-415,18,24,48-A'!$H62))/('Tex-415,18,24,48-A'!$D62*'Tex-415,18,24,48-A'!$E62^2)))))),\"\",IF('Tex-415,18,24,48-A'!$H62>('Tex-415,18,24,48-A'!$F62*0.05),\"RETEST\",IF('Tex-415,18,24,48-A'!H62=0,(((('Tex-415,18,24,48-A'!$G62*1000)*('Tex-415,18,24,48-A'!$F62))/(('Tex-415,18,24,48-A'!$D62)*(('Tex-415,18,24,48-A'!$E62))^2))),(3*((('Tex-415,18,24,48-A'!$G62*1000)*('Tex-415,18,24,48-A'!F62/3-'Tex-415,18,24,48-A'!$H62))/('Tex-415,18,24,48-A'!$D62*'Tex-415,18,24,48-A'!$E62^2))))))","v":""}]
[1.05,0.88200000000000001,null,null,{"$f":"IF(ISERROR(IF('Tex-415,18,24,48-A'!$H63>('Tex-415,18,24,48-A'!$F63*0.05),\"RETEST\",IF('Tex-415,18,24,48-A'!H63=0,((('Tex-415,18,24,48-A'!$G63*6^3/'Tex-415,18,24,48-A'!F63)*'Tex-415,18,24,48-A'!$F63)/('Tex-415,18,24,48-A'!$D63*'Tex-415,18,24,48-A'!$E63^2)),3*((('Tex-415,18,24,48-A'!$G63*6^3/'Tex-415,18,24,48-A'!F63)*('Tex-415,18,24,48-A'!F63/3-'Tex-415,18,24,48-A'!$H63))/('Tex-415,18,24,48-A'!$D63*'Tex-415,18,24,48-A'!$E63^2))))),\"\",IF('Tex-415,18,24,48-A'!$H63>('Tex-415,18,24,48-A'!$F63*0.05),\"RETEST\",IF('Tex-415,18,24,48-A'!H63=0,((('Tex-415,18,24,48-A'!$G63*6^3/'Tex-415,18,24,48-A'!F63)*'Tex-415,18,24,48-A'!$F63)/('Tex-415,18,24,48-A'!$D63*'Tex-415,18,24,48-A'!$E63^2)),3*((('Tex-415,18,24,48-A'!$G63*6^3/'Tex-415,18,24,48-A'!F63)*('Tex-415,18,24,48-A'!F63/3-'Tex-415,18,24,48-A'!$H63))/('Tex-415,18,24,48-A'!$D63*'Tex-415,18,24,48-A'!$E63^2)))))","v":""},{"$f":"IF(ISERROR(IF('Tex-415,18,24,48-A'!$H63>('Tex-415,18,24,48-A'!$F63*0.05),\"RETEST\",IF('Tex-415,18,24,48-A'!H63=0,(((('Tex-415,18,24,48-A'!$G63*1000)*('Tex-415,18,24,48-A'!$F63))/(('Tex-415,18,24,48-A'!$D63)*(('Tex-415,18,24,48-A'!$E63))^2))),(3*((('Tex-415,18,24,48-A'!$G63*1000)*('Tex-415,18,24,48-A'!F63/3-'Tex-415,18,24,48-A'!$H63))/('Tex-415,18,24,48-A'!$D63*'Tex-415,18,24,48-A'!$E63^2)))))),\"\",IF('Tex-415,18,24,48-A'!$H63>('Tex-415,18,24,48-A'!$F63*0.05),\"RETEST\",IF('Tex-415,18,24,48-A'!H63=0,(((('Tex-415,18,24,48-A'!$G63*1000)*('Tex-415,18,24,48-A'!$F63))/(('Tex-415,18,24,48-A'!$D63)*(('Tex-415,18,24,48-A'!$E63))^2))),(3*((('Tex-415,18,24,48-A'!$G63*1000)*('Tex-415,18,24,48-A'!F63/3-'Tex-415,18,24,48-A'!$H63))/('Tex-415,18,24,48-A'!$D63*'Tex-415,18,24,48-A'!$E63^2))))))","v":""}]
[1.06,0.88400000000000001,null,null,{"$f":"IF(ISERROR(IF('Tex-415,18,24,48-A'!$H64>('Tex-415,18,24,48-A'!$F64*0.05),\"RETEST\",IF('Tex-415,18,24,48-A'!H64=0,((('Tex-415,18,24,48-A'!$G64*6^3/'Tex-415,18,24,48-A'!F64)*'Tex-415,18,24,48-A'!$F64)/('Tex-415,18,24,48-A'!$D64*'Tex-415,18,24,48-A'!$E64^2)),3*((('Tex-415,18,24,48-A'!$G64*6^3/'Tex-415,18,24,48-A'!F64)*('Tex-415,18,24,48-A'!F64/3-'Tex-415,18,24,48-A'!$H64))/('Tex-415,18,24,48-A'!$D64*'Tex-415,18,24,48-A'!$E64^2))))),\"\",IF('Tex-415,18,24,48-A'!$H64>('Tex-415,18,24,48-A'!$F64*0.05),\"RETEST\",IF('Tex-415,18,24,48-A'!H64=0,((('Tex-415,18,24,48-A'!$G64*6^3/'Tex-415,18,24,48-A'!F64)*'Tex-415,18,24,48-A'!$F64)/('Tex-415,18,24,48-A'!$D64*'Tex-415,18,24,48-A'!$E64^2)),3*((('Tex-415,18,24,48-A'!$G64*6^3/'Tex-415,18,24,48-A'!F64)*('Tex-415,18,24,48-A'!F64/3-'Tex-415,18,24,48-A'!$H64))/('Tex-415,18,24,48-A'!$D64*'Tex-415,18,24,48-A'!$E64^2)))))","v":""},{"$f":"IF(ISERROR(IF('Tex-415,18,24,48-A'!$H64>('Tex-415,18,24,48-A'!$F64*0.05),\"RETEST\",IF('Tex-415,18,24,48-A'!H64=0,(((('Tex-415,18,24,48-A'!$G64*1000)*('Tex-415,18,24,48-A'!$F64))/(('Tex-415,18,24,48-A'!$D64)*(('Tex-415,18,24,48-A'!$E64))^2))),(3*((('Tex-415,18,24,48-A'!$G64*1000)*('Tex-415,18,24,48-A'!F64/3-'Tex-415,18,24,48-A'!$H64))/('Tex-415,18,24,48-A'!$D64*'Tex-415,18,24,48-A'!$E64^2)))))),\"\",IF('Tex-415,18,24,48-A'!$H64>('Tex-415,18,24,48-A'!$F64*0.05),\"RETEST\",IF('Tex-415,18,24,48-A'!H64=0,(((('Tex-415,18,24,48-A'!$G64*1000)*('Tex-415,18,24,48-A'!$F64))/(('Tex-415,18,24,48-A'!$D64)*(('Tex-415,18,24,48-A'!$E64))^2))),(3*((('Tex-415,18,24,48-A'!$G64*1000)*('Tex-415,18,24,48-A'!F64/3-'Tex-415,18,24,48-A'!$H64))/('Tex-415,18,24,48-A'!$D64*'Tex-415,18,24,48-A'!$E64^2))))))","v":""}]
[1.07,0.88700000000000001,null,null,{"$f":"IF(ISERROR(IF('Tex-415,18,24,48-A'!$H65>('Tex-415,18,24,48-A'!$F65*0.05),\"RETEST\",IF('Tex-415,18,24,48-A'!H65=0,((('Tex-415,18,24,48-A'!$G65*6^3/'Tex-415,18,24,48-A'!F65)*'Tex-415,18,24,48-A'!$F65)/('Tex-415,18,24,48-A'!$D65*'Tex-415,18,24,48-A'!$E65^2)),3*((('Tex-415,18,24,48-A'!$G65*6^3/'Tex-415,18,24,48-A'!F65)*('Tex-415,18,24,48-A'!F65/3-'Tex-415,18,24,48-A'!$H65))/('Tex-415,18,24,48-A'!$D65*'Tex-415,18,24,48-A'!$E65^2))))),\"\",IF('Tex-415,18,24,48-A'!$H65>('Tex-415,18,24,48-A'!$F65*0.05),\"RETEST\",IF('Tex-415,18,24,48-A'!H65=0,((('Tex-415,18,24,48-A'!$G65*6^3/'Tex-415,18,24,48-A'!F65)*'Tex-415,18,24,48-A'!$F65)/('Tex-415,18,24,48-A'!$D65*'Tex-415,18,24,48-A'!$E65^2)),3*((('Tex-415,18,24,48-A'!$G65*6^3/'Tex-415,18,24,48-A'!F65)*('Tex-415,18,24,48-A'!F65/3-'Tex-415,18,24,48-A'!$H65))/('Tex-415,18,24,48-A'!$D65*'Tex-415,18,24,48-A'!$E65^2)))))","v":""},{"$f":"IF(ISERROR(IF('Tex-415,18,24,48-A'!$H65>('Tex-415,18,24,48-A'!$F65*0.05),\"RETEST\",IF('Tex-415,18,24,48-A'!H65=0,(((('Tex-415,18,24,48-A'!$G65*1000)*('Tex-415,18,24,48-A'!$F65))/(('Tex-415,18,24,48-A'!$D65)*(('Tex-415,18,24,48-A'!$E65))^2))),(3*((('Tex-415,18,24,48-A'!$G65*1000)*('Tex-415,18,24,48-A'!F65/3-'Tex-415,18,24,48-A'!$H65))/('Tex-415,18,24,48-A'!$D65*'Tex-415,18,24,48-A'!$E65^2)))))),\"\",IF('Tex-415,18,24,48-A'!$H65>('Tex-415,18,24,48-A'!$F65*0.05),\"RETEST\",IF('Tex-415,18,24,48-A'!H65=0,(((('Tex-415,18,24,48-A'!$G65*1000)*('Tex-415,18,24,48-A'!$F65))/(('Tex-415,18,24,48-A'!$D65)*(('Tex-415,18,24,48-A'!$E65))^2))),(3*((('Tex-415,18,24,48-A'!$G65*1000)*('Tex-415,18,24,48-A'!F65/3-'Tex-415,18,24,48-A'!$H65))/('Tex-415,18,24,48-A'!$D65*'Tex-415,18,24,48-A'!$E65^2))))))","v":""}]
[1.08,0.88900000000000001]
[1.0900000000000001,0.89200000000000002,null,null,"English f'c","Metric f'c"]
[1.1000000000000001,0.89400000000000002,null,null,{"$f":"IF(ISERROR('Tex-415,18,24,48-A'!$I33*('Tex-415,18,24,48-A'!$G33/(PI()*(IF(CircumDiameter1=\"circumference\",SQRT('Tex-415,18,24,48-A'!$D33/PI())*2,'Tex-415,18,24,48-A'!$D33)^2/4)))),\"\",'Tex-415,18,24,48-A'!$I33*('Tex-415,18,24,48-A'!$G33/(PI()*(IF(CircumDiameter1=\"circumference\",SQRT('Tex-415,18,24,48-A'!$D33/PI())*2,'Tex-415,18,24,48-A'!$D33)^2/4))))","v":""},{"$f":"IF(ISERROR(0.000001*('Tex-415,18,24,48-A'!$I33*('Tex-415,18,24,48-A'!$G33/(PI()*((IF(CircumDiameter1=\"circumference\",SQRT('Tex-415,18,24,48-A'!$D33/PI())*2,'Tex-415,18,24,48-A'!$D33)/1000)^2/4))))),\"\",0.000001*('Tex-415,18,24,48-A'!$I33*('Tex-415,18,24,48-A'!$G33/(PI()*((IF(CircumDiameter1=\"circumference\",SQRT('Tex-415,18,24,48-A'!$D33/PI())*2,'Tex-415,18,24,48-A'!$D33)/1000)^2/4)))))","v":""}]
[1.1100000000000001,0.89600000000000002,null,null,{"$f":"IF(ISERROR('Tex-415,18,24,48-A'!$I34*('Tex-415,18,24,48-A'!$G34/(PI()*(IF(CircumDiameter1=\"circumference\",SQRT('Tex-415,18,24,48-A'!$D34/PI())*2,'Tex-415,18,24,48-A'!$D34)^2/4)))),\"\",'Tex-415,18,24,48-A'!$I34*('Tex-415,18,24,48-A'!$G34/(PI()*(IF(CircumDiameter1=\"circumference\",SQRT('Tex-415,18,24,48-A'!$D34/PI())*2,'Tex-415,18,24,48-A'!$D34)^2/4))))","v":""},{"$f":"IF(ISERROR(0.000001*('Tex-415,18,24,48-A'!$I34*('Tex-415,18,24,48-A'!$G34/(PI()*((IF(CircumDiameter1=\"circumference\",SQRT('Tex-415,18,24,48-A'!$D34/PI())*2,'Tex-415,18,24,48-A'!$D34)/1000)^2/4))))),\"\",0.000001*('Tex-415,18,24,48-A'!$I34*('Tex-415,18,24,48-A'!$G34/(PI()*((IF(CircumDiameter1=\"circumference\",SQRT('Tex-415,18,24,48-A'!$D34/PI())*2,'Tex-415,18,24,48-A'!$D34)/1000)^2/4)))))","v":""}]
[1.1200000000000001,0.89900000000000002,null,null,{"$f":"IF(ISERROR('Tex-415,18,24,48-A'!$I35*('Tex-415,18,24,48-A'!$G35/(PI()*(IF(CircumDiameter1=\"circumference\",SQRT('Tex-415,18,24,48-A'!$D35/PI())*2,'Tex-415,18,24,48-A'!$D35)^2/4)))),\"\",'Tex-415,18,24,48-A'!$I35*('Tex-415,18,24,48-A'!$G35/(PI()*(IF(CircumDiameter1=\"circumference\",SQRT('Tex-415,18,24,48-A'!$D35/PI())*2,'Tex-415,18,24,48-A'!$D35)^2/4))))","v":""},{"$f":"IF(ISERROR(0.000001*('Tex-415,18,24,48-A'!$I35*('Tex-415,18,24,48-A'!$G35/(PI()*((IF(CircumDiameter1=\"circumference\",SQRT('Tex-415,18,24,48-A'!$D35/PI())*2,'Tex-415,18,24,48-A'!$D35)/1000)^2/4))))),\"\",0.000001*('Tex-415,18,24,48-A'!$I35*('Tex-415,18,24,48-A'!$G35/(PI()*((IF(CircumDiameter1=\"circumference\",SQRT('Tex-415,18,24,48-A'!$D35/PI())*2,'Tex-415,18,24,48-A'!$D35)/1000)^2/4)))))","v":""}]
[1.1299999999999999,0.90100000000000002,null,null,{"$f":"IF(ISERROR('Tex-415,18,24,48-A'!$I36*('Tex-415,18,24,48-A'!$G36/(PI()*(IF(CircumDiameter1=\"circumference\",SQRT('Tex-415,18,24,48-A'!$D36/PI())*2,'Tex-415,18,24,48-A'!$D36)^2/4)))),\"\",'Tex-415,18,24,48-A'!$I36*('Tex-415,18,24,48-A'!$G36/(PI()*(IF(CircumDiameter1=\"circumference\",SQRT('Tex-415,18,24,48-A'!$D36/PI())*2,'Tex-415,18,24,48-A'!$D36)^2/4))))","v":""},{"$f":"IF(ISERROR(0.000001*('Tex-415,18,24,48-A'!$I36*('Tex-415,18,24,48-A'!$G36/(PI()*((IF(CircumDiameter1=\"circumference\",SQRT('Tex-415,18,24,48-A'!$D36/PI())*2,'Tex-415,18,24,48-A'!$D36)/1000)^2/4))))),\"\",0.000001*('Tex-415,18,24,48-A'!$I36*('Tex-415,18,24,48-A'!$G36/(PI()*((IF(CircumDiameter1=\"circumference\",SQRT('Tex-415,18,24,48-A'!$D36/PI())*2,'Tex-415,18,24,48-A'!$D36)/1000)^2/4)))))","v":""}]
[1.1399999999999999,0.90400000000000003,null,null,{"$f":"IF(ISERROR('Tex-415,18,24,48-A'!$I37*('Tex-415,18,24,48-A'!$G37/(PI()*(IF(CircumDiameter1=\"circumference\",SQRT('Tex-415,18,24,48-A'!$D37/PI())*2,'Tex-415,18,24,48-A'!$D37)^2/4)))),\"\",'Tex-415,18,24,48-A'!$I37*('Tex-415,18,24,48-A'!$G37/(PI()*(IF(CircumDiameter1=\"circumference\",SQRT('Tex-415,18,24,48-A'!$D37/PI())*2,'Tex-415,18,24,48-A'!$D37)^2/4))))","v":""},{"$f":"IF(ISERROR(0.000001*('Tex-415,18,24,48-A'!$I37*('Tex-415,18,24,48-A'!$G37/(PI()*((IF(CircumDiameter1=\"circumference\",SQRT('Tex-415,18,24,48-A'!$D37/PI())*2,'Tex-415,18,24,48-A'!$D37)/1000)^2/4))))),\"\",0.000001*('Tex-415,18,24,48-A'!$I37*('Tex-415,18,24,48-A'!$G37/(PI()*((IF(CircumDiameter1=\"circumference\",SQRT('Tex-415,18,24,48-A'!$D37/PI())*2,'Tex-415,18,24,48-A'!$D37)/1000)^2/4)))))","v":""}]
[1.1499999999999999,0.90600000000000003,null,null,{"$f":"IF(ISERROR('Tex-415,18,24,48-A'!$I38*('Tex-415,18,24,48-A'!$G38/(PI()*(IF(CircumDiameter1=\"circumference\",SQRT('Tex-415,18,24,48-A'!$D38/PI())*2,'Tex-415,18,24,48-A'!$D38)^2/4)))),\"\",'Tex-415,18,24,48-A'!$I38*('Tex-415,18,24,48-A'!$G38/(PI()*(IF(CircumDiameter1=\"circumference\",SQRT('Tex-415,18,24,48-A'!$D38/PI())*2,'Tex-415,18,24,48-A'!$D38)^2/4))))","v":""},{"$f":"IF(ISERROR(0.000001*('Tex-415,18,24,48-A'!$I38*('Tex-415,18,24,48-A'!$G38/(PI()*((IF(CircumDiameter1=\"circumference\",SQRT('Tex-415,18,24,48-A'!$D38/PI())*2,'Tex-415,18,24,48-A'!$D38)/1000)^2/4))))),\"\",0.000001*('Tex-415,18,24,48-A'!$I38*('Tex-415,18,24,48-A'!$G38/(PI()*((IF(CircumDiameter1=\"circumference\",SQRT('Tex-415,18,24,48-A'!$D38/PI())*2,'Tex-415,18,24,48-A'!$D38)/1000)^2/4)))))","v":""}]
[1.1599999999999999,0.90800000000000003,null,null,{"$f":"IF(ISERROR('Tex-415,18,24,48-A'!$I39*('Tex-415,18,24,48-A'!$G39/(PI()*(IF(CircumDiameter1=\"circumference\",SQRT('Tex-415,18,24,48-A'!$D39/PI())*2,'Tex-415,18,24,48-A'!$D39)^2/4)))),\"\",'Tex-415,18,24,48-A'!$I39*('Tex-415,18,24,48-A'!$G39/(PI()*(IF(CircumDiameter1=\"circumference\",SQRT('Tex-415,18,24,48-A'!$D39/PI())*2,'Tex-415,18,24,48-A'!$D39)^2/4))))","v":""},{"$f":"IF(ISERROR(0.000001*('Tex-415,18,24,48-A'!$I39*('Tex-415,18,24,48-A'!$G39/(PI()*((IF(CircumDiameter1=\"circumference\",SQRT('Tex-415,18,24,48-A'!$D39/PI())*2,'Tex-415,18,24,48-A'!$D39)/1000)^2/4))))),\"\",0.000001*('Tex-415,18,24,48-A'!$I39*('Tex-415,18,24,48-A'!$G39/(PI()*((IF(CircumDiameter1=\"circumference\",SQRT('Tex-415,18,24,48-A'!$D39/PI())*2,'Tex-415,18,24,48-A'!$D39)/1000)^2/4)))))","v":""}]
[1.17,0.91100000000000003,null,null,{"$f":"IF(ISERROR('Tex-415,18,24,48-A'!$I40*('Tex-415,18,24,48-A'!$G40/(PI()*(IF(CircumDiameter1=\"circumference\",SQRT('Tex-415,18,24,48-A'!$D40/PI())*2,'Tex-415,18,24,48-A'!$D40)^2/4)))),\"\",'Tex-415,18,24,48-A'!$I40*('Tex-415,18,24,48-A'!$G40/(PI()*(IF(CircumDiameter1=\"circumference\",SQRT('Tex-415,18,24,48-A'!$D40/PI())*2,'Tex-415,18,24,48-A'!$D40)^2/4))))","v":""},{"$f":"IF(ISERROR(0.000001*('Tex-415,18,24,48-A'!$I40*('Tex-415,18,24,48-A'!$G40/(PI()*((IF(CircumDiameter1=\"circumference\",SQRT('Tex-415,18,24,48-A'!$D40/PI())*2,'Tex-415,18,24,48-A'!$D40)/1000)^2/4))))),\"\",0.000001*('Tex-415,18,24,48-A'!$I40*('Tex-415,18,24,48-A'!$G40/(PI()*((IF(CircumDiameter1=\"circumference\",SQRT('Tex-415,18,24,48-A'!$D40/PI())*2,'Tex-415,18,24,48-A'!$D40)/1000)^2/4)))))","v":""}]
[1.18,0.91300000000000003]
[1.19,0.91600000000000004]
[1.2,0.91800000000000004,null,null,{"$f":"IF(ISERROR('Tex-415,18,24,48-A'!$I46*('Tex-415,18,24,48-A'!$G46/(PI()*(IF(CircumDiameter2=\"circumference\",SQRT('Tex-415,18,24,48-A'!$D46/PI())*2,'Tex-415,18,24,48-A'!$D46)^2/4)))),\"\",'Tex-415,18,24,48-A'!$I46*('Tex-415,18,24,48-A'!$G46/(PI()*(IF(CircumDiameter2=\"circumference\",SQRT('Tex-415,18,24,48-A'!$D46/PI())*2,'Tex-415,18,24,48-A'!$D46)^2/4))))","v":""},{"$f":"IF(ISERROR(0.000001*('Tex-415,18,24,48-A'!$I46*('Tex-415,18,24,48-A'!$G46/(PI()*((IF(CircumDiameter2=\"circumference\",SQRT('Tex-415,18,24,48-A'!$D46/PI())*2,'Tex-415,18,24,48-A'!$D46)/1000)^2/4))))),\"\",0.000001*('Tex-415,18,24,48-A'!$I46*('Tex-415,18,24,48-A'!$G46/(PI()*((IF(CircumDiameter2=\"circumference\",SQRT('Tex-415,18,24,48-A'!$D46/PI())*2,'Tex-415,18,24,48-A'!$D46)/1000)^2/4)))))","v":""}]
[1.21,0.92,null,null,{"$f":"IF(ISERROR('Tex-415,18,24,48-A'!$I47*('Tex-415,18,24,48-A'!$G47/(PI()*(IF(CircumDiameter2=\"circumference\",SQRT('Tex-415,18,24,48-A'!$D47/PI())*2,'Tex-415,18,24,48-A'!$D47)^2/4)))),\"\",'Tex-415,18,24,48-A'!$I47*('Tex-415,18,24,48-A'!$G47/(PI()*(IF(CircumDiameter2=\"circumference\",SQRT('Tex-415,18,24,48-A'!$D47/PI())*2,'Tex-415,18,24,48-A'!$D47)^2/4))))","v":""},{"$f":"IF(ISERROR(0.000001*('Tex-415,18,24,48-A'!$I47*('Tex-415,18,24,48-A'!$G47/(PI()*((IF(CircumDiameter2=\"circumference\",SQRT('Tex-415,18,24,48-A'!$D47/PI())*2,'Tex-415,18,24,48-A'!$D47)/1000)^2/4))))),\"\",0.000001*('Tex-415,18,24,48-A'!$I47*('Tex-415,18,24,48-A'!$G47/(PI()*((IF(CircumDiameter2=\"circumference\",SQRT('Tex-415,18,24,48-A'!$D47/PI())*2,'Tex-415,18,24,48-A'!$D47)/1000)^2/4)))))","v":""}]
[1.22,0.92300000000000004,null,null,{"$f":"IF(ISERROR('Tex-415,18,24,48-A'!$I48*('Tex-415,18,24,48-A'!$G48/(PI()*(IF(CircumDiameter2=\"circumference\",SQRT('Tex-415,18,24,48-A'!$D48/PI())*2,'Tex-415,18,24,48-A'!$D48)^2/4)))),\"\",'Tex-415,18,24,48-A'!$I48*('Tex-415,18,24,48-A'!$G48/(PI()*(IF(CircumDiameter2=\"circumference\",SQRT('Tex-415,18,24,48-A'!$D48/PI())*2,'Tex-415,18,24,48-A'!$D48)^2/4))))","v":""},{"$f":"IF(ISERROR(0.000001*('Tex-415,18,24,48-A'!$I48*('Tex-415,18,24,48-A'!$G48/(PI()*((IF(CircumDiameter2=\"circumference\",SQRT('Tex-415,18,24,48-A'!$D48/PI())*2,'Tex-415,18,24,48-A'!$D48)/1000)^2/4))))),\"\",0.000001*('Tex-415,18,24,48-A'!$I48*('Tex-415,18,24,48-A'!$G48/(PI()*((IF(CircumDiameter2=\"circumference\",SQRT('Tex-415,18,24,48-A'!$D48/PI())*2,'Tex-415,18,24,48-A'!$D48)/1000)^2/4)))))","v":""}]
[1.23,0.92500000000000004,null,null,{"$f":"IF(ISERROR('Tex-415,18,24,48-A'!$I49*('Tex-415,18,24,48-A'!$G49/(PI()*(IF(CircumDiameter2=\"circumference\",SQRT('Tex-415,18,24,48-A'!$D49/PI())*2,'Tex-415,18,24,48-A'!$D49)^2/4)))),\"\",'Tex-415,18,24,48-A'!$I49*('Tex-415,18,24,48-A'!$G49/(PI()*(IF(CircumDiameter2=\"circumference\",SQRT('Tex-415,18,24,48-A'!$D49/PI())*2,'Tex-415,18,24,48-A'!$D49)^2/4))))","v":""},{"$f":"IF(ISERROR(0.000001*('Tex-415,18,24,48-A'!$I49*('Tex-415,18,24,48-A'!$G49/(PI()*((IF(CircumDiameter2=\"circumference\",SQRT('Tex-415,18,24,48-A'!$D49/PI())*2,'Tex-415,18,24,48-A'!$D49)/1000)^2/4))))),\"\",0.000001*('Tex-415,18,24,48-A'!$I49*('Tex-415,18,24,48-A'!$G49/(PI()*((IF(CircumDiameter2=\"circumference\",SQRT('Tex-415,18,24,48-A'!$D49/PI())*2,'Tex-415,18,24,48-A'!$D49)/1000)^2/4)))))","v":""}]
[1.24,0.92800000000000005,null,null,{"$f":"IF(ISERROR('Tex-415,18,24,48-A'!$I50*('Tex-415,18,24,48-A'!$G50/(PI()*(IF(CircumDiameter2=\"circumference\",SQRT('Tex-415,18,24,48-A'!$D50/PI())*2,'Tex-415,18,24,48-A'!$D50)^2/4)))),\"\",'Tex-415,18,24,48-A'!$I50*('Tex-415,18,24,48-A'!$G50/(PI()*(IF(CircumDiameter2=\"circumference\",SQRT('Tex-415,18,24,48-A'!$D50/PI())*2,'Tex-415,18,24,48-A'!$D50)^2/4))))","v":""},{"$f":"IF(ISERROR(0.000001*('Tex-415,18,24,48-A'!$I50*('Tex-415,18,24,48-A'!$G50/(PI()*((IF(CircumDiameter2=\"circumference\",SQRT('Tex-415,18,24,48-A'!$D50/PI())*2,'Tex-415,18,24,48-A'!$D50)/1000)^2/4))))),\"\",0.000001*('Tex-415,18,24,48-A'!$I50*('Tex-415,18,24,48-A'!$G50/(PI()*((IF(CircumDiameter2=\"circumference\",SQRT('Tex-415,18,24,48-A'!$D50/PI())*2,'Tex-415,18,24,48-A'!$D50)/1000)^2/4)))))","v":""}]
[1.25,0.93,null,null,{"$f":"IF(ISERROR('Tex-415,18,24,48-A'!$I51*('Tex-415,18,24,48-A'!$G51/(PI()*(IF(CircumDiameter2=\"circumference\",SQRT('Tex-415,18,24,48-A'!$D51/PI())*2,'Tex-415,18,24,48-A'!$D51)^2/4)))),\"\",'Tex-415,18,24,48-A'!$I51*('Tex-415,18,24,48-A'!$G51/(PI()*(IF(CircumDiameter2=\"circumference\",SQRT('Tex-415,18,24,48-A'!$D51/PI())*2,'Tex-415,18,24,48-A'!$D51)^2/4))))","v":""},{"$f":"IF(ISERROR(0.000001*('Tex-415,18,24,48-A'!$I51*('Tex-415,18,24,48-A'!$G51/(PI()*((IF(CircumDiameter2=\"circumference\",SQRT('Tex-415,18,24,48-A'!$D51/PI())*2,'Tex-415,18,24,48-A'!$D51)/1000)^2/4))))),\"\",0.000001*('Tex-415,18,24,48-A'!$I51*('Tex-415,18,24,48-A'!$G51/(PI()*((IF(CircumDiameter2=\"circumference\",SQRT('Tex-415,18,24,48-A'!$D51/PI())*2,'Tex-415,18,24,48-A'!$D51)/1000)^2/4)))))","v":""}]
[1.26,0.93100000000000005,null,null,{"$f":"IF(ISERROR('Tex-415,18,24,48-A'!$I52*('Tex-415,18,24,48-A'!$G52/(PI()*(IF(CircumDiameter2=\"circumference\",SQRT('Tex-415,18,24,48-A'!$D52/PI())*2,'Tex-415,18,24,48-A'!$D52)^2/4)))),\"\",'Tex-415,18,24,48-A'!$I52*('Tex-415,18,24,48-A'!$G52/(PI()*(IF(CircumDiameter2=\"circumference\",SQRT('Tex-415,18,24,48-A'!$D52/PI())*2,'Tex-415,18,24,48-A'!$D52)^2/4))))","v":""},{"$f":"IF(ISERROR(0.000001*('Tex-415,18,24,48-A'!$I52*('Tex-415,18,24,48-A'!$G52/(PI()*((IF(CircumDiameter2=\"circumference\",SQRT('Tex-415,18,24,48-A'!$D52/PI())*2,'Tex-415,18,24,48-A'!$D52)/1000)^2/4))))),\"\",0.000001*('Tex-415,18,24,48-A'!$I52*('Tex-415,18,24,48-A'!$G52/(PI()*((IF(CircumDiameter2=\"circumference\",SQRT('Tex-415,18,24,48-A'!$D52/PI())*2,'Tex-415,18,24,48-A'!$D52)/1000)^2/4)))))","v":""}]
[1.27,0.93200000000000005,null,null,{"$f":"IF(ISERROR('Tex-415,18,24,48-A'!$I53*('Tex-415,18,24,48-A'!$G53/(PI()*(IF(CircumDiameter2=\"circumference\",SQRT('Tex-415,18,24,48-A'!$D53/PI())*2,'Tex-415,18,24,48-A'!$D53)^2/4)))),\"\",'Tex-415,18,24,48-A'!$I53*('Tex-415,18,24,48-A'!$G53/(PI()*(IF(CircumDiameter2=\"circumference\",SQRT('Tex-415,18,24,48-A'!$D53/PI())*2,'Tex-415,18,24,48-A'!$D53)^2/4))))","v":""},{"$f":"IF(ISERROR(0.000001*('Tex-415,18,24,48-A'!$I53*('Tex-415,18,24,48-A'!$G53/(PI()*((IF(CircumDiameter2=\"circumference\",SQRT('Tex-415,18,24,48-A'!$D53/PI())*2,'Tex-415,18,24,48-A'!$D53)/1000)^2/4))))),\"\",0.000001*('Tex-415,18,24,48-A'!$I53*('Tex-415,18,24,48-A'!$G53/(PI()*((IF(CircumDiameter2=\"circumference\",SQRT('Tex-415,18,24,48-A'!$D53/PI())*2,'Tex-415,18,24,48-A'!$D53)/1000)^2/4)))))","v":""}]
[1.28,0.93300000000000005]
[1.29,0.93400000000000005]
[1.3,0.93600000000000005]
[1.31,0.93700000000000006]
[1.32,0.93799999999999994]
[1.33,0.93899999999999995]
[1.34,0.94]
[1.35,0.94199999999999995]
[1.36,0.94299999999999995]
[1.37,0.94399999999999995]
[1.38,0.94499999999999995]
[1.39,0.94599999999999995]
[1.4,0.94799999999999995]
[1.41,0.94899999999999995]
[1.42,0.95]
[1.43,0.95099999999999996]
[1.44,0.95199999999999996]
[1.45,0.95399999999999996]
[1.46,0.95499999999999996]
[1.47,0.95599999999999996]
[1.48,0.95699999999999996]
[1.49,0.95799999999999996]
[1.5,0.96]
[1.51,0.96099999999999997]
[1.52,0.96199999999999997]
[1.53,0.96199999999999997]
[1.54,0.96299999999999997]
[1.55,0.96399999999999997]
[1.56,0.96499999999999997]
[1.57,0.96599999999999997]
[1.58,0.96599999999999997]
[1.59,0.96699999999999997]
[1.6,0.96799999999999997]
[1.61,0.96899999999999997]
[1.62,0.97]
[1.63,0.97]
[1.64,0.97099999999999997]
[1.65,0.97199999999999998]
[1.66,0.97299999999999998]
[1.67,0.97399999999999998]
[1.68,0.97399999999999998]
[1.69,0.97499999999999998]
[1.7,0.97599999999999998]
[1.71,0.97699999999999998]
[1.72,0.97799999999999998]
[1.73,0.97799999999999998]
[1.74,0.97899999999999998]
[1.75,0.98]
[1.76,{"$f":"IF(version>=1, 1, 0.981)","v":1}]
[1.77,{"$f":"IF(version>=1, 1, 0.982)","v":1}]
[1.78,{"$f":"IF(version>=1, 1, 0.982)","v":1}]
[1.79,{"$f":"IF(version>=1, 1, 0.983)","v":1}]
[1.8,{"$f":"IF(version>=1, 1, 0.984)","v":1}]
[1.81,{"$f":"IF(version>=1, 1, 0.985)","v":1}]
[1.82,{"$f":"IF(version>=1, 1, 0.986)","v":1}]
[1.83,{"$f":"IF(version>=1, 1, 0.986)","v":1}]
[1.84,{"$f":"IF(version>=1, 1, 0.987)","v":1}]
[1.85,{"$f":"IF(version>=1, 1, 0.988)","v":1}]
[1.86,{"$f":"IF(version>=1, 1, 0.989)","v":1}]
[1.87,{"$f":"IF(version>=1, 1, 0.99)","v":1}]
[1.88,{"$f":"IF(version>=1, 1, 0.99)","v":1}]
[1.89,{"$f":"IF(version>=1, 1, 0.991)","v":1}]
[1.9,{"$f":"IF(version>=1, 1, 0.992)","v":1}]
[1.91,{"$f":"IF(version>=1, 1, 0.993)","v":1}]
[1.92,{"$f":"IF(version>=1, 1, 0.994)","v":1}]
[1.93,{"$f":"IF(version>=1, 1, 0.994)","v":1}]
[1.94,{"$f":"IF(version>=1, 1, 0.995)","v":1}]
[1.95,1]
[1.96,1]
[1.97,1]
[1.98,1]
[1.99,1]
[2,1]
[2.0099999999999998,1]
[2.02,1]
[2.0299999999999998,1]
[2.04,1]
[2.0499999999999998,1]
[2.06,1]
[2.0699999999999998,1]
[2.08,1]
[2.09,1]
[2.1,1]