{"text_format":"1","workbook":"xlsx","n_sheets":5,"sheets":["Tex-415,18,24,48-A","RX","Spec. Strengths","Revisions","L to D Lookup"],"not_rendered":{"charts":0,"images":1,"macros":1,"external_links":0,"defined_names":241,"comments":1,"pivot_tables":0},"unopened":[],"bounds":{"document_bytes":16777216,"sheet_cells":100000,"rows_first":2000,"rows_last":500,"rows_between":2000,"halvings":0,"cell_chars":16384,"cell_head_chars":4096},"cells_cut":0,"cells_raw":0,"read":"whole","date_system":"1900"}

{"sheet":"Tex-415,18,24,48-A","index":0,"n_rows":90,"n_cols":12,"rows_kept":90,"cut":false,"hidden":false,"merged":[[29,9,31,9],[38,2,39,2],[38,10,39,10],[43,3,44,3],[42,9,44,9],[36,10,37,10],[34,10,35,10],[34,2,35,2],[0,0,0,1],[11,3,11,4],[7,3,7,4],[8,3,8,4],[9,3,9,4],[10,3,10,4],[26,1,26,11],[25,1,25,11],[27,5,27,7],[27,1,27,3],[7,7,7,8],[8,7,8,8],[9,7,9,8],[10,7,10,8],[16,3,16,4],[11,7,11,8],[13,7,13,8],[14,3,14,8],[23,4,23,5],[15,3,15,8],[16,7,16,8],[12,7,12,8],[21,4,21,6],[22,4,22,6],[12,3,12,4],[13,3,13,4],[89,1,89,3],[79,2,79,4],[75,2,75,4],[77,2,77,4],[70,1,70,8],[85,6,85,8],[85,1,85,3],[74,2,74,4],[81,2,81,4],[83,2,83,4],[72,2,72,4],[73,2,73,4],[69,1,69,8],[67,1,68,8],[63,2,64,2],[55,1,56,1],[55,4,56,4],[57,2,58,2],[53,1,53,9],[41,1,41,10],[42,8,44,8],[47,10,48,10],[42,1,44,1],[42,4,44,4],[42,2,44,2],[49,10,50,10],[45,10,46,10],[42,6,44,6],[57,9,58,9],[42,5,44,5],[47,2,48,2],[45,2,46,2],[55,2,56,2],[49,2,50,2],[42,7,44,7],[55,6,56,6],[55,0,56,0],[38,11,39,11],[29,11,31,11],[29,0,31,0],[42,0,44,0],[32,11,33,11],[34,11,35,11],[36,11,37,11],[51,10,52,10],[51,2,52,2],[55,7,56,7],[55,5,56,5],[29,5,31,5],[29,4,31,4],[29,10,31,10],[29,6,31,6],[30,3,31,3],[29,8,31,8],[29,7,31,7],[36,2,37,2],[29,1,31,1],[32,10,33,10],[29,2,31,2],[32,2,33,2],[63,9,64,9],[40,1,40,10],[61,9,62,9],[55,3,56,3],[42,10,44,10],[55,9,56,9],[55,8,56,8],[59,2,60,2],[61,2,62,2],[54,1,54,9],[59,9,60,9]]}
["TxDOT Manuals >",null,null,"Tex-418-A","Tex-448-A","Tex-424-A","Tex-415-A"]
[null,"TEXAS DEPARTMENT OF TRANSPORTATION",null,null,null,null,null,null,null,null,160]
[null,null,null,null,null,null,null,null,null,null,6]
[null,null,null,null,null,null,null,null,null,null,"tx418,48.xlsm::45170.326551"]
[null,"HYDRAULIC CEMENT CONCRETE REPORT "]
[null,"Tex-415,18,24,48-A"]
[null,null,null,null,null,null,null,null,{"$f":"\"TX 418, 48 :: File Version: \" & TEXT(MID(sn,SEARCH(\"::\",sn,1)+2,20),\"mm/dd/yy hh:mm:ss\")","v":"TX 418, 48 :: File Version: 09/01/23 07:50:14"}]
[null,null,"SAMPLE ID:",null,null,null,"SAMPLED DATE:"]
[null,null,"TEST NUMBER:",null,null,null,"LETTING DATE:"]
[null,null,"SAMPLE STATUS:",null,null,null,"CONTROLLING CSJ:"]
[null,null,"COUNTY:",null,null,null,"SPEC YEAR:"]
[null,null,"SAMPLED BY:",null,null,null,"SPEC ITEM:"]
[null,null,"SAMPLE LOCATION:",null,null,null,"SPECIAL PROVISION:"]
[null,null,"MATERIAL CODE:",null,null,null,"CLASS:"]
[null,null,"MATERIAL NAME:"]
{"$rows_left_out":76}
{"sheet":"RX","index":1,"n_rows":232,"n_cols":9,"rows_kept":232,"cut":false,"hidden":true,"merged":[]}
[{"$f":"COUNTA(A3:A5000)","v":230}]
["Fld_nbr","Value","Desc_1","Desc_2","Desc_3","Desc_4","Desc_5","Desc_6","Desc_7"]
[1,{"$f":"IF('Tex-415,18,24,48-A'!$B$68=\"\",\"\",'Tex-415,18,24,48-A'!$B$68)","v":""},{"$f":"'Tex-415,18,24,48-A'!$B$67","v":"Remarks:"}]
[2,{"$f":"IF('Tex-415,18,24,48-A'!$D$19=\"\",\"\",'Tex-415,18,24,48-A'!$D$19)","v":""},{"$f":"IF('Tex-415,18,24,48-A'!$C$19=\"\",\"\",'Tex-415,18,24,48-A'!$C$19)","v":"COURSE\\LIFT:"}]
[3,{"$f":"IF('Tex-415,18,24,48-A'!$C$76=\"\",\"\",'Tex-415,18,24,48-A'!$C$76)","v":" "},"Tested By ",{"$f":"IF('Tex-415,18,24,48-A'!$B$76=\"\",\"\",'Tex-415,18,24,48-A'!$B$76)","v":"TX415"}]
[4,{"$f":"IF('Tex-415,18,24,48-A'!$F$76=\"\",\"\",'Tex-415,18,24,48-A'!$F$76)","v":" "},"Tested Date ",{"$f":"IF('Tex-415,18,24,48-A'!$B$76=\"\",\"\",'Tex-415,18,24,48-A'!$B$76)","v":"TX415"}]
[5,{"$f":"IF('Tex-415,18,24,48-A'!$C$78=\"\",\"\",'Tex-415,18,24,48-A'!$C$78)","v":" "},"Tested By ",{"$f":"IF('Tex-415,18,24,48-A'!$B$78=\"\",\"\",'Tex-415,18,24,48-A'!$B$78)","v":"TX418"}]
[6,{"$f":"IF('Tex-415,18,24,48-A'!$F$78=\"\",\"\",'Tex-415,18,24,48-A'!$F$78)","v":" "},"Tested Date ",{"$f":"IF('Tex-415,18,24,48-A'!$B$78=\"\",\"\",'Tex-415,18,24,48-A'!$B$78)","v":"TX418"}]
[7,{"$f":"IF('Tex-415,18,24,48-A'!$C$80=\"\",\"\",'Tex-415,18,24,48-A'!$C$80)","v":" "},"Tested By ",{"$f":"IF('Tex-415,18,24,48-A'!$B$80=\"\",\"\",'Tex-415,18,24,48-A'!$B$80)","v":"TX424"}]
[8,{"$f":"IF('Tex-415,18,24,48-A'!$F$80=\"\",\"\",'Tex-415,18,24,48-A'!$F$80)","v":" "},"Tested Date ",{"$f":"IF('Tex-415,18,24,48-A'!$B$80=\"\",\"\",'Tex-415,18,24,48-A'!$B$80)","v":"TX424"}]
[9,{"$f":"IF('Tex-415,18,24,48-A'!$C$82=\"\",\"\",'Tex-415,18,24,48-A'!$C$82)","v":" "},"Tested By ",{"$f":"IF('Tex-415,18,24,48-A'!$B$82=\"\",\"\",'Tex-415,18,24,48-A'!$B$82)","v":"TX448"}]
[10,{"$f":"IF('Tex-415,18,24,48-A'!$F$82=\"\",\"\",'Tex-415,18,24,48-A'!$F$82)","v":" "},"Tested Date ",{"$f":"IF('Tex-415,18,24,48-A'!$B$82=\"\",\"\",'Tex-415,18,24,48-A'!$B$82)","v":"TX448"}]
[11,{"$f":"IF('Tex-415,18,24,48-A'!$C$24=\"\",\"\",'Tex-415,18,24,48-A'!$C$24)","v":""},{"$f":"IF('Tex-415,18,24,48-A'!$B$6=\"\",\"\",'Tex-415,18,24,48-A'!$B$6)","v":"Tex-415,18,24,48-A"},{"$f":"IF('Tex-415,18,24,48-A'!$B$24=\"\",\"\",'Tex-415,18,24,48-A'!$B$24)","v":"Mix Design #"}]
[12,{"$f":"IF('Tex-415,18,24,48-A'!$G$24=\"\",\"\",'Tex-415,18,24,48-A'!$G$24)","v":""},{"$f":"IF('Tex-415,18,24,48-A'!$E$23=\"\",\"\",'Tex-415,18,24,48-A'!$E$23)","v":"Tex-415-A"},{"$f":"IF('Tex-415,18,24,48-A'!$E$24=\"\",\"\",'Tex-415,18,24,48-A'!$E$24)","v":"Slump "}]
[13,{"$f":"IF('Tex-415,18,24,48-A'!$E$28=\"\",\"\",'Tex-415,18,24,48-A'!$E$28)","v":""},{"$f":"IF('Tex-415,18,24,48-A'!$B$27=\"\",\"\",'Tex-415,18,24,48-A'!$B$27)","v":"Tex-418-A"},{"$f":"IF('Tex-415,18,24,48-A'!$B$28=\"\",\"\",'Tex-415,18,24,48-A'!$B$28)","v":"7-Day Target Strength  :"}]
{"$rows_left_out":218}
{"sheet":"Spec. Strengths","index":2,"n_rows":38,"n_cols":7,"rows_kept":38,"cut":false,"hidden":true,"merged":[[1,1,1,3],[1,0,2,0],[1,4,1,6],[20,0,21,0],[20,1,20,3],[20,4,20,6]]}
[]
["Concrete Class","Min. 28-Day Compressive Strength",null,null,"Min. 7-Day Compressive Strength"]
[null,1993,1995,2004,1993,1995,2004]
[null,"(psi)","(MPa)","(psi)","(psi)","(kPa)","(psi)"]
["A",3000,21,3000,"Not Applicable","Not Applicable","Not Applicable"]
["B",2000,14,2000,"Not Applicable","Not Applicable","Not Applicable"]
["C",3600,25,3600,"Not Applicable","Not Applicable","Not Applicable"]
["CO",4600,32,4600,"Not Applicable","Not Applicable","Not Applicable"]
["D",1500,10,1500,"Not Applicable","Not Applicable","Not Applicable"]
["DC",5500,38,5500,"Not Applicable","Not Applicable","Not Applicable"]
["E",3000,21,3000,"Not Applicable","Not Applicable","Not Applicable"]
["F","Input at right","Input at right","Input at right","Not Applicable","Not Applicable","Not Applicable"]
["H","Input at right","Input at right","Input at right","Not Applicable","Not Applicable","Not Applicable"]
["HES","NA","NA","Input at right","Not Applicable","Not Applicable","Not Applicable"]
["K","Input at right","Input at right","Input at right","Not Applicable","Not Applicable","Not Applicable"]
{"$rows_left_out":24}
{"sheet":"Revisions","index":3,"n_rows":13,"n_cols":4,"rows_kept":13,"cut":false,"hidden":true,"merged":[]}
["Date","Changes","By","Comment"]
["2005-05-02","Added \"Spec. Strengths\" tab.","Jennifer Moore "]
["2005-05-02","Added row 27 information on \"Tex-415,18,24, & 48-A\" tab.","Jennifer Moore "]
["2005-05-02","Added conditional formatting to slump section of \"Tex-415,18,24 & 48-A\" tab.","Jennifer Moore "]
["2005-05-02","Added to validations list for Field4. ","Jennifer Moore "]
["2005-05-03","Fixed macro for hiding different sections on \"Tex-415,18,24 & 48-A\" tab.","Joe Liu"]
["2005-05-25","Sheet L to D Lookup cell D2,D3,D4 Unprotect, Add fields 151,152,153","Joe Liu"]
["2005-07-18","Added comment to E27.","Jennifer Moore "]
["2005-07-18","Added conditional formatting to cells K32:K39","Jennifer Moore "]
["2005-07-26","Correction formulas for cells L32:39","Jennifer Moore "]
["2005-08-01","Corrected formulas for cells I57:I64","Stephen Guerra"]
["2005-09-26","Add Mix Design - Field 156","Joe Liu"]
["2011-06-27","Added FF to the grade picklist.","Stewart"]

{"sheet":"L to D Lookup","index":4,"n_rows":112,"n_cols":6,"rows_kept":112,"cut":false,"hidden":true,"merged":[[0,2,0,3]]}
["Length to Diameter Ratio","Correction Factor","Display These Test Methods",null,"English MOR","Metric MOR"]
[1,0.87,"flexural",null,{"$f":"IF(ISERROR(IF('Tex-415,18,24,48-A'!$H58>('Tex-415,18,24,48-A'!$F58*0.05),\"RETEST\",IF('Tex-415,18,24,48-A'!H58=0,((('Tex-415,18,24,48-A'!$G58*6^3/'Tex-415,18,24,48-A'!F58)*'Tex-415,18,24,48-A'!$F58)/('Tex-415,18,24,48-A'!$D58*'Tex-415,18,24,48-A'!$E58^2)),3*((('Tex-415,18,24,48-A'!$G58*6^3/'Tex-415,18,24,48-A'!F58)*('Tex-415,18,24,48-A'!F58/3-'Tex-415,18,24,48-A'!$H58))/('Tex-415,18,24,48-A'!$D58*'Tex-415,18,24,48-A'!$E58^2))))),\"\",IF('Tex-415,18,24,48-A'!$H58>('Tex-415,18,24,48-A'!$F58*0.05),\"RETEST\",IF('Tex-415,18,24,48-A'!H58=0,((('Tex-415,18,24,48-A'!$G58*6^3/'Tex-415,18,24,48-A'!F58)*'Tex-415,18,24,48-A'!$F58)/('Tex-415,18,24,48-A'!$D58*'Tex-415,18,24,48-A'!$E58^2)),3*((('Tex-415,18,24,48-A'!$G58*6^3/'Tex-415,18,24,48-A'!F58)*('Tex-415,18,24,48-A'!F58/3-'Tex-415,18,24,48-A'!$H58))/('Tex-415,18,24,48-A'!$D58*'Tex-415,18,24,48-A'!$E58^2)))))","v":""},{"$f":"IF(ISERROR(IF('Tex-415,18,24,48-A'!$H58>('Tex-415,18,24,48-A'!$F58*0.05),\"RETEST\",IF('Tex-415,18,24,48-A'!H58=0,(((('Tex-415,18,24,48-A'!$G58*1000)*('Tex-415,18,24,48-A'!$F58))/(('Tex-415,18,24,48-A'!$D58)*(('Tex-415,18,24,48-A'!$E58))^2))),(3*((('Tex-415,18,24,48-A'!$G58*1000)*('Tex-415,18,24,48-A'!F58/3-'Tex-415,18,24,48-A'!$H58))/('Tex-415,18,24,48-A'!$D58*'Tex-415,18,24,48-A'!$E58^2)))))),\"\",IF('Tex-415,18,24,48-A'!$H58>('Tex-415,18,24,48-A'!$F58*0.05),\"RETEST\",IF('Tex-415,18,24,48-A'!H58=0,(((('Tex-415,18,24,48-A'!$G58*1000)*('Tex-415,18,24,48-A'!$F58))/(('Tex-415,18,24,48-A'!$D58)*(('Tex-415,18,24,48-A'!$E58))^2))),(3*((('Tex-415,18,24,48-A'!$G58*1000)*('Tex-415,18,24,48-A'!F58/3-'Tex-415,18,24,48-A'!$H58))/('Tex-415,18,24,48-A'!$D58*'Tex-415,18,24,48-A'!$E58^2))))))","v":""}]
[1.01,0.872,"compressive",null,{"$f":"IF(ISERROR(IF('Tex-415,18,24,48-A'!$H59>('Tex-415,18,24,48-A'!$F59*0.05),\"RETEST\",IF('Tex-415,18,24,48-A'!H59=0,((('Tex-415,18,24,48-A'!$G59*6^3/'Tex-415,18,24,48-A'!F59)*'Tex-415,18,24,48-A'!$F59)/('Tex-415,18,24,48-A'!$D59*'Tex-415,18,24,48-A'!$E59^2)),3*((('Tex-415,18,24,48-A'!$G59*6^3/'Tex-415,18,24,48-A'!F59)*('Tex-415,18,24,48-A'!F59/3-'Tex-415,18,24,48-A'!$H59))/('Tex-415,18,24,48-A'!$D59*'Tex-415,18,24,48-A'!$E59^2))))),\"\",IF('Tex-415,18,24,48-A'!$H59>('Tex-415,18,24,48-A'!$F59*0.05),\"RETEST\",IF('Tex-415,18,24,48-A'!H59=0,((('Tex-415,18,24,48-A'!$G59*6^3/'Tex-415,18,24,48-A'!F59)*'Tex-415,18,24,48-A'!$F59)/('Tex-415,18,24,48-A'!$D59*'Tex-415,18,24,48-A'!$E59^2)),3*((('Tex-415,18,24,48-A'!$G59*6^3/'Tex-415,18,24,48-A'!F59)*('Tex-415,18,24,48-A'!F59/3-'Tex-415,18,24,48-A'!$H59))/('Tex-415,18,24,48-A'!$D59*'Tex-415,18,24,48-A'!$E59^2)))))","v":""},{"$f":"IF(ISERROR(IF('Tex-415,18,24,48-A'!$H59>('Tex-415,18,24,48-A'!$F59*0.05),\"RETEST\",IF('Tex-415,18,24,48-A'!H59=0,(((('Tex-415,18,24,48-A'!$G59*1000)*('Tex-415,18,24,48-A'!$F59))/(('Tex-415,18,24,48-A'!$D59)*(('Tex-415,18,24,48-A'!$E59))^2))),(3*((('Tex-415,18,24,48-A'!$G59*1000)*('Tex-415,18,24,48-A'!F59/3-'Tex-415,18,24,48-A'!$H59))/('Tex-415,18,24,48-A'!$D59*'Tex-415,18,24,48-A'!$E59^2)))))),\"\",IF('Tex-415,18,24,48-A'!$H59>('Tex-415,18,24,48-A'!$F59*0.05),\"RETEST\",IF('Tex-415,18,24,48-A'!H59=0,(((('Tex-415,18,24,48-A'!$G59*1000)*('Tex-415,18,24,48-A'!$F59))/(('Tex-415,18,24,48-A'!$D59)*(('Tex-415,18,24,48-A'!$E59))^2))),(3*((('Tex-415,18,24,48-A'!$G59*1000)*('Tex-415,18,24,48-A'!F59/3-'Tex-415,18,24,48-A'!$H59))/('Tex-415,18,24,48-A'!$D59*'Tex-415,18,24,48-A'!$E59^2))))))","v":""}]
[1.02,0.875,"drilled cores",null,{"$f":"IF(ISERROR(IF('Tex-415,18,24,48-A'!$H60>('Tex-415,18,24,48-A'!$F60*0.05),\"RETEST\",IF('Tex-415,18,24,48-A'!H60=0,((('Tex-415,18,24,48-A'!$G60*6^3/'Tex-415,18,24,48-A'!F60)*'Tex-415,18,24,48-A'!$F60)/('Tex-415,18,24,48-A'!$D60*'Tex-415,18,24,48-A'!$E60^2)),3*((('Tex-415,18,24,48-A'!$G60*6^3/'Tex-415,18,24,48-A'!F60)*('Tex-415,18,24,48-A'!F60/3-'Tex-415,18,24,48-A'!$H60))/('Tex-415,18,24,48-A'!$D60*'Tex-415,18,24,48-A'!$E60^2))))),\"\",IF('Tex-415,18,24,48-A'!$H60>('Tex-415,18,24,48-A'!$F60*0.05),\"RETEST\",IF('Tex-415,18,24,48-A'!H60=0,((('Tex-415,18,24,48-A'!$G60*6^3/'Tex-415,18,24,48-A'!F60)*'Tex-415,18,24,48-A'!$F60)/('Tex-415,18,24,48-A'!$D60*'Tex-415,18,24,48-A'!$E60^2)),3*((('Tex-415,18,24,48-A'!$G60*6^3/'Tex-415,18,24,48-A'!F60)*('Tex-415,18,24,48-A'!F60/3-'Tex-415,18,24,48-A'!$H60))/('Tex-415,18,24,48-A'!$D60*'Tex-415,18,24,48-A'!$E60^2)))))","v":""},{"$f":"IF(ISERROR(IF('Tex-415,18,24,48-A'!$H60>('Tex-415,18,24,48-A'!$F60*0.05),\"RETEST\",IF('Tex-415,18,24,48-A'!H60=0,(((('Tex-415,18,24,48-A'!$G60*1000)*('Tex-415,18,24,48-A'!$F60))/(('Tex-415,18,24,48-A'!$D60)*(('Tex-415,18,24,48-A'!$E60))^2))),(3*((('Tex-415,18,24,48-A'!$G60*1000)*('Tex-415,18,24,48-A'!F60/3-'Tex-415,18,24,48-A'!$H60))/('Tex-415,18,24,48-A'!$D60*'Tex-415,18,24,48-A'!$E60^2)))))),\"\",IF('Tex-415,18,24,48-A'!$H60>('Tex-415,18,24,48-A'!$F60*0.05),\"RETEST\",IF('Tex-415,18,24,48-A'!H60=0,(((('Tex-415,18,24,48-A'!$G60*1000)*('Tex-415,18,24,48-A'!$F60))/(('Tex-415,18,24,48-A'!$D60)*(('Tex-415,18,24,48-A'!$E60))^2))),(3*((('Tex-415,18,24,48-A'!$G60*1000)*('Tex-415,18,24,48-A'!F60/3-'Tex-415,18,24,48-A'!$H60))/('Tex-415,18,24,48-A'!$D60*'Tex-415,18,24,48-A'!$E60^2))))))","v":""}]
[1.03,0.877,null,null,{"$f":"IF(ISERROR(IF('Tex-415,18,24,48-A'!$H61>('Tex-415,18,24,48-A'!$F61*0.05),\"RETEST\",IF('Tex-415,18,24,48-A'!H61=0,((('Tex-415,18,24,48-A'!$G61*6^3/'Tex-415,18,24,48-A'!F61)*'Tex-415,18,24,48-A'!$F61)/('Tex-415,18,24,48-A'!$D61*'Tex-415,18,24,48-A'!$E61^2)),3*((('Tex-415,18,24,48-A'!$G61*6^3/'Tex-415,18,24,48-A'!F61)*('Tex-415,18,24,48-A'!F61/3-'Tex-415,18,24,48-A'!$H61))/('Tex-415,18,24,48-A'!$D61*'Tex-415,18,24,48-A'!$E61^2))))),\"\",IF('Tex-415,18,24,48-A'!$H61>('Tex-415,18,24,48-A'!$F61*0.05),\"RETEST\",IF('Tex-415,18,24,48-A'!H61=0,((('Tex-415,18,24,48-A'!$G61*6^3/'Tex-415,18,24,48-A'!F61)*'Tex-415,18,24,48-A'!$F61)/('Tex-415,18,24,48-A'!$D61*'Tex-415,18,24,48-A'!$E61^2)),3*((('Tex-415,18,24,48-A'!$G61*6^3/'Tex-415,18,24,48-A'!F61)*('Tex-415,18,24,48-A'!F61/3-'Tex-415,18,24,48-A'!$H61))/('Tex-415,18,24,48-A'!$D61*'Tex-415,18,24,48-A'!$E61^2)))))","v":""},{"$f":"IF(ISERROR(IF('Tex-415,18,24,48-A'!$H61>('Tex-415,18,24,48-A'!$F61*0.05),\"RETEST\",IF('Tex-415,18,24,48-A'!H61=0,(((('Tex-415,18,24,48-A'!$G61*1000)*('Tex-415,18,24,48-A'!$F61))/(('Tex-415,18,24,48-A'!$D61)*(('Tex-415,18,24,48-A'!$E61))^2))),(3*((('Tex-415,18,24,48-A'!$G61*1000)*('Tex-415,18,24,48-A'!F61/3-'Tex-415,18,24,48-A'!$H61))/('Tex-415,18,24,48-A'!$D61*'Tex-415,18,24,48-A'!$E61^2)))))),\"\",IF('Tex-415,18,24,48-A'!$H61>('Tex-415,18,24,48-A'!$F61*0.05),\"RETEST\",IF('Tex-415,18,24,48-A'!H61=0,(((('Tex-415,18,24,48-A'!$G61*1000)*('Tex-415,18,24,48-A'!$F61))/(('Tex-415,18,24,48-A'!$D61)*(('Tex-415,18,24,48-A'!$E61))^2))),(3*((('Tex-415,18,24,48-A'!$G61*1000)*('Tex-415,18,24,48-A'!F61/3-'Tex-415,18,24,48-A'!$H61))/('Tex-415,18,24,48-A'!$D61*'Tex-415,18,24,48-A'!$E61^2))))))","v":""}]
[1.04,0.88,null,null,{"$f":"IF(ISERROR(IF('Tex-415,18,24,48-A'!$H62>('Tex-415,18,24,48-A'!$F62*0.05),\"RETEST\",IF('Tex-415,18,24,48-A'!H62=0,((('Tex-415,18,24,48-A'!$G62*6^3/'Tex-415,18,24,48-A'!F62)*'Tex-415,18,24,48-A'!$F62)/('Tex-415,18,24,48-A'!$D62*'Tex-415,18,24,48-A'!$E62^2)),3*((('Tex-415,18,24,48-A'!$G62*6^3/'Tex-415,18,24,48-A'!F62)*('Tex-415,18,24,48-A'!F62/3-'Tex-415,18,24,48-A'!$H62))/('Tex-415,18,24,48-A'!$D62*'Tex-415,18,24,48-A'!$E62^2))))),\"\",IF('Tex-415,18,24,48-A'!$H62>('Tex-415,18,24,48-A'!$F62*0.05),\"RETEST\",IF('Tex-415,18,24,48-A'!H62=0,((('Tex-415,18,24,48-A'!$G62*6^3/'Tex-415,18,24,48-A'!F62)*'Tex-415,18,24,48-A'!$F62)/('Tex-415,18,24,48-A'!$D62*'Tex-415,18,24,48-A'!$E62^2)),3*((('Tex-415,18,24,48-A'!$G62*6^3/'Tex-415,18,24,48-A'!F62)*('Tex-415,18,24,48-A'!F62/3-'Tex-415,18,24,48-A'!$H62))/('Tex-415,18,24,48-A'!$D62*'Tex-415,18,24,48-A'!$E62^2)))))","v":""},{"$f":"IF(ISERROR(IF('Tex-415,18,24,48-A'!$H62>('Tex-415,18,24,48-A'!$F62*0.05),\"RETEST\",IF('Tex-415,18,24,48-A'!H62=0,(((('Tex-415,18,24,48-A'!$G62*1000)*('Tex-415,18,24,48-A'!$F62))/(('Tex-415,18,24,48-A'!$D62)*(('Tex-415,18,24,48-A'!$E62))^2))),(3*((('Tex-415,18,24,48-A'!$G62*1000)*('Tex-415,18,24,48-A'!F62/3-'Tex-415,18,24,48-A'!$H62))/('Tex-415,18,24,48-A'!$D62*'Tex-415,18,24,48-A'!$E62^2)))))),\"\",IF('Tex-415,18,24,48-A'!$H62>('Tex-415,18,24,48-A'!$F62*0.05),\"RETEST\",IF('Tex-415,18,24,48-A'!H62=0,(((('Tex-415,18,24,48-A'!$G62*1000)*('Tex-415,18,24,48-A'!$F62))/(('Tex-415,18,24,48-A'!$D62)*(('Tex-415,18,24,48-A'!$E62))^2))),(3*((('Tex-415,18,24,48-A'!$G62*1000)*('Tex-415,18,24,48-A'!F62/3-'Tex-415,18,24,48-A'!$H62))/('Tex-415,18,24,48-A'!$D62*'Tex-415,18,24,48-A'!$E62^2))))))","v":""}]
[1.05,0.88200000000000001,null,null,{"$f":"IF(ISERROR(IF('Tex-415,18,24,48-A'!$H63>('Tex-415,18,24,48-A'!$F63*0.05),\"RETEST\",IF('Tex-415,18,24,48-A'!H63=0,((('Tex-415,18,24,48-A'!$G63*6^3/'Tex-415,18,24,48-A'!F63)*'Tex-415,18,24,48-A'!$F63)/('Tex-415,18,24,48-A'!$D63*'Tex-415,18,24,48-A'!$E63^2)),3*((('Tex-415,18,24,48-A'!$G63*6^3/'Tex-415,18,24,48-A'!F63)*('Tex-415,18,24,48-A'!F63/3-'Tex-415,18,24,48-A'!$H63))/('Tex-415,18,24,48-A'!$D63*'Tex-415,18,24,48-A'!$E63^2))))),\"\",IF('Tex-415,18,24,48-A'!$H63>('Tex-415,18,24,48-A'!$F63*0.05),\"RETEST\",IF('Tex-415,18,24,48-A'!H63=0,((('Tex-415,18,24,48-A'!$G63*6^3/'Tex-415,18,24,48-A'!F63)*'Tex-415,18,24,48-A'!$F63)/('Tex-415,18,24,48-A'!$D63*'Tex-415,18,24,48-A'!$E63^2)),3*((('Tex-415,18,24,48-A'!$G63*6^3/'Tex-415,18,24,48-A'!F63)*('Tex-415,18,24,48-A'!F63/3-'Tex-415,18,24,48-A'!$H63))/('Tex-415,18,24,48-A'!$D63*'Tex-415,18,24,48-A'!$E63^2)))))","v":""},{"$f":"IF(ISERROR(IF('Tex-415,18,24,48-A'!$H63>('Tex-415,18,24,48-A'!$F63*0.05),\"RETEST\",IF('Tex-415,18,24,48-A'!H63=0,(((('Tex-415,18,24,48-A'!$G63*1000)*('Tex-415,18,24,48-A'!$F63))/(('Tex-415,18,24,48-A'!$D63)*(('Tex-415,18,24,48-A'!$E63))^2))),(3*((('Tex-415,18,24,48-A'!$G63*1000)*('Tex-415,18,24,48-A'!F63/3-'Tex-415,18,24,48-A'!$H63))/('Tex-415,18,24,48-A'!$D63*'Tex-415,18,24,48-A'!$E63^2)))))),\"\",IF('Tex-415,18,24,48-A'!$H63>('Tex-415,18,24,48-A'!$F63*0.05),\"RETEST\",IF('Tex-415,18,24,48-A'!H63=0,(((('Tex-415,18,24,48-A'!$G63*1000)*('Tex-415,18,24,48-A'!$F63))/(('Tex-415,18,24,48-A'!$D63)*(('Tex-415,18,24,48-A'!$E63))^2))),(3*((('Tex-415,18,24,48-A'!$G63*1000)*('Tex-415,18,24,48-A'!F63/3-'Tex-415,18,24,48-A'!$H63))/('Tex-415,18,24,48-A'!$D63*'Tex-415,18,24,48-A'!$E63^2))))))","v":""}]
[1.06,0.88400000000000001,null,null,{"$f":"IF(ISERROR(IF('Tex-415,18,24,48-A'!$H64>('Tex-415,18,24,48-A'!$F64*0.05),\"RETEST\",IF('Tex-415,18,24,48-A'!H64=0,((('Tex-415,18,24,48-A'!$G64*6^3/'Tex-415,18,24,48-A'!F64)*'Tex-415,18,24,48-A'!$F64)/('Tex-415,18,24,48-A'!$D64*'Tex-415,18,24,48-A'!$E64^2)),3*((('Tex-415,18,24,48-A'!$G64*6^3/'Tex-415,18,24,48-A'!F64)*('Tex-415,18,24,48-A'!F64/3-'Tex-415,18,24,48-A'!$H64))/('Tex-415,18,24,48-A'!$D64*'Tex-415,18,24,48-A'!$E64^2))))),\"\",IF('Tex-415,18,24,48-A'!$H64>('Tex-415,18,24,48-A'!$F64*0.05),\"RETEST\",IF('Tex-415,18,24,48-A'!H64=0,((('Tex-415,18,24,48-A'!$G64*6^3/'Tex-415,18,24,48-A'!F64)*'Tex-415,18,24,48-A'!$F64)/('Tex-415,18,24,48-A'!$D64*'Tex-415,18,24,48-A'!$E64^2)),3*((('Tex-415,18,24,48-A'!$G64*6^3/'Tex-415,18,24,48-A'!F64)*('Tex-415,18,24,48-A'!F64/3-'Tex-415,18,24,48-A'!$H64))/('Tex-415,18,24,48-A'!$D64*'Tex-415,18,24,48-A'!$E64^2)))))","v":""},{"$f":"IF(ISERROR(IF('Tex-415,18,24,48-A'!$H64>('Tex-415,18,24,48-A'!$F64*0.05),\"RETEST\",IF('Tex-415,18,24,48-A'!H64=0,(((('Tex-415,18,24,48-A'!$G64*1000)*('Tex-415,18,24,48-A'!$F64))/(('Tex-415,18,24,48-A'!$D64)*(('Tex-415,18,24,48-A'!$E64))^2))),(3*((('Tex-415,18,24,48-A'!$G64*1000)*('Tex-415,18,24,48-A'!F64/3-'Tex-415,18,24,48-A'!$H64))/('Tex-415,18,24,48-A'!$D64*'Tex-415,18,24,48-A'!$E64^2)))))),\"\",IF('Tex-415,18,24,48-A'!$H64>('Tex-415,18,24,48-A'!$F64*0.05),\"RETEST\",IF('Tex-415,18,24,48-A'!H64=0,(((('Tex-415,18,24,48-A'!$G64*1000)*('Tex-415,18,24,48-A'!$F64))/(('Tex-415,18,24,48-A'!$D64)*(('Tex-415,18,24,48-A'!$E64))^2))),(3*((('Tex-415,18,24,48-A'!$G64*1000)*('Tex-415,18,24,48-A'!F64/3-'Tex-415,18,24,48-A'!$H64))/('Tex-415,18,24,48-A'!$D64*'Tex-415,18,24,48-A'!$E64^2))))))","v":""}]
[1.07,0.88700000000000001,null,null,{"$f":"IF(ISERROR(IF('Tex-415,18,24,48-A'!$H65>('Tex-415,18,24,48-A'!$F65*0.05),\"RETEST\",IF('Tex-415,18,24,48-A'!H65=0,((('Tex-415,18,24,48-A'!$G65*6^3/'Tex-415,18,24,48-A'!F65)*'Tex-415,18,24,48-A'!$F65)/('Tex-415,18,24,48-A'!$D65*'Tex-415,18,24,48-A'!$E65^2)),3*((('Tex-415,18,24,48-A'!$G65*6^3/'Tex-415,18,24,48-A'!F65)*('Tex-415,18,24,48-A'!F65/3-'Tex-415,18,24,48-A'!$H65))/('Tex-415,18,24,48-A'!$D65*'Tex-415,18,24,48-A'!$E65^2))))),\"\",IF('Tex-415,18,24,48-A'!$H65>('Tex-415,18,24,48-A'!$F65*0.05),\"RETEST\",IF('Tex-415,18,24,48-A'!H65=0,((('Tex-415,18,24,48-A'!$G65*6^3/'Tex-415,18,24,48-A'!F65)*'Tex-415,18,24,48-A'!$F65)/('Tex-415,18,24,48-A'!$D65*'Tex-415,18,24,48-A'!$E65^2)),3*((('Tex-415,18,24,48-A'!$G65*6^3/'Tex-415,18,24,48-A'!F65)*('Tex-415,18,24,48-A'!F65/3-'Tex-415,18,24,48-A'!$H65))/('Tex-415,18,24,48-A'!$D65*'Tex-415,18,24,48-A'!$E65^2)))))","v":""},{"$f":"IF(ISERROR(IF('Tex-415,18,24,48-A'!$H65>('Tex-415,18,24,48-A'!$F65*0.05),\"RETEST\",IF('Tex-415,18,24,48-A'!H65=0,(((('Tex-415,18,24,48-A'!$G65*1000)*('Tex-415,18,24,48-A'!$F65))/(('Tex-415,18,24,48-A'!$D65)*(('Tex-415,18,24,48-A'!$E65))^2))),(3*((('Tex-415,18,24,48-A'!$G65*1000)*('Tex-415,18,24,48-A'!F65/3-'Tex-415,18,24,48-A'!$H65))/('Tex-415,18,24,48-A'!$D65*'Tex-415,18,24,48-A'!$E65^2)))))),\"\",IF('Tex-415,18,24,48-A'!$H65>('Tex-415,18,24,48-A'!$F65*0.05),\"RETEST\",IF('Tex-415,18,24,48-A'!H65=0,(((('Tex-415,18,24,48-A'!$G65*1000)*('Tex-415,18,24,48-A'!$F65))/(('Tex-415,18,24,48-A'!$D65)*(('Tex-415,18,24,48-A'!$E65))^2))),(3*((('Tex-415,18,24,48-A'!$G65*1000)*('Tex-415,18,24,48-A'!F65/3-'Tex-415,18,24,48-A'!$H65))/('Tex-415,18,24,48-A'!$D65*'Tex-415,18,24,48-A'!$E65^2))))))","v":""}]
[1.08,0.88900000000000001]
[1.0900000000000001,0.89200000000000002,null,null,"English f'c","Metric f'c"]
[1.1000000000000001,0.89400000000000002,null,null,{"$f":"IF(ISERROR('Tex-415,18,24,48-A'!$I33*('Tex-415,18,24,48-A'!$G33/(PI()*(IF(CircumDiameter1=\"circumference\",SQRT('Tex-415,18,24,48-A'!$D33/PI())*2,'Tex-415,18,24,48-A'!$D33)^2/4)))),\"\",'Tex-415,18,24,48-A'!$I33*('Tex-415,18,24,48-A'!$G33/(PI()*(IF(CircumDiameter1=\"circumference\",SQRT('Tex-415,18,24,48-A'!$D33/PI())*2,'Tex-415,18,24,48-A'!$D33)^2/4))))","v":""},{"$f":"IF(ISERROR(0.000001*('Tex-415,18,24,48-A'!$I33*('Tex-415,18,24,48-A'!$G33/(PI()*((IF(CircumDiameter1=\"circumference\",SQRT('Tex-415,18,24,48-A'!$D33/PI())*2,'Tex-415,18,24,48-A'!$D33)/1000)^2/4))))),\"\",0.000001*('Tex-415,18,24,48-A'!$I33*('Tex-415,18,24,48-A'!$G33/(PI()*((IF(CircumDiameter1=\"circumference\",SQRT('Tex-415,18,24,48-A'!$D33/PI())*2,'Tex-415,18,24,48-A'!$D33)/1000)^2/4)))))","v":""}]
[1.1100000000000001,0.89600000000000002,null,null,{"$f":"IF(ISERROR('Tex-415,18,24,48-A'!$I34*('Tex-415,18,24,48-A'!$G34/(PI()*(IF(CircumDiameter1=\"circumference\",SQRT('Tex-415,18,24,48-A'!$D34/PI())*2,'Tex-415,18,24,48-A'!$D34)^2/4)))),\"\",'Tex-415,18,24,48-A'!$I34*('Tex-415,18,24,48-A'!$G34/(PI()*(IF(CircumDiameter1=\"circumference\",SQRT('Tex-415,18,24,48-A'!$D34/PI())*2,'Tex-415,18,24,48-A'!$D34)^2/4))))","v":""},{"$f":"IF(ISERROR(0.000001*('Tex-415,18,24,48-A'!$I34*('Tex-415,18,24,48-A'!$G34/(PI()*((IF(CircumDiameter1=\"circumference\",SQRT('Tex-415,18,24,48-A'!$D34/PI())*2,'Tex-415,18,24,48-A'!$D34)/1000)^2/4))))),\"\",0.000001*('Tex-415,18,24,48-A'!$I34*('Tex-415,18,24,48-A'!$G34/(PI()*((IF(CircumDiameter1=\"circumference\",SQRT('Tex-415,18,24,48-A'!$D34/PI())*2,'Tex-415,18,24,48-A'!$D34)/1000)^2/4)))))","v":""}]
[1.1200000000000001,0.89900000000000002,null,null,{"$f":"IF(ISERROR('Tex-415,18,24,48-A'!$I35*('Tex-415,18,24,48-A'!$G35/(PI()*(IF(CircumDiameter1=\"circumference\",SQRT('Tex-415,18,24,48-A'!$D35/PI())*2,'Tex-415,18,24,48-A'!$D35)^2/4)))),\"\",'Tex-415,18,24,48-A'!$I35*('Tex-415,18,24,48-A'!$G35/(PI()*(IF(CircumDiameter1=\"circumference\",SQRT('Tex-415,18,24,48-A'!$D35/PI())*2,'Tex-415,18,24,48-A'!$D35)^2/4))))","v":""},{"$f":"IF(ISERROR(0.000001*('Tex-415,18,24,48-A'!$I35*('Tex-415,18,24,48-A'!$G35/(PI()*((IF(CircumDiameter1=\"circumference\",SQRT('Tex-415,18,24,48-A'!$D35/PI())*2,'Tex-415,18,24,48-A'!$D35)/1000)^2/4))))),\"\",0.000001*('Tex-415,18,24,48-A'!$I35*('Tex-415,18,24,48-A'!$G35/(PI()*((IF(CircumDiameter1=\"circumference\",SQRT('Tex-415,18,24,48-A'!$D35/PI())*2,'Tex-415,18,24,48-A'!$D35)/1000)^2/4)))))","v":""}]
[1.1299999999999999,0.90100000000000002,null,null,{"$f":"IF(ISERROR('Tex-415,18,24,48-A'!$I36*('Tex-415,18,24,48-A'!$G36/(PI()*(IF(CircumDiameter1=\"circumference\",SQRT('Tex-415,18,24,48-A'!$D36/PI())*2,'Tex-415,18,24,48-A'!$D36)^2/4)))),\"\",'Tex-415,18,24,48-A'!$I36*('Tex-415,18,24,48-A'!$G36/(PI()*(IF(CircumDiameter1=\"circumference\",SQRT('Tex-415,18,24,48-A'!$D36/PI())*2,'Tex-415,18,24,48-A'!$D36)^2/4))))","v":""},{"$f":"IF(ISERROR(0.000001*('Tex-415,18,24,48-A'!$I36*('Tex-415,18,24,48-A'!$G36/(PI()*((IF(CircumDiameter1=\"circumference\",SQRT('Tex-415,18,24,48-A'!$D36/PI())*2,'Tex-415,18,24,48-A'!$D36)/1000)^2/4))))),\"\",0.000001*('Tex-415,18,24,48-A'!$I36*('Tex-415,18,24,48-A'!$G36/(PI()*((IF(CircumDiameter1=\"circumference\",SQRT('Tex-415,18,24,48-A'!$D36/PI())*2,'Tex-415,18,24,48-A'!$D36)/1000)^2/4)))))","v":""}]
{"$rows_left_out":97}