{"text_format":"1","workbook":"xlsx","n_sheets":3,"sheets":["Tex-423-A","RX","reference"],"not_rendered":{"charts":0,"images":1,"macros":1,"external_links":0,"defined_names":1333,"comments":1,"pivot_tables":0},"unopened":[],"bounds":{"document_bytes":16777216,"sheet_cells":100000,"rows_first":2000,"rows_last":500,"rows_between":2000,"halvings":0,"cell_chars":16384,"cell_head_chars":4096},"cells_cut":0,"cells_raw":0,"read":"whole","date_system":"1900"}

{"sheet":"Tex-423-A","index":0,"n_rows":152,"n_cols":31,"rows_kept":152,"cut":false,"hidden":false,"merged":[[26,12,26,13],[18,6,18,7],[22,6,22,9],[149,1,149,2],[151,1,151,6],[38,1,38,15],[37,1,37,15],[149,3,149,4],[149,5,149,6],[149,7,149,8],[151,7,151,8],[42,8,42,13],[40,9,40,10],[42,6,42,7],[39,3,39,7],[42,4,42,5],[7,14,7,15],[8,14,8,15],[7,4,7,9],[10,4,10,9],[11,4,11,9],[7,10,7,13],[8,10,8,13],[9,10,9,13],[10,10,10,13],[11,10,11,13],[12,10,12,13],[13,10,13,13],[13,1,13,3],[24,12,25,13],[24,6,24,11],[18,4,18,5],[22,3,22,4],[24,2,25,5],[16,10,16,13],[16,4,16,9],[15,4,15,15],[16,14,16,15],[18,1,18,3],[24,1,25,1],[25,6,25,7],[42,1,42,3],[27,10,27,11],[35,1,36,15],[40,1,40,2],[27,12,27,13],[27,14,27,15],[40,3,40,8],[27,6,27,7],[27,8,27,9],[27,2,27,5],[26,14,26,15],[26,8,26,9],[9,14,9,15],[10,14,10,15],[11,14,11,15],[14,4,14,15],[12,14,12,15],[13,14,13,15],[18,13,18,15],[26,6,26,7],[25,10,25,11],[24,14,25,15],[25,8,25,9],[18,8,18,10],[26,10,26,11],[26,2,26,5],[0,3,0,4],[11,1,11,3],[12,1,12,3],[16,1,16,3],[7,1,7,3],[8,1,8,3],[9,1,9,3],[10,1,10,3],[14,1,14,3],[15,1,15,3],[8,4,8,9],[9,4,9,9],[12,4,12,9],[13,4,13,9]]}
["TxDOT Manuals >",null,null,"Tex-423-A"]
[null,"TEXAS DEPARTMENT OF TRANSPORTATION",null,null,null,null,null,null,null,null,null,null,null,null,null,null,null,null,null,null,null,null,null,null,null,null,null,null,null,null,20]
[null,null,null,null,null,null,null,null,null,null,null,null,null,null,null,null,null,null,null,null,null,null,null,null,null,null,null,null,null,null,1]
[null,null,null,null,null,null,null,null,null,null,null,null,null,null,null,null,null,null,null,null,null,null,null,null,null,null,null,null,null,null,"tx423piii.xlsm::45790.528299"]
[null,"DETERMINING THE DEPTH OF SAW CUT IN CONCRETE PAVEMENT",null,null,null,null,null,null,null,null,null,null,null,null,null,null,null,null,null,null,null,null,null,null,null,null,null,null,null,null,1220]
[null,"Tex-423-A, PART III"]
[null,null,null,null,null,null,null,null,null,null,null,null,null,null,null,{"$f":"\"File Version: \" & TEXT(MID(sn,SEARCH(\"::\",sn,1)+2,20),\"mm/dd/yy hh:mm:ss\")","v":"File Version: 05/13/25 12:40:45"}]
[null,"SAMPLE ID:",null,null,null,null,null,null,null,null,"SAMPLED DATE:"]
[null,"TEST NUMBER:",null,null,null,null,null,null,null,null,"LETTING DATE:"]
[null,"SAMPLE STATUS:",null,null,null,null,null,null,null,null,"CONTROLLING CSJ:",null,null,null,""]
[null,"COUNTY:",null,null,"",null,null,null,null,null,"SPEC YEAR:"]
[null,"SAMPLED BY:",null,null,"",null,null,null,null,null,"SPEC ITEM:",null,null,null,""]
[null,"SAMPLE LOCATION:",null,null,"",null,null,null,null,null,"SPECIAL PROVISION:"]
[null,"MATERIAL CODE:",null,null,null,null,null,null,null,null,"GRADE:"]
[null,"MATERIAL NAME:"]
[null,"PRODUCER:",null,null,""]
[null,"AREA ENGINEER:",null,null,"",null,null,null,null,null,"PROJECT MANAGER:"]
[]
[null,"COURSE\\LIFT:",null,null,null,null,"STATION:",null,null,null,null,null,"DIST. FROM CL:",""]
[]
[null,null,null,null,null,null,null,false]
[]
[null,null,null,null,null,null,{"$f":"\"Pavement Depth\" & IF(Measuredby=\"millimeters\",\", (mm)\",\", (in.)\") & \":\"","v":"Pavement Depth, (in.):"},null,null,null,13,{"$f":"Field8-Field10","v":8.75}]
[]
[null,"SET","Measurement Identification / Location",null,null,null,{"$f":"\"Measurements \" & IF(Measuredby=\"Millimeters\", \"to the nearest 2.0 (mm)\",\"to the nearest 0.1 (in.)\")","v":"Measurements to the nearest 0.1 (in.)"},null,null,null,null,null,{"$f":"\"Average  \" &  IF(Measuredby=\"Millimeters\", \"nearest 3.0 (mm)\",\"nearest 0.1 (in.)\")","v":"Average  nearest 0.1 (in.)"},null,"ACCEPTABLE SAW CUT DEPTH?"]
[null,null,null,null,null,null,1,null,2,null,3]
[null,1,"adfa",null,null,null,4.25,null,null,null,null,null,null,null,{"$f":"IF(G27=\"\", \"\", IF(G27>=(ROUND(K23/3, 1)-0.25), \"ACCEPTABLE\", \"DEFICIENT\"))","v":"ACCEPTABLE"}]
[null,2]
[]
[]
[]
[]
[]
[]
[null,"Remarks:",null,{"$f":"NOW()","v":"2025-05-13T12:41:07.830"}]
[]
[]
[]
[]
[null,"Test Method:",null,"Tested By:",null,null,null,null,null,"Tested Date:"]
[null,"TX423PIII"]
[null,"Test Stamp Code:",null,null,"Omit Test:",null,"Completed Date:",null,"Reviewed By:"]
[]
[null,null,null,"*Required   **Optional   Fields"]
[null,"TEST NUMBER","SET 1 MEASUREMENT LOCATION","MEASURE UNIT","PLANNED PAVEMENT DEPTH\n(inch)","SET 1 MEASUREMENT #1\n(inch)","SET 1 MEASUREMENT #2\n(inch)","SET 1 MEASUREMENT #3\n(inch)","AVERAGE NEAREST 0.1 (in.)","ACCEPTABLE SAW CUT DEPTH?","TX423III - TESTED BY","TEST DATE","STAMP CODE","OMIT INDICATOR","COMPLETE DATE","REMARKS"]
[]
[null,"SMPL_TST_NBR","SET_1_Measurement_Location_9","Measure_Unit_7","Pavement_Depth_8","SET_1_Measurement_1_10","SET_1_Measurement_2_11","SET_1_Measurement_3_12",null,null,"Tested_By_TX423_17","Tested_Date_TX423_18","STMP_CD","OMIT_IND","ACTL_CMPL_DT","Remarks_01","SMPL_ID","TST_METH","Spec_Year_02","Special_Provision_03","Old_Producer_05","course_06","Grade_04","SET_2_Measurement_Location_13","SET_2_Measurement_1_14","SET_2_Measurement_2_15","SET_2_Measurement_3_16","RVWR_UID","Old_Reviewed_By_19","autotemplate_20"]
[{"$f":"IF(COUNTBLANK(C48:P48)=14,0,1)","v":1},"001",null,null,null,null,null,null,{"$f":"IF(AND(ISBLANK(F48), ISBLANK(G48), ISBLANK(H48)), \"\", ROUND(AVERAGE(F48:H48), 2))","v":""},"`",null,null,null,null,null,null,"46080716SDEWITT*01","TX423",null,null,null,null,null,null,null,null,null,null,null,"TRUE"]
[{"$f":"IF(COUNTBLANK(C49:P49)=14,0,1)","v":0},"~AT001    ",null,null,null,null,null,null,{"$f":"IF(AND(ISBLANK(F49), ISBLANK(G49), ISBLANK(H49)), \"\", ROUND(AVERAGE(F49:H49), 2))","v":""},{"$f":"IF(I49=\"\", \"\", IF(I49>=(ROUND(E49/3, 1)-0.25), \"ACCEPTABLE\", \"DEFICIENT\"))","v":""},null,null,null,null,null,null,"46080716SDEWITT*01","TX423"]
[0,"~AT002    ",null,null,null,null,null,null,"","",null,null,null,null,null,null,"46080716SDEWITT*01","TX423"]
[0,"~AT003    ",null,null,null,null,null,null,"","",null,null,null,null,null,null,"46080716SDEWITT*01","TX423"]
[0,"~AT004    ",null,null,null,null,null,null,"","",null,null,null,null,null,null,"46080716SDEWITT*01","TX423"]
[0,"~AT005    ",null,null,null,null,null,null,"","",null,null,null,null,null,null,"46080716SDEWITT*01","TX423"]
[0,"~AT006    ",null,null,null,null,null,null,"","",null,null,null,null,null,null,"46080716SDEWITT*01","TX423"]
[0,"~AT007    ",null,null,null,null,null,null,"","",null,null,null,null,null,null,"46080716SDEWITT*01","TX423"]
[0,"~AT008    ",null,null,null,null,null,null,"","",null,null,null,null,null,null,"46080716SDEWITT*01","TX423"]
[0,"~AT009    ",null,null,null,null,null,null,"","",null,null,null,null,null,null,"46080716SDEWITT*01","TX423"]
[0,"~AT010    ",null,null,null,null,null,null,"","",null,null,null,null,null,null,"46080716SDEWITT*01","TX423"]
[0,"~AT011    ",null,null,null,null,null,null,"","",null,null,null,null,null,null,"46080716SDEWITT*01","TX423"]
[0,"~AT012    ",null,null,null,null,null,null,"","",null,null,null,null,null,null,"46080716SDEWITT*01","TX423"]
[0,"~AT013    ",null,null,null,null,null,null,"","",null,null,null,null,null,null,"46080716SDEWITT*01","TX423"]
[0,"~AT014    ",null,null,null,null,null,null,"","",null,null,null,null,null,null,"46080716SDEWITT*01","TX423"]
[0,"~AT015    ",null,null,null,null,null,null,"","",null,null,null,null,null,null,"46080716SDEWITT*01","TX423"]
[0,"~AT016    ",null,null,null,null,null,null,"","",null,null,null,null,null,null,"46080716SDEWITT*01","TX423"]
[0,"~AT017    ",null,null,null,null,null,null,"","",null,null,null,null,null,null,"46080716SDEWITT*01","TX423"]
[0,"~AT018    ",null,null,null,null,null,null,"","",null,null,null,null,null,null,"46080716SDEWITT*01","TX423"]
[0,"~AT019    ",null,null,null,null,null,null,"","",null,null,null,null,null,null,"46080716SDEWITT*01","TX423"]
[0,"~AT020    ",null,null,null,null,null,null,"","",null,null,null,null,null,null,"46080716SDEWITT*01","TX423"]
[0,"~AT021    ",null,null,null,null,null,null,"","",null,null,null,null,null,null,"46080716SDEWITT*01","TX423"]
[0,"~AT022    ",null,null,null,null,null,null,"","",null,null,null,null,null,null,"46080716SDEWITT*01","TX423"]
[0,"~AT023    ",null,null,null,null,null,null,"","",null,null,null,null,null,null,"46080716SDEWITT*01","TX423"]
[0,"~AT024    ",null,null,null,null,null,null,"","",null,null,null,null,null,null,"46080716SDEWITT*01","TX423"]
[0,"~AT025    ",null,null,null,null,null,null,"","",null,null,null,null,null,null,"46080716SDEWITT*01","TX423"]
[0,"~AT026    ",null,null,null,null,null,null,"","",null,null,null,null,null,null,"46080716SDEWITT*01","TX423"]
[0,"~AT027    ",null,null,null,null,null,null,"","",null,null,null,null,null,null,"46080716SDEWITT*01","TX423"]
[0,"~AT028    ",null,null,null,null,null,null,"","",null,null,null,null,null,null,"46080716SDEWITT*01","TX423"]
[0,"~AT029    ",null,null,null,null,null,null,"","",null,null,null,null,null,null,"46080716SDEWITT*01","TX423"]
[0,"~AT030    ",null,null,null,null,null,null,"","",null,null,null,null,null,null,"46080716SDEWITT*01","TX423"]
[0,"~AT031    ",null,null,null,null,null,null,"","",null,null,null,null,null,null,"46080716SDEWITT*01","TX423"]
[0,"~AT032    ",null,null,null,null,null,null,"","",null,null,null,null,null,null,"46080716SDEWITT*01","TX423"]
[0,"~AT033    ",null,null,null,null,null,null,"","",null,null,null,null,null,null,"46080716SDEWITT*01","TX423"]
[0,"~AT034    ",null,null,null,null,null,null,"","",null,null,null,null,null,null,"46080716SDEWITT*01","TX423"]
[0,"~AT035    ",null,null,null,null,null,null,"","",null,null,null,null,null,null,"46080716SDEWITT*01","TX423"]
[0,"~AT036    ",null,null,null,null,null,null,"","",null,null,null,null,null,null,"46080716SDEWITT*01","TX423"]
[0,"~AT037    ",null,null,null,null,null,null,"","",null,null,null,null,null,null,"46080716SDEWITT*01","TX423"]
[0,"~AT038    ",null,null,null,null,null,null,"","",null,null,null,null,null,null,"46080716SDEWITT*01","TX423"]
[0,"~AT039    ",null,null,null,null,null,null,"","",null,null,null,null,null,null,"46080716SDEWITT*01","TX423"]
[0,"~AT040    ",null,null,null,null,null,null,"","",null,null,null,null,null,null,"46080716SDEWITT*01","TX423"]
[0,"~AT041    ",null,null,null,null,null,null,"","",null,null,null,null,null,null,"46080716SDEWITT*01","TX423"]
[0,"~AT042    ",null,null,null,null,null,null,"","",null,null,null,null,null,null,"46080716SDEWITT*01","TX423"]
[0,"~AT043    ",null,null,null,null,null,null,"","",null,null,null,null,null,null,"46080716SDEWITT*01","TX423"]
[0,"~AT044    ",null,null,null,null,null,null,"","",null,null,null,null,null,null,"46080716SDEWITT*01","TX423"]
[0,"~AT045    ",null,null,null,null,null,null,"","",null,null,null,null,null,null,"46080716SDEWITT*01","TX423"]
[0,"~AT046    ",null,null,null,null,null,null,"","",null,null,null,null,null,null,"46080716SDEWITT*01","TX423"]
[0,"~AT047    ",null,null,null,null,null,null,"","",null,null,null,null,null,null,"46080716SDEWITT*01","TX423"]
[0,"~AT048    ",null,null,null,null,null,null,"","",null,null,null,null,null,null,"46080716SDEWITT*01","TX423"]
[0,"~AT049    ",null,null,null,null,null,null,"","",null,null,null,null,null,null,"46080716SDEWITT*01","TX423"]
[0,"~AT050    ",null,null,null,null,null,null,"","",null,null,null,null,null,null,"46080716SDEWITT*01","TX423"]
[0,"~AT051    ",null,null,null,null,null,null,"","",null,null,null,null,null,null,"46080716SDEWITT*01","TX423"]
[0,"~AT052    ",null,null,null,null,null,null,"","",null,null,null,null,null,null,"46080716SDEWITT*01","TX423"]
[0,"~AT053    ",null,null,null,null,null,null,"","",null,null,null,null,null,null,"46080716SDEWITT*01","TX423"]
[0,"~AT054    ",null,null,null,null,null,null,"","",null,null,null,null,null,null,"46080716SDEWITT*01","TX423"]
[0,"~AT055    ",null,null,null,null,null,null,"","",null,null,null,null,null,null,"46080716SDEWITT*01","TX423"]
[0,"~AT056    ",null,null,null,null,null,null,"","",null,null,null,null,null,null,"46080716SDEWITT*01","TX423"]
[0,"~AT057    ",null,null,null,null,null,null,"","",null,null,null,null,null,null,"46080716SDEWITT*01","TX423"]
[0,"~AT058    ",null,null,null,null,null,null,"","",null,null,null,null,null,null,"46080716SDEWITT*01","TX423"]
[0,"~AT059    ",null,null,null,null,null,null,"","",null,null,null,null,null,null,"46080716SDEWITT*01","TX423"]
[0,"~AT060    ",null,null,null,null,null,null,"","",null,null,null,null,null,null,"46080716SDEWITT*01","TX423"]
[0,"~AT061    ",null,null,null,null,null,null,"","",null,null,null,null,null,null,"46080716SDEWITT*01","TX423"]
[0,"~AT062    ",null,null,null,null,null,null,"","",null,null,null,null,null,null,"46080716SDEWITT*01","TX423"]
[0,"~AT063    ",null,null,null,null,null,null,"","",null,null,null,null,null,null,"46080716SDEWITT*01","TX423"]
[0,"~AT064    ",null,null,null,null,null,null,"","",null,null,null,null,null,null,"46080716SDEWITT*01","TX423"]
[{"$f":"IF(COUNTBLANK(C113:P113)=14,0,1)","v":0},"~AT065    ",null,null,null,null,null,null,{"$f":"IF(AND(ISBLANK(F113), ISBLANK(G113), ISBLANK(H113)), \"\", ROUND(AVERAGE(F113:H113), 2))","v":""},{"$f":"IF(I113=\"\", \"\", IF(I113>=(ROUND(E113/3, 1)-0.25), \"ACCEPTABLE\", \"DEFICIENT\"))","v":""},null,null,null,null,null,null,"46080716SDEWITT*01","TX423"]
[0,"~AT066    ",null,null,null,null,null,null,"","",null,null,null,null,null,null,"46080716SDEWITT*01","TX423"]
[0,"~AT067    ",null,null,null,null,null,null,"","",null,null,null,null,null,null,"46080716SDEWITT*01","TX423"]
[0,"~AT068    ",null,null,null,null,null,null,"","",null,null,null,null,null,null,"46080716SDEWITT*01","TX423"]
[0,"~AT069    ",null,null,null,null,null,null,"","",null,null,null,null,null,null,"46080716SDEWITT*01","TX423"]
[0,"~AT070    ",null,null,null,null,null,null,"","",null,null,null,null,null,null,"46080716SDEWITT*01","TX423"]
[0,"~AT071    ",null,null,null,null,null,null,"","",null,null,null,null,null,null,"46080716SDEWITT*01","TX423"]
[0,"~AT072    ",null,null,null,null,null,null,"","",null,null,null,null,null,null,"46080716SDEWITT*01","TX423"]
[0,"~AT073    ",null,null,null,null,null,null,"","",null,null,null,null,null,null,"46080716SDEWITT*01","TX423"]
[0,"~AT074    ",null,null,null,null,null,null,"","",null,null,null,null,null,null,"46080716SDEWITT*01","TX423"]
[0,"~AT075    ",null,null,null,null,null,null,"","",null,null,null,null,null,null,"46080716SDEWITT*01","TX423"]
[0,"~AT076    ",null,null,null,null,null,null,"","",null,null,null,null,null,null,"46080716SDEWITT*01","TX423"]
[0,"~AT077    ",null,null,null,null,null,null,"","",null,null,null,null,null,null,"46080716SDEWITT*01","TX423"]
[0,"~AT078    ",null,null,null,null,null,null,"","",null,null,null,null,null,null,"46080716SDEWITT*01","TX423"]
[0,"~AT079    ",null,null,null,null,null,null,"","",null,null,null,null,null,null,"46080716SDEWITT*01","TX423"]
[0,"~AT080    ",null,null,null,null,null,null,"","",null,null,null,null,null,null,"46080716SDEWITT*01","TX423"]
[0,"~AT081    ",null,null,null,null,null,null,"","",null,null,null,null,null,null,"46080716SDEWITT*01","TX423"]
[0,"~AT082    ",null,null,null,null,null,null,"","",null,null,null,null,null,null,"46080716SDEWITT*01","TX423"]
[0,"~AT083    ",null,null,null,null,null,null,"","",null,null,null,null,null,null,"46080716SDEWITT*01","TX423"]
[0,"~AT084    ",null,null,null,null,null,null,"","",null,null,null,null,null,null,"46080716SDEWITT*01","TX423"]
[0,"~AT085    ",null,null,null,null,null,null,"","",null,null,null,null,null,null,"46080716SDEWITT*01","TX423"]
[0,"~AT086    ",null,null,null,null,null,null,"","",null,null,null,null,null,null,"46080716SDEWITT*01","TX423"]
[0,"~AT087    ",null,null,null,null,null,null,"","",null,null,null,null,null,null,"46080716SDEWITT*01","TX423"]
[0,"~AT088    ",null,null,null,null,null,null,"","",null,null,null,null,null,null,"46080716SDEWITT*01","TX423"]
[0,"~AT089    ",null,null,null,null,null,null,"","",null,null,null,null,null,null,"46080716SDEWITT*01","TX423"]
[0,"~AT090    ",null,null,null,null,null,null,"","",null,null,null,null,null,null,"46080716SDEWITT*01","TX423"]
[0,"~AT091    ",null,null,null,null,null,null,"","",null,null,null,null,null,null,"46080716SDEWITT*01","TX423"]
[0,"~AT092    ",null,null,null,null,null,null,"","",null,null,null,null,null,null,"46080716SDEWITT*01","TX423"]
[0,"~AT093    ",null,null,null,null,null,null,"","",null,null,null,null,null,null,"46080716SDEWITT*01","TX423"]
[0,"~AT094    ",null,null,null,null,null,null,"","",null,null,null,null,null,null,"46080716SDEWITT*01","TX423"]
[0,"~AT095    ",null,null,null,null,null,null,"","",null,null,null,null,null,null,"46080716SDEWITT*01","TX423"]
[0,"~AT096    ",null,null,null,null,null,null,"","",null,null,null,null,null,null,"46080716SDEWITT*01","TX423"]
[0,"~AT097    ",null,null,null,null,null,null,"","",null,null,null,null,null,null,"46080716SDEWITT*01","TX423"]
[0,"~AT098    ",null,null,null,null,null,null,"","",null,null,null,null,null,null,"46080716SDEWITT*01","TX423"]
[0,"~AT099    ",null,null,null,null,null,null,"","",null,null,null,null,null,null,"46080716SDEWITT*01","TX423"]
[]
[null,"Locked By:",null,"TxDOT:",null,"District:",null,"Area:"]
[null,"",null,"",null,"",null,""]
[null,"Authorized By:",null,null,null,null,null,"Authorized Date:"]
[null,null,null,null,null,null,null,null,null,{"$f":"IF(OR(AuthorizedDate=\"\",AuthorizedDate>=44265), 3, IF(AuthorizedDate>38383,2,1))","v":3}]

{"sheet":"RX","index":1,"n_rows":20,"n_cols":9,"rows_kept":20,"cut":false,"hidden":false,"merged":[]}
[18]
["Fld_nbr","Value","Desc_1","Desc_2","Desc_3","Desc_4","Desc_5","Desc_6","Desc_7"]
[1,{"$f":"IF('Tex-423-A'!$B$36=\"\",\"\",'Tex-423-A'!$B$36)","v":""},{"$f":"'Tex-423-A'!$B$35","v":"Remarks:"}]
[2,{"$f":"IF('Tex-423-A'!$E$19=\"\",\"\",'Tex-423-A'!$E$19)","v":""},{"$f":"IF('Tex-423-A'!$B$19=\"\",\"\",'Tex-423-A'!$B$19)","v":"COURSE\\LIFT:"}]
[3,{"$f":"IF('Tex-423-A'!$D$41=\"\",\"\",'Tex-423-A'!$D$41)","v":""},"Tested By ",{"$f":"IF('Tex-423-A'!$B$41=\"\",\"\",'Tex-423-A'!$B$41)","v":"TX423PIII"}]
[4,{"$f":"IF('Tex-423-A'!$J$41=\"\",\"\",'Tex-423-A'!$J$41)","v":""},"Tested Date ",{"$f":"IF('Tex-423-A'!$B$41=\"\",\"\",'Tex-423-A'!$B$41)","v":"TX423PIII"}]
[5,{"$f":"IF('Tex-423-A'!$D$23=\"\",\"\",'Tex-423-A'!$D$23)","v":""},{"$f":"IF('Tex-423-A'!$B$6=\"\",\"\",'Tex-423-A'!$B$6)","v":"Tex-423-A, PART III"},{"$f":"IF('Tex-423-A'!$C$23=\"\",\"\",'Tex-423-A'!$C$23)","v":""}]
[6,{"$f":"IF('Tex-423-A'!$K$23=\"\",\"\",'Tex-423-A'!$K$23)","v":13},{"$f":"IF('Tex-423-A'!$B$6=\"\",\"\",'Tex-423-A'!$B$6)","v":"Tex-423-A, PART III"},{"$f":"IF('Tex-423-A'!$G$23=\"\",\"\",'Tex-423-A'!$G$23)","v":"Pavement Depth, (in.):"}]
[7,{"$f":"IF('Tex-423-A'!$C$27=\"\",\"\",'Tex-423-A'!$C$27)","v":"adfa"},{"$f":"IF('Tex-423-A'!$B$6=\"\",\"\",'Tex-423-A'!$B$6)","v":"Tex-423-A, PART III"},{"$f":"IF('Tex-423-A'!$B$25=\"\",\"\",'Tex-423-A'!$B$25)","v":"SET"},{"$f":"IF('Tex-423-A'!$B$27=\"\",\"\",'Tex-423-A'!$B$27)","v":1},{"$f":"IF('Tex-423-A'!$C$25=\"\",\"\",'Tex-423-A'!$C$25)","v":"Measurement Identification / Location"}]
[8,{"$f":"IF('Tex-423-A'!$G$27=\"\",\"\",'Tex-423-A'!$G$27)","v":4.25},{"$f":"IF('Tex-423-A'!$B$6=\"\",\"\",'Tex-423-A'!$B$6)","v":"Tex-423-A, PART III"},{"$f":"IF('Tex-423-A'!$B$25=\"\",\"\",'Tex-423-A'!$B$25)","v":"SET"},{"$f":"IF('Tex-423-A'!$B$27=\"\",\"\",'Tex-423-A'!$B$27)","v":1},{"$f":"IF('Tex-423-A'!$G$25=\"\",\"\",'Tex-423-A'!$G$25)","v":"Measurements to the nearest 0.1 (in.)"},{"$f":"IF('Tex-423-A'!$G$26=\"\",\"\",'Tex-423-A'!$G$26)","v":1}]
[9,{"$f":"IF('Tex-423-A'!$I$27=\"\",\"\",'Tex-423-A'!$I$27)","v":""},{"$f":"IF('Tex-423-A'!$B$6=\"\",\"\",'Tex-423-A'!$B$6)","v":"Tex-423-A, PART III"},{"$f":"IF('Tex-423-A'!$B$25=\"\",\"\",'Tex-423-A'!$B$25)","v":"SET"},{"$f":"IF('Tex-423-A'!$B$27=\"\",\"\",'Tex-423-A'!$B$27)","v":1},{"$f":"IF('Tex-423-A'!$G$25=\"\",\"\",'Tex-423-A'!$G$25)","v":"Measurements to the nearest 0.1 (in.)"},{"$f":"IF('Tex-423-A'!$I$26=\"\",\"\",'Tex-423-A'!$I$26)","v":2}]
[10,{"$f":"IF('Tex-423-A'!$K$27=\"\",\"\",'Tex-423-A'!$K$27)","v":""},{"$f":"IF('Tex-423-A'!$B$6=\"\",\"\",'Tex-423-A'!$B$6)","v":"Tex-423-A, PART III"},{"$f":"IF('Tex-423-A'!$B$25=\"\",\"\",'Tex-423-A'!$B$25)","v":"SET"},{"$f":"IF('Tex-423-A'!$B$27=\"\",\"\",'Tex-423-A'!$B$27)","v":1},{"$f":"IF('Tex-423-A'!$G$25=\"\",\"\",'Tex-423-A'!$G$25)","v":"Measurements to the nearest 0.1 (in.)"},{"$f":"IF('Tex-423-A'!$K$26=\"\",\"\",'Tex-423-A'!$K$26)","v":3}]
[11,{"$f":"IF('Tex-423-A'!$M$27=\"\",\"\",'Tex-423-A'!$M$27)","v":""},{"$f":"IF('Tex-423-A'!$B$6=\"\",\"\",'Tex-423-A'!$B$6)","v":"Tex-423-A, PART III"},{"$f":"IF('Tex-423-A'!$B$25=\"\",\"\",'Tex-423-A'!$B$25)","v":"SET"},{"$f":"IF('Tex-423-A'!$B$27=\"\",\"\",'Tex-423-A'!$B$27)","v":1},{"$f":"IF('Tex-423-A'!$M$25=\"\",\"\",'Tex-423-A'!$M$25)","v":"Average  nearest 0.1 (in.)"}]
[12,{"$f":"IF('Tex-423-A'!$O$27=\"\",\"\",'Tex-423-A'!$O$27)","v":"ACCEPTABLE"},{"$f":"IF('Tex-423-A'!$B$6=\"\",\"\",'Tex-423-A'!$B$6)","v":"Tex-423-A, PART III"},{"$f":"IF('Tex-423-A'!$B$25=\"\",\"\",'Tex-423-A'!$B$25)","v":"SET"},{"$f":"IF('Tex-423-A'!$B$27=\"\",\"\",'Tex-423-A'!$B$27)","v":1},{"$f":"IF('Tex-423-A'!$O$25=\"\",\"\",'Tex-423-A'!$O$25)","v":"ACCEPTABLE SAW CUT DEPTH?"}]
[13,{"$f":"IF('Tex-423-A'!$C$28=\"\",\"\",'Tex-423-A'!$C$28)","v":""},{"$f":"IF('Tex-423-A'!$B$6=\"\",\"\",'Tex-423-A'!$B$6)","v":"Tex-423-A, PART III"},{"$f":"IF('Tex-423-A'!$B$25=\"\",\"\",'Tex-423-A'!$B$25)","v":"SET"},{"$f":"IF('Tex-423-A'!$B$28=\"\",\"\",'Tex-423-A'!$B$28)","v":2},{"$f":"IF('Tex-423-A'!$C$25=\"\",\"\",'Tex-423-A'!$C$25)","v":"Measurement Identification / Location"}]
[14,{"$f":"IF('Tex-423-A'!$G$28=\"\",\"\",'Tex-423-A'!$G$28)","v":""},{"$f":"IF('Tex-423-A'!$B$6=\"\",\"\",'Tex-423-A'!$B$6)","v":"Tex-423-A, PART III"},{"$f":"IF('Tex-423-A'!$B$25=\"\",\"\",'Tex-423-A'!$B$25)","v":"SET"},{"$f":"IF('Tex-423-A'!$B$28=\"\",\"\",'Tex-423-A'!$B$28)","v":2},{"$f":"IF('Tex-423-A'!$G$25=\"\",\"\",'Tex-423-A'!$G$25)","v":"Measurements to the nearest 0.1 (in.)"},{"$f":"IF('Tex-423-A'!$G$26=\"\",\"\",'Tex-423-A'!$G$26)","v":1}]
[15,{"$f":"IF('Tex-423-A'!$I$28=\"\",\"\",'Tex-423-A'!$I$28)","v":""},{"$f":"IF('Tex-423-A'!$B$6=\"\",\"\",'Tex-423-A'!$B$6)","v":"Tex-423-A, PART III"},{"$f":"IF('Tex-423-A'!$B$25=\"\",\"\",'Tex-423-A'!$B$25)","v":"SET"},{"$f":"IF('Tex-423-A'!$B$28=\"\",\"\",'Tex-423-A'!$B$28)","v":2},{"$f":"IF('Tex-423-A'!$G$25=\"\",\"\",'Tex-423-A'!$G$25)","v":"Measurements to the nearest 0.1 (in.)"},{"$f":"IF('Tex-423-A'!$I$26=\"\",\"\",'Tex-423-A'!$I$26)","v":2}]
[16,{"$f":"IF('Tex-423-A'!$K$28=\"\",\"\",'Tex-423-A'!$K$28)","v":""},{"$f":"IF('Tex-423-A'!$B$6=\"\",\"\",'Tex-423-A'!$B$6)","v":"Tex-423-A, PART III"},{"$f":"IF('Tex-423-A'!$B$25=\"\",\"\",'Tex-423-A'!$B$25)","v":"SET"},{"$f":"IF('Tex-423-A'!$B$28=\"\",\"\",'Tex-423-A'!$B$28)","v":2},{"$f":"IF('Tex-423-A'!$G$25=\"\",\"\",'Tex-423-A'!$G$25)","v":"Measurements to the nearest 0.1 (in.)"},{"$f":"IF('Tex-423-A'!$K$26=\"\",\"\",'Tex-423-A'!$K$26)","v":3}]
[17,{"$f":"IF('Tex-423-A'!$M$28=\"\",\"\",'Tex-423-A'!$M$28)","v":""},{"$f":"IF('Tex-423-A'!$B$6=\"\",\"\",'Tex-423-A'!$B$6)","v":"Tex-423-A, PART III"},{"$f":"IF('Tex-423-A'!$B$25=\"\",\"\",'Tex-423-A'!$B$25)","v":"SET"},{"$f":"IF('Tex-423-A'!$B$28=\"\",\"\",'Tex-423-A'!$B$28)","v":2},{"$f":"IF('Tex-423-A'!$M$25=\"\",\"\",'Tex-423-A'!$M$25)","v":"Average  nearest 0.1 (in.)"}]
[18,{"$f":"IF('Tex-423-A'!$O$28=\"\",\"\",'Tex-423-A'!$O$28)","v":""},{"$f":"IF('Tex-423-A'!$B$6=\"\",\"\",'Tex-423-A'!$B$6)","v":"Tex-423-A, PART III"},{"$f":"IF('Tex-423-A'!$B$25=\"\",\"\",'Tex-423-A'!$B$25)","v":"SET"},{"$f":"IF('Tex-423-A'!$B$28=\"\",\"\",'Tex-423-A'!$B$28)","v":2},{"$f":"IF('Tex-423-A'!$O$25=\"\",\"\",'Tex-423-A'!$O$25)","v":"ACCEPTABLE SAW CUT DEPTH?"}]

{"sheet":"reference","index":2,"n_rows":9,"n_cols":6,"rows_kept":9,"cut":false,"hidden":false,"merged":[[1,1,1,2],[1,4,1,5]]}
[]
[null,"Thickness Price Adjustment",null,null,"Thickness Price Adjustment"]
[null,"Inches",null,null,"mm"]
[null,0.75,0.56999999999999995,null,19,0.56999999999999995]
[null,0.5,0.68,null,13,0.68]
[null,0.4,0.72,null,10,0.72]
[null,0.3,0.8,null,8,0.8]
[null,0.2,1,null,5,1]
[null,0,0,null,0,0]