{"text_format":"1","workbook":"xlsx","n_sheets":3,"sheets":["Tex-424-A","RX","L to D Lookup"],"not_rendered":{"charts":0,"images":1,"macros":1,"external_links":0,"defined_names":116,"comments":1,"pivot_tables":0},"unopened":[],"bounds":{"document_bytes":16777216,"sheet_cells":100000,"rows_first":2000,"rows_last":500,"rows_between":2000,"halvings":0,"cell_chars":16384,"cell_head_chars":4096},"cells_cut":0,"cells_raw":0,"read":"whole","date_system":"1900"}

{"sheet":"Tex-424-A","index":0,"n_rows":49,"n_cols":11,"rows_kept":49,"cut":false,"hidden":false,"merged":[[13,3,13,4],[11,3,11,4],[8,3,8,4],[10,3,10,4],[12,3,12,4],[9,3,9,4],[48,1,48,3],[37,1,37,8],[32,10,33,10],[44,6,44,8],[32,2,33,2],[44,1,44,3],[40,2,40,4],[42,2,42,4],[23,9,25,9],[30,10,31,10],[26,10,27,10],[28,10,29,10],[23,10,25,10],[28,2,29,2],[23,5,25,5],[39,2,39,4],[35,1,36,8],[38,1,38,8],[30,2,31,2],[24,3,25,3],[23,4,25,4],[23,6,25,6],[23,1,25,1],[26,2,27,2],[23,2,25,2],[23,0,25,0],[0,0,0,1],[16,3,16,4],[16,7,16,8],[23,8,25,8],[23,7,25,7],[7,7,7,8],[10,7,10,8],[8,7,8,8],[11,7,11,8],[9,7,9,8],[12,7,12,8],[14,3,14,8],[15,3,15,8],[13,7,13,8],[7,3,7,4]]}
["TxDOT Manuals >",null,null,"Tex-424-A"]
[null,"TEXAS DEPARTMENT OF TRANSPORTATION",null,null,null,null,null,null,null,null,56]
[null,null,null,null,null,null,null,null,null,null,2]
[null,null,null,null,null,null,null,null,null,null,"tx424,iii.xlsm::45575.629722"]
[null,"TESTING OF DRILLED CORES OF PORTLAND CEMENT CONCRETE  "]
[null,"Tex-424-A, Part III"]
[null,null,null,null,null,null,null,null,{"$f":"\"TX424, III :: File Version: \" & TEXT(MID(sn,SEARCH(\"::\",sn,1)+2,20),\"mm/dd/yy hh:mm:ss\")","v":"TX424, III :: File Version: 10/10/24 15:06:48"}]
[null,null,"SAMPLE ID:",null,null,null,"SAMPLED DATE:"]
[null,null,"TEST NUMBER:",null,null,null,"LETTING DATE:"]
[null,null,"SAMPLE STATUS:",null,null,null,"CONTROLLING CSJ:"]
[null,null,"COUNTY:",null,null,null,"SPEC YEAR:"]
[null,null,"SAMPLED BY:",null,null,null,"SPEC ITEM:"]
[null,null,"SAMPLE LOCATION:",null,null,null,"SPECIAL PROVISION:"]
[null,null,"MATERIAL CODE:",null,null,null,"GRADE:"]
[null,null,"MATERIAL NAME:"]
[null,null,"PRODUCER:"]
[null,null,"AREA ENGINEER:",null,null,null,"PROJECT MANAGER:"]
[]
[null,null,"COURSE\\LIFT:",null,"STATION:",null,null,"DIST. FROM CL:"]
[]
[]
[null,"                    TESTING OF DRILLED CORES OF CONCRETE"]
[null,"Tex-424-A"]
["Cores","Core Number","Age (Days)",null,{"$f":"\"Length of Core \" & IF(version>=1, IF(SpecYear=\"\", \"\", IF(SpecYear<>\"1995\", \"( inches )\", \"( millimeter )\")), IF(SpecYear=\"\",\"\",IF(SpecYear=\"1993\",\"(inches)\",\"(millimeter)\")))","v":"Length of Core "},"Length to Diameter Ratio",{"$f":"\"Max Load \" & IF(version>=1, IF(SpecYear=\"\", \"\", IF(SpecYear<>\"1995\", \"( Lbs.)\", \"(kN)\")), IF(SpecYear=\"\",\"\",IF(SpecYear=\"1993\",\"(Lbs.)\",\"(kN)\")))","v":"Max Load "},"Failure Type","Correction Factor",{"$f":"\"Compressive Strength \" & IF(version>=1, IF(SpecYear=\"\", \"\", IF(SpecYear<>\"1995\", \"(psi)\", \"(MPa)\")), IF(SpecYear=\"\",\"\",IF(SpecYear=\"1993\",\"(psi)\",\"(MPa)\")))","v":"Compressive Strength "},{"$f":"\"Compressive Strength Average \" & IF(version>=1, IF(SpecYear=\"\", \"\", IF(SpecYear<>\"1995\", \"(psi)\", \"(Mpa)\")), IF(SpecYear=\"\",\"\",IF(SpecYear=\"1993\",\"(psi)\",\"(MPa)\")))","v":"Compressive Strength Average "}]
[null,null,null,{"$f":"+CircumDiameter2 &\" of Core \" & IF(version>=1, IF(SpecYear=\"\",\"\",IF(SpecYear<>\"1995\", \"( inches )\", \"( millimeter )\")), IF(SpecYear=\"\",\"\",IF(SpecYear=\"1993\",\"( inches )\",\"( millimeter )\")))","v":" of Core "}]
[]
[1,null,null,null,null,{"$f":"IF(ISERROR(IF(CircumDiameter2=\"diameter\",($E27/$D27),$E27/(SQRT($D27/PI())*2))),\"\",IF(CircumDiameter2=\"diameter\",($E27/$D27),$E27/(SQRT($D27/PI())*2)))","v":""},null,null,{"$f":"IF(F27=\"\",\"\",IF(F27<1,\"CHK SIZES\",IF(F27>2.1,\"CHK SIZES\",VLOOKUP(F27,CorrectionFactors,2))))","v":""},{"$f":"IF(ISERROR(IF(SpecYear=\"1993\",'L to D Lookup'!$D22,'L to D Lookup'!$E22)),0,IF(SpecYear=\"1993\",'L to D Lookup'!$D22,'L to D Lookup'!$E22))","v":""},{"$f":"IF(ISERROR(IF(SpecYear=\"1995\",ROUND(AVERAGE(J27:J28)*2,-1)/2,ROUND(AVERAGE(J27:J28),-1))),\"\",IF(SpecYear=\"1995\",ROUND(AVERAGE(J27:J28)*2,-1)/2,ROUND(AVERAGE(J27:J28),-1)))","v":""}]
[2,null,null,null,null,"",null,null,"",{"$f":"IF(ISERROR(IF(SpecYear=\"1993\",'L to D Lookup'!$D23,'L to D Lookup'!$E23)),0,IF(SpecYear=\"1993\",'L to D Lookup'!$D23,'L to D Lookup'!$E23))","v":""}]
[3,null,null,null,null,"",null,null,"",{"$f":"IF(ISERROR(IF(SpecYear=\"1993\",'L to D Lookup'!$D24,'L to D Lookup'!$E24)),0,IF(SpecYear=\"1993\",'L to D Lookup'!$D24,'L to D Lookup'!$E24))","v":""},{"$f":"IF(ISERROR(IF(SpecYear=\"1995\",ROUND(AVERAGE(J29:J30)*2,-1)/2,ROUND(AVERAGE(J29:J30),-1))),\"\",IF(SpecYear=\"1995\",ROUND(AVERAGE(J29:J30)*2,-1)/2,ROUND(AVERAGE(J29:J30),-1)))","v":""}]
[4,null,null,null,null,"",null,null,"",{"$f":"IF(ISERROR(IF(SpecYear=\"1993\",'L to D Lookup'!$D25,'L to D Lookup'!$E25)),0,IF(SpecYear=\"1993\",'L to D Lookup'!$D25,'L to D Lookup'!$E25))","v":""}]
[5,null,null,null,null,"",null,null,"",{"$f":"IF(ISERROR(IF(SpecYear=\"1993\",'L to D Lookup'!$D26,'L to D Lookup'!$E26)),0,IF(SpecYear=\"1993\",'L to D Lookup'!$D26,'L to D Lookup'!$E26))","v":""},{"$f":"IF(ISERROR(IF(SpecYear=\"1995\",ROUND(AVERAGE(J31:J32)*2,-1)/2,ROUND(AVERAGE(J31:J32),-1))),\"\",IF(SpecYear=\"1995\",ROUND(AVERAGE(J31:J32)*2,-1)/2,ROUND(AVERAGE(J31:J32),-1)))","v":""}]
[6,null,null,null,null,"",null,null,"",{"$f":"IF(ISERROR(IF(SpecYear=\"1993\",'L to D Lookup'!$D27,'L to D Lookup'!$E27)),0,IF(SpecYear=\"1993\",'L to D Lookup'!$D27,'L to D Lookup'!$E27))","v":""}]
[7,null,null,null,null,"",null,null,"",{"$f":"IF(ISERROR(IF(SpecYear=\"1993\",'L to D Lookup'!$D28,'L to D Lookup'!$E28)),0,IF(SpecYear=\"1993\",'L to D Lookup'!$D28,'L to D Lookup'!$E28))","v":""},{"$f":"IF(ISERROR(IF(SpecYear=\"1995\",ROUND(AVERAGE(J33:J34)*2,-1)/2,ROUND(AVERAGE(J33:J34),-1))),\"\",IF(SpecYear=\"1995\",ROUND(AVERAGE(J33:J34)*2,-1)/2,ROUND(AVERAGE(J33:J34),-1)))","v":""}]
[8,null,null,null,null,"",null,null,"",{"$f":"IF(ISERROR(IF(SpecYear=\"1993\",'L to D Lookup'!$D29,'L to D Lookup'!$E29)),0,IF(SpecYear=\"1993\",'L to D Lookup'!$D29,'L to D Lookup'!$E29))","v":""}]
[null,"Remarks:",{"$f":"NOW()","v":"2024-10-10T15:06:48.290"}]
[]
[]
[]
[]
[null,"Test Method:","Tested By:",null,null,"Tested Date:"]
[null,"TX424"]
[]
[null,"TX424,III"]
[null,"Test Stamp Code:",null,null,"Omit Test:","Completed Date:","Reviewed By:"]
[]
[null,"Locked By:","TxDOT:","District:","Area:"]
[]
[null,"Authorized By:",null,null,"Authorized Date:"]
[null,null,null,null,null,{"$f":"IF(OR(ISBLANK(AuthorizedDate), AuthorizedDate>43144),1,0)","v":1}]

{"sheet":"RX","index":1,"n_rows":80,"n_cols":9,"rows_kept":80,"cut":false,"hidden":true,"merged":[]}
[{"$f":"COUNTA(A3:A5000)","v":78}]
["Fld_nbr","Value","Desc_1","Desc_2","Desc_3","Desc_4","Desc_5","Desc_6","Desc_7"]
[1,{"$f":"IF('Tex-424-A'!$B$36=\"\",\"\",'Tex-424-A'!$B$36)","v":""},{"$f":"'Tex-424-A'!$B$35","v":"Remarks:"}]
[2,{"$f":"IF('Tex-424-A'!$D$19=\"\",\"\",'Tex-424-A'!$D$19)","v":""},{"$f":"IF('Tex-424-A'!$C$19=\"\",\"\",'Tex-424-A'!$C$19)","v":"COURSE\\LIFT:"}]
[3,{"$f":"IF('Tex-424-A'!$C$41=\"\",\"\",'Tex-424-A'!$C$41)","v":""},"Tested By ",{"$f":"IF('Tex-424-A'!$B$41=\"\",\"\",'Tex-424-A'!$B$41)","v":"TX424"}]
[4,{"$f":"IF('Tex-424-A'!$F$41=\"\",\"\",'Tex-424-A'!$F$41)","v":""},"Tested Date ",{"$f":"IF('Tex-424-A'!$B$41=\"\",\"\",'Tex-424-A'!$B$41)","v":"TX424"}]
[5,{"$f":"IF('Tex-424-A'!$B$27=\"\",\"\",'Tex-424-A'!$B$27)","v":""},{"$f":"IF('Tex-424-A'!$B$23=\"\",\"\",'Tex-424-A'!$B$23)","v":"Tex-424-A"},{"$f":"IF('Tex-424-A'!$A$24=\"\",\"\",'Tex-424-A'!$A$24)","v":"Cores"},{"$f":"IF('Tex-424-A'!$A$27=\"\",\"\",'Tex-424-A'!$A$27)","v":1},{"$f":"IF('Tex-424-A'!$B$24=\"\",\"\",'Tex-424-A'!$B$24)","v":"Core Number"}]
[6,{"$f":"IF('Tex-424-A'!$C$27=\"\",\"\",'Tex-424-A'!$C$27)","v":""},{"$f":"IF('Tex-424-A'!$B$23=\"\",\"\",'Tex-424-A'!$B$23)","v":"Tex-424-A"},{"$f":"IF('Tex-424-A'!$A$24=\"\",\"\",'Tex-424-A'!$A$24)","v":"Cores"},{"$f":"IF('Tex-424-A'!$A$27=\"\",\"\",'Tex-424-A'!$A$27)","v":1},{"$f":"IF('Tex-424-A'!$C$24=\"\",\"\",'Tex-424-A'!$C$24)","v":"Age (Days)"}]
[7,{"$f":"IF('Tex-424-A'!$D$27=\"\",\"\",'Tex-424-A'!$D$27)","v":""},{"$f":"IF('Tex-424-A'!$B$23=\"\",\"\",'Tex-424-A'!$B$23)","v":"Tex-424-A"},{"$f":"IF('Tex-424-A'!$A$24=\"\",\"\",'Tex-424-A'!$A$24)","v":"Cores"},{"$f":"IF('Tex-424-A'!$A$27=\"\",\"\",'Tex-424-A'!$A$27)","v":1},{"$f":"IF('Tex-424-A'!$D$25=\"\",\"\",'Tex-424-A'!$D$25)","v":" of Core "}]
[8,{"$f":"IF('Tex-424-A'!$E$27=\"\",\"\",'Tex-424-A'!$E$27)","v":""},{"$f":"IF('Tex-424-A'!$B$23=\"\",\"\",'Tex-424-A'!$B$23)","v":"Tex-424-A"},{"$f":"IF('Tex-424-A'!$A$24=\"\",\"\",'Tex-424-A'!$A$24)","v":"Cores"},{"$f":"IF('Tex-424-A'!$A$27=\"\",\"\",'Tex-424-A'!$A$27)","v":1},{"$f":"IF('Tex-424-A'!$E$24=\"\",\"\",'Tex-424-A'!$E$24)","v":"Length of Core "}]
[9,{"$f":"IF('Tex-424-A'!$F$27=\"\",\"\",'Tex-424-A'!$F$27)","v":""},{"$f":"IF('Tex-424-A'!$B$23=\"\",\"\",'Tex-424-A'!$B$23)","v":"Tex-424-A"},{"$f":"IF('Tex-424-A'!$A$24=\"\",\"\",'Tex-424-A'!$A$24)","v":"Cores"},{"$f":"IF('Tex-424-A'!$A$27=\"\",\"\",'Tex-424-A'!$A$27)","v":1},{"$f":"IF('Tex-424-A'!$F$24=\"\",\"\",'Tex-424-A'!$F$24)","v":"Length to Diameter Ratio"}]
[10,{"$f":"IF('Tex-424-A'!$G$27=\"\",\"\",'Tex-424-A'!$G$27)","v":""},{"$f":"IF('Tex-424-A'!$B$23=\"\",\"\",'Tex-424-A'!$B$23)","v":"Tex-424-A"},{"$f":"IF('Tex-424-A'!$A$24=\"\",\"\",'Tex-424-A'!$A$24)","v":"Cores"},{"$f":"IF('Tex-424-A'!$A$27=\"\",\"\",'Tex-424-A'!$A$27)","v":1},{"$f":"IF('Tex-424-A'!$G$24=\"\",\"\",'Tex-424-A'!$G$24)","v":"Max Load "}]
[11,{"$f":"IF('Tex-424-A'!$H$27=\"\",\"\",'Tex-424-A'!$H$27)","v":""},{"$f":"IF('Tex-424-A'!$B$23=\"\",\"\",'Tex-424-A'!$B$23)","v":"Tex-424-A"},{"$f":"IF('Tex-424-A'!$A$24=\"\",\"\",'Tex-424-A'!$A$24)","v":"Cores"},{"$f":"IF('Tex-424-A'!$A$27=\"\",\"\",'Tex-424-A'!$A$27)","v":1},{"$f":"IF('Tex-424-A'!$H$24=\"\",\"\",'Tex-424-A'!$H$24)","v":"Failure Type"}]
[12,{"$f":"IF('Tex-424-A'!$I$27=\"\",\"\",'Tex-424-A'!$I$27)","v":""},{"$f":"IF('Tex-424-A'!$B$23=\"\",\"\",'Tex-424-A'!$B$23)","v":"Tex-424-A"},{"$f":"IF('Tex-424-A'!$A$24=\"\",\"\",'Tex-424-A'!$A$24)","v":"Cores"},{"$f":"IF('Tex-424-A'!$A$27=\"\",\"\",'Tex-424-A'!$A$27)","v":1},{"$f":"IF('Tex-424-A'!$I$24=\"\",\"\",'Tex-424-A'!$I$24)","v":"Correction Factor"}]
[13,{"$f":"IF('Tex-424-A'!$J$27=\"\",\"\",'Tex-424-A'!$J$27)","v":""},{"$f":"IF('Tex-424-A'!$B$23=\"\",\"\",'Tex-424-A'!$B$23)","v":"Tex-424-A"},{"$f":"IF('Tex-424-A'!$A$24=\"\",\"\",'Tex-424-A'!$A$24)","v":"Cores"},{"$f":"IF('Tex-424-A'!$A$27=\"\",\"\",'Tex-424-A'!$A$27)","v":1},{"$f":"IF('Tex-424-A'!$J$24=\"\",\"\",'Tex-424-A'!$J$24)","v":"Compressive Strength "}]
[14,{"$f":"IF('Tex-424-A'!$K$27=\"\",\"\",'Tex-424-A'!$K$27)","v":""},{"$f":"IF('Tex-424-A'!$B$23=\"\",\"\",'Tex-424-A'!$B$23)","v":"Tex-424-A"},{"$f":"IF('Tex-424-A'!$A$24=\"\",\"\",'Tex-424-A'!$A$24)","v":"Cores"},{"$f":"IF('Tex-424-A'!$A$27=\"\",\"\",'Tex-424-A'!$A$27)","v":1},{"$f":"IF('Tex-424-A'!$K$24=\"\",\"\",'Tex-424-A'!$K$24)","v":"Compressive Strength Average "}]
[15,{"$f":"IF('Tex-424-A'!$B$28=\"\",\"\",'Tex-424-A'!$B$28)","v":""},{"$f":"IF('Tex-424-A'!$B$23=\"\",\"\",'Tex-424-A'!$B$23)","v":"Tex-424-A"},{"$f":"IF('Tex-424-A'!$A$24=\"\",\"\",'Tex-424-A'!$A$24)","v":"Cores"},{"$f":"IF('Tex-424-A'!$A$28=\"\",\"\",'Tex-424-A'!$A$28)","v":2},{"$f":"IF('Tex-424-A'!$B$24=\"\",\"\",'Tex-424-A'!$B$24)","v":"Core Number"}]
[16,{"$f":"IF('Tex-424-A'!$D$28=\"\",\"\",'Tex-424-A'!$D$28)","v":""},{"$f":"IF('Tex-424-A'!$B$23=\"\",\"\",'Tex-424-A'!$B$23)","v":"Tex-424-A"},{"$f":"IF('Tex-424-A'!$A$24=\"\",\"\",'Tex-424-A'!$A$24)","v":"Cores"},{"$f":"IF('Tex-424-A'!$A$28=\"\",\"\",'Tex-424-A'!$A$28)","v":2},{"$f":"IF('Tex-424-A'!$D$25=\"\",\"\",'Tex-424-A'!$D$25)","v":" of Core "}]
[17,{"$f":"IF('Tex-424-A'!$E$28=\"\",\"\",'Tex-424-A'!$E$28)","v":""},{"$f":"IF('Tex-424-A'!$B$23=\"\",\"\",'Tex-424-A'!$B$23)","v":"Tex-424-A"},{"$f":"IF('Tex-424-A'!$A$24=\"\",\"\",'Tex-424-A'!$A$24)","v":"Cores"},{"$f":"IF('Tex-424-A'!$A$28=\"\",\"\",'Tex-424-A'!$A$28)","v":2},{"$f":"IF('Tex-424-A'!$E$24=\"\",\"\",'Tex-424-A'!$E$24)","v":"Length of Core "}]
[18,{"$f":"IF('Tex-424-A'!$F$28=\"\",\"\",'Tex-424-A'!$F$28)","v":""},{"$f":"IF('Tex-424-A'!$B$23=\"\",\"\",'Tex-424-A'!$B$23)","v":"Tex-424-A"},{"$f":"IF('Tex-424-A'!$A$24=\"\",\"\",'Tex-424-A'!$A$24)","v":"Cores"},{"$f":"IF('Tex-424-A'!$A$28=\"\",\"\",'Tex-424-A'!$A$28)","v":2},{"$f":"IF('Tex-424-A'!$F$24=\"\",\"\",'Tex-424-A'!$F$24)","v":"Length to Diameter Ratio"}]
[19,{"$f":"IF('Tex-424-A'!$G$28=\"\",\"\",'Tex-424-A'!$G$28)","v":""},{"$f":"IF('Tex-424-A'!$B$23=\"\",\"\",'Tex-424-A'!$B$23)","v":"Tex-424-A"},{"$f":"IF('Tex-424-A'!$A$24=\"\",\"\",'Tex-424-A'!$A$24)","v":"Cores"},{"$f":"IF('Tex-424-A'!$A$28=\"\",\"\",'Tex-424-A'!$A$28)","v":2},{"$f":"IF('Tex-424-A'!$G$24=\"\",\"\",'Tex-424-A'!$G$24)","v":"Max Load "}]
[20,{"$f":"IF('Tex-424-A'!$H$28=\"\",\"\",'Tex-424-A'!$H$28)","v":""},{"$f":"IF('Tex-424-A'!$B$23=\"\",\"\",'Tex-424-A'!$B$23)","v":"Tex-424-A"},{"$f":"IF('Tex-424-A'!$A$24=\"\",\"\",'Tex-424-A'!$A$24)","v":"Cores"},{"$f":"IF('Tex-424-A'!$A$28=\"\",\"\",'Tex-424-A'!$A$28)","v":2},{"$f":"IF('Tex-424-A'!$H$24=\"\",\"\",'Tex-424-A'!$H$24)","v":"Failure Type"}]
[21,{"$f":"IF('Tex-424-A'!$I$28=\"\",\"\",'Tex-424-A'!$I$28)","v":""},{"$f":"IF('Tex-424-A'!$B$23=\"\",\"\",'Tex-424-A'!$B$23)","v":"Tex-424-A"},{"$f":"IF('Tex-424-A'!$A$24=\"\",\"\",'Tex-424-A'!$A$24)","v":"Cores"},{"$f":"IF('Tex-424-A'!$A$28=\"\",\"\",'Tex-424-A'!$A$28)","v":2},{"$f":"IF('Tex-424-A'!$I$24=\"\",\"\",'Tex-424-A'!$I$24)","v":"Correction Factor"}]
[22,{"$f":"IF('Tex-424-A'!$J$28=\"\",\"\",'Tex-424-A'!$J$28)","v":""},{"$f":"IF('Tex-424-A'!$B$23=\"\",\"\",'Tex-424-A'!$B$23)","v":"Tex-424-A"},{"$f":"IF('Tex-424-A'!$A$24=\"\",\"\",'Tex-424-A'!$A$24)","v":"Cores"},{"$f":"IF('Tex-424-A'!$A$28=\"\",\"\",'Tex-424-A'!$A$28)","v":2},{"$f":"IF('Tex-424-A'!$J$24=\"\",\"\",'Tex-424-A'!$J$24)","v":"Compressive Strength "}]
[23,{"$f":"IF('Tex-424-A'!$B$29=\"\",\"\",'Tex-424-A'!$B$29)","v":""},{"$f":"IF('Tex-424-A'!$B$23=\"\",\"\",'Tex-424-A'!$B$23)","v":"Tex-424-A"},{"$f":"IF('Tex-424-A'!$A$24=\"\",\"\",'Tex-424-A'!$A$24)","v":"Cores"},{"$f":"IF('Tex-424-A'!$A$29=\"\",\"\",'Tex-424-A'!$A$29)","v":3},{"$f":"IF('Tex-424-A'!$B$24=\"\",\"\",'Tex-424-A'!$B$24)","v":"Core Number"}]
[24,{"$f":"IF('Tex-424-A'!$C$29=\"\",\"\",'Tex-424-A'!$C$29)","v":""},{"$f":"IF('Tex-424-A'!$B$23=\"\",\"\",'Tex-424-A'!$B$23)","v":"Tex-424-A"},{"$f":"IF('Tex-424-A'!$A$24=\"\",\"\",'Tex-424-A'!$A$24)","v":"Cores"},{"$f":"IF('Tex-424-A'!$A$29=\"\",\"\",'Tex-424-A'!$A$29)","v":3},{"$f":"IF('Tex-424-A'!$C$24=\"\",\"\",'Tex-424-A'!$C$24)","v":"Age (Days)"}]
[25,{"$f":"IF('Tex-424-A'!$D$29=\"\",\"\",'Tex-424-A'!$D$29)","v":""},{"$f":"IF('Tex-424-A'!$B$23=\"\",\"\",'Tex-424-A'!$B$23)","v":"Tex-424-A"},{"$f":"IF('Tex-424-A'!$A$24=\"\",\"\",'Tex-424-A'!$A$24)","v":"Cores"},{"$f":"IF('Tex-424-A'!$A$29=\"\",\"\",'Tex-424-A'!$A$29)","v":3},{"$f":"IF('Tex-424-A'!$D$25=\"\",\"\",'Tex-424-A'!$D$25)","v":" of Core "}]
[26,{"$f":"IF('Tex-424-A'!$E$29=\"\",\"\",'Tex-424-A'!$E$29)","v":""},{"$f":"IF('Tex-424-A'!$B$23=\"\",\"\",'Tex-424-A'!$B$23)","v":"Tex-424-A"},{"$f":"IF('Tex-424-A'!$A$24=\"\",\"\",'Tex-424-A'!$A$24)","v":"Cores"},{"$f":"IF('Tex-424-A'!$A$29=\"\",\"\",'Tex-424-A'!$A$29)","v":3},{"$f":"IF('Tex-424-A'!$E$24=\"\",\"\",'Tex-424-A'!$E$24)","v":"Length of Core "}]
[27,{"$f":"IF('Tex-424-A'!$F$29=\"\",\"\",'Tex-424-A'!$F$29)","v":""},{"$f":"IF('Tex-424-A'!$B$23=\"\",\"\",'Tex-424-A'!$B$23)","v":"Tex-424-A"},{"$f":"IF('Tex-424-A'!$A$24=\"\",\"\",'Tex-424-A'!$A$24)","v":"Cores"},{"$f":"IF('Tex-424-A'!$A$29=\"\",\"\",'Tex-424-A'!$A$29)","v":3},{"$f":"IF('Tex-424-A'!$F$24=\"\",\"\",'Tex-424-A'!$F$24)","v":"Length to Diameter Ratio"}]
[28,{"$f":"IF('Tex-424-A'!$G$29=\"\",\"\",'Tex-424-A'!$G$29)","v":""},{"$f":"IF('Tex-424-A'!$B$23=\"\",\"\",'Tex-424-A'!$B$23)","v":"Tex-424-A"},{"$f":"IF('Tex-424-A'!$A$24=\"\",\"\",'Tex-424-A'!$A$24)","v":"Cores"},{"$f":"IF('Tex-424-A'!$A$29=\"\",\"\",'Tex-424-A'!$A$29)","v":3},{"$f":"IF('Tex-424-A'!$G$24=\"\",\"\",'Tex-424-A'!$G$24)","v":"Max Load "}]
[29,{"$f":"IF('Tex-424-A'!$H$29=\"\",\"\",'Tex-424-A'!$H$29)","v":""},{"$f":"IF('Tex-424-A'!$B$23=\"\",\"\",'Tex-424-A'!$B$23)","v":"Tex-424-A"},{"$f":"IF('Tex-424-A'!$A$24=\"\",\"\",'Tex-424-A'!$A$24)","v":"Cores"},{"$f":"IF('Tex-424-A'!$A$29=\"\",\"\",'Tex-424-A'!$A$29)","v":3},{"$f":"IF('Tex-424-A'!$H$24=\"\",\"\",'Tex-424-A'!$H$24)","v":"Failure Type"}]
[30,{"$f":"IF('Tex-424-A'!$I$29=\"\",\"\",'Tex-424-A'!$I$29)","v":""},{"$f":"IF('Tex-424-A'!$B$23=\"\",\"\",'Tex-424-A'!$B$23)","v":"Tex-424-A"},{"$f":"IF('Tex-424-A'!$A$24=\"\",\"\",'Tex-424-A'!$A$24)","v":"Cores"},{"$f":"IF('Tex-424-A'!$A$29=\"\",\"\",'Tex-424-A'!$A$29)","v":3},{"$f":"IF('Tex-424-A'!$I$24=\"\",\"\",'Tex-424-A'!$I$24)","v":"Correction Factor"}]
[31,{"$f":"IF('Tex-424-A'!$J$29=\"\",\"\",'Tex-424-A'!$J$29)","v":""},{"$f":"IF('Tex-424-A'!$B$23=\"\",\"\",'Tex-424-A'!$B$23)","v":"Tex-424-A"},{"$f":"IF('Tex-424-A'!$A$24=\"\",\"\",'Tex-424-A'!$A$24)","v":"Cores"},{"$f":"IF('Tex-424-A'!$A$29=\"\",\"\",'Tex-424-A'!$A$29)","v":3},{"$f":"IF('Tex-424-A'!$J$24=\"\",\"\",'Tex-424-A'!$J$24)","v":"Compressive Strength "}]
[32,{"$f":"IF('Tex-424-A'!$K$29=\"\",\"\",'Tex-424-A'!$K$29)","v":""},{"$f":"IF('Tex-424-A'!$B$23=\"\",\"\",'Tex-424-A'!$B$23)","v":"Tex-424-A"},{"$f":"IF('Tex-424-A'!$A$24=\"\",\"\",'Tex-424-A'!$A$24)","v":"Cores"},{"$f":"IF('Tex-424-A'!$A$29=\"\",\"\",'Tex-424-A'!$A$29)","v":3},{"$f":"IF('Tex-424-A'!$K$24=\"\",\"\",'Tex-424-A'!$K$24)","v":"Compressive Strength Average "}]
[33,{"$f":"IF('Tex-424-A'!$B$30=\"\",\"\",'Tex-424-A'!$B$30)","v":""},{"$f":"IF('Tex-424-A'!$B$23=\"\",\"\",'Tex-424-A'!$B$23)","v":"Tex-424-A"},{"$f":"IF('Tex-424-A'!$A$24=\"\",\"\",'Tex-424-A'!$A$24)","v":"Cores"},{"$f":"IF('Tex-424-A'!$A$30=\"\",\"\",'Tex-424-A'!$A$30)","v":4},{"$f":"IF('Tex-424-A'!$B$24=\"\",\"\",'Tex-424-A'!$B$24)","v":"Core Number"}]
[34,{"$f":"IF('Tex-424-A'!$D$30=\"\",\"\",'Tex-424-A'!$D$30)","v":""},{"$f":"IF('Tex-424-A'!$B$23=\"\",\"\",'Tex-424-A'!$B$23)","v":"Tex-424-A"},{"$f":"IF('Tex-424-A'!$A$24=\"\",\"\",'Tex-424-A'!$A$24)","v":"Cores"},{"$f":"IF('Tex-424-A'!$A$30=\"\",\"\",'Tex-424-A'!$A$30)","v":4},{"$f":"IF('Tex-424-A'!$D$25=\"\",\"\",'Tex-424-A'!$D$25)","v":" of Core "}]
[35,{"$f":"IF('Tex-424-A'!$E$30=\"\",\"\",'Tex-424-A'!$E$30)","v":""},{"$f":"IF('Tex-424-A'!$B$23=\"\",\"\",'Tex-424-A'!$B$23)","v":"Tex-424-A"},{"$f":"IF('Tex-424-A'!$A$24=\"\",\"\",'Tex-424-A'!$A$24)","v":"Cores"},{"$f":"IF('Tex-424-A'!$A$30=\"\",\"\",'Tex-424-A'!$A$30)","v":4},{"$f":"IF('Tex-424-A'!$E$24=\"\",\"\",'Tex-424-A'!$E$24)","v":"Length of Core "}]
[36,{"$f":"IF('Tex-424-A'!$F$30=\"\",\"\",'Tex-424-A'!$F$30)","v":""},{"$f":"IF('Tex-424-A'!$B$23=\"\",\"\",'Tex-424-A'!$B$23)","v":"Tex-424-A"},{"$f":"IF('Tex-424-A'!$A$24=\"\",\"\",'Tex-424-A'!$A$24)","v":"Cores"},{"$f":"IF('Tex-424-A'!$A$30=\"\",\"\",'Tex-424-A'!$A$30)","v":4},{"$f":"IF('Tex-424-A'!$F$24=\"\",\"\",'Tex-424-A'!$F$24)","v":"Length to Diameter Ratio"}]
[37,{"$f":"IF('Tex-424-A'!$G$30=\"\",\"\",'Tex-424-A'!$G$30)","v":""},{"$f":"IF('Tex-424-A'!$B$23=\"\",\"\",'Tex-424-A'!$B$23)","v":"Tex-424-A"},{"$f":"IF('Tex-424-A'!$A$24=\"\",\"\",'Tex-424-A'!$A$24)","v":"Cores"},{"$f":"IF('Tex-424-A'!$A$30=\"\",\"\",'Tex-424-A'!$A$30)","v":4},{"$f":"IF('Tex-424-A'!$G$24=\"\",\"\",'Tex-424-A'!$G$24)","v":"Max Load "}]
[38,{"$f":"IF('Tex-424-A'!$H$30=\"\",\"\",'Tex-424-A'!$H$30)","v":""},{"$f":"IF('Tex-424-A'!$B$23=\"\",\"\",'Tex-424-A'!$B$23)","v":"Tex-424-A"},{"$f":"IF('Tex-424-A'!$A$24=\"\",\"\",'Tex-424-A'!$A$24)","v":"Cores"},{"$f":"IF('Tex-424-A'!$A$30=\"\",\"\",'Tex-424-A'!$A$30)","v":4},{"$f":"IF('Tex-424-A'!$H$24=\"\",\"\",'Tex-424-A'!$H$24)","v":"Failure Type"}]
[39,{"$f":"IF('Tex-424-A'!$I$30=\"\",\"\",'Tex-424-A'!$I$30)","v":""},{"$f":"IF('Tex-424-A'!$B$23=\"\",\"\",'Tex-424-A'!$B$23)","v":"Tex-424-A"},{"$f":"IF('Tex-424-A'!$A$24=\"\",\"\",'Tex-424-A'!$A$24)","v":"Cores"},{"$f":"IF('Tex-424-A'!$A$30=\"\",\"\",'Tex-424-A'!$A$30)","v":4},{"$f":"IF('Tex-424-A'!$I$24=\"\",\"\",'Tex-424-A'!$I$24)","v":"Correction Factor"}]
[40,{"$f":"IF('Tex-424-A'!$J$30=\"\",\"\",'Tex-424-A'!$J$30)","v":""},{"$f":"IF('Tex-424-A'!$B$23=\"\",\"\",'Tex-424-A'!$B$23)","v":"Tex-424-A"},{"$f":"IF('Tex-424-A'!$A$24=\"\",\"\",'Tex-424-A'!$A$24)","v":"Cores"},{"$f":"IF('Tex-424-A'!$A$30=\"\",\"\",'Tex-424-A'!$A$30)","v":4},{"$f":"IF('Tex-424-A'!$J$24=\"\",\"\",'Tex-424-A'!$J$24)","v":"Compressive Strength "}]
[41,{"$f":"IF('Tex-424-A'!$B$31=\"\",\"\",'Tex-424-A'!$B$31)","v":""},{"$f":"IF('Tex-424-A'!$B$23=\"\",\"\",'Tex-424-A'!$B$23)","v":"Tex-424-A"},{"$f":"IF('Tex-424-A'!$A$24=\"\",\"\",'Tex-424-A'!$A$24)","v":"Cores"},{"$f":"IF('Tex-424-A'!$A$31=\"\",\"\",'Tex-424-A'!$A$31)","v":5},{"$f":"IF('Tex-424-A'!$B$24=\"\",\"\",'Tex-424-A'!$B$24)","v":"Core Number"}]
[42,{"$f":"IF('Tex-424-A'!$C$31=\"\",\"\",'Tex-424-A'!$C$31)","v":""},{"$f":"IF('Tex-424-A'!$B$23=\"\",\"\",'Tex-424-A'!$B$23)","v":"Tex-424-A"},{"$f":"IF('Tex-424-A'!$A$24=\"\",\"\",'Tex-424-A'!$A$24)","v":"Cores"},{"$f":"IF('Tex-424-A'!$A$31=\"\",\"\",'Tex-424-A'!$A$31)","v":5},{"$f":"IF('Tex-424-A'!$C$24=\"\",\"\",'Tex-424-A'!$C$24)","v":"Age (Days)"}]
[43,{"$f":"IF('Tex-424-A'!$D$31=\"\",\"\",'Tex-424-A'!$D$31)","v":""},{"$f":"IF('Tex-424-A'!$B$23=\"\",\"\",'Tex-424-A'!$B$23)","v":"Tex-424-A"},{"$f":"IF('Tex-424-A'!$A$24=\"\",\"\",'Tex-424-A'!$A$24)","v":"Cores"},{"$f":"IF('Tex-424-A'!$A$31=\"\",\"\",'Tex-424-A'!$A$31)","v":5},{"$f":"IF('Tex-424-A'!$D$25=\"\",\"\",'Tex-424-A'!$D$25)","v":" of Core "}]
[44,{"$f":"IF('Tex-424-A'!$E$31=\"\",\"\",'Tex-424-A'!$E$31)","v":""},{"$f":"IF('Tex-424-A'!$B$23=\"\",\"\",'Tex-424-A'!$B$23)","v":"Tex-424-A"},{"$f":"IF('Tex-424-A'!$A$24=\"\",\"\",'Tex-424-A'!$A$24)","v":"Cores"},{"$f":"IF('Tex-424-A'!$A$31=\"\",\"\",'Tex-424-A'!$A$31)","v":5},{"$f":"IF('Tex-424-A'!$E$24=\"\",\"\",'Tex-424-A'!$E$24)","v":"Length of Core "}]
[45,{"$f":"IF('Tex-424-A'!$F$31=\"\",\"\",'Tex-424-A'!$F$31)","v":""},{"$f":"IF('Tex-424-A'!$B$23=\"\",\"\",'Tex-424-A'!$B$23)","v":"Tex-424-A"},{"$f":"IF('Tex-424-A'!$A$24=\"\",\"\",'Tex-424-A'!$A$24)","v":"Cores"},{"$f":"IF('Tex-424-A'!$A$31=\"\",\"\",'Tex-424-A'!$A$31)","v":5},{"$f":"IF('Tex-424-A'!$F$24=\"\",\"\",'Tex-424-A'!$F$24)","v":"Length to Diameter Ratio"}]
[46,{"$f":"IF('Tex-424-A'!$G$31=\"\",\"\",'Tex-424-A'!$G$31)","v":""},{"$f":"IF('Tex-424-A'!$B$23=\"\",\"\",'Tex-424-A'!$B$23)","v":"Tex-424-A"},{"$f":"IF('Tex-424-A'!$A$24=\"\",\"\",'Tex-424-A'!$A$24)","v":"Cores"},{"$f":"IF('Tex-424-A'!$A$31=\"\",\"\",'Tex-424-A'!$A$31)","v":5},{"$f":"IF('Tex-424-A'!$G$24=\"\",\"\",'Tex-424-A'!$G$24)","v":"Max Load "}]
[47,{"$f":"IF('Tex-424-A'!$H$31=\"\",\"\",'Tex-424-A'!$H$31)","v":""},{"$f":"IF('Tex-424-A'!$B$23=\"\",\"\",'Tex-424-A'!$B$23)","v":"Tex-424-A"},{"$f":"IF('Tex-424-A'!$A$24=\"\",\"\",'Tex-424-A'!$A$24)","v":"Cores"},{"$f":"IF('Tex-424-A'!$A$31=\"\",\"\",'Tex-424-A'!$A$31)","v":5},{"$f":"IF('Tex-424-A'!$H$24=\"\",\"\",'Tex-424-A'!$H$24)","v":"Failure Type"}]
[48,{"$f":"IF('Tex-424-A'!$I$31=\"\",\"\",'Tex-424-A'!$I$31)","v":""},{"$f":"IF('Tex-424-A'!$B$23=\"\",\"\",'Tex-424-A'!$B$23)","v":"Tex-424-A"},{"$f":"IF('Tex-424-A'!$A$24=\"\",\"\",'Tex-424-A'!$A$24)","v":"Cores"},{"$f":"IF('Tex-424-A'!$A$31=\"\",\"\",'Tex-424-A'!$A$31)","v":5},{"$f":"IF('Tex-424-A'!$I$24=\"\",\"\",'Tex-424-A'!$I$24)","v":"Correction Factor"}]
[49,{"$f":"IF('Tex-424-A'!$J$31=\"\",\"\",'Tex-424-A'!$J$31)","v":""},{"$f":"IF('Tex-424-A'!$B$23=\"\",\"\",'Tex-424-A'!$B$23)","v":"Tex-424-A"},{"$f":"IF('Tex-424-A'!$A$24=\"\",\"\",'Tex-424-A'!$A$24)","v":"Cores"},{"$f":"IF('Tex-424-A'!$A$31=\"\",\"\",'Tex-424-A'!$A$31)","v":5},{"$f":"IF('Tex-424-A'!$J$24=\"\",\"\",'Tex-424-A'!$J$24)","v":"Compressive Strength "}]
[50,{"$f":"IF('Tex-424-A'!$K$31=\"\",\"\",'Tex-424-A'!$K$31)","v":""},{"$f":"IF('Tex-424-A'!$B$23=\"\",\"\",'Tex-424-A'!$B$23)","v":"Tex-424-A"},{"$f":"IF('Tex-424-A'!$A$24=\"\",\"\",'Tex-424-A'!$A$24)","v":"Cores"},{"$f":"IF('Tex-424-A'!$A$31=\"\",\"\",'Tex-424-A'!$A$31)","v":5},{"$f":"IF('Tex-424-A'!$K$24=\"\",\"\",'Tex-424-A'!$K$24)","v":"Compressive Strength Average "}]
[51,{"$f":"IF('Tex-424-A'!$B$32=\"\",\"\",'Tex-424-A'!$B$32)","v":""},{"$f":"IF('Tex-424-A'!$B$23=\"\",\"\",'Tex-424-A'!$B$23)","v":"Tex-424-A"},{"$f":"IF('Tex-424-A'!$A$24=\"\",\"\",'Tex-424-A'!$A$24)","v":"Cores"},{"$f":"IF('Tex-424-A'!$A$32=\"\",\"\",'Tex-424-A'!$A$32)","v":6},{"$f":"IF('Tex-424-A'!$B$24=\"\",\"\",'Tex-424-A'!$B$24)","v":"Core Number"}]
[52,{"$f":"IF('Tex-424-A'!$D$32=\"\",\"\",'Tex-424-A'!$D$32)","v":""},{"$f":"IF('Tex-424-A'!$B$23=\"\",\"\",'Tex-424-A'!$B$23)","v":"Tex-424-A"},{"$f":"IF('Tex-424-A'!$A$24=\"\",\"\",'Tex-424-A'!$A$24)","v":"Cores"},{"$f":"IF('Tex-424-A'!$A$32=\"\",\"\",'Tex-424-A'!$A$32)","v":6},{"$f":"IF('Tex-424-A'!$D$25=\"\",\"\",'Tex-424-A'!$D$25)","v":" of Core "}]
[53,{"$f":"IF('Tex-424-A'!$E$32=\"\",\"\",'Tex-424-A'!$E$32)","v":""},{"$f":"IF('Tex-424-A'!$B$23=\"\",\"\",'Tex-424-A'!$B$23)","v":"Tex-424-A"},{"$f":"IF('Tex-424-A'!$A$24=\"\",\"\",'Tex-424-A'!$A$24)","v":"Cores"},{"$f":"IF('Tex-424-A'!$A$32=\"\",\"\",'Tex-424-A'!$A$32)","v":6},{"$f":"IF('Tex-424-A'!$E$24=\"\",\"\",'Tex-424-A'!$E$24)","v":"Length of Core "}]
[54,{"$f":"IF('Tex-424-A'!$F$32=\"\",\"\",'Tex-424-A'!$F$32)","v":""},{"$f":"IF('Tex-424-A'!$B$23=\"\",\"\",'Tex-424-A'!$B$23)","v":"Tex-424-A"},{"$f":"IF('Tex-424-A'!$A$24=\"\",\"\",'Tex-424-A'!$A$24)","v":"Cores"},{"$f":"IF('Tex-424-A'!$A$32=\"\",\"\",'Tex-424-A'!$A$32)","v":6},{"$f":"IF('Tex-424-A'!$F$24=\"\",\"\",'Tex-424-A'!$F$24)","v":"Length to Diameter Ratio"}]
[55,{"$f":"IF('Tex-424-A'!$G$32=\"\",\"\",'Tex-424-A'!$G$32)","v":""},{"$f":"IF('Tex-424-A'!$B$23=\"\",\"\",'Tex-424-A'!$B$23)","v":"Tex-424-A"},{"$f":"IF('Tex-424-A'!$A$24=\"\",\"\",'Tex-424-A'!$A$24)","v":"Cores"},{"$f":"IF('Tex-424-A'!$A$32=\"\",\"\",'Tex-424-A'!$A$32)","v":6},{"$f":"IF('Tex-424-A'!$G$24=\"\",\"\",'Tex-424-A'!$G$24)","v":"Max Load "}]
[56,{"$f":"IF('Tex-424-A'!$H$32=\"\",\"\",'Tex-424-A'!$H$32)","v":""},{"$f":"IF('Tex-424-A'!$B$23=\"\",\"\",'Tex-424-A'!$B$23)","v":"Tex-424-A"},{"$f":"IF('Tex-424-A'!$A$24=\"\",\"\",'Tex-424-A'!$A$24)","v":"Cores"},{"$f":"IF('Tex-424-A'!$A$32=\"\",\"\",'Tex-424-A'!$A$32)","v":6},{"$f":"IF('Tex-424-A'!$H$24=\"\",\"\",'Tex-424-A'!$H$24)","v":"Failure Type"}]
[57,{"$f":"IF('Tex-424-A'!$I$32=\"\",\"\",'Tex-424-A'!$I$32)","v":""},{"$f":"IF('Tex-424-A'!$B$23=\"\",\"\",'Tex-424-A'!$B$23)","v":"Tex-424-A"},{"$f":"IF('Tex-424-A'!$A$24=\"\",\"\",'Tex-424-A'!$A$24)","v":"Cores"},{"$f":"IF('Tex-424-A'!$A$32=\"\",\"\",'Tex-424-A'!$A$32)","v":6},{"$f":"IF('Tex-424-A'!$I$24=\"\",\"\",'Tex-424-A'!$I$24)","v":"Correction Factor"}]
[58,{"$f":"IF('Tex-424-A'!$J$32=\"\",\"\",'Tex-424-A'!$J$32)","v":""},{"$f":"IF('Tex-424-A'!$B$23=\"\",\"\",'Tex-424-A'!$B$23)","v":"Tex-424-A"},{"$f":"IF('Tex-424-A'!$A$24=\"\",\"\",'Tex-424-A'!$A$24)","v":"Cores"},{"$f":"IF('Tex-424-A'!$A$32=\"\",\"\",'Tex-424-A'!$A$32)","v":6},{"$f":"IF('Tex-424-A'!$J$24=\"\",\"\",'Tex-424-A'!$J$24)","v":"Compressive Strength "}]
[59,{"$f":"IF('Tex-424-A'!$B$33=\"\",\"\",'Tex-424-A'!$B$33)","v":""},{"$f":"IF('Tex-424-A'!$B$23=\"\",\"\",'Tex-424-A'!$B$23)","v":"Tex-424-A"},{"$f":"IF('Tex-424-A'!$A$24=\"\",\"\",'Tex-424-A'!$A$24)","v":"Cores"},{"$f":"IF('Tex-424-A'!$A$33=\"\",\"\",'Tex-424-A'!$A$33)","v":7},{"$f":"IF('Tex-424-A'!$B$24=\"\",\"\",'Tex-424-A'!$B$24)","v":"Core Number"}]
[60,{"$f":"IF('Tex-424-A'!$C$33=\"\",\"\",'Tex-424-A'!$C$33)","v":""},{"$f":"IF('Tex-424-A'!$B$23=\"\",\"\",'Tex-424-A'!$B$23)","v":"Tex-424-A"},{"$f":"IF('Tex-424-A'!$A$24=\"\",\"\",'Tex-424-A'!$A$24)","v":"Cores"},{"$f":"IF('Tex-424-A'!$A$33=\"\",\"\",'Tex-424-A'!$A$33)","v":7},{"$f":"IF('Tex-424-A'!$C$24=\"\",\"\",'Tex-424-A'!$C$24)","v":"Age (Days)"}]
[61,{"$f":"IF('Tex-424-A'!$D$33=\"\",\"\",'Tex-424-A'!$D$33)","v":""},{"$f":"IF('Tex-424-A'!$B$23=\"\",\"\",'Tex-424-A'!$B$23)","v":"Tex-424-A"},{"$f":"IF('Tex-424-A'!$A$24=\"\",\"\",'Tex-424-A'!$A$24)","v":"Cores"},{"$f":"IF('Tex-424-A'!$A$33=\"\",\"\",'Tex-424-A'!$A$33)","v":7},{"$f":"IF('Tex-424-A'!$D$25=\"\",\"\",'Tex-424-A'!$D$25)","v":" of Core "}]
[62,{"$f":"IF('Tex-424-A'!$E$33=\"\",\"\",'Tex-424-A'!$E$33)","v":""},{"$f":"IF('Tex-424-A'!$B$23=\"\",\"\",'Tex-424-A'!$B$23)","v":"Tex-424-A"},{"$f":"IF('Tex-424-A'!$A$24=\"\",\"\",'Tex-424-A'!$A$24)","v":"Cores"},{"$f":"IF('Tex-424-A'!$A$33=\"\",\"\",'Tex-424-A'!$A$33)","v":7},{"$f":"IF('Tex-424-A'!$E$24=\"\",\"\",'Tex-424-A'!$E$24)","v":"Length of Core "}]
[63,{"$f":"IF('Tex-424-A'!$F$33=\"\",\"\",'Tex-424-A'!$F$33)","v":""},{"$f":"IF('Tex-424-A'!$B$23=\"\",\"\",'Tex-424-A'!$B$23)","v":"Tex-424-A"},{"$f":"IF('Tex-424-A'!$A$24=\"\",\"\",'Tex-424-A'!$A$24)","v":"Cores"},{"$f":"IF('Tex-424-A'!$A$33=\"\",\"\",'Tex-424-A'!$A$33)","v":7},{"$f":"IF('Tex-424-A'!$F$24=\"\",\"\",'Tex-424-A'!$F$24)","v":"Length to Diameter Ratio"}]
[64,{"$f":"IF('Tex-424-A'!$G$33=\"\",\"\",'Tex-424-A'!$G$33)","v":""},{"$f":"IF('Tex-424-A'!$B$23=\"\",\"\",'Tex-424-A'!$B$23)","v":"Tex-424-A"},{"$f":"IF('Tex-424-A'!$A$24=\"\",\"\",'Tex-424-A'!$A$24)","v":"Cores"},{"$f":"IF('Tex-424-A'!$A$33=\"\",\"\",'Tex-424-A'!$A$33)","v":7},{"$f":"IF('Tex-424-A'!$G$24=\"\",\"\",'Tex-424-A'!$G$24)","v":"Max Load "}]
[65,{"$f":"IF('Tex-424-A'!$H$33=\"\",\"\",'Tex-424-A'!$H$33)","v":""},{"$f":"IF('Tex-424-A'!$B$23=\"\",\"\",'Tex-424-A'!$B$23)","v":"Tex-424-A"},{"$f":"IF('Tex-424-A'!$A$24=\"\",\"\",'Tex-424-A'!$A$24)","v":"Cores"},{"$f":"IF('Tex-424-A'!$A$33=\"\",\"\",'Tex-424-A'!$A$33)","v":7},{"$f":"IF('Tex-424-A'!$H$24=\"\",\"\",'Tex-424-A'!$H$24)","v":"Failure Type"}]
[66,{"$f":"IF('Tex-424-A'!$I$33=\"\",\"\",'Tex-424-A'!$I$33)","v":""},{"$f":"IF('Tex-424-A'!$B$23=\"\",\"\",'Tex-424-A'!$B$23)","v":"Tex-424-A"},{"$f":"IF('Tex-424-A'!$A$24=\"\",\"\",'Tex-424-A'!$A$24)","v":"Cores"},{"$f":"IF('Tex-424-A'!$A$33=\"\",\"\",'Tex-424-A'!$A$33)","v":7},{"$f":"IF('Tex-424-A'!$I$24=\"\",\"\",'Tex-424-A'!$I$24)","v":"Correction Factor"}]
[67,{"$f":"IF('Tex-424-A'!$J$33=\"\",\"\",'Tex-424-A'!$J$33)","v":""},{"$f":"IF('Tex-424-A'!$B$23=\"\",\"\",'Tex-424-A'!$B$23)","v":"Tex-424-A"},{"$f":"IF('Tex-424-A'!$A$24=\"\",\"\",'Tex-424-A'!$A$24)","v":"Cores"},{"$f":"IF('Tex-424-A'!$A$33=\"\",\"\",'Tex-424-A'!$A$33)","v":7},{"$f":"IF('Tex-424-A'!$J$24=\"\",\"\",'Tex-424-A'!$J$24)","v":"Compressive Strength "}]
[68,{"$f":"IF('Tex-424-A'!$K$33=\"\",\"\",'Tex-424-A'!$K$33)","v":""},{"$f":"IF('Tex-424-A'!$B$23=\"\",\"\",'Tex-424-A'!$B$23)","v":"Tex-424-A"},{"$f":"IF('Tex-424-A'!$A$24=\"\",\"\",'Tex-424-A'!$A$24)","v":"Cores"},{"$f":"IF('Tex-424-A'!$A$33=\"\",\"\",'Tex-424-A'!$A$33)","v":7},{"$f":"IF('Tex-424-A'!$K$24=\"\",\"\",'Tex-424-A'!$K$24)","v":"Compressive Strength Average "}]
[69,{"$f":"IF('Tex-424-A'!$B$34=\"\",\"\",'Tex-424-A'!$B$34)","v":""},{"$f":"IF('Tex-424-A'!$B$23=\"\",\"\",'Tex-424-A'!$B$23)","v":"Tex-424-A"},{"$f":"IF('Tex-424-A'!$A$24=\"\",\"\",'Tex-424-A'!$A$24)","v":"Cores"},{"$f":"IF('Tex-424-A'!$A$34=\"\",\"\",'Tex-424-A'!$A$34)","v":8},{"$f":"IF('Tex-424-A'!$B$24=\"\",\"\",'Tex-424-A'!$B$24)","v":"Core Number"}]
[70,{"$f":"IF('Tex-424-A'!$D$34=\"\",\"\",'Tex-424-A'!$D$34)","v":""},{"$f":"IF('Tex-424-A'!$B$23=\"\",\"\",'Tex-424-A'!$B$23)","v":"Tex-424-A"},{"$f":"IF('Tex-424-A'!$A$24=\"\",\"\",'Tex-424-A'!$A$24)","v":"Cores"},{"$f":"IF('Tex-424-A'!$A$34=\"\",\"\",'Tex-424-A'!$A$34)","v":8},{"$f":"IF('Tex-424-A'!$D$25=\"\",\"\",'Tex-424-A'!$D$25)","v":" of Core "}]
[71,{"$f":"IF('Tex-424-A'!$E$34=\"\",\"\",'Tex-424-A'!$E$34)","v":""},{"$f":"IF('Tex-424-A'!$B$23=\"\",\"\",'Tex-424-A'!$B$23)","v":"Tex-424-A"},{"$f":"IF('Tex-424-A'!$A$24=\"\",\"\",'Tex-424-A'!$A$24)","v":"Cores"},{"$f":"IF('Tex-424-A'!$A$34=\"\",\"\",'Tex-424-A'!$A$34)","v":8},{"$f":"IF('Tex-424-A'!$E$24=\"\",\"\",'Tex-424-A'!$E$24)","v":"Length of Core "}]
[72,{"$f":"IF('Tex-424-A'!$F$34=\"\",\"\",'Tex-424-A'!$F$34)","v":""},{"$f":"IF('Tex-424-A'!$B$23=\"\",\"\",'Tex-424-A'!$B$23)","v":"Tex-424-A"},{"$f":"IF('Tex-424-A'!$A$24=\"\",\"\",'Tex-424-A'!$A$24)","v":"Cores"},{"$f":"IF('Tex-424-A'!$A$34=\"\",\"\",'Tex-424-A'!$A$34)","v":8},{"$f":"IF('Tex-424-A'!$F$24=\"\",\"\",'Tex-424-A'!$F$24)","v":"Length to Diameter Ratio"}]
[73,{"$f":"IF('Tex-424-A'!$G$34=\"\",\"\",'Tex-424-A'!$G$34)","v":""},{"$f":"IF('Tex-424-A'!$B$23=\"\",\"\",'Tex-424-A'!$B$23)","v":"Tex-424-A"},{"$f":"IF('Tex-424-A'!$A$24=\"\",\"\",'Tex-424-A'!$A$24)","v":"Cores"},{"$f":"IF('Tex-424-A'!$A$34=\"\",\"\",'Tex-424-A'!$A$34)","v":8},{"$f":"IF('Tex-424-A'!$G$24=\"\",\"\",'Tex-424-A'!$G$24)","v":"Max Load "}]
[74,{"$f":"IF('Tex-424-A'!$H$34=\"\",\"\",'Tex-424-A'!$H$34)","v":""},{"$f":"IF('Tex-424-A'!$B$23=\"\",\"\",'Tex-424-A'!$B$23)","v":"Tex-424-A"},{"$f":"IF('Tex-424-A'!$A$24=\"\",\"\",'Tex-424-A'!$A$24)","v":"Cores"},{"$f":"IF('Tex-424-A'!$A$34=\"\",\"\",'Tex-424-A'!$A$34)","v":8},{"$f":"IF('Tex-424-A'!$H$24=\"\",\"\",'Tex-424-A'!$H$24)","v":"Failure Type"}]
[75,{"$f":"IF('Tex-424-A'!$I$34=\"\",\"\",'Tex-424-A'!$I$34)","v":""},{"$f":"IF('Tex-424-A'!$B$23=\"\",\"\",'Tex-424-A'!$B$23)","v":"Tex-424-A"},{"$f":"IF('Tex-424-A'!$A$24=\"\",\"\",'Tex-424-A'!$A$24)","v":"Cores"},{"$f":"IF('Tex-424-A'!$A$34=\"\",\"\",'Tex-424-A'!$A$34)","v":8},{"$f":"IF('Tex-424-A'!$I$24=\"\",\"\",'Tex-424-A'!$I$24)","v":"Correction Factor"}]
[76,{"$f":"IF('Tex-424-A'!$J$34=\"\",\"\",'Tex-424-A'!$J$34)","v":""},{"$f":"IF('Tex-424-A'!$B$23=\"\",\"\",'Tex-424-A'!$B$23)","v":"Tex-424-A"},{"$f":"IF('Tex-424-A'!$A$24=\"\",\"\",'Tex-424-A'!$A$24)","v":"Cores"},{"$f":"IF('Tex-424-A'!$A$34=\"\",\"\",'Tex-424-A'!$A$34)","v":8},{"$f":"IF('Tex-424-A'!$J$24=\"\",\"\",'Tex-424-A'!$J$24)","v":"Compressive Strength "}]
[77,{"$f":"IF('Tex-424-A'!$C$43=\"\",\"\",'Tex-424-A'!$C$43)","v":""},"Tested By ",{"$f":"IF('Tex-424-A'!$B$43=\"\",\"\",'Tex-424-A'!$B$43)","v":"TX424,III"}]
[78,{"$f":"IF('Tex-424-A'!$F$43=\"\",\"\",'Tex-424-A'!$F$43)","v":""},"Tested Date ",{"$f":"IF('Tex-424-A'!$B$43=\"\",\"\",'Tex-424-A'!$B$43)","v":"TX424,III"}]

{"sheet":"L to D Lookup","index":2,"n_rows":112,"n_cols":7,"rows_kept":112,"cut":false,"hidden":true,"merged":[]}
["Length to Diameter Ratio","Correction Factor",null,"English MOR","Metric MOR"]
[1,0.87,null,{"$f":"IF(ISERROR(IF('Tex-424-A'!#REF!>('Tex-424-A'!#REF!*0.05),\"RETEST\",IF('Tex-424-A'!#REF!=0,ROUND(((('Tex-424-A'!#REF!*6^3/'Tex-424-A'!#REF!)*'Tex-424-A'!#REF!)/('Tex-424-A'!#REF!*'Tex-424-A'!#REF!^2))*2,-1)/2,(ROUND(3*((('Tex-424-A'!#REF!*6^3/'Tex-424-A'!#REF!)*('Tex-424-A'!#REF!/3-'Tex-424-A'!#REF!))/('Tex-424-A'!#REF!*'Tex-424-A'!#REF!^2))*2,-1)/2)))),\"\",IF('Tex-424-A'!#REF!>('Tex-424-A'!#REF!*0.05),\"RETEST\",IF('Tex-424-A'!#REF!=0,ROUND(((('Tex-424-A'!#REF!*6^3/'Tex-424-A'!#REF!)*'Tex-424-A'!#REF!)/('Tex-424-A'!#REF!*'Tex-424-A'!#REF!^2))*2,-1)/2,(ROUND(3*((('Tex-424-A'!#REF!*6^3/'Tex-424-A'!#REF!)*('Tex-424-A'!#REF!/3-'Tex-424-A'!#REF!))/('Tex-424-A'!#REF!*'Tex-424-A'!#REF!^2))*2,-1)/2))))","v":""},{"$f":"IF(ISERROR(IF('Tex-424-A'!#REF!>('Tex-424-A'!#REF!*0.05),\"RETEST\",IF('Tex-424-A'!#REF!=0,ROUND((((('Tex-424-A'!#REF!*1000)*('Tex-424-A'!#REF!))/(('Tex-424-A'!#REF!)*(('Tex-424-A'!#REF!))^2)))*2,-2)/2,ROUND((3*((('Tex-424-A'!#REF!*1000)*('Tex-424-A'!#REF!/3-'Tex-424-A'!#REF!))/('Tex-424-A'!#REF!*'Tex-424-A'!#REF!^2)))*2,-2)/2))),\"\",IF('Tex-424-A'!#REF!>('Tex-424-A'!#REF!*0.05),\"RETEST\",IF('Tex-424-A'!#REF!=0,ROUND((((('Tex-424-A'!#REF!*1000)*('Tex-424-A'!#REF!))/(('Tex-424-A'!#REF!)*(('Tex-424-A'!#REF!))^2)))*2,-2)/2,ROUND((3*((('Tex-424-A'!#REF!*1000)*('Tex-424-A'!#REF!/3-'Tex-424-A'!#REF!))/('Tex-424-A'!#REF!*'Tex-424-A'!#REF!^2)))*2,-2)/2)))","v":""}]
[1.01,0.872,null,{"$f":"IF(ISERROR(IF('Tex-424-A'!#REF!>('Tex-424-A'!#REF!*0.05),\"RETEST\",IF('Tex-424-A'!#REF!=0,ROUND(((('Tex-424-A'!#REF!*6^3/'Tex-424-A'!#REF!)*'Tex-424-A'!#REF!)/('Tex-424-A'!#REF!*'Tex-424-A'!#REF!^2))*2,-1)/2,(ROUND(3*((('Tex-424-A'!#REF!*6^3/'Tex-424-A'!#REF!)*('Tex-424-A'!#REF!/3-'Tex-424-A'!#REF!))/('Tex-424-A'!#REF!*'Tex-424-A'!#REF!^2))*2,-1)/2)))),\"\",IF('Tex-424-A'!#REF!>('Tex-424-A'!#REF!*0.05),\"RETEST\",IF('Tex-424-A'!#REF!=0,ROUND(((('Tex-424-A'!#REF!*6^3/'Tex-424-A'!#REF!)*'Tex-424-A'!#REF!)/('Tex-424-A'!#REF!*'Tex-424-A'!#REF!^2))*2,-1)/2,(ROUND(3*((('Tex-424-A'!#REF!*6^3/'Tex-424-A'!#REF!)*('Tex-424-A'!#REF!/3-'Tex-424-A'!#REF!))/('Tex-424-A'!#REF!*'Tex-424-A'!#REF!^2))*2,-1)/2))))","v":""},{"$f":"IF(ISERROR(IF('Tex-424-A'!#REF!>('Tex-424-A'!#REF!*0.05),\"RETEST\",IF('Tex-424-A'!#REF!=0,ROUND((((('Tex-424-A'!#REF!*1000)*('Tex-424-A'!#REF!))/(('Tex-424-A'!#REF!)*(('Tex-424-A'!#REF!))^2)))*2,-2)/2,ROUND((3*((('Tex-424-A'!#REF!*1000)*('Tex-424-A'!#REF!/3-'Tex-424-A'!#REF!))/('Tex-424-A'!#REF!*'Tex-424-A'!#REF!^2)))*2,-2)/2))),\"\",IF('Tex-424-A'!#REF!>('Tex-424-A'!#REF!*0.05),\"RETEST\",IF('Tex-424-A'!#REF!=0,ROUND((((('Tex-424-A'!#REF!*1000)*('Tex-424-A'!#REF!))/(('Tex-424-A'!#REF!)*(('Tex-424-A'!#REF!))^2)))*2,-2)/2,ROUND((3*((('Tex-424-A'!#REF!*1000)*('Tex-424-A'!#REF!/3-'Tex-424-A'!#REF!))/('Tex-424-A'!#REF!*'Tex-424-A'!#REF!^2)))*2,-2)/2)))","v":""}]
[1.02,0.875,null,{"$f":"IF(ISERROR(IF('Tex-424-A'!#REF!>('Tex-424-A'!#REF!*0.05),\"RETEST\",IF('Tex-424-A'!#REF!=0,ROUND(((('Tex-424-A'!#REF!*6^3/'Tex-424-A'!#REF!)*'Tex-424-A'!#REF!)/('Tex-424-A'!#REF!*'Tex-424-A'!#REF!^2))*2,-1)/2,(ROUND(3*((('Tex-424-A'!#REF!*6^3/'Tex-424-A'!#REF!)*('Tex-424-A'!#REF!/3-'Tex-424-A'!#REF!))/('Tex-424-A'!#REF!*'Tex-424-A'!#REF!^2))*2,-1)/2)))),\"\",IF('Tex-424-A'!#REF!>('Tex-424-A'!#REF!*0.05),\"RETEST\",IF('Tex-424-A'!#REF!=0,ROUND(((('Tex-424-A'!#REF!*6^3/'Tex-424-A'!#REF!)*'Tex-424-A'!#REF!)/('Tex-424-A'!#REF!*'Tex-424-A'!#REF!^2))*2,-1)/2,(ROUND(3*((('Tex-424-A'!#REF!*6^3/'Tex-424-A'!#REF!)*('Tex-424-A'!#REF!/3-'Tex-424-A'!#REF!))/('Tex-424-A'!#REF!*'Tex-424-A'!#REF!^2))*2,-1)/2))))","v":""},{"$f":"IF(ISERROR(IF('Tex-424-A'!#REF!>('Tex-424-A'!#REF!*0.05),\"RETEST\",IF('Tex-424-A'!#REF!=0,ROUND((((('Tex-424-A'!#REF!*1000)*('Tex-424-A'!#REF!))/(('Tex-424-A'!#REF!)*(('Tex-424-A'!#REF!))^2)))*2,-2)/2,ROUND((3*((('Tex-424-A'!#REF!*1000)*('Tex-424-A'!#REF!/3-'Tex-424-A'!#REF!))/('Tex-424-A'!#REF!*'Tex-424-A'!#REF!^2)))*2,-2)/2))),\"\",IF('Tex-424-A'!#REF!>('Tex-424-A'!#REF!*0.05),\"RETEST\",IF('Tex-424-A'!#REF!=0,ROUND((((('Tex-424-A'!#REF!*1000)*('Tex-424-A'!#REF!))/(('Tex-424-A'!#REF!)*(('Tex-424-A'!#REF!))^2)))*2,-2)/2,ROUND((3*((('Tex-424-A'!#REF!*1000)*('Tex-424-A'!#REF!/3-'Tex-424-A'!#REF!))/('Tex-424-A'!#REF!*'Tex-424-A'!#REF!^2)))*2,-2)/2)))","v":""}]
[1.03,0.877,null,{"$f":"IF(ISERROR(IF('Tex-424-A'!#REF!>('Tex-424-A'!#REF!*0.05),\"RETEST\",IF('Tex-424-A'!#REF!=0,ROUND(((('Tex-424-A'!#REF!*6^3/'Tex-424-A'!#REF!)*'Tex-424-A'!#REF!)/('Tex-424-A'!#REF!*'Tex-424-A'!#REF!^2))*2,-1)/2,(ROUND(3*((('Tex-424-A'!#REF!*6^3/'Tex-424-A'!#REF!)*('Tex-424-A'!#REF!/3-'Tex-424-A'!#REF!))/('Tex-424-A'!#REF!*'Tex-424-A'!#REF!^2))*2,-1)/2)))),\"\",IF('Tex-424-A'!#REF!>('Tex-424-A'!#REF!*0.05),\"RETEST\",IF('Tex-424-A'!#REF!=0,ROUND(((('Tex-424-A'!#REF!*6^3/'Tex-424-A'!#REF!)*'Tex-424-A'!#REF!)/('Tex-424-A'!#REF!*'Tex-424-A'!#REF!^2))*2,-1)/2,(ROUND(3*((('Tex-424-A'!#REF!*6^3/'Tex-424-A'!#REF!)*('Tex-424-A'!#REF!/3-'Tex-424-A'!#REF!))/('Tex-424-A'!#REF!*'Tex-424-A'!#REF!^2))*2,-1)/2))))","v":""},{"$f":"IF(ISERROR(IF('Tex-424-A'!#REF!>('Tex-424-A'!#REF!*0.05),\"RETEST\",IF('Tex-424-A'!#REF!=0,ROUND((((('Tex-424-A'!#REF!*1000)*('Tex-424-A'!#REF!))/(('Tex-424-A'!#REF!)*(('Tex-424-A'!#REF!))^2)))*2,-2)/2,ROUND((3*((('Tex-424-A'!#REF!*1000)*('Tex-424-A'!#REF!/3-'Tex-424-A'!#REF!))/('Tex-424-A'!#REF!*'Tex-424-A'!#REF!^2)))*2,-2)/2))),\"\",IF('Tex-424-A'!#REF!>('Tex-424-A'!#REF!*0.05),\"RETEST\",IF('Tex-424-A'!#REF!=0,ROUND((((('Tex-424-A'!#REF!*1000)*('Tex-424-A'!#REF!))/(('Tex-424-A'!#REF!)*(('Tex-424-A'!#REF!))^2)))*2,-2)/2,ROUND((3*((('Tex-424-A'!#REF!*1000)*('Tex-424-A'!#REF!/3-'Tex-424-A'!#REF!))/('Tex-424-A'!#REF!*'Tex-424-A'!#REF!^2)))*2,-2)/2)))","v":""}]
[1.04,0.88,null,{"$f":"IF(ISERROR(IF('Tex-424-A'!#REF!>('Tex-424-A'!#REF!*0.05),\"RETEST\",IF('Tex-424-A'!#REF!=0,ROUND(((('Tex-424-A'!#REF!*6^3/'Tex-424-A'!#REF!)*'Tex-424-A'!#REF!)/('Tex-424-A'!#REF!*'Tex-424-A'!#REF!^2))*2,-1)/2,(ROUND(3*((('Tex-424-A'!#REF!*6^3/'Tex-424-A'!#REF!)*('Tex-424-A'!#REF!/3-'Tex-424-A'!#REF!))/('Tex-424-A'!#REF!*'Tex-424-A'!#REF!^2))*2,-1)/2)))),\"\",IF('Tex-424-A'!#REF!>('Tex-424-A'!#REF!*0.05),\"RETEST\",IF('Tex-424-A'!#REF!=0,ROUND(((('Tex-424-A'!#REF!*6^3/'Tex-424-A'!#REF!)*'Tex-424-A'!#REF!)/('Tex-424-A'!#REF!*'Tex-424-A'!#REF!^2))*2,-1)/2,(ROUND(3*((('Tex-424-A'!#REF!*6^3/'Tex-424-A'!#REF!)*('Tex-424-A'!#REF!/3-'Tex-424-A'!#REF!))/('Tex-424-A'!#REF!*'Tex-424-A'!#REF!^2))*2,-1)/2))))","v":""},{"$f":"IF(ISERROR(IF('Tex-424-A'!#REF!>('Tex-424-A'!#REF!*0.05),\"RETEST\",IF('Tex-424-A'!#REF!=0,ROUND((((('Tex-424-A'!#REF!*1000)*('Tex-424-A'!#REF!))/(('Tex-424-A'!#REF!)*(('Tex-424-A'!#REF!))^2)))*2,-2)/2,ROUND((3*((('Tex-424-A'!#REF!*1000)*('Tex-424-A'!#REF!/3-'Tex-424-A'!#REF!))/('Tex-424-A'!#REF!*'Tex-424-A'!#REF!^2)))*2,-2)/2))),\"\",IF('Tex-424-A'!#REF!>('Tex-424-A'!#REF!*0.05),\"RETEST\",IF('Tex-424-A'!#REF!=0,ROUND((((('Tex-424-A'!#REF!*1000)*('Tex-424-A'!#REF!))/(('Tex-424-A'!#REF!)*(('Tex-424-A'!#REF!))^2)))*2,-2)/2,ROUND((3*((('Tex-424-A'!#REF!*1000)*('Tex-424-A'!#REF!/3-'Tex-424-A'!#REF!))/('Tex-424-A'!#REF!*'Tex-424-A'!#REF!^2)))*2,-2)/2)))","v":""}]
[1.05,0.88200000000000001,null,{"$f":"IF(ISERROR(IF('Tex-424-A'!#REF!>('Tex-424-A'!#REF!*0.05),\"RETEST\",IF('Tex-424-A'!#REF!=0,ROUND(((('Tex-424-A'!#REF!*6^3/'Tex-424-A'!#REF!)*'Tex-424-A'!#REF!)/('Tex-424-A'!#REF!*'Tex-424-A'!#REF!^2))*2,-1)/2,(ROUND(3*((('Tex-424-A'!#REF!*6^3/'Tex-424-A'!#REF!)*('Tex-424-A'!#REF!/3-'Tex-424-A'!#REF!))/('Tex-424-A'!#REF!*'Tex-424-A'!#REF!^2))*2,-1)/2)))),\"\",IF('Tex-424-A'!#REF!>('Tex-424-A'!#REF!*0.05),\"RETEST\",IF('Tex-424-A'!#REF!=0,ROUND(((('Tex-424-A'!#REF!*6^3/'Tex-424-A'!#REF!)*'Tex-424-A'!#REF!)/('Tex-424-A'!#REF!*'Tex-424-A'!#REF!^2))*2,-1)/2,(ROUND(3*((('Tex-424-A'!#REF!*6^3/'Tex-424-A'!#REF!)*('Tex-424-A'!#REF!/3-'Tex-424-A'!#REF!))/('Tex-424-A'!#REF!*'Tex-424-A'!#REF!^2))*2,-1)/2))))","v":""},{"$f":"IF(ISERROR(IF('Tex-424-A'!#REF!>('Tex-424-A'!#REF!*0.05),\"RETEST\",IF('Tex-424-A'!#REF!=0,ROUND((((('Tex-424-A'!#REF!*1000)*('Tex-424-A'!#REF!))/(('Tex-424-A'!#REF!)*(('Tex-424-A'!#REF!))^2)))*2,-2)/2,ROUND((3*((('Tex-424-A'!#REF!*1000)*('Tex-424-A'!#REF!/3-'Tex-424-A'!#REF!))/('Tex-424-A'!#REF!*'Tex-424-A'!#REF!^2)))*2,-2)/2))),\"\",IF('Tex-424-A'!#REF!>('Tex-424-A'!#REF!*0.05),\"RETEST\",IF('Tex-424-A'!#REF!=0,ROUND((((('Tex-424-A'!#REF!*1000)*('Tex-424-A'!#REF!))/(('Tex-424-A'!#REF!)*(('Tex-424-A'!#REF!))^2)))*2,-2)/2,ROUND((3*((('Tex-424-A'!#REF!*1000)*('Tex-424-A'!#REF!/3-'Tex-424-A'!#REF!))/('Tex-424-A'!#REF!*'Tex-424-A'!#REF!^2)))*2,-2)/2)))","v":""}]
[1.06,0.88400000000000001,null,{"$f":"IF(ISERROR(IF('Tex-424-A'!#REF!>('Tex-424-A'!#REF!*0.05),\"RETEST\",IF('Tex-424-A'!#REF!=0,ROUND(((('Tex-424-A'!#REF!*6^3/'Tex-424-A'!#REF!)*'Tex-424-A'!#REF!)/('Tex-424-A'!#REF!*'Tex-424-A'!#REF!^2))*2,-1)/2,(ROUND(3*((('Tex-424-A'!#REF!*6^3/'Tex-424-A'!#REF!)*('Tex-424-A'!#REF!/3-'Tex-424-A'!#REF!))/('Tex-424-A'!#REF!*'Tex-424-A'!#REF!^2))*2,-1)/2)))),\"\",IF('Tex-424-A'!#REF!>('Tex-424-A'!#REF!*0.05),\"RETEST\",IF('Tex-424-A'!#REF!=0,ROUND(((('Tex-424-A'!#REF!*6^3/'Tex-424-A'!#REF!)*'Tex-424-A'!#REF!)/('Tex-424-A'!#REF!*'Tex-424-A'!#REF!^2))*2,-1)/2,(ROUND(3*((('Tex-424-A'!#REF!*6^3/'Tex-424-A'!#REF!)*('Tex-424-A'!#REF!/3-'Tex-424-A'!#REF!))/('Tex-424-A'!#REF!*'Tex-424-A'!#REF!^2))*2,-1)/2))))","v":""},{"$f":"IF(ISERROR(IF('Tex-424-A'!#REF!>('Tex-424-A'!#REF!*0.05),\"RETEST\",IF('Tex-424-A'!#REF!=0,ROUND((((('Tex-424-A'!#REF!*1000)*('Tex-424-A'!#REF!))/(('Tex-424-A'!#REF!)*(('Tex-424-A'!#REF!))^2)))*2,-2)/2,ROUND((3*((('Tex-424-A'!#REF!*1000)*('Tex-424-A'!#REF!/3-'Tex-424-A'!#REF!))/('Tex-424-A'!#REF!*'Tex-424-A'!#REF!^2)))*2,-2)/2))),\"\",IF('Tex-424-A'!#REF!>('Tex-424-A'!#REF!*0.05),\"RETEST\",IF('Tex-424-A'!#REF!=0,ROUND((((('Tex-424-A'!#REF!*1000)*('Tex-424-A'!#REF!))/(('Tex-424-A'!#REF!)*(('Tex-424-A'!#REF!))^2)))*2,-2)/2,ROUND((3*((('Tex-424-A'!#REF!*1000)*('Tex-424-A'!#REF!/3-'Tex-424-A'!#REF!))/('Tex-424-A'!#REF!*'Tex-424-A'!#REF!^2)))*2,-2)/2)))","v":""}]
[1.07,0.88700000000000001,null,{"$f":"IF(ISERROR(IF('Tex-424-A'!#REF!>('Tex-424-A'!#REF!*0.05),\"RETEST\",IF('Tex-424-A'!#REF!=0,ROUND(((('Tex-424-A'!#REF!*6^3/'Tex-424-A'!#REF!)*'Tex-424-A'!#REF!)/('Tex-424-A'!#REF!*'Tex-424-A'!#REF!^2))*2,-1)/2,(ROUND(3*((('Tex-424-A'!#REF!*6^3/'Tex-424-A'!#REF!)*('Tex-424-A'!#REF!/3-'Tex-424-A'!#REF!))/('Tex-424-A'!#REF!*'Tex-424-A'!#REF!^2))*2,-1)/2)))),\"\",IF('Tex-424-A'!#REF!>('Tex-424-A'!#REF!*0.05),\"RETEST\",IF('Tex-424-A'!#REF!=0,ROUND(((('Tex-424-A'!#REF!*6^3/'Tex-424-A'!#REF!)*'Tex-424-A'!#REF!)/('Tex-424-A'!#REF!*'Tex-424-A'!#REF!^2))*2,-1)/2,(ROUND(3*((('Tex-424-A'!#REF!*6^3/'Tex-424-A'!#REF!)*('Tex-424-A'!#REF!/3-'Tex-424-A'!#REF!))/('Tex-424-A'!#REF!*'Tex-424-A'!#REF!^2))*2,-1)/2))))","v":""},{"$f":"IF(ISERROR(IF('Tex-424-A'!#REF!>('Tex-424-A'!#REF!*0.05),\"RETEST\",IF('Tex-424-A'!#REF!=0,ROUND((((('Tex-424-A'!#REF!*1000)*('Tex-424-A'!#REF!))/(('Tex-424-A'!#REF!)*(('Tex-424-A'!#REF!))^2)))*2,-2)/2,ROUND((3*((('Tex-424-A'!#REF!*1000)*('Tex-424-A'!#REF!/3-'Tex-424-A'!#REF!))/('Tex-424-A'!#REF!*'Tex-424-A'!#REF!^2)))*2,-2)/2))),\"\",IF('Tex-424-A'!#REF!>('Tex-424-A'!#REF!*0.05),\"RETEST\",IF('Tex-424-A'!#REF!=0,ROUND((((('Tex-424-A'!#REF!*1000)*('Tex-424-A'!#REF!))/(('Tex-424-A'!#REF!)*(('Tex-424-A'!#REF!))^2)))*2,-2)/2,ROUND((3*((('Tex-424-A'!#REF!*1000)*('Tex-424-A'!#REF!/3-'Tex-424-A'!#REF!))/('Tex-424-A'!#REF!*'Tex-424-A'!#REF!^2)))*2,-2)/2)))","v":""}]
[1.08,0.88900000000000001]
[1.0900000000000001,0.89200000000000002,null,"English f'c","Metric f'c"]
[1.1000000000000001,0.89400000000000002,null,{"$f":"IF(ISERROR(ROUND('Tex-424-A'!#REF!*('Tex-424-A'!#REF!/(PI()*(IF(CircumDiameter1=\"Diameter\",'Tex-424-A'!#REF!,SQRT('Tex-424-A'!#REF!/PI())*2)^2/4))),-1)),\"\",ROUND('Tex-424-A'!#REF!*('Tex-424-A'!#REF!/(PI()*(IF(CircumDiameter1=\"Diameter\",'Tex-424-A'!#REF!,SQRT('Tex-424-A'!#REF!/PI())*2)^2/4))),-1))","v":""},{"$f":"IF(ISERROR(ROUND(0.000001*('Tex-424-A'!#REF!*('Tex-424-A'!#REF!/(PI()*((IF(CircumDiameter1=\"Diameter\",'Tex-424-A'!#REF!,SQRT('Tex-424-A'!#REF!/PI())*2)/1000)^2/4))))*2,1)/2),\"\",ROUND(0.000001*('Tex-424-A'!#REF!*('Tex-424-A'!#REF!/(PI()*((IF(CircumDiameter1=\"Diameter\",'Tex-424-A'!#REF!,SQRT('Tex-424-A'!#REF!/PI())*2)/1000)^2/4))))*2,1)/2)","v":""}]
[1.1100000000000001,0.89600000000000002,null,{"$f":"IF(ISERROR(ROUND('Tex-424-A'!#REF!*('Tex-424-A'!#REF!/(PI()*(IF(CircumDiameter1=\"Diameter\",'Tex-424-A'!#REF!,SQRT('Tex-424-A'!#REF!/PI())*2)^2/4))),-1)),\"\",ROUND('Tex-424-A'!#REF!*('Tex-424-A'!#REF!/(PI()*(IF(CircumDiameter1=\"Diameter\",'Tex-424-A'!#REF!,SQRT('Tex-424-A'!#REF!/PI())*2)^2/4))),-1))","v":""},{"$f":"IF(ISERROR(ROUND(0.000001*('Tex-424-A'!#REF!*('Tex-424-A'!#REF!/(PI()*((IF(CircumDiameter1=\"Diameter\",'Tex-424-A'!#REF!,SQRT('Tex-424-A'!#REF!/PI())*2)/1000)^2/4))))*2,1)/2),\"\",ROUND(0.000001*('Tex-424-A'!#REF!*('Tex-424-A'!#REF!/(PI()*((IF(CircumDiameter1=\"Diameter\",'Tex-424-A'!#REF!,SQRT('Tex-424-A'!#REF!/PI())*2)/1000)^2/4))))*2,1)/2)","v":""}]
[1.1200000000000001,0.89900000000000002,null,{"$f":"IF(ISERROR(ROUND('Tex-424-A'!#REF!*('Tex-424-A'!#REF!/(PI()*(IF(CircumDiameter1=\"Diameter\",'Tex-424-A'!#REF!,SQRT('Tex-424-A'!#REF!/PI())*2)^2/4))),-1)),\"\",ROUND('Tex-424-A'!#REF!*('Tex-424-A'!#REF!/(PI()*(IF(CircumDiameter1=\"Diameter\",'Tex-424-A'!#REF!,SQRT('Tex-424-A'!#REF!/PI())*2)^2/4))),-1))","v":""},{"$f":"IF(ISERROR(ROUND(0.000001*('Tex-424-A'!#REF!*('Tex-424-A'!#REF!/(PI()*((IF(CircumDiameter1=\"Diameter\",'Tex-424-A'!#REF!,SQRT('Tex-424-A'!#REF!/PI())*2)/1000)^2/4))))*2,1)/2),\"\",ROUND(0.000001*('Tex-424-A'!#REF!*('Tex-424-A'!#REF!/(PI()*((IF(CircumDiameter1=\"Diameter\",'Tex-424-A'!#REF!,SQRT('Tex-424-A'!#REF!/PI())*2)/1000)^2/4))))*2,1)/2)","v":""}]
[1.1299999999999999,0.90100000000000002,null,{"$f":"IF(ISERROR(ROUND('Tex-424-A'!#REF!*('Tex-424-A'!#REF!/(PI()*(IF(CircumDiameter1=\"Diameter\",'Tex-424-A'!#REF!,SQRT('Tex-424-A'!#REF!/PI())*2)^2/4))),-1)),\"\",ROUND('Tex-424-A'!#REF!*('Tex-424-A'!#REF!/(PI()*(IF(CircumDiameter1=\"Diameter\",'Tex-424-A'!#REF!,SQRT('Tex-424-A'!#REF!/PI())*2)^2/4))),-1))","v":""},{"$f":"IF(ISERROR(ROUND(0.000001*('Tex-424-A'!#REF!*('Tex-424-A'!#REF!/(PI()*((IF(CircumDiameter1=\"Diameter\",'Tex-424-A'!#REF!,SQRT('Tex-424-A'!#REF!/PI())*2)/1000)^2/4))))*2,1)/2),\"\",ROUND(0.000001*('Tex-424-A'!#REF!*('Tex-424-A'!#REF!/(PI()*((IF(CircumDiameter1=\"Diameter\",'Tex-424-A'!#REF!,SQRT('Tex-424-A'!#REF!/PI())*2)/1000)^2/4))))*2,1)/2)","v":""}]
[1.1399999999999999,0.90400000000000003,null,{"$f":"IF(ISERROR(ROUND('Tex-424-A'!#REF!*('Tex-424-A'!#REF!/(PI()*(IF(CircumDiameter1=\"Diameter\",'Tex-424-A'!#REF!,SQRT('Tex-424-A'!#REF!/PI())*2)^2/4))),-1)),\"\",ROUND('Tex-424-A'!#REF!*('Tex-424-A'!#REF!/(PI()*(IF(CircumDiameter1=\"Diameter\",'Tex-424-A'!#REF!,SQRT('Tex-424-A'!#REF!/PI())*2)^2/4))),-1))","v":""},{"$f":"IF(ISERROR(ROUND(0.000001*('Tex-424-A'!#REF!*('Tex-424-A'!#REF!/(PI()*((IF(CircumDiameter1=\"Diameter\",'Tex-424-A'!#REF!,SQRT('Tex-424-A'!#REF!/PI())*2)/1000)^2/4))))*2,1)/2),\"\",ROUND(0.000001*('Tex-424-A'!#REF!*('Tex-424-A'!#REF!/(PI()*((IF(CircumDiameter1=\"Diameter\",'Tex-424-A'!#REF!,SQRT('Tex-424-A'!#REF!/PI())*2)/1000)^2/4))))*2,1)/2)","v":""}]
[1.1499999999999999,0.90600000000000003,null,{"$f":"IF(ISERROR(ROUND('Tex-424-A'!#REF!*('Tex-424-A'!#REF!/(PI()*(IF(CircumDiameter1=\"Diameter\",'Tex-424-A'!#REF!,SQRT('Tex-424-A'!#REF!/PI())*2)^2/4))),-1)),\"\",ROUND('Tex-424-A'!#REF!*('Tex-424-A'!#REF!/(PI()*(IF(CircumDiameter1=\"Diameter\",'Tex-424-A'!#REF!,SQRT('Tex-424-A'!#REF!/PI())*2)^2/4))),-1))","v":""},{"$f":"IF(ISERROR(ROUND(0.000001*('Tex-424-A'!#REF!*('Tex-424-A'!#REF!/(PI()*((IF(CircumDiameter1=\"Diameter\",'Tex-424-A'!#REF!,SQRT('Tex-424-A'!#REF!/PI())*2)/1000)^2/4))))*2,1)/2),\"\",ROUND(0.000001*('Tex-424-A'!#REF!*('Tex-424-A'!#REF!/(PI()*((IF(CircumDiameter1=\"Diameter\",'Tex-424-A'!#REF!,SQRT('Tex-424-A'!#REF!/PI())*2)/1000)^2/4))))*2,1)/2)","v":""}]
[1.1599999999999999,0.90800000000000003,null,{"$f":"IF(ISERROR(ROUND('Tex-424-A'!#REF!*('Tex-424-A'!#REF!/(PI()*(IF(CircumDiameter1=\"Diameter\",'Tex-424-A'!#REF!,SQRT('Tex-424-A'!#REF!/PI())*2)^2/4))),-1)),\"\",ROUND('Tex-424-A'!#REF!*('Tex-424-A'!#REF!/(PI()*(IF(CircumDiameter1=\"Diameter\",'Tex-424-A'!#REF!,SQRT('Tex-424-A'!#REF!/PI())*2)^2/4))),-1))","v":""},{"$f":"IF(ISERROR(ROUND(0.000001*('Tex-424-A'!#REF!*('Tex-424-A'!#REF!/(PI()*((IF(CircumDiameter1=\"Diameter\",'Tex-424-A'!#REF!,SQRT('Tex-424-A'!#REF!/PI())*2)/1000)^2/4))))*2,1)/2),\"\",ROUND(0.000001*('Tex-424-A'!#REF!*('Tex-424-A'!#REF!/(PI()*((IF(CircumDiameter1=\"Diameter\",'Tex-424-A'!#REF!,SQRT('Tex-424-A'!#REF!/PI())*2)/1000)^2/4))))*2,1)/2)","v":""}]
[1.17,0.91100000000000003,null,{"$f":"IF(ISERROR(ROUND('Tex-424-A'!#REF!*('Tex-424-A'!#REF!/(PI()*(IF(CircumDiameter1=\"Diameter\",'Tex-424-A'!#REF!,SQRT('Tex-424-A'!#REF!/PI())*2)^2/4))),-1)),\"\",ROUND('Tex-424-A'!#REF!*('Tex-424-A'!#REF!/(PI()*(IF(CircumDiameter1=\"Diameter\",'Tex-424-A'!#REF!,SQRT('Tex-424-A'!#REF!/PI())*2)^2/4))),-1))","v":""},{"$f":"IF(ISERROR(ROUND(0.000001*('Tex-424-A'!#REF!*('Tex-424-A'!#REF!/(PI()*((IF(CircumDiameter1=\"Diameter\",'Tex-424-A'!#REF!,SQRT('Tex-424-A'!#REF!/PI())*2)/1000)^2/4))))*2,1)/2),\"\",ROUND(0.000001*('Tex-424-A'!#REF!*('Tex-424-A'!#REF!/(PI()*((IF(CircumDiameter1=\"Diameter\",'Tex-424-A'!#REF!,SQRT('Tex-424-A'!#REF!/PI())*2)/1000)^2/4))))*2,1)/2)","v":""}]
[1.18,0.91300000000000003]
[1.19,0.91600000000000004,null,null,null,null,{"$f":"IF(CircumDiameter1=\"\",'Tex-424-A'!#REF!,SQRT('Tex-424-A'!#REF!/PI())*2)","v":{"$error":"#REF!"}}]
[1.2,0.91800000000000004,null,{"$f":"IF(ISERROR('Tex-424-A'!$I27*('Tex-424-A'!$G27/(PI()*(IF(CircumDiameter2=\"Diameter\",'Tex-424-A'!$D27,SQRT('Tex-424-A'!$D27/PI())*2)^2/4)))),\"\",'Tex-424-A'!$I27*('Tex-424-A'!$G27/(PI()*(IF(CircumDiameter2=\"Diameter\",'Tex-424-A'!$D27,SQRT('Tex-424-A'!$D27/PI())*2)^2/4))))","v":""},{"$f":"IF(ISERROR(0.000001*('Tex-424-A'!$I27*('Tex-424-A'!$G27/(PI()*((IF(CircumDiameter2=\"Diameter\",'Tex-424-A'!$D27,SQRT('Tex-424-A'!$D27/PI())*2)/1000)^2/4))))),\"\",0.000001*('Tex-424-A'!$I27*('Tex-424-A'!$G27/(PI()*((IF(CircumDiameter2=\"Diameter\",'Tex-424-A'!$D27,SQRT('Tex-424-A'!$D27/PI())*2)/1000)^2/4)))))","v":""}]
[1.21,0.92,null,{"$f":"IF(ISERROR('Tex-424-A'!$I28*('Tex-424-A'!$G28/(PI()*(IF(CircumDiameter2=\"Diameter\",'Tex-424-A'!$D28,SQRT('Tex-424-A'!$D28/PI())*2)^2/4)))),\"\",'Tex-424-A'!$I28*('Tex-424-A'!$G28/(PI()*(IF(CircumDiameter2=\"Diameter\",'Tex-424-A'!$D28,SQRT('Tex-424-A'!$D28/PI())*2)^2/4))))","v":""},{"$f":"IF(ISERROR(0.000001*('Tex-424-A'!$I28*('Tex-424-A'!$G28/(PI()*((IF(CircumDiameter2=\"Diameter\",'Tex-424-A'!$D28,SQRT('Tex-424-A'!$D28/PI())*2)/1000)^2/4))))),\"\",0.000001*('Tex-424-A'!$I28*('Tex-424-A'!$G28/(PI()*((IF(CircumDiameter2=\"Diameter\",'Tex-424-A'!$D28,SQRT('Tex-424-A'!$D28/PI())*2)/1000)^2/4)))))","v":""}]
[1.22,0.92300000000000004,null,{"$f":"IF(ISERROR('Tex-424-A'!$I29*('Tex-424-A'!$G29/(PI()*(IF(CircumDiameter2=\"Diameter\",'Tex-424-A'!$D29,SQRT('Tex-424-A'!$D29/PI())*2)^2/4)))),\"\",'Tex-424-A'!$I29*('Tex-424-A'!$G29/(PI()*(IF(CircumDiameter2=\"Diameter\",'Tex-424-A'!$D29,SQRT('Tex-424-A'!$D29/PI())*2)^2/4))))","v":""},{"$f":"IF(ISERROR(0.000001*('Tex-424-A'!$I29*('Tex-424-A'!$G29/(PI()*((IF(CircumDiameter2=\"Diameter\",'Tex-424-A'!$D29,SQRT('Tex-424-A'!$D29/PI())*2)/1000)^2/4))))),\"\",0.000001*('Tex-424-A'!$I29*('Tex-424-A'!$G29/(PI()*((IF(CircumDiameter2=\"Diameter\",'Tex-424-A'!$D29,SQRT('Tex-424-A'!$D29/PI())*2)/1000)^2/4)))))","v":""}]
[1.23,0.92500000000000004,null,{"$f":"IF(ISERROR('Tex-424-A'!$I30*('Tex-424-A'!$G30/(PI()*(IF(CircumDiameter2=\"Diameter\",'Tex-424-A'!$D30,SQRT('Tex-424-A'!$D30/PI())*2)^2/4)))),\"\",'Tex-424-A'!$I30*('Tex-424-A'!$G30/(PI()*(IF(CircumDiameter2=\"Diameter\",'Tex-424-A'!$D30,SQRT('Tex-424-A'!$D30/PI())*2)^2/4))))","v":""},{"$f":"IF(ISERROR(0.000001*('Tex-424-A'!$I30*('Tex-424-A'!$G30/(PI()*((IF(CircumDiameter2=\"Diameter\",'Tex-424-A'!$D30,SQRT('Tex-424-A'!$D30/PI())*2)/1000)^2/4))))),\"\",0.000001*('Tex-424-A'!$I30*('Tex-424-A'!$G30/(PI()*((IF(CircumDiameter2=\"Diameter\",'Tex-424-A'!$D30,SQRT('Tex-424-A'!$D30/PI())*2)/1000)^2/4)))))","v":""}]
[1.24,0.92800000000000005,null,{"$f":"IF(ISERROR('Tex-424-A'!$I31*('Tex-424-A'!$G31/(PI()*(IF(CircumDiameter2=\"Diameter\",'Tex-424-A'!$D31,SQRT('Tex-424-A'!$D31/PI())*2)^2/4)))),\"\",'Tex-424-A'!$I31*('Tex-424-A'!$G31/(PI()*(IF(CircumDiameter2=\"Diameter\",'Tex-424-A'!$D31,SQRT('Tex-424-A'!$D31/PI())*2)^2/4))))","v":""},{"$f":"IF(ISERROR(0.000001*('Tex-424-A'!$I31*('Tex-424-A'!$G31/(PI()*((IF(CircumDiameter2=\"Diameter\",'Tex-424-A'!$D31,SQRT('Tex-424-A'!$D31/PI())*2)/1000)^2/4))))),\"\",0.000001*('Tex-424-A'!$I31*('Tex-424-A'!$G31/(PI()*((IF(CircumDiameter2=\"Diameter\",'Tex-424-A'!$D31,SQRT('Tex-424-A'!$D31/PI())*2)/1000)^2/4)))))","v":""}]
[1.25,0.93,null,{"$f":"IF(ISERROR('Tex-424-A'!$I32*('Tex-424-A'!$G32/(PI()*(IF(CircumDiameter2=\"Diameter\",'Tex-424-A'!$D32,SQRT('Tex-424-A'!$D32/PI())*2)^2/4)))),\"\",'Tex-424-A'!$I32*('Tex-424-A'!$G32/(PI()*(IF(CircumDiameter2=\"Diameter\",'Tex-424-A'!$D32,SQRT('Tex-424-A'!$D32/PI())*2)^2/4))))","v":""},{"$f":"IF(ISERROR(0.000001*('Tex-424-A'!$I32*('Tex-424-A'!$G32/(PI()*((IF(CircumDiameter2=\"Diameter\",'Tex-424-A'!$D32,SQRT('Tex-424-A'!$D32/PI())*2)/1000)^2/4))))),\"\",0.000001*('Tex-424-A'!$I32*('Tex-424-A'!$G32/(PI()*((IF(CircumDiameter2=\"Diameter\",'Tex-424-A'!$D32,SQRT('Tex-424-A'!$D32/PI())*2)/1000)^2/4)))))","v":""}]
[1.26,0.93100000000000005,null,{"$f":"IF(ISERROR('Tex-424-A'!$I33*('Tex-424-A'!$G33/(PI()*(IF(CircumDiameter2=\"Diameter\",'Tex-424-A'!$D33,SQRT('Tex-424-A'!$D33/PI())*2)^2/4)))),\"\",'Tex-424-A'!$I33*('Tex-424-A'!$G33/(PI()*(IF(CircumDiameter2=\"Diameter\",'Tex-424-A'!$D33,SQRT('Tex-424-A'!$D33/PI())*2)^2/4))))","v":""},{"$f":"IF(ISERROR(0.000001*('Tex-424-A'!$I33*('Tex-424-A'!$G33/(PI()*((IF(CircumDiameter2=\"Diameter\",'Tex-424-A'!$D33,SQRT('Tex-424-A'!$D33/PI())*2)/1000)^2/4))))),\"\",0.000001*('Tex-424-A'!$I33*('Tex-424-A'!$G33/(PI()*((IF(CircumDiameter2=\"Diameter\",'Tex-424-A'!$D33,SQRT('Tex-424-A'!$D33/PI())*2)/1000)^2/4)))))","v":""}]
[1.27,0.93200000000000005,null,{"$f":"IF(ISERROR('Tex-424-A'!$I34*('Tex-424-A'!$G34/(PI()*(IF(CircumDiameter2=\"Diameter\",'Tex-424-A'!$D34,SQRT('Tex-424-A'!$D34/PI())*2)^2/4)))),\"\",'Tex-424-A'!$I34*('Tex-424-A'!$G34/(PI()*(IF(CircumDiameter2=\"Diameter\",'Tex-424-A'!$D34,SQRT('Tex-424-A'!$D34/PI())*2)^2/4))))","v":""},{"$f":"IF(ISERROR(0.000001*('Tex-424-A'!$I34*('Tex-424-A'!$G34/(PI()*((IF(CircumDiameter2=\"Diameter\",'Tex-424-A'!$D34,SQRT('Tex-424-A'!$D34/PI())*2)/1000)^2/4))))),\"\",0.000001*('Tex-424-A'!$I34*('Tex-424-A'!$G34/(PI()*((IF(CircumDiameter2=\"Diameter\",'Tex-424-A'!$D34,SQRT('Tex-424-A'!$D34/PI())*2)/1000)^2/4)))))","v":""}]
[1.28,0.93300000000000005]
[1.29,0.93400000000000005]
[1.3,0.93600000000000005]
[1.31,0.93700000000000006]
[1.32,0.93799999999999994]
[1.33,0.93899999999999995]
[1.34,0.94]
[1.35,0.94199999999999995]
[1.36,0.94299999999999995]
[1.37,0.94399999999999995]
[1.38,0.94499999999999995]
[1.39,0.94599999999999995]
[1.4,0.94799999999999995]
[1.41,0.94899999999999995]
[1.42,0.95]
[1.43,0.95099999999999996]
[1.44,0.95199999999999996]
[1.45,0.95399999999999996]
[1.46,0.95499999999999996]
[1.47,0.95599999999999996]
[1.48,0.95699999999999996]
[1.49,0.95799999999999996]
[1.5,0.96]
[1.51,0.96099999999999997]
[1.52,0.96199999999999997]
[1.53,0.96199999999999997]
[1.54,0.96299999999999997]
[1.55,0.96399999999999997]
[1.56,0.96499999999999997]
[1.57,0.96599999999999997]
[1.58,0.96599999999999997]
[1.59,0.96699999999999997]
[1.6,0.96799999999999997]
[1.61,0.96899999999999997]
[1.62,0.97]
[1.63,0.97]
[1.64,0.97099999999999997]
[1.65,0.97199999999999998]
[1.66,0.97299999999999998]
[1.67,0.97399999999999998]
[1.68,0.97399999999999998]
[1.69,0.97499999999999998]
[1.7,0.97599999999999998]
[1.71,0.97699999999999998]
[1.72,0.97799999999999998]
[1.73,0.97799999999999998]
[1.74,0.97899999999999998]
[1.75,0.98]
[1.76,{"$f":"IF(version>=1, 1, 0.981)","v":1}]
[1.77,{"$f":"IF(version>=1, 1, 0.982)","v":1}]
[1.78,{"$f":"IF(version>=1, 1, 0.982)","v":1}]
[1.79,{"$f":"IF(version>=1, 1, 0.983)","v":1}]
[1.8,{"$f":"IF(version>=1, 1, 0.984)","v":1}]
[1.81,{"$f":"IF(version>=1, 1, 0.985)","v":1}]
[1.82,{"$f":"IF(version>=1, 1, 0.986)","v":1}]
[1.83,{"$f":"IF(version>=1, 1, 0.986)","v":1}]
[1.84,{"$f":"IF(version>=1, 1, 0.987)","v":1}]
[1.85,{"$f":"IF(version>=1, 1, 0.988)","v":1}]
[1.86,{"$f":"IF(version>=1, 1, 0.989)","v":1}]
[1.87,{"$f":"IF(version>=1, 1, 0.99)","v":1}]
[1.88,{"$f":"IF(version>=1, 1, 0.99)","v":1}]
[1.89,{"$f":"IF(version>=1, 1, 0.991)","v":1}]
[1.9,{"$f":"IF(version>=1, 1, 0.992)","v":1}]
[1.91,{"$f":"IF(version>=1, 1, 0.993)","v":1}]
[1.92,{"$f":"IF(version>=1, 1, 0.994)","v":1}]
[1.93,{"$f":"IF(version>=1, 1, 0.994)","v":1}]
[1.94,{"$f":"IF(version>=1, 1, 0.995)","v":1}]
[1.95,1]
[1.96,1]
[1.97,1]
[1.98,1]
[1.99,1]
[2,1]
[2.0099999999999998,1]
[2.02,1]
[2.0299999999999998,1]
[2.04,1]
[2.0499999999999998,1]
[2.06,1]
[2.0699999999999998,1]
[2.08,1]
[2.09,1]
[2.1,1]