{"text_format":"1","workbook":"xlsx","n_sheets":3,"sheets":["Tex-424-A","RX","L to D Lookup"],"not_rendered":{"charts":0,"images":1,"macros":1,"external_links":0,"defined_names":116,"comments":1,"pivot_tables":0},"unopened":[],"bounds":{"document_bytes":16777216,"sheet_cells":100000,"rows_first":2000,"rows_last":500,"rows_between":2000,"halvings":0,"cell_chars":16384,"cell_head_chars":4096},"cells_cut":0,"cells_raw":0,"read":"whole","date_system":"1900"}

{"sheet":"Tex-424-A","index":0,"n_rows":49,"n_cols":11,"rows_kept":49,"cut":false,"hidden":false,"merged":[[13,3,13,4],[11,3,11,4],[8,3,8,4],[10,3,10,4],[12,3,12,4],[9,3,9,4],[48,1,48,3],[37,1,37,8],[32,10,33,10],[44,6,44,8],[32,2,33,2],[44,1,44,3],[40,2,40,4],[42,2,42,4],[23,9,25,9],[30,10,31,10],[26,10,27,10],[28,10,29,10],[23,10,25,10],[28,2,29,2],[23,5,25,5],[39,2,39,4],[35,1,36,8],[38,1,38,8],[30,2,31,2],[24,3,25,3],[23,4,25,4],[23,6,25,6],[23,1,25,1],[26,2,27,2],[23,2,25,2],[23,0,25,0],[0,0,0,1],[16,3,16,4],[16,7,16,8],[23,8,25,8],[23,7,25,7],[7,7,7,8],[10,7,10,8],[8,7,8,8],[11,7,11,8],[9,7,9,8],[12,7,12,8],[14,3,14,8],[15,3,15,8],[13,7,13,8],[7,3,7,4]]}
["TxDOT Manuals >",null,null,"Tex-424-A"]
[null,"TEXAS DEPARTMENT OF TRANSPORTATION",null,null,null,null,null,null,null,null,56]
[null,null,null,null,null,null,null,null,null,null,2]
[null,null,null,null,null,null,null,null,null,null,"tx424,iii.xlsm::45575.629722"]
[null,"TESTING OF DRILLED CORES OF PORTLAND CEMENT CONCRETE  "]
[null,"Tex-424-A, Part III"]
[null,null,null,null,null,null,null,null,{"$f":"\"TX424, III :: File Version: \" & TEXT(MID(sn,SEARCH(\"::\",sn,1)+2,20),\"mm/dd/yy hh:mm:ss\")","v":"TX424, III :: File Version: 10/10/24 15:06:48"}]
[null,null,"SAMPLE ID:",null,null,null,"SAMPLED DATE:"]
[null,null,"TEST NUMBER:",null,null,null,"LETTING DATE:"]
[null,null,"SAMPLE STATUS:",null,null,null,"CONTROLLING CSJ:"]
[null,null,"COUNTY:",null,null,null,"SPEC YEAR:"]
[null,null,"SAMPLED BY:",null,null,null,"SPEC ITEM:"]
[null,null,"SAMPLE LOCATION:",null,null,null,"SPECIAL PROVISION:"]
[null,null,"MATERIAL CODE:",null,null,null,"GRADE:"]
[null,null,"MATERIAL NAME:"]
[null,null,"PRODUCER:"]
[null,null,"AREA ENGINEER:",null,null,null,"PROJECT MANAGER:"]
[]
[null,null,"COURSE\\LIFT:",null,"STATION:",null,null,"DIST. FROM CL:"]
[]
{"$rows_left_out":30}
{"sheet":"RX","index":1,"n_rows":80,"n_cols":9,"rows_kept":80,"cut":false,"hidden":true,"merged":[]}
[{"$f":"COUNTA(A3:A5000)","v":78}]
["Fld_nbr","Value","Desc_1","Desc_2","Desc_3","Desc_4","Desc_5","Desc_6","Desc_7"]
[1,{"$f":"IF('Tex-424-A'!$B$36=\"\",\"\",'Tex-424-A'!$B$36)","v":""},{"$f":"'Tex-424-A'!$B$35","v":"Remarks:"}]
[2,{"$f":"IF('Tex-424-A'!$D$19=\"\",\"\",'Tex-424-A'!$D$19)","v":""},{"$f":"IF('Tex-424-A'!$C$19=\"\",\"\",'Tex-424-A'!$C$19)","v":"COURSE\\LIFT:"}]
[3,{"$f":"IF('Tex-424-A'!$C$41=\"\",\"\",'Tex-424-A'!$C$41)","v":""},"Tested By ",{"$f":"IF('Tex-424-A'!$B$41=\"\",\"\",'Tex-424-A'!$B$41)","v":"TX424"}]
[4,{"$f":"IF('Tex-424-A'!$F$41=\"\",\"\",'Tex-424-A'!$F$41)","v":""},"Tested Date ",{"$f":"IF('Tex-424-A'!$B$41=\"\",\"\",'Tex-424-A'!$B$41)","v":"TX424"}]
[5,{"$f":"IF('Tex-424-A'!$B$27=\"\",\"\",'Tex-424-A'!$B$27)","v":""},{"$f":"IF('Tex-424-A'!$B$23=\"\",\"\",'Tex-424-A'!$B$23)","v":"Tex-424-A"},{"$f":"IF('Tex-424-A'!$A$24=\"\",\"\",'Tex-424-A'!$A$24)","v":"Cores"},{"$f":"IF('Tex-424-A'!$A$27=\"\",\"\",'Tex-424-A'!$A$27)","v":1},{"$f":"IF('Tex-424-A'!$B$24=\"\",\"\",'Tex-424-A'!$B$24)","v":"Core Number"}]
[6,{"$f":"IF('Tex-424-A'!$C$27=\"\",\"\",'Tex-424-A'!$C$27)","v":""},{"$f":"IF('Tex-424-A'!$B$23=\"\",\"\",'Tex-424-A'!$B$23)","v":"Tex-424-A"},{"$f":"IF('Tex-424-A'!$A$24=\"\",\"\",'Tex-424-A'!$A$24)","v":"Cores"},{"$f":"IF('Tex-424-A'!$A$27=\"\",\"\",'Tex-424-A'!$A$27)","v":1},{"$f":"IF('Tex-424-A'!$C$24=\"\",\"\",'Tex-424-A'!$C$24)","v":"Age (Days)"}]
[7,{"$f":"IF('Tex-424-A'!$D$27=\"\",\"\",'Tex-424-A'!$D$27)","v":""},{"$f":"IF('Tex-424-A'!$B$23=\"\",\"\",'Tex-424-A'!$B$23)","v":"Tex-424-A"},{"$f":"IF('Tex-424-A'!$A$24=\"\",\"\",'Tex-424-A'!$A$24)","v":"Cores"},{"$f":"IF('Tex-424-A'!$A$27=\"\",\"\",'Tex-424-A'!$A$27)","v":1},{"$f":"IF('Tex-424-A'!$D$25=\"\",\"\",'Tex-424-A'!$D$25)","v":" of Core "}]
[8,{"$f":"IF('Tex-424-A'!$E$27=\"\",\"\",'Tex-424-A'!$E$27)","v":""},{"$f":"IF('Tex-424-A'!$B$23=\"\",\"\",'Tex-424-A'!$B$23)","v":"Tex-424-A"},{"$f":"IF('Tex-424-A'!$A$24=\"\",\"\",'Tex-424-A'!$A$24)","v":"Cores"},{"$f":"IF('Tex-424-A'!$A$27=\"\",\"\",'Tex-424-A'!$A$27)","v":1},{"$f":"IF('Tex-424-A'!$E$24=\"\",\"\",'Tex-424-A'!$E$24)","v":"Length of Core "}]
[9,{"$f":"IF('Tex-424-A'!$F$27=\"\",\"\",'Tex-424-A'!$F$27)","v":""},{"$f":"IF('Tex-424-A'!$B$23=\"\",\"\",'Tex-424-A'!$B$23)","v":"Tex-424-A"},{"$f":"IF('Tex-424-A'!$A$24=\"\",\"\",'Tex-424-A'!$A$24)","v":"Cores"},{"$f":"IF('Tex-424-A'!$A$27=\"\",\"\",'Tex-424-A'!$A$27)","v":1},{"$f":"IF('Tex-424-A'!$F$24=\"\",\"\",'Tex-424-A'!$F$24)","v":"Length to Diameter Ratio"}]
[10,{"$f":"IF('Tex-424-A'!$G$27=\"\",\"\",'Tex-424-A'!$G$27)","v":""},{"$f":"IF('Tex-424-A'!$B$23=\"\",\"\",'Tex-424-A'!$B$23)","v":"Tex-424-A"},{"$f":"IF('Tex-424-A'!$A$24=\"\",\"\",'Tex-424-A'!$A$24)","v":"Cores"},{"$f":"IF('Tex-424-A'!$A$27=\"\",\"\",'Tex-424-A'!$A$27)","v":1},{"$f":"IF('Tex-424-A'!$G$24=\"\",\"\",'Tex-424-A'!$G$24)","v":"Max Load "}]
[11,{"$f":"IF('Tex-424-A'!$H$27=\"\",\"\",'Tex-424-A'!$H$27)","v":""},{"$f":"IF('Tex-424-A'!$B$23=\"\",\"\",'Tex-424-A'!$B$23)","v":"Tex-424-A"},{"$f":"IF('Tex-424-A'!$A$24=\"\",\"\",'Tex-424-A'!$A$24)","v":"Cores"},{"$f":"IF('Tex-424-A'!$A$27=\"\",\"\",'Tex-424-A'!$A$27)","v":1},{"$f":"IF('Tex-424-A'!$H$24=\"\",\"\",'Tex-424-A'!$H$24)","v":"Failure Type"}]
[12,{"$f":"IF('Tex-424-A'!$I$27=\"\",\"\",'Tex-424-A'!$I$27)","v":""},{"$f":"IF('Tex-424-A'!$B$23=\"\",\"\",'Tex-424-A'!$B$23)","v":"Tex-424-A"},{"$f":"IF('Tex-424-A'!$A$24=\"\",\"\",'Tex-424-A'!$A$24)","v":"Cores"},{"$f":"IF('Tex-424-A'!$A$27=\"\",\"\",'Tex-424-A'!$A$27)","v":1},{"$f":"IF('Tex-424-A'!$I$24=\"\",\"\",'Tex-424-A'!$I$24)","v":"Correction Factor"}]
[13,{"$f":"IF('Tex-424-A'!$J$27=\"\",\"\",'Tex-424-A'!$J$27)","v":""},{"$f":"IF('Tex-424-A'!$B$23=\"\",\"\",'Tex-424-A'!$B$23)","v":"Tex-424-A"},{"$f":"IF('Tex-424-A'!$A$24=\"\",\"\",'Tex-424-A'!$A$24)","v":"Cores"},{"$f":"IF('Tex-424-A'!$A$27=\"\",\"\",'Tex-424-A'!$A$27)","v":1},{"$f":"IF('Tex-424-A'!$J$24=\"\",\"\",'Tex-424-A'!$J$24)","v":"Compressive Strength "}]
[14,{"$f":"IF('Tex-424-A'!$K$27=\"\",\"\",'Tex-424-A'!$K$27)","v":""},{"$f":"IF('Tex-424-A'!$B$23=\"\",\"\",'Tex-424-A'!$B$23)","v":"Tex-424-A"},{"$f":"IF('Tex-424-A'!$A$24=\"\",\"\",'Tex-424-A'!$A$24)","v":"Cores"},{"$f":"IF('Tex-424-A'!$A$27=\"\",\"\",'Tex-424-A'!$A$27)","v":1},{"$f":"IF('Tex-424-A'!$K$24=\"\",\"\",'Tex-424-A'!$K$24)","v":"Compressive Strength Average "}]
[15,{"$f":"IF('Tex-424-A'!$B$28=\"\",\"\",'Tex-424-A'!$B$28)","v":""},{"$f":"IF('Tex-424-A'!$B$23=\"\",\"\",'Tex-424-A'!$B$23)","v":"Tex-424-A"},{"$f":"IF('Tex-424-A'!$A$24=\"\",\"\",'Tex-424-A'!$A$24)","v":"Cores"},{"$f":"IF('Tex-424-A'!$A$28=\"\",\"\",'Tex-424-A'!$A$28)","v":2},{"$f":"IF('Tex-424-A'!$B$24=\"\",\"\",'Tex-424-A'!$B$24)","v":"Core Number"}]
[16,{"$f":"IF('Tex-424-A'!$D$28=\"\",\"\",'Tex-424-A'!$D$28)","v":""},{"$f":"IF('Tex-424-A'!$B$23=\"\",\"\",'Tex-424-A'!$B$23)","v":"Tex-424-A"},{"$f":"IF('Tex-424-A'!$A$24=\"\",\"\",'Tex-424-A'!$A$24)","v":"Cores"},{"$f":"IF('Tex-424-A'!$A$28=\"\",\"\",'Tex-424-A'!$A$28)","v":2},{"$f":"IF('Tex-424-A'!$D$25=\"\",\"\",'Tex-424-A'!$D$25)","v":" of Core "}]
[17,{"$f":"IF('Tex-424-A'!$E$28=\"\",\"\",'Tex-424-A'!$E$28)","v":""},{"$f":"IF('Tex-424-A'!$B$23=\"\",\"\",'Tex-424-A'!$B$23)","v":"Tex-424-A"},{"$f":"IF('Tex-424-A'!$A$24=\"\",\"\",'Tex-424-A'!$A$24)","v":"Cores"},{"$f":"IF('Tex-424-A'!$A$28=\"\",\"\",'Tex-424-A'!$A$28)","v":2},{"$f":"IF('Tex-424-A'!$E$24=\"\",\"\",'Tex-424-A'!$E$24)","v":"Length of Core "}]
[18,{"$f":"IF('Tex-424-A'!$F$28=\"\",\"\",'Tex-424-A'!$F$28)","v":""},{"$f":"IF('Tex-424-A'!$B$23=\"\",\"\",'Tex-424-A'!$B$23)","v":"Tex-424-A"},{"$f":"IF('Tex-424-A'!$A$24=\"\",\"\",'Tex-424-A'!$A$24)","v":"Cores"},{"$f":"IF('Tex-424-A'!$A$28=\"\",\"\",'Tex-424-A'!$A$28)","v":2},{"$f":"IF('Tex-424-A'!$F$24=\"\",\"\",'Tex-424-A'!$F$24)","v":"Length to Diameter Ratio"}]
{"$rows_left_out":61}
{"sheet":"L to D Lookup","index":2,"n_rows":112,"n_cols":7,"rows_kept":112,"cut":false,"hidden":true,"merged":[]}
["Length to Diameter Ratio","Correction Factor",null,"English MOR","Metric MOR"]
[1,0.87,null,{"$f":"IF(ISERROR(IF('Tex-424-A'!#REF!>('Tex-424-A'!#REF!*0.05),\"RETEST\",IF('Tex-424-A'!#REF!=0,ROUND(((('Tex-424-A'!#REF!*6^3/'Tex-424-A'!#REF!)*'Tex-424-A'!#REF!)/('Tex-424-A'!#REF!*'Tex-424-A'!#REF!^2))*2,-1)/2,(ROUND(3*((('Tex-424-A'!#REF!*6^3/'Tex-424-A'!#REF!)*('Tex-424-A'!#REF!/3-'Tex-424-A'!#REF!))/('Tex-424-A'!#REF!*'Tex-424-A'!#REF!^2))*2,-1)/2)))),\"\",IF('Tex-424-A'!#REF!>('Tex-424-A'!#REF!*0.05),\"RETEST\",IF('Tex-424-A'!#REF!=0,ROUND(((('Tex-424-A'!#REF!*6^3/'Tex-424-A'!#REF!)*'Tex-424-A'!#REF!)/('Tex-424-A'!#REF!*'Tex-424-A'!#REF!^2))*2,-1)/2,(ROUND(3*((('Tex-424-A'!#REF!*6^3/'Tex-424-A'!#REF!)*('Tex-424-A'!#REF!/3-'Tex-424-A'!#REF!))/('Tex-424-A'!#REF!*'Tex-424-A'!#REF!^2))*2,-1)/2))))","v":""},{"$f":"IF(ISERROR(IF('Tex-424-A'!#REF!>('Tex-424-A'!#REF!*0.05),\"RETEST\",IF('Tex-424-A'!#REF!=0,ROUND((((('Tex-424-A'!#REF!*1000)*('Tex-424-A'!#REF!))/(('Tex-424-A'!#REF!)*(('Tex-424-A'!#REF!))^2)))*2,-2)/2,ROUND((3*((('Tex-424-A'!#REF!*1000)*('Tex-424-A'!#REF!/3-'Tex-424-A'!#REF!))/('Tex-424-A'!#REF!*'Tex-424-A'!#REF!^2)))*2,-2)/2))),\"\",IF('Tex-424-A'!#REF!>('Tex-424-A'!#REF!*0.05),\"RETEST\",IF('Tex-424-A'!#REF!=0,ROUND((((('Tex-424-A'!#REF!*1000)*('Tex-424-A'!#REF!))/(('Tex-424-A'!#REF!)*(('Tex-424-A'!#REF!))^2)))*2,-2)/2,ROUND((3*((('Tex-424-A'!#REF!*1000)*('Tex-424-A'!#REF!/3-'Tex-424-A'!#REF!))/('Tex-424-A'!#REF!*'Tex-424-A'!#REF!^2)))*2,-2)/2)))","v":""}]
[1.01,0.872,null,{"$f":"IF(ISERROR(IF('Tex-424-A'!#REF!>('Tex-424-A'!#REF!*0.05),\"RETEST\",IF('Tex-424-A'!#REF!=0,ROUND(((('Tex-424-A'!#REF!*6^3/'Tex-424-A'!#REF!)*'Tex-424-A'!#REF!)/('Tex-424-A'!#REF!*'Tex-424-A'!#REF!^2))*2,-1)/2,(ROUND(3*((('Tex-424-A'!#REF!*6^3/'Tex-424-A'!#REF!)*('Tex-424-A'!#REF!/3-'Tex-424-A'!#REF!))/('Tex-424-A'!#REF!*'Tex-424-A'!#REF!^2))*2,-1)/2)))),\"\",IF('Tex-424-A'!#REF!>('Tex-424-A'!#REF!*0.05),\"RETEST\",IF('Tex-424-A'!#REF!=0,ROUND(((('Tex-424-A'!#REF!*6^3/'Tex-424-A'!#REF!)*'Tex-424-A'!#REF!)/('Tex-424-A'!#REF!*'Tex-424-A'!#REF!^2))*2,-1)/2,(ROUND(3*((('Tex-424-A'!#REF!*6^3/'Tex-424-A'!#REF!)*('Tex-424-A'!#REF!/3-'Tex-424-A'!#REF!))/('Tex-424-A'!#REF!*'Tex-424-A'!#REF!^2))*2,-1)/2))))","v":""},{"$f":"IF(ISERROR(IF('Tex-424-A'!#REF!>('Tex-424-A'!#REF!*0.05),\"RETEST\",IF('Tex-424-A'!#REF!=0,ROUND((((('Tex-424-A'!#REF!*1000)*('Tex-424-A'!#REF!))/(('Tex-424-A'!#REF!)*(('Tex-424-A'!#REF!))^2)))*2,-2)/2,ROUND((3*((('Tex-424-A'!#REF!*1000)*('Tex-424-A'!#REF!/3-'Tex-424-A'!#REF!))/('Tex-424-A'!#REF!*'Tex-424-A'!#REF!^2)))*2,-2)/2))),\"\",IF('Tex-424-A'!#REF!>('Tex-424-A'!#REF!*0.05),\"RETEST\",IF('Tex-424-A'!#REF!=0,ROUND((((('Tex-424-A'!#REF!*1000)*('Tex-424-A'!#REF!))/(('Tex-424-A'!#REF!)*(('Tex-424-A'!#REF!))^2)))*2,-2)/2,ROUND((3*((('Tex-424-A'!#REF!*1000)*('Tex-424-A'!#REF!/3-'Tex-424-A'!#REF!))/('Tex-424-A'!#REF!*'Tex-424-A'!#REF!^2)))*2,-2)/2)))","v":""}]
[1.02,0.875,null,{"$f":"IF(ISERROR(IF('Tex-424-A'!#REF!>('Tex-424-A'!#REF!*0.05),\"RETEST\",IF('Tex-424-A'!#REF!=0,ROUND(((('Tex-424-A'!#REF!*6^3/'Tex-424-A'!#REF!)*'Tex-424-A'!#REF!)/('Tex-424-A'!#REF!*'Tex-424-A'!#REF!^2))*2,-1)/2,(ROUND(3*((('Tex-424-A'!#REF!*6^3/'Tex-424-A'!#REF!)*('Tex-424-A'!#REF!/3-'Tex-424-A'!#REF!))/('Tex-424-A'!#REF!*'Tex-424-A'!#REF!^2))*2,-1)/2)))),\"\",IF('Tex-424-A'!#REF!>('Tex-424-A'!#REF!*0.05),\"RETEST\",IF('Tex-424-A'!#REF!=0,ROUND(((('Tex-424-A'!#REF!*6^3/'Tex-424-A'!#REF!)*'Tex-424-A'!#REF!)/('Tex-424-A'!#REF!*'Tex-424-A'!#REF!^2))*2,-1)/2,(ROUND(3*((('Tex-424-A'!#REF!*6^3/'Tex-424-A'!#REF!)*('Tex-424-A'!#REF!/3-'Tex-424-A'!#REF!))/('Tex-424-A'!#REF!*'Tex-424-A'!#REF!^2))*2,-1)/2))))","v":""},{"$f":"IF(ISERROR(IF('Tex-424-A'!#REF!>('Tex-424-A'!#REF!*0.05),\"RETEST\",IF('Tex-424-A'!#REF!=0,ROUND((((('Tex-424-A'!#REF!*1000)*('Tex-424-A'!#REF!))/(('Tex-424-A'!#REF!)*(('Tex-424-A'!#REF!))^2)))*2,-2)/2,ROUND((3*((('Tex-424-A'!#REF!*1000)*('Tex-424-A'!#REF!/3-'Tex-424-A'!#REF!))/('Tex-424-A'!#REF!*'Tex-424-A'!#REF!^2)))*2,-2)/2))),\"\",IF('Tex-424-A'!#REF!>('Tex-424-A'!#REF!*0.05),\"RETEST\",IF('Tex-424-A'!#REF!=0,ROUND((((('Tex-424-A'!#REF!*1000)*('Tex-424-A'!#REF!))/(('Tex-424-A'!#REF!)*(('Tex-424-A'!#REF!))^2)))*2,-2)/2,ROUND((3*((('Tex-424-A'!#REF!*1000)*('Tex-424-A'!#REF!/3-'Tex-424-A'!#REF!))/('Tex-424-A'!#REF!*'Tex-424-A'!#REF!^2)))*2,-2)/2)))","v":""}]
[1.03,0.877,null,{"$f":"IF(ISERROR(IF('Tex-424-A'!#REF!>('Tex-424-A'!#REF!*0.05),\"RETEST\",IF('Tex-424-A'!#REF!=0,ROUND(((('Tex-424-A'!#REF!*6^3/'Tex-424-A'!#REF!)*'Tex-424-A'!#REF!)/('Tex-424-A'!#REF!*'Tex-424-A'!#REF!^2))*2,-1)/2,(ROUND(3*((('Tex-424-A'!#REF!*6^3/'Tex-424-A'!#REF!)*('Tex-424-A'!#REF!/3-'Tex-424-A'!#REF!))/('Tex-424-A'!#REF!*'Tex-424-A'!#REF!^2))*2,-1)/2)))),\"\",IF('Tex-424-A'!#REF!>('Tex-424-A'!#REF!*0.05),\"RETEST\",IF('Tex-424-A'!#REF!=0,ROUND(((('Tex-424-A'!#REF!*6^3/'Tex-424-A'!#REF!)*'Tex-424-A'!#REF!)/('Tex-424-A'!#REF!*'Tex-424-A'!#REF!^2))*2,-1)/2,(ROUND(3*((('Tex-424-A'!#REF!*6^3/'Tex-424-A'!#REF!)*('Tex-424-A'!#REF!/3-'Tex-424-A'!#REF!))/('Tex-424-A'!#REF!*'Tex-424-A'!#REF!^2))*2,-1)/2))))","v":""},{"$f":"IF(ISERROR(IF('Tex-424-A'!#REF!>('Tex-424-A'!#REF!*0.05),\"RETEST\",IF('Tex-424-A'!#REF!=0,ROUND((((('Tex-424-A'!#REF!*1000)*('Tex-424-A'!#REF!))/(('Tex-424-A'!#REF!)*(('Tex-424-A'!#REF!))^2)))*2,-2)/2,ROUND((3*((('Tex-424-A'!#REF!*1000)*('Tex-424-A'!#REF!/3-'Tex-424-A'!#REF!))/('Tex-424-A'!#REF!*'Tex-424-A'!#REF!^2)))*2,-2)/2))),\"\",IF('Tex-424-A'!#REF!>('Tex-424-A'!#REF!*0.05),\"RETEST\",IF('Tex-424-A'!#REF!=0,ROUND((((('Tex-424-A'!#REF!*1000)*('Tex-424-A'!#REF!))/(('Tex-424-A'!#REF!)*(('Tex-424-A'!#REF!))^2)))*2,-2)/2,ROUND((3*((('Tex-424-A'!#REF!*1000)*('Tex-424-A'!#REF!/3-'Tex-424-A'!#REF!))/('Tex-424-A'!#REF!*'Tex-424-A'!#REF!^2)))*2,-2)/2)))","v":""}]
[1.04,0.88,null,{"$f":"IF(ISERROR(IF('Tex-424-A'!#REF!>('Tex-424-A'!#REF!*0.05),\"RETEST\",IF('Tex-424-A'!#REF!=0,ROUND(((('Tex-424-A'!#REF!*6^3/'Tex-424-A'!#REF!)*'Tex-424-A'!#REF!)/('Tex-424-A'!#REF!*'Tex-424-A'!#REF!^2))*2,-1)/2,(ROUND(3*((('Tex-424-A'!#REF!*6^3/'Tex-424-A'!#REF!)*('Tex-424-A'!#REF!/3-'Tex-424-A'!#REF!))/('Tex-424-A'!#REF!*'Tex-424-A'!#REF!^2))*2,-1)/2)))),\"\",IF('Tex-424-A'!#REF!>('Tex-424-A'!#REF!*0.05),\"RETEST\",IF('Tex-424-A'!#REF!=0,ROUND(((('Tex-424-A'!#REF!*6^3/'Tex-424-A'!#REF!)*'Tex-424-A'!#REF!)/('Tex-424-A'!#REF!*'Tex-424-A'!#REF!^2))*2,-1)/2,(ROUND(3*((('Tex-424-A'!#REF!*6^3/'Tex-424-A'!#REF!)*('Tex-424-A'!#REF!/3-'Tex-424-A'!#REF!))/('Tex-424-A'!#REF!*'Tex-424-A'!#REF!^2))*2,-1)/2))))","v":""},{"$f":"IF(ISERROR(IF('Tex-424-A'!#REF!>('Tex-424-A'!#REF!*0.05),\"RETEST\",IF('Tex-424-A'!#REF!=0,ROUND((((('Tex-424-A'!#REF!*1000)*('Tex-424-A'!#REF!))/(('Tex-424-A'!#REF!)*(('Tex-424-A'!#REF!))^2)))*2,-2)/2,ROUND((3*((('Tex-424-A'!#REF!*1000)*('Tex-424-A'!#REF!/3-'Tex-424-A'!#REF!))/('Tex-424-A'!#REF!*'Tex-424-A'!#REF!^2)))*2,-2)/2))),\"\",IF('Tex-424-A'!#REF!>('Tex-424-A'!#REF!*0.05),\"RETEST\",IF('Tex-424-A'!#REF!=0,ROUND((((('Tex-424-A'!#REF!*1000)*('Tex-424-A'!#REF!))/(('Tex-424-A'!#REF!)*(('Tex-424-A'!#REF!))^2)))*2,-2)/2,ROUND((3*((('Tex-424-A'!#REF!*1000)*('Tex-424-A'!#REF!/3-'Tex-424-A'!#REF!))/('Tex-424-A'!#REF!*'Tex-424-A'!#REF!^2)))*2,-2)/2)))","v":""}]
[1.05,0.88200000000000001,null,{"$f":"IF(ISERROR(IF('Tex-424-A'!#REF!>('Tex-424-A'!#REF!*0.05),\"RETEST\",IF('Tex-424-A'!#REF!=0,ROUND(((('Tex-424-A'!#REF!*6^3/'Tex-424-A'!#REF!)*'Tex-424-A'!#REF!)/('Tex-424-A'!#REF!*'Tex-424-A'!#REF!^2))*2,-1)/2,(ROUND(3*((('Tex-424-A'!#REF!*6^3/'Tex-424-A'!#REF!)*('Tex-424-A'!#REF!/3-'Tex-424-A'!#REF!))/('Tex-424-A'!#REF!*'Tex-424-A'!#REF!^2))*2,-1)/2)))),\"\",IF('Tex-424-A'!#REF!>('Tex-424-A'!#REF!*0.05),\"RETEST\",IF('Tex-424-A'!#REF!=0,ROUND(((('Tex-424-A'!#REF!*6^3/'Tex-424-A'!#REF!)*'Tex-424-A'!#REF!)/('Tex-424-A'!#REF!*'Tex-424-A'!#REF!^2))*2,-1)/2,(ROUND(3*((('Tex-424-A'!#REF!*6^3/'Tex-424-A'!#REF!)*('Tex-424-A'!#REF!/3-'Tex-424-A'!#REF!))/('Tex-424-A'!#REF!*'Tex-424-A'!#REF!^2))*2,-1)/2))))","v":""},{"$f":"IF(ISERROR(IF('Tex-424-A'!#REF!>('Tex-424-A'!#REF!*0.05),\"RETEST\",IF('Tex-424-A'!#REF!=0,ROUND((((('Tex-424-A'!#REF!*1000)*('Tex-424-A'!#REF!))/(('Tex-424-A'!#REF!)*(('Tex-424-A'!#REF!))^2)))*2,-2)/2,ROUND((3*((('Tex-424-A'!#REF!*1000)*('Tex-424-A'!#REF!/3-'Tex-424-A'!#REF!))/('Tex-424-A'!#REF!*'Tex-424-A'!#REF!^2)))*2,-2)/2))),\"\",IF('Tex-424-A'!#REF!>('Tex-424-A'!#REF!*0.05),\"RETEST\",IF('Tex-424-A'!#REF!=0,ROUND((((('Tex-424-A'!#REF!*1000)*('Tex-424-A'!#REF!))/(('Tex-424-A'!#REF!)*(('Tex-424-A'!#REF!))^2)))*2,-2)/2,ROUND((3*((('Tex-424-A'!#REF!*1000)*('Tex-424-A'!#REF!/3-'Tex-424-A'!#REF!))/('Tex-424-A'!#REF!*'Tex-424-A'!#REF!^2)))*2,-2)/2)))","v":""}]
[1.06,0.88400000000000001,null,{"$f":"IF(ISERROR(IF('Tex-424-A'!#REF!>('Tex-424-A'!#REF!*0.05),\"RETEST\",IF('Tex-424-A'!#REF!=0,ROUND(((('Tex-424-A'!#REF!*6^3/'Tex-424-A'!#REF!)*'Tex-424-A'!#REF!)/('Tex-424-A'!#REF!*'Tex-424-A'!#REF!^2))*2,-1)/2,(ROUND(3*((('Tex-424-A'!#REF!*6^3/'Tex-424-A'!#REF!)*('Tex-424-A'!#REF!/3-'Tex-424-A'!#REF!))/('Tex-424-A'!#REF!*'Tex-424-A'!#REF!^2))*2,-1)/2)))),\"\",IF('Tex-424-A'!#REF!>('Tex-424-A'!#REF!*0.05),\"RETEST\",IF('Tex-424-A'!#REF!=0,ROUND(((('Tex-424-A'!#REF!*6^3/'Tex-424-A'!#REF!)*'Tex-424-A'!#REF!)/('Tex-424-A'!#REF!*'Tex-424-A'!#REF!^2))*2,-1)/2,(ROUND(3*((('Tex-424-A'!#REF!*6^3/'Tex-424-A'!#REF!)*('Tex-424-A'!#REF!/3-'Tex-424-A'!#REF!))/('Tex-424-A'!#REF!*'Tex-424-A'!#REF!^2))*2,-1)/2))))","v":""},{"$f":"IF(ISERROR(IF('Tex-424-A'!#REF!>('Tex-424-A'!#REF!*0.05),\"RETEST\",IF('Tex-424-A'!#REF!=0,ROUND((((('Tex-424-A'!#REF!*1000)*('Tex-424-A'!#REF!))/(('Tex-424-A'!#REF!)*(('Tex-424-A'!#REF!))^2)))*2,-2)/2,ROUND((3*((('Tex-424-A'!#REF!*1000)*('Tex-424-A'!#REF!/3-'Tex-424-A'!#REF!))/('Tex-424-A'!#REF!*'Tex-424-A'!#REF!^2)))*2,-2)/2))),\"\",IF('Tex-424-A'!#REF!>('Tex-424-A'!#REF!*0.05),\"RETEST\",IF('Tex-424-A'!#REF!=0,ROUND((((('Tex-424-A'!#REF!*1000)*('Tex-424-A'!#REF!))/(('Tex-424-A'!#REF!)*(('Tex-424-A'!#REF!))^2)))*2,-2)/2,ROUND((3*((('Tex-424-A'!#REF!*1000)*('Tex-424-A'!#REF!/3-'Tex-424-A'!#REF!))/('Tex-424-A'!#REF!*'Tex-424-A'!#REF!^2)))*2,-2)/2)))","v":""}]
[1.07,0.88700000000000001,null,{"$f":"IF(ISERROR(IF('Tex-424-A'!#REF!>('Tex-424-A'!#REF!*0.05),\"RETEST\",IF('Tex-424-A'!#REF!=0,ROUND(((('Tex-424-A'!#REF!*6^3/'Tex-424-A'!#REF!)*'Tex-424-A'!#REF!)/('Tex-424-A'!#REF!*'Tex-424-A'!#REF!^2))*2,-1)/2,(ROUND(3*((('Tex-424-A'!#REF!*6^3/'Tex-424-A'!#REF!)*('Tex-424-A'!#REF!/3-'Tex-424-A'!#REF!))/('Tex-424-A'!#REF!*'Tex-424-A'!#REF!^2))*2,-1)/2)))),\"\",IF('Tex-424-A'!#REF!>('Tex-424-A'!#REF!*0.05),\"RETEST\",IF('Tex-424-A'!#REF!=0,ROUND(((('Tex-424-A'!#REF!*6^3/'Tex-424-A'!#REF!)*'Tex-424-A'!#REF!)/('Tex-424-A'!#REF!*'Tex-424-A'!#REF!^2))*2,-1)/2,(ROUND(3*((('Tex-424-A'!#REF!*6^3/'Tex-424-A'!#REF!)*('Tex-424-A'!#REF!/3-'Tex-424-A'!#REF!))/('Tex-424-A'!#REF!*'Tex-424-A'!#REF!^2))*2,-1)/2))))","v":""},{"$f":"IF(ISERROR(IF('Tex-424-A'!#REF!>('Tex-424-A'!#REF!*0.05),\"RETEST\",IF('Tex-424-A'!#REF!=0,ROUND((((('Tex-424-A'!#REF!*1000)*('Tex-424-A'!#REF!))/(('Tex-424-A'!#REF!)*(('Tex-424-A'!#REF!))^2)))*2,-2)/2,ROUND((3*((('Tex-424-A'!#REF!*1000)*('Tex-424-A'!#REF!/3-'Tex-424-A'!#REF!))/('Tex-424-A'!#REF!*'Tex-424-A'!#REF!^2)))*2,-2)/2))),\"\",IF('Tex-424-A'!#REF!>('Tex-424-A'!#REF!*0.05),\"RETEST\",IF('Tex-424-A'!#REF!=0,ROUND((((('Tex-424-A'!#REF!*1000)*('Tex-424-A'!#REF!))/(('Tex-424-A'!#REF!)*(('Tex-424-A'!#REF!))^2)))*2,-2)/2,ROUND((3*((('Tex-424-A'!#REF!*1000)*('Tex-424-A'!#REF!/3-'Tex-424-A'!#REF!))/('Tex-424-A'!#REF!*'Tex-424-A'!#REF!^2)))*2,-2)/2)))","v":""}]
[1.08,0.88900000000000001]
[1.0900000000000001,0.89200000000000002,null,"English f'c","Metric f'c"]
[1.1000000000000001,0.89400000000000002,null,{"$f":"IF(ISERROR(ROUND('Tex-424-A'!#REF!*('Tex-424-A'!#REF!/(PI()*(IF(CircumDiameter1=\"Diameter\",'Tex-424-A'!#REF!,SQRT('Tex-424-A'!#REF!/PI())*2)^2/4))),-1)),\"\",ROUND('Tex-424-A'!#REF!*('Tex-424-A'!#REF!/(PI()*(IF(CircumDiameter1=\"Diameter\",'Tex-424-A'!#REF!,SQRT('Tex-424-A'!#REF!/PI())*2)^2/4))),-1))","v":""},{"$f":"IF(ISERROR(ROUND(0.000001*('Tex-424-A'!#REF!*('Tex-424-A'!#REF!/(PI()*((IF(CircumDiameter1=\"Diameter\",'Tex-424-A'!#REF!,SQRT('Tex-424-A'!#REF!/PI())*2)/1000)^2/4))))*2,1)/2),\"\",ROUND(0.000001*('Tex-424-A'!#REF!*('Tex-424-A'!#REF!/(PI()*((IF(CircumDiameter1=\"Diameter\",'Tex-424-A'!#REF!,SQRT('Tex-424-A'!#REF!/PI())*2)/1000)^2/4))))*2,1)/2)","v":""}]
[1.1100000000000001,0.89600000000000002,null,{"$f":"IF(ISERROR(ROUND('Tex-424-A'!#REF!*('Tex-424-A'!#REF!/(PI()*(IF(CircumDiameter1=\"Diameter\",'Tex-424-A'!#REF!,SQRT('Tex-424-A'!#REF!/PI())*2)^2/4))),-1)),\"\",ROUND('Tex-424-A'!#REF!*('Tex-424-A'!#REF!/(PI()*(IF(CircumDiameter1=\"Diameter\",'Tex-424-A'!#REF!,SQRT('Tex-424-A'!#REF!/PI())*2)^2/4))),-1))","v":""},{"$f":"IF(ISERROR(ROUND(0.000001*('Tex-424-A'!#REF!*('Tex-424-A'!#REF!/(PI()*((IF(CircumDiameter1=\"Diameter\",'Tex-424-A'!#REF!,SQRT('Tex-424-A'!#REF!/PI())*2)/1000)^2/4))))*2,1)/2),\"\",ROUND(0.000001*('Tex-424-A'!#REF!*('Tex-424-A'!#REF!/(PI()*((IF(CircumDiameter1=\"Diameter\",'Tex-424-A'!#REF!,SQRT('Tex-424-A'!#REF!/PI())*2)/1000)^2/4))))*2,1)/2)","v":""}]
[1.1200000000000001,0.89900000000000002,null,{"$f":"IF(ISERROR(ROUND('Tex-424-A'!#REF!*('Tex-424-A'!#REF!/(PI()*(IF(CircumDiameter1=\"Diameter\",'Tex-424-A'!#REF!,SQRT('Tex-424-A'!#REF!/PI())*2)^2/4))),-1)),\"\",ROUND('Tex-424-A'!#REF!*('Tex-424-A'!#REF!/(PI()*(IF(CircumDiameter1=\"Diameter\",'Tex-424-A'!#REF!,SQRT('Tex-424-A'!#REF!/PI())*2)^2/4))),-1))","v":""},{"$f":"IF(ISERROR(ROUND(0.000001*('Tex-424-A'!#REF!*('Tex-424-A'!#REF!/(PI()*((IF(CircumDiameter1=\"Diameter\",'Tex-424-A'!#REF!,SQRT('Tex-424-A'!#REF!/PI())*2)/1000)^2/4))))*2,1)/2),\"\",ROUND(0.000001*('Tex-424-A'!#REF!*('Tex-424-A'!#REF!/(PI()*((IF(CircumDiameter1=\"Diameter\",'Tex-424-A'!#REF!,SQRT('Tex-424-A'!#REF!/PI())*2)/1000)^2/4))))*2,1)/2)","v":""}]
[1.1299999999999999,0.90100000000000002,null,{"$f":"IF(ISERROR(ROUND('Tex-424-A'!#REF!*('Tex-424-A'!#REF!/(PI()*(IF(CircumDiameter1=\"Diameter\",'Tex-424-A'!#REF!,SQRT('Tex-424-A'!#REF!/PI())*2)^2/4))),-1)),\"\",ROUND('Tex-424-A'!#REF!*('Tex-424-A'!#REF!/(PI()*(IF(CircumDiameter1=\"Diameter\",'Tex-424-A'!#REF!,SQRT('Tex-424-A'!#REF!/PI())*2)^2/4))),-1))","v":""},{"$f":"IF(ISERROR(ROUND(0.000001*('Tex-424-A'!#REF!*('Tex-424-A'!#REF!/(PI()*((IF(CircumDiameter1=\"Diameter\",'Tex-424-A'!#REF!,SQRT('Tex-424-A'!#REF!/PI())*2)/1000)^2/4))))*2,1)/2),\"\",ROUND(0.000001*('Tex-424-A'!#REF!*('Tex-424-A'!#REF!/(PI()*((IF(CircumDiameter1=\"Diameter\",'Tex-424-A'!#REF!,SQRT('Tex-424-A'!#REF!/PI())*2)/1000)^2/4))))*2,1)/2)","v":""}]
[1.1399999999999999,0.90400000000000003,null,{"$f":"IF(ISERROR(ROUND('Tex-424-A'!#REF!*('Tex-424-A'!#REF!/(PI()*(IF(CircumDiameter1=\"Diameter\",'Tex-424-A'!#REF!,SQRT('Tex-424-A'!#REF!/PI())*2)^2/4))),-1)),\"\",ROUND('Tex-424-A'!#REF!*('Tex-424-A'!#REF!/(PI()*(IF(CircumDiameter1=\"Diameter\",'Tex-424-A'!#REF!,SQRT('Tex-424-A'!#REF!/PI())*2)^2/4))),-1))","v":""},{"$f":"IF(ISERROR(ROUND(0.000001*('Tex-424-A'!#REF!*('Tex-424-A'!#REF!/(PI()*((IF(CircumDiameter1=\"Diameter\",'Tex-424-A'!#REF!,SQRT('Tex-424-A'!#REF!/PI())*2)/1000)^2/4))))*2,1)/2),\"\",ROUND(0.000001*('Tex-424-A'!#REF!*('Tex-424-A'!#REF!/(PI()*((IF(CircumDiameter1=\"Diameter\",'Tex-424-A'!#REF!,SQRT('Tex-424-A'!#REF!/PI())*2)/1000)^2/4))))*2,1)/2)","v":""}]
[1.1499999999999999,0.90600000000000003,null,{"$f":"IF(ISERROR(ROUND('Tex-424-A'!#REF!*('Tex-424-A'!#REF!/(PI()*(IF(CircumDiameter1=\"Diameter\",'Tex-424-A'!#REF!,SQRT('Tex-424-A'!#REF!/PI())*2)^2/4))),-1)),\"\",ROUND('Tex-424-A'!#REF!*('Tex-424-A'!#REF!/(PI()*(IF(CircumDiameter1=\"Diameter\",'Tex-424-A'!#REF!,SQRT('Tex-424-A'!#REF!/PI())*2)^2/4))),-1))","v":""},{"$f":"IF(ISERROR(ROUND(0.000001*('Tex-424-A'!#REF!*('Tex-424-A'!#REF!/(PI()*((IF(CircumDiameter1=\"Diameter\",'Tex-424-A'!#REF!,SQRT('Tex-424-A'!#REF!/PI())*2)/1000)^2/4))))*2,1)/2),\"\",ROUND(0.000001*('Tex-424-A'!#REF!*('Tex-424-A'!#REF!/(PI()*((IF(CircumDiameter1=\"Diameter\",'Tex-424-A'!#REF!,SQRT('Tex-424-A'!#REF!/PI())*2)/1000)^2/4))))*2,1)/2)","v":""}]
[1.1599999999999999,0.90800000000000003,null,{"$f":"IF(ISERROR(ROUND('Tex-424-A'!#REF!*('Tex-424-A'!#REF!/(PI()*(IF(CircumDiameter1=\"Diameter\",'Tex-424-A'!#REF!,SQRT('Tex-424-A'!#REF!/PI())*2)^2/4))),-1)),\"\",ROUND('Tex-424-A'!#REF!*('Tex-424-A'!#REF!/(PI()*(IF(CircumDiameter1=\"Diameter\",'Tex-424-A'!#REF!,SQRT('Tex-424-A'!#REF!/PI())*2)^2/4))),-1))","v":""},{"$f":"IF(ISERROR(ROUND(0.000001*('Tex-424-A'!#REF!*('Tex-424-A'!#REF!/(PI()*((IF(CircumDiameter1=\"Diameter\",'Tex-424-A'!#REF!,SQRT('Tex-424-A'!#REF!/PI())*2)/1000)^2/4))))*2,1)/2),\"\",ROUND(0.000001*('Tex-424-A'!#REF!*('Tex-424-A'!#REF!/(PI()*((IF(CircumDiameter1=\"Diameter\",'Tex-424-A'!#REF!,SQRT('Tex-424-A'!#REF!/PI())*2)/1000)^2/4))))*2,1)/2)","v":""}]
[1.17,0.91100000000000003,null,{"$f":"IF(ISERROR(ROUND('Tex-424-A'!#REF!*('Tex-424-A'!#REF!/(PI()*(IF(CircumDiameter1=\"Diameter\",'Tex-424-A'!#REF!,SQRT('Tex-424-A'!#REF!/PI())*2)^2/4))),-1)),\"\",ROUND('Tex-424-A'!#REF!*('Tex-424-A'!#REF!/(PI()*(IF(CircumDiameter1=\"Diameter\",'Tex-424-A'!#REF!,SQRT('Tex-424-A'!#REF!/PI())*2)^2/4))),-1))","v":""},{"$f":"IF(ISERROR(ROUND(0.000001*('Tex-424-A'!#REF!*('Tex-424-A'!#REF!/(PI()*((IF(CircumDiameter1=\"Diameter\",'Tex-424-A'!#REF!,SQRT('Tex-424-A'!#REF!/PI())*2)/1000)^2/4))))*2,1)/2),\"\",ROUND(0.000001*('Tex-424-A'!#REF!*('Tex-424-A'!#REF!/(PI()*((IF(CircumDiameter1=\"Diameter\",'Tex-424-A'!#REF!,SQRT('Tex-424-A'!#REF!/PI())*2)/1000)^2/4))))*2,1)/2)","v":""}]
[1.18,0.91300000000000003]
{"$rows_left_out":92}