{"text_format":"1","workbook":"xlsx","n_sheets":3,"sheets":["Pressure Slaking","RX","Sieves"],"not_rendered":{"charts":0,"images":1,"macros":1,"external_links":0,"defined_names":91,"comments":1,"pivot_tables":0},"unopened":[],"bounds":{"document_bytes":16777216,"sheet_cells":100000,"rows_first":2000,"rows_last":500,"rows_between":2000,"halvings":0,"cell_chars":16384,"cell_head_chars":4096},"cells_cut":0,"cells_raw":0,"read":"whole","date_system":"1900"}

{"sheet":"Pressure Slaking","index":0,"n_rows":60,"n_cols":22,"rows_kept":60,"cut":false,"hidden":false,"merged":[[60,1,60,3],[56,1,56,3],[54,2,54,4],[31,1,33,1],[27,6,27,7],[29,1,30,2],[27,4,27,5],[40,3,40,5],[43,1,44,8],[45,1,45,8],[46,1,46,8],[56,6,56,8],[53,2,53,4],[29,3,33,3],[29,8,33,8],[29,4,33,4],[16,3,16,4],[16,7,16,8],[20,1,20,2],[22,3,23,3],[24,6,24,7],[22,4,22,7],[24,4,24,5],[31,2,33,2],[29,7,33,7],[26,6,26,7],[29,5,33,5],[29,6,33,6],[26,4,26,5],[8,3,8,4],[8,7,8,8],[10,7,10,8],[0,0,0,1],[7,7,7,8],[7,3,7,4],[9,7,9,8],[9,3,9,4],[10,3,10,4],[48,2,48,4],[49,2,49,4],[51,2,51,4],[11,3,11,4],[15,3,15,8],[11,7,11,8],[13,7,13,8],[12,3,12,4],[13,3,13,4],[14,3,14,8],[12,7,12,8],[25,4,25,5],[25,6,25,7],[22,2,23,2],[23,6,23,7],[23,4,23,5]]}
["TxDOT Manuals >",null,null,"Tex-431-A"]
[null,"TEXAS DEPARTMENT OF TRANSPORTATION",null,null,null,null,null,null,null,null,35]
[null,null,null,null,null,null,null,null,null,null,1]
[null,null,null,null,null,null,null,null,null,null,"tx431.xlsm::45506.921088"]
[null,"PRESSURE SLAKING TEST OF SYNTHETIC COARSE AGGREGATE"]
[null,"Tex-431-A "]
[null,null,null,null,null,null,null,null,{"$f":"\"File Version: \" & TEXT(MID(sn,SEARCH(\"::\",sn,1)+2,20),\"mm/dd/yy hh:mm:ss\")","v":"File Version: 08/02/24 22:06:22"}]
[null,null,"SAMPLE ID:",null,null,null,"SAMPLED DATE:"]
[null,null,"TEST NUMBER:",null,null,null,"LETTING DATE:"]
[null,null,"SAMPLE STATUS:",null,null,null,"CONTROLLING CSJ:"]
[null,null,"COUNTY:",null,null,null,"SPEC YEAR:"]
[null,null,"SAMPLED BY:",null,null,null,"SPEC ITEM:"]
[null,null,"SAMPLE LOCATION:",null,null,null,"SPECIAL PROVISION:"]
[null,null,"MATERIAL CODE:",null,null,null,"GRADE/PRODUCT:"]
[null,null,"MATERIAL NAME:"]
[null,null,"PRODUCER:"]
[null,null,"AREA ENGINEER:",null,null,null,"PROJECT MANAGER:"]
[]
[null,null,"COURSE\\LIFT:",null,"STATION:",null,null,"DIST. FROM CL:"]
[]
[null,"QTY REPRESENTED:"]
[]
[null,null,"Bottle","Centrifuge Bottles","Height of Water Before and After Pressurization"]
[null,null,null,null,{"$f":"\"Before \"& IF(SpecYear=\"\",\"\",IF(SpecYear=\"1995\",\"( mm )\",\"( in. )\"))","v":"Before "},null,{"$f":"\"After \"& IF(SpecYear=\"\",\"\",IF(SpecYear=\"1995\",\"( mm )\",\"( in. )\"))","v":"After "}]
[null,null,1,null,null,null,null,null,{"$f":"IF(OR(SpecYear=\"\",G25=\"\"),\"\",IF(E25-G25>IF(SpecYear=\"1995\",15.9,0.625),\"Add Water\",\"\"))","v":""}]
[null,null,2,null,null,null,null,null,{"$f":"IF(OR(SpecYear=\"\",G26=\"\"),\"\",IF(E26-G26>IF(SpecYear=\"1995\",15.9,0.625),\"Add Water\",\"\"))","v":""}]
[null,null,3,null,null,null,null,null,{"$f":"IF(OR(SpecYear=\"\",G27=\"\"),\"\",IF(E27-G27>IF(SpecYear=\"1995\",15.9,0.625),\"Add Water\",\"\"))","v":""}]
[null,null,4,null,null,null,null,null,{"$f":"IF(OR(SpecYear=\"\",G28=\"\"),\"\",IF(E28-G28>IF(SpecYear=\"1995\",15.9,0.625),\"Add Water\",\"\"))","v":""},null,null,null,null,null,null,null,null,null,null,{"$f":"IF($H$11=\"1993\",(IF(G27=\"\",\"\",IF((+$E27-$G27>0.75),\"YES\",\"\"))),+U28)","v":""},{"$f":"IF($H$11=\"1995\",IF($G27=\"\",\"\",IF((+$E27-$G27>15.9),\"YES\",\"\")))","v":""}]
[null,null,null,null,null,null,null,null,null,null,null,null,null,null,null,null,null,null,null,null,{"$f":"IF($H$11=\"1993\",(IF(G28=\"\",\"\",IF((+$E28-$G28>0.75),\"YES\",\"\"))),+V29)","v":""},{"$f":"IF($H$11=\"1995\",IF($G28=\"\",\"\",IF((+$E28-$G28>15.9),\"YES\",\"\")))","v":""}]
[null,"Particle Size Range",null,"Initial Weight (g)","Final Weight (g)","Loss of Weight (g)","% Loss","Normalized Gradation Ind. % ","Weighted Average % Loss"]
[]
[null,"Passing","Retained"]
[]
[]
[null,{"$f":"IF(SpecYear=\"\",\"\",IF(ISERROR(INDEX(INDIRECT(Type),1,IF(SpecYear=\"1995\",6,3))),\"\",INDEX(INDIRECT(Type),1,IF(SpecYear=\"1995\",6,3))))","v":""},{"$f":"IF(SpecYear=\"\",\"\",IF(ISERROR(INDEX(INDIRECT(Type),1,IF(SpecYear=\"1995\",7,4))),\"\",INDEX(INDIRECT(Type),1,IF(SpecYear=\"1995\",7,4))))","v":""},null,null,{"$f":"IF(COUNTBLANK($D$35:$E$38)=8,\"\",D35-E35)","v":""},{"$f":"IF(COUNTBLANK($D$35:$E$38)=8,\"\",IF(D35>0,+F35/D35*100,0))","v":""},{"$f":"IF(SpecYear=\"\",\"\",IF(ISERROR(INDEX(INDIRECT(Type),1,8)),\"\",INDEX(INDIRECT(Type),1,8)))","v":""},{"$f":"IF($H35=0, \"\",H35*G35/100)","v":""}]
[null,{"$f":"IF(SpecYear=\"\",\"\",IF(ISERROR(INDEX(INDIRECT(Type),2,IF(SpecYear=\"1995\",6,3))),\"\",INDEX(INDIRECT(Type),2,IF(SpecYear=\"1995\",6,3))))","v":""},{"$f":"IF(SpecYear=\"\",\"\",IF(ISERROR(INDEX(INDIRECT(Type),2,IF(SpecYear=\"1995\",7,4))),\"\",INDEX(INDIRECT(Type),2,IF(SpecYear=\"1995\",7,4))))","v":""},null,null,{"$f":"IF(COUNTBLANK($D$35:$E$38)=8,\"\",D36-E36)","v":""},{"$f":"IF(COUNTBLANK($D$35:$E$38)=8,\"\",IF(D36>0,+F36/D36*100,0))","v":""},{"$f":"IF(SpecYear=\"\",\"\",IF(ISERROR(INDEX(INDIRECT(Type),2,8)),\"\",INDEX(INDIRECT(Type),2,8)))","v":""},{"$f":"IF($H36=0, \"\",H36*G36/100)","v":""}]
[null,{"$f":"IF(SpecYear=\"\",\"\",IF(ISERROR(INDEX(INDIRECT(Type),3,IF(SpecYear=\"1995\",6,3))),\"\",INDEX(INDIRECT(Type),3,IF(SpecYear=\"1995\",6,3))))","v":""},{"$f":"IF(SpecYear=\"\",\"\",IF(ISERROR(INDEX(INDIRECT(Type),3,IF(SpecYear=\"1995\",7,4))),\"\",INDEX(INDIRECT(Type),3,IF(SpecYear=\"1995\",7,4))))","v":""},null,null,{"$f":"IF(COUNTBLANK($D$35:$E$38)=8,\"\",D37-E37)","v":""},{"$f":"IF(COUNTBLANK($D$35:$E$38)=8,\"\",IF(D37>0,+F37/D37*100,0))","v":""},{"$f":"IF(SpecYear=\"\",\"\",IF(ISERROR(INDEX(INDIRECT(Type),3,8)),\"\",INDEX(INDIRECT(Type),3,8)))","v":""},{"$f":"IF($H37=0, \"\",H37*G37/100)","v":""}]
[null,{"$f":"IF(SpecYear=\"\",\"\",IF(ISERROR(INDEX(INDIRECT(Type),4,IF(SpecYear=\"1995\",6,3))),\"\",INDEX(INDIRECT(Type),4,IF(SpecYear=\"1995\",6,3))))","v":""},{"$f":"IF(SpecYear=\"\",\"\",IF(ISERROR(INDEX(INDIRECT(Type),4,IF(SpecYear=\"1995\",7,4))),\"\",INDEX(INDIRECT(Type),4,IF(SpecYear=\"1995\",7,4))))","v":""},null,null,{"$f":"IF(COUNTBLANK($D$35:$E$38)=8,\"\",D38-E38)","v":""},{"$f":"IF(COUNTBLANK($D$35:$E$38)=8,\"\",IF(D38>0,+F38/D38*100,0))","v":""},{"$f":"IF(SpecYear=\"\",\"\",IF(ISERROR(INDEX(INDIRECT(Type),4,8)),\"\",INDEX(INDIRECT(Type),4,8)))","v":""},{"$f":"IF($H38=0, \"\",H38*G38/100)","v":""}]
[null,null,"Total:",{"$f":"IF(COUNTBLANK($D$35:$E$38)=8,\"\",SUM(D35:D38))","v":""},null,null,"Total:",{"$f":"IF(COUNTBLANK($D$35:$E$38)=8,\"\",SUM(H35:H38))","v":""},{"$f":"IF(COUNTBLANK($D$35:$E$38)=8,\"\",SUM(I35:I38))","v":""}]
[]
[null,null,null,"Loss due to Pressure Slaking:",null,null,{"$f":"$I$39","v":""}]
[]
[null,"Remarks:",{"$f":"NOW()","v":"2024-08-02T22:06:22.280"}]
[]
[]
[]
[]
[]
[null,"Sample Method:","Sampled By:",null,null,"Sampled Date:"]
[null,"TX221"]
[]
[null,"TX400"]
[]
[null,"Test Method:","Tested By:",null,null,"Tested Date:"]
[null,"TX431"]
[null,"Test Stamp Code:",null,null,"Omit Test:","Completed Date:","Reviewed By:"]
[]
[null,"Locked By:","TxDOT:","District:","Area:"]
[]
[null,"Authorized By:",null,null,"Authorized Date:"]

{"sheet":"RX","index":1,"n_rows":43,"n_cols":9,"rows_kept":43,"cut":false,"hidden":true,"merged":[]}
[41]
["Fld_nbr","Value","Desc_1","Desc_2","Desc_3","Desc_4","Desc_5","Desc_6","Desc_7"]
[1,{"$f":"IF('Pressure Slaking'!$B$44=\"\",\"\",'Pressure Slaking'!$B$44)","v":""},{"$f":"'Pressure Slaking'!$B$43","v":"Remarks:"}]
[2,{"$f":"IF('Pressure Slaking'!$D$19=\"\",\"\",'Pressure Slaking'!$D$19)","v":""},{"$f":"IF('Pressure Slaking'!$C$19=\"\",\"\",'Pressure Slaking'!$C$19)","v":"COURSE\\LIFT:"}]
[3,{"$f":"IF('Pressure Slaking'!$C$55=\"\",\"\",'Pressure Slaking'!$C$55)","v":""},"Tested By ",{"$f":"IF('Pressure Slaking'!$B$55=\"\",\"\",'Pressure Slaking'!$B$55)","v":"TX431"}]
[4,{"$f":"IF('Pressure Slaking'!$F$55=\"\",\"\",'Pressure Slaking'!$F$55)","v":""},"Tested Date ",{"$f":"IF('Pressure Slaking'!$B$55=\"\",\"\",'Pressure Slaking'!$B$55)","v":"TX431"}]
[5,{"$f":"IF('Pressure Slaking'!$D$21=\"\",\"\",'Pressure Slaking'!$D$21)","v":""},{"$f":"IF('Pressure Slaking'!$B$6=\"\",\"\",'Pressure Slaking'!$B$6)","v":"Tex-431-A "},{"$f":"IF('Pressure Slaking'!$B$21=\"\",\"\",'Pressure Slaking'!$B$21)","v":"QTY REPRESENTED:"}]
[6,{"$f":"IF('Pressure Slaking'!$D$25=\"\",\"\",'Pressure Slaking'!$D$25)","v":""},{"$f":"IF('Pressure Slaking'!$B$6=\"\",\"\",'Pressure Slaking'!$B$6)","v":"Tex-431-A "},{"$f":"IF('Pressure Slaking'!$D$23=\"\",\"\",'Pressure Slaking'!$D$23)","v":"Centrifuge Bottles"},{"$f":"IF('Pressure Slaking'!$C$23=\"\",\"\",'Pressure Slaking'!$C$23)","v":"Bottle"},{"$f":"IF('Pressure Slaking'!$C$25=\"\",\"\",'Pressure Slaking'!$C$25)","v":1}]
[7,{"$f":"IF('Pressure Slaking'!$D$26=\"\",\"\",'Pressure Slaking'!$D$26)","v":""},{"$f":"IF('Pressure Slaking'!$B$6=\"\",\"\",'Pressure Slaking'!$B$6)","v":"Tex-431-A "},{"$f":"IF('Pressure Slaking'!$D$23=\"\",\"\",'Pressure Slaking'!$D$23)","v":"Centrifuge Bottles"},{"$f":"IF('Pressure Slaking'!$C$23=\"\",\"\",'Pressure Slaking'!$C$23)","v":"Bottle"},{"$f":"IF('Pressure Slaking'!$C$26=\"\",\"\",'Pressure Slaking'!$C$26)","v":2}]
[8,{"$f":"IF('Pressure Slaking'!$D$27=\"\",\"\",'Pressure Slaking'!$D$27)","v":""},{"$f":"IF('Pressure Slaking'!$B$6=\"\",\"\",'Pressure Slaking'!$B$6)","v":"Tex-431-A "},{"$f":"IF('Pressure Slaking'!$D$23=\"\",\"\",'Pressure Slaking'!$D$23)","v":"Centrifuge Bottles"},{"$f":"IF('Pressure Slaking'!$C$23=\"\",\"\",'Pressure Slaking'!$C$23)","v":"Bottle"},{"$f":"IF('Pressure Slaking'!$C$27=\"\",\"\",'Pressure Slaking'!$C$27)","v":3}]
[9,{"$f":"IF('Pressure Slaking'!$D$28=\"\",\"\",'Pressure Slaking'!$D$28)","v":""},{"$f":"IF('Pressure Slaking'!$B$6=\"\",\"\",'Pressure Slaking'!$B$6)","v":"Tex-431-A "},{"$f":"IF('Pressure Slaking'!$D$23=\"\",\"\",'Pressure Slaking'!$D$23)","v":"Centrifuge Bottles"},{"$f":"IF('Pressure Slaking'!$C$23=\"\",\"\",'Pressure Slaking'!$C$23)","v":"Bottle"},{"$f":"IF('Pressure Slaking'!$C$28=\"\",\"\",'Pressure Slaking'!$C$28)","v":4}]
[10,{"$f":"IF('Pressure Slaking'!$D$35=\"\",\"\",'Pressure Slaking'!$D$35)","v":""},{"$f":"IF('Pressure Slaking'!$B$6=\"\",\"\",'Pressure Slaking'!$B$6)","v":"Tex-431-A "},{"$f":"IF('Pressure Slaking'!$D$30=\"\",\"\",'Pressure Slaking'!$D$30)","v":"Initial Weight (g)"},{"$f":"IF('Pressure Slaking'!$B$30=\"\",\"\",'Pressure Slaking'!$B$30)","v":"Particle Size Range"},{"$f":"IF('Pressure Slaking'!$B$32=\"\",\"\",'Pressure Slaking'!$B$32)","v":"Passing"},{"$f":"IF('Pressure Slaking'!$B$35=\"\",\"\",'Pressure Slaking'!$B$35)","v":""},{"$f":"IF('Pressure Slaking'!$C$32=\"\",\"\",'Pressure Slaking'!$C$32)","v":"Retained"},{"$f":"'Pressure Slaking'!$C$35","v":""}]
[11,{"$f":"IF('Pressure Slaking'!$E$35=\"\",\"\",'Pressure Slaking'!$E$35)","v":""},{"$f":"IF('Pressure Slaking'!$B$6=\"\",\"\",'Pressure Slaking'!$B$6)","v":"Tex-431-A "},{"$f":"IF('Pressure Slaking'!$E$30=\"\",\"\",'Pressure Slaking'!$E$30)","v":"Final Weight (g)"},{"$f":"IF('Pressure Slaking'!$B$30=\"\",\"\",'Pressure Slaking'!$B$30)","v":"Particle Size Range"},{"$f":"IF('Pressure Slaking'!$B$32=\"\",\"\",'Pressure Slaking'!$B$32)","v":"Passing"},{"$f":"IF('Pressure Slaking'!$B$35=\"\",\"\",'Pressure Slaking'!$B$35)","v":""},{"$f":"IF('Pressure Slaking'!$C$32=\"\",\"\",'Pressure Slaking'!$C$32)","v":"Retained"},{"$f":"'Pressure Slaking'!$C$35","v":""}]
[12,{"$f":"IF('Pressure Slaking'!$F$35=\"\",\"\",'Pressure Slaking'!$F$35)","v":""},{"$f":"IF('Pressure Slaking'!$B$6=\"\",\"\",'Pressure Slaking'!$B$6)","v":"Tex-431-A "},{"$f":"IF('Pressure Slaking'!$F$30=\"\",\"\",'Pressure Slaking'!$F$30)","v":"Loss of Weight (g)"},{"$f":"IF('Pressure Slaking'!$B$30=\"\",\"\",'Pressure Slaking'!$B$30)","v":"Particle Size Range"},{"$f":"IF('Pressure Slaking'!$B$32=\"\",\"\",'Pressure Slaking'!$B$32)","v":"Passing"},{"$f":"IF('Pressure Slaking'!$B$35=\"\",\"\",'Pressure Slaking'!$B$35)","v":""},{"$f":"IF('Pressure Slaking'!$C$32=\"\",\"\",'Pressure Slaking'!$C$32)","v":"Retained"},{"$f":"'Pressure Slaking'!$C$35","v":""}]
[13,{"$f":"IF('Pressure Slaking'!$G$35=\"\",\"\",'Pressure Slaking'!$G$35)","v":""},{"$f":"IF('Pressure Slaking'!$B$6=\"\",\"\",'Pressure Slaking'!$B$6)","v":"Tex-431-A "},{"$f":"IF('Pressure Slaking'!$G$30=\"\",\"\",'Pressure Slaking'!$G$30)","v":"% Loss"},{"$f":"IF('Pressure Slaking'!$B$30=\"\",\"\",'Pressure Slaking'!$B$30)","v":"Particle Size Range"},{"$f":"IF('Pressure Slaking'!$B$32=\"\",\"\",'Pressure Slaking'!$B$32)","v":"Passing"},{"$f":"IF('Pressure Slaking'!$B$35=\"\",\"\",'Pressure Slaking'!$B$35)","v":""},{"$f":"IF('Pressure Slaking'!$C$32=\"\",\"\",'Pressure Slaking'!$C$32)","v":"Retained"},{"$f":"'Pressure Slaking'!$C$35","v":""}]
[14,{"$f":"IF('Pressure Slaking'!$H$35=\"\",\"\",'Pressure Slaking'!$H$35)","v":""},{"$f":"IF('Pressure Slaking'!$B$6=\"\",\"\",'Pressure Slaking'!$B$6)","v":"Tex-431-A "},{"$f":"IF('Pressure Slaking'!$H$30=\"\",\"\",'Pressure Slaking'!$H$30)","v":"Normalized Gradation Ind. % "},{"$f":"IF('Pressure Slaking'!$B$30=\"\",\"\",'Pressure Slaking'!$B$30)","v":"Particle Size Range"},{"$f":"IF('Pressure Slaking'!$B$32=\"\",\"\",'Pressure Slaking'!$B$32)","v":"Passing"},{"$f":"IF('Pressure Slaking'!$B$35=\"\",\"\",'Pressure Slaking'!$B$35)","v":""},{"$f":"IF('Pressure Slaking'!$C$32=\"\",\"\",'Pressure Slaking'!$C$32)","v":"Retained"},{"$f":"'Pressure Slaking'!$C$35","v":""}]
[15,{"$f":"IF('Pressure Slaking'!$I$35=\"\",\"\",'Pressure Slaking'!$I$35)","v":""},{"$f":"IF('Pressure Slaking'!$B$6=\"\",\"\",'Pressure Slaking'!$B$6)","v":"Tex-431-A "},{"$f":"IF('Pressure Slaking'!$I$30=\"\",\"\",'Pressure Slaking'!$I$30)","v":"Weighted Average % Loss"},{"$f":"IF('Pressure Slaking'!$B$30=\"\",\"\",'Pressure Slaking'!$B$30)","v":"Particle Size Range"},{"$f":"IF('Pressure Slaking'!$B$32=\"\",\"\",'Pressure Slaking'!$B$32)","v":"Passing"},{"$f":"IF('Pressure Slaking'!$B$35=\"\",\"\",'Pressure Slaking'!$B$35)","v":""},{"$f":"IF('Pressure Slaking'!$C$32=\"\",\"\",'Pressure Slaking'!$C$32)","v":"Retained"},{"$f":"'Pressure Slaking'!$C$35","v":""}]
[16,{"$f":"IF('Pressure Slaking'!$D$36=\"\",\"\",'Pressure Slaking'!$D$36)","v":""},{"$f":"IF('Pressure Slaking'!$B$6=\"\",\"\",'Pressure Slaking'!$B$6)","v":"Tex-431-A "},{"$f":"IF('Pressure Slaking'!$D$30=\"\",\"\",'Pressure Slaking'!$D$30)","v":"Initial Weight (g)"},{"$f":"IF('Pressure Slaking'!$B$30=\"\",\"\",'Pressure Slaking'!$B$30)","v":"Particle Size Range"},{"$f":"IF('Pressure Slaking'!$B$32=\"\",\"\",'Pressure Slaking'!$B$32)","v":"Passing"},{"$f":"IF('Pressure Slaking'!$B$36=\"\",\"\",'Pressure Slaking'!$B$36)","v":""},{"$f":"IF('Pressure Slaking'!$C$32=\"\",\"\",'Pressure Slaking'!$C$32)","v":"Retained"},{"$f":"'Pressure Slaking'!$C$36","v":""}]
[17,{"$f":"IF('Pressure Slaking'!$E$36=\"\",\"\",'Pressure Slaking'!$E$36)","v":""},{"$f":"IF('Pressure Slaking'!$B$6=\"\",\"\",'Pressure Slaking'!$B$6)","v":"Tex-431-A "},{"$f":"IF('Pressure Slaking'!$E$30=\"\",\"\",'Pressure Slaking'!$E$30)","v":"Final Weight (g)"},{"$f":"IF('Pressure Slaking'!$B$30=\"\",\"\",'Pressure Slaking'!$B$30)","v":"Particle Size Range"},{"$f":"IF('Pressure Slaking'!$B$32=\"\",\"\",'Pressure Slaking'!$B$32)","v":"Passing"},{"$f":"IF('Pressure Slaking'!$B$36=\"\",\"\",'Pressure Slaking'!$B$36)","v":""},{"$f":"IF('Pressure Slaking'!$C$32=\"\",\"\",'Pressure Slaking'!$C$32)","v":"Retained"},{"$f":"'Pressure Slaking'!$C$36","v":""}]
[18,{"$f":"IF('Pressure Slaking'!$F$36=\"\",\"\",'Pressure Slaking'!$F$36)","v":""},{"$f":"IF('Pressure Slaking'!$B$6=\"\",\"\",'Pressure Slaking'!$B$6)","v":"Tex-431-A "},{"$f":"IF('Pressure Slaking'!$F$30=\"\",\"\",'Pressure Slaking'!$F$30)","v":"Loss of Weight (g)"},{"$f":"IF('Pressure Slaking'!$B$30=\"\",\"\",'Pressure Slaking'!$B$30)","v":"Particle Size Range"},{"$f":"IF('Pressure Slaking'!$B$32=\"\",\"\",'Pressure Slaking'!$B$32)","v":"Passing"},{"$f":"IF('Pressure Slaking'!$B$36=\"\",\"\",'Pressure Slaking'!$B$36)","v":""},{"$f":"IF('Pressure Slaking'!$C$32=\"\",\"\",'Pressure Slaking'!$C$32)","v":"Retained"},{"$f":"'Pressure Slaking'!$C$36","v":""}]
[19,{"$f":"IF('Pressure Slaking'!$G$36=\"\",\"\",'Pressure Slaking'!$G$36)","v":""},{"$f":"IF('Pressure Slaking'!$B$6=\"\",\"\",'Pressure Slaking'!$B$6)","v":"Tex-431-A "},{"$f":"IF('Pressure Slaking'!$G$30=\"\",\"\",'Pressure Slaking'!$G$30)","v":"% Loss"},{"$f":"IF('Pressure Slaking'!$B$30=\"\",\"\",'Pressure Slaking'!$B$30)","v":"Particle Size Range"},{"$f":"IF('Pressure Slaking'!$B$32=\"\",\"\",'Pressure Slaking'!$B$32)","v":"Passing"},{"$f":"IF('Pressure Slaking'!$B$36=\"\",\"\",'Pressure Slaking'!$B$36)","v":""},{"$f":"IF('Pressure Slaking'!$C$32=\"\",\"\",'Pressure Slaking'!$C$32)","v":"Retained"},{"$f":"'Pressure Slaking'!$C$36","v":""}]
[20,{"$f":"IF('Pressure Slaking'!$H$36=\"\",\"\",'Pressure Slaking'!$H$36)","v":""},{"$f":"IF('Pressure Slaking'!$B$6=\"\",\"\",'Pressure Slaking'!$B$6)","v":"Tex-431-A "},{"$f":"IF('Pressure Slaking'!$H$30=\"\",\"\",'Pressure Slaking'!$H$30)","v":"Normalized Gradation Ind. % "},{"$f":"IF('Pressure Slaking'!$B$30=\"\",\"\",'Pressure Slaking'!$B$30)","v":"Particle Size Range"},{"$f":"IF('Pressure Slaking'!$B$32=\"\",\"\",'Pressure Slaking'!$B$32)","v":"Passing"},{"$f":"IF('Pressure Slaking'!$B$36=\"\",\"\",'Pressure Slaking'!$B$36)","v":""},{"$f":"IF('Pressure Slaking'!$C$32=\"\",\"\",'Pressure Slaking'!$C$32)","v":"Retained"},{"$f":"'Pressure Slaking'!$C$36","v":""}]
[21,{"$f":"IF('Pressure Slaking'!$I$36=\"\",\"\",'Pressure Slaking'!$I$36)","v":""},{"$f":"IF('Pressure Slaking'!$B$6=\"\",\"\",'Pressure Slaking'!$B$6)","v":"Tex-431-A "},{"$f":"IF('Pressure Slaking'!$I$30=\"\",\"\",'Pressure Slaking'!$I$30)","v":"Weighted Average % Loss"},{"$f":"IF('Pressure Slaking'!$B$30=\"\",\"\",'Pressure Slaking'!$B$30)","v":"Particle Size Range"},{"$f":"IF('Pressure Slaking'!$B$32=\"\",\"\",'Pressure Slaking'!$B$32)","v":"Passing"},{"$f":"IF('Pressure Slaking'!$B$36=\"\",\"\",'Pressure Slaking'!$B$36)","v":""},{"$f":"IF('Pressure Slaking'!$C$32=\"\",\"\",'Pressure Slaking'!$C$32)","v":"Retained"},{"$f":"'Pressure Slaking'!$C$36","v":""}]
[22,{"$f":"IF('Pressure Slaking'!$D$37=\"\",\"\",'Pressure Slaking'!$D$37)","v":""},{"$f":"IF('Pressure Slaking'!$B$6=\"\",\"\",'Pressure Slaking'!$B$6)","v":"Tex-431-A "},{"$f":"IF('Pressure Slaking'!$D$30=\"\",\"\",'Pressure Slaking'!$D$30)","v":"Initial Weight (g)"},{"$f":"IF('Pressure Slaking'!$B$30=\"\",\"\",'Pressure Slaking'!$B$30)","v":"Particle Size Range"},{"$f":"IF('Pressure Slaking'!$B$32=\"\",\"\",'Pressure Slaking'!$B$32)","v":"Passing"},{"$f":"IF('Pressure Slaking'!$B$37=\"\",\"\",'Pressure Slaking'!$B$37)","v":""},{"$f":"IF('Pressure Slaking'!$C$32=\"\",\"\",'Pressure Slaking'!$C$32)","v":"Retained"},{"$f":"'Pressure Slaking'!$C$37","v":""}]
[23,{"$f":"IF('Pressure Slaking'!$E$37=\"\",\"\",'Pressure Slaking'!$E$37)","v":""},{"$f":"IF('Pressure Slaking'!$B$6=\"\",\"\",'Pressure Slaking'!$B$6)","v":"Tex-431-A "},{"$f":"IF('Pressure Slaking'!$E$30=\"\",\"\",'Pressure Slaking'!$E$30)","v":"Final Weight (g)"},{"$f":"IF('Pressure Slaking'!$B$30=\"\",\"\",'Pressure Slaking'!$B$30)","v":"Particle Size Range"},{"$f":"IF('Pressure Slaking'!$B$32=\"\",\"\",'Pressure Slaking'!$B$32)","v":"Passing"},{"$f":"IF('Pressure Slaking'!$B$37=\"\",\"\",'Pressure Slaking'!$B$37)","v":""},{"$f":"IF('Pressure Slaking'!$C$32=\"\",\"\",'Pressure Slaking'!$C$32)","v":"Retained"},{"$f":"'Pressure Slaking'!$C$37","v":""}]
[24,{"$f":"IF('Pressure Slaking'!$F$37=\"\",\"\",'Pressure Slaking'!$F$37)","v":""},{"$f":"IF('Pressure Slaking'!$B$6=\"\",\"\",'Pressure Slaking'!$B$6)","v":"Tex-431-A "},{"$f":"IF('Pressure Slaking'!$F$30=\"\",\"\",'Pressure Slaking'!$F$30)","v":"Loss of Weight (g)"},{"$f":"IF('Pressure Slaking'!$B$30=\"\",\"\",'Pressure Slaking'!$B$30)","v":"Particle Size Range"},{"$f":"IF('Pressure Slaking'!$B$32=\"\",\"\",'Pressure Slaking'!$B$32)","v":"Passing"},{"$f":"IF('Pressure Slaking'!$B$37=\"\",\"\",'Pressure Slaking'!$B$37)","v":""},{"$f":"IF('Pressure Slaking'!$C$32=\"\",\"\",'Pressure Slaking'!$C$32)","v":"Retained"},{"$f":"'Pressure Slaking'!$C$37","v":""}]
[25,{"$f":"IF('Pressure Slaking'!$G$37=\"\",\"\",'Pressure Slaking'!$G$37)","v":""},{"$f":"IF('Pressure Slaking'!$B$6=\"\",\"\",'Pressure Slaking'!$B$6)","v":"Tex-431-A "},{"$f":"IF('Pressure Slaking'!$G$30=\"\",\"\",'Pressure Slaking'!$G$30)","v":"% Loss"},{"$f":"IF('Pressure Slaking'!$B$30=\"\",\"\",'Pressure Slaking'!$B$30)","v":"Particle Size Range"},{"$f":"IF('Pressure Slaking'!$B$32=\"\",\"\",'Pressure Slaking'!$B$32)","v":"Passing"},{"$f":"IF('Pressure Slaking'!$B$37=\"\",\"\",'Pressure Slaking'!$B$37)","v":""},{"$f":"IF('Pressure Slaking'!$C$32=\"\",\"\",'Pressure Slaking'!$C$32)","v":"Retained"},{"$f":"'Pressure Slaking'!$C$37","v":""}]
[26,{"$f":"IF('Pressure Slaking'!$H$37=\"\",\"\",'Pressure Slaking'!$H$37)","v":""},{"$f":"IF('Pressure Slaking'!$B$6=\"\",\"\",'Pressure Slaking'!$B$6)","v":"Tex-431-A "},{"$f":"IF('Pressure Slaking'!$H$30=\"\",\"\",'Pressure Slaking'!$H$30)","v":"Normalized Gradation Ind. % "},{"$f":"IF('Pressure Slaking'!$B$30=\"\",\"\",'Pressure Slaking'!$B$30)","v":"Particle Size Range"},{"$f":"IF('Pressure Slaking'!$B$32=\"\",\"\",'Pressure Slaking'!$B$32)","v":"Passing"},{"$f":"IF('Pressure Slaking'!$B$37=\"\",\"\",'Pressure Slaking'!$B$37)","v":""},{"$f":"IF('Pressure Slaking'!$C$32=\"\",\"\",'Pressure Slaking'!$C$32)","v":"Retained"},{"$f":"'Pressure Slaking'!$C$37","v":""}]
[27,{"$f":"IF('Pressure Slaking'!$I$37=\"\",\"\",'Pressure Slaking'!$I$37)","v":""},{"$f":"IF('Pressure Slaking'!$B$6=\"\",\"\",'Pressure Slaking'!$B$6)","v":"Tex-431-A "},{"$f":"IF('Pressure Slaking'!$I$30=\"\",\"\",'Pressure Slaking'!$I$30)","v":"Weighted Average % Loss"},{"$f":"IF('Pressure Slaking'!$B$30=\"\",\"\",'Pressure Slaking'!$B$30)","v":"Particle Size Range"},{"$f":"IF('Pressure Slaking'!$B$32=\"\",\"\",'Pressure Slaking'!$B$32)","v":"Passing"},{"$f":"IF('Pressure Slaking'!$B$37=\"\",\"\",'Pressure Slaking'!$B$37)","v":""},{"$f":"IF('Pressure Slaking'!$C$32=\"\",\"\",'Pressure Slaking'!$C$32)","v":"Retained"},{"$f":"'Pressure Slaking'!$C$37","v":""}]
[28,{"$f":"IF('Pressure Slaking'!$D$38=\"\",\"\",'Pressure Slaking'!$D$38)","v":""},{"$f":"IF('Pressure Slaking'!$B$6=\"\",\"\",'Pressure Slaking'!$B$6)","v":"Tex-431-A "},{"$f":"IF('Pressure Slaking'!$D$30=\"\",\"\",'Pressure Slaking'!$D$30)","v":"Initial Weight (g)"},{"$f":"IF('Pressure Slaking'!$B$30=\"\",\"\",'Pressure Slaking'!$B$30)","v":"Particle Size Range"},{"$f":"IF('Pressure Slaking'!$B$32=\"\",\"\",'Pressure Slaking'!$B$32)","v":"Passing"},{"$f":"IF('Pressure Slaking'!$B$38=\"\",\"\",'Pressure Slaking'!$B$38)","v":""},{"$f":"IF('Pressure Slaking'!$C$32=\"\",\"\",'Pressure Slaking'!$C$32)","v":"Retained"},{"$f":"'Pressure Slaking'!$C$38","v":""}]
[29,{"$f":"IF('Pressure Slaking'!$E$38=\"\",\"\",'Pressure Slaking'!$E$38)","v":""},{"$f":"IF('Pressure Slaking'!$B$6=\"\",\"\",'Pressure Slaking'!$B$6)","v":"Tex-431-A "},{"$f":"IF('Pressure Slaking'!$E$30=\"\",\"\",'Pressure Slaking'!$E$30)","v":"Final Weight (g)"},{"$f":"IF('Pressure Slaking'!$B$30=\"\",\"\",'Pressure Slaking'!$B$30)","v":"Particle Size Range"},{"$f":"IF('Pressure Slaking'!$B$32=\"\",\"\",'Pressure Slaking'!$B$32)","v":"Passing"},{"$f":"IF('Pressure Slaking'!$B$38=\"\",\"\",'Pressure Slaking'!$B$38)","v":""},{"$f":"IF('Pressure Slaking'!$C$32=\"\",\"\",'Pressure Slaking'!$C$32)","v":"Retained"},{"$f":"'Pressure Slaking'!$C$38","v":""}]
[30,{"$f":"IF('Pressure Slaking'!$F$38=\"\",\"\",'Pressure Slaking'!$F$38)","v":""},{"$f":"IF('Pressure Slaking'!$B$6=\"\",\"\",'Pressure Slaking'!$B$6)","v":"Tex-431-A "},{"$f":"IF('Pressure Slaking'!$F$30=\"\",\"\",'Pressure Slaking'!$F$30)","v":"Loss of Weight (g)"},{"$f":"IF('Pressure Slaking'!$B$30=\"\",\"\",'Pressure Slaking'!$B$30)","v":"Particle Size Range"},{"$f":"IF('Pressure Slaking'!$B$32=\"\",\"\",'Pressure Slaking'!$B$32)","v":"Passing"},{"$f":"IF('Pressure Slaking'!$B$38=\"\",\"\",'Pressure Slaking'!$B$38)","v":""},{"$f":"IF('Pressure Slaking'!$C$32=\"\",\"\",'Pressure Slaking'!$C$32)","v":"Retained"},{"$f":"'Pressure Slaking'!$C$38","v":""}]
[31,{"$f":"IF('Pressure Slaking'!$G$38=\"\",\"\",'Pressure Slaking'!$G$38)","v":""},{"$f":"IF('Pressure Slaking'!$B$6=\"\",\"\",'Pressure Slaking'!$B$6)","v":"Tex-431-A "},{"$f":"IF('Pressure Slaking'!$G$30=\"\",\"\",'Pressure Slaking'!$G$30)","v":"% Loss"},{"$f":"IF('Pressure Slaking'!$B$30=\"\",\"\",'Pressure Slaking'!$B$30)","v":"Particle Size Range"},{"$f":"IF('Pressure Slaking'!$B$32=\"\",\"\",'Pressure Slaking'!$B$32)","v":"Passing"},{"$f":"IF('Pressure Slaking'!$B$38=\"\",\"\",'Pressure Slaking'!$B$38)","v":""},{"$f":"IF('Pressure Slaking'!$C$32=\"\",\"\",'Pressure Slaking'!$C$32)","v":"Retained"},{"$f":"'Pressure Slaking'!$C$38","v":""}]
[32,{"$f":"IF('Pressure Slaking'!$H$38=\"\",\"\",'Pressure Slaking'!$H$38)","v":""},{"$f":"IF('Pressure Slaking'!$B$6=\"\",\"\",'Pressure Slaking'!$B$6)","v":"Tex-431-A "},{"$f":"IF('Pressure Slaking'!$H$30=\"\",\"\",'Pressure Slaking'!$H$30)","v":"Normalized Gradation Ind. % "},{"$f":"IF('Pressure Slaking'!$B$30=\"\",\"\",'Pressure Slaking'!$B$30)","v":"Particle Size Range"},{"$f":"IF('Pressure Slaking'!$B$32=\"\",\"\",'Pressure Slaking'!$B$32)","v":"Passing"},{"$f":"IF('Pressure Slaking'!$B$38=\"\",\"\",'Pressure Slaking'!$B$38)","v":""},{"$f":"IF('Pressure Slaking'!$C$32=\"\",\"\",'Pressure Slaking'!$C$32)","v":"Retained"},{"$f":"'Pressure Slaking'!$C$38","v":""}]
[33,{"$f":"IF('Pressure Slaking'!$I$38=\"\",\"\",'Pressure Slaking'!$I$38)","v":""},{"$f":"IF('Pressure Slaking'!$B$6=\"\",\"\",'Pressure Slaking'!$B$6)","v":"Tex-431-A "},{"$f":"IF('Pressure Slaking'!$I$30=\"\",\"\",'Pressure Slaking'!$I$30)","v":"Weighted Average % Loss"},{"$f":"IF('Pressure Slaking'!$B$30=\"\",\"\",'Pressure Slaking'!$B$30)","v":"Particle Size Range"},{"$f":"IF('Pressure Slaking'!$B$32=\"\",\"\",'Pressure Slaking'!$B$32)","v":"Passing"},{"$f":"IF('Pressure Slaking'!$B$38=\"\",\"\",'Pressure Slaking'!$B$38)","v":""},{"$f":"IF('Pressure Slaking'!$C$32=\"\",\"\",'Pressure Slaking'!$C$32)","v":"Retained"},{"$f":"'Pressure Slaking'!$C$38","v":""}]
[34,{"$f":"IF('Pressure Slaking'!$D$39=\"\",\"\",'Pressure Slaking'!$D$39)","v":""},{"$f":"IF('Pressure Slaking'!$B$6=\"\",\"\",'Pressure Slaking'!$B$6)","v":"Tex-431-A "},{"$f":"IF('Pressure Slaking'!$D$30=\"\",\"\",'Pressure Slaking'!$D$30)","v":"Initial Weight (g)"},{"$f":"IF('Pressure Slaking'!$C$39=\"\",\"\",'Pressure Slaking'!$C$39)","v":"Total:"}]
[35,{"$f":"IF('Pressure Slaking'!$H$39=\"\",\"\",'Pressure Slaking'!$H$39)","v":""},{"$f":"IF('Pressure Slaking'!$B$6=\"\",\"\",'Pressure Slaking'!$B$6)","v":"Tex-431-A "},{"$f":"IF('Pressure Slaking'!$H$30=\"\",\"\",'Pressure Slaking'!$H$30)","v":"Normalized Gradation Ind. % "},{"$f":"IF('Pressure Slaking'!$G$39=\"\",\"\",'Pressure Slaking'!$G$39)","v":"Total:"}]
[36,{"$f":"IF('Pressure Slaking'!$I$39=\"\",\"\",'Pressure Slaking'!$I$39)","v":""},{"$f":"IF('Pressure Slaking'!$B$6=\"\",\"\",'Pressure Slaking'!$B$6)","v":"Tex-431-A "},{"$f":"IF('Pressure Slaking'!$I$30=\"\",\"\",'Pressure Slaking'!$I$30)","v":"Weighted Average % Loss"},{"$f":"IF('Pressure Slaking'!$G$39=\"\",\"\",'Pressure Slaking'!$G$39)","v":"Total:"}]
[37,{"$f":"IF('Pressure Slaking'!$G$41=\"\",\"\",'Pressure Slaking'!$G$41)","v":""},{"$f":"IF('Pressure Slaking'!$B$6=\"\",\"\",'Pressure Slaking'!$B$6)","v":"Tex-431-A "},{"$f":"IF('Pressure Slaking'!$D$41=\"\",\"\",'Pressure Slaking'!$D$41)","v":"Loss due to Pressure Slaking:"}]
[38,{"$f":"IF('Pressure Slaking'!$C$50=\"\",\"\",'Pressure Slaking'!$C$50)","v":""},"Tested By ",{"$f":"IF('Pressure Slaking'!$B$50=\"\",\"\",'Pressure Slaking'!$B$50)","v":"TX221"}]
[39,{"$f":"IF('Pressure Slaking'!$F$50=\"\",\"\",'Pressure Slaking'!$F$50)","v":""},"Tested Date ",{"$f":"IF('Pressure Slaking'!$B$50=\"\",\"\",'Pressure Slaking'!$B$50)","v":"TX221"}]
[40,{"$f":"IF('Pressure Slaking'!$C$52=\"\",\"\",'Pressure Slaking'!$C$52)","v":""},"Tested By ",{"$f":"IF('Pressure Slaking'!$B$52=\"\",\"\",'Pressure Slaking'!$B$52)","v":"TX400"}]
[41,{"$f":"IF('Pressure Slaking'!$F$52=\"\",\"\",'Pressure Slaking'!$F$52)","v":""},"Tested Date ",{"$f":"IF('Pressure Slaking'!$B$52=\"\",\"\",'Pressure Slaking'!$B$52)","v":"TX400"}]

{"sheet":"Sieves","index":2,"n_rows":14,"n_cols":9,"rows_kept":14,"cut":false,"hidden":true,"merged":[[10,0,13,0],[0,7,1,7],[0,10,1,10],[0,1,0,3],[0,4,0,6],[2,0,5,0],[6,0,9,0]]}
[null,"\"1993\"",null,null,"\"1995\"",null,null,"Standard Gradation"]
["Grade","Sieve Size","Passing Sieve","Retained Sieve","Sieve Size","Passing Sieve","Retained Sieve"]
["Concrete Coarse Aggr","5/8\"","3/4\"","5/8\"","16.0 mm","19.0 mm","16.0 mm"]
[null,"1/2\"","5/8\"","1/2\"","12.5 mm","16.0 mm","12.5 mm"]
[null,"3/8\"","1/2\"","3/8\"","9.5 mm","12.5 mm","9.5 mm",66]
[null,"No. 4","3/8\"","No. 4","4.75 mm","9.5 mm","4.75 mm",34,{"$f":"SUM(H3:H6)","v":100}]
["Hmac","1/2\"","5/8\"","1/2\"","12.5 mm","16.0 mm","12.5 mm"]
[null,"3/8\"","1/2\"","3/8\"","9.5 mm","12.5 mm","9.5 mm",13]
[null,"No. 4","3/8\"","No. 4","4.75 mm","9.5 mm","4.75 mm",50]
[null,"No. 8","No. 4","No. 8","2.36 mm","4.75 mm","2.36 mm",37,{"$f":"SUM(H7:H10)","v":100}]
["Surface Treatment","1/2\"","5/8\"","1/2\"","12.5 mm","16.0 mm","12.5 mm"]
[null,"3/8\"","1/2\"","3/8\"","9.5 mm","12.5 mm","9.5 mm",28]
[null,"No. 4","3/8\"","No. 4","4.75 mm","9.5 mm","4.75 mm",72]
[null,"No. 8","No. 4","No. 8","2.36 mm","4.75 mm","2.36 mm",null,{"$f":"SUM(H11:H14)","v":100}]