{"text_format":"1","workbook":"xlsx","n_sheets":4,"sheets":["Freeze-Thaw","Cycle History","RX","Sieves"],"not_rendered":{"charts":0,"images":1,"macros":1,"external_links":0,"defined_names":615,"comments":1,"pivot_tables":0},"unopened":[],"bounds":{"document_bytes":16777216,"sheet_cells":100000,"rows_first":2000,"rows_last":500,"rows_between":2000,"halvings":0,"cell_chars":16384,"cell_head_chars":4096},"cells_cut":0,"cells_raw":0,"read":"whole","date_system":"1900"}

{"sheet":"Freeze-Thaw","index":0,"n_rows":57,"n_cols":11,"rows_kept":57,"cut":false,"hidden":false,"merged":[[57,1,57,3],[24,1,25,2],[53,6,53,8],[51,2,51,4],[26,1,28,1],[26,2,28,2],[50,2,50,4],[24,3,28,3],[24,7,28,7],[24,4,28,4],[24,8,28,8],[24,5,28,5],[24,6,28,6],[53,1,53,3],[49,2,49,4],[47,2,47,4],[0,0,0,1],[12,3,12,4],[14,3,14,8],[7,7,7,8],[8,3,8,4],[10,7,10,8],[9,7,9,8],[7,3,7,4],[10,3,10,4],[9,3,9,4],[8,7,8,8],[11,7,11,8],[11,3,11,4],[13,3,13,4],[13,7,13,8],[12,7,12,8],[15,3,15,8],[16,7,16,8],[41,1,42,8],[16,3,16,4],[46,2,46,4],[44,1,44,8],[43,1,43,8]]}
["TxDOT Manuals >",null,null,"Tex-432-A"]
[null,"TEXAS DEPARTMENT OF TRANSPORTATION",null,null,null,null,null,null,null,null,529]
[null,null,null,null,null,null,null,null,null,null,3]
[null,null,null,null,null,null,null,null,null,null,"tx432.xlsm::45481.59463"]
[null,"COARSE AGGREGATE FREEZE-THAW"]
[null,"Tex-432-A "]
[null,null,null,null,null,null,null,null,{"$f":"\"File Version: \" & TEXT(MID(sn,SEARCH(\"::\",sn,1)+2,20),\"mm/dd/yy hh:mm:ss\")","v":"File Version: 07/08/24 14:16:16"}]
[null,null,"SAMPLE ID:",null,null,null,"SAMPLED DATE:"]
[null,null,"TEST NUMBER:",null,null,null,"LETTING DATE:"]
[null,null,"SAMPLE STATUS:",null,null,null,"CONTROLLING CSJ:"]
[null,null,"COUNTY:",null,null,null,"SPEC YEAR:"]
[null,null,"SAMPLED BY:",null,null,null,"SPEC ITEM:"]
[null,null,"SAMPLE LOCATION:",null,null,null,"SPECIAL PROVISION:"]
[null,null,"MATERIAL CODE:",null,null,null,"GRADE:"]
[null,null,"MATERIAL NAME:"]
[null,null,"PRODUCER:"]
[null,null,"AREA ENGINEER:",null,null,null,"PROJECT MANAGER:"]
[]
[null,null,"COURSE\\LIFT:",null,"STATION:",null,null,"DIST. FROM CL:"]
[]
[]
[]
[]
[]
[null,"Particle Size Range",null,"Initial Weight (g)","Final Weight (g)","Loss of Weight (g)","Percent Loss","Normalized Individual Percent Retained","Weighted Average Percent Loss"]
[]
[null,"Passing","Retained"]
[]
[]
[null,{"$f":"IF(ISERROR(IF(SpecYear=\"\",\"\",INDEX(INDIRECT(Grade),1,IF(SpecYear=\"1995\",4,2)))),\"\",IF(SpecYear=\"\",\"\",INDEX(INDIRECT(Grade),1,IF(SpecYear=\"1995\",4,2))))","v":""},{"$f":"IF(ISERROR(IF(SpecYear=\"\",\"\",INDEX(INDIRECT(Grade),1,IF(SpecYear=\"1995\",5,3)))),\"\",IF(SpecYear=\"\",\"\",INDEX(INDIRECT(Grade),1,IF(SpecYear=\"1995\",5,3))))","v":""},null,null,{"$f":"IF(COUNTBLANK($D$30:$E$37)=16,\"\",D30-E30)","v":""},{"$f":"IF(COUNTBLANK($D$30:$E$37)=16,\"\",IF(D30>0,+F30/D30,0))","v":""},{"$f":"IF(COUNTBLANK($D$30:$E$37)=16,\"\",IF(ISERROR(INDEX(INDIRECT(Grade),1,6)),\"\",INDEX(INDIRECT(Grade),1,6)))","v":""},{"$f":"IF(H30=\"\",\"\",H30*G30)","v":""}]
[null,{"$f":"IF(ISERROR(IF(SpecYear=\"\",\"\",INDEX(INDIRECT(Grade),2,IF(SpecYear=\"1995\",4,2)))),\"\",IF(SpecYear=\"\",\"\",INDEX(INDIRECT(Grade),2,IF(SpecYear=\"1995\",4,2))))","v":""},{"$f":"IF(ISERROR(IF(SpecYear=\"\",\"\",INDEX(INDIRECT(Grade),2,IF(SpecYear=\"1995\",5,3)))),\"\",IF(SpecYear=\"\",\"\",INDEX(INDIRECT(Grade),2,IF(SpecYear=\"1995\",5,3))))","v":""},null,null,{"$f":"IF(COUNTBLANK($D$30:$E$37)=16,\"\",D31-E31)","v":""},{"$f":"IF(COUNTBLANK($D$30:$E$37)=16,\"\",IF(D31>0,+F31/D31,0))","v":""},{"$f":"IF(COUNTBLANK($D$30:$E$37)=16,\"\",IF(ISERROR(INDEX(INDIRECT(Grade),2,6)),\"\",INDEX(INDIRECT(Grade),2,6)))","v":""},{"$f":"IF(H31=\"\",\"\",H31*G31)","v":""}]
[null,{"$f":"IF(ISERROR(IF(SpecYear=\"\",\"\",INDEX(INDIRECT(Grade),3,IF(SpecYear=\"1995\",4,2)))),\"\",IF(SpecYear=\"\",\"\",INDEX(INDIRECT(Grade),3,IF(SpecYear=\"1995\",4,2))))","v":""},{"$f":"IF(ISERROR(IF(SpecYear=\"\",\"\",INDEX(INDIRECT(Grade),3,IF(SpecYear=\"1995\",5,3)))),\"\",IF(SpecYear=\"\",\"\",INDEX(INDIRECT(Grade),3,IF(SpecYear=\"1995\",5,3))))","v":""},null,null,"","",{"$f":"IF(COUNTBLANK($D$30:$E$37)=16,\"\",IF(ISERROR(INDEX(INDIRECT(Grade),3,6)),\"\",INDEX(INDIRECT(Grade),3,6)))","v":""},""]
[null,{"$f":"IF(ISERROR(IF(SpecYear=\"\",\"\",INDEX(INDIRECT(Grade),4,IF(SpecYear=\"1995\",4,2)))),\"\",IF(SpecYear=\"\",\"\",INDEX(INDIRECT(Grade),4,IF(SpecYear=\"1995\",4,2))))","v":""},{"$f":"IF(ISERROR(IF(SpecYear=\"\",\"\",INDEX(INDIRECT(Grade),4,IF(SpecYear=\"1995\",5,3)))),\"\",IF(SpecYear=\"\",\"\",INDEX(INDIRECT(Grade),4,IF(SpecYear=\"1995\",5,3))))","v":""},null,null,"","",{"$f":"IF(COUNTBLANK($D$30:$E$37)=16,\"\",IF(ISERROR(INDEX(INDIRECT(Grade),4,6)),\"\",INDEX(INDIRECT(Grade),4,6)))","v":""},""]
[null,{"$f":"IF(ISERROR(IF(SpecYear=\"\",\"\",INDEX(INDIRECT(Grade),5,IF(SpecYear=\"1995\",4,2)))),\"\",IF(SpecYear=\"\",\"\",INDEX(INDIRECT(Grade),5,IF(SpecYear=\"1995\",4,2))))","v":""},{"$f":"IF(ISERROR(IF(SpecYear=\"\",\"\",INDEX(INDIRECT(Grade),5,IF(SpecYear=\"1995\",5,3)))),\"\",IF(SpecYear=\"\",\"\",INDEX(INDIRECT(Grade),5,IF(SpecYear=\"1995\",5,3))))","v":""},null,null,"","",{"$f":"IF(COUNTBLANK($D$30:$E$37)=16,\"\",IF(ISERROR(INDEX(INDIRECT(Grade),5,6)),\"\",INDEX(INDIRECT(Grade),5,6)))","v":""},""]
[null,{"$f":"IF(ISERROR(IF(SpecYear=\"\",\"\",INDEX(INDIRECT(Grade),6,IF(SpecYear=\"1995\",4,2)))),\"\",IF(SpecYear=\"\",\"\",INDEX(INDIRECT(Grade),6,IF(SpecYear=\"1995\",4,2))))","v":""},{"$f":"IF(ISERROR(IF(SpecYear=\"\",\"\",INDEX(INDIRECT(Grade),6,IF(SpecYear=\"1995\",5,3)))),\"\",IF(SpecYear=\"\",\"\",INDEX(INDIRECT(Grade),6,IF(SpecYear=\"1995\",5,3))))","v":""},null,null,"","",{"$f":"IF(COUNTBLANK($D$30:$E$37)=16,\"\",IF(ISERROR(INDEX(INDIRECT(Grade),6,6)),\"\",INDEX(INDIRECT(Grade),6,6)))","v":""},""]
[null,{"$f":"IF(ISERROR(IF(SpecYear=\"\",\"\",INDEX(INDIRECT(Grade),7,IF(SpecYear=\"1995\",4,2)))),\"\",IF(SpecYear=\"\",\"\",INDEX(INDIRECT(Grade),7,IF(SpecYear=\"1995\",4,2))))","v":""},{"$f":"IF(ISERROR(IF(SpecYear=\"\",\"\",INDEX(INDIRECT(Grade),7,IF(SpecYear=\"1995\",5,3)))),\"\",IF(SpecYear=\"\",\"\",INDEX(INDIRECT(Grade),7,IF(SpecYear=\"1995\",5,3))))","v":""},null,null,"","",{"$f":"IF(COUNTBLANK($D$30:$E$37)=16,\"\",IF(ISERROR(INDEX(INDIRECT(Grade),7,6)),\"\",INDEX(INDIRECT(Grade),7,6)))","v":""},""]
[null,{"$f":"IF(ISERROR(IF(SpecYear=\"\",\"\",INDEX(INDIRECT(Grade),8,IF(SpecYear=\"1995\",4,2)))),\"\",IF(SpecYear=\"\",\"\",INDEX(INDIRECT(Grade),8,IF(SpecYear=\"1995\",4,2))))","v":""},{"$f":"IF(ISERROR(IF(SpecYear=\"\",\"\",INDEX(INDIRECT(Grade),8,IF(SpecYear=\"1995\",5,3)))),\"\",IF(SpecYear=\"\",\"\",INDEX(INDIRECT(Grade),8,IF(SpecYear=\"1995\",5,3))))","v":""},null,null,"","",{"$f":"IF(COUNTBLANK($D$30:$E$37)=16,\"\",IF(ISERROR(INDEX(INDIRECT(Grade),8,6)),\"\",INDEX(INDIRECT(Grade),8,6)))","v":""},""]
[null,null,null,null,null,"Total:",{"$f":"IF(COUNTBLANK(D30:E37)=16,\"\",SUM(G30:G37))","v":""},{"$f":"IF(COUNTBLANK($D$30:$E$37)=16,\"\",SUM(H30:H37))","v":""},""]
[]
[null,null,null,null,"Freeze-Thaw Loss:",{"$f":"$I$38","v":""}]
[null,"Remarks:",{"$f":"NOW()","v":"2024-07-08T14:16:16.320"}]
[]
[]
[]
[]
[]
[null,"Sample Method:","Sampled By:",null,null,"Sampled Date:"]
[null,"TX221"]
[]
[null,"TX400"]
[null,"Test Method:","Tested By:",null,null,"Tested Date:"]
[null,"TX432"]
[null,"Test Stamp Code:",null,null,"Omit Test:","Completed Date:","Reviewed By:"]
[]
[null,"Locked By:","TxDOT:","District:","Area:"]
[]
[null,"Authorized By:",null,null,"Authorized Date:"]

{"sheet":"Cycle History","index":1,"n_rows":153,"n_cols":8,"rows_kept":153,"cut":false,"hidden":false,"merged":[[2,2,2,3],[15,1,17,1],[13,2,13,3],[14,2,14,3],[15,2,15,3],[16,2,16,3],[17,2,17,3],[6,7,8,8],[18,1,20,1],[19,2,19,3],[20,2,20,3],[21,2,21,3],[30,2,30,3],[31,2,31,3],[32,2,32,3],[33,2,33,3],[26,2,26,3],[27,2,27,3],[28,2,28,3],[57,1,59,1],[36,1,38,1],[39,1,41,1],[42,1,44,1],[45,1,47,1],[24,1,26,1],[27,1,29,1],[30,1,32,1],[33,1,35,1],[54,1,56,1],[46,2,46,3],[47,2,47,3],[48,2,48,3],[49,2,49,3],[42,2,42,3],[43,2,43,3],[147,1,149,1],[150,1,152,1],[3,2,3,3],[4,2,4,3],[5,2,5,3],[6,2,6,3],[7,2,7,3],[8,2,8,3],[9,2,9,3],[132,1,134,1],[135,1,137,1],[138,1,140,1],[141,1,143,1],[120,1,122,1],[123,1,125,1],[126,1,128,1],[129,1,131,1],[108,1,110,1],[111,1,113,1],[114,1,116,1],[117,1,119,1],[96,1,98,1],[99,1,101,1],[102,1,104,1],[144,1,146,1],[105,1,107,1],[84,1,86,1],[87,1,89,1],[90,1,92,1],[93,1,95,1],[72,1,74,1],[75,1,77,1],[78,1,80,1],[81,1,83,1],[60,1,62,1],[63,1,65,1],[66,1,68,1],[69,1,71,1],[48,1,50,1],[51,1,53,1],[34,2,34,3],[35,2,35,3],[36,2,36,3],[37,2,37,3],[58,2,58,3],[59,2,59,3],[60,2,60,3],[61,2,61,3],[54,2,54,3],[55,2,55,3],[56,2,56,3],[57,2,57,3],[50,2,50,3],[51,2,51,3],[52,2,52,3],[53,2,53,3],[70,2,70,3],[71,2,71,3],[44,2,44,3],[45,2,45,3],[38,2,38,3],[39,2,39,3],[40,2,40,3],[41,2,41,3],[72,2,72,3],[73,2,73,3],[66,2,66,3],[67,2,67,3],[68,2,68,3],[69,2,69,3],[62,2,62,3],[63,2,63,3],[64,2,64,3],[65,2,65,3],[82,2,82,3],[83,2,83,3],[84,2,84,3],[85,2,85,3],[78,2,78,3],[79,2,79,3],[80,2,80,3],[81,2,81,3],[74,2,74,3],[75,2,75,3],[76,2,76,3],[77,2,77,3],[94,2,94,3],[95,2,95,3],[96,2,96,3],[97,2,97,3],[90,2,90,3],[91,2,91,3],[92,2,92,3],[93,2,93,3],[86,2,86,3],[87,2,87,3],[88,2,88,3],[89,2,89,3],[109,2,109,3],[102,2,102,3],[103,2,103,3],[104,2,104,3],[105,2,105,3],[98,2,98,3],[99,2,99,3],[100,2,100,3],[101,2,101,3],[152,2,152,3],[146,2,146,3],[147,2,147,3],[148,2,148,3],[149,2,149,3],[140,2,140,3],[141,2,141,3],[150,2,150,3],[134,2,134,3],[135,2,135,3],[136,2,136,3],[137,2,137,3],[151,2,151,3],[142,2,142,3],[143,2,143,3],[144,2,144,3],[145,2,145,3],[138,2,138,3],[139,2,139,3],[122,2,122,3],[123,2,123,3],[124,2,124,3],[125,2,125,3],[117,7,119,8],[96,7,98,8],[99,7,101,8],[102,7,104,8],[105,7,107,8],[118,2,118,3],[119,2,119,3],[120,2,120,3],[121,2,121,3],[114,2,114,3],[115,2,115,3],[116,2,116,3],[117,2,117,3],[110,2,110,3],[111,2,111,3],[112,2,112,3],[113,2,113,3],[106,2,106,3],[107,2,107,3],[108,2,108,3],[130,2,130,3],[131,2,131,3],[132,2,132,3],[133,2,133,3],[126,2,126,3],[127,2,127,3],[128,2,128,3],[129,2,129,3],[30,7,32,8],[33,7,35,8],[60,7,62,8],[63,7,65,8],[66,7,68,8],[69,7,71,8],[48,7,50,8],[51,7,53,8],[54,7,56,8],[57,7,59,8],[36,7,38,8],[39,7,41,8],[42,7,44,8],[45,7,47,8],[87,7,89,8],[90,7,92,8],[93,7,95,8],[72,7,74,8],[75,7,77,8],[78,7,80,8],[81,7,83,8],[147,7,149,8],[150,7,152,8],[144,7,146,8],[132,7,134,8],[135,7,137,8],[138,7,140,8],[141,7,143,8],[120,7,122,8],[123,7,125,8],[126,7,128,8],[129,7,131,8],[108,7,110,8],[111,7,113,8],[114,7,116,8],[84,7,86,8],[0,1,1,8],[18,7,20,8],[21,7,23,8],[24,7,26,8],[27,7,29,8],[2,7,2,8],[3,7,5,8],[9,7,11,8],[12,7,14,8],[15,7,17,8],[29,2,29,3],[21,1,23,1],[3,1,5,1],[6,1,8,1],[9,1,11,1],[12,1,14,1],[10,2,10,3],[11,2,11,3],[12,2,12,3],[22,2,22,3],[23,2,23,3],[24,2,24,3],[25,2,25,3],[18,2,18,3]]}
[null,"CYCLE HISTORY"]
[]
[null,"CYCLE","PHASE",null,"DATE","TIME IN","TIME OUT","REMARKS"]
[null,1,"In Freezing chamber"]
[null,null,"Out Freezing chamber"]
[null,null,"Thawed"]
[null,{"$f":"$B4+1","v":2},"In Freezing chamber"]
[null,null,"Out Freezing chamber"]
[null,null,"Thawed"]
[null,{"$f":"$B7+1","v":3},"In Freezing chamber"]
[null,null,"Out Freezing chamber"]
[null,null,"Thawed"]
[null,{"$f":"$B10+1","v":4},"In Freezing chamber"]
[null,null,"Out Freezing chamber"]
[null,null,"Thawed"]
[null,{"$f":"$B13+1","v":5},"In Freezing chamber"]
[null,null,"Out Freezing chamber"]
[null,null,"Thawed"]
[null,{"$f":"$B16+1","v":6},"In Freezing chamber"]
[null,null,"Out Freezing chamber"]
[null,null,"Thawed"]
[null,{"$f":"$B19+1","v":7},"In Freezing chamber"]
[null,null,"Out Freezing chamber"]
[null,null,"Thawed"]
[null,{"$f":"$B22+1","v":8},"In Freezing chamber"]
[null,null,"Out Freezing chamber"]
[null,null,"Thawed"]
[null,{"$f":"$B25+1","v":9},"In Freezing chamber"]
[null,null,"Out Freezing chamber"]
[null,null,"Thawed"]
[null,{"$f":"$B28+1","v":10},"In Freezing chamber"]
[null,null,"Out Freezing chamber"]
[null,null,"Thawed"]
[null,{"$f":"$B31+1","v":11},"In Freezing chamber"]
[null,null,"Out Freezing chamber"]
[null,null,"Thawed"]
[null,{"$f":"$B34+1","v":12},"In Freezing chamber"]
[null,null,"Out Freezing chamber"]
[null,null,"Thawed"]
[null,{"$f":"$B37+1","v":13},"In Freezing chamber"]
[null,null,"Out Freezing chamber"]
[null,null,"Thawed"]
[null,{"$f":"$B40+1","v":14},"In Freezing chamber"]
[null,null,"Out Freezing chamber"]
[null,null,"Thawed"]
[null,{"$f":"$B43+1","v":15},"In Freezing chamber"]
[null,null,"Out Freezing chamber"]
[null,null,"Thawed"]
[null,{"$f":"$B46+1","v":16},"In Freezing chamber"]
[null,null,"Out Freezing chamber"]
[null,null,"Thawed"]
[null,{"$f":"$B49+1","v":17},"In Freezing chamber"]
[null,null,"Out Freezing chamber"]
[null,null,"Thawed"]
[null,{"$f":"$B52+1","v":18},"In Freezing chamber"]
[null,null,"Out Freezing chamber"]
[null,null,"Thawed"]
[null,{"$f":"$B55+1","v":19},"In Freezing chamber"]
[null,null,"Out Freezing chamber"]
[null,null,"Thawed"]
[null,{"$f":"$B58+1","v":20},"In Freezing chamber"]
[null,null,"Out Freezing chamber"]
[null,null,"Thawed"]
[null,{"$f":"$B61+1","v":21},"In Freezing chamber"]
[null,null,"Out Freezing chamber"]
[null,null,"Thawed"]
[null,{"$f":"$B64+1","v":22},"In Freezing chamber"]
[null,null,"Out Freezing chamber"]
[null,null,"Thawed"]
[null,{"$f":"$B67+1","v":23},"In Freezing chamber"]
[null,null,"Out Freezing chamber"]
[null,null,"Thawed"]
[null,{"$f":"$B70+1","v":24},"In Freezing chamber"]
[null,null,"Out Freezing chamber"]
[null,null,"Thawed"]
[null,{"$f":"$B73+1","v":25},"In Freezing chamber"]
[null,null,"Out Freezing chamber"]
[null,null,"Thawed"]
[null,{"$f":"$B76+1","v":26},"In Freezing chamber"]
[null,null,"Out Freezing chamber"]
[null,null,"Thawed"]
[null,{"$f":"$B79+1","v":27},"In Freezing chamber"]
[null,null,"Out Freezing chamber"]
[null,null,"Thawed"]
[null,{"$f":"$B82+1","v":28},"In Freezing chamber"]
[null,null,"Out Freezing chamber"]
[null,null,"Thawed"]
[null,{"$f":"$B85+1","v":29},"In Freezing chamber"]
[null,null,"Out Freezing chamber"]
[null,null,"Thawed"]
[null,{"$f":"$B88+1","v":30},"In Freezing chamber"]
[null,null,"Out Freezing chamber"]
[null,null,"Thawed"]
[null,{"$f":"$B91+1","v":31},"In Freezing chamber"]
[null,null,"Out Freezing chamber"]
[null,null,"Thawed"]
[null,{"$f":"$B94+1","v":32},"In Freezing chamber"]
[null,null,"Out Freezing chamber"]
[null,null,"Thawed"]
[null,{"$f":"$B97+1","v":33},"In Freezing chamber"]
[null,null,"Out Freezing chamber"]
[null,null,"Thawed"]
[null,{"$f":"$B100+1","v":34},"In Freezing chamber"]
[null,null,"Out Freezing chamber"]
[null,null,"Thawed"]
[null,{"$f":"$B103+1","v":35},"In Freezing chamber"]
[null,null,"Out Freezing chamber"]
[null,null,"Thawed"]
[null,{"$f":"$B106+1","v":36},"In Freezing chamber"]
[null,null,"Out Freezing chamber"]
[null,null,"Thawed"]
[null,{"$f":"$B109+1","v":37},"In Freezing chamber"]
[null,null,"Out Freezing chamber"]
[null,null,"Thawed"]
[null,{"$f":"$B112+1","v":38},"In Freezing chamber"]
[null,null,"Out Freezing chamber"]
[null,null,"Thawed"]
[null,{"$f":"$B115+1","v":39},"In Freezing chamber"]
[null,null,"Out Freezing chamber"]
[null,null,"Thawed"]
[null,{"$f":"$B118+1","v":40},"In Freezing chamber"]
[null,null,"Out Freezing chamber"]
[null,null,"Thawed"]
[null,{"$f":"$B121+1","v":41},"In Freezing chamber"]
[null,null,"Out Freezing chamber"]
[null,null,"Thawed"]
[null,{"$f":"$B124+1","v":42},"In Freezing chamber"]
[null,null,"Out Freezing chamber"]
[null,null,"Thawed"]
[null,{"$f":"$B127+1","v":43},"In Freezing chamber"]
[null,null,"Out Freezing chamber"]
[null,null,"Thawed"]
[null,{"$f":"$B130+1","v":44},"In Freezing chamber"]
[null,null,"Out Freezing chamber"]
[null,null,"Thawed"]
[null,{"$f":"$B133+1","v":45},"In Freezing chamber"]
[null,null,"Out Freezing chamber"]
[null,null,"Thawed"]
[null,{"$f":"$B136+1","v":46},"In Freezing chamber"]
[null,null,"Out Freezing chamber"]
[null,null,"Thawed"]
[null,{"$f":"$B139+1","v":47},"In Freezing chamber"]
[null,null,"Out Freezing chamber"]
[null,null,"Thawed"]
[null,{"$f":"$B142+1","v":48},"In Freezing chamber"]
[null,null,"Out Freezing chamber"]
[null,null,"Thawed"]
[null,{"$f":"$B145+1","v":49},"In Freezing chamber"]
[null,null,"Out Freezing chamber"]
[null,null,"Thawed"]
[null,{"$f":"$B148+1","v":50},"In Freezing chamber"]
[null,null,"Out Freezing chamber"]
[null,null,"Thawed"]

{"sheet":"RX","index":2,"n_rows":562,"n_cols":9,"rows_kept":562,"cut":false,"hidden":true,"merged":[]}
[560]
["Fld_nbr","Value","Desc_1","Desc_2","Desc_3","Desc_4","Desc_5","Desc_6","Desc_7"]
[1,{"$f":"IF('Freeze-Thaw'!$B$42=\"\",\"\",'Freeze-Thaw'!$B$42)","v":""},{"$f":"'Freeze-Thaw'!$B$41","v":"Remarks:"}]
[2,{"$f":"IF('Freeze-Thaw'!$D$19=\"\",\"\",'Freeze-Thaw'!$D$19)","v":""},{"$f":"IF('Freeze-Thaw'!$C$19=\"\",\"\",'Freeze-Thaw'!$C$19)","v":"COURSE\\LIFT:"}]
[3,{"$f":"IF('Freeze-Thaw'!$C$52=\"\",\"\",'Freeze-Thaw'!$C$52)","v":""},"Tested By ",{"$f":"IF('Freeze-Thaw'!$B$52=\"\",\"\",'Freeze-Thaw'!$B$52)","v":"TX432"}]
[4,{"$f":"IF('Freeze-Thaw'!$F$52=\"\",\"\",'Freeze-Thaw'!$F$52)","v":""},"Tested Date ",{"$f":"IF('Freeze-Thaw'!$B$52=\"\",\"\",'Freeze-Thaw'!$B$52)","v":"TX432"}]
[5,{"$f":"IF('Freeze-Thaw'!$D$30=\"\",\"\",'Freeze-Thaw'!$D$30)","v":""},{"$f":"IF('Freeze-Thaw'!$B$6=\"\",\"\",'Freeze-Thaw'!$B$6)","v":"Tex-432-A "},{"$f":"IF('Freeze-Thaw'!$B$27=\"\",\"\",'Freeze-Thaw'!$B$27)","v":"Passing"},{"$f":"IF('Freeze-Thaw'!$B$30=\"\",\"\",'Freeze-Thaw'!$B$30)","v":""},{"$f":"IF('Freeze-Thaw'!$B$25=\"\",\"\",'Freeze-Thaw'!$B$25)","v":"Particle Size Range"},{"$f":"IF('Freeze-Thaw'!$C$27=\"\",\"\",'Freeze-Thaw'!$C$27)","v":"Retained"},{"$f":"IF('Freeze-Thaw'!$C$30=\"\",\"\",'Freeze-Thaw'!$C$30)","v":""},{"$f":"IF('Freeze-Thaw'!$D$25=\"\",\"\",'Freeze-Thaw'!$D$25)","v":"Initial Weight (g)"}]
[6,{"$f":"IF('Freeze-Thaw'!$E$30=\"\",\"\",'Freeze-Thaw'!$E$30)","v":""},{"$f":"IF('Freeze-Thaw'!$B$6=\"\",\"\",'Freeze-Thaw'!$B$6)","v":"Tex-432-A "},{"$f":"IF('Freeze-Thaw'!$B$27=\"\",\"\",'Freeze-Thaw'!$B$27)","v":"Passing"},{"$f":"IF('Freeze-Thaw'!$B$30=\"\",\"\",'Freeze-Thaw'!$B$30)","v":""},{"$f":"IF('Freeze-Thaw'!$B$25=\"\",\"\",'Freeze-Thaw'!$B$25)","v":"Particle Size Range"},{"$f":"IF('Freeze-Thaw'!$C$27=\"\",\"\",'Freeze-Thaw'!$C$27)","v":"Retained"},{"$f":"IF('Freeze-Thaw'!$C$30=\"\",\"\",'Freeze-Thaw'!$C$30)","v":""},{"$f":"IF('Freeze-Thaw'!$E$25=\"\",\"\",'Freeze-Thaw'!$E$25)","v":"Final Weight (g)"}]
[7,{"$f":"IF('Freeze-Thaw'!$F$30=\"\",\"\",'Freeze-Thaw'!$F$30)","v":""},{"$f":"IF('Freeze-Thaw'!$B$6=\"\",\"\",'Freeze-Thaw'!$B$6)","v":"Tex-432-A "},{"$f":"IF('Freeze-Thaw'!$B$27=\"\",\"\",'Freeze-Thaw'!$B$27)","v":"Passing"},{"$f":"IF('Freeze-Thaw'!$B$30=\"\",\"\",'Freeze-Thaw'!$B$30)","v":""},{"$f":"IF('Freeze-Thaw'!$B$25=\"\",\"\",'Freeze-Thaw'!$B$25)","v":"Particle Size Range"},{"$f":"IF('Freeze-Thaw'!$C$27=\"\",\"\",'Freeze-Thaw'!$C$27)","v":"Retained"},{"$f":"IF('Freeze-Thaw'!$C$30=\"\",\"\",'Freeze-Thaw'!$C$30)","v":""},{"$f":"IF('Freeze-Thaw'!$F$25=\"\",\"\",'Freeze-Thaw'!$F$25)","v":"Loss of Weight (g)"}]
[8,{"$f":"IF('Freeze-Thaw'!$G$30=\"\",\"\",'Freeze-Thaw'!$G$30)","v":""},{"$f":"IF('Freeze-Thaw'!$B$6=\"\",\"\",'Freeze-Thaw'!$B$6)","v":"Tex-432-A "},{"$f":"IF('Freeze-Thaw'!$B$27=\"\",\"\",'Freeze-Thaw'!$B$27)","v":"Passing"},{"$f":"IF('Freeze-Thaw'!$B$30=\"\",\"\",'Freeze-Thaw'!$B$30)","v":""},{"$f":"IF('Freeze-Thaw'!$B$25=\"\",\"\",'Freeze-Thaw'!$B$25)","v":"Particle Size Range"},{"$f":"IF('Freeze-Thaw'!$C$27=\"\",\"\",'Freeze-Thaw'!$C$27)","v":"Retained"},{"$f":"IF('Freeze-Thaw'!$C$30=\"\",\"\",'Freeze-Thaw'!$C$30)","v":""},{"$f":"IF('Freeze-Thaw'!$G$25=\"\",\"\",'Freeze-Thaw'!$G$25)","v":"Percent Loss"}]
[9,{"$f":"IF('Freeze-Thaw'!$H$30=\"\",\"\",'Freeze-Thaw'!$H$30)","v":""},{"$f":"IF('Freeze-Thaw'!$B$6=\"\",\"\",'Freeze-Thaw'!$B$6)","v":"Tex-432-A "},{"$f":"IF('Freeze-Thaw'!$B$27=\"\",\"\",'Freeze-Thaw'!$B$27)","v":"Passing"},{"$f":"IF('Freeze-Thaw'!$B$30=\"\",\"\",'Freeze-Thaw'!$B$30)","v":""},{"$f":"IF('Freeze-Thaw'!$B$25=\"\",\"\",'Freeze-Thaw'!$B$25)","v":"Particle Size Range"},{"$f":"IF('Freeze-Thaw'!$C$27=\"\",\"\",'Freeze-Thaw'!$C$27)","v":"Retained"},{"$f":"IF('Freeze-Thaw'!$C$30=\"\",\"\",'Freeze-Thaw'!$C$30)","v":""},{"$f":"IF('Freeze-Thaw'!$H$25=\"\",\"\",'Freeze-Thaw'!$H$25)","v":"Normalized Individual Percent Retained"}]
[10,{"$f":"IF('Freeze-Thaw'!$I$30=\"\",\"\",'Freeze-Thaw'!$I$30)","v":""},{"$f":"IF('Freeze-Thaw'!$B$6=\"\",\"\",'Freeze-Thaw'!$B$6)","v":"Tex-432-A "},{"$f":"IF('Freeze-Thaw'!$B$27=\"\",\"\",'Freeze-Thaw'!$B$27)","v":"Passing"},{"$f":"IF('Freeze-Thaw'!$B$30=\"\",\"\",'Freeze-Thaw'!$B$30)","v":""},{"$f":"IF('Freeze-Thaw'!$B$25=\"\",\"\",'Freeze-Thaw'!$B$25)","v":"Particle Size Range"},{"$f":"IF('Freeze-Thaw'!$C$27=\"\",\"\",'Freeze-Thaw'!$C$27)","v":"Retained"},{"$f":"IF('Freeze-Thaw'!$C$30=\"\",\"\",'Freeze-Thaw'!$C$30)","v":""},{"$f":"IF('Freeze-Thaw'!$I$25=\"\",\"\",'Freeze-Thaw'!$I$25)","v":"Weighted Average Percent Loss"}]
[11,{"$f":"IF('Freeze-Thaw'!$D$31=\"\",\"\",'Freeze-Thaw'!$D$31)","v":""},{"$f":"IF('Freeze-Thaw'!$B$6=\"\",\"\",'Freeze-Thaw'!$B$6)","v":"Tex-432-A "},{"$f":"IF('Freeze-Thaw'!$B$27=\"\",\"\",'Freeze-Thaw'!$B$27)","v":"Passing"},{"$f":"IF('Freeze-Thaw'!$B$31=\"\",\"\",'Freeze-Thaw'!$B$31)","v":""},{"$f":"IF('Freeze-Thaw'!$B$25=\"\",\"\",'Freeze-Thaw'!$B$25)","v":"Particle Size Range"},{"$f":"IF('Freeze-Thaw'!$C$27=\"\",\"\",'Freeze-Thaw'!$C$27)","v":"Retained"},{"$f":"IF('Freeze-Thaw'!$C$31=\"\",\"\",'Freeze-Thaw'!$C$31)","v":""},{"$f":"IF('Freeze-Thaw'!$D$25=\"\",\"\",'Freeze-Thaw'!$D$25)","v":"Initial Weight (g)"}]
[12,{"$f":"IF('Freeze-Thaw'!$E$31=\"\",\"\",'Freeze-Thaw'!$E$31)","v":""},{"$f":"IF('Freeze-Thaw'!$B$6=\"\",\"\",'Freeze-Thaw'!$B$6)","v":"Tex-432-A "},{"$f":"IF('Freeze-Thaw'!$B$27=\"\",\"\",'Freeze-Thaw'!$B$27)","v":"Passing"},{"$f":"IF('Freeze-Thaw'!$B$31=\"\",\"\",'Freeze-Thaw'!$B$31)","v":""},{"$f":"IF('Freeze-Thaw'!$B$25=\"\",\"\",'Freeze-Thaw'!$B$25)","v":"Particle Size Range"},{"$f":"IF('Freeze-Thaw'!$C$27=\"\",\"\",'Freeze-Thaw'!$C$27)","v":"Retained"},{"$f":"IF('Freeze-Thaw'!$C$31=\"\",\"\",'Freeze-Thaw'!$C$31)","v":""},{"$f":"IF('Freeze-Thaw'!$E$25=\"\",\"\",'Freeze-Thaw'!$E$25)","v":"Final Weight (g)"}]
[13,{"$f":"IF('Freeze-Thaw'!$F$31=\"\",\"\",'Freeze-Thaw'!$F$31)","v":""},{"$f":"IF('Freeze-Thaw'!$B$6=\"\",\"\",'Freeze-Thaw'!$B$6)","v":"Tex-432-A "},{"$f":"IF('Freeze-Thaw'!$B$27=\"\",\"\",'Freeze-Thaw'!$B$27)","v":"Passing"},{"$f":"IF('Freeze-Thaw'!$B$31=\"\",\"\",'Freeze-Thaw'!$B$31)","v":""},{"$f":"IF('Freeze-Thaw'!$B$25=\"\",\"\",'Freeze-Thaw'!$B$25)","v":"Particle Size Range"},{"$f":"IF('Freeze-Thaw'!$C$27=\"\",\"\",'Freeze-Thaw'!$C$27)","v":"Retained"},{"$f":"IF('Freeze-Thaw'!$C$31=\"\",\"\",'Freeze-Thaw'!$C$31)","v":""},{"$f":"IF('Freeze-Thaw'!$F$25=\"\",\"\",'Freeze-Thaw'!$F$25)","v":"Loss of Weight (g)"}]
[14,{"$f":"IF('Freeze-Thaw'!$G$31=\"\",\"\",'Freeze-Thaw'!$G$31)","v":""},{"$f":"IF('Freeze-Thaw'!$B$6=\"\",\"\",'Freeze-Thaw'!$B$6)","v":"Tex-432-A "},{"$f":"IF('Freeze-Thaw'!$B$27=\"\",\"\",'Freeze-Thaw'!$B$27)","v":"Passing"},{"$f":"IF('Freeze-Thaw'!$B$31=\"\",\"\",'Freeze-Thaw'!$B$31)","v":""},{"$f":"IF('Freeze-Thaw'!$B$25=\"\",\"\",'Freeze-Thaw'!$B$25)","v":"Particle Size Range"},{"$f":"IF('Freeze-Thaw'!$C$27=\"\",\"\",'Freeze-Thaw'!$C$27)","v":"Retained"},{"$f":"IF('Freeze-Thaw'!$C$31=\"\",\"\",'Freeze-Thaw'!$C$31)","v":""},{"$f":"IF('Freeze-Thaw'!$G$25=\"\",\"\",'Freeze-Thaw'!$G$25)","v":"Percent Loss"}]
[15,{"$f":"IF('Freeze-Thaw'!$H$31=\"\",\"\",'Freeze-Thaw'!$H$31)","v":""},{"$f":"IF('Freeze-Thaw'!$B$6=\"\",\"\",'Freeze-Thaw'!$B$6)","v":"Tex-432-A "},{"$f":"IF('Freeze-Thaw'!$B$27=\"\",\"\",'Freeze-Thaw'!$B$27)","v":"Passing"},{"$f":"IF('Freeze-Thaw'!$B$31=\"\",\"\",'Freeze-Thaw'!$B$31)","v":""},{"$f":"IF('Freeze-Thaw'!$B$25=\"\",\"\",'Freeze-Thaw'!$B$25)","v":"Particle Size Range"},{"$f":"IF('Freeze-Thaw'!$C$27=\"\",\"\",'Freeze-Thaw'!$C$27)","v":"Retained"},{"$f":"IF('Freeze-Thaw'!$C$31=\"\",\"\",'Freeze-Thaw'!$C$31)","v":""},{"$f":"IF('Freeze-Thaw'!$H$25=\"\",\"\",'Freeze-Thaw'!$H$25)","v":"Normalized Individual Percent Retained"}]
[16,{"$f":"IF('Freeze-Thaw'!$I$31=\"\",\"\",'Freeze-Thaw'!$I$31)","v":""},{"$f":"IF('Freeze-Thaw'!$B$6=\"\",\"\",'Freeze-Thaw'!$B$6)","v":"Tex-432-A "},{"$f":"IF('Freeze-Thaw'!$B$27=\"\",\"\",'Freeze-Thaw'!$B$27)","v":"Passing"},{"$f":"IF('Freeze-Thaw'!$B$31=\"\",\"\",'Freeze-Thaw'!$B$31)","v":""},{"$f":"IF('Freeze-Thaw'!$B$25=\"\",\"\",'Freeze-Thaw'!$B$25)","v":"Particle Size Range"},{"$f":"IF('Freeze-Thaw'!$C$27=\"\",\"\",'Freeze-Thaw'!$C$27)","v":"Retained"},{"$f":"IF('Freeze-Thaw'!$C$31=\"\",\"\",'Freeze-Thaw'!$C$31)","v":""},{"$f":"IF('Freeze-Thaw'!$I$25=\"\",\"\",'Freeze-Thaw'!$I$25)","v":"Weighted Average Percent Loss"}]
[17,{"$f":"IF('Freeze-Thaw'!$D$32=\"\",\"\",'Freeze-Thaw'!$D$32)","v":""},{"$f":"IF('Freeze-Thaw'!$B$6=\"\",\"\",'Freeze-Thaw'!$B$6)","v":"Tex-432-A "},{"$f":"IF('Freeze-Thaw'!$B$27=\"\",\"\",'Freeze-Thaw'!$B$27)","v":"Passing"},{"$f":"IF('Freeze-Thaw'!$B$32=\"\",\"\",'Freeze-Thaw'!$B$32)","v":""},{"$f":"IF('Freeze-Thaw'!$B$25=\"\",\"\",'Freeze-Thaw'!$B$25)","v":"Particle Size Range"},{"$f":"IF('Freeze-Thaw'!$C$27=\"\",\"\",'Freeze-Thaw'!$C$27)","v":"Retained"},{"$f":"IF('Freeze-Thaw'!$C$32=\"\",\"\",'Freeze-Thaw'!$C$32)","v":""},{"$f":"IF('Freeze-Thaw'!$D$25=\"\",\"\",'Freeze-Thaw'!$D$25)","v":"Initial Weight (g)"}]
[18,{"$f":"IF('Freeze-Thaw'!$E$32=\"\",\"\",'Freeze-Thaw'!$E$32)","v":""},{"$f":"IF('Freeze-Thaw'!$B$6=\"\",\"\",'Freeze-Thaw'!$B$6)","v":"Tex-432-A "},{"$f":"IF('Freeze-Thaw'!$B$27=\"\",\"\",'Freeze-Thaw'!$B$27)","v":"Passing"},{"$f":"IF('Freeze-Thaw'!$B$32=\"\",\"\",'Freeze-Thaw'!$B$32)","v":""},{"$f":"IF('Freeze-Thaw'!$B$25=\"\",\"\",'Freeze-Thaw'!$B$25)","v":"Particle Size Range"},{"$f":"IF('Freeze-Thaw'!$C$27=\"\",\"\",'Freeze-Thaw'!$C$27)","v":"Retained"},{"$f":"IF('Freeze-Thaw'!$C$32=\"\",\"\",'Freeze-Thaw'!$C$32)","v":""},{"$f":"IF('Freeze-Thaw'!$E$25=\"\",\"\",'Freeze-Thaw'!$E$25)","v":"Final Weight (g)"}]
[19,{"$f":"IF('Freeze-Thaw'!$F$32=\"\",\"\",'Freeze-Thaw'!$F$32)","v":""},{"$f":"IF('Freeze-Thaw'!$B$6=\"\",\"\",'Freeze-Thaw'!$B$6)","v":"Tex-432-A "},{"$f":"IF('Freeze-Thaw'!$B$27=\"\",\"\",'Freeze-Thaw'!$B$27)","v":"Passing"},{"$f":"IF('Freeze-Thaw'!$B$32=\"\",\"\",'Freeze-Thaw'!$B$32)","v":""},{"$f":"IF('Freeze-Thaw'!$B$25=\"\",\"\",'Freeze-Thaw'!$B$25)","v":"Particle Size Range"},{"$f":"IF('Freeze-Thaw'!$C$27=\"\",\"\",'Freeze-Thaw'!$C$27)","v":"Retained"},{"$f":"IF('Freeze-Thaw'!$C$32=\"\",\"\",'Freeze-Thaw'!$C$32)","v":""},{"$f":"IF('Freeze-Thaw'!$F$25=\"\",\"\",'Freeze-Thaw'!$F$25)","v":"Loss of Weight (g)"}]
[20,{"$f":"IF('Freeze-Thaw'!$G$32=\"\",\"\",'Freeze-Thaw'!$G$32)","v":""},{"$f":"IF('Freeze-Thaw'!$B$6=\"\",\"\",'Freeze-Thaw'!$B$6)","v":"Tex-432-A "},{"$f":"IF('Freeze-Thaw'!$B$27=\"\",\"\",'Freeze-Thaw'!$B$27)","v":"Passing"},{"$f":"IF('Freeze-Thaw'!$B$32=\"\",\"\",'Freeze-Thaw'!$B$32)","v":""},{"$f":"IF('Freeze-Thaw'!$B$25=\"\",\"\",'Freeze-Thaw'!$B$25)","v":"Particle Size Range"},{"$f":"IF('Freeze-Thaw'!$C$27=\"\",\"\",'Freeze-Thaw'!$C$27)","v":"Retained"},{"$f":"IF('Freeze-Thaw'!$C$32=\"\",\"\",'Freeze-Thaw'!$C$32)","v":""},{"$f":"IF('Freeze-Thaw'!$G$25=\"\",\"\",'Freeze-Thaw'!$G$25)","v":"Percent Loss"}]
[21,{"$f":"IF('Freeze-Thaw'!$H$32=\"\",\"\",'Freeze-Thaw'!$H$32)","v":""},{"$f":"IF('Freeze-Thaw'!$B$6=\"\",\"\",'Freeze-Thaw'!$B$6)","v":"Tex-432-A "},{"$f":"IF('Freeze-Thaw'!$B$27=\"\",\"\",'Freeze-Thaw'!$B$27)","v":"Passing"},{"$f":"IF('Freeze-Thaw'!$B$32=\"\",\"\",'Freeze-Thaw'!$B$32)","v":""},{"$f":"IF('Freeze-Thaw'!$B$25=\"\",\"\",'Freeze-Thaw'!$B$25)","v":"Particle Size Range"},{"$f":"IF('Freeze-Thaw'!$C$27=\"\",\"\",'Freeze-Thaw'!$C$27)","v":"Retained"},{"$f":"IF('Freeze-Thaw'!$C$32=\"\",\"\",'Freeze-Thaw'!$C$32)","v":""},{"$f":"IF('Freeze-Thaw'!$H$25=\"\",\"\",'Freeze-Thaw'!$H$25)","v":"Normalized Individual Percent Retained"}]
[22,{"$f":"IF('Freeze-Thaw'!$I$32=\"\",\"\",'Freeze-Thaw'!$I$32)","v":""},{"$f":"IF('Freeze-Thaw'!$B$6=\"\",\"\",'Freeze-Thaw'!$B$6)","v":"Tex-432-A "},{"$f":"IF('Freeze-Thaw'!$B$27=\"\",\"\",'Freeze-Thaw'!$B$27)","v":"Passing"},{"$f":"IF('Freeze-Thaw'!$B$32=\"\",\"\",'Freeze-Thaw'!$B$32)","v":""},{"$f":"IF('Freeze-Thaw'!$B$25=\"\",\"\",'Freeze-Thaw'!$B$25)","v":"Particle Size Range"},{"$f":"IF('Freeze-Thaw'!$C$27=\"\",\"\",'Freeze-Thaw'!$C$27)","v":"Retained"},{"$f":"IF('Freeze-Thaw'!$C$32=\"\",\"\",'Freeze-Thaw'!$C$32)","v":""},{"$f":"IF('Freeze-Thaw'!$I$25=\"\",\"\",'Freeze-Thaw'!$I$25)","v":"Weighted Average Percent Loss"}]
[23,{"$f":"IF('Freeze-Thaw'!$D$33=\"\",\"\",'Freeze-Thaw'!$D$33)","v":""},{"$f":"IF('Freeze-Thaw'!$B$6=\"\",\"\",'Freeze-Thaw'!$B$6)","v":"Tex-432-A "},{"$f":"IF('Freeze-Thaw'!$B$27=\"\",\"\",'Freeze-Thaw'!$B$27)","v":"Passing"},{"$f":"IF('Freeze-Thaw'!$B$33=\"\",\"\",'Freeze-Thaw'!$B$33)","v":""},{"$f":"IF('Freeze-Thaw'!$B$25=\"\",\"\",'Freeze-Thaw'!$B$25)","v":"Particle Size Range"},{"$f":"IF('Freeze-Thaw'!$C$27=\"\",\"\",'Freeze-Thaw'!$C$27)","v":"Retained"},{"$f":"IF('Freeze-Thaw'!$C$33=\"\",\"\",'Freeze-Thaw'!$C$33)","v":""},{"$f":"IF('Freeze-Thaw'!$D$25=\"\",\"\",'Freeze-Thaw'!$D$25)","v":"Initial Weight (g)"}]
[24,{"$f":"IF('Freeze-Thaw'!$E$33=\"\",\"\",'Freeze-Thaw'!$E$33)","v":""},{"$f":"IF('Freeze-Thaw'!$B$6=\"\",\"\",'Freeze-Thaw'!$B$6)","v":"Tex-432-A "},{"$f":"IF('Freeze-Thaw'!$B$27=\"\",\"\",'Freeze-Thaw'!$B$27)","v":"Passing"},{"$f":"IF('Freeze-Thaw'!$B$33=\"\",\"\",'Freeze-Thaw'!$B$33)","v":""},{"$f":"IF('Freeze-Thaw'!$B$25=\"\",\"\",'Freeze-Thaw'!$B$25)","v":"Particle Size Range"},{"$f":"IF('Freeze-Thaw'!$C$27=\"\",\"\",'Freeze-Thaw'!$C$27)","v":"Retained"},{"$f":"IF('Freeze-Thaw'!$C$33=\"\",\"\",'Freeze-Thaw'!$C$33)","v":""},{"$f":"IF('Freeze-Thaw'!$E$25=\"\",\"\",'Freeze-Thaw'!$E$25)","v":"Final Weight (g)"}]
[25,{"$f":"IF('Freeze-Thaw'!$F$33=\"\",\"\",'Freeze-Thaw'!$F$33)","v":""},{"$f":"IF('Freeze-Thaw'!$B$6=\"\",\"\",'Freeze-Thaw'!$B$6)","v":"Tex-432-A "},{"$f":"IF('Freeze-Thaw'!$B$27=\"\",\"\",'Freeze-Thaw'!$B$27)","v":"Passing"},{"$f":"IF('Freeze-Thaw'!$B$33=\"\",\"\",'Freeze-Thaw'!$B$33)","v":""},{"$f":"IF('Freeze-Thaw'!$B$25=\"\",\"\",'Freeze-Thaw'!$B$25)","v":"Particle Size Range"},{"$f":"IF('Freeze-Thaw'!$C$27=\"\",\"\",'Freeze-Thaw'!$C$27)","v":"Retained"},{"$f":"IF('Freeze-Thaw'!$C$33=\"\",\"\",'Freeze-Thaw'!$C$33)","v":""},{"$f":"IF('Freeze-Thaw'!$F$25=\"\",\"\",'Freeze-Thaw'!$F$25)","v":"Loss of Weight (g)"}]
[26,{"$f":"IF('Freeze-Thaw'!$G$33=\"\",\"\",'Freeze-Thaw'!$G$33)","v":""},{"$f":"IF('Freeze-Thaw'!$B$6=\"\",\"\",'Freeze-Thaw'!$B$6)","v":"Tex-432-A "},{"$f":"IF('Freeze-Thaw'!$B$27=\"\",\"\",'Freeze-Thaw'!$B$27)","v":"Passing"},{"$f":"IF('Freeze-Thaw'!$B$33=\"\",\"\",'Freeze-Thaw'!$B$33)","v":""},{"$f":"IF('Freeze-Thaw'!$B$25=\"\",\"\",'Freeze-Thaw'!$B$25)","v":"Particle Size Range"},{"$f":"IF('Freeze-Thaw'!$C$27=\"\",\"\",'Freeze-Thaw'!$C$27)","v":"Retained"},{"$f":"IF('Freeze-Thaw'!$C$33=\"\",\"\",'Freeze-Thaw'!$C$33)","v":""},{"$f":"IF('Freeze-Thaw'!$G$25=\"\",\"\",'Freeze-Thaw'!$G$25)","v":"Percent Loss"}]
[27,{"$f":"IF('Freeze-Thaw'!$H$33=\"\",\"\",'Freeze-Thaw'!$H$33)","v":""},{"$f":"IF('Freeze-Thaw'!$B$6=\"\",\"\",'Freeze-Thaw'!$B$6)","v":"Tex-432-A "},{"$f":"IF('Freeze-Thaw'!$B$27=\"\",\"\",'Freeze-Thaw'!$B$27)","v":"Passing"},{"$f":"IF('Freeze-Thaw'!$B$33=\"\",\"\",'Freeze-Thaw'!$B$33)","v":""},{"$f":"IF('Freeze-Thaw'!$B$25=\"\",\"\",'Freeze-Thaw'!$B$25)","v":"Particle Size Range"},{"$f":"IF('Freeze-Thaw'!$C$27=\"\",\"\",'Freeze-Thaw'!$C$27)","v":"Retained"},{"$f":"IF('Freeze-Thaw'!$C$33=\"\",\"\",'Freeze-Thaw'!$C$33)","v":""},{"$f":"IF('Freeze-Thaw'!$H$25=\"\",\"\",'Freeze-Thaw'!$H$25)","v":"Normalized Individual Percent Retained"}]
[28,{"$f":"IF('Freeze-Thaw'!$I$33=\"\",\"\",'Freeze-Thaw'!$I$33)","v":""},{"$f":"IF('Freeze-Thaw'!$B$6=\"\",\"\",'Freeze-Thaw'!$B$6)","v":"Tex-432-A "},{"$f":"IF('Freeze-Thaw'!$B$27=\"\",\"\",'Freeze-Thaw'!$B$27)","v":"Passing"},{"$f":"IF('Freeze-Thaw'!$B$33=\"\",\"\",'Freeze-Thaw'!$B$33)","v":""},{"$f":"IF('Freeze-Thaw'!$B$25=\"\",\"\",'Freeze-Thaw'!$B$25)","v":"Particle Size Range"},{"$f":"IF('Freeze-Thaw'!$C$27=\"\",\"\",'Freeze-Thaw'!$C$27)","v":"Retained"},{"$f":"IF('Freeze-Thaw'!$C$33=\"\",\"\",'Freeze-Thaw'!$C$33)","v":""},{"$f":"IF('Freeze-Thaw'!$I$25=\"\",\"\",'Freeze-Thaw'!$I$25)","v":"Weighted Average Percent Loss"}]
[29,{"$f":"IF('Freeze-Thaw'!$D$34=\"\",\"\",'Freeze-Thaw'!$D$34)","v":""},{"$f":"IF('Freeze-Thaw'!$B$6=\"\",\"\",'Freeze-Thaw'!$B$6)","v":"Tex-432-A "},{"$f":"IF('Freeze-Thaw'!$B$27=\"\",\"\",'Freeze-Thaw'!$B$27)","v":"Passing"},{"$f":"IF('Freeze-Thaw'!$B$34=\"\",\"\",'Freeze-Thaw'!$B$34)","v":""},{"$f":"IF('Freeze-Thaw'!$B$25=\"\",\"\",'Freeze-Thaw'!$B$25)","v":"Particle Size Range"},{"$f":"IF('Freeze-Thaw'!$C$27=\"\",\"\",'Freeze-Thaw'!$C$27)","v":"Retained"},{"$f":"IF('Freeze-Thaw'!$C$34=\"\",\"\",'Freeze-Thaw'!$C$34)","v":""},{"$f":"IF('Freeze-Thaw'!$D$25=\"\",\"\",'Freeze-Thaw'!$D$25)","v":"Initial Weight (g)"}]
[30,{"$f":"IF('Freeze-Thaw'!$E$34=\"\",\"\",'Freeze-Thaw'!$E$34)","v":""},{"$f":"IF('Freeze-Thaw'!$B$6=\"\",\"\",'Freeze-Thaw'!$B$6)","v":"Tex-432-A "},{"$f":"IF('Freeze-Thaw'!$B$27=\"\",\"\",'Freeze-Thaw'!$B$27)","v":"Passing"},{"$f":"IF('Freeze-Thaw'!$B$34=\"\",\"\",'Freeze-Thaw'!$B$34)","v":""},{"$f":"IF('Freeze-Thaw'!$B$25=\"\",\"\",'Freeze-Thaw'!$B$25)","v":"Particle Size Range"},{"$f":"IF('Freeze-Thaw'!$C$27=\"\",\"\",'Freeze-Thaw'!$C$27)","v":"Retained"},{"$f":"IF('Freeze-Thaw'!$C$34=\"\",\"\",'Freeze-Thaw'!$C$34)","v":""},{"$f":"IF('Freeze-Thaw'!$E$25=\"\",\"\",'Freeze-Thaw'!$E$25)","v":"Final Weight (g)"}]
[31,{"$f":"IF('Freeze-Thaw'!$F$34=\"\",\"\",'Freeze-Thaw'!$F$34)","v":""},{"$f":"IF('Freeze-Thaw'!$B$6=\"\",\"\",'Freeze-Thaw'!$B$6)","v":"Tex-432-A "},{"$f":"IF('Freeze-Thaw'!$B$27=\"\",\"\",'Freeze-Thaw'!$B$27)","v":"Passing"},{"$f":"IF('Freeze-Thaw'!$B$34=\"\",\"\",'Freeze-Thaw'!$B$34)","v":""},{"$f":"IF('Freeze-Thaw'!$B$25=\"\",\"\",'Freeze-Thaw'!$B$25)","v":"Particle Size Range"},{"$f":"IF('Freeze-Thaw'!$C$27=\"\",\"\",'Freeze-Thaw'!$C$27)","v":"Retained"},{"$f":"IF('Freeze-Thaw'!$C$34=\"\",\"\",'Freeze-Thaw'!$C$34)","v":""},{"$f":"IF('Freeze-Thaw'!$F$25=\"\",\"\",'Freeze-Thaw'!$F$25)","v":"Loss of Weight (g)"}]
[32,{"$f":"IF('Freeze-Thaw'!$G$34=\"\",\"\",'Freeze-Thaw'!$G$34)","v":""},{"$f":"IF('Freeze-Thaw'!$B$6=\"\",\"\",'Freeze-Thaw'!$B$6)","v":"Tex-432-A "},{"$f":"IF('Freeze-Thaw'!$B$27=\"\",\"\",'Freeze-Thaw'!$B$27)","v":"Passing"},{"$f":"IF('Freeze-Thaw'!$B$34=\"\",\"\",'Freeze-Thaw'!$B$34)","v":""},{"$f":"IF('Freeze-Thaw'!$B$25=\"\",\"\",'Freeze-Thaw'!$B$25)","v":"Particle Size Range"},{"$f":"IF('Freeze-Thaw'!$C$27=\"\",\"\",'Freeze-Thaw'!$C$27)","v":"Retained"},{"$f":"IF('Freeze-Thaw'!$C$34=\"\",\"\",'Freeze-Thaw'!$C$34)","v":""},{"$f":"IF('Freeze-Thaw'!$G$25=\"\",\"\",'Freeze-Thaw'!$G$25)","v":"Percent Loss"}]
[33,{"$f":"IF('Freeze-Thaw'!$H$34=\"\",\"\",'Freeze-Thaw'!$H$34)","v":""},{"$f":"IF('Freeze-Thaw'!$B$6=\"\",\"\",'Freeze-Thaw'!$B$6)","v":"Tex-432-A "},{"$f":"IF('Freeze-Thaw'!$B$27=\"\",\"\",'Freeze-Thaw'!$B$27)","v":"Passing"},{"$f":"IF('Freeze-Thaw'!$B$34=\"\",\"\",'Freeze-Thaw'!$B$34)","v":""},{"$f":"IF('Freeze-Thaw'!$B$25=\"\",\"\",'Freeze-Thaw'!$B$25)","v":"Particle Size Range"},{"$f":"IF('Freeze-Thaw'!$C$27=\"\",\"\",'Freeze-Thaw'!$C$27)","v":"Retained"},{"$f":"IF('Freeze-Thaw'!$C$34=\"\",\"\",'Freeze-Thaw'!$C$34)","v":""},{"$f":"IF('Freeze-Thaw'!$H$25=\"\",\"\",'Freeze-Thaw'!$H$25)","v":"Normalized Individual Percent Retained"}]
[34,{"$f":"IF('Freeze-Thaw'!$I$34=\"\",\"\",'Freeze-Thaw'!$I$34)","v":""},{"$f":"IF('Freeze-Thaw'!$B$6=\"\",\"\",'Freeze-Thaw'!$B$6)","v":"Tex-432-A "},{"$f":"IF('Freeze-Thaw'!$B$27=\"\",\"\",'Freeze-Thaw'!$B$27)","v":"Passing"},{"$f":"IF('Freeze-Thaw'!$B$34=\"\",\"\",'Freeze-Thaw'!$B$34)","v":""},{"$f":"IF('Freeze-Thaw'!$B$25=\"\",\"\",'Freeze-Thaw'!$B$25)","v":"Particle Size Range"},{"$f":"IF('Freeze-Thaw'!$C$27=\"\",\"\",'Freeze-Thaw'!$C$27)","v":"Retained"},{"$f":"IF('Freeze-Thaw'!$C$34=\"\",\"\",'Freeze-Thaw'!$C$34)","v":""},{"$f":"IF('Freeze-Thaw'!$I$25=\"\",\"\",'Freeze-Thaw'!$I$25)","v":"Weighted Average Percent Loss"}]
[35,{"$f":"IF('Freeze-Thaw'!$D$35=\"\",\"\",'Freeze-Thaw'!$D$35)","v":""},{"$f":"IF('Freeze-Thaw'!$B$6=\"\",\"\",'Freeze-Thaw'!$B$6)","v":"Tex-432-A "},{"$f":"IF('Freeze-Thaw'!$B$27=\"\",\"\",'Freeze-Thaw'!$B$27)","v":"Passing"},{"$f":"IF('Freeze-Thaw'!$B$35=\"\",\"\",'Freeze-Thaw'!$B$35)","v":""},{"$f":"IF('Freeze-Thaw'!$B$25=\"\",\"\",'Freeze-Thaw'!$B$25)","v":"Particle Size Range"},{"$f":"IF('Freeze-Thaw'!$C$27=\"\",\"\",'Freeze-Thaw'!$C$27)","v":"Retained"},{"$f":"IF('Freeze-Thaw'!$C$35=\"\",\"\",'Freeze-Thaw'!$C$35)","v":""},{"$f":"IF('Freeze-Thaw'!$D$25=\"\",\"\",'Freeze-Thaw'!$D$25)","v":"Initial Weight (g)"}]
[36,{"$f":"IF('Freeze-Thaw'!$E$35=\"\",\"\",'Freeze-Thaw'!$E$35)","v":""},{"$f":"IF('Freeze-Thaw'!$B$6=\"\",\"\",'Freeze-Thaw'!$B$6)","v":"Tex-432-A "},{"$f":"IF('Freeze-Thaw'!$B$27=\"\",\"\",'Freeze-Thaw'!$B$27)","v":"Passing"},{"$f":"IF('Freeze-Thaw'!$B$35=\"\",\"\",'Freeze-Thaw'!$B$35)","v":""},{"$f":"IF('Freeze-Thaw'!$B$25=\"\",\"\",'Freeze-Thaw'!$B$25)","v":"Particle Size Range"},{"$f":"IF('Freeze-Thaw'!$C$27=\"\",\"\",'Freeze-Thaw'!$C$27)","v":"Retained"},{"$f":"IF('Freeze-Thaw'!$C$35=\"\",\"\",'Freeze-Thaw'!$C$35)","v":""},{"$f":"IF('Freeze-Thaw'!$E$25=\"\",\"\",'Freeze-Thaw'!$E$25)","v":"Final Weight (g)"}]
[37,{"$f":"IF('Freeze-Thaw'!$F$35=\"\",\"\",'Freeze-Thaw'!$F$35)","v":""},{"$f":"IF('Freeze-Thaw'!$B$6=\"\",\"\",'Freeze-Thaw'!$B$6)","v":"Tex-432-A "},{"$f":"IF('Freeze-Thaw'!$B$27=\"\",\"\",'Freeze-Thaw'!$B$27)","v":"Passing"},{"$f":"IF('Freeze-Thaw'!$B$35=\"\",\"\",'Freeze-Thaw'!$B$35)","v":""},{"$f":"IF('Freeze-Thaw'!$B$25=\"\",\"\",'Freeze-Thaw'!$B$25)","v":"Particle Size Range"},{"$f":"IF('Freeze-Thaw'!$C$27=\"\",\"\",'Freeze-Thaw'!$C$27)","v":"Retained"},{"$f":"IF('Freeze-Thaw'!$C$35=\"\",\"\",'Freeze-Thaw'!$C$35)","v":""},{"$f":"IF('Freeze-Thaw'!$F$25=\"\",\"\",'Freeze-Thaw'!$F$25)","v":"Loss of Weight (g)"}]
[38,{"$f":"IF('Freeze-Thaw'!$G$35=\"\",\"\",'Freeze-Thaw'!$G$35)","v":""},{"$f":"IF('Freeze-Thaw'!$B$6=\"\",\"\",'Freeze-Thaw'!$B$6)","v":"Tex-432-A "},{"$f":"IF('Freeze-Thaw'!$B$27=\"\",\"\",'Freeze-Thaw'!$B$27)","v":"Passing"},{"$f":"IF('Freeze-Thaw'!$B$35=\"\",\"\",'Freeze-Thaw'!$B$35)","v":""},{"$f":"IF('Freeze-Thaw'!$B$25=\"\",\"\",'Freeze-Thaw'!$B$25)","v":"Particle Size Range"},{"$f":"IF('Freeze-Thaw'!$C$27=\"\",\"\",'Freeze-Thaw'!$C$27)","v":"Retained"},{"$f":"IF('Freeze-Thaw'!$C$35=\"\",\"\",'Freeze-Thaw'!$C$35)","v":""},{"$f":"IF('Freeze-Thaw'!$G$25=\"\",\"\",'Freeze-Thaw'!$G$25)","v":"Percent Loss"}]
[39,{"$f":"IF('Freeze-Thaw'!$H$35=\"\",\"\",'Freeze-Thaw'!$H$35)","v":""},{"$f":"IF('Freeze-Thaw'!$B$6=\"\",\"\",'Freeze-Thaw'!$B$6)","v":"Tex-432-A "},{"$f":"IF('Freeze-Thaw'!$B$27=\"\",\"\",'Freeze-Thaw'!$B$27)","v":"Passing"},{"$f":"IF('Freeze-Thaw'!$B$35=\"\",\"\",'Freeze-Thaw'!$B$35)","v":""},{"$f":"IF('Freeze-Thaw'!$B$25=\"\",\"\",'Freeze-Thaw'!$B$25)","v":"Particle Size Range"},{"$f":"IF('Freeze-Thaw'!$C$27=\"\",\"\",'Freeze-Thaw'!$C$27)","v":"Retained"},{"$f":"IF('Freeze-Thaw'!$C$35=\"\",\"\",'Freeze-Thaw'!$C$35)","v":""},{"$f":"IF('Freeze-Thaw'!$H$25=\"\",\"\",'Freeze-Thaw'!$H$25)","v":"Normalized Individual Percent Retained"}]
[40,{"$f":"IF('Freeze-Thaw'!$I$35=\"\",\"\",'Freeze-Thaw'!$I$35)","v":""},{"$f":"IF('Freeze-Thaw'!$B$6=\"\",\"\",'Freeze-Thaw'!$B$6)","v":"Tex-432-A "},{"$f":"IF('Freeze-Thaw'!$B$27=\"\",\"\",'Freeze-Thaw'!$B$27)","v":"Passing"},{"$f":"IF('Freeze-Thaw'!$B$35=\"\",\"\",'Freeze-Thaw'!$B$35)","v":""},{"$f":"IF('Freeze-Thaw'!$B$25=\"\",\"\",'Freeze-Thaw'!$B$25)","v":"Particle Size Range"},{"$f":"IF('Freeze-Thaw'!$C$27=\"\",\"\",'Freeze-Thaw'!$C$27)","v":"Retained"},{"$f":"IF('Freeze-Thaw'!$C$35=\"\",\"\",'Freeze-Thaw'!$C$35)","v":""},{"$f":"IF('Freeze-Thaw'!$I$25=\"\",\"\",'Freeze-Thaw'!$I$25)","v":"Weighted Average Percent Loss"}]
[41,{"$f":"IF('Freeze-Thaw'!$D$36=\"\",\"\",'Freeze-Thaw'!$D$36)","v":""},{"$f":"IF('Freeze-Thaw'!$B$6=\"\",\"\",'Freeze-Thaw'!$B$6)","v":"Tex-432-A "},{"$f":"IF('Freeze-Thaw'!$B$27=\"\",\"\",'Freeze-Thaw'!$B$27)","v":"Passing"},{"$f":"IF('Freeze-Thaw'!$B$36=\"\",\"\",'Freeze-Thaw'!$B$36)","v":""},{"$f":"IF('Freeze-Thaw'!$B$25=\"\",\"\",'Freeze-Thaw'!$B$25)","v":"Particle Size Range"},{"$f":"IF('Freeze-Thaw'!$C$27=\"\",\"\",'Freeze-Thaw'!$C$27)","v":"Retained"},{"$f":"IF('Freeze-Thaw'!$C$36=\"\",\"\",'Freeze-Thaw'!$C$36)","v":""},{"$f":"IF('Freeze-Thaw'!$D$25=\"\",\"\",'Freeze-Thaw'!$D$25)","v":"Initial Weight (g)"}]
[42,{"$f":"IF('Freeze-Thaw'!$E$36=\"\",\"\",'Freeze-Thaw'!$E$36)","v":""},{"$f":"IF('Freeze-Thaw'!$B$6=\"\",\"\",'Freeze-Thaw'!$B$6)","v":"Tex-432-A "},{"$f":"IF('Freeze-Thaw'!$B$27=\"\",\"\",'Freeze-Thaw'!$B$27)","v":"Passing"},{"$f":"IF('Freeze-Thaw'!$B$36=\"\",\"\",'Freeze-Thaw'!$B$36)","v":""},{"$f":"IF('Freeze-Thaw'!$B$25=\"\",\"\",'Freeze-Thaw'!$B$25)","v":"Particle Size Range"},{"$f":"IF('Freeze-Thaw'!$C$27=\"\",\"\",'Freeze-Thaw'!$C$27)","v":"Retained"},{"$f":"IF('Freeze-Thaw'!$C$36=\"\",\"\",'Freeze-Thaw'!$C$36)","v":""},{"$f":"IF('Freeze-Thaw'!$E$25=\"\",\"\",'Freeze-Thaw'!$E$25)","v":"Final Weight (g)"}]
[43,{"$f":"IF('Freeze-Thaw'!$F$36=\"\",\"\",'Freeze-Thaw'!$F$36)","v":""},{"$f":"IF('Freeze-Thaw'!$B$6=\"\",\"\",'Freeze-Thaw'!$B$6)","v":"Tex-432-A "},{"$f":"IF('Freeze-Thaw'!$B$27=\"\",\"\",'Freeze-Thaw'!$B$27)","v":"Passing"},{"$f":"IF('Freeze-Thaw'!$B$36=\"\",\"\",'Freeze-Thaw'!$B$36)","v":""},{"$f":"IF('Freeze-Thaw'!$B$25=\"\",\"\",'Freeze-Thaw'!$B$25)","v":"Particle Size Range"},{"$f":"IF('Freeze-Thaw'!$C$27=\"\",\"\",'Freeze-Thaw'!$C$27)","v":"Retained"},{"$f":"IF('Freeze-Thaw'!$C$36=\"\",\"\",'Freeze-Thaw'!$C$36)","v":""},{"$f":"IF('Freeze-Thaw'!$F$25=\"\",\"\",'Freeze-Thaw'!$F$25)","v":"Loss of Weight (g)"}]
[44,{"$f":"IF('Freeze-Thaw'!$G$36=\"\",\"\",'Freeze-Thaw'!$G$36)","v":""},{"$f":"IF('Freeze-Thaw'!$B$6=\"\",\"\",'Freeze-Thaw'!$B$6)","v":"Tex-432-A "},{"$f":"IF('Freeze-Thaw'!$B$27=\"\",\"\",'Freeze-Thaw'!$B$27)","v":"Passing"},{"$f":"IF('Freeze-Thaw'!$B$36=\"\",\"\",'Freeze-Thaw'!$B$36)","v":""},{"$f":"IF('Freeze-Thaw'!$B$25=\"\",\"\",'Freeze-Thaw'!$B$25)","v":"Particle Size Range"},{"$f":"IF('Freeze-Thaw'!$C$27=\"\",\"\",'Freeze-Thaw'!$C$27)","v":"Retained"},{"$f":"IF('Freeze-Thaw'!$C$36=\"\",\"\",'Freeze-Thaw'!$C$36)","v":""},{"$f":"IF('Freeze-Thaw'!$G$25=\"\",\"\",'Freeze-Thaw'!$G$25)","v":"Percent Loss"}]
[45,{"$f":"IF('Freeze-Thaw'!$H$36=\"\",\"\",'Freeze-Thaw'!$H$36)","v":""},{"$f":"IF('Freeze-Thaw'!$B$6=\"\",\"\",'Freeze-Thaw'!$B$6)","v":"Tex-432-A "},{"$f":"IF('Freeze-Thaw'!$B$27=\"\",\"\",'Freeze-Thaw'!$B$27)","v":"Passing"},{"$f":"IF('Freeze-Thaw'!$B$36=\"\",\"\",'Freeze-Thaw'!$B$36)","v":""},{"$f":"IF('Freeze-Thaw'!$B$25=\"\",\"\",'Freeze-Thaw'!$B$25)","v":"Particle Size Range"},{"$f":"IF('Freeze-Thaw'!$C$27=\"\",\"\",'Freeze-Thaw'!$C$27)","v":"Retained"},{"$f":"IF('Freeze-Thaw'!$C$36=\"\",\"\",'Freeze-Thaw'!$C$36)","v":""},{"$f":"IF('Freeze-Thaw'!$H$25=\"\",\"\",'Freeze-Thaw'!$H$25)","v":"Normalized Individual Percent Retained"}]
[46,{"$f":"IF('Freeze-Thaw'!$I$36=\"\",\"\",'Freeze-Thaw'!$I$36)","v":""},{"$f":"IF('Freeze-Thaw'!$B$6=\"\",\"\",'Freeze-Thaw'!$B$6)","v":"Tex-432-A "},{"$f":"IF('Freeze-Thaw'!$B$27=\"\",\"\",'Freeze-Thaw'!$B$27)","v":"Passing"},{"$f":"IF('Freeze-Thaw'!$B$36=\"\",\"\",'Freeze-Thaw'!$B$36)","v":""},{"$f":"IF('Freeze-Thaw'!$B$25=\"\",\"\",'Freeze-Thaw'!$B$25)","v":"Particle Size Range"},{"$f":"IF('Freeze-Thaw'!$C$27=\"\",\"\",'Freeze-Thaw'!$C$27)","v":"Retained"},{"$f":"IF('Freeze-Thaw'!$C$36=\"\",\"\",'Freeze-Thaw'!$C$36)","v":""},{"$f":"IF('Freeze-Thaw'!$I$25=\"\",\"\",'Freeze-Thaw'!$I$25)","v":"Weighted Average Percent Loss"}]
[47,{"$f":"IF('Freeze-Thaw'!$D$37=\"\",\"\",'Freeze-Thaw'!$D$37)","v":""},{"$f":"IF('Freeze-Thaw'!$B$6=\"\",\"\",'Freeze-Thaw'!$B$6)","v":"Tex-432-A "},{"$f":"IF('Freeze-Thaw'!$B$27=\"\",\"\",'Freeze-Thaw'!$B$27)","v":"Passing"},{"$f":"IF('Freeze-Thaw'!$B$37=\"\",\"\",'Freeze-Thaw'!$B$37)","v":""},{"$f":"IF('Freeze-Thaw'!$B$25=\"\",\"\",'Freeze-Thaw'!$B$25)","v":"Particle Size Range"},{"$f":"IF('Freeze-Thaw'!$C$27=\"\",\"\",'Freeze-Thaw'!$C$27)","v":"Retained"},{"$f":"IF('Freeze-Thaw'!$C$37=\"\",\"\",'Freeze-Thaw'!$C$37)","v":""},{"$f":"IF('Freeze-Thaw'!$D$25=\"\",\"\",'Freeze-Thaw'!$D$25)","v":"Initial Weight (g)"}]
[48,{"$f":"IF('Freeze-Thaw'!$E$37=\"\",\"\",'Freeze-Thaw'!$E$37)","v":""},{"$f":"IF('Freeze-Thaw'!$B$6=\"\",\"\",'Freeze-Thaw'!$B$6)","v":"Tex-432-A "},{"$f":"IF('Freeze-Thaw'!$B$27=\"\",\"\",'Freeze-Thaw'!$B$27)","v":"Passing"},{"$f":"IF('Freeze-Thaw'!$B$37=\"\",\"\",'Freeze-Thaw'!$B$37)","v":""},{"$f":"IF('Freeze-Thaw'!$B$25=\"\",\"\",'Freeze-Thaw'!$B$25)","v":"Particle Size Range"},{"$f":"IF('Freeze-Thaw'!$C$27=\"\",\"\",'Freeze-Thaw'!$C$27)","v":"Retained"},{"$f":"IF('Freeze-Thaw'!$C$37=\"\",\"\",'Freeze-Thaw'!$C$37)","v":""},{"$f":"IF('Freeze-Thaw'!$E$25=\"\",\"\",'Freeze-Thaw'!$E$25)","v":"Final Weight (g)"}]
[49,{"$f":"IF('Freeze-Thaw'!$F$37=\"\",\"\",'Freeze-Thaw'!$F$37)","v":""},{"$f":"IF('Freeze-Thaw'!$B$6=\"\",\"\",'Freeze-Thaw'!$B$6)","v":"Tex-432-A "},{"$f":"IF('Freeze-Thaw'!$B$27=\"\",\"\",'Freeze-Thaw'!$B$27)","v":"Passing"},{"$f":"IF('Freeze-Thaw'!$B$37=\"\",\"\",'Freeze-Thaw'!$B$37)","v":""},{"$f":"IF('Freeze-Thaw'!$B$25=\"\",\"\",'Freeze-Thaw'!$B$25)","v":"Particle Size Range"},{"$f":"IF('Freeze-Thaw'!$C$27=\"\",\"\",'Freeze-Thaw'!$C$27)","v":"Retained"},{"$f":"IF('Freeze-Thaw'!$C$37=\"\",\"\",'Freeze-Thaw'!$C$37)","v":""},{"$f":"IF('Freeze-Thaw'!$F$25=\"\",\"\",'Freeze-Thaw'!$F$25)","v":"Loss of Weight (g)"}]
[50,{"$f":"IF('Freeze-Thaw'!$G$37=\"\",\"\",'Freeze-Thaw'!$G$37)","v":""},{"$f":"IF('Freeze-Thaw'!$B$6=\"\",\"\",'Freeze-Thaw'!$B$6)","v":"Tex-432-A "},{"$f":"IF('Freeze-Thaw'!$B$27=\"\",\"\",'Freeze-Thaw'!$B$27)","v":"Passing"},{"$f":"IF('Freeze-Thaw'!$B$37=\"\",\"\",'Freeze-Thaw'!$B$37)","v":""},{"$f":"IF('Freeze-Thaw'!$B$25=\"\",\"\",'Freeze-Thaw'!$B$25)","v":"Particle Size Range"},{"$f":"IF('Freeze-Thaw'!$C$27=\"\",\"\",'Freeze-Thaw'!$C$27)","v":"Retained"},{"$f":"IF('Freeze-Thaw'!$C$37=\"\",\"\",'Freeze-Thaw'!$C$37)","v":""},{"$f":"IF('Freeze-Thaw'!$G$25=\"\",\"\",'Freeze-Thaw'!$G$25)","v":"Percent Loss"}]
[51,{"$f":"IF('Freeze-Thaw'!$H$37=\"\",\"\",'Freeze-Thaw'!$H$37)","v":""},{"$f":"IF('Freeze-Thaw'!$B$6=\"\",\"\",'Freeze-Thaw'!$B$6)","v":"Tex-432-A "},{"$f":"IF('Freeze-Thaw'!$B$27=\"\",\"\",'Freeze-Thaw'!$B$27)","v":"Passing"},{"$f":"IF('Freeze-Thaw'!$B$37=\"\",\"\",'Freeze-Thaw'!$B$37)","v":""},{"$f":"IF('Freeze-Thaw'!$B$25=\"\",\"\",'Freeze-Thaw'!$B$25)","v":"Particle Size Range"},{"$f":"IF('Freeze-Thaw'!$C$27=\"\",\"\",'Freeze-Thaw'!$C$27)","v":"Retained"},{"$f":"IF('Freeze-Thaw'!$C$37=\"\",\"\",'Freeze-Thaw'!$C$37)","v":""},{"$f":"IF('Freeze-Thaw'!$H$25=\"\",\"\",'Freeze-Thaw'!$H$25)","v":"Normalized Individual Percent Retained"}]
[52,{"$f":"IF('Freeze-Thaw'!$I$37=\"\",\"\",'Freeze-Thaw'!$I$37)","v":""},{"$f":"IF('Freeze-Thaw'!$B$6=\"\",\"\",'Freeze-Thaw'!$B$6)","v":"Tex-432-A "},{"$f":"IF('Freeze-Thaw'!$B$27=\"\",\"\",'Freeze-Thaw'!$B$27)","v":"Passing"},{"$f":"IF('Freeze-Thaw'!$B$37=\"\",\"\",'Freeze-Thaw'!$B$37)","v":""},{"$f":"IF('Freeze-Thaw'!$B$25=\"\",\"\",'Freeze-Thaw'!$B$25)","v":"Particle Size Range"},{"$f":"IF('Freeze-Thaw'!$C$27=\"\",\"\",'Freeze-Thaw'!$C$27)","v":"Retained"},{"$f":"IF('Freeze-Thaw'!$C$37=\"\",\"\",'Freeze-Thaw'!$C$37)","v":""},{"$f":"IF('Freeze-Thaw'!$I$25=\"\",\"\",'Freeze-Thaw'!$I$25)","v":"Weighted Average Percent Loss"}]
[53,{"$f":"IF('Freeze-Thaw'!$G$38=\"\",\"\",'Freeze-Thaw'!$G$38)","v":""},{"$f":"IF('Freeze-Thaw'!$B$6=\"\",\"\",'Freeze-Thaw'!$B$6)","v":"Tex-432-A "},{"$f":"IF('Freeze-Thaw'!$F$38=\"\",\"\",'Freeze-Thaw'!$F$38)","v":"Total:"},{"$f":"IF('Freeze-Thaw'!$G$25=\"\",\"\",'Freeze-Thaw'!$G$25)","v":"Percent Loss"}]
[54,{"$f":"IF('Freeze-Thaw'!$H$38=\"\",\"\",'Freeze-Thaw'!$H$38)","v":""},{"$f":"IF('Freeze-Thaw'!$B$6=\"\",\"\",'Freeze-Thaw'!$B$6)","v":"Tex-432-A "},{"$f":"IF('Freeze-Thaw'!$F$38=\"\",\"\",'Freeze-Thaw'!$F$38)","v":"Total:"},{"$f":"IF('Freeze-Thaw'!$H$25=\"\",\"\",'Freeze-Thaw'!$H$25)","v":"Normalized Individual Percent Retained"}]
[55,{"$f":"IF('Freeze-Thaw'!$I$38=\"\",\"\",'Freeze-Thaw'!$I$38)","v":""},{"$f":"IF('Freeze-Thaw'!$B$6=\"\",\"\",'Freeze-Thaw'!$B$6)","v":"Tex-432-A "},{"$f":"IF('Freeze-Thaw'!$F$38=\"\",\"\",'Freeze-Thaw'!$F$38)","v":"Total:"},{"$f":"IF('Freeze-Thaw'!$I$25=\"\",\"\",'Freeze-Thaw'!$I$25)","v":"Weighted Average Percent Loss"}]
[56,{"$f":"IF('Freeze-Thaw'!$F$40=\"\",\"\",'Freeze-Thaw'!$F$40)","v":""},{"$f":"IF('Freeze-Thaw'!$B$6=\"\",\"\",'Freeze-Thaw'!$B$6)","v":"Tex-432-A "},{"$f":"IF('Freeze-Thaw'!$E$40=\"\",\"\",'Freeze-Thaw'!$E$40)","v":"Freeze-Thaw Loss:"}]
[57,{"$f":"IF('Cycle History'!$E$4=\"\",\"\",'Cycle History'!$E$4)","v":""},{"$f":"IF('Cycle History'!$B$1=\"\",\"\",'Cycle History'!$B$1)","v":"CYCLE HISTORY"},{"$f":"IF('Cycle History'!$B$3=\"\",\"\",'Cycle History'!$B$3)","v":"CYCLE"},{"$f":"IF('Cycle History'!$B$4=\"\",\"\",'Cycle History'!$B$4)","v":1},{"$f":"IF('Cycle History'!$C$4=\"\",\"\",'Cycle History'!$C$4)","v":"In Freezing chamber"},{"$f":"IF('Cycle History'!$E$3=\"\",\"\",'Cycle History'!$E$3)","v":"DATE"}]
[58,{"$f":"IF('Cycle History'!$F$4=\"\",\"\",'Cycle History'!$F$4)","v":""},{"$f":"IF('Cycle History'!$B$1=\"\",\"\",'Cycle History'!$B$1)","v":"CYCLE HISTORY"},{"$f":"IF('Cycle History'!$B$3=\"\",\"\",'Cycle History'!$B$3)","v":"CYCLE"},{"$f":"IF('Cycle History'!$B$4=\"\",\"\",'Cycle History'!$B$4)","v":1},{"$f":"IF('Cycle History'!$C$4=\"\",\"\",'Cycle History'!$C$4)","v":"In Freezing chamber"},{"$f":"IF('Cycle History'!$F$3=\"\",\"\",'Cycle History'!$F$3)","v":"TIME IN"}]
[59,{"$f":"IF('Cycle History'!$G$4=\"\",\"\",'Cycle History'!$G$4)","v":""},{"$f":"IF('Cycle History'!$B$1=\"\",\"\",'Cycle History'!$B$1)","v":"CYCLE HISTORY"},{"$f":"IF('Cycle History'!$B$3=\"\",\"\",'Cycle History'!$B$3)","v":"CYCLE"},{"$f":"IF('Cycle History'!$B$4=\"\",\"\",'Cycle History'!$B$4)","v":1},{"$f":"IF('Cycle History'!$C$4=\"\",\"\",'Cycle History'!$C$4)","v":"In Freezing chamber"},{"$f":"IF('Cycle History'!$G$3=\"\",\"\",'Cycle History'!$G$3)","v":"TIME OUT"}]
[60,{"$f":"IF('Cycle History'!$H$4=\"\",\"\",'Cycle History'!$H$4)","v":""},{"$f":"IF('Cycle History'!$B$1=\"\",\"\",'Cycle History'!$B$1)","v":"CYCLE HISTORY"},{"$f":"IF('Cycle History'!$B$3=\"\",\"\",'Cycle History'!$B$3)","v":"CYCLE"},{"$f":"IF('Cycle History'!$B$4=\"\",\"\",'Cycle History'!$B$4)","v":1},{"$f":"IF('Cycle History'!$C$4=\"\",\"\",'Cycle History'!$C$4)","v":"In Freezing chamber"},{"$f":"IF('Cycle History'!$H$3=\"\",\"\",'Cycle History'!$H$3)","v":"REMARKS"}]
[61,{"$f":"IF('Cycle History'!$E$5=\"\",\"\",'Cycle History'!$E$5)","v":""},{"$f":"IF('Cycle History'!$B$1=\"\",\"\",'Cycle History'!$B$1)","v":"CYCLE HISTORY"},{"$f":"IF('Cycle History'!$B$3=\"\",\"\",'Cycle History'!$B$3)","v":"CYCLE"},{"$f":"IF('Cycle History'!$B$4=\"\",\"\",'Cycle History'!$B$4)","v":1},{"$f":"IF('Cycle History'!$C$5=\"\",\"\",'Cycle History'!$C$5)","v":"Out Freezing chamber"},{"$f":"IF('Cycle History'!$E$3=\"\",\"\",'Cycle History'!$E$3)","v":"DATE"}]
[62,{"$f":"IF('Cycle History'!$F$5=\"\",\"\",'Cycle History'!$F$5)","v":""},{"$f":"IF('Cycle History'!$B$1=\"\",\"\",'Cycle History'!$B$1)","v":"CYCLE HISTORY"},{"$f":"IF('Cycle History'!$B$3=\"\",\"\",'Cycle History'!$B$3)","v":"CYCLE"},{"$f":"IF('Cycle History'!$B$4=\"\",\"\",'Cycle History'!$B$4)","v":1},{"$f":"IF('Cycle History'!$C$5=\"\",\"\",'Cycle History'!$C$5)","v":"Out Freezing chamber"},{"$f":"IF('Cycle History'!$F$3=\"\",\"\",'Cycle History'!$F$3)","v":"TIME IN"}]
[63,{"$f":"IF('Cycle History'!$G$5=\"\",\"\",'Cycle History'!$G$5)","v":""},{"$f":"IF('Cycle History'!$B$1=\"\",\"\",'Cycle History'!$B$1)","v":"CYCLE HISTORY"},{"$f":"IF('Cycle History'!$B$3=\"\",\"\",'Cycle History'!$B$3)","v":"CYCLE"},{"$f":"IF('Cycle History'!$B$4=\"\",\"\",'Cycle History'!$B$4)","v":1},{"$f":"IF('Cycle History'!$C$5=\"\",\"\",'Cycle History'!$C$5)","v":"Out Freezing chamber"},{"$f":"IF('Cycle History'!$G$3=\"\",\"\",'Cycle History'!$G$3)","v":"TIME OUT"}]
[64,{"$f":"IF('Cycle History'!$E$6=\"\",\"\",'Cycle History'!$E$6)","v":""},{"$f":"IF('Cycle History'!$B$1=\"\",\"\",'Cycle History'!$B$1)","v":"CYCLE HISTORY"},{"$f":"IF('Cycle History'!$B$3=\"\",\"\",'Cycle History'!$B$3)","v":"CYCLE"},{"$f":"IF('Cycle History'!$B$4=\"\",\"\",'Cycle History'!$B$4)","v":1},{"$f":"IF('Cycle History'!$C$6=\"\",\"\",'Cycle History'!$C$6)","v":"Thawed"},{"$f":"IF('Cycle History'!$E$3=\"\",\"\",'Cycle History'!$E$3)","v":"DATE"}]
[65,{"$f":"IF('Cycle History'!$F$6=\"\",\"\",'Cycle History'!$F$6)","v":""},{"$f":"IF('Cycle History'!$B$1=\"\",\"\",'Cycle History'!$B$1)","v":"CYCLE HISTORY"},{"$f":"IF('Cycle History'!$B$3=\"\",\"\",'Cycle History'!$B$3)","v":"CYCLE"},{"$f":"IF('Cycle History'!$B$4=\"\",\"\",'Cycle History'!$B$4)","v":1},{"$f":"IF('Cycle History'!$C$6=\"\",\"\",'Cycle History'!$C$6)","v":"Thawed"},{"$f":"IF('Cycle History'!$F$3=\"\",\"\",'Cycle History'!$F$3)","v":"TIME IN"}]
[66,{"$f":"IF('Cycle History'!$G$6=\"\",\"\",'Cycle History'!$G$6)","v":""},{"$f":"IF('Cycle History'!$B$1=\"\",\"\",'Cycle History'!$B$1)","v":"CYCLE HISTORY"},{"$f":"IF('Cycle History'!$B$3=\"\",\"\",'Cycle History'!$B$3)","v":"CYCLE"},{"$f":"IF('Cycle History'!$B$4=\"\",\"\",'Cycle History'!$B$4)","v":1},{"$f":"IF('Cycle History'!$C$6=\"\",\"\",'Cycle History'!$C$6)","v":"Thawed"},{"$f":"IF('Cycle History'!$G$3=\"\",\"\",'Cycle History'!$G$3)","v":"TIME OUT"}]
[67,{"$f":"IF('Cycle History'!$E$7=\"\",\"\",'Cycle History'!$E$7)","v":""},{"$f":"IF('Cycle History'!$B$1=\"\",\"\",'Cycle History'!$B$1)","v":"CYCLE HISTORY"},{"$f":"IF('Cycle History'!$B$3=\"\",\"\",'Cycle History'!$B$3)","v":"CYCLE"},{"$f":"IF('Cycle History'!$B$7=\"\",\"\",'Cycle History'!$B$7)","v":2},{"$f":"IF('Cycle History'!$C$7=\"\",\"\",'Cycle History'!$C$7)","v":"In Freezing chamber"},{"$f":"IF('Cycle History'!$E$3=\"\",\"\",'Cycle History'!$E$3)","v":"DATE"}]
[68,{"$f":"IF('Cycle History'!$F$7=\"\",\"\",'Cycle History'!$F$7)","v":""},{"$f":"IF('Cycle History'!$B$1=\"\",\"\",'Cycle History'!$B$1)","v":"CYCLE HISTORY"},{"$f":"IF('Cycle History'!$B$3=\"\",\"\",'Cycle History'!$B$3)","v":"CYCLE"},{"$f":"IF('Cycle History'!$B$7=\"\",\"\",'Cycle History'!$B$7)","v":2},{"$f":"IF('Cycle History'!$C$7=\"\",\"\",'Cycle History'!$C$7)","v":"In Freezing chamber"},{"$f":"IF('Cycle History'!$F$3=\"\",\"\",'Cycle History'!$F$3)","v":"TIME IN"}]
[69,{"$f":"IF('Cycle History'!$G$7=\"\",\"\",'Cycle History'!$G$7)","v":""},{"$f":"IF('Cycle History'!$B$1=\"\",\"\",'Cycle History'!$B$1)","v":"CYCLE HISTORY"},{"$f":"IF('Cycle History'!$B$3=\"\",\"\",'Cycle History'!$B$3)","v":"CYCLE"},{"$f":"IF('Cycle History'!$B$7=\"\",\"\",'Cycle History'!$B$7)","v":2},{"$f":"IF('Cycle History'!$C$7=\"\",\"\",'Cycle History'!$C$7)","v":"In Freezing chamber"},{"$f":"IF('Cycle History'!$G$3=\"\",\"\",'Cycle History'!$G$3)","v":"TIME OUT"}]
[70,{"$f":"IF('Cycle History'!$H$7=\"\",\"\",'Cycle History'!$H$7)","v":""},{"$f":"IF('Cycle History'!$B$1=\"\",\"\",'Cycle History'!$B$1)","v":"CYCLE HISTORY"},{"$f":"IF('Cycle History'!$B$3=\"\",\"\",'Cycle History'!$B$3)","v":"CYCLE"},{"$f":"IF('Cycle History'!$B$7=\"\",\"\",'Cycle History'!$B$7)","v":2},{"$f":"IF('Cycle History'!$C$7=\"\",\"\",'Cycle History'!$C$7)","v":"In Freezing chamber"},{"$f":"IF('Cycle History'!$H$3=\"\",\"\",'Cycle History'!$H$3)","v":"REMARKS"}]
[71,{"$f":"IF('Cycle History'!$E$8=\"\",\"\",'Cycle History'!$E$8)","v":""},{"$f":"IF('Cycle History'!$B$1=\"\",\"\",'Cycle History'!$B$1)","v":"CYCLE HISTORY"},{"$f":"IF('Cycle History'!$B$3=\"\",\"\",'Cycle History'!$B$3)","v":"CYCLE"},{"$f":"IF('Cycle History'!$B$7=\"\",\"\",'Cycle History'!$B$7)","v":2},{"$f":"IF('Cycle History'!$C$8=\"\",\"\",'Cycle History'!$C$8)","v":"Out Freezing chamber"},{"$f":"IF('Cycle History'!$E$3=\"\",\"\",'Cycle History'!$E$3)","v":"DATE"}]
[72,{"$f":"IF('Cycle History'!$F$8=\"\",\"\",'Cycle History'!$F$8)","v":""},{"$f":"IF('Cycle History'!$B$1=\"\",\"\",'Cycle History'!$B$1)","v":"CYCLE HISTORY"},{"$f":"IF('Cycle History'!$B$3=\"\",\"\",'Cycle History'!$B$3)","v":"CYCLE"},{"$f":"IF('Cycle History'!$B$7=\"\",\"\",'Cycle History'!$B$7)","v":2},{"$f":"IF('Cycle History'!$C$8=\"\",\"\",'Cycle History'!$C$8)","v":"Out Freezing chamber"},{"$f":"IF('Cycle History'!$F$3=\"\",\"\",'Cycle History'!$F$3)","v":"TIME IN"}]
[73,{"$f":"IF('Cycle History'!$G$8=\"\",\"\",'Cycle History'!$G$8)","v":""},{"$f":"IF('Cycle History'!$B$1=\"\",\"\",'Cycle History'!$B$1)","v":"CYCLE HISTORY"},{"$f":"IF('Cycle History'!$B$3=\"\",\"\",'Cycle History'!$B$3)","v":"CYCLE"},{"$f":"IF('Cycle History'!$B$7=\"\",\"\",'Cycle History'!$B$7)","v":2},{"$f":"IF('Cycle History'!$C$8=\"\",\"\",'Cycle History'!$C$8)","v":"Out Freezing chamber"},{"$f":"IF('Cycle History'!$G$3=\"\",\"\",'Cycle History'!$G$3)","v":"TIME OUT"}]
[74,{"$f":"IF('Cycle History'!$E$9=\"\",\"\",'Cycle History'!$E$9)","v":""},{"$f":"IF('Cycle History'!$B$1=\"\",\"\",'Cycle History'!$B$1)","v":"CYCLE HISTORY"},{"$f":"IF('Cycle History'!$B$3=\"\",\"\",'Cycle History'!$B$3)","v":"CYCLE"},{"$f":"IF('Cycle History'!$B$7=\"\",\"\",'Cycle History'!$B$7)","v":2},{"$f":"IF('Cycle History'!$C$9=\"\",\"\",'Cycle History'!$C$9)","v":"Thawed"},{"$f":"IF('Cycle History'!$E$3=\"\",\"\",'Cycle History'!$E$3)","v":"DATE"}]
[75,{"$f":"IF('Cycle History'!$F$9=\"\",\"\",'Cycle History'!$F$9)","v":""},{"$f":"IF('Cycle History'!$B$1=\"\",\"\",'Cycle History'!$B$1)","v":"CYCLE HISTORY"},{"$f":"IF('Cycle History'!$B$3=\"\",\"\",'Cycle History'!$B$3)","v":"CYCLE"},{"$f":"IF('Cycle History'!$B$7=\"\",\"\",'Cycle History'!$B$7)","v":2},{"$f":"IF('Cycle History'!$C$9=\"\",\"\",'Cycle History'!$C$9)","v":"Thawed"},{"$f":"IF('Cycle History'!$F$3=\"\",\"\",'Cycle History'!$F$3)","v":"TIME IN"}]
[76,{"$f":"IF('Cycle History'!$G$9=\"\",\"\",'Cycle History'!$G$9)","v":""},{"$f":"IF('Cycle History'!$B$1=\"\",\"\",'Cycle History'!$B$1)","v":"CYCLE HISTORY"},{"$f":"IF('Cycle History'!$B$3=\"\",\"\",'Cycle History'!$B$3)","v":"CYCLE"},{"$f":"IF('Cycle History'!$B$7=\"\",\"\",'Cycle History'!$B$7)","v":2},{"$f":"IF('Cycle History'!$C$9=\"\",\"\",'Cycle History'!$C$9)","v":"Thawed"},{"$f":"IF('Cycle History'!$G$3=\"\",\"\",'Cycle History'!$G$3)","v":"TIME OUT"}]
[77,{"$f":"IF('Cycle History'!$E$10=\"\",\"\",'Cycle History'!$E$10)","v":""},{"$f":"IF('Cycle History'!$B$1=\"\",\"\",'Cycle History'!$B$1)","v":"CYCLE HISTORY"},{"$f":"IF('Cycle History'!$B$3=\"\",\"\",'Cycle History'!$B$3)","v":"CYCLE"},{"$f":"IF('Cycle History'!$B$10=\"\",\"\",'Cycle History'!$B$10)","v":3},{"$f":"IF('Cycle History'!$C$10=\"\",\"\",'Cycle History'!$C$10)","v":"In Freezing chamber"},{"$f":"IF('Cycle History'!$E$3=\"\",\"\",'Cycle History'!$E$3)","v":"DATE"}]
[78,{"$f":"IF('Cycle History'!$F$10=\"\",\"\",'Cycle History'!$F$10)","v":""},{"$f":"IF('Cycle History'!$B$1=\"\",\"\",'Cycle History'!$B$1)","v":"CYCLE HISTORY"},{"$f":"IF('Cycle History'!$B$3=\"\",\"\",'Cycle History'!$B$3)","v":"CYCLE"},{"$f":"IF('Cycle History'!$B$10=\"\",\"\",'Cycle History'!$B$10)","v":3},{"$f":"IF('Cycle History'!$C$10=\"\",\"\",'Cycle History'!$C$10)","v":"In Freezing chamber"},{"$f":"IF('Cycle History'!$F$3=\"\",\"\",'Cycle History'!$F$3)","v":"TIME IN"}]
[79,{"$f":"IF('Cycle History'!$G$10=\"\",\"\",'Cycle History'!$G$10)","v":""},{"$f":"IF('Cycle History'!$B$1=\"\",\"\",'Cycle History'!$B$1)","v":"CYCLE HISTORY"},{"$f":"IF('Cycle History'!$B$3=\"\",\"\",'Cycle History'!$B$3)","v":"CYCLE"},{"$f":"IF('Cycle History'!$B$10=\"\",\"\",'Cycle History'!$B$10)","v":3},{"$f":"IF('Cycle History'!$C$10=\"\",\"\",'Cycle History'!$C$10)","v":"In Freezing chamber"},{"$f":"IF('Cycle History'!$G$3=\"\",\"\",'Cycle History'!$G$3)","v":"TIME OUT"}]
[80,{"$f":"IF('Cycle History'!$H$10=\"\",\"\",'Cycle History'!$H$10)","v":""},{"$f":"IF('Cycle History'!$B$1=\"\",\"\",'Cycle History'!$B$1)","v":"CYCLE HISTORY"},{"$f":"IF('Cycle History'!$B$3=\"\",\"\",'Cycle History'!$B$3)","v":"CYCLE"},{"$f":"IF('Cycle History'!$B$10=\"\",\"\",'Cycle History'!$B$10)","v":3},{"$f":"IF('Cycle History'!$C$10=\"\",\"\",'Cycle History'!$C$10)","v":"In Freezing chamber"},{"$f":"IF('Cycle History'!$H$3=\"\",\"\",'Cycle History'!$H$3)","v":"REMARKS"}]
[81,{"$f":"IF('Cycle History'!$E$11=\"\",\"\",'Cycle History'!$E$11)","v":""},{"$f":"IF('Cycle History'!$B$1=\"\",\"\",'Cycle History'!$B$1)","v":"CYCLE HISTORY"},{"$f":"IF('Cycle History'!$B$3=\"\",\"\",'Cycle History'!$B$3)","v":"CYCLE"},{"$f":"IF('Cycle History'!$B$10=\"\",\"\",'Cycle History'!$B$10)","v":3},{"$f":"IF('Cycle History'!$C$11=\"\",\"\",'Cycle History'!$C$11)","v":"Out Freezing chamber"},{"$f":"IF('Cycle History'!$E$3=\"\",\"\",'Cycle History'!$E$3)","v":"DATE"}]
[82,{"$f":"IF('Cycle History'!$F$11=\"\",\"\",'Cycle History'!$F$11)","v":""},{"$f":"IF('Cycle History'!$B$1=\"\",\"\",'Cycle History'!$B$1)","v":"CYCLE HISTORY"},{"$f":"IF('Cycle History'!$B$3=\"\",\"\",'Cycle History'!$B$3)","v":"CYCLE"},{"$f":"IF('Cycle History'!$B$10=\"\",\"\",'Cycle History'!$B$10)","v":3},{"$f":"IF('Cycle History'!$C$11=\"\",\"\",'Cycle History'!$C$11)","v":"Out Freezing chamber"},{"$f":"IF('Cycle History'!$F$3=\"\",\"\",'Cycle History'!$F$3)","v":"TIME IN"}]
[83,{"$f":"IF('Cycle History'!$G$11=\"\",\"\",'Cycle History'!$G$11)","v":""},{"$f":"IF('Cycle History'!$B$1=\"\",\"\",'Cycle History'!$B$1)","v":"CYCLE HISTORY"},{"$f":"IF('Cycle History'!$B$3=\"\",\"\",'Cycle History'!$B$3)","v":"CYCLE"},{"$f":"IF('Cycle History'!$B$10=\"\",\"\",'Cycle History'!$B$10)","v":3},{"$f":"IF('Cycle History'!$C$11=\"\",\"\",'Cycle History'!$C$11)","v":"Out Freezing chamber"},{"$f":"IF('Cycle History'!$G$3=\"\",\"\",'Cycle History'!$G$3)","v":"TIME OUT"}]
[84,{"$f":"IF('Cycle History'!$E$12=\"\",\"\",'Cycle History'!$E$12)","v":""},{"$f":"IF('Cycle History'!$B$1=\"\",\"\",'Cycle History'!$B$1)","v":"CYCLE HISTORY"},{"$f":"IF('Cycle History'!$B$3=\"\",\"\",'Cycle History'!$B$3)","v":"CYCLE"},{"$f":"IF('Cycle History'!$B$10=\"\",\"\",'Cycle History'!$B$10)","v":3},{"$f":"IF('Cycle History'!$C$12=\"\",\"\",'Cycle History'!$C$12)","v":"Thawed"},{"$f":"IF('Cycle History'!$E$3=\"\",\"\",'Cycle History'!$E$3)","v":"DATE"}]
[85,{"$f":"IF('Cycle History'!$F$12=\"\",\"\",'Cycle History'!$F$12)","v":""},{"$f":"IF('Cycle History'!$B$1=\"\",\"\",'Cycle History'!$B$1)","v":"CYCLE HISTORY"},{"$f":"IF('Cycle History'!$B$3=\"\",\"\",'Cycle History'!$B$3)","v":"CYCLE"},{"$f":"IF('Cycle History'!$B$10=\"\",\"\",'Cycle History'!$B$10)","v":3},{"$f":"IF('Cycle History'!$C$12=\"\",\"\",'Cycle History'!$C$12)","v":"Thawed"},{"$f":"IF('Cycle History'!$F$3=\"\",\"\",'Cycle History'!$F$3)","v":"TIME IN"}]
[86,{"$f":"IF('Cycle History'!$G$12=\"\",\"\",'Cycle History'!$G$12)","v":""},{"$f":"IF('Cycle History'!$B$1=\"\",\"\",'Cycle History'!$B$1)","v":"CYCLE HISTORY"},{"$f":"IF('Cycle History'!$B$3=\"\",\"\",'Cycle History'!$B$3)","v":"CYCLE"},{"$f":"IF('Cycle History'!$B$10=\"\",\"\",'Cycle History'!$B$10)","v":3},{"$f":"IF('Cycle History'!$C$12=\"\",\"\",'Cycle History'!$C$12)","v":"Thawed"},{"$f":"IF('Cycle History'!$G$3=\"\",\"\",'Cycle History'!$G$3)","v":"TIME OUT"}]
[87,{"$f":"IF('Cycle History'!$E$13=\"\",\"\",'Cycle History'!$E$13)","v":""},{"$f":"IF('Cycle History'!$B$1=\"\",\"\",'Cycle History'!$B$1)","v":"CYCLE HISTORY"},{"$f":"IF('Cycle History'!$B$3=\"\",\"\",'Cycle History'!$B$3)","v":"CYCLE"},{"$f":"IF('Cycle History'!$B$13=\"\",\"\",'Cycle History'!$B$13)","v":4},{"$f":"IF('Cycle History'!$C$13=\"\",\"\",'Cycle History'!$C$13)","v":"In Freezing chamber"},{"$f":"IF('Cycle History'!$E$3=\"\",\"\",'Cycle History'!$E$3)","v":"DATE"}]
[88,{"$f":"IF('Cycle History'!$F$13=\"\",\"\",'Cycle History'!$F$13)","v":""},{"$f":"IF('Cycle History'!$B$1=\"\",\"\",'Cycle History'!$B$1)","v":"CYCLE HISTORY"},{"$f":"IF('Cycle History'!$B$3=\"\",\"\",'Cycle History'!$B$3)","v":"CYCLE"},{"$f":"IF('Cycle History'!$B$13=\"\",\"\",'Cycle History'!$B$13)","v":4},{"$f":"IF('Cycle History'!$C$13=\"\",\"\",'Cycle History'!$C$13)","v":"In Freezing chamber"},{"$f":"IF('Cycle History'!$F$3=\"\",\"\",'Cycle History'!$F$3)","v":"TIME IN"}]
[89,{"$f":"IF('Cycle History'!$G$13=\"\",\"\",'Cycle History'!$G$13)","v":""},{"$f":"IF('Cycle History'!$B$1=\"\",\"\",'Cycle History'!$B$1)","v":"CYCLE HISTORY"},{"$f":"IF('Cycle History'!$B$3=\"\",\"\",'Cycle History'!$B$3)","v":"CYCLE"},{"$f":"IF('Cycle History'!$B$13=\"\",\"\",'Cycle History'!$B$13)","v":4},{"$f":"IF('Cycle History'!$C$13=\"\",\"\",'Cycle History'!$C$13)","v":"In Freezing chamber"},{"$f":"IF('Cycle History'!$G$3=\"\",\"\",'Cycle History'!$G$3)","v":"TIME OUT"}]
[90,{"$f":"IF('Cycle History'!$H$13=\"\",\"\",'Cycle History'!$H$13)","v":""},{"$f":"IF('Cycle History'!$B$1=\"\",\"\",'Cycle History'!$B$1)","v":"CYCLE HISTORY"},{"$f":"IF('Cycle History'!$B$3=\"\",\"\",'Cycle History'!$B$3)","v":"CYCLE"},{"$f":"IF('Cycle History'!$B$13=\"\",\"\",'Cycle History'!$B$13)","v":4},{"$f":"IF('Cycle History'!$C$13=\"\",\"\",'Cycle History'!$C$13)","v":"In Freezing chamber"},{"$f":"IF('Cycle History'!$H$3=\"\",\"\",'Cycle History'!$H$3)","v":"REMARKS"}]
[91,{"$f":"IF('Cycle History'!$E$14=\"\",\"\",'Cycle History'!$E$14)","v":""},{"$f":"IF('Cycle History'!$B$1=\"\",\"\",'Cycle History'!$B$1)","v":"CYCLE HISTORY"},{"$f":"IF('Cycle History'!$B$3=\"\",\"\",'Cycle History'!$B$3)","v":"CYCLE"},{"$f":"IF('Cycle History'!$B$13=\"\",\"\",'Cycle History'!$B$13)","v":4},{"$f":"IF('Cycle History'!$C$14=\"\",\"\",'Cycle History'!$C$14)","v":"Out Freezing chamber"},{"$f":"IF('Cycle History'!$E$3=\"\",\"\",'Cycle History'!$E$3)","v":"DATE"}]
[92,{"$f":"IF('Cycle History'!$F$14=\"\",\"\",'Cycle History'!$F$14)","v":""},{"$f":"IF('Cycle History'!$B$1=\"\",\"\",'Cycle History'!$B$1)","v":"CYCLE HISTORY"},{"$f":"IF('Cycle History'!$B$3=\"\",\"\",'Cycle History'!$B$3)","v":"CYCLE"},{"$f":"IF('Cycle History'!$B$13=\"\",\"\",'Cycle History'!$B$13)","v":4},{"$f":"IF('Cycle History'!$C$14=\"\",\"\",'Cycle History'!$C$14)","v":"Out Freezing chamber"},{"$f":"IF('Cycle History'!$F$3=\"\",\"\",'Cycle History'!$F$3)","v":"TIME IN"}]
[93,{"$f":"IF('Cycle History'!$G$14=\"\",\"\",'Cycle History'!$G$14)","v":""},{"$f":"IF('Cycle History'!$B$1=\"\",\"\",'Cycle History'!$B$1)","v":"CYCLE HISTORY"},{"$f":"IF('Cycle History'!$B$3=\"\",\"\",'Cycle History'!$B$3)","v":"CYCLE"},{"$f":"IF('Cycle History'!$B$13=\"\",\"\",'Cycle History'!$B$13)","v":4},{"$f":"IF('Cycle History'!$C$14=\"\",\"\",'Cycle History'!$C$14)","v":"Out Freezing chamber"},{"$f":"IF('Cycle History'!$G$3=\"\",\"\",'Cycle History'!$G$3)","v":"TIME OUT"}]
[94,{"$f":"IF('Cycle History'!$E$15=\"\",\"\",'Cycle History'!$E$15)","v":""},{"$f":"IF('Cycle History'!$B$1=\"\",\"\",'Cycle History'!$B$1)","v":"CYCLE HISTORY"},{"$f":"IF('Cycle History'!$B$3=\"\",\"\",'Cycle History'!$B$3)","v":"CYCLE"},{"$f":"IF('Cycle History'!$B$13=\"\",\"\",'Cycle History'!$B$13)","v":4},{"$f":"IF('Cycle History'!$C$15=\"\",\"\",'Cycle History'!$C$15)","v":"Thawed"},{"$f":"IF('Cycle History'!$E$3=\"\",\"\",'Cycle History'!$E$3)","v":"DATE"}]
[95,{"$f":"IF('Cycle History'!$F$15=\"\",\"\",'Cycle History'!$F$15)","v":""},{"$f":"IF('Cycle History'!$B$1=\"\",\"\",'Cycle History'!$B$1)","v":"CYCLE HISTORY"},{"$f":"IF('Cycle History'!$B$3=\"\",\"\",'Cycle History'!$B$3)","v":"CYCLE"},{"$f":"IF('Cycle History'!$B$13=\"\",\"\",'Cycle History'!$B$13)","v":4},{"$f":"IF('Cycle History'!$C$15=\"\",\"\",'Cycle History'!$C$15)","v":"Thawed"},{"$f":"IF('Cycle History'!$F$3=\"\",\"\",'Cycle History'!$F$3)","v":"TIME IN"}]
[96,{"$f":"IF('Cycle History'!$G$15=\"\",\"\",'Cycle History'!$G$15)","v":""},{"$f":"IF('Cycle History'!$B$1=\"\",\"\",'Cycle History'!$B$1)","v":"CYCLE HISTORY"},{"$f":"IF('Cycle History'!$B$3=\"\",\"\",'Cycle History'!$B$3)","v":"CYCLE"},{"$f":"IF('Cycle History'!$B$13=\"\",\"\",'Cycle History'!$B$13)","v":4},{"$f":"IF('Cycle History'!$C$15=\"\",\"\",'Cycle History'!$C$15)","v":"Thawed"},{"$f":"IF('Cycle History'!$G$3=\"\",\"\",'Cycle History'!$G$3)","v":"TIME OUT"}]
[97,{"$f":"IF('Cycle History'!$E$16=\"\",\"\",'Cycle History'!$E$16)","v":""},{"$f":"IF('Cycle History'!$B$1=\"\",\"\",'Cycle History'!$B$1)","v":"CYCLE HISTORY"},{"$f":"IF('Cycle History'!$B$3=\"\",\"\",'Cycle History'!$B$3)","v":"CYCLE"},{"$f":"IF('Cycle History'!$B$16=\"\",\"\",'Cycle History'!$B$16)","v":5},{"$f":"IF('Cycle History'!$C$16=\"\",\"\",'Cycle History'!$C$16)","v":"In Freezing chamber"},{"$f":"IF('Cycle History'!$E$3=\"\",\"\",'Cycle History'!$E$3)","v":"DATE"}]
[98,{"$f":"IF('Cycle History'!$F$16=\"\",\"\",'Cycle History'!$F$16)","v":""},{"$f":"IF('Cycle History'!$B$1=\"\",\"\",'Cycle History'!$B$1)","v":"CYCLE HISTORY"},{"$f":"IF('Cycle History'!$B$3=\"\",\"\",'Cycle History'!$B$3)","v":"CYCLE"},{"$f":"IF('Cycle History'!$B$16=\"\",\"\",'Cycle History'!$B$16)","v":5},{"$f":"IF('Cycle History'!$C$16=\"\",\"\",'Cycle History'!$C$16)","v":"In Freezing chamber"},{"$f":"IF('Cycle History'!$F$3=\"\",\"\",'Cycle History'!$F$3)","v":"TIME IN"}]
[99,{"$f":"IF('Cycle History'!$G$16=\"\",\"\",'Cycle History'!$G$16)","v":""},{"$f":"IF('Cycle History'!$B$1=\"\",\"\",'Cycle History'!$B$1)","v":"CYCLE HISTORY"},{"$f":"IF('Cycle History'!$B$3=\"\",\"\",'Cycle History'!$B$3)","v":"CYCLE"},{"$f":"IF('Cycle History'!$B$16=\"\",\"\",'Cycle History'!$B$16)","v":5},{"$f":"IF('Cycle History'!$C$16=\"\",\"\",'Cycle History'!$C$16)","v":"In Freezing chamber"},{"$f":"IF('Cycle History'!$G$3=\"\",\"\",'Cycle History'!$G$3)","v":"TIME OUT"}]
[100,{"$f":"IF('Cycle History'!$H$16=\"\",\"\",'Cycle History'!$H$16)","v":""},{"$f":"IF('Cycle History'!$B$1=\"\",\"\",'Cycle History'!$B$1)","v":"CYCLE HISTORY"},{"$f":"IF('Cycle History'!$B$3=\"\",\"\",'Cycle History'!$B$3)","v":"CYCLE"},{"$f":"IF('Cycle History'!$B$16=\"\",\"\",'Cycle History'!$B$16)","v":5},{"$f":"IF('Cycle History'!$C$16=\"\",\"\",'Cycle History'!$C$16)","v":"In Freezing chamber"},{"$f":"IF('Cycle History'!$H$3=\"\",\"\",'Cycle History'!$H$3)","v":"REMARKS"}]
[101,{"$f":"IF('Cycle History'!$E$17=\"\",\"\",'Cycle History'!$E$17)","v":""},{"$f":"IF('Cycle History'!$B$1=\"\",\"\",'Cycle History'!$B$1)","v":"CYCLE HISTORY"},{"$f":"IF('Cycle History'!$B$3=\"\",\"\",'Cycle History'!$B$3)","v":"CYCLE"},{"$f":"IF('Cycle History'!$B$16=\"\",\"\",'Cycle History'!$B$16)","v":5},{"$f":"IF('Cycle History'!$C$17=\"\",\"\",'Cycle History'!$C$17)","v":"Out Freezing chamber"},{"$f":"IF('Cycle History'!$E$3=\"\",\"\",'Cycle History'!$E$3)","v":"DATE"}]
[102,{"$f":"IF('Cycle History'!$F$17=\"\",\"\",'Cycle History'!$F$17)","v":""},{"$f":"IF('Cycle History'!$B$1=\"\",\"\",'Cycle History'!$B$1)","v":"CYCLE HISTORY"},{"$f":"IF('Cycle History'!$B$3=\"\",\"\",'Cycle History'!$B$3)","v":"CYCLE"},{"$f":"IF('Cycle History'!$B$16=\"\",\"\",'Cycle History'!$B$16)","v":5},{"$f":"IF('Cycle History'!$C$17=\"\",\"\",'Cycle History'!$C$17)","v":"Out Freezing chamber"},{"$f":"IF('Cycle History'!$F$3=\"\",\"\",'Cycle History'!$F$3)","v":"TIME IN"}]
[103,{"$f":"IF('Cycle History'!$G$17=\"\",\"\",'Cycle History'!$G$17)","v":""},{"$f":"IF('Cycle History'!$B$1=\"\",\"\",'Cycle History'!$B$1)","v":"CYCLE HISTORY"},{"$f":"IF('Cycle History'!$B$3=\"\",\"\",'Cycle History'!$B$3)","v":"CYCLE"},{"$f":"IF('Cycle History'!$B$16=\"\",\"\",'Cycle History'!$B$16)","v":5},{"$f":"IF('Cycle History'!$C$17=\"\",\"\",'Cycle History'!$C$17)","v":"Out Freezing chamber"},{"$f":"IF('Cycle History'!$G$3=\"\",\"\",'Cycle History'!$G$3)","v":"TIME OUT"}]
[104,{"$f":"IF('Cycle History'!$E$18=\"\",\"\",'Cycle History'!$E$18)","v":""},{"$f":"IF('Cycle History'!$B$1=\"\",\"\",'Cycle History'!$B$1)","v":"CYCLE HISTORY"},{"$f":"IF('Cycle History'!$B$3=\"\",\"\",'Cycle History'!$B$3)","v":"CYCLE"},{"$f":"IF('Cycle History'!$B$16=\"\",\"\",'Cycle History'!$B$16)","v":5},{"$f":"IF('Cycle History'!$C$18=\"\",\"\",'Cycle History'!$C$18)","v":"Thawed"},{"$f":"IF('Cycle History'!$E$3=\"\",\"\",'Cycle History'!$E$3)","v":"DATE"}]
[105,{"$f":"IF('Cycle History'!$F$18=\"\",\"\",'Cycle History'!$F$18)","v":""},{"$f":"IF('Cycle History'!$B$1=\"\",\"\",'Cycle History'!$B$1)","v":"CYCLE HISTORY"},{"$f":"IF('Cycle History'!$B$3=\"\",\"\",'Cycle History'!$B$3)","v":"CYCLE"},{"$f":"IF('Cycle History'!$B$16=\"\",\"\",'Cycle History'!$B$16)","v":5},{"$f":"IF('Cycle History'!$C$18=\"\",\"\",'Cycle History'!$C$18)","v":"Thawed"},{"$f":"IF('Cycle History'!$F$3=\"\",\"\",'Cycle History'!$F$3)","v":"TIME IN"}]
[106,{"$f":"IF('Cycle History'!$G$18=\"\",\"\",'Cycle History'!$G$18)","v":""},{"$f":"IF('Cycle History'!$B$1=\"\",\"\",'Cycle History'!$B$1)","v":"CYCLE HISTORY"},{"$f":"IF('Cycle History'!$B$3=\"\",\"\",'Cycle History'!$B$3)","v":"CYCLE"},{"$f":"IF('Cycle History'!$B$16=\"\",\"\",'Cycle History'!$B$16)","v":5},{"$f":"IF('Cycle History'!$C$18=\"\",\"\",'Cycle History'!$C$18)","v":"Thawed"},{"$f":"IF('Cycle History'!$G$3=\"\",\"\",'Cycle History'!$G$3)","v":"TIME OUT"}]
[107,{"$f":"IF('Cycle History'!$E$19=\"\",\"\",'Cycle History'!$E$19)","v":""},{"$f":"IF('Cycle History'!$B$1=\"\",\"\",'Cycle History'!$B$1)","v":"CYCLE HISTORY"},{"$f":"IF('Cycle History'!$B$3=\"\",\"\",'Cycle History'!$B$3)","v":"CYCLE"},{"$f":"IF('Cycle History'!$B$19=\"\",\"\",'Cycle History'!$B$19)","v":6},{"$f":"IF('Cycle History'!$C$19=\"\",\"\",'Cycle History'!$C$19)","v":"In Freezing chamber"},{"$f":"IF('Cycle History'!$E$3=\"\",\"\",'Cycle History'!$E$3)","v":"DATE"}]
[108,{"$f":"IF('Cycle History'!$F$19=\"\",\"\",'Cycle History'!$F$19)","v":""},{"$f":"IF('Cycle History'!$B$1=\"\",\"\",'Cycle History'!$B$1)","v":"CYCLE HISTORY"},{"$f":"IF('Cycle History'!$B$3=\"\",\"\",'Cycle History'!$B$3)","v":"CYCLE"},{"$f":"IF('Cycle History'!$B$19=\"\",\"\",'Cycle History'!$B$19)","v":6},{"$f":"IF('Cycle History'!$C$19=\"\",\"\",'Cycle History'!$C$19)","v":"In Freezing chamber"},{"$f":"IF('Cycle History'!$F$3=\"\",\"\",'Cycle History'!$F$3)","v":"TIME IN"}]
[109,{"$f":"IF('Cycle History'!$G$19=\"\",\"\",'Cycle History'!$G$19)","v":""},{"$f":"IF('Cycle History'!$B$1=\"\",\"\",'Cycle History'!$B$1)","v":"CYCLE HISTORY"},{"$f":"IF('Cycle History'!$B$3=\"\",\"\",'Cycle History'!$B$3)","v":"CYCLE"},{"$f":"IF('Cycle History'!$B$19=\"\",\"\",'Cycle History'!$B$19)","v":6},{"$f":"IF('Cycle History'!$C$19=\"\",\"\",'Cycle History'!$C$19)","v":"In Freezing chamber"},{"$f":"IF('Cycle History'!$G$3=\"\",\"\",'Cycle History'!$G$3)","v":"TIME OUT"}]
[110,{"$f":"IF('Cycle History'!$H$19=\"\",\"\",'Cycle History'!$H$19)","v":""},{"$f":"IF('Cycle History'!$B$1=\"\",\"\",'Cycle History'!$B$1)","v":"CYCLE HISTORY"},{"$f":"IF('Cycle History'!$B$3=\"\",\"\",'Cycle History'!$B$3)","v":"CYCLE"},{"$f":"IF('Cycle History'!$B$19=\"\",\"\",'Cycle History'!$B$19)","v":6},{"$f":"IF('Cycle History'!$C$19=\"\",\"\",'Cycle History'!$C$19)","v":"In Freezing chamber"},{"$f":"IF('Cycle History'!$H$3=\"\",\"\",'Cycle History'!$H$3)","v":"REMARKS"}]
[111,{"$f":"IF('Cycle History'!$E$20=\"\",\"\",'Cycle History'!$E$20)","v":""},{"$f":"IF('Cycle History'!$B$1=\"\",\"\",'Cycle History'!$B$1)","v":"CYCLE HISTORY"},{"$f":"IF('Cycle History'!$B$3=\"\",\"\",'Cycle History'!$B$3)","v":"CYCLE"},{"$f":"IF('Cycle History'!$B$19=\"\",\"\",'Cycle History'!$B$19)","v":6},{"$f":"IF('Cycle History'!$C$20=\"\",\"\",'Cycle History'!$C$20)","v":"Out Freezing chamber"},{"$f":"IF('Cycle History'!$E$3=\"\",\"\",'Cycle History'!$E$3)","v":"DATE"}]
[112,{"$f":"IF('Cycle History'!$F$20=\"\",\"\",'Cycle History'!$F$20)","v":""},{"$f":"IF('Cycle History'!$B$1=\"\",\"\",'Cycle History'!$B$1)","v":"CYCLE HISTORY"},{"$f":"IF('Cycle History'!$B$3=\"\",\"\",'Cycle History'!$B$3)","v":"CYCLE"},{"$f":"IF('Cycle History'!$B$19=\"\",\"\",'Cycle History'!$B$19)","v":6},{"$f":"IF('Cycle History'!$C$20=\"\",\"\",'Cycle History'!$C$20)","v":"Out Freezing chamber"},{"$f":"IF('Cycle History'!$F$3=\"\",\"\",'Cycle History'!$F$3)","v":"TIME IN"}]
[113,{"$f":"IF('Cycle History'!$G$20=\"\",\"\",'Cycle History'!$G$20)","v":""},{"$f":"IF('Cycle History'!$B$1=\"\",\"\",'Cycle History'!$B$1)","v":"CYCLE HISTORY"},{"$f":"IF('Cycle History'!$B$3=\"\",\"\",'Cycle History'!$B$3)","v":"CYCLE"},{"$f":"IF('Cycle History'!$B$19=\"\",\"\",'Cycle History'!$B$19)","v":6},{"$f":"IF('Cycle History'!$C$20=\"\",\"\",'Cycle History'!$C$20)","v":"Out Freezing chamber"},{"$f":"IF('Cycle History'!$G$3=\"\",\"\",'Cycle History'!$G$3)","v":"TIME OUT"}]
[114,{"$f":"IF('Cycle History'!$E$21=\"\",\"\",'Cycle History'!$E$21)","v":""},{"$f":"IF('Cycle History'!$B$1=\"\",\"\",'Cycle History'!$B$1)","v":"CYCLE HISTORY"},{"$f":"IF('Cycle History'!$B$3=\"\",\"\",'Cycle History'!$B$3)","v":"CYCLE"},{"$f":"IF('Cycle History'!$B$19=\"\",\"\",'Cycle History'!$B$19)","v":6},{"$f":"IF('Cycle History'!$C$21=\"\",\"\",'Cycle History'!$C$21)","v":"Thawed"},{"$f":"IF('Cycle History'!$E$3=\"\",\"\",'Cycle History'!$E$3)","v":"DATE"}]
[115,{"$f":"IF('Cycle History'!$F$21=\"\",\"\",'Cycle History'!$F$21)","v":""},{"$f":"IF('Cycle History'!$B$1=\"\",\"\",'Cycle History'!$B$1)","v":"CYCLE HISTORY"},{"$f":"IF('Cycle History'!$B$3=\"\",\"\",'Cycle History'!$B$3)","v":"CYCLE"},{"$f":"IF('Cycle History'!$B$19=\"\",\"\",'Cycle History'!$B$19)","v":6},{"$f":"IF('Cycle History'!$C$21=\"\",\"\",'Cycle History'!$C$21)","v":"Thawed"},{"$f":"IF('Cycle History'!$F$3=\"\",\"\",'Cycle History'!$F$3)","v":"TIME IN"}]
[116,{"$f":"IF('Cycle History'!$G$21=\"\",\"\",'Cycle History'!$G$21)","v":""},{"$f":"IF('Cycle History'!$B$1=\"\",\"\",'Cycle History'!$B$1)","v":"CYCLE HISTORY"},{"$f":"IF('Cycle History'!$B$3=\"\",\"\",'Cycle History'!$B$3)","v":"CYCLE"},{"$f":"IF('Cycle History'!$B$19=\"\",\"\",'Cycle History'!$B$19)","v":6},{"$f":"IF('Cycle History'!$C$21=\"\",\"\",'Cycle History'!$C$21)","v":"Thawed"},{"$f":"IF('Cycle History'!$G$3=\"\",\"\",'Cycle History'!$G$3)","v":"TIME OUT"}]
[117,{"$f":"IF('Cycle History'!$E$22=\"\",\"\",'Cycle History'!$E$22)","v":""},{"$f":"IF('Cycle History'!$B$1=\"\",\"\",'Cycle History'!$B$1)","v":"CYCLE HISTORY"},{"$f":"IF('Cycle History'!$B$3=\"\",\"\",'Cycle History'!$B$3)","v":"CYCLE"},{"$f":"IF('Cycle History'!$B$22=\"\",\"\",'Cycle History'!$B$22)","v":7},{"$f":"IF('Cycle History'!$C$22=\"\",\"\",'Cycle History'!$C$22)","v":"In Freezing chamber"},{"$f":"IF('Cycle History'!$E$3=\"\",\"\",'Cycle History'!$E$3)","v":"DATE"}]
[118,{"$f":"IF('Cycle History'!$F$22=\"\",\"\",'Cycle History'!$F$22)","v":""},{"$f":"IF('Cycle History'!$B$1=\"\",\"\",'Cycle History'!$B$1)","v":"CYCLE HISTORY"},{"$f":"IF('Cycle History'!$B$3=\"\",\"\",'Cycle History'!$B$3)","v":"CYCLE"},{"$f":"IF('Cycle History'!$B$22=\"\",\"\",'Cycle History'!$B$22)","v":7},{"$f":"IF('Cycle History'!$C$22=\"\",\"\",'Cycle History'!$C$22)","v":"In Freezing chamber"},{"$f":"IF('Cycle History'!$F$3=\"\",\"\",'Cycle History'!$F$3)","v":"TIME IN"}]
[119,{"$f":"IF('Cycle History'!$G$22=\"\",\"\",'Cycle History'!$G$22)","v":""},{"$f":"IF('Cycle History'!$B$1=\"\",\"\",'Cycle History'!$B$1)","v":"CYCLE HISTORY"},{"$f":"IF('Cycle History'!$B$3=\"\",\"\",'Cycle History'!$B$3)","v":"CYCLE"},{"$f":"IF('Cycle History'!$B$22=\"\",\"\",'Cycle History'!$B$22)","v":7},{"$f":"IF('Cycle History'!$C$22=\"\",\"\",'Cycle History'!$C$22)","v":"In Freezing chamber"},{"$f":"IF('Cycle History'!$G$3=\"\",\"\",'Cycle History'!$G$3)","v":"TIME OUT"}]
[120,{"$f":"IF('Cycle History'!$H$22=\"\",\"\",'Cycle History'!$H$22)","v":""},{"$f":"IF('Cycle History'!$B$1=\"\",\"\",'Cycle History'!$B$1)","v":"CYCLE HISTORY"},{"$f":"IF('Cycle History'!$B$3=\"\",\"\",'Cycle History'!$B$3)","v":"CYCLE"},{"$f":"IF('Cycle History'!$B$22=\"\",\"\",'Cycle History'!$B$22)","v":7},{"$f":"IF('Cycle History'!$C$22=\"\",\"\",'Cycle History'!$C$22)","v":"In Freezing chamber"},{"$f":"IF('Cycle History'!$H$3=\"\",\"\",'Cycle History'!$H$3)","v":"REMARKS"}]
[121,{"$f":"IF('Cycle History'!$E$23=\"\",\"\",'Cycle History'!$E$23)","v":""},{"$f":"IF('Cycle History'!$B$1=\"\",\"\",'Cycle History'!$B$1)","v":"CYCLE HISTORY"},{"$f":"IF('Cycle History'!$B$3=\"\",\"\",'Cycle History'!$B$3)","v":"CYCLE"},{"$f":"IF('Cycle History'!$B$22=\"\",\"\",'Cycle History'!$B$22)","v":7},{"$f":"IF('Cycle History'!$C$23=\"\",\"\",'Cycle History'!$C$23)","v":"Out Freezing chamber"},{"$f":"IF('Cycle History'!$E$3=\"\",\"\",'Cycle History'!$E$3)","v":"DATE"}]
[122,{"$f":"IF('Cycle History'!$F$23=\"\",\"\",'Cycle History'!$F$23)","v":""},{"$f":"IF('Cycle History'!$B$1=\"\",\"\",'Cycle History'!$B$1)","v":"CYCLE HISTORY"},{"$f":"IF('Cycle History'!$B$3=\"\",\"\",'Cycle History'!$B$3)","v":"CYCLE"},{"$f":"IF('Cycle History'!$B$22=\"\",\"\",'Cycle History'!$B$22)","v":7},{"$f":"IF('Cycle History'!$C$23=\"\",\"\",'Cycle History'!$C$23)","v":"Out Freezing chamber"},{"$f":"IF('Cycle History'!$F$3=\"\",\"\",'Cycle History'!$F$3)","v":"TIME IN"}]
[123,{"$f":"IF('Cycle History'!$G$23=\"\",\"\",'Cycle History'!$G$23)","v":""},{"$f":"IF('Cycle History'!$B$1=\"\",\"\",'Cycle History'!$B$1)","v":"CYCLE HISTORY"},{"$f":"IF('Cycle History'!$B$3=\"\",\"\",'Cycle History'!$B$3)","v":"CYCLE"},{"$f":"IF('Cycle History'!$B$22=\"\",\"\",'Cycle History'!$B$22)","v":7},{"$f":"IF('Cycle History'!$C$23=\"\",\"\",'Cycle History'!$C$23)","v":"Out Freezing chamber"},{"$f":"IF('Cycle History'!$G$3=\"\",\"\",'Cycle History'!$G$3)","v":"TIME OUT"}]
[124,{"$f":"IF('Cycle History'!$E$24=\"\",\"\",'Cycle History'!$E$24)","v":""},{"$f":"IF('Cycle History'!$B$1=\"\",\"\",'Cycle History'!$B$1)","v":"CYCLE HISTORY"},{"$f":"IF('Cycle History'!$B$3=\"\",\"\",'Cycle History'!$B$3)","v":"CYCLE"},{"$f":"IF('Cycle History'!$B$22=\"\",\"\",'Cycle History'!$B$22)","v":7},{"$f":"IF('Cycle History'!$C$24=\"\",\"\",'Cycle History'!$C$24)","v":"Thawed"},{"$f":"IF('Cycle History'!$E$3=\"\",\"\",'Cycle History'!$E$3)","v":"DATE"}]
[125,{"$f":"IF('Cycle History'!$F$24=\"\",\"\",'Cycle History'!$F$24)","v":""},{"$f":"IF('Cycle History'!$B$1=\"\",\"\",'Cycle History'!$B$1)","v":"CYCLE HISTORY"},{"$f":"IF('Cycle History'!$B$3=\"\",\"\",'Cycle History'!$B$3)","v":"CYCLE"},{"$f":"IF('Cycle History'!$B$22=\"\",\"\",'Cycle History'!$B$22)","v":7},{"$f":"IF('Cycle History'!$C$24=\"\",\"\",'Cycle History'!$C$24)","v":"Thawed"},{"$f":"IF('Cycle History'!$F$3=\"\",\"\",'Cycle History'!$F$3)","v":"TIME IN"}]
[126,{"$f":"IF('Cycle History'!$G$24=\"\",\"\",'Cycle History'!$G$24)","v":""},{"$f":"IF('Cycle History'!$B$1=\"\",\"\",'Cycle History'!$B$1)","v":"CYCLE HISTORY"},{"$f":"IF('Cycle History'!$B$3=\"\",\"\",'Cycle History'!$B$3)","v":"CYCLE"},{"$f":"IF('Cycle History'!$B$22=\"\",\"\",'Cycle History'!$B$22)","v":7},{"$f":"IF('Cycle History'!$C$24=\"\",\"\",'Cycle History'!$C$24)","v":"Thawed"},{"$f":"IF('Cycle History'!$G$3=\"\",\"\",'Cycle History'!$G$3)","v":"TIME OUT"}]
[127,{"$f":"IF('Cycle History'!$E$25=\"\",\"\",'Cycle History'!$E$25)","v":""},{"$f":"IF('Cycle History'!$B$1=\"\",\"\",'Cycle History'!$B$1)","v":"CYCLE HISTORY"},{"$f":"IF('Cycle History'!$B$3=\"\",\"\",'Cycle History'!$B$3)","v":"CYCLE"},{"$f":"IF('Cycle History'!$B$25=\"\",\"\",'Cycle History'!$B$25)","v":8},{"$f":"IF('Cycle History'!$C$25=\"\",\"\",'Cycle History'!$C$25)","v":"In Freezing chamber"},{"$f":"IF('Cycle History'!$E$3=\"\",\"\",'Cycle History'!$E$3)","v":"DATE"}]
[128,{"$f":"IF('Cycle History'!$F$25=\"\",\"\",'Cycle History'!$F$25)","v":""},{"$f":"IF('Cycle History'!$B$1=\"\",\"\",'Cycle History'!$B$1)","v":"CYCLE HISTORY"},{"$f":"IF('Cycle History'!$B$3=\"\",\"\",'Cycle History'!$B$3)","v":"CYCLE"},{"$f":"IF('Cycle History'!$B$25=\"\",\"\",'Cycle History'!$B$25)","v":8},{"$f":"IF('Cycle History'!$C$25=\"\",\"\",'Cycle History'!$C$25)","v":"In Freezing chamber"},{"$f":"IF('Cycle History'!$F$3=\"\",\"\",'Cycle History'!$F$3)","v":"TIME IN"}]
[129,{"$f":"IF('Cycle History'!$G$25=\"\",\"\",'Cycle History'!$G$25)","v":""},{"$f":"IF('Cycle History'!$B$1=\"\",\"\",'Cycle History'!$B$1)","v":"CYCLE HISTORY"},{"$f":"IF('Cycle History'!$B$3=\"\",\"\",'Cycle History'!$B$3)","v":"CYCLE"},{"$f":"IF('Cycle History'!$B$25=\"\",\"\",'Cycle History'!$B$25)","v":8},{"$f":"IF('Cycle History'!$C$25=\"\",\"\",'Cycle History'!$C$25)","v":"In Freezing chamber"},{"$f":"IF('Cycle History'!$G$3=\"\",\"\",'Cycle History'!$G$3)","v":"TIME OUT"}]
[130,{"$f":"IF('Cycle History'!$H$25=\"\",\"\",'Cycle History'!$H$25)","v":""},{"$f":"IF('Cycle History'!$B$1=\"\",\"\",'Cycle History'!$B$1)","v":"CYCLE HISTORY"},{"$f":"IF('Cycle History'!$B$3=\"\",\"\",'Cycle History'!$B$3)","v":"CYCLE"},{"$f":"IF('Cycle History'!$B$25=\"\",\"\",'Cycle History'!$B$25)","v":8},{"$f":"IF('Cycle History'!$C$25=\"\",\"\",'Cycle History'!$C$25)","v":"In Freezing chamber"},{"$f":"IF('Cycle History'!$H$3=\"\",\"\",'Cycle History'!$H$3)","v":"REMARKS"}]
[131,{"$f":"IF('Cycle History'!$E$26=\"\",\"\",'Cycle History'!$E$26)","v":""},{"$f":"IF('Cycle History'!$B$1=\"\",\"\",'Cycle History'!$B$1)","v":"CYCLE HISTORY"},{"$f":"IF('Cycle History'!$B$3=\"\",\"\",'Cycle History'!$B$3)","v":"CYCLE"},{"$f":"IF('Cycle History'!$B$25=\"\",\"\",'Cycle History'!$B$25)","v":8},{"$f":"IF('Cycle History'!$C$26=\"\",\"\",'Cycle History'!$C$26)","v":"Out Freezing chamber"},{"$f":"IF('Cycle History'!$E$3=\"\",\"\",'Cycle History'!$E$3)","v":"DATE"}]
[132,{"$f":"IF('Cycle History'!$F$26=\"\",\"\",'Cycle History'!$F$26)","v":""},{"$f":"IF('Cycle History'!$B$1=\"\",\"\",'Cycle History'!$B$1)","v":"CYCLE HISTORY"},{"$f":"IF('Cycle History'!$B$3=\"\",\"\",'Cycle History'!$B$3)","v":"CYCLE"},{"$f":"IF('Cycle History'!$B$25=\"\",\"\",'Cycle History'!$B$25)","v":8},{"$f":"IF('Cycle History'!$C$26=\"\",\"\",'Cycle History'!$C$26)","v":"Out Freezing chamber"},{"$f":"IF('Cycle History'!$F$3=\"\",\"\",'Cycle History'!$F$3)","v":"TIME IN"}]
[133,{"$f":"IF('Cycle History'!$G$26=\"\",\"\",'Cycle History'!$G$26)","v":""},{"$f":"IF('Cycle History'!$B$1=\"\",\"\",'Cycle History'!$B$1)","v":"CYCLE HISTORY"},{"$f":"IF('Cycle History'!$B$3=\"\",\"\",'Cycle History'!$B$3)","v":"CYCLE"},{"$f":"IF('Cycle History'!$B$25=\"\",\"\",'Cycle History'!$B$25)","v":8},{"$f":"IF('Cycle History'!$C$26=\"\",\"\",'Cycle History'!$C$26)","v":"Out Freezing chamber"},{"$f":"IF('Cycle History'!$G$3=\"\",\"\",'Cycle History'!$G$3)","v":"TIME OUT"}]
[134,{"$f":"IF('Cycle History'!$E$27=\"\",\"\",'Cycle History'!$E$27)","v":""},{"$f":"IF('Cycle History'!$B$1=\"\",\"\",'Cycle History'!$B$1)","v":"CYCLE HISTORY"},{"$f":"IF('Cycle History'!$B$3=\"\",\"\",'Cycle History'!$B$3)","v":"CYCLE"},{"$f":"IF('Cycle History'!$B$25=\"\",\"\",'Cycle History'!$B$25)","v":8},{"$f":"IF('Cycle History'!$C$27=\"\",\"\",'Cycle History'!$C$27)","v":"Thawed"},{"$f":"IF('Cycle History'!$E$3=\"\",\"\",'Cycle History'!$E$3)","v":"DATE"}]
[135,{"$f":"IF('Cycle History'!$F$27=\"\",\"\",'Cycle History'!$F$27)","v":""},{"$f":"IF('Cycle History'!$B$1=\"\",\"\",'Cycle History'!$B$1)","v":"CYCLE HISTORY"},{"$f":"IF('Cycle History'!$B$3=\"\",\"\",'Cycle History'!$B$3)","v":"CYCLE"},{"$f":"IF('Cycle History'!$B$25=\"\",\"\",'Cycle History'!$B$25)","v":8},{"$f":"IF('Cycle History'!$C$27=\"\",\"\",'Cycle History'!$C$27)","v":"Thawed"},{"$f":"IF('Cycle History'!$F$3=\"\",\"\",'Cycle History'!$F$3)","v":"TIME IN"}]
[136,{"$f":"IF('Cycle History'!$G$27=\"\",\"\",'Cycle History'!$G$27)","v":""},{"$f":"IF('Cycle History'!$B$1=\"\",\"\",'Cycle History'!$B$1)","v":"CYCLE HISTORY"},{"$f":"IF('Cycle History'!$B$3=\"\",\"\",'Cycle History'!$B$3)","v":"CYCLE"},{"$f":"IF('Cycle History'!$B$25=\"\",\"\",'Cycle History'!$B$25)","v":8},{"$f":"IF('Cycle History'!$C$27=\"\",\"\",'Cycle History'!$C$27)","v":"Thawed"},{"$f":"IF('Cycle History'!$G$3=\"\",\"\",'Cycle History'!$G$3)","v":"TIME OUT"}]
[137,{"$f":"IF('Cycle History'!$E$28=\"\",\"\",'Cycle History'!$E$28)","v":""},{"$f":"IF('Cycle History'!$B$1=\"\",\"\",'Cycle History'!$B$1)","v":"CYCLE HISTORY"},{"$f":"IF('Cycle History'!$B$3=\"\",\"\",'Cycle History'!$B$3)","v":"CYCLE"},{"$f":"IF('Cycle History'!$B$28=\"\",\"\",'Cycle History'!$B$28)","v":9},{"$f":"IF('Cycle History'!$C$28=\"\",\"\",'Cycle History'!$C$28)","v":"In Freezing chamber"},{"$f":"IF('Cycle History'!$E$3=\"\",\"\",'Cycle History'!$E$3)","v":"DATE"}]
[138,{"$f":"IF('Cycle History'!$F$28=\"\",\"\",'Cycle History'!$F$28)","v":""},{"$f":"IF('Cycle History'!$B$1=\"\",\"\",'Cycle History'!$B$1)","v":"CYCLE HISTORY"},{"$f":"IF('Cycle History'!$B$3=\"\",\"\",'Cycle History'!$B$3)","v":"CYCLE"},{"$f":"IF('Cycle History'!$B$28=\"\",\"\",'Cycle History'!$B$28)","v":9},{"$f":"IF('Cycle History'!$C$28=\"\",\"\",'Cycle History'!$C$28)","v":"In Freezing chamber"},{"$f":"IF('Cycle History'!$F$3=\"\",\"\",'Cycle History'!$F$3)","v":"TIME IN"}]
[139,{"$f":"IF('Cycle History'!$G$28=\"\",\"\",'Cycle History'!$G$28)","v":""},{"$f":"IF('Cycle History'!$B$1=\"\",\"\",'Cycle History'!$B$1)","v":"CYCLE HISTORY"},{"$f":"IF('Cycle History'!$B$3=\"\",\"\",'Cycle History'!$B$3)","v":"CYCLE"},{"$f":"IF('Cycle History'!$B$28=\"\",\"\",'Cycle History'!$B$28)","v":9},{"$f":"IF('Cycle History'!$C$28=\"\",\"\",'Cycle History'!$C$28)","v":"In Freezing chamber"},{"$f":"IF('Cycle History'!$G$3=\"\",\"\",'Cycle History'!$G$3)","v":"TIME OUT"}]
[140,{"$f":"IF('Cycle History'!$H$28=\"\",\"\",'Cycle History'!$H$28)","v":""},{"$f":"IF('Cycle History'!$B$1=\"\",\"\",'Cycle History'!$B$1)","v":"CYCLE HISTORY"},{"$f":"IF('Cycle History'!$B$3=\"\",\"\",'Cycle History'!$B$3)","v":"CYCLE"},{"$f":"IF('Cycle History'!$B$28=\"\",\"\",'Cycle History'!$B$28)","v":9},{"$f":"IF('Cycle History'!$C$28=\"\",\"\",'Cycle History'!$C$28)","v":"In Freezing chamber"},{"$f":"IF('Cycle History'!$H$3=\"\",\"\",'Cycle History'!$H$3)","v":"REMARKS"}]
[141,{"$f":"IF('Cycle History'!$E$29=\"\",\"\",'Cycle History'!$E$29)","v":""},{"$f":"IF('Cycle History'!$B$1=\"\",\"\",'Cycle History'!$B$1)","v":"CYCLE HISTORY"},{"$f":"IF('Cycle History'!$B$3=\"\",\"\",'Cycle History'!$B$3)","v":"CYCLE"},{"$f":"IF('Cycle History'!$B$28=\"\",\"\",'Cycle History'!$B$28)","v":9},{"$f":"IF('Cycle History'!$C$29=\"\",\"\",'Cycle History'!$C$29)","v":"Out Freezing chamber"},{"$f":"IF('Cycle History'!$E$3=\"\",\"\",'Cycle History'!$E$3)","v":"DATE"}]
[142,{"$f":"IF('Cycle History'!$F$29=\"\",\"\",'Cycle History'!$F$29)","v":""},{"$f":"IF('Cycle History'!$B$1=\"\",\"\",'Cycle History'!$B$1)","v":"CYCLE HISTORY"},{"$f":"IF('Cycle History'!$B$3=\"\",\"\",'Cycle History'!$B$3)","v":"CYCLE"},{"$f":"IF('Cycle History'!$B$28=\"\",\"\",'Cycle History'!$B$28)","v":9},{"$f":"IF('Cycle History'!$C$29=\"\",\"\",'Cycle History'!$C$29)","v":"Out Freezing chamber"},{"$f":"IF('Cycle History'!$F$3=\"\",\"\",'Cycle History'!$F$3)","v":"TIME IN"}]
[143,{"$f":"IF('Cycle History'!$G$29=\"\",\"\",'Cycle History'!$G$29)","v":""},{"$f":"IF('Cycle History'!$B$1=\"\",\"\",'Cycle History'!$B$1)","v":"CYCLE HISTORY"},{"$f":"IF('Cycle History'!$B$3=\"\",\"\",'Cycle History'!$B$3)","v":"CYCLE"},{"$f":"IF('Cycle History'!$B$28=\"\",\"\",'Cycle History'!$B$28)","v":9},{"$f":"IF('Cycle History'!$C$29=\"\",\"\",'Cycle History'!$C$29)","v":"Out Freezing chamber"},{"$f":"IF('Cycle History'!$G$3=\"\",\"\",'Cycle History'!$G$3)","v":"TIME OUT"}]
[144,{"$f":"IF('Cycle History'!$E$30=\"\",\"\",'Cycle History'!$E$30)","v":""},{"$f":"IF('Cycle History'!$B$1=\"\",\"\",'Cycle History'!$B$1)","v":"CYCLE HISTORY"},{"$f":"IF('Cycle History'!$B$3=\"\",\"\",'Cycle History'!$B$3)","v":"CYCLE"},{"$f":"IF('Cycle History'!$B$28=\"\",\"\",'Cycle History'!$B$28)","v":9},{"$f":"IF('Cycle History'!$C$30=\"\",\"\",'Cycle History'!$C$30)","v":"Thawed"},{"$f":"IF('Cycle History'!$E$3=\"\",\"\",'Cycle History'!$E$3)","v":"DATE"}]
[145,{"$f":"IF('Cycle History'!$F$30=\"\",\"\",'Cycle History'!$F$30)","v":""},{"$f":"IF('Cycle History'!$B$1=\"\",\"\",'Cycle History'!$B$1)","v":"CYCLE HISTORY"},{"$f":"IF('Cycle History'!$B$3=\"\",\"\",'Cycle History'!$B$3)","v":"CYCLE"},{"$f":"IF('Cycle History'!$B$28=\"\",\"\",'Cycle History'!$B$28)","v":9},{"$f":"IF('Cycle History'!$C$30=\"\",\"\",'Cycle History'!$C$30)","v":"Thawed"},{"$f":"IF('Cycle History'!$F$3=\"\",\"\",'Cycle History'!$F$3)","v":"TIME IN"}]
[146,{"$f":"IF('Cycle History'!$G$30=\"\",\"\",'Cycle History'!$G$30)","v":""},{"$f":"IF('Cycle History'!$B$1=\"\",\"\",'Cycle History'!$B$1)","v":"CYCLE HISTORY"},{"$f":"IF('Cycle History'!$B$3=\"\",\"\",'Cycle History'!$B$3)","v":"CYCLE"},{"$f":"IF('Cycle History'!$B$28=\"\",\"\",'Cycle History'!$B$28)","v":9},{"$f":"IF('Cycle History'!$C$30=\"\",\"\",'Cycle History'!$C$30)","v":"Thawed"},{"$f":"IF('Cycle History'!$G$3=\"\",\"\",'Cycle History'!$G$3)","v":"TIME OUT"}]
[147,{"$f":"IF('Cycle History'!$E$31=\"\",\"\",'Cycle History'!$E$31)","v":""},{"$f":"IF('Cycle History'!$B$1=\"\",\"\",'Cycle History'!$B$1)","v":"CYCLE HISTORY"},{"$f":"IF('Cycle History'!$B$3=\"\",\"\",'Cycle History'!$B$3)","v":"CYCLE"},{"$f":"IF('Cycle History'!$B$31=\"\",\"\",'Cycle History'!$B$31)","v":10},{"$f":"IF('Cycle History'!$C$31=\"\",\"\",'Cycle History'!$C$31)","v":"In Freezing chamber"},{"$f":"IF('Cycle History'!$E$3=\"\",\"\",'Cycle History'!$E$3)","v":"DATE"}]
[148,{"$f":"IF('Cycle History'!$F$31=\"\",\"\",'Cycle History'!$F$31)","v":""},{"$f":"IF('Cycle History'!$B$1=\"\",\"\",'Cycle History'!$B$1)","v":"CYCLE HISTORY"},{"$f":"IF('Cycle History'!$B$3=\"\",\"\",'Cycle History'!$B$3)","v":"CYCLE"},{"$f":"IF('Cycle History'!$B$31=\"\",\"\",'Cycle History'!$B$31)","v":10},{"$f":"IF('Cycle History'!$C$31=\"\",\"\",'Cycle History'!$C$31)","v":"In Freezing chamber"},{"$f":"IF('Cycle History'!$F$3=\"\",\"\",'Cycle History'!$F$3)","v":"TIME IN"}]
[149,{"$f":"IF('Cycle History'!$G$31=\"\",\"\",'Cycle History'!$G$31)","v":""},{"$f":"IF('Cycle History'!$B$1=\"\",\"\",'Cycle History'!$B$1)","v":"CYCLE HISTORY"},{"$f":"IF('Cycle History'!$B$3=\"\",\"\",'Cycle History'!$B$3)","v":"CYCLE"},{"$f":"IF('Cycle History'!$B$31=\"\",\"\",'Cycle History'!$B$31)","v":10},{"$f":"IF('Cycle History'!$C$31=\"\",\"\",'Cycle History'!$C$31)","v":"In Freezing chamber"},{"$f":"IF('Cycle History'!$G$3=\"\",\"\",'Cycle History'!$G$3)","v":"TIME OUT"}]
[150,{"$f":"IF('Cycle History'!$H$31=\"\",\"\",'Cycle History'!$H$31)","v":""},{"$f":"IF('Cycle History'!$B$1=\"\",\"\",'Cycle History'!$B$1)","v":"CYCLE HISTORY"},{"$f":"IF('Cycle History'!$B$3=\"\",\"\",'Cycle History'!$B$3)","v":"CYCLE"},{"$f":"IF('Cycle History'!$B$31=\"\",\"\",'Cycle History'!$B$31)","v":10},{"$f":"IF('Cycle History'!$C$31=\"\",\"\",'Cycle History'!$C$31)","v":"In Freezing chamber"},{"$f":"IF('Cycle History'!$H$3=\"\",\"\",'Cycle History'!$H$3)","v":"REMARKS"}]
[151,{"$f":"IF('Cycle History'!$E$32=\"\",\"\",'Cycle History'!$E$32)","v":""},{"$f":"IF('Cycle History'!$B$1=\"\",\"\",'Cycle History'!$B$1)","v":"CYCLE HISTORY"},{"$f":"IF('Cycle History'!$B$3=\"\",\"\",'Cycle History'!$B$3)","v":"CYCLE"},{"$f":"IF('Cycle History'!$B$31=\"\",\"\",'Cycle History'!$B$31)","v":10},{"$f":"IF('Cycle History'!$C$32=\"\",\"\",'Cycle History'!$C$32)","v":"Out Freezing chamber"},{"$f":"IF('Cycle History'!$E$3=\"\",\"\",'Cycle History'!$E$3)","v":"DATE"}]
[152,{"$f":"IF('Cycle History'!$F$32=\"\",\"\",'Cycle History'!$F$32)","v":""},{"$f":"IF('Cycle History'!$B$1=\"\",\"\",'Cycle History'!$B$1)","v":"CYCLE HISTORY"},{"$f":"IF('Cycle History'!$B$3=\"\",\"\",'Cycle History'!$B$3)","v":"CYCLE"},{"$f":"IF('Cycle History'!$B$31=\"\",\"\",'Cycle History'!$B$31)","v":10},{"$f":"IF('Cycle History'!$C$32=\"\",\"\",'Cycle History'!$C$32)","v":"Out Freezing chamber"},{"$f":"IF('Cycle History'!$F$3=\"\",\"\",'Cycle History'!$F$3)","v":"TIME IN"}]
[153,{"$f":"IF('Cycle History'!$G$32=\"\",\"\",'Cycle History'!$G$32)","v":""},{"$f":"IF('Cycle History'!$B$1=\"\",\"\",'Cycle History'!$B$1)","v":"CYCLE HISTORY"},{"$f":"IF('Cycle History'!$B$3=\"\",\"\",'Cycle History'!$B$3)","v":"CYCLE"},{"$f":"IF('Cycle History'!$B$31=\"\",\"\",'Cycle History'!$B$31)","v":10},{"$f":"IF('Cycle History'!$C$32=\"\",\"\",'Cycle History'!$C$32)","v":"Out Freezing chamber"},{"$f":"IF('Cycle History'!$G$3=\"\",\"\",'Cycle History'!$G$3)","v":"TIME OUT"}]
[154,{"$f":"IF('Cycle History'!$E$33=\"\",\"\",'Cycle History'!$E$33)","v":""},{"$f":"IF('Cycle History'!$B$1=\"\",\"\",'Cycle History'!$B$1)","v":"CYCLE HISTORY"},{"$f":"IF('Cycle History'!$B$3=\"\",\"\",'Cycle History'!$B$3)","v":"CYCLE"},{"$f":"IF('Cycle History'!$B$31=\"\",\"\",'Cycle History'!$B$31)","v":10},{"$f":"IF('Cycle History'!$C$33=\"\",\"\",'Cycle History'!$C$33)","v":"Thawed"},{"$f":"IF('Cycle History'!$E$3=\"\",\"\",'Cycle History'!$E$3)","v":"DATE"}]
[155,{"$f":"IF('Cycle History'!$F$33=\"\",\"\",'Cycle History'!$F$33)","v":""},{"$f":"IF('Cycle History'!$B$1=\"\",\"\",'Cycle History'!$B$1)","v":"CYCLE HISTORY"},{"$f":"IF('Cycle History'!$B$3=\"\",\"\",'Cycle History'!$B$3)","v":"CYCLE"},{"$f":"IF('Cycle History'!$B$31=\"\",\"\",'Cycle History'!$B$31)","v":10},{"$f":"IF('Cycle History'!$C$33=\"\",\"\",'Cycle History'!$C$33)","v":"Thawed"},{"$f":"IF('Cycle History'!$F$3=\"\",\"\",'Cycle History'!$F$3)","v":"TIME IN"}]
[156,{"$f":"IF('Cycle History'!$G$33=\"\",\"\",'Cycle History'!$G$33)","v":""},{"$f":"IF('Cycle History'!$B$1=\"\",\"\",'Cycle History'!$B$1)","v":"CYCLE HISTORY"},{"$f":"IF('Cycle History'!$B$3=\"\",\"\",'Cycle History'!$B$3)","v":"CYCLE"},{"$f":"IF('Cycle History'!$B$31=\"\",\"\",'Cycle History'!$B$31)","v":10},{"$f":"IF('Cycle History'!$C$33=\"\",\"\",'Cycle History'!$C$33)","v":"Thawed"},{"$f":"IF('Cycle History'!$G$3=\"\",\"\",'Cycle History'!$G$3)","v":"TIME OUT"}]
[157,{"$f":"IF('Cycle History'!$E$34=\"\",\"\",'Cycle History'!$E$34)","v":""},{"$f":"IF('Cycle History'!$B$1=\"\",\"\",'Cycle History'!$B$1)","v":"CYCLE HISTORY"},{"$f":"IF('Cycle History'!$B$3=\"\",\"\",'Cycle History'!$B$3)","v":"CYCLE"},{"$f":"IF('Cycle History'!$B$34=\"\",\"\",'Cycle History'!$B$34)","v":11},{"$f":"IF('Cycle History'!$C$34=\"\",\"\",'Cycle History'!$C$34)","v":"In Freezing chamber"},{"$f":"IF('Cycle History'!$E$3=\"\",\"\",'Cycle History'!$E$3)","v":"DATE"}]
[158,{"$f":"IF('Cycle History'!$F$34=\"\",\"\",'Cycle History'!$F$34)","v":""},{"$f":"IF('Cycle History'!$B$1=\"\",\"\",'Cycle History'!$B$1)","v":"CYCLE HISTORY"},{"$f":"IF('Cycle History'!$B$3=\"\",\"\",'Cycle History'!$B$3)","v":"CYCLE"},{"$f":"IF('Cycle History'!$B$34=\"\",\"\",'Cycle History'!$B$34)","v":11},{"$f":"IF('Cycle History'!$C$34=\"\",\"\",'Cycle History'!$C$34)","v":"In Freezing chamber"},{"$f":"IF('Cycle History'!$F$3=\"\",\"\",'Cycle History'!$F$3)","v":"TIME IN"}]
[159,{"$f":"IF('Cycle History'!$G$34=\"\",\"\",'Cycle History'!$G$34)","v":""},{"$f":"IF('Cycle History'!$B$1=\"\",\"\",'Cycle History'!$B$1)","v":"CYCLE HISTORY"},{"$f":"IF('Cycle History'!$B$3=\"\",\"\",'Cycle History'!$B$3)","v":"CYCLE"},{"$f":"IF('Cycle History'!$B$34=\"\",\"\",'Cycle History'!$B$34)","v":11},{"$f":"IF('Cycle History'!$C$34=\"\",\"\",'Cycle History'!$C$34)","v":"In Freezing chamber"},{"$f":"IF('Cycle History'!$G$3=\"\",\"\",'Cycle History'!$G$3)","v":"TIME OUT"}]
[160,{"$f":"IF('Cycle History'!$H$34=\"\",\"\",'Cycle History'!$H$34)","v":""},{"$f":"IF('Cycle History'!$B$1=\"\",\"\",'Cycle History'!$B$1)","v":"CYCLE HISTORY"},{"$f":"IF('Cycle History'!$B$3=\"\",\"\",'Cycle History'!$B$3)","v":"CYCLE"},{"$f":"IF('Cycle History'!$B$34=\"\",\"\",'Cycle History'!$B$34)","v":11},{"$f":"IF('Cycle History'!$C$34=\"\",\"\",'Cycle History'!$C$34)","v":"In Freezing chamber"},{"$f":"IF('Cycle History'!$H$3=\"\",\"\",'Cycle History'!$H$3)","v":"REMARKS"}]
[161,{"$f":"IF('Cycle History'!$E$35=\"\",\"\",'Cycle History'!$E$35)","v":""},{"$f":"IF('Cycle History'!$B$1=\"\",\"\",'Cycle History'!$B$1)","v":"CYCLE HISTORY"},{"$f":"IF('Cycle History'!$B$3=\"\",\"\",'Cycle History'!$B$3)","v":"CYCLE"},{"$f":"IF('Cycle History'!$B$34=\"\",\"\",'Cycle History'!$B$34)","v":11},{"$f":"IF('Cycle History'!$C$35=\"\",\"\",'Cycle History'!$C$35)","v":"Out Freezing chamber"},{"$f":"IF('Cycle History'!$E$3=\"\",\"\",'Cycle History'!$E$3)","v":"DATE"}]
[162,{"$f":"IF('Cycle History'!$F$35=\"\",\"\",'Cycle History'!$F$35)","v":""},{"$f":"IF('Cycle History'!$B$1=\"\",\"\",'Cycle History'!$B$1)","v":"CYCLE HISTORY"},{"$f":"IF('Cycle History'!$B$3=\"\",\"\",'Cycle History'!$B$3)","v":"CYCLE"},{"$f":"IF('Cycle History'!$B$34=\"\",\"\",'Cycle History'!$B$34)","v":11},{"$f":"IF('Cycle History'!$C$35=\"\",\"\",'Cycle History'!$C$35)","v":"Out Freezing chamber"},{"$f":"IF('Cycle History'!$F$3=\"\",\"\",'Cycle History'!$F$3)","v":"TIME IN"}]
[163,{"$f":"IF('Cycle History'!$G$35=\"\",\"\",'Cycle History'!$G$35)","v":""},{"$f":"IF('Cycle History'!$B$1=\"\",\"\",'Cycle History'!$B$1)","v":"CYCLE HISTORY"},{"$f":"IF('Cycle History'!$B$3=\"\",\"\",'Cycle History'!$B$3)","v":"CYCLE"},{"$f":"IF('Cycle History'!$B$34=\"\",\"\",'Cycle History'!$B$34)","v":11},{"$f":"IF('Cycle History'!$C$35=\"\",\"\",'Cycle History'!$C$35)","v":"Out Freezing chamber"},{"$f":"IF('Cycle History'!$G$3=\"\",\"\",'Cycle History'!$G$3)","v":"TIME OUT"}]
[164,{"$f":"IF('Cycle History'!$E$36=\"\",\"\",'Cycle History'!$E$36)","v":""},{"$f":"IF('Cycle History'!$B$1=\"\",\"\",'Cycle History'!$B$1)","v":"CYCLE HISTORY"},{"$f":"IF('Cycle History'!$B$3=\"\",\"\",'Cycle History'!$B$3)","v":"CYCLE"},{"$f":"IF('Cycle History'!$B$34=\"\",\"\",'Cycle History'!$B$34)","v":11},{"$f":"IF('Cycle History'!$C$36=\"\",\"\",'Cycle History'!$C$36)","v":"Thawed"},{"$f":"IF('Cycle History'!$E$3=\"\",\"\",'Cycle History'!$E$3)","v":"DATE"}]
[165,{"$f":"IF('Cycle History'!$F$36=\"\",\"\",'Cycle History'!$F$36)","v":""},{"$f":"IF('Cycle History'!$B$1=\"\",\"\",'Cycle History'!$B$1)","v":"CYCLE HISTORY"},{"$f":"IF('Cycle History'!$B$3=\"\",\"\",'Cycle History'!$B$3)","v":"CYCLE"},{"$f":"IF('Cycle History'!$B$34=\"\",\"\",'Cycle History'!$B$34)","v":11},{"$f":"IF('Cycle History'!$C$36=\"\",\"\",'Cycle History'!$C$36)","v":"Thawed"},{"$f":"IF('Cycle History'!$F$3=\"\",\"\",'Cycle History'!$F$3)","v":"TIME IN"}]
[166,{"$f":"IF('Cycle History'!$G$36=\"\",\"\",'Cycle History'!$G$36)","v":""},{"$f":"IF('Cycle History'!$B$1=\"\",\"\",'Cycle History'!$B$1)","v":"CYCLE HISTORY"},{"$f":"IF('Cycle History'!$B$3=\"\",\"\",'Cycle History'!$B$3)","v":"CYCLE"},{"$f":"IF('Cycle History'!$B$34=\"\",\"\",'Cycle History'!$B$34)","v":11},{"$f":"IF('Cycle History'!$C$36=\"\",\"\",'Cycle History'!$C$36)","v":"Thawed"},{"$f":"IF('Cycle History'!$G$3=\"\",\"\",'Cycle History'!$G$3)","v":"TIME OUT"}]
[167,{"$f":"IF('Cycle History'!$E$37=\"\",\"\",'Cycle History'!$E$37)","v":""},{"$f":"IF('Cycle History'!$B$1=\"\",\"\",'Cycle History'!$B$1)","v":"CYCLE HISTORY"},{"$f":"IF('Cycle History'!$B$3=\"\",\"\",'Cycle History'!$B$3)","v":"CYCLE"},{"$f":"IF('Cycle History'!$B$37=\"\",\"\",'Cycle History'!$B$37)","v":12},{"$f":"IF('Cycle History'!$C$37=\"\",\"\",'Cycle History'!$C$37)","v":"In Freezing chamber"},{"$f":"IF('Cycle History'!$E$3=\"\",\"\",'Cycle History'!$E$3)","v":"DATE"}]
[168,{"$f":"IF('Cycle History'!$F$37=\"\",\"\",'Cycle History'!$F$37)","v":""},{"$f":"IF('Cycle History'!$B$1=\"\",\"\",'Cycle History'!$B$1)","v":"CYCLE HISTORY"},{"$f":"IF('Cycle History'!$B$3=\"\",\"\",'Cycle History'!$B$3)","v":"CYCLE"},{"$f":"IF('Cycle History'!$B$37=\"\",\"\",'Cycle History'!$B$37)","v":12},{"$f":"IF('Cycle History'!$C$37=\"\",\"\",'Cycle History'!$C$37)","v":"In Freezing chamber"},{"$f":"IF('Cycle History'!$F$3=\"\",\"\",'Cycle History'!$F$3)","v":"TIME IN"}]
[169,{"$f":"IF('Cycle History'!$G$37=\"\",\"\",'Cycle History'!$G$37)","v":""},{"$f":"IF('Cycle History'!$B$1=\"\",\"\",'Cycle History'!$B$1)","v":"CYCLE HISTORY"},{"$f":"IF('Cycle History'!$B$3=\"\",\"\",'Cycle History'!$B$3)","v":"CYCLE"},{"$f":"IF('Cycle History'!$B$37=\"\",\"\",'Cycle History'!$B$37)","v":12},{"$f":"IF('Cycle History'!$C$37=\"\",\"\",'Cycle History'!$C$37)","v":"In Freezing chamber"},{"$f":"IF('Cycle History'!$G$3=\"\",\"\",'Cycle History'!$G$3)","v":"TIME OUT"}]
[170,{"$f":"IF('Cycle History'!$H$37=\"\",\"\",'Cycle History'!$H$37)","v":""},{"$f":"IF('Cycle History'!$B$1=\"\",\"\",'Cycle History'!$B$1)","v":"CYCLE HISTORY"},{"$f":"IF('Cycle History'!$B$3=\"\",\"\",'Cycle History'!$B$3)","v":"CYCLE"},{"$f":"IF('Cycle History'!$B$37=\"\",\"\",'Cycle History'!$B$37)","v":12},{"$f":"IF('Cycle History'!$C$37=\"\",\"\",'Cycle History'!$C$37)","v":"In Freezing chamber"},{"$f":"IF('Cycle History'!$H$3=\"\",\"\",'Cycle History'!$H$3)","v":"REMARKS"}]
[171,{"$f":"IF('Cycle History'!$E$38=\"\",\"\",'Cycle History'!$E$38)","v":""},{"$f":"IF('Cycle History'!$B$1=\"\",\"\",'Cycle History'!$B$1)","v":"CYCLE HISTORY"},{"$f":"IF('Cycle History'!$B$3=\"\",\"\",'Cycle History'!$B$3)","v":"CYCLE"},{"$f":"IF('Cycle History'!$B$37=\"\",\"\",'Cycle History'!$B$37)","v":12},{"$f":"IF('Cycle History'!$C$38=\"\",\"\",'Cycle History'!$C$38)","v":"Out Freezing chamber"},{"$f":"IF('Cycle History'!$E$3=\"\",\"\",'Cycle History'!$E$3)","v":"DATE"}]
[172,{"$f":"IF('Cycle History'!$F$38=\"\",\"\",'Cycle History'!$F$38)","v":""},{"$f":"IF('Cycle History'!$B$1=\"\",\"\",'Cycle History'!$B$1)","v":"CYCLE HISTORY"},{"$f":"IF('Cycle History'!$B$3=\"\",\"\",'Cycle History'!$B$3)","v":"CYCLE"},{"$f":"IF('Cycle History'!$B$37=\"\",\"\",'Cycle History'!$B$37)","v":12},{"$f":"IF('Cycle History'!$C$38=\"\",\"\",'Cycle History'!$C$38)","v":"Out Freezing chamber"},{"$f":"IF('Cycle History'!$F$3=\"\",\"\",'Cycle History'!$F$3)","v":"TIME IN"}]
[173,{"$f":"IF('Cycle History'!$G$38=\"\",\"\",'Cycle History'!$G$38)","v":""},{"$f":"IF('Cycle History'!$B$1=\"\",\"\",'Cycle History'!$B$1)","v":"CYCLE HISTORY"},{"$f":"IF('Cycle History'!$B$3=\"\",\"\",'Cycle History'!$B$3)","v":"CYCLE"},{"$f":"IF('Cycle History'!$B$37=\"\",\"\",'Cycle History'!$B$37)","v":12},{"$f":"IF('Cycle History'!$C$38=\"\",\"\",'Cycle History'!$C$38)","v":"Out Freezing chamber"},{"$f":"IF('Cycle History'!$G$3=\"\",\"\",'Cycle History'!$G$3)","v":"TIME OUT"}]
[174,{"$f":"IF('Cycle History'!$E$39=\"\",\"\",'Cycle History'!$E$39)","v":""},{"$f":"IF('Cycle History'!$B$1=\"\",\"\",'Cycle History'!$B$1)","v":"CYCLE HISTORY"},{"$f":"IF('Cycle History'!$B$3=\"\",\"\",'Cycle History'!$B$3)","v":"CYCLE"},{"$f":"IF('Cycle History'!$B$37=\"\",\"\",'Cycle History'!$B$37)","v":12},{"$f":"IF('Cycle History'!$C$39=\"\",\"\",'Cycle History'!$C$39)","v":"Thawed"},{"$f":"IF('Cycle History'!$E$3=\"\",\"\",'Cycle History'!$E$3)","v":"DATE"}]
[175,{"$f":"IF('Cycle History'!$F$39=\"\",\"\",'Cycle History'!$F$39)","v":""},{"$f":"IF('Cycle History'!$B$1=\"\",\"\",'Cycle History'!$B$1)","v":"CYCLE HISTORY"},{"$f":"IF('Cycle History'!$B$3=\"\",\"\",'Cycle History'!$B$3)","v":"CYCLE"},{"$f":"IF('Cycle History'!$B$37=\"\",\"\",'Cycle History'!$B$37)","v":12},{"$f":"IF('Cycle History'!$C$39=\"\",\"\",'Cycle History'!$C$39)","v":"Thawed"},{"$f":"IF('Cycle History'!$F$3=\"\",\"\",'Cycle History'!$F$3)","v":"TIME IN"}]
[176,{"$f":"IF('Cycle History'!$G$39=\"\",\"\",'Cycle History'!$G$39)","v":""},{"$f":"IF('Cycle History'!$B$1=\"\",\"\",'Cycle History'!$B$1)","v":"CYCLE HISTORY"},{"$f":"IF('Cycle History'!$B$3=\"\",\"\",'Cycle History'!$B$3)","v":"CYCLE"},{"$f":"IF('Cycle History'!$B$37=\"\",\"\",'Cycle History'!$B$37)","v":12},{"$f":"IF('Cycle History'!$C$39=\"\",\"\",'Cycle History'!$C$39)","v":"Thawed"},{"$f":"IF('Cycle History'!$G$3=\"\",\"\",'Cycle History'!$G$3)","v":"TIME OUT"}]
[177,{"$f":"IF('Cycle History'!$E$40=\"\",\"\",'Cycle History'!$E$40)","v":""},{"$f":"IF('Cycle History'!$B$1=\"\",\"\",'Cycle History'!$B$1)","v":"CYCLE HISTORY"},{"$f":"IF('Cycle History'!$B$3=\"\",\"\",'Cycle History'!$B$3)","v":"CYCLE"},{"$f":"IF('Cycle History'!$B$40=\"\",\"\",'Cycle History'!$B$40)","v":13},{"$f":"IF('Cycle History'!$C$40=\"\",\"\",'Cycle History'!$C$40)","v":"In Freezing chamber"},{"$f":"IF('Cycle History'!$E$3=\"\",\"\",'Cycle History'!$E$3)","v":"DATE"}]
[178,{"$f":"IF('Cycle History'!$F$40=\"\",\"\",'Cycle History'!$F$40)","v":""},{"$f":"IF('Cycle History'!$B$1=\"\",\"\",'Cycle History'!$B$1)","v":"CYCLE HISTORY"},{"$f":"IF('Cycle History'!$B$3=\"\",\"\",'Cycle History'!$B$3)","v":"CYCLE"},{"$f":"IF('Cycle History'!$B$40=\"\",\"\",'Cycle History'!$B$40)","v":13},{"$f":"IF('Cycle History'!$C$40=\"\",\"\",'Cycle History'!$C$40)","v":"In Freezing chamber"},{"$f":"IF('Cycle History'!$F$3=\"\",\"\",'Cycle History'!$F$3)","v":"TIME IN"}]
[179,{"$f":"IF('Cycle History'!$G$40=\"\",\"\",'Cycle History'!$G$40)","v":""},{"$f":"IF('Cycle History'!$B$1=\"\",\"\",'Cycle History'!$B$1)","v":"CYCLE HISTORY"},{"$f":"IF('Cycle History'!$B$3=\"\",\"\",'Cycle History'!$B$3)","v":"CYCLE"},{"$f":"IF('Cycle History'!$B$40=\"\",\"\",'Cycle History'!$B$40)","v":13},{"$f":"IF('Cycle History'!$C$40=\"\",\"\",'Cycle History'!$C$40)","v":"In Freezing chamber"},{"$f":"IF('Cycle History'!$G$3=\"\",\"\",'Cycle History'!$G$3)","v":"TIME OUT"}]
[180,{"$f":"IF('Cycle History'!$H$40=\"\",\"\",'Cycle History'!$H$40)","v":""},{"$f":"IF('Cycle History'!$B$1=\"\",\"\",'Cycle History'!$B$1)","v":"CYCLE HISTORY"},{"$f":"IF('Cycle History'!$B$3=\"\",\"\",'Cycle History'!$B$3)","v":"CYCLE"},{"$f":"IF('Cycle History'!$B$40=\"\",\"\",'Cycle History'!$B$40)","v":13},{"$f":"IF('Cycle History'!$C$40=\"\",\"\",'Cycle History'!$C$40)","v":"In Freezing chamber"},{"$f":"IF('Cycle History'!$H$3=\"\",\"\",'Cycle History'!$H$3)","v":"REMARKS"}]
[181,{"$f":"IF('Cycle History'!$E$41=\"\",\"\",'Cycle History'!$E$41)","v":""},{"$f":"IF('Cycle History'!$B$1=\"\",\"\",'Cycle History'!$B$1)","v":"CYCLE HISTORY"},{"$f":"IF('Cycle History'!$B$3=\"\",\"\",'Cycle History'!$B$3)","v":"CYCLE"},{"$f":"IF('Cycle History'!$B$40=\"\",\"\",'Cycle History'!$B$40)","v":13},{"$f":"IF('Cycle History'!$C$41=\"\",\"\",'Cycle History'!$C$41)","v":"Out Freezing chamber"},{"$f":"IF('Cycle History'!$E$3=\"\",\"\",'Cycle History'!$E$3)","v":"DATE"}]
[182,{"$f":"IF('Cycle History'!$F$41=\"\",\"\",'Cycle History'!$F$41)","v":""},{"$f":"IF('Cycle History'!$B$1=\"\",\"\",'Cycle History'!$B$1)","v":"CYCLE HISTORY"},{"$f":"IF('Cycle History'!$B$3=\"\",\"\",'Cycle History'!$B$3)","v":"CYCLE"},{"$f":"IF('Cycle History'!$B$40=\"\",\"\",'Cycle History'!$B$40)","v":13},{"$f":"IF('Cycle History'!$C$41=\"\",\"\",'Cycle History'!$C$41)","v":"Out Freezing chamber"},{"$f":"IF('Cycle History'!$F$3=\"\",\"\",'Cycle History'!$F$3)","v":"TIME IN"}]
[183,{"$f":"IF('Cycle History'!$G$41=\"\",\"\",'Cycle History'!$G$41)","v":""},{"$f":"IF('Cycle History'!$B$1=\"\",\"\",'Cycle History'!$B$1)","v":"CYCLE HISTORY"},{"$f":"IF('Cycle History'!$B$3=\"\",\"\",'Cycle History'!$B$3)","v":"CYCLE"},{"$f":"IF('Cycle History'!$B$40=\"\",\"\",'Cycle History'!$B$40)","v":13},{"$f":"IF('Cycle History'!$C$41=\"\",\"\",'Cycle History'!$C$41)","v":"Out Freezing chamber"},{"$f":"IF('Cycle History'!$G$3=\"\",\"\",'Cycle History'!$G$3)","v":"TIME OUT"}]
[184,{"$f":"IF('Cycle History'!$E$42=\"\",\"\",'Cycle History'!$E$42)","v":""},{"$f":"IF('Cycle History'!$B$1=\"\",\"\",'Cycle History'!$B$1)","v":"CYCLE HISTORY"},{"$f":"IF('Cycle History'!$B$3=\"\",\"\",'Cycle History'!$B$3)","v":"CYCLE"},{"$f":"IF('Cycle History'!$B$40=\"\",\"\",'Cycle History'!$B$40)","v":13},{"$f":"IF('Cycle History'!$C$42=\"\",\"\",'Cycle History'!$C$42)","v":"Thawed"},{"$f":"IF('Cycle History'!$E$3=\"\",\"\",'Cycle History'!$E$3)","v":"DATE"}]
[185,{"$f":"IF('Cycle History'!$F$42=\"\",\"\",'Cycle History'!$F$42)","v":""},{"$f":"IF('Cycle History'!$B$1=\"\",\"\",'Cycle History'!$B$1)","v":"CYCLE HISTORY"},{"$f":"IF('Cycle History'!$B$3=\"\",\"\",'Cycle History'!$B$3)","v":"CYCLE"},{"$f":"IF('Cycle History'!$B$40=\"\",\"\",'Cycle History'!$B$40)","v":13},{"$f":"IF('Cycle History'!$C$42=\"\",\"\",'Cycle History'!$C$42)","v":"Thawed"},{"$f":"IF('Cycle History'!$F$3=\"\",\"\",'Cycle History'!$F$3)","v":"TIME IN"}]
[186,{"$f":"IF('Cycle History'!$G$42=\"\",\"\",'Cycle History'!$G$42)","v":""},{"$f":"IF('Cycle History'!$B$1=\"\",\"\",'Cycle History'!$B$1)","v":"CYCLE HISTORY"},{"$f":"IF('Cycle History'!$B$3=\"\",\"\",'Cycle History'!$B$3)","v":"CYCLE"},{"$f":"IF('Cycle History'!$B$40=\"\",\"\",'Cycle History'!$B$40)","v":13},{"$f":"IF('Cycle History'!$C$42=\"\",\"\",'Cycle History'!$C$42)","v":"Thawed"},{"$f":"IF('Cycle History'!$G$3=\"\",\"\",'Cycle History'!$G$3)","v":"TIME OUT"}]
[187,{"$f":"IF('Cycle History'!$E$43=\"\",\"\",'Cycle History'!$E$43)","v":""},{"$f":"IF('Cycle History'!$B$1=\"\",\"\",'Cycle History'!$B$1)","v":"CYCLE HISTORY"},{"$f":"IF('Cycle History'!$B$3=\"\",\"\",'Cycle History'!$B$3)","v":"CYCLE"},{"$f":"IF('Cycle History'!$B$43=\"\",\"\",'Cycle History'!$B$43)","v":14},{"$f":"IF('Cycle History'!$C$43=\"\",\"\",'Cycle History'!$C$43)","v":"In Freezing chamber"},{"$f":"IF('Cycle History'!$E$3=\"\",\"\",'Cycle History'!$E$3)","v":"DATE"}]
[188,{"$f":"IF('Cycle History'!$F$43=\"\",\"\",'Cycle History'!$F$43)","v":""},{"$f":"IF('Cycle History'!$B$1=\"\",\"\",'Cycle History'!$B$1)","v":"CYCLE HISTORY"},{"$f":"IF('Cycle History'!$B$3=\"\",\"\",'Cycle History'!$B$3)","v":"CYCLE"},{"$f":"IF('Cycle History'!$B$43=\"\",\"\",'Cycle History'!$B$43)","v":14},{"$f":"IF('Cycle History'!$C$43=\"\",\"\",'Cycle History'!$C$43)","v":"In Freezing chamber"},{"$f":"IF('Cycle History'!$F$3=\"\",\"\",'Cycle History'!$F$3)","v":"TIME IN"}]
[189,{"$f":"IF('Cycle History'!$G$43=\"\",\"\",'Cycle History'!$G$43)","v":""},{"$f":"IF('Cycle History'!$B$1=\"\",\"\",'Cycle History'!$B$1)","v":"CYCLE HISTORY"},{"$f":"IF('Cycle History'!$B$3=\"\",\"\",'Cycle History'!$B$3)","v":"CYCLE"},{"$f":"IF('Cycle History'!$B$43=\"\",\"\",'Cycle History'!$B$43)","v":14},{"$f":"IF('Cycle History'!$C$43=\"\",\"\",'Cycle History'!$C$43)","v":"In Freezing chamber"},{"$f":"IF('Cycle History'!$G$3=\"\",\"\",'Cycle History'!$G$3)","v":"TIME OUT"}]
[190,{"$f":"IF('Cycle History'!$H$43=\"\",\"\",'Cycle History'!$H$43)","v":""},{"$f":"IF('Cycle History'!$B$1=\"\",\"\",'Cycle History'!$B$1)","v":"CYCLE HISTORY"},{"$f":"IF('Cycle History'!$B$3=\"\",\"\",'Cycle History'!$B$3)","v":"CYCLE"},{"$f":"IF('Cycle History'!$B$43=\"\",\"\",'Cycle History'!$B$43)","v":14},{"$f":"IF('Cycle History'!$C$43=\"\",\"\",'Cycle History'!$C$43)","v":"In Freezing chamber"},{"$f":"IF('Cycle History'!$H$3=\"\",\"\",'Cycle History'!$H$3)","v":"REMARKS"}]
[191,{"$f":"IF('Cycle History'!$E$44=\"\",\"\",'Cycle History'!$E$44)","v":""},{"$f":"IF('Cycle History'!$B$1=\"\",\"\",'Cycle History'!$B$1)","v":"CYCLE HISTORY"},{"$f":"IF('Cycle History'!$B$3=\"\",\"\",'Cycle History'!$B$3)","v":"CYCLE"},{"$f":"IF('Cycle History'!$B$43=\"\",\"\",'Cycle History'!$B$43)","v":14},{"$f":"IF('Cycle History'!$C$44=\"\",\"\",'Cycle History'!$C$44)","v":"Out Freezing chamber"},{"$f":"IF('Cycle History'!$E$3=\"\",\"\",'Cycle History'!$E$3)","v":"DATE"}]
[192,{"$f":"IF('Cycle History'!$F$44=\"\",\"\",'Cycle History'!$F$44)","v":""},{"$f":"IF('Cycle History'!$B$1=\"\",\"\",'Cycle History'!$B$1)","v":"CYCLE HISTORY"},{"$f":"IF('Cycle History'!$B$3=\"\",\"\",'Cycle History'!$B$3)","v":"CYCLE"},{"$f":"IF('Cycle History'!$B$43=\"\",\"\",'Cycle History'!$B$43)","v":14},{"$f":"IF('Cycle History'!$C$44=\"\",\"\",'Cycle History'!$C$44)","v":"Out Freezing chamber"},{"$f":"IF('Cycle History'!$F$3=\"\",\"\",'Cycle History'!$F$3)","v":"TIME IN"}]
[193,{"$f":"IF('Cycle History'!$G$44=\"\",\"\",'Cycle History'!$G$44)","v":""},{"$f":"IF('Cycle History'!$B$1=\"\",\"\",'Cycle History'!$B$1)","v":"CYCLE HISTORY"},{"$f":"IF('Cycle History'!$B$3=\"\",\"\",'Cycle History'!$B$3)","v":"CYCLE"},{"$f":"IF('Cycle History'!$B$43=\"\",\"\",'Cycle History'!$B$43)","v":14},{"$f":"IF('Cycle History'!$C$44=\"\",\"\",'Cycle History'!$C$44)","v":"Out Freezing chamber"},{"$f":"IF('Cycle History'!$G$3=\"\",\"\",'Cycle History'!$G$3)","v":"TIME OUT"}]
[194,{"$f":"IF('Cycle History'!$E$45=\"\",\"\",'Cycle History'!$E$45)","v":""},{"$f":"IF('Cycle History'!$B$1=\"\",\"\",'Cycle History'!$B$1)","v":"CYCLE HISTORY"},{"$f":"IF('Cycle History'!$B$3=\"\",\"\",'Cycle History'!$B$3)","v":"CYCLE"},{"$f":"IF('Cycle History'!$B$43=\"\",\"\",'Cycle History'!$B$43)","v":14},{"$f":"IF('Cycle History'!$C$45=\"\",\"\",'Cycle History'!$C$45)","v":"Thawed"},{"$f":"IF('Cycle History'!$E$3=\"\",\"\",'Cycle History'!$E$3)","v":"DATE"}]
[195,{"$f":"IF('Cycle History'!$F$45=\"\",\"\",'Cycle History'!$F$45)","v":""},{"$f":"IF('Cycle History'!$B$1=\"\",\"\",'Cycle History'!$B$1)","v":"CYCLE HISTORY"},{"$f":"IF('Cycle History'!$B$3=\"\",\"\",'Cycle History'!$B$3)","v":"CYCLE"},{"$f":"IF('Cycle History'!$B$43=\"\",\"\",'Cycle History'!$B$43)","v":14},{"$f":"IF('Cycle History'!$C$45=\"\",\"\",'Cycle History'!$C$45)","v":"Thawed"},{"$f":"IF('Cycle History'!$F$3=\"\",\"\",'Cycle History'!$F$3)","v":"TIME IN"}]
[196,{"$f":"IF('Cycle History'!$G$45=\"\",\"\",'Cycle History'!$G$45)","v":""},{"$f":"IF('Cycle History'!$B$1=\"\",\"\",'Cycle History'!$B$1)","v":"CYCLE HISTORY"},{"$f":"IF('Cycle History'!$B$3=\"\",\"\",'Cycle History'!$B$3)","v":"CYCLE"},{"$f":"IF('Cycle History'!$B$43=\"\",\"\",'Cycle History'!$B$43)","v":14},{"$f":"IF('Cycle History'!$C$45=\"\",\"\",'Cycle History'!$C$45)","v":"Thawed"},{"$f":"IF('Cycle History'!$G$3=\"\",\"\",'Cycle History'!$G$3)","v":"TIME OUT"}]
[197,{"$f":"IF('Cycle History'!$E$46=\"\",\"\",'Cycle History'!$E$46)","v":""},{"$f":"IF('Cycle History'!$B$1=\"\",\"\",'Cycle History'!$B$1)","v":"CYCLE HISTORY"},{"$f":"IF('Cycle History'!$B$3=\"\",\"\",'Cycle History'!$B$3)","v":"CYCLE"},{"$f":"IF('Cycle History'!$B$46=\"\",\"\",'Cycle History'!$B$46)","v":15},{"$f":"IF('Cycle History'!$C$46=\"\",\"\",'Cycle History'!$C$46)","v":"In Freezing chamber"},{"$f":"IF('Cycle History'!$E$3=\"\",\"\",'Cycle History'!$E$3)","v":"DATE"}]
[198,{"$f":"IF('Cycle History'!$F$46=\"\",\"\",'Cycle History'!$F$46)","v":""},{"$f":"IF('Cycle History'!$B$1=\"\",\"\",'Cycle History'!$B$1)","v":"CYCLE HISTORY"},{"$f":"IF('Cycle History'!$B$3=\"\",\"\",'Cycle History'!$B$3)","v":"CYCLE"},{"$f":"IF('Cycle History'!$B$46=\"\",\"\",'Cycle History'!$B$46)","v":15},{"$f":"IF('Cycle History'!$C$46=\"\",\"\",'Cycle History'!$C$46)","v":"In Freezing chamber"},{"$f":"IF('Cycle History'!$F$3=\"\",\"\",'Cycle History'!$F$3)","v":"TIME IN"}]
[199,{"$f":"IF('Cycle History'!$G$46=\"\",\"\",'Cycle History'!$G$46)","v":""},{"$f":"IF('Cycle History'!$B$1=\"\",\"\",'Cycle History'!$B$1)","v":"CYCLE HISTORY"},{"$f":"IF('Cycle History'!$B$3=\"\",\"\",'Cycle History'!$B$3)","v":"CYCLE"},{"$f":"IF('Cycle History'!$B$46=\"\",\"\",'Cycle History'!$B$46)","v":15},{"$f":"IF('Cycle History'!$C$46=\"\",\"\",'Cycle History'!$C$46)","v":"In Freezing chamber"},{"$f":"IF('Cycle History'!$G$3=\"\",\"\",'Cycle History'!$G$3)","v":"TIME OUT"}]
[200,{"$f":"IF('Cycle History'!$H$46=\"\",\"\",'Cycle History'!$H$46)","v":""},{"$f":"IF('Cycle History'!$B$1=\"\",\"\",'Cycle History'!$B$1)","v":"CYCLE HISTORY"},{"$f":"IF('Cycle History'!$B$3=\"\",\"\",'Cycle History'!$B$3)","v":"CYCLE"},{"$f":"IF('Cycle History'!$B$46=\"\",\"\",'Cycle History'!$B$46)","v":15},{"$f":"IF('Cycle History'!$C$46=\"\",\"\",'Cycle History'!$C$46)","v":"In Freezing chamber"},{"$f":"IF('Cycle History'!$H$3=\"\",\"\",'Cycle History'!$H$3)","v":"REMARKS"}]
[201,{"$f":"IF('Cycle History'!$E$47=\"\",\"\",'Cycle History'!$E$47)","v":""},{"$f":"IF('Cycle History'!$B$1=\"\",\"\",'Cycle History'!$B$1)","v":"CYCLE HISTORY"},{"$f":"IF('Cycle History'!$B$3=\"\",\"\",'Cycle History'!$B$3)","v":"CYCLE"},{"$f":"IF('Cycle History'!$B$46=\"\",\"\",'Cycle History'!$B$46)","v":15},{"$f":"IF('Cycle History'!$C$47=\"\",\"\",'Cycle History'!$C$47)","v":"Out Freezing chamber"},{"$f":"IF('Cycle History'!$E$3=\"\",\"\",'Cycle History'!$E$3)","v":"DATE"}]
[202,{"$f":"IF('Cycle History'!$F$47=\"\",\"\",'Cycle History'!$F$47)","v":""},{"$f":"IF('Cycle History'!$B$1=\"\",\"\",'Cycle History'!$B$1)","v":"CYCLE HISTORY"},{"$f":"IF('Cycle History'!$B$3=\"\",\"\",'Cycle History'!$B$3)","v":"CYCLE"},{"$f":"IF('Cycle History'!$B$46=\"\",\"\",'Cycle History'!$B$46)","v":15},{"$f":"IF('Cycle History'!$C$47=\"\",\"\",'Cycle History'!$C$47)","v":"Out Freezing chamber"},{"$f":"IF('Cycle History'!$F$3=\"\",\"\",'Cycle History'!$F$3)","v":"TIME IN"}]
[203,{"$f":"IF('Cycle History'!$G$47=\"\",\"\",'Cycle History'!$G$47)","v":""},{"$f":"IF('Cycle History'!$B$1=\"\",\"\",'Cycle History'!$B$1)","v":"CYCLE HISTORY"},{"$f":"IF('Cycle History'!$B$3=\"\",\"\",'Cycle History'!$B$3)","v":"CYCLE"},{"$f":"IF('Cycle History'!$B$46=\"\",\"\",'Cycle History'!$B$46)","v":15},{"$f":"IF('Cycle History'!$C$47=\"\",\"\",'Cycle History'!$C$47)","v":"Out Freezing chamber"},{"$f":"IF('Cycle History'!$G$3=\"\",\"\",'Cycle History'!$G$3)","v":"TIME OUT"}]
[204,{"$f":"IF('Cycle History'!$E$48=\"\",\"\",'Cycle History'!$E$48)","v":""},{"$f":"IF('Cycle History'!$B$1=\"\",\"\",'Cycle History'!$B$1)","v":"CYCLE HISTORY"},{"$f":"IF('Cycle History'!$B$3=\"\",\"\",'Cycle History'!$B$3)","v":"CYCLE"},{"$f":"IF('Cycle History'!$B$46=\"\",\"\",'Cycle History'!$B$46)","v":15},{"$f":"IF('Cycle History'!$C$48=\"\",\"\",'Cycle History'!$C$48)","v":"Thawed"},{"$f":"IF('Cycle History'!$E$3=\"\",\"\",'Cycle History'!$E$3)","v":"DATE"}]
[205,{"$f":"IF('Cycle History'!$F$48=\"\",\"\",'Cycle History'!$F$48)","v":""},{"$f":"IF('Cycle History'!$B$1=\"\",\"\",'Cycle History'!$B$1)","v":"CYCLE HISTORY"},{"$f":"IF('Cycle History'!$B$3=\"\",\"\",'Cycle History'!$B$3)","v":"CYCLE"},{"$f":"IF('Cycle History'!$B$46=\"\",\"\",'Cycle History'!$B$46)","v":15},{"$f":"IF('Cycle History'!$C$48=\"\",\"\",'Cycle History'!$C$48)","v":"Thawed"},{"$f":"IF('Cycle History'!$F$3=\"\",\"\",'Cycle History'!$F$3)","v":"TIME IN"}]
[206,{"$f":"IF('Cycle History'!$G$48=\"\",\"\",'Cycle History'!$G$48)","v":""},{"$f":"IF('Cycle History'!$B$1=\"\",\"\",'Cycle History'!$B$1)","v":"CYCLE HISTORY"},{"$f":"IF('Cycle History'!$B$3=\"\",\"\",'Cycle History'!$B$3)","v":"CYCLE"},{"$f":"IF('Cycle History'!$B$46=\"\",\"\",'Cycle History'!$B$46)","v":15},{"$f":"IF('Cycle History'!$C$48=\"\",\"\",'Cycle History'!$C$48)","v":"Thawed"},{"$f":"IF('Cycle History'!$G$3=\"\",\"\",'Cycle History'!$G$3)","v":"TIME OUT"}]
[207,{"$f":"IF('Cycle History'!$E$49=\"\",\"\",'Cycle History'!$E$49)","v":""},{"$f":"IF('Cycle History'!$B$1=\"\",\"\",'Cycle History'!$B$1)","v":"CYCLE HISTORY"},{"$f":"IF('Cycle History'!$B$3=\"\",\"\",'Cycle History'!$B$3)","v":"CYCLE"},{"$f":"IF('Cycle History'!$B$49=\"\",\"\",'Cycle History'!$B$49)","v":16},{"$f":"IF('Cycle History'!$C$49=\"\",\"\",'Cycle History'!$C$49)","v":"In Freezing chamber"},{"$f":"IF('Cycle History'!$E$3=\"\",\"\",'Cycle History'!$E$3)","v":"DATE"}]
[208,{"$f":"IF('Cycle History'!$F$49=\"\",\"\",'Cycle History'!$F$49)","v":""},{"$f":"IF('Cycle History'!$B$1=\"\",\"\",'Cycle History'!$B$1)","v":"CYCLE HISTORY"},{"$f":"IF('Cycle History'!$B$3=\"\",\"\",'Cycle History'!$B$3)","v":"CYCLE"},{"$f":"IF('Cycle History'!$B$49=\"\",\"\",'Cycle History'!$B$49)","v":16},{"$f":"IF('Cycle History'!$C$49=\"\",\"\",'Cycle History'!$C$49)","v":"In Freezing chamber"},{"$f":"IF('Cycle History'!$F$3=\"\",\"\",'Cycle History'!$F$3)","v":"TIME IN"}]
[209,{"$f":"IF('Cycle History'!$G$49=\"\",\"\",'Cycle History'!$G$49)","v":""},{"$f":"IF('Cycle History'!$B$1=\"\",\"\",'Cycle History'!$B$1)","v":"CYCLE HISTORY"},{"$f":"IF('Cycle History'!$B$3=\"\",\"\",'Cycle History'!$B$3)","v":"CYCLE"},{"$f":"IF('Cycle History'!$B$49=\"\",\"\",'Cycle History'!$B$49)","v":16},{"$f":"IF('Cycle History'!$C$49=\"\",\"\",'Cycle History'!$C$49)","v":"In Freezing chamber"},{"$f":"IF('Cycle History'!$G$3=\"\",\"\",'Cycle History'!$G$3)","v":"TIME OUT"}]
[210,{"$f":"IF('Cycle History'!$H$49=\"\",\"\",'Cycle History'!$H$49)","v":""},{"$f":"IF('Cycle History'!$B$1=\"\",\"\",'Cycle History'!$B$1)","v":"CYCLE HISTORY"},{"$f":"IF('Cycle History'!$B$3=\"\",\"\",'Cycle History'!$B$3)","v":"CYCLE"},{"$f":"IF('Cycle History'!$B$49=\"\",\"\",'Cycle History'!$B$49)","v":16},{"$f":"IF('Cycle History'!$C$49=\"\",\"\",'Cycle History'!$C$49)","v":"In Freezing chamber"},{"$f":"IF('Cycle History'!$H$3=\"\",\"\",'Cycle History'!$H$3)","v":"REMARKS"}]
[211,{"$f":"IF('Cycle History'!$E$50=\"\",\"\",'Cycle History'!$E$50)","v":""},{"$f":"IF('Cycle History'!$B$1=\"\",\"\",'Cycle History'!$B$1)","v":"CYCLE HISTORY"},{"$f":"IF('Cycle History'!$B$3=\"\",\"\",'Cycle History'!$B$3)","v":"CYCLE"},{"$f":"IF('Cycle History'!$B$49=\"\",\"\",'Cycle History'!$B$49)","v":16},{"$f":"IF('Cycle History'!$C$50=\"\",\"\",'Cycle History'!$C$50)","v":"Out Freezing chamber"},{"$f":"IF('Cycle History'!$E$3=\"\",\"\",'Cycle History'!$E$3)","v":"DATE"}]
[212,{"$f":"IF('Cycle History'!$F$50=\"\",\"\",'Cycle History'!$F$50)","v":""},{"$f":"IF('Cycle History'!$B$1=\"\",\"\",'Cycle History'!$B$1)","v":"CYCLE HISTORY"},{"$f":"IF('Cycle History'!$B$3=\"\",\"\",'Cycle History'!$B$3)","v":"CYCLE"},{"$f":"IF('Cycle History'!$B$49=\"\",\"\",'Cycle History'!$B$49)","v":16},{"$f":"IF('Cycle History'!$C$50=\"\",\"\",'Cycle History'!$C$50)","v":"Out Freezing chamber"},{"$f":"IF('Cycle History'!$F$3=\"\",\"\",'Cycle History'!$F$3)","v":"TIME IN"}]
[213,{"$f":"IF('Cycle History'!$G$50=\"\",\"\",'Cycle History'!$G$50)","v":""},{"$f":"IF('Cycle History'!$B$1=\"\",\"\",'Cycle History'!$B$1)","v":"CYCLE HISTORY"},{"$f":"IF('Cycle History'!$B$3=\"\",\"\",'Cycle History'!$B$3)","v":"CYCLE"},{"$f":"IF('Cycle History'!$B$49=\"\",\"\",'Cycle History'!$B$49)","v":16},{"$f":"IF('Cycle History'!$C$50=\"\",\"\",'Cycle History'!$C$50)","v":"Out Freezing chamber"},{"$f":"IF('Cycle History'!$G$3=\"\",\"\",'Cycle History'!$G$3)","v":"TIME OUT"}]
[214,{"$f":"IF('Cycle History'!$E$51=\"\",\"\",'Cycle History'!$E$51)","v":""},{"$f":"IF('Cycle History'!$B$1=\"\",\"\",'Cycle History'!$B$1)","v":"CYCLE HISTORY"},{"$f":"IF('Cycle History'!$B$3=\"\",\"\",'Cycle History'!$B$3)","v":"CYCLE"},{"$f":"IF('Cycle History'!$B$49=\"\",\"\",'Cycle History'!$B$49)","v":16},{"$f":"IF('Cycle History'!$C$51=\"\",\"\",'Cycle History'!$C$51)","v":"Thawed"},{"$f":"IF('Cycle History'!$E$3=\"\",\"\",'Cycle History'!$E$3)","v":"DATE"}]
[215,{"$f":"IF('Cycle History'!$F$51=\"\",\"\",'Cycle History'!$F$51)","v":""},{"$f":"IF('Cycle History'!$B$1=\"\",\"\",'Cycle History'!$B$1)","v":"CYCLE HISTORY"},{"$f":"IF('Cycle History'!$B$3=\"\",\"\",'Cycle History'!$B$3)","v":"CYCLE"},{"$f":"IF('Cycle History'!$B$49=\"\",\"\",'Cycle History'!$B$49)","v":16},{"$f":"IF('Cycle History'!$C$51=\"\",\"\",'Cycle History'!$C$51)","v":"Thawed"},{"$f":"IF('Cycle History'!$F$3=\"\",\"\",'Cycle History'!$F$3)","v":"TIME IN"}]
[216,{"$f":"IF('Cycle History'!$G$51=\"\",\"\",'Cycle History'!$G$51)","v":""},{"$f":"IF('Cycle History'!$B$1=\"\",\"\",'Cycle History'!$B$1)","v":"CYCLE HISTORY"},{"$f":"IF('Cycle History'!$B$3=\"\",\"\",'Cycle History'!$B$3)","v":"CYCLE"},{"$f":"IF('Cycle History'!$B$49=\"\",\"\",'Cycle History'!$B$49)","v":16},{"$f":"IF('Cycle History'!$C$51=\"\",\"\",'Cycle History'!$C$51)","v":"Thawed"},{"$f":"IF('Cycle History'!$G$3=\"\",\"\",'Cycle History'!$G$3)","v":"TIME OUT"}]
[217,{"$f":"IF('Cycle History'!$E$52=\"\",\"\",'Cycle History'!$E$52)","v":""},{"$f":"IF('Cycle History'!$B$1=\"\",\"\",'Cycle History'!$B$1)","v":"CYCLE HISTORY"},{"$f":"IF('Cycle History'!$B$3=\"\",\"\",'Cycle History'!$B$3)","v":"CYCLE"},{"$f":"IF('Cycle History'!$B$52=\"\",\"\",'Cycle History'!$B$52)","v":17},{"$f":"IF('Cycle History'!$C$52=\"\",\"\",'Cycle History'!$C$52)","v":"In Freezing chamber"},{"$f":"IF('Cycle History'!$E$3=\"\",\"\",'Cycle History'!$E$3)","v":"DATE"}]
[218,{"$f":"IF('Cycle History'!$F$52=\"\",\"\",'Cycle History'!$F$52)","v":""},{"$f":"IF('Cycle History'!$B$1=\"\",\"\",'Cycle History'!$B$1)","v":"CYCLE HISTORY"},{"$f":"IF('Cycle History'!$B$3=\"\",\"\",'Cycle History'!$B$3)","v":"CYCLE"},{"$f":"IF('Cycle History'!$B$52=\"\",\"\",'Cycle History'!$B$52)","v":17},{"$f":"IF('Cycle History'!$C$52=\"\",\"\",'Cycle History'!$C$52)","v":"In Freezing chamber"},{"$f":"IF('Cycle History'!$F$3=\"\",\"\",'Cycle History'!$F$3)","v":"TIME IN"}]
[219,{"$f":"IF('Cycle History'!$G$52=\"\",\"\",'Cycle History'!$G$52)","v":""},{"$f":"IF('Cycle History'!$B$1=\"\",\"\",'Cycle History'!$B$1)","v":"CYCLE HISTORY"},{"$f":"IF('Cycle History'!$B$3=\"\",\"\",'Cycle History'!$B$3)","v":"CYCLE"},{"$f":"IF('Cycle History'!$B$52=\"\",\"\",'Cycle History'!$B$52)","v":17},{"$f":"IF('Cycle History'!$C$52=\"\",\"\",'Cycle History'!$C$52)","v":"In Freezing chamber"},{"$f":"IF('Cycle History'!$G$3=\"\",\"\",'Cycle History'!$G$3)","v":"TIME OUT"}]
[220,{"$f":"IF('Cycle History'!$H$52=\"\",\"\",'Cycle History'!$H$52)","v":""},{"$f":"IF('Cycle History'!$B$1=\"\",\"\",'Cycle History'!$B$1)","v":"CYCLE HISTORY"},{"$f":"IF('Cycle History'!$B$3=\"\",\"\",'Cycle History'!$B$3)","v":"CYCLE"},{"$f":"IF('Cycle History'!$B$52=\"\",\"\",'Cycle History'!$B$52)","v":17},{"$f":"IF('Cycle History'!$C$52=\"\",\"\",'Cycle History'!$C$52)","v":"In Freezing chamber"},{"$f":"IF('Cycle History'!$H$3=\"\",\"\",'Cycle History'!$H$3)","v":"REMARKS"}]
[221,{"$f":"IF('Cycle History'!$E$53=\"\",\"\",'Cycle History'!$E$53)","v":""},{"$f":"IF('Cycle History'!$B$1=\"\",\"\",'Cycle History'!$B$1)","v":"CYCLE HISTORY"},{"$f":"IF('Cycle History'!$B$3=\"\",\"\",'Cycle History'!$B$3)","v":"CYCLE"},{"$f":"IF('Cycle History'!$B$52=\"\",\"\",'Cycle History'!$B$52)","v":17},{"$f":"IF('Cycle History'!$C$53=\"\",\"\",'Cycle History'!$C$53)","v":"Out Freezing chamber"},{"$f":"IF('Cycle History'!$E$3=\"\",\"\",'Cycle History'!$E$3)","v":"DATE"}]
[222,{"$f":"IF('Cycle History'!$F$53=\"\",\"\",'Cycle History'!$F$53)","v":""},{"$f":"IF('Cycle History'!$B$1=\"\",\"\",'Cycle History'!$B$1)","v":"CYCLE HISTORY"},{"$f":"IF('Cycle History'!$B$3=\"\",\"\",'Cycle History'!$B$3)","v":"CYCLE"},{"$f":"IF('Cycle History'!$B$52=\"\",\"\",'Cycle History'!$B$52)","v":17},{"$f":"IF('Cycle History'!$C$53=\"\",\"\",'Cycle History'!$C$53)","v":"Out Freezing chamber"},{"$f":"IF('Cycle History'!$F$3=\"\",\"\",'Cycle History'!$F$3)","v":"TIME IN"}]
[223,{"$f":"IF('Cycle History'!$G$53=\"\",\"\",'Cycle History'!$G$53)","v":""},{"$f":"IF('Cycle History'!$B$1=\"\",\"\",'Cycle History'!$B$1)","v":"CYCLE HISTORY"},{"$f":"IF('Cycle History'!$B$3=\"\",\"\",'Cycle History'!$B$3)","v":"CYCLE"},{"$f":"IF('Cycle History'!$B$52=\"\",\"\",'Cycle History'!$B$52)","v":17},{"$f":"IF('Cycle History'!$C$53=\"\",\"\",'Cycle History'!$C$53)","v":"Out Freezing chamber"},{"$f":"IF('Cycle History'!$G$3=\"\",\"\",'Cycle History'!$G$3)","v":"TIME OUT"}]
[224,{"$f":"IF('Cycle History'!$E$54=\"\",\"\",'Cycle History'!$E$54)","v":""},{"$f":"IF('Cycle History'!$B$1=\"\",\"\",'Cycle History'!$B$1)","v":"CYCLE HISTORY"},{"$f":"IF('Cycle History'!$B$3=\"\",\"\",'Cycle History'!$B$3)","v":"CYCLE"},{"$f":"IF('Cycle History'!$B$52=\"\",\"\",'Cycle History'!$B$52)","v":17},{"$f":"IF('Cycle History'!$C$54=\"\",\"\",'Cycle History'!$C$54)","v":"Thawed"},{"$f":"IF('Cycle History'!$E$3=\"\",\"\",'Cycle History'!$E$3)","v":"DATE"}]
[225,{"$f":"IF('Cycle History'!$F$54=\"\",\"\",'Cycle History'!$F$54)","v":""},{"$f":"IF('Cycle History'!$B$1=\"\",\"\",'Cycle History'!$B$1)","v":"CYCLE HISTORY"},{"$f":"IF('Cycle History'!$B$3=\"\",\"\",'Cycle History'!$B$3)","v":"CYCLE"},{"$f":"IF('Cycle History'!$B$52=\"\",\"\",'Cycle History'!$B$52)","v":17},{"$f":"IF('Cycle History'!$C$54=\"\",\"\",'Cycle History'!$C$54)","v":"Thawed"},{"$f":"IF('Cycle History'!$F$3=\"\",\"\",'Cycle History'!$F$3)","v":"TIME IN"}]
[226,{"$f":"IF('Cycle History'!$G$54=\"\",\"\",'Cycle History'!$G$54)","v":""},{"$f":"IF('Cycle History'!$B$1=\"\",\"\",'Cycle History'!$B$1)","v":"CYCLE HISTORY"},{"$f":"IF('Cycle History'!$B$3=\"\",\"\",'Cycle History'!$B$3)","v":"CYCLE"},{"$f":"IF('Cycle History'!$B$52=\"\",\"\",'Cycle History'!$B$52)","v":17},{"$f":"IF('Cycle History'!$C$54=\"\",\"\",'Cycle History'!$C$54)","v":"Thawed"},{"$f":"IF('Cycle History'!$G$3=\"\",\"\",'Cycle History'!$G$3)","v":"TIME OUT"}]
[227,{"$f":"IF('Cycle History'!$E$55=\"\",\"\",'Cycle History'!$E$55)","v":""},{"$f":"IF('Cycle History'!$B$1=\"\",\"\",'Cycle History'!$B$1)","v":"CYCLE HISTORY"},{"$f":"IF('Cycle History'!$B$3=\"\",\"\",'Cycle History'!$B$3)","v":"CYCLE"},{"$f":"IF('Cycle History'!$B$55=\"\",\"\",'Cycle History'!$B$55)","v":18},{"$f":"IF('Cycle History'!$C$55=\"\",\"\",'Cycle History'!$C$55)","v":"In Freezing chamber"},{"$f":"IF('Cycle History'!$E$3=\"\",\"\",'Cycle History'!$E$3)","v":"DATE"}]
[228,{"$f":"IF('Cycle History'!$F$55=\"\",\"\",'Cycle History'!$F$55)","v":""},{"$f":"IF('Cycle History'!$B$1=\"\",\"\",'Cycle History'!$B$1)","v":"CYCLE HISTORY"},{"$f":"IF('Cycle History'!$B$3=\"\",\"\",'Cycle History'!$B$3)","v":"CYCLE"},{"$f":"IF('Cycle History'!$B$55=\"\",\"\",'Cycle History'!$B$55)","v":18},{"$f":"IF('Cycle History'!$C$55=\"\",\"\",'Cycle History'!$C$55)","v":"In Freezing chamber"},{"$f":"IF('Cycle History'!$F$3=\"\",\"\",'Cycle History'!$F$3)","v":"TIME IN"}]
[229,{"$f":"IF('Cycle History'!$G$55=\"\",\"\",'Cycle History'!$G$55)","v":""},{"$f":"IF('Cycle History'!$B$1=\"\",\"\",'Cycle History'!$B$1)","v":"CYCLE HISTORY"},{"$f":"IF('Cycle History'!$B$3=\"\",\"\",'Cycle History'!$B$3)","v":"CYCLE"},{"$f":"IF('Cycle History'!$B$55=\"\",\"\",'Cycle History'!$B$55)","v":18},{"$f":"IF('Cycle History'!$C$55=\"\",\"\",'Cycle History'!$C$55)","v":"In Freezing chamber"},{"$f":"IF('Cycle History'!$G$3=\"\",\"\",'Cycle History'!$G$3)","v":"TIME OUT"}]
[230,{"$f":"IF('Cycle History'!$H$55=\"\",\"\",'Cycle History'!$H$55)","v":""},{"$f":"IF('Cycle History'!$B$1=\"\",\"\",'Cycle History'!$B$1)","v":"CYCLE HISTORY"},{"$f":"IF('Cycle History'!$B$3=\"\",\"\",'Cycle History'!$B$3)","v":"CYCLE"},{"$f":"IF('Cycle History'!$B$55=\"\",\"\",'Cycle History'!$B$55)","v":18},{"$f":"IF('Cycle History'!$C$55=\"\",\"\",'Cycle History'!$C$55)","v":"In Freezing chamber"},{"$f":"IF('Cycle History'!$H$3=\"\",\"\",'Cycle History'!$H$3)","v":"REMARKS"}]
[231,{"$f":"IF('Cycle History'!$E$56=\"\",\"\",'Cycle History'!$E$56)","v":""},{"$f":"IF('Cycle History'!$B$1=\"\",\"\",'Cycle History'!$B$1)","v":"CYCLE HISTORY"},{"$f":"IF('Cycle History'!$B$3=\"\",\"\",'Cycle History'!$B$3)","v":"CYCLE"},{"$f":"IF('Cycle History'!$B$55=\"\",\"\",'Cycle History'!$B$55)","v":18},{"$f":"IF('Cycle History'!$C$56=\"\",\"\",'Cycle History'!$C$56)","v":"Out Freezing chamber"},{"$f":"IF('Cycle History'!$E$3=\"\",\"\",'Cycle History'!$E$3)","v":"DATE"}]
[232,{"$f":"IF('Cycle History'!$F$56=\"\",\"\",'Cycle History'!$F$56)","v":""},{"$f":"IF('Cycle History'!$B$1=\"\",\"\",'Cycle History'!$B$1)","v":"CYCLE HISTORY"},{"$f":"IF('Cycle History'!$B$3=\"\",\"\",'Cycle History'!$B$3)","v":"CYCLE"},{"$f":"IF('Cycle History'!$B$55=\"\",\"\",'Cycle History'!$B$55)","v":18},{"$f":"IF('Cycle History'!$C$56=\"\",\"\",'Cycle History'!$C$56)","v":"Out Freezing chamber"},{"$f":"IF('Cycle History'!$F$3=\"\",\"\",'Cycle History'!$F$3)","v":"TIME IN"}]
[233,{"$f":"IF('Cycle History'!$G$56=\"\",\"\",'Cycle History'!$G$56)","v":""},{"$f":"IF('Cycle History'!$B$1=\"\",\"\",'Cycle History'!$B$1)","v":"CYCLE HISTORY"},{"$f":"IF('Cycle History'!$B$3=\"\",\"\",'Cycle History'!$B$3)","v":"CYCLE"},{"$f":"IF('Cycle History'!$B$55=\"\",\"\",'Cycle History'!$B$55)","v":18},{"$f":"IF('Cycle History'!$C$56=\"\",\"\",'Cycle History'!$C$56)","v":"Out Freezing chamber"},{"$f":"IF('Cycle History'!$G$3=\"\",\"\",'Cycle History'!$G$3)","v":"TIME OUT"}]
[234,{"$f":"IF('Cycle History'!$E$57=\"\",\"\",'Cycle History'!$E$57)","v":""},{"$f":"IF('Cycle History'!$B$1=\"\",\"\",'Cycle History'!$B$1)","v":"CYCLE HISTORY"},{"$f":"IF('Cycle History'!$B$3=\"\",\"\",'Cycle History'!$B$3)","v":"CYCLE"},{"$f":"IF('Cycle History'!$B$55=\"\",\"\",'Cycle History'!$B$55)","v":18},{"$f":"IF('Cycle History'!$C$57=\"\",\"\",'Cycle History'!$C$57)","v":"Thawed"},{"$f":"IF('Cycle History'!$E$3=\"\",\"\",'Cycle History'!$E$3)","v":"DATE"}]
[235,{"$f":"IF('Cycle History'!$F$57=\"\",\"\",'Cycle History'!$F$57)","v":""},{"$f":"IF('Cycle History'!$B$1=\"\",\"\",'Cycle History'!$B$1)","v":"CYCLE HISTORY"},{"$f":"IF('Cycle History'!$B$3=\"\",\"\",'Cycle History'!$B$3)","v":"CYCLE"},{"$f":"IF('Cycle History'!$B$55=\"\",\"\",'Cycle History'!$B$55)","v":18},{"$f":"IF('Cycle History'!$C$57=\"\",\"\",'Cycle History'!$C$57)","v":"Thawed"},{"$f":"IF('Cycle History'!$F$3=\"\",\"\",'Cycle History'!$F$3)","v":"TIME IN"}]
[236,{"$f":"IF('Cycle History'!$G$57=\"\",\"\",'Cycle History'!$G$57)","v":""},{"$f":"IF('Cycle History'!$B$1=\"\",\"\",'Cycle History'!$B$1)","v":"CYCLE HISTORY"},{"$f":"IF('Cycle History'!$B$3=\"\",\"\",'Cycle History'!$B$3)","v":"CYCLE"},{"$f":"IF('Cycle History'!$B$55=\"\",\"\",'Cycle History'!$B$55)","v":18},{"$f":"IF('Cycle History'!$C$57=\"\",\"\",'Cycle History'!$C$57)","v":"Thawed"},{"$f":"IF('Cycle History'!$G$3=\"\",\"\",'Cycle History'!$G$3)","v":"TIME OUT"}]
[237,{"$f":"IF('Cycle History'!$E$58=\"\",\"\",'Cycle History'!$E$58)","v":""},{"$f":"IF('Cycle History'!$B$1=\"\",\"\",'Cycle History'!$B$1)","v":"CYCLE HISTORY"},{"$f":"IF('Cycle History'!$B$3=\"\",\"\",'Cycle History'!$B$3)","v":"CYCLE"},{"$f":"IF('Cycle History'!$B$58=\"\",\"\",'Cycle History'!$B$58)","v":19},{"$f":"IF('Cycle History'!$C$58=\"\",\"\",'Cycle History'!$C$58)","v":"In Freezing chamber"},{"$f":"IF('Cycle History'!$E$3=\"\",\"\",'Cycle History'!$E$3)","v":"DATE"}]
[238,{"$f":"IF('Cycle History'!$F$58=\"\",\"\",'Cycle History'!$F$58)","v":""},{"$f":"IF('Cycle History'!$B$1=\"\",\"\",'Cycle History'!$B$1)","v":"CYCLE HISTORY"},{"$f":"IF('Cycle History'!$B$3=\"\",\"\",'Cycle History'!$B$3)","v":"CYCLE"},{"$f":"IF('Cycle History'!$B$58=\"\",\"\",'Cycle History'!$B$58)","v":19},{"$f":"IF('Cycle History'!$C$58=\"\",\"\",'Cycle History'!$C$58)","v":"In Freezing chamber"},{"$f":"IF('Cycle History'!$F$3=\"\",\"\",'Cycle History'!$F$3)","v":"TIME IN"}]
[239,{"$f":"IF('Cycle History'!$G$58=\"\",\"\",'Cycle History'!$G$58)","v":""},{"$f":"IF('Cycle History'!$B$1=\"\",\"\",'Cycle History'!$B$1)","v":"CYCLE HISTORY"},{"$f":"IF('Cycle History'!$B$3=\"\",\"\",'Cycle History'!$B$3)","v":"CYCLE"},{"$f":"IF('Cycle History'!$B$58=\"\",\"\",'Cycle History'!$B$58)","v":19},{"$f":"IF('Cycle History'!$C$58=\"\",\"\",'Cycle History'!$C$58)","v":"In Freezing chamber"},{"$f":"IF('Cycle History'!$G$3=\"\",\"\",'Cycle History'!$G$3)","v":"TIME OUT"}]
[240,{"$f":"IF('Cycle History'!$H$58=\"\",\"\",'Cycle History'!$H$58)","v":""},{"$f":"IF('Cycle History'!$B$1=\"\",\"\",'Cycle History'!$B$1)","v":"CYCLE HISTORY"},{"$f":"IF('Cycle History'!$B$3=\"\",\"\",'Cycle History'!$B$3)","v":"CYCLE"},{"$f":"IF('Cycle History'!$B$58=\"\",\"\",'Cycle History'!$B$58)","v":19},{"$f":"IF('Cycle History'!$C$58=\"\",\"\",'Cycle History'!$C$58)","v":"In Freezing chamber"},{"$f":"IF('Cycle History'!$H$3=\"\",\"\",'Cycle History'!$H$3)","v":"REMARKS"}]
[241,{"$f":"IF('Cycle History'!$E$59=\"\",\"\",'Cycle History'!$E$59)","v":""},{"$f":"IF('Cycle History'!$B$1=\"\",\"\",'Cycle History'!$B$1)","v":"CYCLE HISTORY"},{"$f":"IF('Cycle History'!$B$3=\"\",\"\",'Cycle History'!$B$3)","v":"CYCLE"},{"$f":"IF('Cycle History'!$B$58=\"\",\"\",'Cycle History'!$B$58)","v":19},{"$f":"IF('Cycle History'!$C$59=\"\",\"\",'Cycle History'!$C$59)","v":"Out Freezing chamber"},{"$f":"IF('Cycle History'!$E$3=\"\",\"\",'Cycle History'!$E$3)","v":"DATE"}]
[242,{"$f":"IF('Cycle History'!$F$59=\"\",\"\",'Cycle History'!$F$59)","v":""},{"$f":"IF('Cycle History'!$B$1=\"\",\"\",'Cycle History'!$B$1)","v":"CYCLE HISTORY"},{"$f":"IF('Cycle History'!$B$3=\"\",\"\",'Cycle History'!$B$3)","v":"CYCLE"},{"$f":"IF('Cycle History'!$B$58=\"\",\"\",'Cycle History'!$B$58)","v":19},{"$f":"IF('Cycle History'!$C$59=\"\",\"\",'Cycle History'!$C$59)","v":"Out Freezing chamber"},{"$f":"IF('Cycle History'!$F$3=\"\",\"\",'Cycle History'!$F$3)","v":"TIME IN"}]
[243,{"$f":"IF('Cycle History'!$G$59=\"\",\"\",'Cycle History'!$G$59)","v":""},{"$f":"IF('Cycle History'!$B$1=\"\",\"\",'Cycle History'!$B$1)","v":"CYCLE HISTORY"},{"$f":"IF('Cycle History'!$B$3=\"\",\"\",'Cycle History'!$B$3)","v":"CYCLE"},{"$f":"IF('Cycle History'!$B$58=\"\",\"\",'Cycle History'!$B$58)","v":19},{"$f":"IF('Cycle History'!$C$59=\"\",\"\",'Cycle History'!$C$59)","v":"Out Freezing chamber"},{"$f":"IF('Cycle History'!$G$3=\"\",\"\",'Cycle History'!$G$3)","v":"TIME OUT"}]
[244,{"$f":"IF('Cycle History'!$E$60=\"\",\"\",'Cycle History'!$E$60)","v":""},{"$f":"IF('Cycle History'!$B$1=\"\",\"\",'Cycle History'!$B$1)","v":"CYCLE HISTORY"},{"$f":"IF('Cycle History'!$B$3=\"\",\"\",'Cycle History'!$B$3)","v":"CYCLE"},{"$f":"IF('Cycle History'!$B$58=\"\",\"\",'Cycle History'!$B$58)","v":19},{"$f":"IF('Cycle History'!$C$60=\"\",\"\",'Cycle History'!$C$60)","v":"Thawed"},{"$f":"IF('Cycle History'!$E$3=\"\",\"\",'Cycle History'!$E$3)","v":"DATE"}]
[245,{"$f":"IF('Cycle History'!$F$60=\"\",\"\",'Cycle History'!$F$60)","v":""},{"$f":"IF('Cycle History'!$B$1=\"\",\"\",'Cycle History'!$B$1)","v":"CYCLE HISTORY"},{"$f":"IF('Cycle History'!$B$3=\"\",\"\",'Cycle History'!$B$3)","v":"CYCLE"},{"$f":"IF('Cycle History'!$B$58=\"\",\"\",'Cycle History'!$B$58)","v":19},{"$f":"IF('Cycle History'!$C$60=\"\",\"\",'Cycle History'!$C$60)","v":"Thawed"},{"$f":"IF('Cycle History'!$F$3=\"\",\"\",'Cycle History'!$F$3)","v":"TIME IN"}]
[246,{"$f":"IF('Cycle History'!$G$60=\"\",\"\",'Cycle History'!$G$60)","v":""},{"$f":"IF('Cycle History'!$B$1=\"\",\"\",'Cycle History'!$B$1)","v":"CYCLE HISTORY"},{"$f":"IF('Cycle History'!$B$3=\"\",\"\",'Cycle History'!$B$3)","v":"CYCLE"},{"$f":"IF('Cycle History'!$B$58=\"\",\"\",'Cycle History'!$B$58)","v":19},{"$f":"IF('Cycle History'!$C$60=\"\",\"\",'Cycle History'!$C$60)","v":"Thawed"},{"$f":"IF('Cycle History'!$G$3=\"\",\"\",'Cycle History'!$G$3)","v":"TIME OUT"}]
[247,{"$f":"IF('Cycle History'!$E$61=\"\",\"\",'Cycle History'!$E$61)","v":""},{"$f":"IF('Cycle History'!$B$1=\"\",\"\",'Cycle History'!$B$1)","v":"CYCLE HISTORY"},{"$f":"IF('Cycle History'!$B$3=\"\",\"\",'Cycle History'!$B$3)","v":"CYCLE"},{"$f":"IF('Cycle History'!$B$61=\"\",\"\",'Cycle History'!$B$61)","v":20},{"$f":"IF('Cycle History'!$C$61=\"\",\"\",'Cycle History'!$C$61)","v":"In Freezing chamber"},{"$f":"IF('Cycle History'!$E$3=\"\",\"\",'Cycle History'!$E$3)","v":"DATE"}]
[248,{"$f":"IF('Cycle History'!$F$61=\"\",\"\",'Cycle History'!$F$61)","v":""},{"$f":"IF('Cycle History'!$B$1=\"\",\"\",'Cycle History'!$B$1)","v":"CYCLE HISTORY"},{"$f":"IF('Cycle History'!$B$3=\"\",\"\",'Cycle History'!$B$3)","v":"CYCLE"},{"$f":"IF('Cycle History'!$B$61=\"\",\"\",'Cycle History'!$B$61)","v":20},{"$f":"IF('Cycle History'!$C$61=\"\",\"\",'Cycle History'!$C$61)","v":"In Freezing chamber"},{"$f":"IF('Cycle History'!$F$3=\"\",\"\",'Cycle History'!$F$3)","v":"TIME IN"}]
[249,{"$f":"IF('Cycle History'!$G$61=\"\",\"\",'Cycle History'!$G$61)","v":""},{"$f":"IF('Cycle History'!$B$1=\"\",\"\",'Cycle History'!$B$1)","v":"CYCLE HISTORY"},{"$f":"IF('Cycle History'!$B$3=\"\",\"\",'Cycle History'!$B$3)","v":"CYCLE"},{"$f":"IF('Cycle History'!$B$61=\"\",\"\",'Cycle History'!$B$61)","v":20},{"$f":"IF('Cycle History'!$C$61=\"\",\"\",'Cycle History'!$C$61)","v":"In Freezing chamber"},{"$f":"IF('Cycle History'!$G$3=\"\",\"\",'Cycle History'!$G$3)","v":"TIME OUT"}]
[250,{"$f":"IF('Cycle History'!$H$61=\"\",\"\",'Cycle History'!$H$61)","v":""},{"$f":"IF('Cycle History'!$B$1=\"\",\"\",'Cycle History'!$B$1)","v":"CYCLE HISTORY"},{"$f":"IF('Cycle History'!$B$3=\"\",\"\",'Cycle History'!$B$3)","v":"CYCLE"},{"$f":"IF('Cycle History'!$B$61=\"\",\"\",'Cycle History'!$B$61)","v":20},{"$f":"IF('Cycle History'!$C$61=\"\",\"\",'Cycle History'!$C$61)","v":"In Freezing chamber"},{"$f":"IF('Cycle History'!$H$3=\"\",\"\",'Cycle History'!$H$3)","v":"REMARKS"}]
[251,{"$f":"IF('Cycle History'!$E$62=\"\",\"\",'Cycle History'!$E$62)","v":""},{"$f":"IF('Cycle History'!$B$1=\"\",\"\",'Cycle History'!$B$1)","v":"CYCLE HISTORY"},{"$f":"IF('Cycle History'!$B$3=\"\",\"\",'Cycle History'!$B$3)","v":"CYCLE"},{"$f":"IF('Cycle History'!$B$61=\"\",\"\",'Cycle History'!$B$61)","v":20},{"$f":"IF('Cycle History'!$C$62=\"\",\"\",'Cycle History'!$C$62)","v":"Out Freezing chamber"},{"$f":"IF('Cycle History'!$E$3=\"\",\"\",'Cycle History'!$E$3)","v":"DATE"}]
[252,{"$f":"IF('Cycle History'!$F$62=\"\",\"\",'Cycle History'!$F$62)","v":""},{"$f":"IF('Cycle History'!$B$1=\"\",\"\",'Cycle History'!$B$1)","v":"CYCLE HISTORY"},{"$f":"IF('Cycle History'!$B$3=\"\",\"\",'Cycle History'!$B$3)","v":"CYCLE"},{"$f":"IF('Cycle History'!$B$61=\"\",\"\",'Cycle History'!$B$61)","v":20},{"$f":"IF('Cycle History'!$C$62=\"\",\"\",'Cycle History'!$C$62)","v":"Out Freezing chamber"},{"$f":"IF('Cycle History'!$F$3=\"\",\"\",'Cycle History'!$F$3)","v":"TIME IN"}]
[253,{"$f":"IF('Cycle History'!$G$62=\"\",\"\",'Cycle History'!$G$62)","v":""},{"$f":"IF('Cycle History'!$B$1=\"\",\"\",'Cycle History'!$B$1)","v":"CYCLE HISTORY"},{"$f":"IF('Cycle History'!$B$3=\"\",\"\",'Cycle History'!$B$3)","v":"CYCLE"},{"$f":"IF('Cycle History'!$B$61=\"\",\"\",'Cycle History'!$B$61)","v":20},{"$f":"IF('Cycle History'!$C$62=\"\",\"\",'Cycle History'!$C$62)","v":"Out Freezing chamber"},{"$f":"IF('Cycle History'!$G$3=\"\",\"\",'Cycle History'!$G$3)","v":"TIME OUT"}]
[254,{"$f":"IF('Cycle History'!$E$63=\"\",\"\",'Cycle History'!$E$63)","v":""},{"$f":"IF('Cycle History'!$B$1=\"\",\"\",'Cycle History'!$B$1)","v":"CYCLE HISTORY"},{"$f":"IF('Cycle History'!$B$3=\"\",\"\",'Cycle History'!$B$3)","v":"CYCLE"},{"$f":"IF('Cycle History'!$B$61=\"\",\"\",'Cycle History'!$B$61)","v":20},{"$f":"IF('Cycle History'!$C$63=\"\",\"\",'Cycle History'!$C$63)","v":"Thawed"},{"$f":"IF('Cycle History'!$E$3=\"\",\"\",'Cycle History'!$E$3)","v":"DATE"}]
[255,{"$f":"IF('Cycle History'!$F$63=\"\",\"\",'Cycle History'!$F$63)","v":""},{"$f":"IF('Cycle History'!$B$1=\"\",\"\",'Cycle History'!$B$1)","v":"CYCLE HISTORY"},{"$f":"IF('Cycle History'!$B$3=\"\",\"\",'Cycle History'!$B$3)","v":"CYCLE"},{"$f":"IF('Cycle History'!$B$61=\"\",\"\",'Cycle History'!$B$61)","v":20},{"$f":"IF('Cycle History'!$C$63=\"\",\"\",'Cycle History'!$C$63)","v":"Thawed"},{"$f":"IF('Cycle History'!$F$3=\"\",\"\",'Cycle History'!$F$3)","v":"TIME IN"}]
[256,{"$f":"IF('Cycle History'!$G$63=\"\",\"\",'Cycle History'!$G$63)","v":""},{"$f":"IF('Cycle History'!$B$1=\"\",\"\",'Cycle History'!$B$1)","v":"CYCLE HISTORY"},{"$f":"IF('Cycle History'!$B$3=\"\",\"\",'Cycle History'!$B$3)","v":"CYCLE"},{"$f":"IF('Cycle History'!$B$61=\"\",\"\",'Cycle History'!$B$61)","v":20},{"$f":"IF('Cycle History'!$C$63=\"\",\"\",'Cycle History'!$C$63)","v":"Thawed"},{"$f":"IF('Cycle History'!$G$3=\"\",\"\",'Cycle History'!$G$3)","v":"TIME OUT"}]
[257,{"$f":"IF('Cycle History'!$E$64=\"\",\"\",'Cycle History'!$E$64)","v":""},{"$f":"IF('Cycle History'!$B$1=\"\",\"\",'Cycle History'!$B$1)","v":"CYCLE HISTORY"},{"$f":"IF('Cycle History'!$B$3=\"\",\"\",'Cycle History'!$B$3)","v":"CYCLE"},{"$f":"IF('Cycle History'!$B$64=\"\",\"\",'Cycle History'!$B$64)","v":21},{"$f":"IF('Cycle History'!$C$64=\"\",\"\",'Cycle History'!$C$64)","v":"In Freezing chamber"},{"$f":"IF('Cycle History'!$E$3=\"\",\"\",'Cycle History'!$E$3)","v":"DATE"}]
[258,{"$f":"IF('Cycle History'!$F$64=\"\",\"\",'Cycle History'!$F$64)","v":""},{"$f":"IF('Cycle History'!$B$1=\"\",\"\",'Cycle History'!$B$1)","v":"CYCLE HISTORY"},{"$f":"IF('Cycle History'!$B$3=\"\",\"\",'Cycle History'!$B$3)","v":"CYCLE"},{"$f":"IF('Cycle History'!$B$64=\"\",\"\",'Cycle History'!$B$64)","v":21},{"$f":"IF('Cycle History'!$C$64=\"\",\"\",'Cycle History'!$C$64)","v":"In Freezing chamber"},{"$f":"IF('Cycle History'!$F$3=\"\",\"\",'Cycle History'!$F$3)","v":"TIME IN"}]
[259,{"$f":"IF('Cycle History'!$G$64=\"\",\"\",'Cycle History'!$G$64)","v":""},{"$f":"IF('Cycle History'!$B$1=\"\",\"\",'Cycle History'!$B$1)","v":"CYCLE HISTORY"},{"$f":"IF('Cycle History'!$B$3=\"\",\"\",'Cycle History'!$B$3)","v":"CYCLE"},{"$f":"IF('Cycle History'!$B$64=\"\",\"\",'Cycle History'!$B$64)","v":21},{"$f":"IF('Cycle History'!$C$64=\"\",\"\",'Cycle History'!$C$64)","v":"In Freezing chamber"},{"$f":"IF('Cycle History'!$G$3=\"\",\"\",'Cycle History'!$G$3)","v":"TIME OUT"}]
[260,{"$f":"IF('Cycle History'!$H$64=\"\",\"\",'Cycle History'!$H$64)","v":""},{"$f":"IF('Cycle History'!$B$1=\"\",\"\",'Cycle History'!$B$1)","v":"CYCLE HISTORY"},{"$f":"IF('Cycle History'!$B$3=\"\",\"\",'Cycle History'!$B$3)","v":"CYCLE"},{"$f":"IF('Cycle History'!$B$64=\"\",\"\",'Cycle History'!$B$64)","v":21},{"$f":"IF('Cycle History'!$C$64=\"\",\"\",'Cycle History'!$C$64)","v":"In Freezing chamber"},{"$f":"IF('Cycle History'!$H$3=\"\",\"\",'Cycle History'!$H$3)","v":"REMARKS"}]
[261,{"$f":"IF('Cycle History'!$E$65=\"\",\"\",'Cycle History'!$E$65)","v":""},{"$f":"IF('Cycle History'!$B$1=\"\",\"\",'Cycle History'!$B$1)","v":"CYCLE HISTORY"},{"$f":"IF('Cycle History'!$B$3=\"\",\"\",'Cycle History'!$B$3)","v":"CYCLE"},{"$f":"IF('Cycle History'!$B$64=\"\",\"\",'Cycle History'!$B$64)","v":21},{"$f":"IF('Cycle History'!$C$65=\"\",\"\",'Cycle History'!$C$65)","v":"Out Freezing chamber"},{"$f":"IF('Cycle History'!$E$3=\"\",\"\",'Cycle History'!$E$3)","v":"DATE"}]
[262,{"$f":"IF('Cycle History'!$F$65=\"\",\"\",'Cycle History'!$F$65)","v":""},{"$f":"IF('Cycle History'!$B$1=\"\",\"\",'Cycle History'!$B$1)","v":"CYCLE HISTORY"},{"$f":"IF('Cycle History'!$B$3=\"\",\"\",'Cycle History'!$B$3)","v":"CYCLE"},{"$f":"IF('Cycle History'!$B$64=\"\",\"\",'Cycle History'!$B$64)","v":21},{"$f":"IF('Cycle History'!$C$65=\"\",\"\",'Cycle History'!$C$65)","v":"Out Freezing chamber"},{"$f":"IF('Cycle History'!$F$3=\"\",\"\",'Cycle History'!$F$3)","v":"TIME IN"}]
[263,{"$f":"IF('Cycle History'!$G$65=\"\",\"\",'Cycle History'!$G$65)","v":""},{"$f":"IF('Cycle History'!$B$1=\"\",\"\",'Cycle History'!$B$1)","v":"CYCLE HISTORY"},{"$f":"IF('Cycle History'!$B$3=\"\",\"\",'Cycle History'!$B$3)","v":"CYCLE"},{"$f":"IF('Cycle History'!$B$64=\"\",\"\",'Cycle History'!$B$64)","v":21},{"$f":"IF('Cycle History'!$C$65=\"\",\"\",'Cycle History'!$C$65)","v":"Out Freezing chamber"},{"$f":"IF('Cycle History'!$G$3=\"\",\"\",'Cycle History'!$G$3)","v":"TIME OUT"}]
[264,{"$f":"IF('Cycle History'!$E$66=\"\",\"\",'Cycle History'!$E$66)","v":""},{"$f":"IF('Cycle History'!$B$1=\"\",\"\",'Cycle History'!$B$1)","v":"CYCLE HISTORY"},{"$f":"IF('Cycle History'!$B$3=\"\",\"\",'Cycle History'!$B$3)","v":"CYCLE"},{"$f":"IF('Cycle History'!$B$64=\"\",\"\",'Cycle History'!$B$64)","v":21},{"$f":"IF('Cycle History'!$C$66=\"\",\"\",'Cycle History'!$C$66)","v":"Thawed"},{"$f":"IF('Cycle History'!$E$3=\"\",\"\",'Cycle History'!$E$3)","v":"DATE"}]
[265,{"$f":"IF('Cycle History'!$F$66=\"\",\"\",'Cycle History'!$F$66)","v":""},{"$f":"IF('Cycle History'!$B$1=\"\",\"\",'Cycle History'!$B$1)","v":"CYCLE HISTORY"},{"$f":"IF('Cycle History'!$B$3=\"\",\"\",'Cycle History'!$B$3)","v":"CYCLE"},{"$f":"IF('Cycle History'!$B$64=\"\",\"\",'Cycle History'!$B$64)","v":21},{"$f":"IF('Cycle History'!$C$66=\"\",\"\",'Cycle History'!$C$66)","v":"Thawed"},{"$f":"IF('Cycle History'!$F$3=\"\",\"\",'Cycle History'!$F$3)","v":"TIME IN"}]
[266,{"$f":"IF('Cycle History'!$G$66=\"\",\"\",'Cycle History'!$G$66)","v":""},{"$f":"IF('Cycle History'!$B$1=\"\",\"\",'Cycle History'!$B$1)","v":"CYCLE HISTORY"},{"$f":"IF('Cycle History'!$B$3=\"\",\"\",'Cycle History'!$B$3)","v":"CYCLE"},{"$f":"IF('Cycle History'!$B$64=\"\",\"\",'Cycle History'!$B$64)","v":21},{"$f":"IF('Cycle History'!$C$66=\"\",\"\",'Cycle History'!$C$66)","v":"Thawed"},{"$f":"IF('Cycle History'!$G$3=\"\",\"\",'Cycle History'!$G$3)","v":"TIME OUT"}]
[267,{"$f":"IF('Cycle History'!$E$67=\"\",\"\",'Cycle History'!$E$67)","v":""},{"$f":"IF('Cycle History'!$B$1=\"\",\"\",'Cycle History'!$B$1)","v":"CYCLE HISTORY"},{"$f":"IF('Cycle History'!$B$3=\"\",\"\",'Cycle History'!$B$3)","v":"CYCLE"},{"$f":"IF('Cycle History'!$B$67=\"\",\"\",'Cycle History'!$B$67)","v":22},{"$f":"IF('Cycle History'!$C$67=\"\",\"\",'Cycle History'!$C$67)","v":"In Freezing chamber"},{"$f":"IF('Cycle History'!$E$3=\"\",\"\",'Cycle History'!$E$3)","v":"DATE"}]
[268,{"$f":"IF('Cycle History'!$F$67=\"\",\"\",'Cycle History'!$F$67)","v":""},{"$f":"IF('Cycle History'!$B$1=\"\",\"\",'Cycle History'!$B$1)","v":"CYCLE HISTORY"},{"$f":"IF('Cycle History'!$B$3=\"\",\"\",'Cycle History'!$B$3)","v":"CYCLE"},{"$f":"IF('Cycle History'!$B$67=\"\",\"\",'Cycle History'!$B$67)","v":22},{"$f":"IF('Cycle History'!$C$67=\"\",\"\",'Cycle History'!$C$67)","v":"In Freezing chamber"},{"$f":"IF('Cycle History'!$F$3=\"\",\"\",'Cycle History'!$F$3)","v":"TIME IN"}]
[269,{"$f":"IF('Cycle History'!$G$67=\"\",\"\",'Cycle History'!$G$67)","v":""},{"$f":"IF('Cycle History'!$B$1=\"\",\"\",'Cycle History'!$B$1)","v":"CYCLE HISTORY"},{"$f":"IF('Cycle History'!$B$3=\"\",\"\",'Cycle History'!$B$3)","v":"CYCLE"},{"$f":"IF('Cycle History'!$B$67=\"\",\"\",'Cycle History'!$B$67)","v":22},{"$f":"IF('Cycle History'!$C$67=\"\",\"\",'Cycle History'!$C$67)","v":"In Freezing chamber"},{"$f":"IF('Cycle History'!$G$3=\"\",\"\",'Cycle History'!$G$3)","v":"TIME OUT"}]
[270,{"$f":"IF('Cycle History'!$H$67=\"\",\"\",'Cycle History'!$H$67)","v":""},{"$f":"IF('Cycle History'!$B$1=\"\",\"\",'Cycle History'!$B$1)","v":"CYCLE HISTORY"},{"$f":"IF('Cycle History'!$B$3=\"\",\"\",'Cycle History'!$B$3)","v":"CYCLE"},{"$f":"IF('Cycle History'!$B$67=\"\",\"\",'Cycle History'!$B$67)","v":22},{"$f":"IF('Cycle History'!$C$67=\"\",\"\",'Cycle History'!$C$67)","v":"In Freezing chamber"},{"$f":"IF('Cycle History'!$H$3=\"\",\"\",'Cycle History'!$H$3)","v":"REMARKS"}]
[271,{"$f":"IF('Cycle History'!$E$68=\"\",\"\",'Cycle History'!$E$68)","v":""},{"$f":"IF('Cycle History'!$B$1=\"\",\"\",'Cycle History'!$B$1)","v":"CYCLE HISTORY"},{"$f":"IF('Cycle History'!$B$3=\"\",\"\",'Cycle History'!$B$3)","v":"CYCLE"},{"$f":"IF('Cycle History'!$B$67=\"\",\"\",'Cycle History'!$B$67)","v":22},{"$f":"IF('Cycle History'!$C$68=\"\",\"\",'Cycle History'!$C$68)","v":"Out Freezing chamber"},{"$f":"IF('Cycle History'!$E$3=\"\",\"\",'Cycle History'!$E$3)","v":"DATE"}]
[272,{"$f":"IF('Cycle History'!$F$68=\"\",\"\",'Cycle History'!$F$68)","v":""},{"$f":"IF('Cycle History'!$B$1=\"\",\"\",'Cycle History'!$B$1)","v":"CYCLE HISTORY"},{"$f":"IF('Cycle History'!$B$3=\"\",\"\",'Cycle History'!$B$3)","v":"CYCLE"},{"$f":"IF('Cycle History'!$B$67=\"\",\"\",'Cycle History'!$B$67)","v":22},{"$f":"IF('Cycle History'!$C$68=\"\",\"\",'Cycle History'!$C$68)","v":"Out Freezing chamber"},{"$f":"IF('Cycle History'!$F$3=\"\",\"\",'Cycle History'!$F$3)","v":"TIME IN"}]
[273,{"$f":"IF('Cycle History'!$G$68=\"\",\"\",'Cycle History'!$G$68)","v":""},{"$f":"IF('Cycle History'!$B$1=\"\",\"\",'Cycle History'!$B$1)","v":"CYCLE HISTORY"},{"$f":"IF('Cycle History'!$B$3=\"\",\"\",'Cycle History'!$B$3)","v":"CYCLE"},{"$f":"IF('Cycle History'!$B$67=\"\",\"\",'Cycle History'!$B$67)","v":22},{"$f":"IF('Cycle History'!$C$68=\"\",\"\",'Cycle History'!$C$68)","v":"Out Freezing chamber"},{"$f":"IF('Cycle History'!$G$3=\"\",\"\",'Cycle History'!$G$3)","v":"TIME OUT"}]
[274,{"$f":"IF('Cycle History'!$E$69=\"\",\"\",'Cycle History'!$E$69)","v":""},{"$f":"IF('Cycle History'!$B$1=\"\",\"\",'Cycle History'!$B$1)","v":"CYCLE HISTORY"},{"$f":"IF('Cycle History'!$B$3=\"\",\"\",'Cycle History'!$B$3)","v":"CYCLE"},{"$f":"IF('Cycle History'!$B$67=\"\",\"\",'Cycle History'!$B$67)","v":22},{"$f":"IF('Cycle History'!$C$69=\"\",\"\",'Cycle History'!$C$69)","v":"Thawed"},{"$f":"IF('Cycle History'!$E$3=\"\",\"\",'Cycle History'!$E$3)","v":"DATE"}]
[275,{"$f":"IF('Cycle History'!$F$69=\"\",\"\",'Cycle History'!$F$69)","v":""},{"$f":"IF('Cycle History'!$B$1=\"\",\"\",'Cycle History'!$B$1)","v":"CYCLE HISTORY"},{"$f":"IF('Cycle History'!$B$3=\"\",\"\",'Cycle History'!$B$3)","v":"CYCLE"},{"$f":"IF('Cycle History'!$B$67=\"\",\"\",'Cycle History'!$B$67)","v":22},{"$f":"IF('Cycle History'!$C$69=\"\",\"\",'Cycle History'!$C$69)","v":"Thawed"},{"$f":"IF('Cycle History'!$F$3=\"\",\"\",'Cycle History'!$F$3)","v":"TIME IN"}]
[276,{"$f":"IF('Cycle History'!$G$69=\"\",\"\",'Cycle History'!$G$69)","v":""},{"$f":"IF('Cycle History'!$B$1=\"\",\"\",'Cycle History'!$B$1)","v":"CYCLE HISTORY"},{"$f":"IF('Cycle History'!$B$3=\"\",\"\",'Cycle History'!$B$3)","v":"CYCLE"},{"$f":"IF('Cycle History'!$B$67=\"\",\"\",'Cycle History'!$B$67)","v":22},{"$f":"IF('Cycle History'!$C$69=\"\",\"\",'Cycle History'!$C$69)","v":"Thawed"},{"$f":"IF('Cycle History'!$G$3=\"\",\"\",'Cycle History'!$G$3)","v":"TIME OUT"}]
[277,{"$f":"IF('Cycle History'!$E$70=\"\",\"\",'Cycle History'!$E$70)","v":""},{"$f":"IF('Cycle History'!$B$1=\"\",\"\",'Cycle History'!$B$1)","v":"CYCLE HISTORY"},{"$f":"IF('Cycle History'!$B$3=\"\",\"\",'Cycle History'!$B$3)","v":"CYCLE"},{"$f":"IF('Cycle History'!$B$70=\"\",\"\",'Cycle History'!$B$70)","v":23},{"$f":"IF('Cycle History'!$C$70=\"\",\"\",'Cycle History'!$C$70)","v":"In Freezing chamber"},{"$f":"IF('Cycle History'!$E$3=\"\",\"\",'Cycle History'!$E$3)","v":"DATE"}]
[278,{"$f":"IF('Cycle History'!$F$70=\"\",\"\",'Cycle History'!$F$70)","v":""},{"$f":"IF('Cycle History'!$B$1=\"\",\"\",'Cycle History'!$B$1)","v":"CYCLE HISTORY"},{"$f":"IF('Cycle History'!$B$3=\"\",\"\",'Cycle History'!$B$3)","v":"CYCLE"},{"$f":"IF('Cycle History'!$B$70=\"\",\"\",'Cycle History'!$B$70)","v":23},{"$f":"IF('Cycle History'!$C$70=\"\",\"\",'Cycle History'!$C$70)","v":"In Freezing chamber"},{"$f":"IF('Cycle History'!$F$3=\"\",\"\",'Cycle History'!$F$3)","v":"TIME IN"}]
[279,{"$f":"IF('Cycle History'!$G$70=\"\",\"\",'Cycle History'!$G$70)","v":""},{"$f":"IF('Cycle History'!$B$1=\"\",\"\",'Cycle History'!$B$1)","v":"CYCLE HISTORY"},{"$f":"IF('Cycle History'!$B$3=\"\",\"\",'Cycle History'!$B$3)","v":"CYCLE"},{"$f":"IF('Cycle History'!$B$70=\"\",\"\",'Cycle History'!$B$70)","v":23},{"$f":"IF('Cycle History'!$C$70=\"\",\"\",'Cycle History'!$C$70)","v":"In Freezing chamber"},{"$f":"IF('Cycle History'!$G$3=\"\",\"\",'Cycle History'!$G$3)","v":"TIME OUT"}]
[280,{"$f":"IF('Cycle History'!$H$70=\"\",\"\",'Cycle History'!$H$70)","v":""},{"$f":"IF('Cycle History'!$B$1=\"\",\"\",'Cycle History'!$B$1)","v":"CYCLE HISTORY"},{"$f":"IF('Cycle History'!$B$3=\"\",\"\",'Cycle History'!$B$3)","v":"CYCLE"},{"$f":"IF('Cycle History'!$B$70=\"\",\"\",'Cycle History'!$B$70)","v":23},{"$f":"IF('Cycle History'!$C$70=\"\",\"\",'Cycle History'!$C$70)","v":"In Freezing chamber"},{"$f":"IF('Cycle History'!$H$3=\"\",\"\",'Cycle History'!$H$3)","v":"REMARKS"}]
[281,{"$f":"IF('Cycle History'!$E$71=\"\",\"\",'Cycle History'!$E$71)","v":""},{"$f":"IF('Cycle History'!$B$1=\"\",\"\",'Cycle History'!$B$1)","v":"CYCLE HISTORY"},{"$f":"IF('Cycle History'!$B$3=\"\",\"\",'Cycle History'!$B$3)","v":"CYCLE"},{"$f":"IF('Cycle History'!$B$70=\"\",\"\",'Cycle History'!$B$70)","v":23},{"$f":"IF('Cycle History'!$C$71=\"\",\"\",'Cycle History'!$C$71)","v":"Out Freezing chamber"},{"$f":"IF('Cycle History'!$E$3=\"\",\"\",'Cycle History'!$E$3)","v":"DATE"}]
[282,{"$f":"IF('Cycle History'!$F$71=\"\",\"\",'Cycle History'!$F$71)","v":""},{"$f":"IF('Cycle History'!$B$1=\"\",\"\",'Cycle History'!$B$1)","v":"CYCLE HISTORY"},{"$f":"IF('Cycle History'!$B$3=\"\",\"\",'Cycle History'!$B$3)","v":"CYCLE"},{"$f":"IF('Cycle History'!$B$70=\"\",\"\",'Cycle History'!$B$70)","v":23},{"$f":"IF('Cycle History'!$C$71=\"\",\"\",'Cycle History'!$C$71)","v":"Out Freezing chamber"},{"$f":"IF('Cycle History'!$F$3=\"\",\"\",'Cycle History'!$F$3)","v":"TIME IN"}]
[283,{"$f":"IF('Cycle History'!$G$71=\"\",\"\",'Cycle History'!$G$71)","v":""},{"$f":"IF('Cycle History'!$B$1=\"\",\"\",'Cycle History'!$B$1)","v":"CYCLE HISTORY"},{"$f":"IF('Cycle History'!$B$3=\"\",\"\",'Cycle History'!$B$3)","v":"CYCLE"},{"$f":"IF('Cycle History'!$B$70=\"\",\"\",'Cycle History'!$B$70)","v":23},{"$f":"IF('Cycle History'!$C$71=\"\",\"\",'Cycle History'!$C$71)","v":"Out Freezing chamber"},{"$f":"IF('Cycle History'!$G$3=\"\",\"\",'Cycle History'!$G$3)","v":"TIME OUT"}]
[284,{"$f":"IF('Cycle History'!$E$72=\"\",\"\",'Cycle History'!$E$72)","v":""},{"$f":"IF('Cycle History'!$B$1=\"\",\"\",'Cycle History'!$B$1)","v":"CYCLE HISTORY"},{"$f":"IF('Cycle History'!$B$3=\"\",\"\",'Cycle History'!$B$3)","v":"CYCLE"},{"$f":"IF('Cycle History'!$B$70=\"\",\"\",'Cycle History'!$B$70)","v":23},{"$f":"IF('Cycle History'!$C$72=\"\",\"\",'Cycle History'!$C$72)","v":"Thawed"},{"$f":"IF('Cycle History'!$E$3=\"\",\"\",'Cycle History'!$E$3)","v":"DATE"}]
[285,{"$f":"IF('Cycle History'!$F$72=\"\",\"\",'Cycle History'!$F$72)","v":""},{"$f":"IF('Cycle History'!$B$1=\"\",\"\",'Cycle History'!$B$1)","v":"CYCLE HISTORY"},{"$f":"IF('Cycle History'!$B$3=\"\",\"\",'Cycle History'!$B$3)","v":"CYCLE"},{"$f":"IF('Cycle History'!$B$70=\"\",\"\",'Cycle History'!$B$70)","v":23},{"$f":"IF('Cycle History'!$C$72=\"\",\"\",'Cycle History'!$C$72)","v":"Thawed"},{"$f":"IF('Cycle History'!$F$3=\"\",\"\",'Cycle History'!$F$3)","v":"TIME IN"}]
[286,{"$f":"IF('Cycle History'!$G$72=\"\",\"\",'Cycle History'!$G$72)","v":""},{"$f":"IF('Cycle History'!$B$1=\"\",\"\",'Cycle History'!$B$1)","v":"CYCLE HISTORY"},{"$f":"IF('Cycle History'!$B$3=\"\",\"\",'Cycle History'!$B$3)","v":"CYCLE"},{"$f":"IF('Cycle History'!$B$70=\"\",\"\",'Cycle History'!$B$70)","v":23},{"$f":"IF('Cycle History'!$C$72=\"\",\"\",'Cycle History'!$C$72)","v":"Thawed"},{"$f":"IF('Cycle History'!$G$3=\"\",\"\",'Cycle History'!$G$3)","v":"TIME OUT"}]
[287,{"$f":"IF('Cycle History'!$E$73=\"\",\"\",'Cycle History'!$E$73)","v":""},{"$f":"IF('Cycle History'!$B$1=\"\",\"\",'Cycle History'!$B$1)","v":"CYCLE HISTORY"},{"$f":"IF('Cycle History'!$B$3=\"\",\"\",'Cycle History'!$B$3)","v":"CYCLE"},{"$f":"IF('Cycle History'!$B$73=\"\",\"\",'Cycle History'!$B$73)","v":24},{"$f":"IF('Cycle History'!$C$73=\"\",\"\",'Cycle History'!$C$73)","v":"In Freezing chamber"},{"$f":"IF('Cycle History'!$E$3=\"\",\"\",'Cycle History'!$E$3)","v":"DATE"}]
[288,{"$f":"IF('Cycle History'!$F$73=\"\",\"\",'Cycle History'!$F$73)","v":""},{"$f":"IF('Cycle History'!$B$1=\"\",\"\",'Cycle History'!$B$1)","v":"CYCLE HISTORY"},{"$f":"IF('Cycle History'!$B$3=\"\",\"\",'Cycle History'!$B$3)","v":"CYCLE"},{"$f":"IF('Cycle History'!$B$73=\"\",\"\",'Cycle History'!$B$73)","v":24},{"$f":"IF('Cycle History'!$C$73=\"\",\"\",'Cycle History'!$C$73)","v":"In Freezing chamber"},{"$f":"IF('Cycle History'!$F$3=\"\",\"\",'Cycle History'!$F$3)","v":"TIME IN"}]
[289,{"$f":"IF('Cycle History'!$G$73=\"\",\"\",'Cycle History'!$G$73)","v":""},{"$f":"IF('Cycle History'!$B$1=\"\",\"\",'Cycle History'!$B$1)","v":"CYCLE HISTORY"},{"$f":"IF('Cycle History'!$B$3=\"\",\"\",'Cycle History'!$B$3)","v":"CYCLE"},{"$f":"IF('Cycle History'!$B$73=\"\",\"\",'Cycle History'!$B$73)","v":24},{"$f":"IF('Cycle History'!$C$73=\"\",\"\",'Cycle History'!$C$73)","v":"In Freezing chamber"},{"$f":"IF('Cycle History'!$G$3=\"\",\"\",'Cycle History'!$G$3)","v":"TIME OUT"}]
[290,{"$f":"IF('Cycle History'!$H$73=\"\",\"\",'Cycle History'!$H$73)","v":""},{"$f":"IF('Cycle History'!$B$1=\"\",\"\",'Cycle History'!$B$1)","v":"CYCLE HISTORY"},{"$f":"IF('Cycle History'!$B$3=\"\",\"\",'Cycle History'!$B$3)","v":"CYCLE"},{"$f":"IF('Cycle History'!$B$73=\"\",\"\",'Cycle History'!$B$73)","v":24},{"$f":"IF('Cycle History'!$C$73=\"\",\"\",'Cycle History'!$C$73)","v":"In Freezing chamber"},{"$f":"IF('Cycle History'!$H$3=\"\",\"\",'Cycle History'!$H$3)","v":"REMARKS"}]
[291,{"$f":"IF('Cycle History'!$E$74=\"\",\"\",'Cycle History'!$E$74)","v":""},{"$f":"IF('Cycle History'!$B$1=\"\",\"\",'Cycle History'!$B$1)","v":"CYCLE HISTORY"},{"$f":"IF('Cycle History'!$B$3=\"\",\"\",'Cycle History'!$B$3)","v":"CYCLE"},{"$f":"IF('Cycle History'!$B$73=\"\",\"\",'Cycle History'!$B$73)","v":24},{"$f":"IF('Cycle History'!$C$74=\"\",\"\",'Cycle History'!$C$74)","v":"Out Freezing chamber"},{"$f":"IF('Cycle History'!$E$3=\"\",\"\",'Cycle History'!$E$3)","v":"DATE"}]
[292,{"$f":"IF('Cycle History'!$F$74=\"\",\"\",'Cycle History'!$F$74)","v":""},{"$f":"IF('Cycle History'!$B$1=\"\",\"\",'Cycle History'!$B$1)","v":"CYCLE HISTORY"},{"$f":"IF('Cycle History'!$B$3=\"\",\"\",'Cycle History'!$B$3)","v":"CYCLE"},{"$f":"IF('Cycle History'!$B$73=\"\",\"\",'Cycle History'!$B$73)","v":24},{"$f":"IF('Cycle History'!$C$74=\"\",\"\",'Cycle History'!$C$74)","v":"Out Freezing chamber"},{"$f":"IF('Cycle History'!$F$3=\"\",\"\",'Cycle History'!$F$3)","v":"TIME IN"}]
[293,{"$f":"IF('Cycle History'!$G$74=\"\",\"\",'Cycle History'!$G$74)","v":""},{"$f":"IF('Cycle History'!$B$1=\"\",\"\",'Cycle History'!$B$1)","v":"CYCLE HISTORY"},{"$f":"IF('Cycle History'!$B$3=\"\",\"\",'Cycle History'!$B$3)","v":"CYCLE"},{"$f":"IF('Cycle History'!$B$73=\"\",\"\",'Cycle History'!$B$73)","v":24},{"$f":"IF('Cycle History'!$C$74=\"\",\"\",'Cycle History'!$C$74)","v":"Out Freezing chamber"},{"$f":"IF('Cycle History'!$G$3=\"\",\"\",'Cycle History'!$G$3)","v":"TIME OUT"}]
[294,{"$f":"IF('Cycle History'!$E$75=\"\",\"\",'Cycle History'!$E$75)","v":""},{"$f":"IF('Cycle History'!$B$1=\"\",\"\",'Cycle History'!$B$1)","v":"CYCLE HISTORY"},{"$f":"IF('Cycle History'!$B$3=\"\",\"\",'Cycle History'!$B$3)","v":"CYCLE"},{"$f":"IF('Cycle History'!$B$73=\"\",\"\",'Cycle History'!$B$73)","v":24},{"$f":"IF('Cycle History'!$C$75=\"\",\"\",'Cycle History'!$C$75)","v":"Thawed"},{"$f":"IF('Cycle History'!$E$3=\"\",\"\",'Cycle History'!$E$3)","v":"DATE"}]
[295,{"$f":"IF('Cycle History'!$F$75=\"\",\"\",'Cycle History'!$F$75)","v":""},{"$f":"IF('Cycle History'!$B$1=\"\",\"\",'Cycle History'!$B$1)","v":"CYCLE HISTORY"},{"$f":"IF('Cycle History'!$B$3=\"\",\"\",'Cycle History'!$B$3)","v":"CYCLE"},{"$f":"IF('Cycle History'!$B$73=\"\",\"\",'Cycle History'!$B$73)","v":24},{"$f":"IF('Cycle History'!$C$75=\"\",\"\",'Cycle History'!$C$75)","v":"Thawed"},{"$f":"IF('Cycle History'!$F$3=\"\",\"\",'Cycle History'!$F$3)","v":"TIME IN"}]
[296,{"$f":"IF('Cycle History'!$G$75=\"\",\"\",'Cycle History'!$G$75)","v":""},{"$f":"IF('Cycle History'!$B$1=\"\",\"\",'Cycle History'!$B$1)","v":"CYCLE HISTORY"},{"$f":"IF('Cycle History'!$B$3=\"\",\"\",'Cycle History'!$B$3)","v":"CYCLE"},{"$f":"IF('Cycle History'!$B$73=\"\",\"\",'Cycle History'!$B$73)","v":24},{"$f":"IF('Cycle History'!$C$75=\"\",\"\",'Cycle History'!$C$75)","v":"Thawed"},{"$f":"IF('Cycle History'!$G$3=\"\",\"\",'Cycle History'!$G$3)","v":"TIME OUT"}]
[297,{"$f":"IF('Cycle History'!$E$76=\"\",\"\",'Cycle History'!$E$76)","v":""},{"$f":"IF('Cycle History'!$B$1=\"\",\"\",'Cycle History'!$B$1)","v":"CYCLE HISTORY"},{"$f":"IF('Cycle History'!$B$3=\"\",\"\",'Cycle History'!$B$3)","v":"CYCLE"},{"$f":"IF('Cycle History'!$B$76=\"\",\"\",'Cycle History'!$B$76)","v":25},{"$f":"IF('Cycle History'!$C$76=\"\",\"\",'Cycle History'!$C$76)","v":"In Freezing chamber"},{"$f":"IF('Cycle History'!$E$3=\"\",\"\",'Cycle History'!$E$3)","v":"DATE"}]
[298,{"$f":"IF('Cycle History'!$F$76=\"\",\"\",'Cycle History'!$F$76)","v":""},{"$f":"IF('Cycle History'!$B$1=\"\",\"\",'Cycle History'!$B$1)","v":"CYCLE HISTORY"},{"$f":"IF('Cycle History'!$B$3=\"\",\"\",'Cycle History'!$B$3)","v":"CYCLE"},{"$f":"IF('Cycle History'!$B$76=\"\",\"\",'Cycle History'!$B$76)","v":25},{"$f":"IF('Cycle History'!$C$76=\"\",\"\",'Cycle History'!$C$76)","v":"In Freezing chamber"},{"$f":"IF('Cycle History'!$F$3=\"\",\"\",'Cycle History'!$F$3)","v":"TIME IN"}]
[299,{"$f":"IF('Cycle History'!$G$76=\"\",\"\",'Cycle History'!$G$76)","v":""},{"$f":"IF('Cycle History'!$B$1=\"\",\"\",'Cycle History'!$B$1)","v":"CYCLE HISTORY"},{"$f":"IF('Cycle History'!$B$3=\"\",\"\",'Cycle History'!$B$3)","v":"CYCLE"},{"$f":"IF('Cycle History'!$B$76=\"\",\"\",'Cycle History'!$B$76)","v":25},{"$f":"IF('Cycle History'!$C$76=\"\",\"\",'Cycle History'!$C$76)","v":"In Freezing chamber"},{"$f":"IF('Cycle History'!$G$3=\"\",\"\",'Cycle History'!$G$3)","v":"TIME OUT"}]
[300,{"$f":"IF('Cycle History'!$H$76=\"\",\"\",'Cycle History'!$H$76)","v":""},{"$f":"IF('Cycle History'!$B$1=\"\",\"\",'Cycle History'!$B$1)","v":"CYCLE HISTORY"},{"$f":"IF('Cycle History'!$B$3=\"\",\"\",'Cycle History'!$B$3)","v":"CYCLE"},{"$f":"IF('Cycle History'!$B$76=\"\",\"\",'Cycle History'!$B$76)","v":25},{"$f":"IF('Cycle History'!$C$76=\"\",\"\",'Cycle History'!$C$76)","v":"In Freezing chamber"},{"$f":"IF('Cycle History'!$H$3=\"\",\"\",'Cycle History'!$H$3)","v":"REMARKS"}]
[301,{"$f":"IF('Cycle History'!$E$77=\"\",\"\",'Cycle History'!$E$77)","v":""},{"$f":"IF('Cycle History'!$B$1=\"\",\"\",'Cycle History'!$B$1)","v":"CYCLE HISTORY"},{"$f":"IF('Cycle History'!$B$3=\"\",\"\",'Cycle History'!$B$3)","v":"CYCLE"},{"$f":"IF('Cycle History'!$B$76=\"\",\"\",'Cycle History'!$B$76)","v":25},{"$f":"IF('Cycle History'!$C$77=\"\",\"\",'Cycle History'!$C$77)","v":"Out Freezing chamber"},{"$f":"IF('Cycle History'!$E$3=\"\",\"\",'Cycle History'!$E$3)","v":"DATE"}]
[302,{"$f":"IF('Cycle History'!$F$77=\"\",\"\",'Cycle History'!$F$77)","v":""},{"$f":"IF('Cycle History'!$B$1=\"\",\"\",'Cycle History'!$B$1)","v":"CYCLE HISTORY"},{"$f":"IF('Cycle History'!$B$3=\"\",\"\",'Cycle History'!$B$3)","v":"CYCLE"},{"$f":"IF('Cycle History'!$B$76=\"\",\"\",'Cycle History'!$B$76)","v":25},{"$f":"IF('Cycle History'!$C$77=\"\",\"\",'Cycle History'!$C$77)","v":"Out Freezing chamber"},{"$f":"IF('Cycle History'!$F$3=\"\",\"\",'Cycle History'!$F$3)","v":"TIME IN"}]
[303,{"$f":"IF('Cycle History'!$G$77=\"\",\"\",'Cycle History'!$G$77)","v":""},{"$f":"IF('Cycle History'!$B$1=\"\",\"\",'Cycle History'!$B$1)","v":"CYCLE HISTORY"},{"$f":"IF('Cycle History'!$B$3=\"\",\"\",'Cycle History'!$B$3)","v":"CYCLE"},{"$f":"IF('Cycle History'!$B$76=\"\",\"\",'Cycle History'!$B$76)","v":25},{"$f":"IF('Cycle History'!$C$77=\"\",\"\",'Cycle History'!$C$77)","v":"Out Freezing chamber"},{"$f":"IF('Cycle History'!$G$3=\"\",\"\",'Cycle History'!$G$3)","v":"TIME OUT"}]
[304,{"$f":"IF('Cycle History'!$E$78=\"\",\"\",'Cycle History'!$E$78)","v":""},{"$f":"IF('Cycle History'!$B$1=\"\",\"\",'Cycle History'!$B$1)","v":"CYCLE HISTORY"},{"$f":"IF('Cycle History'!$B$3=\"\",\"\",'Cycle History'!$B$3)","v":"CYCLE"},{"$f":"IF('Cycle History'!$B$76=\"\",\"\",'Cycle History'!$B$76)","v":25},{"$f":"IF('Cycle History'!$C$78=\"\",\"\",'Cycle History'!$C$78)","v":"Thawed"},{"$f":"IF('Cycle History'!$E$3=\"\",\"\",'Cycle History'!$E$3)","v":"DATE"}]
[305,{"$f":"IF('Cycle History'!$F$78=\"\",\"\",'Cycle History'!$F$78)","v":""},{"$f":"IF('Cycle History'!$B$1=\"\",\"\",'Cycle History'!$B$1)","v":"CYCLE HISTORY"},{"$f":"IF('Cycle History'!$B$3=\"\",\"\",'Cycle History'!$B$3)","v":"CYCLE"},{"$f":"IF('Cycle History'!$B$76=\"\",\"\",'Cycle History'!$B$76)","v":25},{"$f":"IF('Cycle History'!$C$78=\"\",\"\",'Cycle History'!$C$78)","v":"Thawed"},{"$f":"IF('Cycle History'!$F$3=\"\",\"\",'Cycle History'!$F$3)","v":"TIME IN"}]
[306,{"$f":"IF('Cycle History'!$G$78=\"\",\"\",'Cycle History'!$G$78)","v":""},{"$f":"IF('Cycle History'!$B$1=\"\",\"\",'Cycle History'!$B$1)","v":"CYCLE HISTORY"},{"$f":"IF('Cycle History'!$B$3=\"\",\"\",'Cycle History'!$B$3)","v":"CYCLE"},{"$f":"IF('Cycle History'!$B$76=\"\",\"\",'Cycle History'!$B$76)","v":25},{"$f":"IF('Cycle History'!$C$78=\"\",\"\",'Cycle History'!$C$78)","v":"Thawed"},{"$f":"IF('Cycle History'!$G$3=\"\",\"\",'Cycle History'!$G$3)","v":"TIME OUT"}]
[307,{"$f":"IF('Cycle History'!$E$79=\"\",\"\",'Cycle History'!$E$79)","v":""},{"$f":"IF('Cycle History'!$B$1=\"\",\"\",'Cycle History'!$B$1)","v":"CYCLE HISTORY"},{"$f":"IF('Cycle History'!$B$3=\"\",\"\",'Cycle History'!$B$3)","v":"CYCLE"},{"$f":"IF('Cycle History'!$B$79=\"\",\"\",'Cycle History'!$B$79)","v":26},{"$f":"IF('Cycle History'!$C$79=\"\",\"\",'Cycle History'!$C$79)","v":"In Freezing chamber"},{"$f":"IF('Cycle History'!$E$3=\"\",\"\",'Cycle History'!$E$3)","v":"DATE"}]
[308,{"$f":"IF('Cycle History'!$F$79=\"\",\"\",'Cycle History'!$F$79)","v":""},{"$f":"IF('Cycle History'!$B$1=\"\",\"\",'Cycle History'!$B$1)","v":"CYCLE HISTORY"},{"$f":"IF('Cycle History'!$B$3=\"\",\"\",'Cycle History'!$B$3)","v":"CYCLE"},{"$f":"IF('Cycle History'!$B$79=\"\",\"\",'Cycle History'!$B$79)","v":26},{"$f":"IF('Cycle History'!$C$79=\"\",\"\",'Cycle History'!$C$79)","v":"In Freezing chamber"},{"$f":"IF('Cycle History'!$F$3=\"\",\"\",'Cycle History'!$F$3)","v":"TIME IN"}]
[309,{"$f":"IF('Cycle History'!$G$79=\"\",\"\",'Cycle History'!$G$79)","v":""},{"$f":"IF('Cycle History'!$B$1=\"\",\"\",'Cycle History'!$B$1)","v":"CYCLE HISTORY"},{"$f":"IF('Cycle History'!$B$3=\"\",\"\",'Cycle History'!$B$3)","v":"CYCLE"},{"$f":"IF('Cycle History'!$B$79=\"\",\"\",'Cycle History'!$B$79)","v":26},{"$f":"IF('Cycle History'!$C$79=\"\",\"\",'Cycle History'!$C$79)","v":"In Freezing chamber"},{"$f":"IF('Cycle History'!$G$3=\"\",\"\",'Cycle History'!$G$3)","v":"TIME OUT"}]
[310,{"$f":"IF('Cycle History'!$H$79=\"\",\"\",'Cycle History'!$H$79)","v":""},{"$f":"IF('Cycle History'!$B$1=\"\",\"\",'Cycle History'!$B$1)","v":"CYCLE HISTORY"},{"$f":"IF('Cycle History'!$B$3=\"\",\"\",'Cycle History'!$B$3)","v":"CYCLE"},{"$f":"IF('Cycle History'!$B$79=\"\",\"\",'Cycle History'!$B$79)","v":26},{"$f":"IF('Cycle History'!$C$79=\"\",\"\",'Cycle History'!$C$79)","v":"In Freezing chamber"},{"$f":"IF('Cycle History'!$H$3=\"\",\"\",'Cycle History'!$H$3)","v":"REMARKS"}]
[311,{"$f":"IF('Cycle History'!$E$80=\"\",\"\",'Cycle History'!$E$80)","v":""},{"$f":"IF('Cycle History'!$B$1=\"\",\"\",'Cycle History'!$B$1)","v":"CYCLE HISTORY"},{"$f":"IF('Cycle History'!$B$3=\"\",\"\",'Cycle History'!$B$3)","v":"CYCLE"},{"$f":"IF('Cycle History'!$B$79=\"\",\"\",'Cycle History'!$B$79)","v":26},{"$f":"IF('Cycle History'!$C$80=\"\",\"\",'Cycle History'!$C$80)","v":"Out Freezing chamber"},{"$f":"IF('Cycle History'!$E$3=\"\",\"\",'Cycle History'!$E$3)","v":"DATE"}]
[312,{"$f":"IF('Cycle History'!$F$80=\"\",\"\",'Cycle History'!$F$80)","v":""},{"$f":"IF('Cycle History'!$B$1=\"\",\"\",'Cycle History'!$B$1)","v":"CYCLE HISTORY"},{"$f":"IF('Cycle History'!$B$3=\"\",\"\",'Cycle History'!$B$3)","v":"CYCLE"},{"$f":"IF('Cycle History'!$B$79=\"\",\"\",'Cycle History'!$B$79)","v":26},{"$f":"IF('Cycle History'!$C$80=\"\",\"\",'Cycle History'!$C$80)","v":"Out Freezing chamber"},{"$f":"IF('Cycle History'!$F$3=\"\",\"\",'Cycle History'!$F$3)","v":"TIME IN"}]
[313,{"$f":"IF('Cycle History'!$G$80=\"\",\"\",'Cycle History'!$G$80)","v":""},{"$f":"IF('Cycle History'!$B$1=\"\",\"\",'Cycle History'!$B$1)","v":"CYCLE HISTORY"},{"$f":"IF('Cycle History'!$B$3=\"\",\"\",'Cycle History'!$B$3)","v":"CYCLE"},{"$f":"IF('Cycle History'!$B$79=\"\",\"\",'Cycle History'!$B$79)","v":26},{"$f":"IF('Cycle History'!$C$80=\"\",\"\",'Cycle History'!$C$80)","v":"Out Freezing chamber"},{"$f":"IF('Cycle History'!$G$3=\"\",\"\",'Cycle History'!$G$3)","v":"TIME OUT"}]
[314,{"$f":"IF('Cycle History'!$E$81=\"\",\"\",'Cycle History'!$E$81)","v":""},{"$f":"IF('Cycle History'!$B$1=\"\",\"\",'Cycle History'!$B$1)","v":"CYCLE HISTORY"},{"$f":"IF('Cycle History'!$B$3=\"\",\"\",'Cycle History'!$B$3)","v":"CYCLE"},{"$f":"IF('Cycle History'!$B$79=\"\",\"\",'Cycle History'!$B$79)","v":26},{"$f":"IF('Cycle History'!$C$81=\"\",\"\",'Cycle History'!$C$81)","v":"Thawed"},{"$f":"IF('Cycle History'!$E$3=\"\",\"\",'Cycle History'!$E$3)","v":"DATE"}]
[315,{"$f":"IF('Cycle History'!$F$81=\"\",\"\",'Cycle History'!$F$81)","v":""},{"$f":"IF('Cycle History'!$B$1=\"\",\"\",'Cycle History'!$B$1)","v":"CYCLE HISTORY"},{"$f":"IF('Cycle History'!$B$3=\"\",\"\",'Cycle History'!$B$3)","v":"CYCLE"},{"$f":"IF('Cycle History'!$B$79=\"\",\"\",'Cycle History'!$B$79)","v":26},{"$f":"IF('Cycle History'!$C$81=\"\",\"\",'Cycle History'!$C$81)","v":"Thawed"},{"$f":"IF('Cycle History'!$F$3=\"\",\"\",'Cycle History'!$F$3)","v":"TIME IN"}]
[316,{"$f":"IF('Cycle History'!$G$81=\"\",\"\",'Cycle History'!$G$81)","v":""},{"$f":"IF('Cycle History'!$B$1=\"\",\"\",'Cycle History'!$B$1)","v":"CYCLE HISTORY"},{"$f":"IF('Cycle History'!$B$3=\"\",\"\",'Cycle History'!$B$3)","v":"CYCLE"},{"$f":"IF('Cycle History'!$B$79=\"\",\"\",'Cycle History'!$B$79)","v":26},{"$f":"IF('Cycle History'!$C$81=\"\",\"\",'Cycle History'!$C$81)","v":"Thawed"},{"$f":"IF('Cycle History'!$G$3=\"\",\"\",'Cycle History'!$G$3)","v":"TIME OUT"}]
[317,{"$f":"IF('Cycle History'!$E$82=\"\",\"\",'Cycle History'!$E$82)","v":""},{"$f":"IF('Cycle History'!$B$1=\"\",\"\",'Cycle History'!$B$1)","v":"CYCLE HISTORY"},{"$f":"IF('Cycle History'!$B$3=\"\",\"\",'Cycle History'!$B$3)","v":"CYCLE"},{"$f":"IF('Cycle History'!$B$82=\"\",\"\",'Cycle History'!$B$82)","v":27},{"$f":"IF('Cycle History'!$C$82=\"\",\"\",'Cycle History'!$C$82)","v":"In Freezing chamber"},{"$f":"IF('Cycle History'!$E$3=\"\",\"\",'Cycle History'!$E$3)","v":"DATE"}]
[318,{"$f":"IF('Cycle History'!$F$82=\"\",\"\",'Cycle History'!$F$82)","v":""},{"$f":"IF('Cycle History'!$B$1=\"\",\"\",'Cycle History'!$B$1)","v":"CYCLE HISTORY"},{"$f":"IF('Cycle History'!$B$3=\"\",\"\",'Cycle History'!$B$3)","v":"CYCLE"},{"$f":"IF('Cycle History'!$B$82=\"\",\"\",'Cycle History'!$B$82)","v":27},{"$f":"IF('Cycle History'!$C$82=\"\",\"\",'Cycle History'!$C$82)","v":"In Freezing chamber"},{"$f":"IF('Cycle History'!$F$3=\"\",\"\",'Cycle History'!$F$3)","v":"TIME IN"}]
[319,{"$f":"IF('Cycle History'!$G$82=\"\",\"\",'Cycle History'!$G$82)","v":""},{"$f":"IF('Cycle History'!$B$1=\"\",\"\",'Cycle History'!$B$1)","v":"CYCLE HISTORY"},{"$f":"IF('Cycle History'!$B$3=\"\",\"\",'Cycle History'!$B$3)","v":"CYCLE"},{"$f":"IF('Cycle History'!$B$82=\"\",\"\",'Cycle History'!$B$82)","v":27},{"$f":"IF('Cycle History'!$C$82=\"\",\"\",'Cycle History'!$C$82)","v":"In Freezing chamber"},{"$f":"IF('Cycle History'!$G$3=\"\",\"\",'Cycle History'!$G$3)","v":"TIME OUT"}]
[320,{"$f":"IF('Cycle History'!$H$82=\"\",\"\",'Cycle History'!$H$82)","v":""},{"$f":"IF('Cycle History'!$B$1=\"\",\"\",'Cycle History'!$B$1)","v":"CYCLE HISTORY"},{"$f":"IF('Cycle History'!$B$3=\"\",\"\",'Cycle History'!$B$3)","v":"CYCLE"},{"$f":"IF('Cycle History'!$B$82=\"\",\"\",'Cycle History'!$B$82)","v":27},{"$f":"IF('Cycle History'!$C$82=\"\",\"\",'Cycle History'!$C$82)","v":"In Freezing chamber"},{"$f":"IF('Cycle History'!$H$3=\"\",\"\",'Cycle History'!$H$3)","v":"REMARKS"}]
[321,{"$f":"IF('Cycle History'!$E$83=\"\",\"\",'Cycle History'!$E$83)","v":""},{"$f":"IF('Cycle History'!$B$1=\"\",\"\",'Cycle History'!$B$1)","v":"CYCLE HISTORY"},{"$f":"IF('Cycle History'!$B$3=\"\",\"\",'Cycle History'!$B$3)","v":"CYCLE"},{"$f":"IF('Cycle History'!$B$82=\"\",\"\",'Cycle History'!$B$82)","v":27},{"$f":"IF('Cycle History'!$C$83=\"\",\"\",'Cycle History'!$C$83)","v":"Out Freezing chamber"},{"$f":"IF('Cycle History'!$E$3=\"\",\"\",'Cycle History'!$E$3)","v":"DATE"}]
[322,{"$f":"IF('Cycle History'!$F$83=\"\",\"\",'Cycle History'!$F$83)","v":""},{"$f":"IF('Cycle History'!$B$1=\"\",\"\",'Cycle History'!$B$1)","v":"CYCLE HISTORY"},{"$f":"IF('Cycle History'!$B$3=\"\",\"\",'Cycle History'!$B$3)","v":"CYCLE"},{"$f":"IF('Cycle History'!$B$82=\"\",\"\",'Cycle History'!$B$82)","v":27},{"$f":"IF('Cycle History'!$C$83=\"\",\"\",'Cycle History'!$C$83)","v":"Out Freezing chamber"},{"$f":"IF('Cycle History'!$F$3=\"\",\"\",'Cycle History'!$F$3)","v":"TIME IN"}]
[323,{"$f":"IF('Cycle History'!$G$83=\"\",\"\",'Cycle History'!$G$83)","v":""},{"$f":"IF('Cycle History'!$B$1=\"\",\"\",'Cycle History'!$B$1)","v":"CYCLE HISTORY"},{"$f":"IF('Cycle History'!$B$3=\"\",\"\",'Cycle History'!$B$3)","v":"CYCLE"},{"$f":"IF('Cycle History'!$B$82=\"\",\"\",'Cycle History'!$B$82)","v":27},{"$f":"IF('Cycle History'!$C$83=\"\",\"\",'Cycle History'!$C$83)","v":"Out Freezing chamber"},{"$f":"IF('Cycle History'!$G$3=\"\",\"\",'Cycle History'!$G$3)","v":"TIME OUT"}]
[324,{"$f":"IF('Cycle History'!$E$84=\"\",\"\",'Cycle History'!$E$84)","v":""},{"$f":"IF('Cycle History'!$B$1=\"\",\"\",'Cycle History'!$B$1)","v":"CYCLE HISTORY"},{"$f":"IF('Cycle History'!$B$3=\"\",\"\",'Cycle History'!$B$3)","v":"CYCLE"},{"$f":"IF('Cycle History'!$B$82=\"\",\"\",'Cycle History'!$B$82)","v":27},{"$f":"IF('Cycle History'!$C$84=\"\",\"\",'Cycle History'!$C$84)","v":"Thawed"},{"$f":"IF('Cycle History'!$E$3=\"\",\"\",'Cycle History'!$E$3)","v":"DATE"}]
[325,{"$f":"IF('Cycle History'!$F$84=\"\",\"\",'Cycle History'!$F$84)","v":""},{"$f":"IF('Cycle History'!$B$1=\"\",\"\",'Cycle History'!$B$1)","v":"CYCLE HISTORY"},{"$f":"IF('Cycle History'!$B$3=\"\",\"\",'Cycle History'!$B$3)","v":"CYCLE"},{"$f":"IF('Cycle History'!$B$82=\"\",\"\",'Cycle History'!$B$82)","v":27},{"$f":"IF('Cycle History'!$C$84=\"\",\"\",'Cycle History'!$C$84)","v":"Thawed"},{"$f":"IF('Cycle History'!$F$3=\"\",\"\",'Cycle History'!$F$3)","v":"TIME IN"}]
[326,{"$f":"IF('Cycle History'!$G$84=\"\",\"\",'Cycle History'!$G$84)","v":""},{"$f":"IF('Cycle History'!$B$1=\"\",\"\",'Cycle History'!$B$1)","v":"CYCLE HISTORY"},{"$f":"IF('Cycle History'!$B$3=\"\",\"\",'Cycle History'!$B$3)","v":"CYCLE"},{"$f":"IF('Cycle History'!$B$82=\"\",\"\",'Cycle History'!$B$82)","v":27},{"$f":"IF('Cycle History'!$C$84=\"\",\"\",'Cycle History'!$C$84)","v":"Thawed"},{"$f":"IF('Cycle History'!$G$3=\"\",\"\",'Cycle History'!$G$3)","v":"TIME OUT"}]
[327,{"$f":"IF('Cycle History'!$E$85=\"\",\"\",'Cycle History'!$E$85)","v":""},{"$f":"IF('Cycle History'!$B$1=\"\",\"\",'Cycle History'!$B$1)","v":"CYCLE HISTORY"},{"$f":"IF('Cycle History'!$B$3=\"\",\"\",'Cycle History'!$B$3)","v":"CYCLE"},{"$f":"IF('Cycle History'!$B$85=\"\",\"\",'Cycle History'!$B$85)","v":28},{"$f":"IF('Cycle History'!$C$85=\"\",\"\",'Cycle History'!$C$85)","v":"In Freezing chamber"},{"$f":"IF('Cycle History'!$E$3=\"\",\"\",'Cycle History'!$E$3)","v":"DATE"}]
[328,{"$f":"IF('Cycle History'!$F$85=\"\",\"\",'Cycle History'!$F$85)","v":""},{"$f":"IF('Cycle History'!$B$1=\"\",\"\",'Cycle History'!$B$1)","v":"CYCLE HISTORY"},{"$f":"IF('Cycle History'!$B$3=\"\",\"\",'Cycle History'!$B$3)","v":"CYCLE"},{"$f":"IF('Cycle History'!$B$85=\"\",\"\",'Cycle History'!$B$85)","v":28},{"$f":"IF('Cycle History'!$C$85=\"\",\"\",'Cycle History'!$C$85)","v":"In Freezing chamber"},{"$f":"IF('Cycle History'!$F$3=\"\",\"\",'Cycle History'!$F$3)","v":"TIME IN"}]
[329,{"$f":"IF('Cycle History'!$G$85=\"\",\"\",'Cycle History'!$G$85)","v":""},{"$f":"IF('Cycle History'!$B$1=\"\",\"\",'Cycle History'!$B$1)","v":"CYCLE HISTORY"},{"$f":"IF('Cycle History'!$B$3=\"\",\"\",'Cycle History'!$B$3)","v":"CYCLE"},{"$f":"IF('Cycle History'!$B$85=\"\",\"\",'Cycle History'!$B$85)","v":28},{"$f":"IF('Cycle History'!$C$85=\"\",\"\",'Cycle History'!$C$85)","v":"In Freezing chamber"},{"$f":"IF('Cycle History'!$G$3=\"\",\"\",'Cycle History'!$G$3)","v":"TIME OUT"}]
[330,{"$f":"IF('Cycle History'!$H$85=\"\",\"\",'Cycle History'!$H$85)","v":""},{"$f":"IF('Cycle History'!$B$1=\"\",\"\",'Cycle History'!$B$1)","v":"CYCLE HISTORY"},{"$f":"IF('Cycle History'!$B$3=\"\",\"\",'Cycle History'!$B$3)","v":"CYCLE"},{"$f":"IF('Cycle History'!$B$85=\"\",\"\",'Cycle History'!$B$85)","v":28},{"$f":"IF('Cycle History'!$C$85=\"\",\"\",'Cycle History'!$C$85)","v":"In Freezing chamber"},{"$f":"IF('Cycle History'!$H$3=\"\",\"\",'Cycle History'!$H$3)","v":"REMARKS"}]
[331,{"$f":"IF('Cycle History'!$E$86=\"\",\"\",'Cycle History'!$E$86)","v":""},{"$f":"IF('Cycle History'!$B$1=\"\",\"\",'Cycle History'!$B$1)","v":"CYCLE HISTORY"},{"$f":"IF('Cycle History'!$B$3=\"\",\"\",'Cycle History'!$B$3)","v":"CYCLE"},{"$f":"IF('Cycle History'!$B$85=\"\",\"\",'Cycle History'!$B$85)","v":28},{"$f":"IF('Cycle History'!$C$86=\"\",\"\",'Cycle History'!$C$86)","v":"Out Freezing chamber"},{"$f":"IF('Cycle History'!$E$3=\"\",\"\",'Cycle History'!$E$3)","v":"DATE"}]
[332,{"$f":"IF('Cycle History'!$F$86=\"\",\"\",'Cycle History'!$F$86)","v":""},{"$f":"IF('Cycle History'!$B$1=\"\",\"\",'Cycle History'!$B$1)","v":"CYCLE HISTORY"},{"$f":"IF('Cycle History'!$B$3=\"\",\"\",'Cycle History'!$B$3)","v":"CYCLE"},{"$f":"IF('Cycle History'!$B$85=\"\",\"\",'Cycle History'!$B$85)","v":28},{"$f":"IF('Cycle History'!$C$86=\"\",\"\",'Cycle History'!$C$86)","v":"Out Freezing chamber"},{"$f":"IF('Cycle History'!$F$3=\"\",\"\",'Cycle History'!$F$3)","v":"TIME IN"}]
[333,{"$f":"IF('Cycle History'!$G$86=\"\",\"\",'Cycle History'!$G$86)","v":""},{"$f":"IF('Cycle History'!$B$1=\"\",\"\",'Cycle History'!$B$1)","v":"CYCLE HISTORY"},{"$f":"IF('Cycle History'!$B$3=\"\",\"\",'Cycle History'!$B$3)","v":"CYCLE"},{"$f":"IF('Cycle History'!$B$85=\"\",\"\",'Cycle History'!$B$85)","v":28},{"$f":"IF('Cycle History'!$C$86=\"\",\"\",'Cycle History'!$C$86)","v":"Out Freezing chamber"},{"$f":"IF('Cycle History'!$G$3=\"\",\"\",'Cycle History'!$G$3)","v":"TIME OUT"}]
[334,{"$f":"IF('Cycle History'!$E$87=\"\",\"\",'Cycle History'!$E$87)","v":""},{"$f":"IF('Cycle History'!$B$1=\"\",\"\",'Cycle History'!$B$1)","v":"CYCLE HISTORY"},{"$f":"IF('Cycle History'!$B$3=\"\",\"\",'Cycle History'!$B$3)","v":"CYCLE"},{"$f":"IF('Cycle History'!$B$85=\"\",\"\",'Cycle History'!$B$85)","v":28},{"$f":"IF('Cycle History'!$C$87=\"\",\"\",'Cycle History'!$C$87)","v":"Thawed"},{"$f":"IF('Cycle History'!$E$3=\"\",\"\",'Cycle History'!$E$3)","v":"DATE"}]
[335,{"$f":"IF('Cycle History'!$F$87=\"\",\"\",'Cycle History'!$F$87)","v":""},{"$f":"IF('Cycle History'!$B$1=\"\",\"\",'Cycle History'!$B$1)","v":"CYCLE HISTORY"},{"$f":"IF('Cycle History'!$B$3=\"\",\"\",'Cycle History'!$B$3)","v":"CYCLE"},{"$f":"IF('Cycle History'!$B$85=\"\",\"\",'Cycle History'!$B$85)","v":28},{"$f":"IF('Cycle History'!$C$87=\"\",\"\",'Cycle History'!$C$87)","v":"Thawed"},{"$f":"IF('Cycle History'!$F$3=\"\",\"\",'Cycle History'!$F$3)","v":"TIME IN"}]
[336,{"$f":"IF('Cycle History'!$G$87=\"\",\"\",'Cycle History'!$G$87)","v":""},{"$f":"IF('Cycle History'!$B$1=\"\",\"\",'Cycle History'!$B$1)","v":"CYCLE HISTORY"},{"$f":"IF('Cycle History'!$B$3=\"\",\"\",'Cycle History'!$B$3)","v":"CYCLE"},{"$f":"IF('Cycle History'!$B$85=\"\",\"\",'Cycle History'!$B$85)","v":28},{"$f":"IF('Cycle History'!$C$87=\"\",\"\",'Cycle History'!$C$87)","v":"Thawed"},{"$f":"IF('Cycle History'!$G$3=\"\",\"\",'Cycle History'!$G$3)","v":"TIME OUT"}]
[337,{"$f":"IF('Cycle History'!$E$88=\"\",\"\",'Cycle History'!$E$88)","v":""},{"$f":"IF('Cycle History'!$B$1=\"\",\"\",'Cycle History'!$B$1)","v":"CYCLE HISTORY"},{"$f":"IF('Cycle History'!$B$3=\"\",\"\",'Cycle History'!$B$3)","v":"CYCLE"},{"$f":"IF('Cycle History'!$B$88=\"\",\"\",'Cycle History'!$B$88)","v":29},{"$f":"IF('Cycle History'!$C$88=\"\",\"\",'Cycle History'!$C$88)","v":"In Freezing chamber"},{"$f":"IF('Cycle History'!$E$3=\"\",\"\",'Cycle History'!$E$3)","v":"DATE"}]
[338,{"$f":"IF('Cycle History'!$F$88=\"\",\"\",'Cycle History'!$F$88)","v":""},{"$f":"IF('Cycle History'!$B$1=\"\",\"\",'Cycle History'!$B$1)","v":"CYCLE HISTORY"},{"$f":"IF('Cycle History'!$B$3=\"\",\"\",'Cycle History'!$B$3)","v":"CYCLE"},{"$f":"IF('Cycle History'!$B$88=\"\",\"\",'Cycle History'!$B$88)","v":29},{"$f":"IF('Cycle History'!$C$88=\"\",\"\",'Cycle History'!$C$88)","v":"In Freezing chamber"},{"$f":"IF('Cycle History'!$F$3=\"\",\"\",'Cycle History'!$F$3)","v":"TIME IN"}]
[339,{"$f":"IF('Cycle History'!$G$88=\"\",\"\",'Cycle History'!$G$88)","v":""},{"$f":"IF('Cycle History'!$B$1=\"\",\"\",'Cycle History'!$B$1)","v":"CYCLE HISTORY"},{"$f":"IF('Cycle History'!$B$3=\"\",\"\",'Cycle History'!$B$3)","v":"CYCLE"},{"$f":"IF('Cycle History'!$B$88=\"\",\"\",'Cycle History'!$B$88)","v":29},{"$f":"IF('Cycle History'!$C$88=\"\",\"\",'Cycle History'!$C$88)","v":"In Freezing chamber"},{"$f":"IF('Cycle History'!$G$3=\"\",\"\",'Cycle History'!$G$3)","v":"TIME OUT"}]
[340,{"$f":"IF('Cycle History'!$H$88=\"\",\"\",'Cycle History'!$H$88)","v":""},{"$f":"IF('Cycle History'!$B$1=\"\",\"\",'Cycle History'!$B$1)","v":"CYCLE HISTORY"},{"$f":"IF('Cycle History'!$B$3=\"\",\"\",'Cycle History'!$B$3)","v":"CYCLE"},{"$f":"IF('Cycle History'!$B$88=\"\",\"\",'Cycle History'!$B$88)","v":29},{"$f":"IF('Cycle History'!$C$88=\"\",\"\",'Cycle History'!$C$88)","v":"In Freezing chamber"},{"$f":"IF('Cycle History'!$H$3=\"\",\"\",'Cycle History'!$H$3)","v":"REMARKS"}]
[341,{"$f":"IF('Cycle History'!$E$89=\"\",\"\",'Cycle History'!$E$89)","v":""},{"$f":"IF('Cycle History'!$B$1=\"\",\"\",'Cycle History'!$B$1)","v":"CYCLE HISTORY"},{"$f":"IF('Cycle History'!$B$3=\"\",\"\",'Cycle History'!$B$3)","v":"CYCLE"},{"$f":"IF('Cycle History'!$B$88=\"\",\"\",'Cycle History'!$B$88)","v":29},{"$f":"IF('Cycle History'!$C$89=\"\",\"\",'Cycle History'!$C$89)","v":"Out Freezing chamber"},{"$f":"IF('Cycle History'!$E$3=\"\",\"\",'Cycle History'!$E$3)","v":"DATE"}]
[342,{"$f":"IF('Cycle History'!$F$89=\"\",\"\",'Cycle History'!$F$89)","v":""},{"$f":"IF('Cycle History'!$B$1=\"\",\"\",'Cycle History'!$B$1)","v":"CYCLE HISTORY"},{"$f":"IF('Cycle History'!$B$3=\"\",\"\",'Cycle History'!$B$3)","v":"CYCLE"},{"$f":"IF('Cycle History'!$B$88=\"\",\"\",'Cycle History'!$B$88)","v":29},{"$f":"IF('Cycle History'!$C$89=\"\",\"\",'Cycle History'!$C$89)","v":"Out Freezing chamber"},{"$f":"IF('Cycle History'!$F$3=\"\",\"\",'Cycle History'!$F$3)","v":"TIME IN"}]
[343,{"$f":"IF('Cycle History'!$G$89=\"\",\"\",'Cycle History'!$G$89)","v":""},{"$f":"IF('Cycle History'!$B$1=\"\",\"\",'Cycle History'!$B$1)","v":"CYCLE HISTORY"},{"$f":"IF('Cycle History'!$B$3=\"\",\"\",'Cycle History'!$B$3)","v":"CYCLE"},{"$f":"IF('Cycle History'!$B$88=\"\",\"\",'Cycle History'!$B$88)","v":29},{"$f":"IF('Cycle History'!$C$89=\"\",\"\",'Cycle History'!$C$89)","v":"Out Freezing chamber"},{"$f":"IF('Cycle History'!$G$3=\"\",\"\",'Cycle History'!$G$3)","v":"TIME OUT"}]
[344,{"$f":"IF('Cycle History'!$E$90=\"\",\"\",'Cycle History'!$E$90)","v":""},{"$f":"IF('Cycle History'!$B$1=\"\",\"\",'Cycle History'!$B$1)","v":"CYCLE HISTORY"},{"$f":"IF('Cycle History'!$B$3=\"\",\"\",'Cycle History'!$B$3)","v":"CYCLE"},{"$f":"IF('Cycle History'!$B$88=\"\",\"\",'Cycle History'!$B$88)","v":29},{"$f":"IF('Cycle History'!$C$90=\"\",\"\",'Cycle History'!$C$90)","v":"Thawed"},{"$f":"IF('Cycle History'!$E$3=\"\",\"\",'Cycle History'!$E$3)","v":"DATE"}]
[345,{"$f":"IF('Cycle History'!$F$90=\"\",\"\",'Cycle History'!$F$90)","v":""},{"$f":"IF('Cycle History'!$B$1=\"\",\"\",'Cycle History'!$B$1)","v":"CYCLE HISTORY"},{"$f":"IF('Cycle History'!$B$3=\"\",\"\",'Cycle History'!$B$3)","v":"CYCLE"},{"$f":"IF('Cycle History'!$B$88=\"\",\"\",'Cycle History'!$B$88)","v":29},{"$f":"IF('Cycle History'!$C$90=\"\",\"\",'Cycle History'!$C$90)","v":"Thawed"},{"$f":"IF('Cycle History'!$F$3=\"\",\"\",'Cycle History'!$F$3)","v":"TIME IN"}]
[346,{"$f":"IF('Cycle History'!$G$90=\"\",\"\",'Cycle History'!$G$90)","v":""},{"$f":"IF('Cycle History'!$B$1=\"\",\"\",'Cycle History'!$B$1)","v":"CYCLE HISTORY"},{"$f":"IF('Cycle History'!$B$3=\"\",\"\",'Cycle History'!$B$3)","v":"CYCLE"},{"$f":"IF('Cycle History'!$B$88=\"\",\"\",'Cycle History'!$B$88)","v":29},{"$f":"IF('Cycle History'!$C$90=\"\",\"\",'Cycle History'!$C$90)","v":"Thawed"},{"$f":"IF('Cycle History'!$G$3=\"\",\"\",'Cycle History'!$G$3)","v":"TIME OUT"}]
[347,{"$f":"IF('Cycle History'!$E$91=\"\",\"\",'Cycle History'!$E$91)","v":""},{"$f":"IF('Cycle History'!$B$1=\"\",\"\",'Cycle History'!$B$1)","v":"CYCLE HISTORY"},{"$f":"IF('Cycle History'!$B$3=\"\",\"\",'Cycle History'!$B$3)","v":"CYCLE"},{"$f":"IF('Cycle History'!$B$91=\"\",\"\",'Cycle History'!$B$91)","v":30},{"$f":"IF('Cycle History'!$C$91=\"\",\"\",'Cycle History'!$C$91)","v":"In Freezing chamber"},{"$f":"IF('Cycle History'!$E$3=\"\",\"\",'Cycle History'!$E$3)","v":"DATE"}]
[348,{"$f":"IF('Cycle History'!$F$91=\"\",\"\",'Cycle History'!$F$91)","v":""},{"$f":"IF('Cycle History'!$B$1=\"\",\"\",'Cycle History'!$B$1)","v":"CYCLE HISTORY"},{"$f":"IF('Cycle History'!$B$3=\"\",\"\",'Cycle History'!$B$3)","v":"CYCLE"},{"$f":"IF('Cycle History'!$B$91=\"\",\"\",'Cycle History'!$B$91)","v":30},{"$f":"IF('Cycle History'!$C$91=\"\",\"\",'Cycle History'!$C$91)","v":"In Freezing chamber"},{"$f":"IF('Cycle History'!$F$3=\"\",\"\",'Cycle History'!$F$3)","v":"TIME IN"}]
[349,{"$f":"IF('Cycle History'!$G$91=\"\",\"\",'Cycle History'!$G$91)","v":""},{"$f":"IF('Cycle History'!$B$1=\"\",\"\",'Cycle History'!$B$1)","v":"CYCLE HISTORY"},{"$f":"IF('Cycle History'!$B$3=\"\",\"\",'Cycle History'!$B$3)","v":"CYCLE"},{"$f":"IF('Cycle History'!$B$91=\"\",\"\",'Cycle History'!$B$91)","v":30},{"$f":"IF('Cycle History'!$C$91=\"\",\"\",'Cycle History'!$C$91)","v":"In Freezing chamber"},{"$f":"IF('Cycle History'!$G$3=\"\",\"\",'Cycle History'!$G$3)","v":"TIME OUT"}]
[350,{"$f":"IF('Cycle History'!$H$91=\"\",\"\",'Cycle History'!$H$91)","v":""},{"$f":"IF('Cycle History'!$B$1=\"\",\"\",'Cycle History'!$B$1)","v":"CYCLE HISTORY"},{"$f":"IF('Cycle History'!$B$3=\"\",\"\",'Cycle History'!$B$3)","v":"CYCLE"},{"$f":"IF('Cycle History'!$B$91=\"\",\"\",'Cycle History'!$B$91)","v":30},{"$f":"IF('Cycle History'!$C$91=\"\",\"\",'Cycle History'!$C$91)","v":"In Freezing chamber"},{"$f":"IF('Cycle History'!$H$3=\"\",\"\",'Cycle History'!$H$3)","v":"REMARKS"}]
[351,{"$f":"IF('Cycle History'!$E$92=\"\",\"\",'Cycle History'!$E$92)","v":""},{"$f":"IF('Cycle History'!$B$1=\"\",\"\",'Cycle History'!$B$1)","v":"CYCLE HISTORY"},{"$f":"IF('Cycle History'!$B$3=\"\",\"\",'Cycle History'!$B$3)","v":"CYCLE"},{"$f":"IF('Cycle History'!$B$91=\"\",\"\",'Cycle History'!$B$91)","v":30},{"$f":"IF('Cycle History'!$C$92=\"\",\"\",'Cycle History'!$C$92)","v":"Out Freezing chamber"},{"$f":"IF('Cycle History'!$E$3=\"\",\"\",'Cycle History'!$E$3)","v":"DATE"}]
[352,{"$f":"IF('Cycle History'!$F$92=\"\",\"\",'Cycle History'!$F$92)","v":""},{"$f":"IF('Cycle History'!$B$1=\"\",\"\",'Cycle History'!$B$1)","v":"CYCLE HISTORY"},{"$f":"IF('Cycle History'!$B$3=\"\",\"\",'Cycle History'!$B$3)","v":"CYCLE"},{"$f":"IF('Cycle History'!$B$91=\"\",\"\",'Cycle History'!$B$91)","v":30},{"$f":"IF('Cycle History'!$C$92=\"\",\"\",'Cycle History'!$C$92)","v":"Out Freezing chamber"},{"$f":"IF('Cycle History'!$F$3=\"\",\"\",'Cycle History'!$F$3)","v":"TIME IN"}]
[353,{"$f":"IF('Cycle History'!$G$92=\"\",\"\",'Cycle History'!$G$92)","v":""},{"$f":"IF('Cycle History'!$B$1=\"\",\"\",'Cycle History'!$B$1)","v":"CYCLE HISTORY"},{"$f":"IF('Cycle History'!$B$3=\"\",\"\",'Cycle History'!$B$3)","v":"CYCLE"},{"$f":"IF('Cycle History'!$B$91=\"\",\"\",'Cycle History'!$B$91)","v":30},{"$f":"IF('Cycle History'!$C$92=\"\",\"\",'Cycle History'!$C$92)","v":"Out Freezing chamber"},{"$f":"IF('Cycle History'!$G$3=\"\",\"\",'Cycle History'!$G$3)","v":"TIME OUT"}]
[354,{"$f":"IF('Cycle History'!$E$93=\"\",\"\",'Cycle History'!$E$93)","v":""},{"$f":"IF('Cycle History'!$B$1=\"\",\"\",'Cycle History'!$B$1)","v":"CYCLE HISTORY"},{"$f":"IF('Cycle History'!$B$3=\"\",\"\",'Cycle History'!$B$3)","v":"CYCLE"},{"$f":"IF('Cycle History'!$B$91=\"\",\"\",'Cycle History'!$B$91)","v":30},{"$f":"IF('Cycle History'!$C$93=\"\",\"\",'Cycle History'!$C$93)","v":"Thawed"},{"$f":"IF('Cycle History'!$E$3=\"\",\"\",'Cycle History'!$E$3)","v":"DATE"}]
[355,{"$f":"IF('Cycle History'!$F$93=\"\",\"\",'Cycle History'!$F$93)","v":""},{"$f":"IF('Cycle History'!$B$1=\"\",\"\",'Cycle History'!$B$1)","v":"CYCLE HISTORY"},{"$f":"IF('Cycle History'!$B$3=\"\",\"\",'Cycle History'!$B$3)","v":"CYCLE"},{"$f":"IF('Cycle History'!$B$91=\"\",\"\",'Cycle History'!$B$91)","v":30},{"$f":"IF('Cycle History'!$C$93=\"\",\"\",'Cycle History'!$C$93)","v":"Thawed"},{"$f":"IF('Cycle History'!$F$3=\"\",\"\",'Cycle History'!$F$3)","v":"TIME IN"}]
[356,{"$f":"IF('Cycle History'!$G$93=\"\",\"\",'Cycle History'!$G$93)","v":""},{"$f":"IF('Cycle History'!$B$1=\"\",\"\",'Cycle History'!$B$1)","v":"CYCLE HISTORY"},{"$f":"IF('Cycle History'!$B$3=\"\",\"\",'Cycle History'!$B$3)","v":"CYCLE"},{"$f":"IF('Cycle History'!$B$91=\"\",\"\",'Cycle History'!$B$91)","v":30},{"$f":"IF('Cycle History'!$C$93=\"\",\"\",'Cycle History'!$C$93)","v":"Thawed"},{"$f":"IF('Cycle History'!$G$3=\"\",\"\",'Cycle History'!$G$3)","v":"TIME OUT"}]
[357,{"$f":"IF('Cycle History'!$E$94=\"\",\"\",'Cycle History'!$E$94)","v":""},{"$f":"IF('Cycle History'!$B$1=\"\",\"\",'Cycle History'!$B$1)","v":"CYCLE HISTORY"},{"$f":"IF('Cycle History'!$B$3=\"\",\"\",'Cycle History'!$B$3)","v":"CYCLE"},{"$f":"IF('Cycle History'!$B$94=\"\",\"\",'Cycle History'!$B$94)","v":31},{"$f":"IF('Cycle History'!$C$94=\"\",\"\",'Cycle History'!$C$94)","v":"In Freezing chamber"},{"$f":"IF('Cycle History'!$E$3=\"\",\"\",'Cycle History'!$E$3)","v":"DATE"}]
[358,{"$f":"IF('Cycle History'!$F$94=\"\",\"\",'Cycle History'!$F$94)","v":""},{"$f":"IF('Cycle History'!$B$1=\"\",\"\",'Cycle History'!$B$1)","v":"CYCLE HISTORY"},{"$f":"IF('Cycle History'!$B$3=\"\",\"\",'Cycle History'!$B$3)","v":"CYCLE"},{"$f":"IF('Cycle History'!$B$94=\"\",\"\",'Cycle History'!$B$94)","v":31},{"$f":"IF('Cycle History'!$C$94=\"\",\"\",'Cycle History'!$C$94)","v":"In Freezing chamber"},{"$f":"IF('Cycle History'!$F$3=\"\",\"\",'Cycle History'!$F$3)","v":"TIME IN"}]
[359,{"$f":"IF('Cycle History'!$G$94=\"\",\"\",'Cycle History'!$G$94)","v":""},{"$f":"IF('Cycle History'!$B$1=\"\",\"\",'Cycle History'!$B$1)","v":"CYCLE HISTORY"},{"$f":"IF('Cycle History'!$B$3=\"\",\"\",'Cycle History'!$B$3)","v":"CYCLE"},{"$f":"IF('Cycle History'!$B$94=\"\",\"\",'Cycle History'!$B$94)","v":31},{"$f":"IF('Cycle History'!$C$94=\"\",\"\",'Cycle History'!$C$94)","v":"In Freezing chamber"},{"$f":"IF('Cycle History'!$G$3=\"\",\"\",'Cycle History'!$G$3)","v":"TIME OUT"}]
[360,{"$f":"IF('Cycle History'!$H$94=\"\",\"\",'Cycle History'!$H$94)","v":""},{"$f":"IF('Cycle History'!$B$1=\"\",\"\",'Cycle History'!$B$1)","v":"CYCLE HISTORY"},{"$f":"IF('Cycle History'!$B$3=\"\",\"\",'Cycle History'!$B$3)","v":"CYCLE"},{"$f":"IF('Cycle History'!$B$94=\"\",\"\",'Cycle History'!$B$94)","v":31},{"$f":"IF('Cycle History'!$C$94=\"\",\"\",'Cycle History'!$C$94)","v":"In Freezing chamber"},{"$f":"IF('Cycle History'!$H$3=\"\",\"\",'Cycle History'!$H$3)","v":"REMARKS"}]
[361,{"$f":"IF('Cycle History'!$E$95=\"\",\"\",'Cycle History'!$E$95)","v":""},{"$f":"IF('Cycle History'!$B$1=\"\",\"\",'Cycle History'!$B$1)","v":"CYCLE HISTORY"},{"$f":"IF('Cycle History'!$B$3=\"\",\"\",'Cycle History'!$B$3)","v":"CYCLE"},{"$f":"IF('Cycle History'!$B$94=\"\",\"\",'Cycle History'!$B$94)","v":31},{"$f":"IF('Cycle History'!$C$95=\"\",\"\",'Cycle History'!$C$95)","v":"Out Freezing chamber"},{"$f":"IF('Cycle History'!$E$3=\"\",\"\",'Cycle History'!$E$3)","v":"DATE"}]
[362,{"$f":"IF('Cycle History'!$F$95=\"\",\"\",'Cycle History'!$F$95)","v":""},{"$f":"IF('Cycle History'!$B$1=\"\",\"\",'Cycle History'!$B$1)","v":"CYCLE HISTORY"},{"$f":"IF('Cycle History'!$B$3=\"\",\"\",'Cycle History'!$B$3)","v":"CYCLE"},{"$f":"IF('Cycle History'!$B$94=\"\",\"\",'Cycle History'!$B$94)","v":31},{"$f":"IF('Cycle History'!$C$95=\"\",\"\",'Cycle History'!$C$95)","v":"Out Freezing chamber"},{"$f":"IF('Cycle History'!$F$3=\"\",\"\",'Cycle History'!$F$3)","v":"TIME IN"}]
[363,{"$f":"IF('Cycle History'!$G$95=\"\",\"\",'Cycle History'!$G$95)","v":""},{"$f":"IF('Cycle History'!$B$1=\"\",\"\",'Cycle History'!$B$1)","v":"CYCLE HISTORY"},{"$f":"IF('Cycle History'!$B$3=\"\",\"\",'Cycle History'!$B$3)","v":"CYCLE"},{"$f":"IF('Cycle History'!$B$94=\"\",\"\",'Cycle History'!$B$94)","v":31},{"$f":"IF('Cycle History'!$C$95=\"\",\"\",'Cycle History'!$C$95)","v":"Out Freezing chamber"},{"$f":"IF('Cycle History'!$G$3=\"\",\"\",'Cycle History'!$G$3)","v":"TIME OUT"}]
[364,{"$f":"IF('Cycle History'!$E$96=\"\",\"\",'Cycle History'!$E$96)","v":""},{"$f":"IF('Cycle History'!$B$1=\"\",\"\",'Cycle History'!$B$1)","v":"CYCLE HISTORY"},{"$f":"IF('Cycle History'!$B$3=\"\",\"\",'Cycle History'!$B$3)","v":"CYCLE"},{"$f":"IF('Cycle History'!$B$94=\"\",\"\",'Cycle History'!$B$94)","v":31},{"$f":"IF('Cycle History'!$C$96=\"\",\"\",'Cycle History'!$C$96)","v":"Thawed"},{"$f":"IF('Cycle History'!$E$3=\"\",\"\",'Cycle History'!$E$3)","v":"DATE"}]
[365,{"$f":"IF('Cycle History'!$F$96=\"\",\"\",'Cycle History'!$F$96)","v":""},{"$f":"IF('Cycle History'!$B$1=\"\",\"\",'Cycle History'!$B$1)","v":"CYCLE HISTORY"},{"$f":"IF('Cycle History'!$B$3=\"\",\"\",'Cycle History'!$B$3)","v":"CYCLE"},{"$f":"IF('Cycle History'!$B$94=\"\",\"\",'Cycle History'!$B$94)","v":31},{"$f":"IF('Cycle History'!$C$96=\"\",\"\",'Cycle History'!$C$96)","v":"Thawed"},{"$f":"IF('Cycle History'!$F$3=\"\",\"\",'Cycle History'!$F$3)","v":"TIME IN"}]
[366,{"$f":"IF('Cycle History'!$G$96=\"\",\"\",'Cycle History'!$G$96)","v":""},{"$f":"IF('Cycle History'!$B$1=\"\",\"\",'Cycle History'!$B$1)","v":"CYCLE HISTORY"},{"$f":"IF('Cycle History'!$B$3=\"\",\"\",'Cycle History'!$B$3)","v":"CYCLE"},{"$f":"IF('Cycle History'!$B$94=\"\",\"\",'Cycle History'!$B$94)","v":31},{"$f":"IF('Cycle History'!$C$96=\"\",\"\",'Cycle History'!$C$96)","v":"Thawed"},{"$f":"IF('Cycle History'!$G$3=\"\",\"\",'Cycle History'!$G$3)","v":"TIME OUT"}]
[367,{"$f":"IF('Cycle History'!$E$97=\"\",\"\",'Cycle History'!$E$97)","v":""},{"$f":"IF('Cycle History'!$B$1=\"\",\"\",'Cycle History'!$B$1)","v":"CYCLE HISTORY"},{"$f":"IF('Cycle History'!$B$3=\"\",\"\",'Cycle History'!$B$3)","v":"CYCLE"},{"$f":"IF('Cycle History'!$B$97=\"\",\"\",'Cycle History'!$B$97)","v":32},{"$f":"IF('Cycle History'!$C$97=\"\",\"\",'Cycle History'!$C$97)","v":"In Freezing chamber"},{"$f":"IF('Cycle History'!$E$3=\"\",\"\",'Cycle History'!$E$3)","v":"DATE"}]
[368,{"$f":"IF('Cycle History'!$F$97=\"\",\"\",'Cycle History'!$F$97)","v":""},{"$f":"IF('Cycle History'!$B$1=\"\",\"\",'Cycle History'!$B$1)","v":"CYCLE HISTORY"},{"$f":"IF('Cycle History'!$B$3=\"\",\"\",'Cycle History'!$B$3)","v":"CYCLE"},{"$f":"IF('Cycle History'!$B$97=\"\",\"\",'Cycle History'!$B$97)","v":32},{"$f":"IF('Cycle History'!$C$97=\"\",\"\",'Cycle History'!$C$97)","v":"In Freezing chamber"},{"$f":"IF('Cycle History'!$F$3=\"\",\"\",'Cycle History'!$F$3)","v":"TIME IN"}]
[369,{"$f":"IF('Cycle History'!$G$97=\"\",\"\",'Cycle History'!$G$97)","v":""},{"$f":"IF('Cycle History'!$B$1=\"\",\"\",'Cycle History'!$B$1)","v":"CYCLE HISTORY"},{"$f":"IF('Cycle History'!$B$3=\"\",\"\",'Cycle History'!$B$3)","v":"CYCLE"},{"$f":"IF('Cycle History'!$B$97=\"\",\"\",'Cycle History'!$B$97)","v":32},{"$f":"IF('Cycle History'!$C$97=\"\",\"\",'Cycle History'!$C$97)","v":"In Freezing chamber"},{"$f":"IF('Cycle History'!$G$3=\"\",\"\",'Cycle History'!$G$3)","v":"TIME OUT"}]
[370,{"$f":"IF('Cycle History'!$H$97=\"\",\"\",'Cycle History'!$H$97)","v":""},{"$f":"IF('Cycle History'!$B$1=\"\",\"\",'Cycle History'!$B$1)","v":"CYCLE HISTORY"},{"$f":"IF('Cycle History'!$B$3=\"\",\"\",'Cycle History'!$B$3)","v":"CYCLE"},{"$f":"IF('Cycle History'!$B$97=\"\",\"\",'Cycle History'!$B$97)","v":32},{"$f":"IF('Cycle History'!$C$97=\"\",\"\",'Cycle History'!$C$97)","v":"In Freezing chamber"},{"$f":"IF('Cycle History'!$H$3=\"\",\"\",'Cycle History'!$H$3)","v":"REMARKS"}]
[371,{"$f":"IF('Cycle History'!$E$98=\"\",\"\",'Cycle History'!$E$98)","v":""},{"$f":"IF('Cycle History'!$B$1=\"\",\"\",'Cycle History'!$B$1)","v":"CYCLE HISTORY"},{"$f":"IF('Cycle History'!$B$3=\"\",\"\",'Cycle History'!$B$3)","v":"CYCLE"},{"$f":"IF('Cycle History'!$B$97=\"\",\"\",'Cycle History'!$B$97)","v":32},{"$f":"IF('Cycle History'!$C$98=\"\",\"\",'Cycle History'!$C$98)","v":"Out Freezing chamber"},{"$f":"IF('Cycle History'!$E$3=\"\",\"\",'Cycle History'!$E$3)","v":"DATE"}]
[372,{"$f":"IF('Cycle History'!$F$98=\"\",\"\",'Cycle History'!$F$98)","v":""},{"$f":"IF('Cycle History'!$B$1=\"\",\"\",'Cycle History'!$B$1)","v":"CYCLE HISTORY"},{"$f":"IF('Cycle History'!$B$3=\"\",\"\",'Cycle History'!$B$3)","v":"CYCLE"},{"$f":"IF('Cycle History'!$B$97=\"\",\"\",'Cycle History'!$B$97)","v":32},{"$f":"IF('Cycle History'!$C$98=\"\",\"\",'Cycle History'!$C$98)","v":"Out Freezing chamber"},{"$f":"IF('Cycle History'!$F$3=\"\",\"\",'Cycle History'!$F$3)","v":"TIME IN"}]
[373,{"$f":"IF('Cycle History'!$G$98=\"\",\"\",'Cycle History'!$G$98)","v":""},{"$f":"IF('Cycle History'!$B$1=\"\",\"\",'Cycle History'!$B$1)","v":"CYCLE HISTORY"},{"$f":"IF('Cycle History'!$B$3=\"\",\"\",'Cycle History'!$B$3)","v":"CYCLE"},{"$f":"IF('Cycle History'!$B$97=\"\",\"\",'Cycle History'!$B$97)","v":32},{"$f":"IF('Cycle History'!$C$98=\"\",\"\",'Cycle History'!$C$98)","v":"Out Freezing chamber"},{"$f":"IF('Cycle History'!$G$3=\"\",\"\",'Cycle History'!$G$3)","v":"TIME OUT"}]
[374,{"$f":"IF('Cycle History'!$E$99=\"\",\"\",'Cycle History'!$E$99)","v":""},{"$f":"IF('Cycle History'!$B$1=\"\",\"\",'Cycle History'!$B$1)","v":"CYCLE HISTORY"},{"$f":"IF('Cycle History'!$B$3=\"\",\"\",'Cycle History'!$B$3)","v":"CYCLE"},{"$f":"IF('Cycle History'!$B$97=\"\",\"\",'Cycle History'!$B$97)","v":32},{"$f":"IF('Cycle History'!$C$99=\"\",\"\",'Cycle History'!$C$99)","v":"Thawed"},{"$f":"IF('Cycle History'!$E$3=\"\",\"\",'Cycle History'!$E$3)","v":"DATE"}]
[375,{"$f":"IF('Cycle History'!$F$99=\"\",\"\",'Cycle History'!$F$99)","v":""},{"$f":"IF('Cycle History'!$B$1=\"\",\"\",'Cycle History'!$B$1)","v":"CYCLE HISTORY"},{"$f":"IF('Cycle History'!$B$3=\"\",\"\",'Cycle History'!$B$3)","v":"CYCLE"},{"$f":"IF('Cycle History'!$B$97=\"\",\"\",'Cycle History'!$B$97)","v":32},{"$f":"IF('Cycle History'!$C$99=\"\",\"\",'Cycle History'!$C$99)","v":"Thawed"},{"$f":"IF('Cycle History'!$F$3=\"\",\"\",'Cycle History'!$F$3)","v":"TIME IN"}]
[376,{"$f":"IF('Cycle History'!$G$99=\"\",\"\",'Cycle History'!$G$99)","v":""},{"$f":"IF('Cycle History'!$B$1=\"\",\"\",'Cycle History'!$B$1)","v":"CYCLE HISTORY"},{"$f":"IF('Cycle History'!$B$3=\"\",\"\",'Cycle History'!$B$3)","v":"CYCLE"},{"$f":"IF('Cycle History'!$B$97=\"\",\"\",'Cycle History'!$B$97)","v":32},{"$f":"IF('Cycle History'!$C$99=\"\",\"\",'Cycle History'!$C$99)","v":"Thawed"},{"$f":"IF('Cycle History'!$G$3=\"\",\"\",'Cycle History'!$G$3)","v":"TIME OUT"}]
[377,{"$f":"IF('Cycle History'!$E$100=\"\",\"\",'Cycle History'!$E$100)","v":""},{"$f":"IF('Cycle History'!$B$1=\"\",\"\",'Cycle History'!$B$1)","v":"CYCLE HISTORY"},{"$f":"IF('Cycle History'!$B$3=\"\",\"\",'Cycle History'!$B$3)","v":"CYCLE"},{"$f":"IF('Cycle History'!$B$100=\"\",\"\",'Cycle History'!$B$100)","v":33},{"$f":"IF('Cycle History'!$C$100=\"\",\"\",'Cycle History'!$C$100)","v":"In Freezing chamber"},{"$f":"IF('Cycle History'!$E$3=\"\",\"\",'Cycle History'!$E$3)","v":"DATE"}]
[378,{"$f":"IF('Cycle History'!$F$100=\"\",\"\",'Cycle History'!$F$100)","v":""},{"$f":"IF('Cycle History'!$B$1=\"\",\"\",'Cycle History'!$B$1)","v":"CYCLE HISTORY"},{"$f":"IF('Cycle History'!$B$3=\"\",\"\",'Cycle History'!$B$3)","v":"CYCLE"},{"$f":"IF('Cycle History'!$B$100=\"\",\"\",'Cycle History'!$B$100)","v":33},{"$f":"IF('Cycle History'!$C$100=\"\",\"\",'Cycle History'!$C$100)","v":"In Freezing chamber"},{"$f":"IF('Cycle History'!$F$3=\"\",\"\",'Cycle History'!$F$3)","v":"TIME IN"}]
[379,{"$f":"IF('Cycle History'!$G$100=\"\",\"\",'Cycle History'!$G$100)","v":""},{"$f":"IF('Cycle History'!$B$1=\"\",\"\",'Cycle History'!$B$1)","v":"CYCLE HISTORY"},{"$f":"IF('Cycle History'!$B$3=\"\",\"\",'Cycle History'!$B$3)","v":"CYCLE"},{"$f":"IF('Cycle History'!$B$100=\"\",\"\",'Cycle History'!$B$100)","v":33},{"$f":"IF('Cycle History'!$C$100=\"\",\"\",'Cycle History'!$C$100)","v":"In Freezing chamber"},{"$f":"IF('Cycle History'!$G$3=\"\",\"\",'Cycle History'!$G$3)","v":"TIME OUT"}]
[380,{"$f":"IF('Cycle History'!$H$100=\"\",\"\",'Cycle History'!$H$100)","v":""},{"$f":"IF('Cycle History'!$B$1=\"\",\"\",'Cycle History'!$B$1)","v":"CYCLE HISTORY"},{"$f":"IF('Cycle History'!$B$3=\"\",\"\",'Cycle History'!$B$3)","v":"CYCLE"},{"$f":"IF('Cycle History'!$B$100=\"\",\"\",'Cycle History'!$B$100)","v":33},{"$f":"IF('Cycle History'!$C$100=\"\",\"\",'Cycle History'!$C$100)","v":"In Freezing chamber"},{"$f":"IF('Cycle History'!$H$3=\"\",\"\",'Cycle History'!$H$3)","v":"REMARKS"}]
[381,{"$f":"IF('Cycle History'!$E$101=\"\",\"\",'Cycle History'!$E$101)","v":""},{"$f":"IF('Cycle History'!$B$1=\"\",\"\",'Cycle History'!$B$1)","v":"CYCLE HISTORY"},{"$f":"IF('Cycle History'!$B$3=\"\",\"\",'Cycle History'!$B$3)","v":"CYCLE"},{"$f":"IF('Cycle History'!$B$100=\"\",\"\",'Cycle History'!$B$100)","v":33},{"$f":"IF('Cycle History'!$C$101=\"\",\"\",'Cycle History'!$C$101)","v":"Out Freezing chamber"},{"$f":"IF('Cycle History'!$E$3=\"\",\"\",'Cycle History'!$E$3)","v":"DATE"}]
[382,{"$f":"IF('Cycle History'!$F$101=\"\",\"\",'Cycle History'!$F$101)","v":""},{"$f":"IF('Cycle History'!$B$1=\"\",\"\",'Cycle History'!$B$1)","v":"CYCLE HISTORY"},{"$f":"IF('Cycle History'!$B$3=\"\",\"\",'Cycle History'!$B$3)","v":"CYCLE"},{"$f":"IF('Cycle History'!$B$100=\"\",\"\",'Cycle History'!$B$100)","v":33},{"$f":"IF('Cycle History'!$C$101=\"\",\"\",'Cycle History'!$C$101)","v":"Out Freezing chamber"},{"$f":"IF('Cycle History'!$F$3=\"\",\"\",'Cycle History'!$F$3)","v":"TIME IN"}]
[383,{"$f":"IF('Cycle History'!$G$101=\"\",\"\",'Cycle History'!$G$101)","v":""},{"$f":"IF('Cycle History'!$B$1=\"\",\"\",'Cycle History'!$B$1)","v":"CYCLE HISTORY"},{"$f":"IF('Cycle History'!$B$3=\"\",\"\",'Cycle History'!$B$3)","v":"CYCLE"},{"$f":"IF('Cycle History'!$B$100=\"\",\"\",'Cycle History'!$B$100)","v":33},{"$f":"IF('Cycle History'!$C$101=\"\",\"\",'Cycle History'!$C$101)","v":"Out Freezing chamber"},{"$f":"IF('Cycle History'!$G$3=\"\",\"\",'Cycle History'!$G$3)","v":"TIME OUT"}]
[384,{"$f":"IF('Cycle History'!$E$102=\"\",\"\",'Cycle History'!$E$102)","v":""},{"$f":"IF('Cycle History'!$B$1=\"\",\"\",'Cycle History'!$B$1)","v":"CYCLE HISTORY"},{"$f":"IF('Cycle History'!$B$3=\"\",\"\",'Cycle History'!$B$3)","v":"CYCLE"},{"$f":"IF('Cycle History'!$B$100=\"\",\"\",'Cycle History'!$B$100)","v":33},{"$f":"IF('Cycle History'!$C$102=\"\",\"\",'Cycle History'!$C$102)","v":"Thawed"},{"$f":"IF('Cycle History'!$E$3=\"\",\"\",'Cycle History'!$E$3)","v":"DATE"}]
[385,{"$f":"IF('Cycle History'!$F$102=\"\",\"\",'Cycle History'!$F$102)","v":""},{"$f":"IF('Cycle History'!$B$1=\"\",\"\",'Cycle History'!$B$1)","v":"CYCLE HISTORY"},{"$f":"IF('Cycle History'!$B$3=\"\",\"\",'Cycle History'!$B$3)","v":"CYCLE"},{"$f":"IF('Cycle History'!$B$100=\"\",\"\",'Cycle History'!$B$100)","v":33},{"$f":"IF('Cycle History'!$C$102=\"\",\"\",'Cycle History'!$C$102)","v":"Thawed"},{"$f":"IF('Cycle History'!$F$3=\"\",\"\",'Cycle History'!$F$3)","v":"TIME IN"}]
[386,{"$f":"IF('Cycle History'!$G$102=\"\",\"\",'Cycle History'!$G$102)","v":""},{"$f":"IF('Cycle History'!$B$1=\"\",\"\",'Cycle History'!$B$1)","v":"CYCLE HISTORY"},{"$f":"IF('Cycle History'!$B$3=\"\",\"\",'Cycle History'!$B$3)","v":"CYCLE"},{"$f":"IF('Cycle History'!$B$100=\"\",\"\",'Cycle History'!$B$100)","v":33},{"$f":"IF('Cycle History'!$C$102=\"\",\"\",'Cycle History'!$C$102)","v":"Thawed"},{"$f":"IF('Cycle History'!$G$3=\"\",\"\",'Cycle History'!$G$3)","v":"TIME OUT"}]
[387,{"$f":"IF('Cycle History'!$E$103=\"\",\"\",'Cycle History'!$E$103)","v":""},{"$f":"IF('Cycle History'!$B$1=\"\",\"\",'Cycle History'!$B$1)","v":"CYCLE HISTORY"},{"$f":"IF('Cycle History'!$B$3=\"\",\"\",'Cycle History'!$B$3)","v":"CYCLE"},{"$f":"IF('Cycle History'!$B$103=\"\",\"\",'Cycle History'!$B$103)","v":34},{"$f":"IF('Cycle History'!$C$103=\"\",\"\",'Cycle History'!$C$103)","v":"In Freezing chamber"},{"$f":"IF('Cycle History'!$E$3=\"\",\"\",'Cycle History'!$E$3)","v":"DATE"}]
[388,{"$f":"IF('Cycle History'!$F$103=\"\",\"\",'Cycle History'!$F$103)","v":""},{"$f":"IF('Cycle History'!$B$1=\"\",\"\",'Cycle History'!$B$1)","v":"CYCLE HISTORY"},{"$f":"IF('Cycle History'!$B$3=\"\",\"\",'Cycle History'!$B$3)","v":"CYCLE"},{"$f":"IF('Cycle History'!$B$103=\"\",\"\",'Cycle History'!$B$103)","v":34},{"$f":"IF('Cycle History'!$C$103=\"\",\"\",'Cycle History'!$C$103)","v":"In Freezing chamber"},{"$f":"IF('Cycle History'!$F$3=\"\",\"\",'Cycle History'!$F$3)","v":"TIME IN"}]
[389,{"$f":"IF('Cycle History'!$G$103=\"\",\"\",'Cycle History'!$G$103)","v":""},{"$f":"IF('Cycle History'!$B$1=\"\",\"\",'Cycle History'!$B$1)","v":"CYCLE HISTORY"},{"$f":"IF('Cycle History'!$B$3=\"\",\"\",'Cycle History'!$B$3)","v":"CYCLE"},{"$f":"IF('Cycle History'!$B$103=\"\",\"\",'Cycle History'!$B$103)","v":34},{"$f":"IF('Cycle History'!$C$103=\"\",\"\",'Cycle History'!$C$103)","v":"In Freezing chamber"},{"$f":"IF('Cycle History'!$G$3=\"\",\"\",'Cycle History'!$G$3)","v":"TIME OUT"}]
[390,{"$f":"IF('Cycle History'!$H$103=\"\",\"\",'Cycle History'!$H$103)","v":""},{"$f":"IF('Cycle History'!$B$1=\"\",\"\",'Cycle History'!$B$1)","v":"CYCLE HISTORY"},{"$f":"IF('Cycle History'!$B$3=\"\",\"\",'Cycle History'!$B$3)","v":"CYCLE"},{"$f":"IF('Cycle History'!$B$103=\"\",\"\",'Cycle History'!$B$103)","v":34},{"$f":"IF('Cycle History'!$C$103=\"\",\"\",'Cycle History'!$C$103)","v":"In Freezing chamber"},{"$f":"IF('Cycle History'!$H$3=\"\",\"\",'Cycle History'!$H$3)","v":"REMARKS"}]
[391,{"$f":"IF('Cycle History'!$E$104=\"\",\"\",'Cycle History'!$E$104)","v":""},{"$f":"IF('Cycle History'!$B$1=\"\",\"\",'Cycle History'!$B$1)","v":"CYCLE HISTORY"},{"$f":"IF('Cycle History'!$B$3=\"\",\"\",'Cycle History'!$B$3)","v":"CYCLE"},{"$f":"IF('Cycle History'!$B$103=\"\",\"\",'Cycle History'!$B$103)","v":34},{"$f":"IF('Cycle History'!$C$104=\"\",\"\",'Cycle History'!$C$104)","v":"Out Freezing chamber"},{"$f":"IF('Cycle History'!$E$3=\"\",\"\",'Cycle History'!$E$3)","v":"DATE"}]
[392,{"$f":"IF('Cycle History'!$F$104=\"\",\"\",'Cycle History'!$F$104)","v":""},{"$f":"IF('Cycle History'!$B$1=\"\",\"\",'Cycle History'!$B$1)","v":"CYCLE HISTORY"},{"$f":"IF('Cycle History'!$B$3=\"\",\"\",'Cycle History'!$B$3)","v":"CYCLE"},{"$f":"IF('Cycle History'!$B$103=\"\",\"\",'Cycle History'!$B$103)","v":34},{"$f":"IF('Cycle History'!$C$104=\"\",\"\",'Cycle History'!$C$104)","v":"Out Freezing chamber"},{"$f":"IF('Cycle History'!$F$3=\"\",\"\",'Cycle History'!$F$3)","v":"TIME IN"}]
[393,{"$f":"IF('Cycle History'!$G$104=\"\",\"\",'Cycle History'!$G$104)","v":""},{"$f":"IF('Cycle History'!$B$1=\"\",\"\",'Cycle History'!$B$1)","v":"CYCLE HISTORY"},{"$f":"IF('Cycle History'!$B$3=\"\",\"\",'Cycle History'!$B$3)","v":"CYCLE"},{"$f":"IF('Cycle History'!$B$103=\"\",\"\",'Cycle History'!$B$103)","v":34},{"$f":"IF('Cycle History'!$C$104=\"\",\"\",'Cycle History'!$C$104)","v":"Out Freezing chamber"},{"$f":"IF('Cycle History'!$G$3=\"\",\"\",'Cycle History'!$G$3)","v":"TIME OUT"}]
[394,{"$f":"IF('Cycle History'!$E$105=\"\",\"\",'Cycle History'!$E$105)","v":""},{"$f":"IF('Cycle History'!$B$1=\"\",\"\",'Cycle History'!$B$1)","v":"CYCLE HISTORY"},{"$f":"IF('Cycle History'!$B$3=\"\",\"\",'Cycle History'!$B$3)","v":"CYCLE"},{"$f":"IF('Cycle History'!$B$103=\"\",\"\",'Cycle History'!$B$103)","v":34},{"$f":"IF('Cycle History'!$C$105=\"\",\"\",'Cycle History'!$C$105)","v":"Thawed"},{"$f":"IF('Cycle History'!$E$3=\"\",\"\",'Cycle History'!$E$3)","v":"DATE"}]
[395,{"$f":"IF('Cycle History'!$F$105=\"\",\"\",'Cycle History'!$F$105)","v":""},{"$f":"IF('Cycle History'!$B$1=\"\",\"\",'Cycle History'!$B$1)","v":"CYCLE HISTORY"},{"$f":"IF('Cycle History'!$B$3=\"\",\"\",'Cycle History'!$B$3)","v":"CYCLE"},{"$f":"IF('Cycle History'!$B$103=\"\",\"\",'Cycle History'!$B$103)","v":34},{"$f":"IF('Cycle History'!$C$105=\"\",\"\",'Cycle History'!$C$105)","v":"Thawed"},{"$f":"IF('Cycle History'!$F$3=\"\",\"\",'Cycle History'!$F$3)","v":"TIME IN"}]
[396,{"$f":"IF('Cycle History'!$G$105=\"\",\"\",'Cycle History'!$G$105)","v":""},{"$f":"IF('Cycle History'!$B$1=\"\",\"\",'Cycle History'!$B$1)","v":"CYCLE HISTORY"},{"$f":"IF('Cycle History'!$B$3=\"\",\"\",'Cycle History'!$B$3)","v":"CYCLE"},{"$f":"IF('Cycle History'!$B$103=\"\",\"\",'Cycle History'!$B$103)","v":34},{"$f":"IF('Cycle History'!$C$105=\"\",\"\",'Cycle History'!$C$105)","v":"Thawed"},{"$f":"IF('Cycle History'!$G$3=\"\",\"\",'Cycle History'!$G$3)","v":"TIME OUT"}]
[397,{"$f":"IF('Cycle History'!$E$106=\"\",\"\",'Cycle History'!$E$106)","v":""},{"$f":"IF('Cycle History'!$B$1=\"\",\"\",'Cycle History'!$B$1)","v":"CYCLE HISTORY"},{"$f":"IF('Cycle History'!$B$3=\"\",\"\",'Cycle History'!$B$3)","v":"CYCLE"},{"$f":"IF('Cycle History'!$B$106=\"\",\"\",'Cycle History'!$B$106)","v":35},{"$f":"IF('Cycle History'!$C$106=\"\",\"\",'Cycle History'!$C$106)","v":"In Freezing chamber"},{"$f":"IF('Cycle History'!$E$3=\"\",\"\",'Cycle History'!$E$3)","v":"DATE"}]
[398,{"$f":"IF('Cycle History'!$F$106=\"\",\"\",'Cycle History'!$F$106)","v":""},{"$f":"IF('Cycle History'!$B$1=\"\",\"\",'Cycle History'!$B$1)","v":"CYCLE HISTORY"},{"$f":"IF('Cycle History'!$B$3=\"\",\"\",'Cycle History'!$B$3)","v":"CYCLE"},{"$f":"IF('Cycle History'!$B$106=\"\",\"\",'Cycle History'!$B$106)","v":35},{"$f":"IF('Cycle History'!$C$106=\"\",\"\",'Cycle History'!$C$106)","v":"In Freezing chamber"},{"$f":"IF('Cycle History'!$F$3=\"\",\"\",'Cycle History'!$F$3)","v":"TIME IN"}]
[399,{"$f":"IF('Cycle History'!$G$106=\"\",\"\",'Cycle History'!$G$106)","v":""},{"$f":"IF('Cycle History'!$B$1=\"\",\"\",'Cycle History'!$B$1)","v":"CYCLE HISTORY"},{"$f":"IF('Cycle History'!$B$3=\"\",\"\",'Cycle History'!$B$3)","v":"CYCLE"},{"$f":"IF('Cycle History'!$B$106=\"\",\"\",'Cycle History'!$B$106)","v":35},{"$f":"IF('Cycle History'!$C$106=\"\",\"\",'Cycle History'!$C$106)","v":"In Freezing chamber"},{"$f":"IF('Cycle History'!$G$3=\"\",\"\",'Cycle History'!$G$3)","v":"TIME OUT"}]
[400,{"$f":"IF('Cycle History'!$H$106=\"\",\"\",'Cycle History'!$H$106)","v":""},{"$f":"IF('Cycle History'!$B$1=\"\",\"\",'Cycle History'!$B$1)","v":"CYCLE HISTORY"},{"$f":"IF('Cycle History'!$B$3=\"\",\"\",'Cycle History'!$B$3)","v":"CYCLE"},{"$f":"IF('Cycle History'!$B$106=\"\",\"\",'Cycle History'!$B$106)","v":35},{"$f":"IF('Cycle History'!$C$106=\"\",\"\",'Cycle History'!$C$106)","v":"In Freezing chamber"},{"$f":"IF('Cycle History'!$H$3=\"\",\"\",'Cycle History'!$H$3)","v":"REMARKS"}]
[401,{"$f":"IF('Cycle History'!$E$107=\"\",\"\",'Cycle History'!$E$107)","v":""},{"$f":"IF('Cycle History'!$B$1=\"\",\"\",'Cycle History'!$B$1)","v":"CYCLE HISTORY"},{"$f":"IF('Cycle History'!$B$3=\"\",\"\",'Cycle History'!$B$3)","v":"CYCLE"},{"$f":"IF('Cycle History'!$B$106=\"\",\"\",'Cycle History'!$B$106)","v":35},{"$f":"IF('Cycle History'!$C$107=\"\",\"\",'Cycle History'!$C$107)","v":"Out Freezing chamber"},{"$f":"IF('Cycle History'!$E$3=\"\",\"\",'Cycle History'!$E$3)","v":"DATE"}]
[402,{"$f":"IF('Cycle History'!$F$107=\"\",\"\",'Cycle History'!$F$107)","v":""},{"$f":"IF('Cycle History'!$B$1=\"\",\"\",'Cycle History'!$B$1)","v":"CYCLE HISTORY"},{"$f":"IF('Cycle History'!$B$3=\"\",\"\",'Cycle History'!$B$3)","v":"CYCLE"},{"$f":"IF('Cycle History'!$B$106=\"\",\"\",'Cycle History'!$B$106)","v":35},{"$f":"IF('Cycle History'!$C$107=\"\",\"\",'Cycle History'!$C$107)","v":"Out Freezing chamber"},{"$f":"IF('Cycle History'!$F$3=\"\",\"\",'Cycle History'!$F$3)","v":"TIME IN"}]
[403,{"$f":"IF('Cycle History'!$G$107=\"\",\"\",'Cycle History'!$G$107)","v":""},{"$f":"IF('Cycle History'!$B$1=\"\",\"\",'Cycle History'!$B$1)","v":"CYCLE HISTORY"},{"$f":"IF('Cycle History'!$B$3=\"\",\"\",'Cycle History'!$B$3)","v":"CYCLE"},{"$f":"IF('Cycle History'!$B$106=\"\",\"\",'Cycle History'!$B$106)","v":35},{"$f":"IF('Cycle History'!$C$107=\"\",\"\",'Cycle History'!$C$107)","v":"Out Freezing chamber"},{"$f":"IF('Cycle History'!$G$3=\"\",\"\",'Cycle History'!$G$3)","v":"TIME OUT"}]
[404,{"$f":"IF('Cycle History'!$E$108=\"\",\"\",'Cycle History'!$E$108)","v":""},{"$f":"IF('Cycle History'!$B$1=\"\",\"\",'Cycle History'!$B$1)","v":"CYCLE HISTORY"},{"$f":"IF('Cycle History'!$B$3=\"\",\"\",'Cycle History'!$B$3)","v":"CYCLE"},{"$f":"IF('Cycle History'!$B$106=\"\",\"\",'Cycle History'!$B$106)","v":35},{"$f":"IF('Cycle History'!$C$108=\"\",\"\",'Cycle History'!$C$108)","v":"Thawed"},{"$f":"IF('Cycle History'!$E$3=\"\",\"\",'Cycle History'!$E$3)","v":"DATE"}]
[405,{"$f":"IF('Cycle History'!$F$108=\"\",\"\",'Cycle History'!$F$108)","v":""},{"$f":"IF('Cycle History'!$B$1=\"\",\"\",'Cycle History'!$B$1)","v":"CYCLE HISTORY"},{"$f":"IF('Cycle History'!$B$3=\"\",\"\",'Cycle History'!$B$3)","v":"CYCLE"},{"$f":"IF('Cycle History'!$B$106=\"\",\"\",'Cycle History'!$B$106)","v":35},{"$f":"IF('Cycle History'!$C$108=\"\",\"\",'Cycle History'!$C$108)","v":"Thawed"},{"$f":"IF('Cycle History'!$F$3=\"\",\"\",'Cycle History'!$F$3)","v":"TIME IN"}]
[406,{"$f":"IF('Cycle History'!$G$108=\"\",\"\",'Cycle History'!$G$108)","v":""},{"$f":"IF('Cycle History'!$B$1=\"\",\"\",'Cycle History'!$B$1)","v":"CYCLE HISTORY"},{"$f":"IF('Cycle History'!$B$3=\"\",\"\",'Cycle History'!$B$3)","v":"CYCLE"},{"$f":"IF('Cycle History'!$B$106=\"\",\"\",'Cycle History'!$B$106)","v":35},{"$f":"IF('Cycle History'!$C$108=\"\",\"\",'Cycle History'!$C$108)","v":"Thawed"},{"$f":"IF('Cycle History'!$G$3=\"\",\"\",'Cycle History'!$G$3)","v":"TIME OUT"}]
[407,{"$f":"IF('Cycle History'!$E$109=\"\",\"\",'Cycle History'!$E$109)","v":""},{"$f":"IF('Cycle History'!$B$1=\"\",\"\",'Cycle History'!$B$1)","v":"CYCLE HISTORY"},{"$f":"IF('Cycle History'!$B$3=\"\",\"\",'Cycle History'!$B$3)","v":"CYCLE"},{"$f":"IF('Cycle History'!$B$109=\"\",\"\",'Cycle History'!$B$109)","v":36},{"$f":"IF('Cycle History'!$C$109=\"\",\"\",'Cycle History'!$C$109)","v":"In Freezing chamber"},{"$f":"IF('Cycle History'!$E$3=\"\",\"\",'Cycle History'!$E$3)","v":"DATE"}]
[408,{"$f":"IF('Cycle History'!$F$109=\"\",\"\",'Cycle History'!$F$109)","v":""},{"$f":"IF('Cycle History'!$B$1=\"\",\"\",'Cycle History'!$B$1)","v":"CYCLE HISTORY"},{"$f":"IF('Cycle History'!$B$3=\"\",\"\",'Cycle History'!$B$3)","v":"CYCLE"},{"$f":"IF('Cycle History'!$B$109=\"\",\"\",'Cycle History'!$B$109)","v":36},{"$f":"IF('Cycle History'!$C$109=\"\",\"\",'Cycle History'!$C$109)","v":"In Freezing chamber"},{"$f":"IF('Cycle History'!$F$3=\"\",\"\",'Cycle History'!$F$3)","v":"TIME IN"}]
[409,{"$f":"IF('Cycle History'!$G$109=\"\",\"\",'Cycle History'!$G$109)","v":""},{"$f":"IF('Cycle History'!$B$1=\"\",\"\",'Cycle History'!$B$1)","v":"CYCLE HISTORY"},{"$f":"IF('Cycle History'!$B$3=\"\",\"\",'Cycle History'!$B$3)","v":"CYCLE"},{"$f":"IF('Cycle History'!$B$109=\"\",\"\",'Cycle History'!$B$109)","v":36},{"$f":"IF('Cycle History'!$C$109=\"\",\"\",'Cycle History'!$C$109)","v":"In Freezing chamber"},{"$f":"IF('Cycle History'!$G$3=\"\",\"\",'Cycle History'!$G$3)","v":"TIME OUT"}]
[410,{"$f":"IF('Cycle History'!$H$109=\"\",\"\",'Cycle History'!$H$109)","v":""},{"$f":"IF('Cycle History'!$B$1=\"\",\"\",'Cycle History'!$B$1)","v":"CYCLE HISTORY"},{"$f":"IF('Cycle History'!$B$3=\"\",\"\",'Cycle History'!$B$3)","v":"CYCLE"},{"$f":"IF('Cycle History'!$B$109=\"\",\"\",'Cycle History'!$B$109)","v":36},{"$f":"IF('Cycle History'!$C$109=\"\",\"\",'Cycle History'!$C$109)","v":"In Freezing chamber"},{"$f":"IF('Cycle History'!$H$3=\"\",\"\",'Cycle History'!$H$3)","v":"REMARKS"}]
[411,{"$f":"IF('Cycle History'!$E$110=\"\",\"\",'Cycle History'!$E$110)","v":""},{"$f":"IF('Cycle History'!$B$1=\"\",\"\",'Cycle History'!$B$1)","v":"CYCLE HISTORY"},{"$f":"IF('Cycle History'!$B$3=\"\",\"\",'Cycle History'!$B$3)","v":"CYCLE"},{"$f":"IF('Cycle History'!$B$109=\"\",\"\",'Cycle History'!$B$109)","v":36},{"$f":"IF('Cycle History'!$C$110=\"\",\"\",'Cycle History'!$C$110)","v":"Out Freezing chamber"},{"$f":"IF('Cycle History'!$E$3=\"\",\"\",'Cycle History'!$E$3)","v":"DATE"}]
[412,{"$f":"IF('Cycle History'!$F$110=\"\",\"\",'Cycle History'!$F$110)","v":""},{"$f":"IF('Cycle History'!$B$1=\"\",\"\",'Cycle History'!$B$1)","v":"CYCLE HISTORY"},{"$f":"IF('Cycle History'!$B$3=\"\",\"\",'Cycle History'!$B$3)","v":"CYCLE"},{"$f":"IF('Cycle History'!$B$109=\"\",\"\",'Cycle History'!$B$109)","v":36},{"$f":"IF('Cycle History'!$C$110=\"\",\"\",'Cycle History'!$C$110)","v":"Out Freezing chamber"},{"$f":"IF('Cycle History'!$F$3=\"\",\"\",'Cycle History'!$F$3)","v":"TIME IN"}]
[413,{"$f":"IF('Cycle History'!$G$110=\"\",\"\",'Cycle History'!$G$110)","v":""},{"$f":"IF('Cycle History'!$B$1=\"\",\"\",'Cycle History'!$B$1)","v":"CYCLE HISTORY"},{"$f":"IF('Cycle History'!$B$3=\"\",\"\",'Cycle History'!$B$3)","v":"CYCLE"},{"$f":"IF('Cycle History'!$B$109=\"\",\"\",'Cycle History'!$B$109)","v":36},{"$f":"IF('Cycle History'!$C$110=\"\",\"\",'Cycle History'!$C$110)","v":"Out Freezing chamber"},{"$f":"IF('Cycle History'!$G$3=\"\",\"\",'Cycle History'!$G$3)","v":"TIME OUT"}]
[414,{"$f":"IF('Cycle History'!$E$111=\"\",\"\",'Cycle History'!$E$111)","v":""},{"$f":"IF('Cycle History'!$B$1=\"\",\"\",'Cycle History'!$B$1)","v":"CYCLE HISTORY"},{"$f":"IF('Cycle History'!$B$3=\"\",\"\",'Cycle History'!$B$3)","v":"CYCLE"},{"$f":"IF('Cycle History'!$B$109=\"\",\"\",'Cycle History'!$B$109)","v":36},{"$f":"IF('Cycle History'!$C$111=\"\",\"\",'Cycle History'!$C$111)","v":"Thawed"},{"$f":"IF('Cycle History'!$E$3=\"\",\"\",'Cycle History'!$E$3)","v":"DATE"}]
[415,{"$f":"IF('Cycle History'!$F$111=\"\",\"\",'Cycle History'!$F$111)","v":""},{"$f":"IF('Cycle History'!$B$1=\"\",\"\",'Cycle History'!$B$1)","v":"CYCLE HISTORY"},{"$f":"IF('Cycle History'!$B$3=\"\",\"\",'Cycle History'!$B$3)","v":"CYCLE"},{"$f":"IF('Cycle History'!$B$109=\"\",\"\",'Cycle History'!$B$109)","v":36},{"$f":"IF('Cycle History'!$C$111=\"\",\"\",'Cycle History'!$C$111)","v":"Thawed"},{"$f":"IF('Cycle History'!$F$3=\"\",\"\",'Cycle History'!$F$3)","v":"TIME IN"}]
[416,{"$f":"IF('Cycle History'!$G$111=\"\",\"\",'Cycle History'!$G$111)","v":""},{"$f":"IF('Cycle History'!$B$1=\"\",\"\",'Cycle History'!$B$1)","v":"CYCLE HISTORY"},{"$f":"IF('Cycle History'!$B$3=\"\",\"\",'Cycle History'!$B$3)","v":"CYCLE"},{"$f":"IF('Cycle History'!$B$109=\"\",\"\",'Cycle History'!$B$109)","v":36},{"$f":"IF('Cycle History'!$C$111=\"\",\"\",'Cycle History'!$C$111)","v":"Thawed"},{"$f":"IF('Cycle History'!$G$3=\"\",\"\",'Cycle History'!$G$3)","v":"TIME OUT"}]
[417,{"$f":"IF('Cycle History'!$E$112=\"\",\"\",'Cycle History'!$E$112)","v":""},{"$f":"IF('Cycle History'!$B$1=\"\",\"\",'Cycle History'!$B$1)","v":"CYCLE HISTORY"},{"$f":"IF('Cycle History'!$B$3=\"\",\"\",'Cycle History'!$B$3)","v":"CYCLE"},{"$f":"IF('Cycle History'!$B$112=\"\",\"\",'Cycle History'!$B$112)","v":37},{"$f":"IF('Cycle History'!$C$112=\"\",\"\",'Cycle History'!$C$112)","v":"In Freezing chamber"},{"$f":"IF('Cycle History'!$E$3=\"\",\"\",'Cycle History'!$E$3)","v":"DATE"}]
[418,{"$f":"IF('Cycle History'!$F$112=\"\",\"\",'Cycle History'!$F$112)","v":""},{"$f":"IF('Cycle History'!$B$1=\"\",\"\",'Cycle History'!$B$1)","v":"CYCLE HISTORY"},{"$f":"IF('Cycle History'!$B$3=\"\",\"\",'Cycle History'!$B$3)","v":"CYCLE"},{"$f":"IF('Cycle History'!$B$112=\"\",\"\",'Cycle History'!$B$112)","v":37},{"$f":"IF('Cycle History'!$C$112=\"\",\"\",'Cycle History'!$C$112)","v":"In Freezing chamber"},{"$f":"IF('Cycle History'!$F$3=\"\",\"\",'Cycle History'!$F$3)","v":"TIME IN"}]
[419,{"$f":"IF('Cycle History'!$G$112=\"\",\"\",'Cycle History'!$G$112)","v":""},{"$f":"IF('Cycle History'!$B$1=\"\",\"\",'Cycle History'!$B$1)","v":"CYCLE HISTORY"},{"$f":"IF('Cycle History'!$B$3=\"\",\"\",'Cycle History'!$B$3)","v":"CYCLE"},{"$f":"IF('Cycle History'!$B$112=\"\",\"\",'Cycle History'!$B$112)","v":37},{"$f":"IF('Cycle History'!$C$112=\"\",\"\",'Cycle History'!$C$112)","v":"In Freezing chamber"},{"$f":"IF('Cycle History'!$G$3=\"\",\"\",'Cycle History'!$G$3)","v":"TIME OUT"}]
[420,{"$f":"IF('Cycle History'!$H$112=\"\",\"\",'Cycle History'!$H$112)","v":""},{"$f":"IF('Cycle History'!$B$1=\"\",\"\",'Cycle History'!$B$1)","v":"CYCLE HISTORY"},{"$f":"IF('Cycle History'!$B$3=\"\",\"\",'Cycle History'!$B$3)","v":"CYCLE"},{"$f":"IF('Cycle History'!$B$112=\"\",\"\",'Cycle History'!$B$112)","v":37},{"$f":"IF('Cycle History'!$C$112=\"\",\"\",'Cycle History'!$C$112)","v":"In Freezing chamber"},{"$f":"IF('Cycle History'!$H$3=\"\",\"\",'Cycle History'!$H$3)","v":"REMARKS"}]
[421,{"$f":"IF('Cycle History'!$E$113=\"\",\"\",'Cycle History'!$E$113)","v":""},{"$f":"IF('Cycle History'!$B$1=\"\",\"\",'Cycle History'!$B$1)","v":"CYCLE HISTORY"},{"$f":"IF('Cycle History'!$B$3=\"\",\"\",'Cycle History'!$B$3)","v":"CYCLE"},{"$f":"IF('Cycle History'!$B$112=\"\",\"\",'Cycle History'!$B$112)","v":37},{"$f":"IF('Cycle History'!$C$113=\"\",\"\",'Cycle History'!$C$113)","v":"Out Freezing chamber"},{"$f":"IF('Cycle History'!$E$3=\"\",\"\",'Cycle History'!$E$3)","v":"DATE"}]
[422,{"$f":"IF('Cycle History'!$F$113=\"\",\"\",'Cycle History'!$F$113)","v":""},{"$f":"IF('Cycle History'!$B$1=\"\",\"\",'Cycle History'!$B$1)","v":"CYCLE HISTORY"},{"$f":"IF('Cycle History'!$B$3=\"\",\"\",'Cycle History'!$B$3)","v":"CYCLE"},{"$f":"IF('Cycle History'!$B$112=\"\",\"\",'Cycle History'!$B$112)","v":37},{"$f":"IF('Cycle History'!$C$113=\"\",\"\",'Cycle History'!$C$113)","v":"Out Freezing chamber"},{"$f":"IF('Cycle History'!$F$3=\"\",\"\",'Cycle History'!$F$3)","v":"TIME IN"}]
[423,{"$f":"IF('Cycle History'!$G$113=\"\",\"\",'Cycle History'!$G$113)","v":""},{"$f":"IF('Cycle History'!$B$1=\"\",\"\",'Cycle History'!$B$1)","v":"CYCLE HISTORY"},{"$f":"IF('Cycle History'!$B$3=\"\",\"\",'Cycle History'!$B$3)","v":"CYCLE"},{"$f":"IF('Cycle History'!$B$112=\"\",\"\",'Cycle History'!$B$112)","v":37},{"$f":"IF('Cycle History'!$C$113=\"\",\"\",'Cycle History'!$C$113)","v":"Out Freezing chamber"},{"$f":"IF('Cycle History'!$G$3=\"\",\"\",'Cycle History'!$G$3)","v":"TIME OUT"}]
[424,{"$f":"IF('Cycle History'!$E$114=\"\",\"\",'Cycle History'!$E$114)","v":""},{"$f":"IF('Cycle History'!$B$1=\"\",\"\",'Cycle History'!$B$1)","v":"CYCLE HISTORY"},{"$f":"IF('Cycle History'!$B$3=\"\",\"\",'Cycle History'!$B$3)","v":"CYCLE"},{"$f":"IF('Cycle History'!$B$112=\"\",\"\",'Cycle History'!$B$112)","v":37},{"$f":"IF('Cycle History'!$C$114=\"\",\"\",'Cycle History'!$C$114)","v":"Thawed"},{"$f":"IF('Cycle History'!$E$3=\"\",\"\",'Cycle History'!$E$3)","v":"DATE"}]
[425,{"$f":"IF('Cycle History'!$F$114=\"\",\"\",'Cycle History'!$F$114)","v":""},{"$f":"IF('Cycle History'!$B$1=\"\",\"\",'Cycle History'!$B$1)","v":"CYCLE HISTORY"},{"$f":"IF('Cycle History'!$B$3=\"\",\"\",'Cycle History'!$B$3)","v":"CYCLE"},{"$f":"IF('Cycle History'!$B$112=\"\",\"\",'Cycle History'!$B$112)","v":37},{"$f":"IF('Cycle History'!$C$114=\"\",\"\",'Cycle History'!$C$114)","v":"Thawed"},{"$f":"IF('Cycle History'!$F$3=\"\",\"\",'Cycle History'!$F$3)","v":"TIME IN"}]
[426,{"$f":"IF('Cycle History'!$G$114=\"\",\"\",'Cycle History'!$G$114)","v":""},{"$f":"IF('Cycle History'!$B$1=\"\",\"\",'Cycle History'!$B$1)","v":"CYCLE HISTORY"},{"$f":"IF('Cycle History'!$B$3=\"\",\"\",'Cycle History'!$B$3)","v":"CYCLE"},{"$f":"IF('Cycle History'!$B$112=\"\",\"\",'Cycle History'!$B$112)","v":37},{"$f":"IF('Cycle History'!$C$114=\"\",\"\",'Cycle History'!$C$114)","v":"Thawed"},{"$f":"IF('Cycle History'!$G$3=\"\",\"\",'Cycle History'!$G$3)","v":"TIME OUT"}]
[427,{"$f":"IF('Cycle History'!$E$115=\"\",\"\",'Cycle History'!$E$115)","v":""},{"$f":"IF('Cycle History'!$B$1=\"\",\"\",'Cycle History'!$B$1)","v":"CYCLE HISTORY"},{"$f":"IF('Cycle History'!$B$3=\"\",\"\",'Cycle History'!$B$3)","v":"CYCLE"},{"$f":"IF('Cycle History'!$B$115=\"\",\"\",'Cycle History'!$B$115)","v":38},{"$f":"IF('Cycle History'!$C$115=\"\",\"\",'Cycle History'!$C$115)","v":"In Freezing chamber"},{"$f":"IF('Cycle History'!$E$3=\"\",\"\",'Cycle History'!$E$3)","v":"DATE"}]
[428,{"$f":"IF('Cycle History'!$F$115=\"\",\"\",'Cycle History'!$F$115)","v":""},{"$f":"IF('Cycle History'!$B$1=\"\",\"\",'Cycle History'!$B$1)","v":"CYCLE HISTORY"},{"$f":"IF('Cycle History'!$B$3=\"\",\"\",'Cycle History'!$B$3)","v":"CYCLE"},{"$f":"IF('Cycle History'!$B$115=\"\",\"\",'Cycle History'!$B$115)","v":38},{"$f":"IF('Cycle History'!$C$115=\"\",\"\",'Cycle History'!$C$115)","v":"In Freezing chamber"},{"$f":"IF('Cycle History'!$F$3=\"\",\"\",'Cycle History'!$F$3)","v":"TIME IN"}]
[429,{"$f":"IF('Cycle History'!$G$115=\"\",\"\",'Cycle History'!$G$115)","v":""},{"$f":"IF('Cycle History'!$B$1=\"\",\"\",'Cycle History'!$B$1)","v":"CYCLE HISTORY"},{"$f":"IF('Cycle History'!$B$3=\"\",\"\",'Cycle History'!$B$3)","v":"CYCLE"},{"$f":"IF('Cycle History'!$B$115=\"\",\"\",'Cycle History'!$B$115)","v":38},{"$f":"IF('Cycle History'!$C$115=\"\",\"\",'Cycle History'!$C$115)","v":"In Freezing chamber"},{"$f":"IF('Cycle History'!$G$3=\"\",\"\",'Cycle History'!$G$3)","v":"TIME OUT"}]
[430,{"$f":"IF('Cycle History'!$H$115=\"\",\"\",'Cycle History'!$H$115)","v":""},{"$f":"IF('Cycle History'!$B$1=\"\",\"\",'Cycle History'!$B$1)","v":"CYCLE HISTORY"},{"$f":"IF('Cycle History'!$B$3=\"\",\"\",'Cycle History'!$B$3)","v":"CYCLE"},{"$f":"IF('Cycle History'!$B$115=\"\",\"\",'Cycle History'!$B$115)","v":38},{"$f":"IF('Cycle History'!$C$115=\"\",\"\",'Cycle History'!$C$115)","v":"In Freezing chamber"},{"$f":"IF('Cycle History'!$H$3=\"\",\"\",'Cycle History'!$H$3)","v":"REMARKS"}]
[431,{"$f":"IF('Cycle History'!$E$116=\"\",\"\",'Cycle History'!$E$116)","v":""},{"$f":"IF('Cycle History'!$B$1=\"\",\"\",'Cycle History'!$B$1)","v":"CYCLE HISTORY"},{"$f":"IF('Cycle History'!$B$3=\"\",\"\",'Cycle History'!$B$3)","v":"CYCLE"},{"$f":"IF('Cycle History'!$B$115=\"\",\"\",'Cycle History'!$B$115)","v":38},{"$f":"IF('Cycle History'!$C$116=\"\",\"\",'Cycle History'!$C$116)","v":"Out Freezing chamber"},{"$f":"IF('Cycle History'!$E$3=\"\",\"\",'Cycle History'!$E$3)","v":"DATE"}]
[432,{"$f":"IF('Cycle History'!$F$116=\"\",\"\",'Cycle History'!$F$116)","v":""},{"$f":"IF('Cycle History'!$B$1=\"\",\"\",'Cycle History'!$B$1)","v":"CYCLE HISTORY"},{"$f":"IF('Cycle History'!$B$3=\"\",\"\",'Cycle History'!$B$3)","v":"CYCLE"},{"$f":"IF('Cycle History'!$B$115=\"\",\"\",'Cycle History'!$B$115)","v":38},{"$f":"IF('Cycle History'!$C$116=\"\",\"\",'Cycle History'!$C$116)","v":"Out Freezing chamber"},{"$f":"IF('Cycle History'!$F$3=\"\",\"\",'Cycle History'!$F$3)","v":"TIME IN"}]
[433,{"$f":"IF('Cycle History'!$G$116=\"\",\"\",'Cycle History'!$G$116)","v":""},{"$f":"IF('Cycle History'!$B$1=\"\",\"\",'Cycle History'!$B$1)","v":"CYCLE HISTORY"},{"$f":"IF('Cycle History'!$B$3=\"\",\"\",'Cycle History'!$B$3)","v":"CYCLE"},{"$f":"IF('Cycle History'!$B$115=\"\",\"\",'Cycle History'!$B$115)","v":38},{"$f":"IF('Cycle History'!$C$116=\"\",\"\",'Cycle History'!$C$116)","v":"Out Freezing chamber"},{"$f":"IF('Cycle History'!$G$3=\"\",\"\",'Cycle History'!$G$3)","v":"TIME OUT"}]
[434,{"$f":"IF('Cycle History'!$E$117=\"\",\"\",'Cycle History'!$E$117)","v":""},{"$f":"IF('Cycle History'!$B$1=\"\",\"\",'Cycle History'!$B$1)","v":"CYCLE HISTORY"},{"$f":"IF('Cycle History'!$B$3=\"\",\"\",'Cycle History'!$B$3)","v":"CYCLE"},{"$f":"IF('Cycle History'!$B$115=\"\",\"\",'Cycle History'!$B$115)","v":38},{"$f":"IF('Cycle History'!$C$117=\"\",\"\",'Cycle History'!$C$117)","v":"Thawed"},{"$f":"IF('Cycle History'!$E$3=\"\",\"\",'Cycle History'!$E$3)","v":"DATE"}]
[435,{"$f":"IF('Cycle History'!$F$117=\"\",\"\",'Cycle History'!$F$117)","v":""},{"$f":"IF('Cycle History'!$B$1=\"\",\"\",'Cycle History'!$B$1)","v":"CYCLE HISTORY"},{"$f":"IF('Cycle History'!$B$3=\"\",\"\",'Cycle History'!$B$3)","v":"CYCLE"},{"$f":"IF('Cycle History'!$B$115=\"\",\"\",'Cycle History'!$B$115)","v":38},{"$f":"IF('Cycle History'!$C$117=\"\",\"\",'Cycle History'!$C$117)","v":"Thawed"},{"$f":"IF('Cycle History'!$F$3=\"\",\"\",'Cycle History'!$F$3)","v":"TIME IN"}]
[436,{"$f":"IF('Cycle History'!$G$117=\"\",\"\",'Cycle History'!$G$117)","v":""},{"$f":"IF('Cycle History'!$B$1=\"\",\"\",'Cycle History'!$B$1)","v":"CYCLE HISTORY"},{"$f":"IF('Cycle History'!$B$3=\"\",\"\",'Cycle History'!$B$3)","v":"CYCLE"},{"$f":"IF('Cycle History'!$B$115=\"\",\"\",'Cycle History'!$B$115)","v":38},{"$f":"IF('Cycle History'!$C$117=\"\",\"\",'Cycle History'!$C$117)","v":"Thawed"},{"$f":"IF('Cycle History'!$G$3=\"\",\"\",'Cycle History'!$G$3)","v":"TIME OUT"}]
[437,{"$f":"IF('Cycle History'!$E$118=\"\",\"\",'Cycle History'!$E$118)","v":""},{"$f":"IF('Cycle History'!$B$1=\"\",\"\",'Cycle History'!$B$1)","v":"CYCLE HISTORY"},{"$f":"IF('Cycle History'!$B$3=\"\",\"\",'Cycle History'!$B$3)","v":"CYCLE"},{"$f":"IF('Cycle History'!$B$118=\"\",\"\",'Cycle History'!$B$118)","v":39},{"$f":"IF('Cycle History'!$C$118=\"\",\"\",'Cycle History'!$C$118)","v":"In Freezing chamber"},{"$f":"IF('Cycle History'!$E$3=\"\",\"\",'Cycle History'!$E$3)","v":"DATE"}]
[438,{"$f":"IF('Cycle History'!$F$118=\"\",\"\",'Cycle History'!$F$118)","v":""},{"$f":"IF('Cycle History'!$B$1=\"\",\"\",'Cycle History'!$B$1)","v":"CYCLE HISTORY"},{"$f":"IF('Cycle History'!$B$3=\"\",\"\",'Cycle History'!$B$3)","v":"CYCLE"},{"$f":"IF('Cycle History'!$B$118=\"\",\"\",'Cycle History'!$B$118)","v":39},{"$f":"IF('Cycle History'!$C$118=\"\",\"\",'Cycle History'!$C$118)","v":"In Freezing chamber"},{"$f":"IF('Cycle History'!$F$3=\"\",\"\",'Cycle History'!$F$3)","v":"TIME IN"}]
[439,{"$f":"IF('Cycle History'!$G$118=\"\",\"\",'Cycle History'!$G$118)","v":""},{"$f":"IF('Cycle History'!$B$1=\"\",\"\",'Cycle History'!$B$1)","v":"CYCLE HISTORY"},{"$f":"IF('Cycle History'!$B$3=\"\",\"\",'Cycle History'!$B$3)","v":"CYCLE"},{"$f":"IF('Cycle History'!$B$118=\"\",\"\",'Cycle History'!$B$118)","v":39},{"$f":"IF('Cycle History'!$C$118=\"\",\"\",'Cycle History'!$C$118)","v":"In Freezing chamber"},{"$f":"IF('Cycle History'!$G$3=\"\",\"\",'Cycle History'!$G$3)","v":"TIME OUT"}]
[440,{"$f":"IF('Cycle History'!$H$118=\"\",\"\",'Cycle History'!$H$118)","v":""},{"$f":"IF('Cycle History'!$B$1=\"\",\"\",'Cycle History'!$B$1)","v":"CYCLE HISTORY"},{"$f":"IF('Cycle History'!$B$3=\"\",\"\",'Cycle History'!$B$3)","v":"CYCLE"},{"$f":"IF('Cycle History'!$B$118=\"\",\"\",'Cycle History'!$B$118)","v":39},{"$f":"IF('Cycle History'!$C$118=\"\",\"\",'Cycle History'!$C$118)","v":"In Freezing chamber"},{"$f":"IF('Cycle History'!$H$3=\"\",\"\",'Cycle History'!$H$3)","v":"REMARKS"}]
[441,{"$f":"IF('Cycle History'!$E$119=\"\",\"\",'Cycle History'!$E$119)","v":""},{"$f":"IF('Cycle History'!$B$1=\"\",\"\",'Cycle History'!$B$1)","v":"CYCLE HISTORY"},{"$f":"IF('Cycle History'!$B$3=\"\",\"\",'Cycle History'!$B$3)","v":"CYCLE"},{"$f":"IF('Cycle History'!$B$118=\"\",\"\",'Cycle History'!$B$118)","v":39},{"$f":"IF('Cycle History'!$C$119=\"\",\"\",'Cycle History'!$C$119)","v":"Out Freezing chamber"},{"$f":"IF('Cycle History'!$E$3=\"\",\"\",'Cycle History'!$E$3)","v":"DATE"}]
[442,{"$f":"IF('Cycle History'!$F$119=\"\",\"\",'Cycle History'!$F$119)","v":""},{"$f":"IF('Cycle History'!$B$1=\"\",\"\",'Cycle History'!$B$1)","v":"CYCLE HISTORY"},{"$f":"IF('Cycle History'!$B$3=\"\",\"\",'Cycle History'!$B$3)","v":"CYCLE"},{"$f":"IF('Cycle History'!$B$118=\"\",\"\",'Cycle History'!$B$118)","v":39},{"$f":"IF('Cycle History'!$C$119=\"\",\"\",'Cycle History'!$C$119)","v":"Out Freezing chamber"},{"$f":"IF('Cycle History'!$F$3=\"\",\"\",'Cycle History'!$F$3)","v":"TIME IN"}]
[443,{"$f":"IF('Cycle History'!$G$119=\"\",\"\",'Cycle History'!$G$119)","v":""},{"$f":"IF('Cycle History'!$B$1=\"\",\"\",'Cycle History'!$B$1)","v":"CYCLE HISTORY"},{"$f":"IF('Cycle History'!$B$3=\"\",\"\",'Cycle History'!$B$3)","v":"CYCLE"},{"$f":"IF('Cycle History'!$B$118=\"\",\"\",'Cycle History'!$B$118)","v":39},{"$f":"IF('Cycle History'!$C$119=\"\",\"\",'Cycle History'!$C$119)","v":"Out Freezing chamber"},{"$f":"IF('Cycle History'!$G$3=\"\",\"\",'Cycle History'!$G$3)","v":"TIME OUT"}]
[444,{"$f":"IF('Cycle History'!$E$120=\"\",\"\",'Cycle History'!$E$120)","v":""},{"$f":"IF('Cycle History'!$B$1=\"\",\"\",'Cycle History'!$B$1)","v":"CYCLE HISTORY"},{"$f":"IF('Cycle History'!$B$3=\"\",\"\",'Cycle History'!$B$3)","v":"CYCLE"},{"$f":"IF('Cycle History'!$B$118=\"\",\"\",'Cycle History'!$B$118)","v":39},{"$f":"IF('Cycle History'!$C$120=\"\",\"\",'Cycle History'!$C$120)","v":"Thawed"},{"$f":"IF('Cycle History'!$E$3=\"\",\"\",'Cycle History'!$E$3)","v":"DATE"}]
[445,{"$f":"IF('Cycle History'!$F$120=\"\",\"\",'Cycle History'!$F$120)","v":""},{"$f":"IF('Cycle History'!$B$1=\"\",\"\",'Cycle History'!$B$1)","v":"CYCLE HISTORY"},{"$f":"IF('Cycle History'!$B$3=\"\",\"\",'Cycle History'!$B$3)","v":"CYCLE"},{"$f":"IF('Cycle History'!$B$118=\"\",\"\",'Cycle History'!$B$118)","v":39},{"$f":"IF('Cycle History'!$C$120=\"\",\"\",'Cycle History'!$C$120)","v":"Thawed"},{"$f":"IF('Cycle History'!$F$3=\"\",\"\",'Cycle History'!$F$3)","v":"TIME IN"}]
[446,{"$f":"IF('Cycle History'!$G$120=\"\",\"\",'Cycle History'!$G$120)","v":""},{"$f":"IF('Cycle History'!$B$1=\"\",\"\",'Cycle History'!$B$1)","v":"CYCLE HISTORY"},{"$f":"IF('Cycle History'!$B$3=\"\",\"\",'Cycle History'!$B$3)","v":"CYCLE"},{"$f":"IF('Cycle History'!$B$118=\"\",\"\",'Cycle History'!$B$118)","v":39},{"$f":"IF('Cycle History'!$C$120=\"\",\"\",'Cycle History'!$C$120)","v":"Thawed"},{"$f":"IF('Cycle History'!$G$3=\"\",\"\",'Cycle History'!$G$3)","v":"TIME OUT"}]
[447,{"$f":"IF('Cycle History'!$E$121=\"\",\"\",'Cycle History'!$E$121)","v":""},{"$f":"IF('Cycle History'!$B$1=\"\",\"\",'Cycle History'!$B$1)","v":"CYCLE HISTORY"},{"$f":"IF('Cycle History'!$B$3=\"\",\"\",'Cycle History'!$B$3)","v":"CYCLE"},{"$f":"IF('Cycle History'!$B$121=\"\",\"\",'Cycle History'!$B$121)","v":40},{"$f":"IF('Cycle History'!$C$121=\"\",\"\",'Cycle History'!$C$121)","v":"In Freezing chamber"},{"$f":"IF('Cycle History'!$E$3=\"\",\"\",'Cycle History'!$E$3)","v":"DATE"}]
[448,{"$f":"IF('Cycle History'!$F$121=\"\",\"\",'Cycle History'!$F$121)","v":""},{"$f":"IF('Cycle History'!$B$1=\"\",\"\",'Cycle History'!$B$1)","v":"CYCLE HISTORY"},{"$f":"IF('Cycle History'!$B$3=\"\",\"\",'Cycle History'!$B$3)","v":"CYCLE"},{"$f":"IF('Cycle History'!$B$121=\"\",\"\",'Cycle History'!$B$121)","v":40},{"$f":"IF('Cycle History'!$C$121=\"\",\"\",'Cycle History'!$C$121)","v":"In Freezing chamber"},{"$f":"IF('Cycle History'!$F$3=\"\",\"\",'Cycle History'!$F$3)","v":"TIME IN"}]
[449,{"$f":"IF('Cycle History'!$G$121=\"\",\"\",'Cycle History'!$G$121)","v":""},{"$f":"IF('Cycle History'!$B$1=\"\",\"\",'Cycle History'!$B$1)","v":"CYCLE HISTORY"},{"$f":"IF('Cycle History'!$B$3=\"\",\"\",'Cycle History'!$B$3)","v":"CYCLE"},{"$f":"IF('Cycle History'!$B$121=\"\",\"\",'Cycle History'!$B$121)","v":40},{"$f":"IF('Cycle History'!$C$121=\"\",\"\",'Cycle History'!$C$121)","v":"In Freezing chamber"},{"$f":"IF('Cycle History'!$G$3=\"\",\"\",'Cycle History'!$G$3)","v":"TIME OUT"}]
[450,{"$f":"IF('Cycle History'!$H$121=\"\",\"\",'Cycle History'!$H$121)","v":""},{"$f":"IF('Cycle History'!$B$1=\"\",\"\",'Cycle History'!$B$1)","v":"CYCLE HISTORY"},{"$f":"IF('Cycle History'!$B$3=\"\",\"\",'Cycle History'!$B$3)","v":"CYCLE"},{"$f":"IF('Cycle History'!$B$121=\"\",\"\",'Cycle History'!$B$121)","v":40},{"$f":"IF('Cycle History'!$C$121=\"\",\"\",'Cycle History'!$C$121)","v":"In Freezing chamber"},{"$f":"IF('Cycle History'!$H$3=\"\",\"\",'Cycle History'!$H$3)","v":"REMARKS"}]
[451,{"$f":"IF('Cycle History'!$E$122=\"\",\"\",'Cycle History'!$E$122)","v":""},{"$f":"IF('Cycle History'!$B$1=\"\",\"\",'Cycle History'!$B$1)","v":"CYCLE HISTORY"},{"$f":"IF('Cycle History'!$B$3=\"\",\"\",'Cycle History'!$B$3)","v":"CYCLE"},{"$f":"IF('Cycle History'!$B$121=\"\",\"\",'Cycle History'!$B$121)","v":40},{"$f":"IF('Cycle History'!$C$122=\"\",\"\",'Cycle History'!$C$122)","v":"Out Freezing chamber"},{"$f":"IF('Cycle History'!$E$3=\"\",\"\",'Cycle History'!$E$3)","v":"DATE"}]
[452,{"$f":"IF('Cycle History'!$F$122=\"\",\"\",'Cycle History'!$F$122)","v":""},{"$f":"IF('Cycle History'!$B$1=\"\",\"\",'Cycle History'!$B$1)","v":"CYCLE HISTORY"},{"$f":"IF('Cycle History'!$B$3=\"\",\"\",'Cycle History'!$B$3)","v":"CYCLE"},{"$f":"IF('Cycle History'!$B$121=\"\",\"\",'Cycle History'!$B$121)","v":40},{"$f":"IF('Cycle History'!$C$122=\"\",\"\",'Cycle History'!$C$122)","v":"Out Freezing chamber"},{"$f":"IF('Cycle History'!$F$3=\"\",\"\",'Cycle History'!$F$3)","v":"TIME IN"}]
[453,{"$f":"IF('Cycle History'!$G$122=\"\",\"\",'Cycle History'!$G$122)","v":""},{"$f":"IF('Cycle History'!$B$1=\"\",\"\",'Cycle History'!$B$1)","v":"CYCLE HISTORY"},{"$f":"IF('Cycle History'!$B$3=\"\",\"\",'Cycle History'!$B$3)","v":"CYCLE"},{"$f":"IF('Cycle History'!$B$121=\"\",\"\",'Cycle History'!$B$121)","v":40},{"$f":"IF('Cycle History'!$C$122=\"\",\"\",'Cycle History'!$C$122)","v":"Out Freezing chamber"},{"$f":"IF('Cycle History'!$G$3=\"\",\"\",'Cycle History'!$G$3)","v":"TIME OUT"}]
[454,{"$f":"IF('Cycle History'!$E$123=\"\",\"\",'Cycle History'!$E$123)","v":""},{"$f":"IF('Cycle History'!$B$1=\"\",\"\",'Cycle History'!$B$1)","v":"CYCLE HISTORY"},{"$f":"IF('Cycle History'!$B$3=\"\",\"\",'Cycle History'!$B$3)","v":"CYCLE"},{"$f":"IF('Cycle History'!$B$121=\"\",\"\",'Cycle History'!$B$121)","v":40},{"$f":"IF('Cycle History'!$C$123=\"\",\"\",'Cycle History'!$C$123)","v":"Thawed"},{"$f":"IF('Cycle History'!$E$3=\"\",\"\",'Cycle History'!$E$3)","v":"DATE"}]
[455,{"$f":"IF('Cycle History'!$F$123=\"\",\"\",'Cycle History'!$F$123)","v":""},{"$f":"IF('Cycle History'!$B$1=\"\",\"\",'Cycle History'!$B$1)","v":"CYCLE HISTORY"},{"$f":"IF('Cycle History'!$B$3=\"\",\"\",'Cycle History'!$B$3)","v":"CYCLE"},{"$f":"IF('Cycle History'!$B$121=\"\",\"\",'Cycle History'!$B$121)","v":40},{"$f":"IF('Cycle History'!$C$123=\"\",\"\",'Cycle History'!$C$123)","v":"Thawed"},{"$f":"IF('Cycle History'!$F$3=\"\",\"\",'Cycle History'!$F$3)","v":"TIME IN"}]
[456,{"$f":"IF('Cycle History'!$G$123=\"\",\"\",'Cycle History'!$G$123)","v":""},{"$f":"IF('Cycle History'!$B$1=\"\",\"\",'Cycle History'!$B$1)","v":"CYCLE HISTORY"},{"$f":"IF('Cycle History'!$B$3=\"\",\"\",'Cycle History'!$B$3)","v":"CYCLE"},{"$f":"IF('Cycle History'!$B$121=\"\",\"\",'Cycle History'!$B$121)","v":40},{"$f":"IF('Cycle History'!$C$123=\"\",\"\",'Cycle History'!$C$123)","v":"Thawed"},{"$f":"IF('Cycle History'!$G$3=\"\",\"\",'Cycle History'!$G$3)","v":"TIME OUT"}]
[457,{"$f":"IF('Cycle History'!$E$124=\"\",\"\",'Cycle History'!$E$124)","v":""},{"$f":"IF('Cycle History'!$B$1=\"\",\"\",'Cycle History'!$B$1)","v":"CYCLE HISTORY"},{"$f":"IF('Cycle History'!$B$3=\"\",\"\",'Cycle History'!$B$3)","v":"CYCLE"},{"$f":"IF('Cycle History'!$B$124=\"\",\"\",'Cycle History'!$B$124)","v":41},{"$f":"IF('Cycle History'!$C$124=\"\",\"\",'Cycle History'!$C$124)","v":"In Freezing chamber"},{"$f":"IF('Cycle History'!$E$3=\"\",\"\",'Cycle History'!$E$3)","v":"DATE"}]
[458,{"$f":"IF('Cycle History'!$F$124=\"\",\"\",'Cycle History'!$F$124)","v":""},{"$f":"IF('Cycle History'!$B$1=\"\",\"\",'Cycle History'!$B$1)","v":"CYCLE HISTORY"},{"$f":"IF('Cycle History'!$B$3=\"\",\"\",'Cycle History'!$B$3)","v":"CYCLE"},{"$f":"IF('Cycle History'!$B$124=\"\",\"\",'Cycle History'!$B$124)","v":41},{"$f":"IF('Cycle History'!$C$124=\"\",\"\",'Cycle History'!$C$124)","v":"In Freezing chamber"},{"$f":"IF('Cycle History'!$F$3=\"\",\"\",'Cycle History'!$F$3)","v":"TIME IN"}]
[459,{"$f":"IF('Cycle History'!$G$124=\"\",\"\",'Cycle History'!$G$124)","v":""},{"$f":"IF('Cycle History'!$B$1=\"\",\"\",'Cycle History'!$B$1)","v":"CYCLE HISTORY"},{"$f":"IF('Cycle History'!$B$3=\"\",\"\",'Cycle History'!$B$3)","v":"CYCLE"},{"$f":"IF('Cycle History'!$B$124=\"\",\"\",'Cycle History'!$B$124)","v":41},{"$f":"IF('Cycle History'!$C$124=\"\",\"\",'Cycle History'!$C$124)","v":"In Freezing chamber"},{"$f":"IF('Cycle History'!$G$3=\"\",\"\",'Cycle History'!$G$3)","v":"TIME OUT"}]
[460,{"$f":"IF('Cycle History'!$H$124=\"\",\"\",'Cycle History'!$H$124)","v":""},{"$f":"IF('Cycle History'!$B$1=\"\",\"\",'Cycle History'!$B$1)","v":"CYCLE HISTORY"},{"$f":"IF('Cycle History'!$B$3=\"\",\"\",'Cycle History'!$B$3)","v":"CYCLE"},{"$f":"IF('Cycle History'!$B$124=\"\",\"\",'Cycle History'!$B$124)","v":41},{"$f":"IF('Cycle History'!$C$124=\"\",\"\",'Cycle History'!$C$124)","v":"In Freezing chamber"},{"$f":"IF('Cycle History'!$H$3=\"\",\"\",'Cycle History'!$H$3)","v":"REMARKS"}]
[461,{"$f":"IF('Cycle History'!$E$125=\"\",\"\",'Cycle History'!$E$125)","v":""},{"$f":"IF('Cycle History'!$B$1=\"\",\"\",'Cycle History'!$B$1)","v":"CYCLE HISTORY"},{"$f":"IF('Cycle History'!$B$3=\"\",\"\",'Cycle History'!$B$3)","v":"CYCLE"},{"$f":"IF('Cycle History'!$B$124=\"\",\"\",'Cycle History'!$B$124)","v":41},{"$f":"IF('Cycle History'!$C$125=\"\",\"\",'Cycle History'!$C$125)","v":"Out Freezing chamber"},{"$f":"IF('Cycle History'!$E$3=\"\",\"\",'Cycle History'!$E$3)","v":"DATE"}]
[462,{"$f":"IF('Cycle History'!$F$125=\"\",\"\",'Cycle History'!$F$125)","v":""},{"$f":"IF('Cycle History'!$B$1=\"\",\"\",'Cycle History'!$B$1)","v":"CYCLE HISTORY"},{"$f":"IF('Cycle History'!$B$3=\"\",\"\",'Cycle History'!$B$3)","v":"CYCLE"},{"$f":"IF('Cycle History'!$B$124=\"\",\"\",'Cycle History'!$B$124)","v":41},{"$f":"IF('Cycle History'!$C$125=\"\",\"\",'Cycle History'!$C$125)","v":"Out Freezing chamber"},{"$f":"IF('Cycle History'!$F$3=\"\",\"\",'Cycle History'!$F$3)","v":"TIME IN"}]
[463,{"$f":"IF('Cycle History'!$G$125=\"\",\"\",'Cycle History'!$G$125)","v":""},{"$f":"IF('Cycle History'!$B$1=\"\",\"\",'Cycle History'!$B$1)","v":"CYCLE HISTORY"},{"$f":"IF('Cycle History'!$B$3=\"\",\"\",'Cycle History'!$B$3)","v":"CYCLE"},{"$f":"IF('Cycle History'!$B$124=\"\",\"\",'Cycle History'!$B$124)","v":41},{"$f":"IF('Cycle History'!$C$125=\"\",\"\",'Cycle History'!$C$125)","v":"Out Freezing chamber"},{"$f":"IF('Cycle History'!$G$3=\"\",\"\",'Cycle History'!$G$3)","v":"TIME OUT"}]
[464,{"$f":"IF('Cycle History'!$E$126=\"\",\"\",'Cycle History'!$E$126)","v":""},{"$f":"IF('Cycle History'!$B$1=\"\",\"\",'Cycle History'!$B$1)","v":"CYCLE HISTORY"},{"$f":"IF('Cycle History'!$B$3=\"\",\"\",'Cycle History'!$B$3)","v":"CYCLE"},{"$f":"IF('Cycle History'!$B$124=\"\",\"\",'Cycle History'!$B$124)","v":41},{"$f":"IF('Cycle History'!$C$126=\"\",\"\",'Cycle History'!$C$126)","v":"Thawed"},{"$f":"IF('Cycle History'!$E$3=\"\",\"\",'Cycle History'!$E$3)","v":"DATE"}]
[465,{"$f":"IF('Cycle History'!$F$126=\"\",\"\",'Cycle History'!$F$126)","v":""},{"$f":"IF('Cycle History'!$B$1=\"\",\"\",'Cycle History'!$B$1)","v":"CYCLE HISTORY"},{"$f":"IF('Cycle History'!$B$3=\"\",\"\",'Cycle History'!$B$3)","v":"CYCLE"},{"$f":"IF('Cycle History'!$B$124=\"\",\"\",'Cycle History'!$B$124)","v":41},{"$f":"IF('Cycle History'!$C$126=\"\",\"\",'Cycle History'!$C$126)","v":"Thawed"},{"$f":"IF('Cycle History'!$F$3=\"\",\"\",'Cycle History'!$F$3)","v":"TIME IN"}]
[466,{"$f":"IF('Cycle History'!$G$126=\"\",\"\",'Cycle History'!$G$126)","v":""},{"$f":"IF('Cycle History'!$B$1=\"\",\"\",'Cycle History'!$B$1)","v":"CYCLE HISTORY"},{"$f":"IF('Cycle History'!$B$3=\"\",\"\",'Cycle History'!$B$3)","v":"CYCLE"},{"$f":"IF('Cycle History'!$B$124=\"\",\"\",'Cycle History'!$B$124)","v":41},{"$f":"IF('Cycle History'!$C$126=\"\",\"\",'Cycle History'!$C$126)","v":"Thawed"},{"$f":"IF('Cycle History'!$G$3=\"\",\"\",'Cycle History'!$G$3)","v":"TIME OUT"}]
[467,{"$f":"IF('Cycle History'!$E$127=\"\",\"\",'Cycle History'!$E$127)","v":""},{"$f":"IF('Cycle History'!$B$1=\"\",\"\",'Cycle History'!$B$1)","v":"CYCLE HISTORY"},{"$f":"IF('Cycle History'!$B$3=\"\",\"\",'Cycle History'!$B$3)","v":"CYCLE"},{"$f":"IF('Cycle History'!$B$127=\"\",\"\",'Cycle History'!$B$127)","v":42},{"$f":"IF('Cycle History'!$C$127=\"\",\"\",'Cycle History'!$C$127)","v":"In Freezing chamber"},{"$f":"IF('Cycle History'!$E$3=\"\",\"\",'Cycle History'!$E$3)","v":"DATE"}]
[468,{"$f":"IF('Cycle History'!$F$127=\"\",\"\",'Cycle History'!$F$127)","v":""},{"$f":"IF('Cycle History'!$B$1=\"\",\"\",'Cycle History'!$B$1)","v":"CYCLE HISTORY"},{"$f":"IF('Cycle History'!$B$3=\"\",\"\",'Cycle History'!$B$3)","v":"CYCLE"},{"$f":"IF('Cycle History'!$B$127=\"\",\"\",'Cycle History'!$B$127)","v":42},{"$f":"IF('Cycle History'!$C$127=\"\",\"\",'Cycle History'!$C$127)","v":"In Freezing chamber"},{"$f":"IF('Cycle History'!$F$3=\"\",\"\",'Cycle History'!$F$3)","v":"TIME IN"}]
[469,{"$f":"IF('Cycle History'!$G$127=\"\",\"\",'Cycle History'!$G$127)","v":""},{"$f":"IF('Cycle History'!$B$1=\"\",\"\",'Cycle History'!$B$1)","v":"CYCLE HISTORY"},{"$f":"IF('Cycle History'!$B$3=\"\",\"\",'Cycle History'!$B$3)","v":"CYCLE"},{"$f":"IF('Cycle History'!$B$127=\"\",\"\",'Cycle History'!$B$127)","v":42},{"$f":"IF('Cycle History'!$C$127=\"\",\"\",'Cycle History'!$C$127)","v":"In Freezing chamber"},{"$f":"IF('Cycle History'!$G$3=\"\",\"\",'Cycle History'!$G$3)","v":"TIME OUT"}]
[470,{"$f":"IF('Cycle History'!$H$127=\"\",\"\",'Cycle History'!$H$127)","v":""},{"$f":"IF('Cycle History'!$B$1=\"\",\"\",'Cycle History'!$B$1)","v":"CYCLE HISTORY"},{"$f":"IF('Cycle History'!$B$3=\"\",\"\",'Cycle History'!$B$3)","v":"CYCLE"},{"$f":"IF('Cycle History'!$B$127=\"\",\"\",'Cycle History'!$B$127)","v":42},{"$f":"IF('Cycle History'!$C$127=\"\",\"\",'Cycle History'!$C$127)","v":"In Freezing chamber"},{"$f":"IF('Cycle History'!$H$3=\"\",\"\",'Cycle History'!$H$3)","v":"REMARKS"}]
[471,{"$f":"IF('Cycle History'!$E$128=\"\",\"\",'Cycle History'!$E$128)","v":""},{"$f":"IF('Cycle History'!$B$1=\"\",\"\",'Cycle History'!$B$1)","v":"CYCLE HISTORY"},{"$f":"IF('Cycle History'!$B$3=\"\",\"\",'Cycle History'!$B$3)","v":"CYCLE"},{"$f":"IF('Cycle History'!$B$127=\"\",\"\",'Cycle History'!$B$127)","v":42},{"$f":"IF('Cycle History'!$C$128=\"\",\"\",'Cycle History'!$C$128)","v":"Out Freezing chamber"},{"$f":"IF('Cycle History'!$E$3=\"\",\"\",'Cycle History'!$E$3)","v":"DATE"}]
[472,{"$f":"IF('Cycle History'!$F$128=\"\",\"\",'Cycle History'!$F$128)","v":""},{"$f":"IF('Cycle History'!$B$1=\"\",\"\",'Cycle History'!$B$1)","v":"CYCLE HISTORY"},{"$f":"IF('Cycle History'!$B$3=\"\",\"\",'Cycle History'!$B$3)","v":"CYCLE"},{"$f":"IF('Cycle History'!$B$127=\"\",\"\",'Cycle History'!$B$127)","v":42},{"$f":"IF('Cycle History'!$C$128=\"\",\"\",'Cycle History'!$C$128)","v":"Out Freezing chamber"},{"$f":"IF('Cycle History'!$F$3=\"\",\"\",'Cycle History'!$F$3)","v":"TIME IN"}]
[473,{"$f":"IF('Cycle History'!$G$128=\"\",\"\",'Cycle History'!$G$128)","v":""},{"$f":"IF('Cycle History'!$B$1=\"\",\"\",'Cycle History'!$B$1)","v":"CYCLE HISTORY"},{"$f":"IF('Cycle History'!$B$3=\"\",\"\",'Cycle History'!$B$3)","v":"CYCLE"},{"$f":"IF('Cycle History'!$B$127=\"\",\"\",'Cycle History'!$B$127)","v":42},{"$f":"IF('Cycle History'!$C$128=\"\",\"\",'Cycle History'!$C$128)","v":"Out Freezing chamber"},{"$f":"IF('Cycle History'!$G$3=\"\",\"\",'Cycle History'!$G$3)","v":"TIME OUT"}]
[474,{"$f":"IF('Cycle History'!$E$129=\"\",\"\",'Cycle History'!$E$129)","v":""},{"$f":"IF('Cycle History'!$B$1=\"\",\"\",'Cycle History'!$B$1)","v":"CYCLE HISTORY"},{"$f":"IF('Cycle History'!$B$3=\"\",\"\",'Cycle History'!$B$3)","v":"CYCLE"},{"$f":"IF('Cycle History'!$B$127=\"\",\"\",'Cycle History'!$B$127)","v":42},{"$f":"IF('Cycle History'!$C$129=\"\",\"\",'Cycle History'!$C$129)","v":"Thawed"},{"$f":"IF('Cycle History'!$E$3=\"\",\"\",'Cycle History'!$E$3)","v":"DATE"}]
[475,{"$f":"IF('Cycle History'!$F$129=\"\",\"\",'Cycle History'!$F$129)","v":""},{"$f":"IF('Cycle History'!$B$1=\"\",\"\",'Cycle History'!$B$1)","v":"CYCLE HISTORY"},{"$f":"IF('Cycle History'!$B$3=\"\",\"\",'Cycle History'!$B$3)","v":"CYCLE"},{"$f":"IF('Cycle History'!$B$127=\"\",\"\",'Cycle History'!$B$127)","v":42},{"$f":"IF('Cycle History'!$C$129=\"\",\"\",'Cycle History'!$C$129)","v":"Thawed"},{"$f":"IF('Cycle History'!$F$3=\"\",\"\",'Cycle History'!$F$3)","v":"TIME IN"}]
[476,{"$f":"IF('Cycle History'!$G$129=\"\",\"\",'Cycle History'!$G$129)","v":""},{"$f":"IF('Cycle History'!$B$1=\"\",\"\",'Cycle History'!$B$1)","v":"CYCLE HISTORY"},{"$f":"IF('Cycle History'!$B$3=\"\",\"\",'Cycle History'!$B$3)","v":"CYCLE"},{"$f":"IF('Cycle History'!$B$127=\"\",\"\",'Cycle History'!$B$127)","v":42},{"$f":"IF('Cycle History'!$C$129=\"\",\"\",'Cycle History'!$C$129)","v":"Thawed"},{"$f":"IF('Cycle History'!$G$3=\"\",\"\",'Cycle History'!$G$3)","v":"TIME OUT"}]
[477,{"$f":"IF('Cycle History'!$E$130=\"\",\"\",'Cycle History'!$E$130)","v":""},{"$f":"IF('Cycle History'!$B$1=\"\",\"\",'Cycle History'!$B$1)","v":"CYCLE HISTORY"},{"$f":"IF('Cycle History'!$B$3=\"\",\"\",'Cycle History'!$B$3)","v":"CYCLE"},{"$f":"IF('Cycle History'!$B$130=\"\",\"\",'Cycle History'!$B$130)","v":43},{"$f":"IF('Cycle History'!$C$130=\"\",\"\",'Cycle History'!$C$130)","v":"In Freezing chamber"},{"$f":"IF('Cycle History'!$E$3=\"\",\"\",'Cycle History'!$E$3)","v":"DATE"}]
[478,{"$f":"IF('Cycle History'!$F$130=\"\",\"\",'Cycle History'!$F$130)","v":""},{"$f":"IF('Cycle History'!$B$1=\"\",\"\",'Cycle History'!$B$1)","v":"CYCLE HISTORY"},{"$f":"IF('Cycle History'!$B$3=\"\",\"\",'Cycle History'!$B$3)","v":"CYCLE"},{"$f":"IF('Cycle History'!$B$130=\"\",\"\",'Cycle History'!$B$130)","v":43},{"$f":"IF('Cycle History'!$C$130=\"\",\"\",'Cycle History'!$C$130)","v":"In Freezing chamber"},{"$f":"IF('Cycle History'!$F$3=\"\",\"\",'Cycle History'!$F$3)","v":"TIME IN"}]
[479,{"$f":"IF('Cycle History'!$G$130=\"\",\"\",'Cycle History'!$G$130)","v":""},{"$f":"IF('Cycle History'!$B$1=\"\",\"\",'Cycle History'!$B$1)","v":"CYCLE HISTORY"},{"$f":"IF('Cycle History'!$B$3=\"\",\"\",'Cycle History'!$B$3)","v":"CYCLE"},{"$f":"IF('Cycle History'!$B$130=\"\",\"\",'Cycle History'!$B$130)","v":43},{"$f":"IF('Cycle History'!$C$130=\"\",\"\",'Cycle History'!$C$130)","v":"In Freezing chamber"},{"$f":"IF('Cycle History'!$G$3=\"\",\"\",'Cycle History'!$G$3)","v":"TIME OUT"}]
[480,{"$f":"IF('Cycle History'!$H$130=\"\",\"\",'Cycle History'!$H$130)","v":""},{"$f":"IF('Cycle History'!$B$1=\"\",\"\",'Cycle History'!$B$1)","v":"CYCLE HISTORY"},{"$f":"IF('Cycle History'!$B$3=\"\",\"\",'Cycle History'!$B$3)","v":"CYCLE"},{"$f":"IF('Cycle History'!$B$130=\"\",\"\",'Cycle History'!$B$130)","v":43},{"$f":"IF('Cycle History'!$C$130=\"\",\"\",'Cycle History'!$C$130)","v":"In Freezing chamber"},{"$f":"IF('Cycle History'!$H$3=\"\",\"\",'Cycle History'!$H$3)","v":"REMARKS"}]
[481,{"$f":"IF('Cycle History'!$E$131=\"\",\"\",'Cycle History'!$E$131)","v":""},{"$f":"IF('Cycle History'!$B$1=\"\",\"\",'Cycle History'!$B$1)","v":"CYCLE HISTORY"},{"$f":"IF('Cycle History'!$B$3=\"\",\"\",'Cycle History'!$B$3)","v":"CYCLE"},{"$f":"IF('Cycle History'!$B$130=\"\",\"\",'Cycle History'!$B$130)","v":43},{"$f":"IF('Cycle History'!$C$131=\"\",\"\",'Cycle History'!$C$131)","v":"Out Freezing chamber"},{"$f":"IF('Cycle History'!$E$3=\"\",\"\",'Cycle History'!$E$3)","v":"DATE"}]
[482,{"$f":"IF('Cycle History'!$F$131=\"\",\"\",'Cycle History'!$F$131)","v":""},{"$f":"IF('Cycle History'!$B$1=\"\",\"\",'Cycle History'!$B$1)","v":"CYCLE HISTORY"},{"$f":"IF('Cycle History'!$B$3=\"\",\"\",'Cycle History'!$B$3)","v":"CYCLE"},{"$f":"IF('Cycle History'!$B$130=\"\",\"\",'Cycle History'!$B$130)","v":43},{"$f":"IF('Cycle History'!$C$131=\"\",\"\",'Cycle History'!$C$131)","v":"Out Freezing chamber"},{"$f":"IF('Cycle History'!$F$3=\"\",\"\",'Cycle History'!$F$3)","v":"TIME IN"}]
[483,{"$f":"IF('Cycle History'!$G$131=\"\",\"\",'Cycle History'!$G$131)","v":""},{"$f":"IF('Cycle History'!$B$1=\"\",\"\",'Cycle History'!$B$1)","v":"CYCLE HISTORY"},{"$f":"IF('Cycle History'!$B$3=\"\",\"\",'Cycle History'!$B$3)","v":"CYCLE"},{"$f":"IF('Cycle History'!$B$130=\"\",\"\",'Cycle History'!$B$130)","v":43},{"$f":"IF('Cycle History'!$C$131=\"\",\"\",'Cycle History'!$C$131)","v":"Out Freezing chamber"},{"$f":"IF('Cycle History'!$G$3=\"\",\"\",'Cycle History'!$G$3)","v":"TIME OUT"}]
[484,{"$f":"IF('Cycle History'!$E$132=\"\",\"\",'Cycle History'!$E$132)","v":""},{"$f":"IF('Cycle History'!$B$1=\"\",\"\",'Cycle History'!$B$1)","v":"CYCLE HISTORY"},{"$f":"IF('Cycle History'!$B$3=\"\",\"\",'Cycle History'!$B$3)","v":"CYCLE"},{"$f":"IF('Cycle History'!$B$130=\"\",\"\",'Cycle History'!$B$130)","v":43},{"$f":"IF('Cycle History'!$C$132=\"\",\"\",'Cycle History'!$C$132)","v":"Thawed"},{"$f":"IF('Cycle History'!$E$3=\"\",\"\",'Cycle History'!$E$3)","v":"DATE"}]
[485,{"$f":"IF('Cycle History'!$F$132=\"\",\"\",'Cycle History'!$F$132)","v":""},{"$f":"IF('Cycle History'!$B$1=\"\",\"\",'Cycle History'!$B$1)","v":"CYCLE HISTORY"},{"$f":"IF('Cycle History'!$B$3=\"\",\"\",'Cycle History'!$B$3)","v":"CYCLE"},{"$f":"IF('Cycle History'!$B$130=\"\",\"\",'Cycle History'!$B$130)","v":43},{"$f":"IF('Cycle History'!$C$132=\"\",\"\",'Cycle History'!$C$132)","v":"Thawed"},{"$f":"IF('Cycle History'!$F$3=\"\",\"\",'Cycle History'!$F$3)","v":"TIME IN"}]
[486,{"$f":"IF('Cycle History'!$G$132=\"\",\"\",'Cycle History'!$G$132)","v":""},{"$f":"IF('Cycle History'!$B$1=\"\",\"\",'Cycle History'!$B$1)","v":"CYCLE HISTORY"},{"$f":"IF('Cycle History'!$B$3=\"\",\"\",'Cycle History'!$B$3)","v":"CYCLE"},{"$f":"IF('Cycle History'!$B$130=\"\",\"\",'Cycle History'!$B$130)","v":43},{"$f":"IF('Cycle History'!$C$132=\"\",\"\",'Cycle History'!$C$132)","v":"Thawed"},{"$f":"IF('Cycle History'!$G$3=\"\",\"\",'Cycle History'!$G$3)","v":"TIME OUT"}]
[487,{"$f":"IF('Cycle History'!$E$133=\"\",\"\",'Cycle History'!$E$133)","v":""},{"$f":"IF('Cycle History'!$B$1=\"\",\"\",'Cycle History'!$B$1)","v":"CYCLE HISTORY"},{"$f":"IF('Cycle History'!$B$3=\"\",\"\",'Cycle History'!$B$3)","v":"CYCLE"},{"$f":"IF('Cycle History'!$B$133=\"\",\"\",'Cycle History'!$B$133)","v":44},{"$f":"IF('Cycle History'!$C$133=\"\",\"\",'Cycle History'!$C$133)","v":"In Freezing chamber"},{"$f":"IF('Cycle History'!$E$3=\"\",\"\",'Cycle History'!$E$3)","v":"DATE"}]
[488,{"$f":"IF('Cycle History'!$F$133=\"\",\"\",'Cycle History'!$F$133)","v":""},{"$f":"IF('Cycle History'!$B$1=\"\",\"\",'Cycle History'!$B$1)","v":"CYCLE HISTORY"},{"$f":"IF('Cycle History'!$B$3=\"\",\"\",'Cycle History'!$B$3)","v":"CYCLE"},{"$f":"IF('Cycle History'!$B$133=\"\",\"\",'Cycle History'!$B$133)","v":44},{"$f":"IF('Cycle History'!$C$133=\"\",\"\",'Cycle History'!$C$133)","v":"In Freezing chamber"},{"$f":"IF('Cycle History'!$F$3=\"\",\"\",'Cycle History'!$F$3)","v":"TIME IN"}]
[489,{"$f":"IF('Cycle History'!$G$133=\"\",\"\",'Cycle History'!$G$133)","v":""},{"$f":"IF('Cycle History'!$B$1=\"\",\"\",'Cycle History'!$B$1)","v":"CYCLE HISTORY"},{"$f":"IF('Cycle History'!$B$3=\"\",\"\",'Cycle History'!$B$3)","v":"CYCLE"},{"$f":"IF('Cycle History'!$B$133=\"\",\"\",'Cycle History'!$B$133)","v":44},{"$f":"IF('Cycle History'!$C$133=\"\",\"\",'Cycle History'!$C$133)","v":"In Freezing chamber"},{"$f":"IF('Cycle History'!$G$3=\"\",\"\",'Cycle History'!$G$3)","v":"TIME OUT"}]
[490,{"$f":"IF('Cycle History'!$H$133=\"\",\"\",'Cycle History'!$H$133)","v":""},{"$f":"IF('Cycle History'!$B$1=\"\",\"\",'Cycle History'!$B$1)","v":"CYCLE HISTORY"},{"$f":"IF('Cycle History'!$B$3=\"\",\"\",'Cycle History'!$B$3)","v":"CYCLE"},{"$f":"IF('Cycle History'!$B$133=\"\",\"\",'Cycle History'!$B$133)","v":44},{"$f":"IF('Cycle History'!$C$133=\"\",\"\",'Cycle History'!$C$133)","v":"In Freezing chamber"},{"$f":"IF('Cycle History'!$H$3=\"\",\"\",'Cycle History'!$H$3)","v":"REMARKS"}]
[491,{"$f":"IF('Cycle History'!$E$134=\"\",\"\",'Cycle History'!$E$134)","v":""},{"$f":"IF('Cycle History'!$B$1=\"\",\"\",'Cycle History'!$B$1)","v":"CYCLE HISTORY"},{"$f":"IF('Cycle History'!$B$3=\"\",\"\",'Cycle History'!$B$3)","v":"CYCLE"},{"$f":"IF('Cycle History'!$B$133=\"\",\"\",'Cycle History'!$B$133)","v":44},{"$f":"IF('Cycle History'!$C$134=\"\",\"\",'Cycle History'!$C$134)","v":"Out Freezing chamber"},{"$f":"IF('Cycle History'!$E$3=\"\",\"\",'Cycle History'!$E$3)","v":"DATE"}]
[492,{"$f":"IF('Cycle History'!$F$134=\"\",\"\",'Cycle History'!$F$134)","v":""},{"$f":"IF('Cycle History'!$B$1=\"\",\"\",'Cycle History'!$B$1)","v":"CYCLE HISTORY"},{"$f":"IF('Cycle History'!$B$3=\"\",\"\",'Cycle History'!$B$3)","v":"CYCLE"},{"$f":"IF('Cycle History'!$B$133=\"\",\"\",'Cycle History'!$B$133)","v":44},{"$f":"IF('Cycle History'!$C$134=\"\",\"\",'Cycle History'!$C$134)","v":"Out Freezing chamber"},{"$f":"IF('Cycle History'!$F$3=\"\",\"\",'Cycle History'!$F$3)","v":"TIME IN"}]
[493,{"$f":"IF('Cycle History'!$G$134=\"\",\"\",'Cycle History'!$G$134)","v":""},{"$f":"IF('Cycle History'!$B$1=\"\",\"\",'Cycle History'!$B$1)","v":"CYCLE HISTORY"},{"$f":"IF('Cycle History'!$B$3=\"\",\"\",'Cycle History'!$B$3)","v":"CYCLE"},{"$f":"IF('Cycle History'!$B$133=\"\",\"\",'Cycle History'!$B$133)","v":44},{"$f":"IF('Cycle History'!$C$134=\"\",\"\",'Cycle History'!$C$134)","v":"Out Freezing chamber"},{"$f":"IF('Cycle History'!$G$3=\"\",\"\",'Cycle History'!$G$3)","v":"TIME OUT"}]
[494,{"$f":"IF('Cycle History'!$E$135=\"\",\"\",'Cycle History'!$E$135)","v":""},{"$f":"IF('Cycle History'!$B$1=\"\",\"\",'Cycle History'!$B$1)","v":"CYCLE HISTORY"},{"$f":"IF('Cycle History'!$B$3=\"\",\"\",'Cycle History'!$B$3)","v":"CYCLE"},{"$f":"IF('Cycle History'!$B$133=\"\",\"\",'Cycle History'!$B$133)","v":44},{"$f":"IF('Cycle History'!$C$135=\"\",\"\",'Cycle History'!$C$135)","v":"Thawed"},{"$f":"IF('Cycle History'!$E$3=\"\",\"\",'Cycle History'!$E$3)","v":"DATE"}]
[495,{"$f":"IF('Cycle History'!$F$135=\"\",\"\",'Cycle History'!$F$135)","v":""},{"$f":"IF('Cycle History'!$B$1=\"\",\"\",'Cycle History'!$B$1)","v":"CYCLE HISTORY"},{"$f":"IF('Cycle History'!$B$3=\"\",\"\",'Cycle History'!$B$3)","v":"CYCLE"},{"$f":"IF('Cycle History'!$B$133=\"\",\"\",'Cycle History'!$B$133)","v":44},{"$f":"IF('Cycle History'!$C$135=\"\",\"\",'Cycle History'!$C$135)","v":"Thawed"},{"$f":"IF('Cycle History'!$F$3=\"\",\"\",'Cycle History'!$F$3)","v":"TIME IN"}]
[496,{"$f":"IF('Cycle History'!$G$135=\"\",\"\",'Cycle History'!$G$135)","v":""},{"$f":"IF('Cycle History'!$B$1=\"\",\"\",'Cycle History'!$B$1)","v":"CYCLE HISTORY"},{"$f":"IF('Cycle History'!$B$3=\"\",\"\",'Cycle History'!$B$3)","v":"CYCLE"},{"$f":"IF('Cycle History'!$B$133=\"\",\"\",'Cycle History'!$B$133)","v":44},{"$f":"IF('Cycle History'!$C$135=\"\",\"\",'Cycle History'!$C$135)","v":"Thawed"},{"$f":"IF('Cycle History'!$G$3=\"\",\"\",'Cycle History'!$G$3)","v":"TIME OUT"}]
[497,{"$f":"IF('Cycle History'!$E$136=\"\",\"\",'Cycle History'!$E$136)","v":""},{"$f":"IF('Cycle History'!$B$1=\"\",\"\",'Cycle History'!$B$1)","v":"CYCLE HISTORY"},{"$f":"IF('Cycle History'!$B$3=\"\",\"\",'Cycle History'!$B$3)","v":"CYCLE"},{"$f":"IF('Cycle History'!$B$136=\"\",\"\",'Cycle History'!$B$136)","v":45},{"$f":"IF('Cycle History'!$C$136=\"\",\"\",'Cycle History'!$C$136)","v":"In Freezing chamber"},{"$f":"IF('Cycle History'!$E$3=\"\",\"\",'Cycle History'!$E$3)","v":"DATE"}]
[498,{"$f":"IF('Cycle History'!$F$136=\"\",\"\",'Cycle History'!$F$136)","v":""},{"$f":"IF('Cycle History'!$B$1=\"\",\"\",'Cycle History'!$B$1)","v":"CYCLE HISTORY"},{"$f":"IF('Cycle History'!$B$3=\"\",\"\",'Cycle History'!$B$3)","v":"CYCLE"},{"$f":"IF('Cycle History'!$B$136=\"\",\"\",'Cycle History'!$B$136)","v":45},{"$f":"IF('Cycle History'!$C$136=\"\",\"\",'Cycle History'!$C$136)","v":"In Freezing chamber"},{"$f":"IF('Cycle History'!$F$3=\"\",\"\",'Cycle History'!$F$3)","v":"TIME IN"}]
[499,{"$f":"IF('Cycle History'!$G$136=\"\",\"\",'Cycle History'!$G$136)","v":""},{"$f":"IF('Cycle History'!$B$1=\"\",\"\",'Cycle History'!$B$1)","v":"CYCLE HISTORY"},{"$f":"IF('Cycle History'!$B$3=\"\",\"\",'Cycle History'!$B$3)","v":"CYCLE"},{"$f":"IF('Cycle History'!$B$136=\"\",\"\",'Cycle History'!$B$136)","v":45},{"$f":"IF('Cycle History'!$C$136=\"\",\"\",'Cycle History'!$C$136)","v":"In Freezing chamber"},{"$f":"IF('Cycle History'!$G$3=\"\",\"\",'Cycle History'!$G$3)","v":"TIME OUT"}]
[500,{"$f":"IF('Cycle History'!$H$136=\"\",\"\",'Cycle History'!$H$136)","v":""},{"$f":"IF('Cycle History'!$B$1=\"\",\"\",'Cycle History'!$B$1)","v":"CYCLE HISTORY"},{"$f":"IF('Cycle History'!$B$3=\"\",\"\",'Cycle History'!$B$3)","v":"CYCLE"},{"$f":"IF('Cycle History'!$B$136=\"\",\"\",'Cycle History'!$B$136)","v":45},{"$f":"IF('Cycle History'!$C$136=\"\",\"\",'Cycle History'!$C$136)","v":"In Freezing chamber"},{"$f":"IF('Cycle History'!$H$3=\"\",\"\",'Cycle History'!$H$3)","v":"REMARKS"}]
[501,{"$f":"IF('Cycle History'!$E$137=\"\",\"\",'Cycle History'!$E$137)","v":""},{"$f":"IF('Cycle History'!$B$1=\"\",\"\",'Cycle History'!$B$1)","v":"CYCLE HISTORY"},{"$f":"IF('Cycle History'!$B$3=\"\",\"\",'Cycle History'!$B$3)","v":"CYCLE"},{"$f":"IF('Cycle History'!$B$136=\"\",\"\",'Cycle History'!$B$136)","v":45},{"$f":"IF('Cycle History'!$C$137=\"\",\"\",'Cycle History'!$C$137)","v":"Out Freezing chamber"},{"$f":"IF('Cycle History'!$E$3=\"\",\"\",'Cycle History'!$E$3)","v":"DATE"}]
[502,{"$f":"IF('Cycle History'!$F$137=\"\",\"\",'Cycle History'!$F$137)","v":""},{"$f":"IF('Cycle History'!$B$1=\"\",\"\",'Cycle History'!$B$1)","v":"CYCLE HISTORY"},{"$f":"IF('Cycle History'!$B$3=\"\",\"\",'Cycle History'!$B$3)","v":"CYCLE"},{"$f":"IF('Cycle History'!$B$136=\"\",\"\",'Cycle History'!$B$136)","v":45},{"$f":"IF('Cycle History'!$C$137=\"\",\"\",'Cycle History'!$C$137)","v":"Out Freezing chamber"},{"$f":"IF('Cycle History'!$F$3=\"\",\"\",'Cycle History'!$F$3)","v":"TIME IN"}]
[503,{"$f":"IF('Cycle History'!$G$137=\"\",\"\",'Cycle History'!$G$137)","v":""},{"$f":"IF('Cycle History'!$B$1=\"\",\"\",'Cycle History'!$B$1)","v":"CYCLE HISTORY"},{"$f":"IF('Cycle History'!$B$3=\"\",\"\",'Cycle History'!$B$3)","v":"CYCLE"},{"$f":"IF('Cycle History'!$B$136=\"\",\"\",'Cycle History'!$B$136)","v":45},{"$f":"IF('Cycle History'!$C$137=\"\",\"\",'Cycle History'!$C$137)","v":"Out Freezing chamber"},{"$f":"IF('Cycle History'!$G$3=\"\",\"\",'Cycle History'!$G$3)","v":"TIME OUT"}]
[504,{"$f":"IF('Cycle History'!$E$138=\"\",\"\",'Cycle History'!$E$138)","v":""},{"$f":"IF('Cycle History'!$B$1=\"\",\"\",'Cycle History'!$B$1)","v":"CYCLE HISTORY"},{"$f":"IF('Cycle History'!$B$3=\"\",\"\",'Cycle History'!$B$3)","v":"CYCLE"},{"$f":"IF('Cycle History'!$B$136=\"\",\"\",'Cycle History'!$B$136)","v":45},{"$f":"IF('Cycle History'!$C$138=\"\",\"\",'Cycle History'!$C$138)","v":"Thawed"},{"$f":"IF('Cycle History'!$E$3=\"\",\"\",'Cycle History'!$E$3)","v":"DATE"}]
[505,{"$f":"IF('Cycle History'!$F$138=\"\",\"\",'Cycle History'!$F$138)","v":""},{"$f":"IF('Cycle History'!$B$1=\"\",\"\",'Cycle History'!$B$1)","v":"CYCLE HISTORY"},{"$f":"IF('Cycle History'!$B$3=\"\",\"\",'Cycle History'!$B$3)","v":"CYCLE"},{"$f":"IF('Cycle History'!$B$136=\"\",\"\",'Cycle History'!$B$136)","v":45},{"$f":"IF('Cycle History'!$C$138=\"\",\"\",'Cycle History'!$C$138)","v":"Thawed"},{"$f":"IF('Cycle History'!$F$3=\"\",\"\",'Cycle History'!$F$3)","v":"TIME IN"}]
[506,{"$f":"IF('Cycle History'!$G$138=\"\",\"\",'Cycle History'!$G$138)","v":""},{"$f":"IF('Cycle History'!$B$1=\"\",\"\",'Cycle History'!$B$1)","v":"CYCLE HISTORY"},{"$f":"IF('Cycle History'!$B$3=\"\",\"\",'Cycle History'!$B$3)","v":"CYCLE"},{"$f":"IF('Cycle History'!$B$136=\"\",\"\",'Cycle History'!$B$136)","v":45},{"$f":"IF('Cycle History'!$C$138=\"\",\"\",'Cycle History'!$C$138)","v":"Thawed"},{"$f":"IF('Cycle History'!$G$3=\"\",\"\",'Cycle History'!$G$3)","v":"TIME OUT"}]
[507,{"$f":"IF('Cycle History'!$E$139=\"\",\"\",'Cycle History'!$E$139)","v":""},{"$f":"IF('Cycle History'!$B$1=\"\",\"\",'Cycle History'!$B$1)","v":"CYCLE HISTORY"},{"$f":"IF('Cycle History'!$B$3=\"\",\"\",'Cycle History'!$B$3)","v":"CYCLE"},{"$f":"IF('Cycle History'!$B$139=\"\",\"\",'Cycle History'!$B$139)","v":46},{"$f":"IF('Cycle History'!$C$139=\"\",\"\",'Cycle History'!$C$139)","v":"In Freezing chamber"},{"$f":"IF('Cycle History'!$E$3=\"\",\"\",'Cycle History'!$E$3)","v":"DATE"}]
[508,{"$f":"IF('Cycle History'!$F$139=\"\",\"\",'Cycle History'!$F$139)","v":""},{"$f":"IF('Cycle History'!$B$1=\"\",\"\",'Cycle History'!$B$1)","v":"CYCLE HISTORY"},{"$f":"IF('Cycle History'!$B$3=\"\",\"\",'Cycle History'!$B$3)","v":"CYCLE"},{"$f":"IF('Cycle History'!$B$139=\"\",\"\",'Cycle History'!$B$139)","v":46},{"$f":"IF('Cycle History'!$C$139=\"\",\"\",'Cycle History'!$C$139)","v":"In Freezing chamber"},{"$f":"IF('Cycle History'!$F$3=\"\",\"\",'Cycle History'!$F$3)","v":"TIME IN"}]
[509,{"$f":"IF('Cycle History'!$G$139=\"\",\"\",'Cycle History'!$G$139)","v":""},{"$f":"IF('Cycle History'!$B$1=\"\",\"\",'Cycle History'!$B$1)","v":"CYCLE HISTORY"},{"$f":"IF('Cycle History'!$B$3=\"\",\"\",'Cycle History'!$B$3)","v":"CYCLE"},{"$f":"IF('Cycle History'!$B$139=\"\",\"\",'Cycle History'!$B$139)","v":46},{"$f":"IF('Cycle History'!$C$139=\"\",\"\",'Cycle History'!$C$139)","v":"In Freezing chamber"},{"$f":"IF('Cycle History'!$G$3=\"\",\"\",'Cycle History'!$G$3)","v":"TIME OUT"}]
[510,{"$f":"IF('Cycle History'!$H$139=\"\",\"\",'Cycle History'!$H$139)","v":""},{"$f":"IF('Cycle History'!$B$1=\"\",\"\",'Cycle History'!$B$1)","v":"CYCLE HISTORY"},{"$f":"IF('Cycle History'!$B$3=\"\",\"\",'Cycle History'!$B$3)","v":"CYCLE"},{"$f":"IF('Cycle History'!$B$139=\"\",\"\",'Cycle History'!$B$139)","v":46},{"$f":"IF('Cycle History'!$C$139=\"\",\"\",'Cycle History'!$C$139)","v":"In Freezing chamber"},{"$f":"IF('Cycle History'!$H$3=\"\",\"\",'Cycle History'!$H$3)","v":"REMARKS"}]
[511,{"$f":"IF('Cycle History'!$E$140=\"\",\"\",'Cycle History'!$E$140)","v":""},{"$f":"IF('Cycle History'!$B$1=\"\",\"\",'Cycle History'!$B$1)","v":"CYCLE HISTORY"},{"$f":"IF('Cycle History'!$B$3=\"\",\"\",'Cycle History'!$B$3)","v":"CYCLE"},{"$f":"IF('Cycle History'!$B$139=\"\",\"\",'Cycle History'!$B$139)","v":46},{"$f":"IF('Cycle History'!$C$140=\"\",\"\",'Cycle History'!$C$140)","v":"Out Freezing chamber"},{"$f":"IF('Cycle History'!$E$3=\"\",\"\",'Cycle History'!$E$3)","v":"DATE"}]
[512,{"$f":"IF('Cycle History'!$F$140=\"\",\"\",'Cycle History'!$F$140)","v":""},{"$f":"IF('Cycle History'!$B$1=\"\",\"\",'Cycle History'!$B$1)","v":"CYCLE HISTORY"},{"$f":"IF('Cycle History'!$B$3=\"\",\"\",'Cycle History'!$B$3)","v":"CYCLE"},{"$f":"IF('Cycle History'!$B$139=\"\",\"\",'Cycle History'!$B$139)","v":46},{"$f":"IF('Cycle History'!$C$140=\"\",\"\",'Cycle History'!$C$140)","v":"Out Freezing chamber"},{"$f":"IF('Cycle History'!$F$3=\"\",\"\",'Cycle History'!$F$3)","v":"TIME IN"}]
[513,{"$f":"IF('Cycle History'!$G$140=\"\",\"\",'Cycle History'!$G$140)","v":""},{"$f":"IF('Cycle History'!$B$1=\"\",\"\",'Cycle History'!$B$1)","v":"CYCLE HISTORY"},{"$f":"IF('Cycle History'!$B$3=\"\",\"\",'Cycle History'!$B$3)","v":"CYCLE"},{"$f":"IF('Cycle History'!$B$139=\"\",\"\",'Cycle History'!$B$139)","v":46},{"$f":"IF('Cycle History'!$C$140=\"\",\"\",'Cycle History'!$C$140)","v":"Out Freezing chamber"},{"$f":"IF('Cycle History'!$G$3=\"\",\"\",'Cycle History'!$G$3)","v":"TIME OUT"}]
[514,{"$f":"IF('Cycle History'!$E$141=\"\",\"\",'Cycle History'!$E$141)","v":""},{"$f":"IF('Cycle History'!$B$1=\"\",\"\",'Cycle History'!$B$1)","v":"CYCLE HISTORY"},{"$f":"IF('Cycle History'!$B$3=\"\",\"\",'Cycle History'!$B$3)","v":"CYCLE"},{"$f":"IF('Cycle History'!$B$139=\"\",\"\",'Cycle History'!$B$139)","v":46},{"$f":"IF('Cycle History'!$C$141=\"\",\"\",'Cycle History'!$C$141)","v":"Thawed"},{"$f":"IF('Cycle History'!$E$3=\"\",\"\",'Cycle History'!$E$3)","v":"DATE"}]
[515,{"$f":"IF('Cycle History'!$F$141=\"\",\"\",'Cycle History'!$F$141)","v":""},{"$f":"IF('Cycle History'!$B$1=\"\",\"\",'Cycle History'!$B$1)","v":"CYCLE HISTORY"},{"$f":"IF('Cycle History'!$B$3=\"\",\"\",'Cycle History'!$B$3)","v":"CYCLE"},{"$f":"IF('Cycle History'!$B$139=\"\",\"\",'Cycle History'!$B$139)","v":46},{"$f":"IF('Cycle History'!$C$141=\"\",\"\",'Cycle History'!$C$141)","v":"Thawed"},{"$f":"IF('Cycle History'!$F$3=\"\",\"\",'Cycle History'!$F$3)","v":"TIME IN"}]
[516,{"$f":"IF('Cycle History'!$G$141=\"\",\"\",'Cycle History'!$G$141)","v":""},{"$f":"IF('Cycle History'!$B$1=\"\",\"\",'Cycle History'!$B$1)","v":"CYCLE HISTORY"},{"$f":"IF('Cycle History'!$B$3=\"\",\"\",'Cycle History'!$B$3)","v":"CYCLE"},{"$f":"IF('Cycle History'!$B$139=\"\",\"\",'Cycle History'!$B$139)","v":46},{"$f":"IF('Cycle History'!$C$141=\"\",\"\",'Cycle History'!$C$141)","v":"Thawed"},{"$f":"IF('Cycle History'!$G$3=\"\",\"\",'Cycle History'!$G$3)","v":"TIME OUT"}]
[517,{"$f":"IF('Cycle History'!$E$142=\"\",\"\",'Cycle History'!$E$142)","v":""},{"$f":"IF('Cycle History'!$B$1=\"\",\"\",'Cycle History'!$B$1)","v":"CYCLE HISTORY"},{"$f":"IF('Cycle History'!$B$3=\"\",\"\",'Cycle History'!$B$3)","v":"CYCLE"},{"$f":"IF('Cycle History'!$B$142=\"\",\"\",'Cycle History'!$B$142)","v":47},{"$f":"IF('Cycle History'!$C$142=\"\",\"\",'Cycle History'!$C$142)","v":"In Freezing chamber"},{"$f":"IF('Cycle History'!$E$3=\"\",\"\",'Cycle History'!$E$3)","v":"DATE"}]
[518,{"$f":"IF('Cycle History'!$F$142=\"\",\"\",'Cycle History'!$F$142)","v":""},{"$f":"IF('Cycle History'!$B$1=\"\",\"\",'Cycle History'!$B$1)","v":"CYCLE HISTORY"},{"$f":"IF('Cycle History'!$B$3=\"\",\"\",'Cycle History'!$B$3)","v":"CYCLE"},{"$f":"IF('Cycle History'!$B$142=\"\",\"\",'Cycle History'!$B$142)","v":47},{"$f":"IF('Cycle History'!$C$142=\"\",\"\",'Cycle History'!$C$142)","v":"In Freezing chamber"},{"$f":"IF('Cycle History'!$F$3=\"\",\"\",'Cycle History'!$F$3)","v":"TIME IN"}]
[519,{"$f":"IF('Cycle History'!$G$142=\"\",\"\",'Cycle History'!$G$142)","v":""},{"$f":"IF('Cycle History'!$B$1=\"\",\"\",'Cycle History'!$B$1)","v":"CYCLE HISTORY"},{"$f":"IF('Cycle History'!$B$3=\"\",\"\",'Cycle History'!$B$3)","v":"CYCLE"},{"$f":"IF('Cycle History'!$B$142=\"\",\"\",'Cycle History'!$B$142)","v":47},{"$f":"IF('Cycle History'!$C$142=\"\",\"\",'Cycle History'!$C$142)","v":"In Freezing chamber"},{"$f":"IF('Cycle History'!$G$3=\"\",\"\",'Cycle History'!$G$3)","v":"TIME OUT"}]
[520,{"$f":"IF('Cycle History'!$H$142=\"\",\"\",'Cycle History'!$H$142)","v":""},{"$f":"IF('Cycle History'!$B$1=\"\",\"\",'Cycle History'!$B$1)","v":"CYCLE HISTORY"},{"$f":"IF('Cycle History'!$B$3=\"\",\"\",'Cycle History'!$B$3)","v":"CYCLE"},{"$f":"IF('Cycle History'!$B$142=\"\",\"\",'Cycle History'!$B$142)","v":47},{"$f":"IF('Cycle History'!$C$142=\"\",\"\",'Cycle History'!$C$142)","v":"In Freezing chamber"},{"$f":"IF('Cycle History'!$H$3=\"\",\"\",'Cycle History'!$H$3)","v":"REMARKS"}]
[521,{"$f":"IF('Cycle History'!$E$143=\"\",\"\",'Cycle History'!$E$143)","v":""},{"$f":"IF('Cycle History'!$B$1=\"\",\"\",'Cycle History'!$B$1)","v":"CYCLE HISTORY"},{"$f":"IF('Cycle History'!$B$3=\"\",\"\",'Cycle History'!$B$3)","v":"CYCLE"},{"$f":"IF('Cycle History'!$B$142=\"\",\"\",'Cycle History'!$B$142)","v":47},{"$f":"IF('Cycle History'!$C$143=\"\",\"\",'Cycle History'!$C$143)","v":"Out Freezing chamber"},{"$f":"IF('Cycle History'!$E$3=\"\",\"\",'Cycle History'!$E$3)","v":"DATE"}]
[522,{"$f":"IF('Cycle History'!$F$143=\"\",\"\",'Cycle History'!$F$143)","v":""},{"$f":"IF('Cycle History'!$B$1=\"\",\"\",'Cycle History'!$B$1)","v":"CYCLE HISTORY"},{"$f":"IF('Cycle History'!$B$3=\"\",\"\",'Cycle History'!$B$3)","v":"CYCLE"},{"$f":"IF('Cycle History'!$B$142=\"\",\"\",'Cycle History'!$B$142)","v":47},{"$f":"IF('Cycle History'!$C$143=\"\",\"\",'Cycle History'!$C$143)","v":"Out Freezing chamber"},{"$f":"IF('Cycle History'!$F$3=\"\",\"\",'Cycle History'!$F$3)","v":"TIME IN"}]
[523,{"$f":"IF('Cycle History'!$G$143=\"\",\"\",'Cycle History'!$G$143)","v":""},{"$f":"IF('Cycle History'!$B$1=\"\",\"\",'Cycle History'!$B$1)","v":"CYCLE HISTORY"},{"$f":"IF('Cycle History'!$B$3=\"\",\"\",'Cycle History'!$B$3)","v":"CYCLE"},{"$f":"IF('Cycle History'!$B$142=\"\",\"\",'Cycle History'!$B$142)","v":47},{"$f":"IF('Cycle History'!$C$143=\"\",\"\",'Cycle History'!$C$143)","v":"Out Freezing chamber"},{"$f":"IF('Cycle History'!$G$3=\"\",\"\",'Cycle History'!$G$3)","v":"TIME OUT"}]
[524,{"$f":"IF('Cycle History'!$E$144=\"\",\"\",'Cycle History'!$E$144)","v":""},{"$f":"IF('Cycle History'!$B$1=\"\",\"\",'Cycle History'!$B$1)","v":"CYCLE HISTORY"},{"$f":"IF('Cycle History'!$B$3=\"\",\"\",'Cycle History'!$B$3)","v":"CYCLE"},{"$f":"IF('Cycle History'!$B$142=\"\",\"\",'Cycle History'!$B$142)","v":47},{"$f":"IF('Cycle History'!$C$144=\"\",\"\",'Cycle History'!$C$144)","v":"Thawed"},{"$f":"IF('Cycle History'!$E$3=\"\",\"\",'Cycle History'!$E$3)","v":"DATE"}]
[525,{"$f":"IF('Cycle History'!$F$144=\"\",\"\",'Cycle History'!$F$144)","v":""},{"$f":"IF('Cycle History'!$B$1=\"\",\"\",'Cycle History'!$B$1)","v":"CYCLE HISTORY"},{"$f":"IF('Cycle History'!$B$3=\"\",\"\",'Cycle History'!$B$3)","v":"CYCLE"},{"$f":"IF('Cycle History'!$B$142=\"\",\"\",'Cycle History'!$B$142)","v":47},{"$f":"IF('Cycle History'!$C$144=\"\",\"\",'Cycle History'!$C$144)","v":"Thawed"},{"$f":"IF('Cycle History'!$F$3=\"\",\"\",'Cycle History'!$F$3)","v":"TIME IN"}]
[526,{"$f":"IF('Cycle History'!$G$144=\"\",\"\",'Cycle History'!$G$144)","v":""},{"$f":"IF('Cycle History'!$B$1=\"\",\"\",'Cycle History'!$B$1)","v":"CYCLE HISTORY"},{"$f":"IF('Cycle History'!$B$3=\"\",\"\",'Cycle History'!$B$3)","v":"CYCLE"},{"$f":"IF('Cycle History'!$B$142=\"\",\"\",'Cycle History'!$B$142)","v":47},{"$f":"IF('Cycle History'!$C$144=\"\",\"\",'Cycle History'!$C$144)","v":"Thawed"},{"$f":"IF('Cycle History'!$G$3=\"\",\"\",'Cycle History'!$G$3)","v":"TIME OUT"}]
[527,{"$f":"IF('Cycle History'!$E$145=\"\",\"\",'Cycle History'!$E$145)","v":""},{"$f":"IF('Cycle History'!$B$1=\"\",\"\",'Cycle History'!$B$1)","v":"CYCLE HISTORY"},{"$f":"IF('Cycle History'!$B$3=\"\",\"\",'Cycle History'!$B$3)","v":"CYCLE"},{"$f":"IF('Cycle History'!$B$145=\"\",\"\",'Cycle History'!$B$145)","v":48},{"$f":"IF('Cycle History'!$C$145=\"\",\"\",'Cycle History'!$C$145)","v":"In Freezing chamber"},{"$f":"IF('Cycle History'!$E$3=\"\",\"\",'Cycle History'!$E$3)","v":"DATE"}]
[528,{"$f":"IF('Cycle History'!$F$145=\"\",\"\",'Cycle History'!$F$145)","v":""},{"$f":"IF('Cycle History'!$B$1=\"\",\"\",'Cycle History'!$B$1)","v":"CYCLE HISTORY"},{"$f":"IF('Cycle History'!$B$3=\"\",\"\",'Cycle History'!$B$3)","v":"CYCLE"},{"$f":"IF('Cycle History'!$B$145=\"\",\"\",'Cycle History'!$B$145)","v":48},{"$f":"IF('Cycle History'!$C$145=\"\",\"\",'Cycle History'!$C$145)","v":"In Freezing chamber"},{"$f":"IF('Cycle History'!$F$3=\"\",\"\",'Cycle History'!$F$3)","v":"TIME IN"}]
[529,{"$f":"IF('Cycle History'!$G$145=\"\",\"\",'Cycle History'!$G$145)","v":""},{"$f":"IF('Cycle History'!$B$1=\"\",\"\",'Cycle History'!$B$1)","v":"CYCLE HISTORY"},{"$f":"IF('Cycle History'!$B$3=\"\",\"\",'Cycle History'!$B$3)","v":"CYCLE"},{"$f":"IF('Cycle History'!$B$145=\"\",\"\",'Cycle History'!$B$145)","v":48},{"$f":"IF('Cycle History'!$C$145=\"\",\"\",'Cycle History'!$C$145)","v":"In Freezing chamber"},{"$f":"IF('Cycle History'!$G$3=\"\",\"\",'Cycle History'!$G$3)","v":"TIME OUT"}]
[530,{"$f":"IF('Cycle History'!$H$145=\"\",\"\",'Cycle History'!$H$145)","v":""},{"$f":"IF('Cycle History'!$B$1=\"\",\"\",'Cycle History'!$B$1)","v":"CYCLE HISTORY"},{"$f":"IF('Cycle History'!$B$3=\"\",\"\",'Cycle History'!$B$3)","v":"CYCLE"},{"$f":"IF('Cycle History'!$B$145=\"\",\"\",'Cycle History'!$B$145)","v":48},{"$f":"IF('Cycle History'!$C$145=\"\",\"\",'Cycle History'!$C$145)","v":"In Freezing chamber"},{"$f":"IF('Cycle History'!$H$3=\"\",\"\",'Cycle History'!$H$3)","v":"REMARKS"}]
[531,{"$f":"IF('Cycle History'!$E$146=\"\",\"\",'Cycle History'!$E$146)","v":""},{"$f":"IF('Cycle History'!$B$1=\"\",\"\",'Cycle History'!$B$1)","v":"CYCLE HISTORY"},{"$f":"IF('Cycle History'!$B$3=\"\",\"\",'Cycle History'!$B$3)","v":"CYCLE"},{"$f":"IF('Cycle History'!$B$145=\"\",\"\",'Cycle History'!$B$145)","v":48},{"$f":"IF('Cycle History'!$C$146=\"\",\"\",'Cycle History'!$C$146)","v":"Out Freezing chamber"},{"$f":"IF('Cycle History'!$E$3=\"\",\"\",'Cycle History'!$E$3)","v":"DATE"}]
[532,{"$f":"IF('Cycle History'!$F$146=\"\",\"\",'Cycle History'!$F$146)","v":""},{"$f":"IF('Cycle History'!$B$1=\"\",\"\",'Cycle History'!$B$1)","v":"CYCLE HISTORY"},{"$f":"IF('Cycle History'!$B$3=\"\",\"\",'Cycle History'!$B$3)","v":"CYCLE"},{"$f":"IF('Cycle History'!$B$145=\"\",\"\",'Cycle History'!$B$145)","v":48},{"$f":"IF('Cycle History'!$C$146=\"\",\"\",'Cycle History'!$C$146)","v":"Out Freezing chamber"},{"$f":"IF('Cycle History'!$F$3=\"\",\"\",'Cycle History'!$F$3)","v":"TIME IN"}]
[533,{"$f":"IF('Cycle History'!$G$146=\"\",\"\",'Cycle History'!$G$146)","v":""},{"$f":"IF('Cycle History'!$B$1=\"\",\"\",'Cycle History'!$B$1)","v":"CYCLE HISTORY"},{"$f":"IF('Cycle History'!$B$3=\"\",\"\",'Cycle History'!$B$3)","v":"CYCLE"},{"$f":"IF('Cycle History'!$B$145=\"\",\"\",'Cycle History'!$B$145)","v":48},{"$f":"IF('Cycle History'!$C$146=\"\",\"\",'Cycle History'!$C$146)","v":"Out Freezing chamber"},{"$f":"IF('Cycle History'!$G$3=\"\",\"\",'Cycle History'!$G$3)","v":"TIME OUT"}]
[534,{"$f":"IF('Cycle History'!$E$147=\"\",\"\",'Cycle History'!$E$147)","v":""},{"$f":"IF('Cycle History'!$B$1=\"\",\"\",'Cycle History'!$B$1)","v":"CYCLE HISTORY"},{"$f":"IF('Cycle History'!$B$3=\"\",\"\",'Cycle History'!$B$3)","v":"CYCLE"},{"$f":"IF('Cycle History'!$B$145=\"\",\"\",'Cycle History'!$B$145)","v":48},{"$f":"IF('Cycle History'!$C$147=\"\",\"\",'Cycle History'!$C$147)","v":"Thawed"},{"$f":"IF('Cycle History'!$E$3=\"\",\"\",'Cycle History'!$E$3)","v":"DATE"}]
[535,{"$f":"IF('Cycle History'!$F$147=\"\",\"\",'Cycle History'!$F$147)","v":""},{"$f":"IF('Cycle History'!$B$1=\"\",\"\",'Cycle History'!$B$1)","v":"CYCLE HISTORY"},{"$f":"IF('Cycle History'!$B$3=\"\",\"\",'Cycle History'!$B$3)","v":"CYCLE"},{"$f":"IF('Cycle History'!$B$145=\"\",\"\",'Cycle History'!$B$145)","v":48},{"$f":"IF('Cycle History'!$C$147=\"\",\"\",'Cycle History'!$C$147)","v":"Thawed"},{"$f":"IF('Cycle History'!$F$3=\"\",\"\",'Cycle History'!$F$3)","v":"TIME IN"}]
[536,{"$f":"IF('Cycle History'!$G$147=\"\",\"\",'Cycle History'!$G$147)","v":""},{"$f":"IF('Cycle History'!$B$1=\"\",\"\",'Cycle History'!$B$1)","v":"CYCLE HISTORY"},{"$f":"IF('Cycle History'!$B$3=\"\",\"\",'Cycle History'!$B$3)","v":"CYCLE"},{"$f":"IF('Cycle History'!$B$145=\"\",\"\",'Cycle History'!$B$145)","v":48},{"$f":"IF('Cycle History'!$C$147=\"\",\"\",'Cycle History'!$C$147)","v":"Thawed"},{"$f":"IF('Cycle History'!$G$3=\"\",\"\",'Cycle History'!$G$3)","v":"TIME OUT"}]
[537,{"$f":"IF('Cycle History'!$E$148=\"\",\"\",'Cycle History'!$E$148)","v":""},{"$f":"IF('Cycle History'!$B$1=\"\",\"\",'Cycle History'!$B$1)","v":"CYCLE HISTORY"},{"$f":"IF('Cycle History'!$B$3=\"\",\"\",'Cycle History'!$B$3)","v":"CYCLE"},{"$f":"IF('Cycle History'!$B$148=\"\",\"\",'Cycle History'!$B$148)","v":49},{"$f":"IF('Cycle History'!$C$148=\"\",\"\",'Cycle History'!$C$148)","v":"In Freezing chamber"},{"$f":"IF('Cycle History'!$E$3=\"\",\"\",'Cycle History'!$E$3)","v":"DATE"}]
[538,{"$f":"IF('Cycle History'!$F$148=\"\",\"\",'Cycle History'!$F$148)","v":""},{"$f":"IF('Cycle History'!$B$1=\"\",\"\",'Cycle History'!$B$1)","v":"CYCLE HISTORY"},{"$f":"IF('Cycle History'!$B$3=\"\",\"\",'Cycle History'!$B$3)","v":"CYCLE"},{"$f":"IF('Cycle History'!$B$148=\"\",\"\",'Cycle History'!$B$148)","v":49},{"$f":"IF('Cycle History'!$C$148=\"\",\"\",'Cycle History'!$C$148)","v":"In Freezing chamber"},{"$f":"IF('Cycle History'!$F$3=\"\",\"\",'Cycle History'!$F$3)","v":"TIME IN"}]
[539,{"$f":"IF('Cycle History'!$G$148=\"\",\"\",'Cycle History'!$G$148)","v":""},{"$f":"IF('Cycle History'!$B$1=\"\",\"\",'Cycle History'!$B$1)","v":"CYCLE HISTORY"},{"$f":"IF('Cycle History'!$B$3=\"\",\"\",'Cycle History'!$B$3)","v":"CYCLE"},{"$f":"IF('Cycle History'!$B$148=\"\",\"\",'Cycle History'!$B$148)","v":49},{"$f":"IF('Cycle History'!$C$148=\"\",\"\",'Cycle History'!$C$148)","v":"In Freezing chamber"},{"$f":"IF('Cycle History'!$G$3=\"\",\"\",'Cycle History'!$G$3)","v":"TIME OUT"}]
[540,{"$f":"IF('Cycle History'!$H$148=\"\",\"\",'Cycle History'!$H$148)","v":""},{"$f":"IF('Cycle History'!$B$1=\"\",\"\",'Cycle History'!$B$1)","v":"CYCLE HISTORY"},{"$f":"IF('Cycle History'!$B$3=\"\",\"\",'Cycle History'!$B$3)","v":"CYCLE"},{"$f":"IF('Cycle History'!$B$148=\"\",\"\",'Cycle History'!$B$148)","v":49},{"$f":"IF('Cycle History'!$C$148=\"\",\"\",'Cycle History'!$C$148)","v":"In Freezing chamber"},{"$f":"IF('Cycle History'!$H$3=\"\",\"\",'Cycle History'!$H$3)","v":"REMARKS"}]
[541,{"$f":"IF('Cycle History'!$E$149=\"\",\"\",'Cycle History'!$E$149)","v":""},{"$f":"IF('Cycle History'!$B$1=\"\",\"\",'Cycle History'!$B$1)","v":"CYCLE HISTORY"},{"$f":"IF('Cycle History'!$B$3=\"\",\"\",'Cycle History'!$B$3)","v":"CYCLE"},{"$f":"IF('Cycle History'!$B$148=\"\",\"\",'Cycle History'!$B$148)","v":49},{"$f":"IF('Cycle History'!$C$149=\"\",\"\",'Cycle History'!$C$149)","v":"Out Freezing chamber"},{"$f":"IF('Cycle History'!$E$3=\"\",\"\",'Cycle History'!$E$3)","v":"DATE"}]
[542,{"$f":"IF('Cycle History'!$F$149=\"\",\"\",'Cycle History'!$F$149)","v":""},{"$f":"IF('Cycle History'!$B$1=\"\",\"\",'Cycle History'!$B$1)","v":"CYCLE HISTORY"},{"$f":"IF('Cycle History'!$B$3=\"\",\"\",'Cycle History'!$B$3)","v":"CYCLE"},{"$f":"IF('Cycle History'!$B$148=\"\",\"\",'Cycle History'!$B$148)","v":49},{"$f":"IF('Cycle History'!$C$149=\"\",\"\",'Cycle History'!$C$149)","v":"Out Freezing chamber"},{"$f":"IF('Cycle History'!$F$3=\"\",\"\",'Cycle History'!$F$3)","v":"TIME IN"}]
[543,{"$f":"IF('Cycle History'!$G$149=\"\",\"\",'Cycle History'!$G$149)","v":""},{"$f":"IF('Cycle History'!$B$1=\"\",\"\",'Cycle History'!$B$1)","v":"CYCLE HISTORY"},{"$f":"IF('Cycle History'!$B$3=\"\",\"\",'Cycle History'!$B$3)","v":"CYCLE"},{"$f":"IF('Cycle History'!$B$148=\"\",\"\",'Cycle History'!$B$148)","v":49},{"$f":"IF('Cycle History'!$C$149=\"\",\"\",'Cycle History'!$C$149)","v":"Out Freezing chamber"},{"$f":"IF('Cycle History'!$G$3=\"\",\"\",'Cycle History'!$G$3)","v":"TIME OUT"}]
[544,{"$f":"IF('Cycle History'!$E$150=\"\",\"\",'Cycle History'!$E$150)","v":""},{"$f":"IF('Cycle History'!$B$1=\"\",\"\",'Cycle History'!$B$1)","v":"CYCLE HISTORY"},{"$f":"IF('Cycle History'!$B$3=\"\",\"\",'Cycle History'!$B$3)","v":"CYCLE"},{"$f":"IF('Cycle History'!$B$148=\"\",\"\",'Cycle History'!$B$148)","v":49},{"$f":"IF('Cycle History'!$C$150=\"\",\"\",'Cycle History'!$C$150)","v":"Thawed"},{"$f":"IF('Cycle History'!$E$3=\"\",\"\",'Cycle History'!$E$3)","v":"DATE"}]
[545,{"$f":"IF('Cycle History'!$F$150=\"\",\"\",'Cycle History'!$F$150)","v":""},{"$f":"IF('Cycle History'!$B$1=\"\",\"\",'Cycle History'!$B$1)","v":"CYCLE HISTORY"},{"$f":"IF('Cycle History'!$B$3=\"\",\"\",'Cycle History'!$B$3)","v":"CYCLE"},{"$f":"IF('Cycle History'!$B$148=\"\",\"\",'Cycle History'!$B$148)","v":49},{"$f":"IF('Cycle History'!$C$150=\"\",\"\",'Cycle History'!$C$150)","v":"Thawed"},{"$f":"IF('Cycle History'!$F$3=\"\",\"\",'Cycle History'!$F$3)","v":"TIME IN"}]
[546,{"$f":"IF('Cycle History'!$G$150=\"\",\"\",'Cycle History'!$G$150)","v":""},{"$f":"IF('Cycle History'!$B$1=\"\",\"\",'Cycle History'!$B$1)","v":"CYCLE HISTORY"},{"$f":"IF('Cycle History'!$B$3=\"\",\"\",'Cycle History'!$B$3)","v":"CYCLE"},{"$f":"IF('Cycle History'!$B$148=\"\",\"\",'Cycle History'!$B$148)","v":49},{"$f":"IF('Cycle History'!$C$150=\"\",\"\",'Cycle History'!$C$150)","v":"Thawed"},{"$f":"IF('Cycle History'!$G$3=\"\",\"\",'Cycle History'!$G$3)","v":"TIME OUT"}]
[547,{"$f":"IF('Cycle History'!$E$151=\"\",\"\",'Cycle History'!$E$151)","v":""},{"$f":"IF('Cycle History'!$B$1=\"\",\"\",'Cycle History'!$B$1)","v":"CYCLE HISTORY"},{"$f":"IF('Cycle History'!$B$3=\"\",\"\",'Cycle History'!$B$3)","v":"CYCLE"},{"$f":"IF('Cycle History'!$B$151=\"\",\"\",'Cycle History'!$B$151)","v":50},{"$f":"IF('Cycle History'!$C$151=\"\",\"\",'Cycle History'!$C$151)","v":"In Freezing chamber"},{"$f":"IF('Cycle History'!$E$3=\"\",\"\",'Cycle History'!$E$3)","v":"DATE"}]
[548,{"$f":"IF('Cycle History'!$F$151=\"\",\"\",'Cycle History'!$F$151)","v":""},{"$f":"IF('Cycle History'!$B$1=\"\",\"\",'Cycle History'!$B$1)","v":"CYCLE HISTORY"},{"$f":"IF('Cycle History'!$B$3=\"\",\"\",'Cycle History'!$B$3)","v":"CYCLE"},{"$f":"IF('Cycle History'!$B$151=\"\",\"\",'Cycle History'!$B$151)","v":50},{"$f":"IF('Cycle History'!$C$151=\"\",\"\",'Cycle History'!$C$151)","v":"In Freezing chamber"},{"$f":"IF('Cycle History'!$F$3=\"\",\"\",'Cycle History'!$F$3)","v":"TIME IN"}]
[549,{"$f":"IF('Cycle History'!$G$151=\"\",\"\",'Cycle History'!$G$151)","v":""},{"$f":"IF('Cycle History'!$B$1=\"\",\"\",'Cycle History'!$B$1)","v":"CYCLE HISTORY"},{"$f":"IF('Cycle History'!$B$3=\"\",\"\",'Cycle History'!$B$3)","v":"CYCLE"},{"$f":"IF('Cycle History'!$B$151=\"\",\"\",'Cycle History'!$B$151)","v":50},{"$f":"IF('Cycle History'!$C$151=\"\",\"\",'Cycle History'!$C$151)","v":"In Freezing chamber"},{"$f":"IF('Cycle History'!$G$3=\"\",\"\",'Cycle History'!$G$3)","v":"TIME OUT"}]
[550,{"$f":"IF('Cycle History'!$H$151=\"\",\"\",'Cycle History'!$H$151)","v":""},{"$f":"IF('Cycle History'!$B$1=\"\",\"\",'Cycle History'!$B$1)","v":"CYCLE HISTORY"},{"$f":"IF('Cycle History'!$B$3=\"\",\"\",'Cycle History'!$B$3)","v":"CYCLE"},{"$f":"IF('Cycle History'!$B$151=\"\",\"\",'Cycle History'!$B$151)","v":50},{"$f":"IF('Cycle History'!$C$151=\"\",\"\",'Cycle History'!$C$151)","v":"In Freezing chamber"},{"$f":"IF('Cycle History'!$H$3=\"\",\"\",'Cycle History'!$H$3)","v":"REMARKS"}]
[551,{"$f":"IF('Cycle History'!$E$152=\"\",\"\",'Cycle History'!$E$152)","v":""},{"$f":"IF('Cycle History'!$B$1=\"\",\"\",'Cycle History'!$B$1)","v":"CYCLE HISTORY"},{"$f":"IF('Cycle History'!$B$3=\"\",\"\",'Cycle History'!$B$3)","v":"CYCLE"},{"$f":"IF('Cycle History'!$B$151=\"\",\"\",'Cycle History'!$B$151)","v":50},{"$f":"IF('Cycle History'!$C$152=\"\",\"\",'Cycle History'!$C$152)","v":"Out Freezing chamber"},{"$f":"IF('Cycle History'!$E$3=\"\",\"\",'Cycle History'!$E$3)","v":"DATE"}]
[552,{"$f":"IF('Cycle History'!$F$152=\"\",\"\",'Cycle History'!$F$152)","v":""},{"$f":"IF('Cycle History'!$B$1=\"\",\"\",'Cycle History'!$B$1)","v":"CYCLE HISTORY"},{"$f":"IF('Cycle History'!$B$3=\"\",\"\",'Cycle History'!$B$3)","v":"CYCLE"},{"$f":"IF('Cycle History'!$B$151=\"\",\"\",'Cycle History'!$B$151)","v":50},{"$f":"IF('Cycle History'!$C$152=\"\",\"\",'Cycle History'!$C$152)","v":"Out Freezing chamber"},{"$f":"IF('Cycle History'!$F$3=\"\",\"\",'Cycle History'!$F$3)","v":"TIME IN"}]
[553,{"$f":"IF('Cycle History'!$G$152=\"\",\"\",'Cycle History'!$G$152)","v":""},{"$f":"IF('Cycle History'!$B$1=\"\",\"\",'Cycle History'!$B$1)","v":"CYCLE HISTORY"},{"$f":"IF('Cycle History'!$B$3=\"\",\"\",'Cycle History'!$B$3)","v":"CYCLE"},{"$f":"IF('Cycle History'!$B$151=\"\",\"\",'Cycle History'!$B$151)","v":50},{"$f":"IF('Cycle History'!$C$152=\"\",\"\",'Cycle History'!$C$152)","v":"Out Freezing chamber"},{"$f":"IF('Cycle History'!$G$3=\"\",\"\",'Cycle History'!$G$3)","v":"TIME OUT"}]
[554,{"$f":"IF('Cycle History'!$E$153=\"\",\"\",'Cycle History'!$E$153)","v":""},{"$f":"IF('Cycle History'!$B$1=\"\",\"\",'Cycle History'!$B$1)","v":"CYCLE HISTORY"},{"$f":"IF('Cycle History'!$B$3=\"\",\"\",'Cycle History'!$B$3)","v":"CYCLE"},{"$f":"IF('Cycle History'!$B$151=\"\",\"\",'Cycle History'!$B$151)","v":50},{"$f":"IF('Cycle History'!$C$153=\"\",\"\",'Cycle History'!$C$153)","v":"Thawed"},{"$f":"IF('Cycle History'!$E$3=\"\",\"\",'Cycle History'!$E$3)","v":"DATE"}]
[555,{"$f":"IF('Cycle History'!$F$153=\"\",\"\",'Cycle History'!$F$153)","v":""},{"$f":"IF('Cycle History'!$B$1=\"\",\"\",'Cycle History'!$B$1)","v":"CYCLE HISTORY"},{"$f":"IF('Cycle History'!$B$3=\"\",\"\",'Cycle History'!$B$3)","v":"CYCLE"},{"$f":"IF('Cycle History'!$B$151=\"\",\"\",'Cycle History'!$B$151)","v":50},{"$f":"IF('Cycle History'!$C$153=\"\",\"\",'Cycle History'!$C$153)","v":"Thawed"},{"$f":"IF('Cycle History'!$F$3=\"\",\"\",'Cycle History'!$F$3)","v":"TIME IN"}]
[556,{"$f":"IF('Cycle History'!$G$153=\"\",\"\",'Cycle History'!$G$153)","v":""},{"$f":"IF('Cycle History'!$B$1=\"\",\"\",'Cycle History'!$B$1)","v":"CYCLE HISTORY"},{"$f":"IF('Cycle History'!$B$3=\"\",\"\",'Cycle History'!$B$3)","v":"CYCLE"},{"$f":"IF('Cycle History'!$B$151=\"\",\"\",'Cycle History'!$B$151)","v":50},{"$f":"IF('Cycle History'!$C$153=\"\",\"\",'Cycle History'!$C$153)","v":"Thawed"},{"$f":"IF('Cycle History'!$G$3=\"\",\"\",'Cycle History'!$G$3)","v":"TIME OUT"}]
[557,{"$f":"IF('Freeze-Thaw'!$C$48=\"\",\"\",'Freeze-Thaw'!$C$48)","v":""},"Sampled By ",{"$f":"IF('Freeze-Thaw'!$B$48=\"\",\"\",'Freeze-Thaw'!$B$48)","v":"TX221"}]
[558,{"$f":"IF('Freeze-Thaw'!$F$48=\"\",\"\",'Freeze-Thaw'!$F$48)","v":""},"Sampled Date ",{"$f":"IF('Freeze-Thaw'!$B$48=\"\",\"\",'Freeze-Thaw'!$B$48)","v":"TX221"}]
[559,{"$f":"IF('Freeze-Thaw'!$C$50=\"\",\"\",'Freeze-Thaw'!$C$50)","v":""},"Sampled By ",{"$f":"IF('Freeze-Thaw'!$B$50=\"\",\"\",'Freeze-Thaw'!$B$50)","v":"TX400"}]
[560,{"$f":"IF('Freeze-Thaw'!$F$50=\"\",\"\",'Freeze-Thaw'!$F$50)","v":""},"Sampled Date ",{"$f":"IF('Freeze-Thaw'!$B$50=\"\",\"\",'Freeze-Thaw'!$B$50)","v":"TX400"}]

{"sheet":"Sieves","index":3,"n_rows":28,"n_cols":7,"rows_kept":28,"cut":false,"hidden":true,"merged":[[20,0,27,0],[0,1,0,2],[14,0,15,0],[16,0,19,0],[0,3,0,4],[0,5,1,5],[0,0,1,0],[11,0,13,0],[7,0,8,0],[9,0,10,0],[2,0,6,0]]}
["Material","English",null,"Metric",null,"Normalized Gradations"]
[null,"Passing Sieve","Retained Sieve","Passing Sieve","Retained Sieve"]
["Concrete Fine Aggr.","No. 4","No. 8","4.75 mm","2.36 mm",0.1]
[null,"No. 8","No. 16","2.36 mm","1.18 mm",0.23]
[null,"No. 16","No. 30","1.18 mm","600 µm",0.22]
[null,"No. 30","No. 50","600 µm","300 µm",0.22]
[null,"No. 50","-","300 µm","-",0.23,{"$f":"SUM(F3:F7)","v":1}]
["Conc. Coarse Aggr.","3/4\"","3/8\"","19.0 mm","9.5 mm",0.66]
[null,"3/8\"","No. 4","9.5 mm","4.75 mm",0.34,{"$f":"SUM(F8:F9)","v":1}]
["Surface Treatment","1/2\"","3/8\"","12.5 mm","9.5 mm",0.28000000000000003]
[null,"3/8\"","No. 4","9.5 mm","4.75 mm",0.72,{"$f":"SUM(F10:F11)","v":1}]
["HMAC","1/2\"","3/8\"","12.5 mm","9.5 mm",0.13]
[null,"3/8\"","No. 4","9.5 mm","4.75 mm",0.5]
[null,"No. 4","No. 8","4.75 mm","2.36 mm",0.37,{"$f":"SUM(F12:F14)","v":1}]
["Rock Riprap","2-1/2\"","1-1/2\"","63 mm","37.5 mm",0.7]
[null,"1-1/2\"","3/4\"","37.5 mm","19.0 mm",0.3]
["Rock Riprap Bedding","2-1/2\"","1-1/2\"","63 mm","37.5 mm",0.24]
[null,"1-1/2\"","3/4\"","37.5 mm","19.0 mm",0.39]
[null,"3/4\"","3/8\"","19.0 mm","9.5 mm",0.24]
[null,"3/8\"","No. 4","9.5 mm","4.75 mm",0.13,{"$f":"SUM(F17:F20)","v":1}]
["Base Material","1-1/2\"","3/4\"","37.5 mm","19.0 mm",0.26]
[null,"3/4\"","3/8\"","19.0 mm","9.5 mm",0.13]
[null,"3/8\"","No. 4","9.5 mm","4.75 mm",0.15]
[null,"No. 4","No. 8","4.75 mm","2.36 mm",7.0000000000000007E-2]
[null,"No. 8","No. 16","2.36 mm","1.18 mm",0.08]
[null,"No. 16","No. 30","1.18 mm","600 µm",0.06]
[null,"No. 30","No. 50","600 µm","300 µm",0.05]
[null,"No. 50","-","300 µm","-",0.2,{"$f":"SUM(F21:F28)","v":1}]