{"text_format":"1","workbook":"xlsx","n_sheets":4,"sheets":["Tex-472-A","7-Day Compressive Strength","RX","Hidden Tables"],"not_rendered":{"charts":0,"images":1,"macros":1,"external_links":0,"defined_names":133,"comments":2,"pivot_tables":0},"unopened":[],"bounds":{"document_bytes":16777216,"sheet_cells":100000,"rows_first":2000,"rows_last":500,"rows_between":2000,"halvings":0,"cell_chars":16384,"cell_head_chars":4096},"cells_cut":0,"cells_raw":0,"read":"whole","date_system":"1900"}

{"sheet":"Tex-472-A","index":0,"n_rows":74,"n_cols":11,"rows_kept":74,"cut":false,"hidden":false,"merged":[[55,2,55,4],[56,2,56,4],[38,7,39,7],[38,8,39,8],[39,3,39,4],[52,1,52,8],[38,1,38,4],[39,1,39,2],[38,6,39,6],[40,1,40,4],[44,1,44,4],[47,1,47,8],[46,1,46,8],[45,1,45,8],[12,7,12,8],[17,3,17,4],[25,1,25,4],[23,1,23,4],[27,1,27,4],[26,1,26,4],[16,3,16,8],[14,7,14,8],[29,1,29,4],[30,1,30,4],[32,1,32,4],[31,1,31,4],[28,1,28,4],[67,0,68,0],[68,2,68,4],[57,2,57,4],[66,2,66,4],[58,2,58,4],[60,2,60,4],[62,2,62,4],[74,1,74,3],[70,6,70,8],[50,1,51,8],[13,7,13,8],[13,3,13,4],[34,1,34,4],[35,1,35,4],[14,3,14,4],[17,7,17,8],[64,2,64,4],[42,2,42,4],[38,5,39,5],[41,1,41,4],[43,1,43,4],[70,1,70,3],[53,1,53,8],[0,0,0,1],[12,3,12,4],[10,3,10,4],[37,1,37,4],[24,1,24,4],[15,3,15,8],[9,1,9,2],[8,7,8,8],[11,7,11,8],[8,3,8,4],[9,3,9,4],[9,7,9,8],[8,1,8,2],[11,3,11,4],[10,7,10,8],[36,1,36,4]]}
["TxDOT Manuals >",null,"Tex-472-A","Tex-403-A","Tex-414-A","Tex-415-A","Tex-416-A","Tex-417-A","Tex-418-A","Tex-447-A"]
[null,"TEXAS DEPARTMENT OF TRANSPORTATION",null,null,null,null,null,null,null,null,67]
[null,null,null,null,null,null,null,null,null,null,7]
[null,null,null,null,null,null,null,null,null,null,"tx472.xlsm::45575.63816"]
[null,"HYDRAULIC CEMENT CONCRETE REPORT"]
[null,"UNIFORMITY OF CONCRETE"]
[null,"Tex-472-A"]
[null,null,null,null,null,null,null,null,{"$f":"\"File Version: \" & TEXT(MID(sn,SEARCH(\"::\",sn,1)+2,20),\"mm/dd/yy hh:mm:ss\")","v":"File Version: 10/10/24 15:18:57"}]
[null,"SAMPLE ID:",null,null,null,null,"SAMPLED DATE:"]
[null,"TEST NUMBER:",null,null,null,null,"LETTING DATE:"]
[null,null,"SAMPLE STATUS:",null,null,null,"CONTROLLING CSJ:"]
[null,null,"COUNTY:",null,null,null,"SPEC YEAR:"]
[null,null,"SAMPLED BY:",null,null,null,"SPEC ITEM:"]
[null,null,"SAMPLE LOCATION:",null,null,null,"SPECIAL PROVISION:"]
[null,null,"MATERIAL CODE:",null,null,null,"CLASS:"]
[null,null,"MATERIAL NAME:"]
[null,null,"PRODUCER:"]
[null,null,"AREA ENGINEER:",null,null,null,"PROJECT MANAGER:"]
[]
[null,null,"COURSE\\LIFT:",null,"STATION:",null,null,"DIST. FROM CL:"]
[]
[]
[null,null,null,null,null,"Sample 1","Sample 2","Difference","Meets Uniformity Requirements"]
[null,"Tex-417-A:UNIT WEIGHT"]
[null,"Mass of bucket (lbs):"]
[null,"Volume of bucket (ft³):"]
[null,"Mass of bucket (filled with) concrete (lbs):"]
[null,"Density (Unit weight ) of concrete (lb/ft³):",null,null,null,{"$f":"IF(ISERROR((F27-F25)/F26),\"\",(F27-F25)/F26)","v":""},{"$f":"IF(ISERROR((G27-G25)/G26),\"\",(G27-G25)/G26)","v":""},{"$f":"IF(ISERROR(ABS(F28-G28)),\"\",ABS(F28-G28))","v":""},{"$f":"IF(NOT(ISNUMBER(H28)),\"\",IF(H12=\"\",\"\",IF(H28<='Hidden Tables'!D19,\"Yes\",\"No\")))","v":""}]
[null,"c* (lbs):"]
[null,"Specific Gravity:"]
[null,"Unit Mass (lb/ft³):",null,null,null,{"$f":"IF(OR(ISERROR(62.4*F30),ISBLANK(F30)),\"\",(62.4*F30))","v":""},{"$f":"IF(OR(ISERROR(62.4*G30),ISBLANK(G30)),\"\",(62.4*G30))","v":""}]
[null,"b** (lbs):",null,null,null,{"$f":"IF(OR(ISERROR(F27-F25),ISBLANK(F27)),\"\",(F27-F25))","v":""},{"$f":"IF(OR(ISERROR(G27-G25),ISBLANK(G27)),\"\",(G27-G25))","v":""}]
[null,"Coarse Aggregate Content (%):",null,null,null,{"$f":"IF(OR(ISERROR((F29/F32)*100),ISBLANK(F29)),\"\",(F29/F32)*100)","v":""},{"$f":"IF(OR(ISERROR((G29/G32)*100),ISBLANK(G29)),\"\",(G29/G32)*100)","v":""},{"$f":"IF(ISERROR(ABS(F33-G33)),\"\",ABS(F33-G33))","v":""},{"$f":"IF(NOT(ISNUMBER(H33)),\"\",IF(H12=\"\",\"\",IF(H33<='Hidden Tables'!D24,\"Yes\",\"No\")))","v":""}]
[null,{"$f":"AirMethod &\":AIR CONTENT\"","v":":AIR CONTENT"},null,"by:"]
[null,{"$f":"IF(AirMethod=\"Tex 414-A\",\"Water Level Reading (%):\",\"Uncorrected Air Content (%):\")","v":"Uncorrected Air Content (%):"}]
[null,{"$f":"IF(AirMethod=\"Tex 414-A\",\"Calibrated Cups of Water*** (cups):\",\"Aggr. Correction Factor (%):\")","v":"Aggr. Correction Factor (%):"}]
[null,{"$f":"IF(AirMethod=\"Tex 414-A\",\"Amt. of Isopropyl Alcohol (pints):\",\"\")","v":""}]
[null,{"$f":"IF(AirMethod=\"Tex 414-A\",\"Air Content (%):\",\"Corrected Air Content (%):\")","v":"Corrected Air Content (%):"},null,null,null,{"$f":"IF(ISBLANK(F35),\"\",IF(AirMethod=\"Tex 414-A\",ROUND(((F35+F36-VLOOKUP(F37,'Hidden Tables'!A5:D14,4))/25),2)*25,ROUND(F35-F36,1)))","v":""},{"$f":"IF(ISBLANK(G35),\"\",IF(AirMethod=\"Tex 414-A\",ROUND(((G35+G36-VLOOKUP(F37,'Hidden Tables'!A5:D14,4))/25),2)*25,ROUND(G35-G36,1)))","v":""},{"$f":"IF(OR(ISERROR(ABS(F38-G38)),ISBLANK(F38)),\"\",ABS(F38-G38))","v":""},{"$f":"IF(NOT(ISNUMBER(H38)),\"\",IF(H12=\"\",\"\",IF(H38<='Hidden Tables'!D20,\"Yes\",\"No\")))","v":""}]
[null,"Tex-415-A:SLUMP"]
[null,"Specified slump:"]
[null,"Slump (in.):",null,null,null,null,null,{"$f":"IF(OR(ISERROR(ABS(F41-G41)),ISBLANK(F41)),\"\",ABS(F41-G41))","v":""},{"$f":"IF(NOT(ISNUMBER(H41)),\"\",IF(H12=\"\",\"\",IF(AND(D40=\"4 in. or less\",H41<='Hidden Tables'!D22),\"Yes\",IF(AND(D40=\"greater than 4 in. and up to 6 in.\",H41<='Hidden Tables'!D23),\"Yes\",\"No\"))))","v":""}]
[null,"Tex-418-A:COMPRESSIVE STRENGTH"]
[null,"Enter ind. results.","7-day Average Compressive Strength (psi):",null,null,{"$f":"IF(ISERROR(ROUND(AVERAGE('7-Day Compressive Strength'!I25:'7-Day Compressive Strength'!I27),-1)),\"\",ROUND(AVERAGE('7-Day Compressive Strength'!I25:'7-Day Compressive Strength'!I27),-1))","v":""},{"$f":"IF(ISERROR(ROUND(AVERAGE('7-Day Compressive Strength'!I28:'7-Day Compressive Strength'!I30),-1)),\"\",ROUND(AVERAGE('7-Day Compressive Strength'!I28:'7-Day Compressive Strength'!I30),-1))","v":""},{"$f":"IF(ISERROR(ABS((F43-G43)/F43)),\"\",ABS((F43-G43)/F43))","v":""},{"$f":"IF(NOT(ISNUMBER(H43)),\"\",IF(Field2=\"\",\"\",IF(OR(H43<'Hidden Tables'!D26,H43='Hidden Tables'!D26),\"Yes\",\"No\")))","v":""}]
[null,"UNIT WEIGHT OF AIR-FREE MORTAR"]
[null,"Unit Weight of Air-free Mortar (lb/ft³):",null,null,null,{"$f":"IF(ISERROR((F32-F29)/(F26-((F26*F38)/100+(F29/F31)))),\"\",(F32-F29)/(F26-((F26*F38)/100+(F29/F31))))","v":""},{"$f":"IF(ISERROR((G32-G29)/(G26-((G26*G38)/100+(G29/G31)))),\"\",(G32-G29)/(G26-((G26*G38)/100+(G29/G31))))","v":""},{"$f":"IF(ISERROR(ABS((F45-G45)/F45)),\"\",ABS((F45-G45)/F45))","v":""},{"$f":"IF(NOT(ISNUMBER(H45)),\"\",IF(Field2=\"\",\"\",IF(OR(H45<'Hidden Tables'!D25,H45='Hidden Tables'!D25),\"Yes\",\"No\")))","v":""}]
[null,"* c = saturated surface-dry weight of coarse aggregate retained on the No. 4 sievve, using coarse aggregate from wet sieving the concrete in the unit weight container"]
[null,"** b = weight of concrete contained in the unit weight container"]
[null,{"$f":"IF(AirMethod=\"Tex 414-A\",\"*** Only necessary if the air content is greater than the 9% range of the meter.\",\"\")","v":""}]
[]
[null,"Remarks:",{"$f":"NOW()","v":"2024-10-10T15:18:57.460"}]
[]
[]
[]
[]
[]
[null,"Sample Method:","Sampled By:",null,null,"Sampled Date:"]
[null,"TX407"," ",null,null," "]
[null,"Test Method:","Tested By:",null,null,"Tested Date:"]
[null,"TX403"," ",null,null," "]
[]
[null,"TX414"," ",null,null," "]
[null,null,"DJ"]
[null,"TX415"," ",null,null," "]
[null,null,"KATE"]
[null,"TX416"," ",null,null," "]
[]
[null,"TX417"," ",null,null," "]
[]
[null,"TX418"," ",null,null," "]
[null,"Test Stamp Code:",null,null,"Omit Test:","Completed Date:","Reviewed By:"]
[]
[null,"Locked By:","TxDOT:","District:","Area:"]
[]
[null,"Authorized By:",null,null,"Authorized Date:"]

{"sheet":"7-Day Compressive Strength","index":1,"n_rows":33,"n_cols":11,"rows_kept":33,"cut":false,"hidden":false,"merged":[[21,6,23,6],[21,5,23,5],[17,6,17,7],[15,1,15,2],[15,3,15,4],[15,5,15,6],[15,7,15,8],[12,5,12,6],[12,7,12,8],[14,1,14,2],[14,3,14,8],[13,1,13,2],[13,3,13,8],[12,3,12,4],[12,1,12,2],[10,5,10,6],[10,7,10,8],[11,1,11,2],[11,3,11,4],[11,5,11,6],[11,7,11,8],[10,3,10,4],[10,1,10,2],[6,5,6,6],[8,5,8,6],[8,7,8,8],[9,1,9,2],[9,3,9,4],[9,5,9,6],[9,7,9,8],[8,1,8,2],[8,3,8,4],[21,7,23,7],[21,8,23,8],[21,9,23,9],[0,0,0,1],[7,3,7,4],[6,1,6,2],[6,3,6,4],[21,3,23,3],[22,2,23,2],[17,1,17,2],[21,1,23,1],[21,4,23,4],[6,7,6,8],[7,1,7,2],[7,5,7,6],[7,7,7,8],[32,6,32,8],[31,6,31,8],[30,6,30,8],[24,9,26,9],[27,9,29,9]]}
["TxDOT Manuals >",null,null,"Tex-418-A"]
[null,"TEXAS DEPARTMENT OF TRANSPORTATION",null,null,null,null,null,null,null,null,16]
[null,null,null,null,null,null,null,null,null,null,1]
[null,"HYDRAULIC CEMENT CONCRETE REPORT",null,null,null,null,null,null,null,null,"Tx417.xls::38117.490382"]
[null,"Tex-472-A, 7-day Compressive Strength"]
[]
[null,"SAMPLE ID",null,{"$f":"IF(sampleid=\"\",\"\",sampleid)","v":""},null,"SAMPLED DATE:",null,{"$f":"IF(SampledDate=\"\",\"\",SampledDate)","v":""}]
[null,"TEST NUMBER:",null,{"$f":"IF(testnumber=\"\",\"\",testnumber)","v":""},null,"LETTING DATE:",null,{"$f":"IF(lettingdate=\"\",\"\",lettingdate)","v":""}]
[null,"SAMPLE STATUS:",null,{"$f":"IF(status=\"\",\"\",status)","v":""},null,"CONTROLLING CSJ:",null,{"$f":"IF(ccsj=\"\",\"\",ccsj)","v":""}]
[null,"COUNTY:",null,{"$f":"IF(county=\"\",\"\",county)","v":""},null,"SPEC YEAR:",null,{"$f":"IF(specyear=\"\",\"\",specyear)","v":""}]
[null,"SAMPLED BY:",null,{"$f":"IF(sampledby=\"\",\"\",sampledby)","v":""},null,"SPEC ITEM:",null,{"$f":"IF(specitem=\"\",\"\",specitem)","v":""}]
[null,"SAMPLE LOCATION:",null,{"$f":"IF(samplelocation=\"\",\"\",samplelocation)","v":""},null,"SPECIAL PROVISION:",null,{"$f":"IF(specialprovision=\"\",\"\",specialprovision)","v":""}]
[null,"MATERIAL CODE:",null,{"$f":"IF(material=\"\",\"\",material)","v":""},null,"CLASS:",null,{"$f":"IF(grade=\"\",\"\",grade)","v":""}]
[null,"MATERIAL NAME:",null,{"$f":"IF(matl_nm=\"\",\"\",matl_nm)","v":""}]
[null,"PRODUCER:",null,{"$f":"IF(producer=\"\",\"\",producer)","v":""}]
[null,"AREA ENGINEER:",null,{"$f":"IF(areaengineer=\"\",\"\",areaengineer)","v":""},null,"PROJECT MANAGER:",null,{"$f":"IF(projectmanager=\"\",\"\",projectmanager)","v":""}]
[]
[null,"COURSE\\LIFT:",null,{"$f":"IF(CourseLift=\"\",\"\",CourseLift)","v":""},"STATION:",{"$f":"IF(station=\"\",\"\",station)","v":""},"DIST. FROM CL:",null,{"$f":"IF(distfromcl=\"\",\"\",distfromcl)","v":""}]
[]
[null,"7-DAY COMPRESSIVE STRENGTH"]
[null,"Test Method Tex-418-A"]
[null,"Cylinder Number",null,"Length of Cylinder (inches)","Length to Diameter Ratio","Max Load (Lbs.)","Fracture Type","Correction Factor","Compressive Strength (psi)","Compressive Strength Average (psi)"]
[null,null,{"$f":"CircumDiameter1 & \" of Cylinder (inches)\"","v":" of Cylinder (inches)"}]
[]
[null,"Sample 1-1",null,null,{"$f":"IF(ISERROR(IF(CircumDiameter1=\"circumference\",$D25/(SQRT($C25/PI())*2),($D25/$C25))),\"\",IF(CircumDiameter1=\"circumference\",$D25/(SQRT($C25/PI())*2),($D25/$C25)))","v":""},null,null,{"$f":"IF(E25=\"\",\"\",IF(E25<1,\"CHK SIZES\",IF(E25>1.8,1,VLOOKUP(E25,'Hidden Tables'!$G3:$H110,2))))","v":""},{"$f":"IF(E25=\"\",\"\",ROUND(H25*IF(CircumDiameter1=\"Circumference\",(F25/((C25*C25)/12.566)),(F25/(0.7854*C25*C25))),-1))","v":""},{"$f":"IF(ISBLANK(Field43), \"\", ROUND(AVERAGE(I25:I27), -1))","v":""}]
[null,"Sample 1-2",null,null,"",null,null,{"$f":"IF(E26=\"\",\"\",IF(E26<1,\"CHK SIZES\",IF(E26>1.8,1,VLOOKUP(E26,'Hidden Tables'!$G4:$H111,2))))","v":""},""]
[null,"Sample 1-3",null,null,"",null,null,{"$f":"IF(E27=\"\",\"\",IF(E27<1,\"CHK SIZES\",IF(E27>1.8,1,VLOOKUP(E27,'Hidden Tables'!$G5:$H112,2))))","v":""},""]
[null,"Sample 2-1",null,null,"",null,null,{"$f":"IF(E28=\"\",\"\",IF(E28<1,\"CHK SIZES\",IF(E28>1.8,1,VLOOKUP(E28,'Hidden Tables'!$G6:$H113,2))))","v":""},"",{"$f":"IF(ISBLANK(Field55), \"\", ROUND(AVERAGE(I28:I30), -1))","v":""}]
[null,"Sample 2-2",null,null,"",null,null,{"$f":"IF(E29=\"\",\"\",IF(E29<1,\"CHK SIZES\",IF(E29>1.8,1,VLOOKUP(E29,'Hidden Tables'!$G7:$H114,2))))","v":""},""]
[null,"Sample 2-3",null,null,"",null,null,{"$f":"IF(E30=\"\",\"\",IF(E30<1,\"CHK SIZES\",IF(E30>1.8,1,VLOOKUP(E30,'Hidden Tables'!$G8:$H115,2))))","v":""},""]
[null,null,null,null,null,null,"Difference",null,null,{"$f":"IF(ISERROR(ABS(J28-J25)), \"\", ABS(J28-J25))","v":""}]
[null,null,null,null,null,null,"Difference, %",null,null,{"$f":"IF(ISERROR((J31)/MIN(J25:J30)), \"\", ROUND((J31*100)/MIN(J25:J30), 1)/100)","v":""}]
[null,null,null,null,null,null,"Meets Uniformity Requirements",null,null,{"$f":"IF(NOT(ISNUMBER(J32)),\"\",IF(H10=\"\",\"\",IF(J32<='Hidden Tables'!D26,\"Yes\",\"No\")))","v":""}]

{"sheet":"RX","index":2,"n_rows":110,"n_cols":9,"rows_kept":110,"cut":false,"hidden":false,"merged":[]}
[105]
["Fld_nbr","Value","Desc_1","Desc_2","Desc_3","Desc_4","Desc_5","Desc_6","Desc_7"]
[1,{"$f":"IF('Tex-472-A'!$B$51=\"\",\"\",'Tex-472-A'!$B$51)","v":""},{"$f":"'Tex-472-A'!$B$50","v":"Remarks:"}]
[2,{"$f":"IF('Tex-472-A'!$D$20=\"\",\"\",'Tex-472-A'!$D$20)","v":""},{"$f":"IF('Tex-472-A'!$C$20=\"\",\"\",'Tex-472-A'!$C$20)","v":"COURSE\\LIFT:"}]
[3,{"$f":"IF('Tex-472-A'!$C$59=\"\",\"\",'Tex-472-A'!$C$59)","v":" "},"Tested By ",{"$f":"IF('Tex-472-A'!$B$59=\"\",\"\",'Tex-472-A'!$B$59)","v":"TX403"}]
[4,{"$f":"IF('Tex-472-A'!$F$59=\"\",\"\",'Tex-472-A'!$F$59)","v":" "},"Tested Date ",{"$f":"IF('Tex-472-A'!$B$59=\"\",\"\",'Tex-472-A'!$B$59)","v":"TX403"}]
[5,{"$f":"IF('Tex-472-A'!$C$61=\"\",\"\",'Tex-472-A'!$C$61)","v":" "},"Tested By ",{"$f":"IF('Tex-472-A'!$B$61=\"\",\"\",'Tex-472-A'!$B$61)","v":"TX414"}]
[6,{"$f":"IF('Tex-472-A'!$F$61=\"\",\"\",'Tex-472-A'!$F$61)","v":" "},"Tested Date ",{"$f":"IF('Tex-472-A'!$B$61=\"\",\"\",'Tex-472-A'!$B$61)","v":"TX414"}]
[7,{"$f":"IF('Tex-472-A'!$C$63=\"\",\"\",'Tex-472-A'!$C$63)","v":" "},"Tested By ",{"$f":"IF('Tex-472-A'!$B$63=\"\",\"\",'Tex-472-A'!$B$63)","v":"TX415"}]
[8,{"$f":"IF('Tex-472-A'!$F$63=\"\",\"\",'Tex-472-A'!$F$63)","v":" "},"Tested Date ",{"$f":"IF('Tex-472-A'!$B$63=\"\",\"\",'Tex-472-A'!$B$63)","v":"TX415"}]
[9,{"$f":"IF('Tex-472-A'!$C$65=\"\",\"\",'Tex-472-A'!$C$65)","v":" "},"Tested By ",{"$f":"IF('Tex-472-A'!$B$65=\"\",\"\",'Tex-472-A'!$B$65)","v":"TX416"}]
[10,{"$f":"IF('Tex-472-A'!$F$65=\"\",\"\",'Tex-472-A'!$F$65)","v":" "},"Tested Date ",{"$f":"IF('Tex-472-A'!$B$65=\"\",\"\",'Tex-472-A'!$B$65)","v":"TX416"}]
[11,{"$f":"IF('Tex-472-A'!$C$67=\"\",\"\",'Tex-472-A'!$C$67)","v":" "},"Tested By ",{"$f":"IF('Tex-472-A'!$B$67=\"\",\"\",'Tex-472-A'!$B$67)","v":"TX417"}]
[12,{"$f":"IF('Tex-472-A'!$F$67=\"\",\"\",'Tex-472-A'!$F$67)","v":" "},"Tested Date ",{"$f":"IF('Tex-472-A'!$B$67=\"\",\"\",'Tex-472-A'!$B$67)","v":"TX417"}]
[13,{"$f":"IF('Tex-472-A'!$C$69=\"\",\"\",'Tex-472-A'!$C$69)","v":" "},"Tested By ",{"$f":"IF('Tex-472-A'!$B$69=\"\",\"\",'Tex-472-A'!$B$69)","v":"TX418"}]
[14,{"$f":"IF('Tex-472-A'!$F$69=\"\",\"\",'Tex-472-A'!$F$69)","v":" "},"Tested Date ",{"$f":"IF('Tex-472-A'!$B$69=\"\",\"\",'Tex-472-A'!$B$69)","v":"TX418"}]
[15,{"$f":"IF('Tex-472-A'!$F$25=\"\",\"\",'Tex-472-A'!$F$25)","v":""},{"$f":"IF('Tex-472-A'!$B$24=\"\",\"\",'Tex-472-A'!$B$24)","v":"Tex-417-A:UNIT WEIGHT"},{"$f":"IF('Tex-472-A'!$B$25=\"\",\"\",'Tex-472-A'!$B$25)","v":"Mass of bucket (lbs):"},{"$f":"IF('Tex-472-A'!$F$23=\"\",\"\",'Tex-472-A'!$F$23)","v":"Sample 1"}]
[16,{"$f":"IF('Tex-472-A'!$G$25=\"\",\"\",'Tex-472-A'!$G$25)","v":""},{"$f":"IF('Tex-472-A'!$B$24=\"\",\"\",'Tex-472-A'!$B$24)","v":"Tex-417-A:UNIT WEIGHT"},{"$f":"IF('Tex-472-A'!$B$25=\"\",\"\",'Tex-472-A'!$B$25)","v":"Mass of bucket (lbs):"},{"$f":"IF('Tex-472-A'!$G$23=\"\",\"\",'Tex-472-A'!$G$23)","v":"Sample 2"}]
[17,{"$f":"IF('Tex-472-A'!$F$26=\"\",\"\",'Tex-472-A'!$F$26)","v":""},{"$f":"IF('Tex-472-A'!$B$24=\"\",\"\",'Tex-472-A'!$B$24)","v":"Tex-417-A:UNIT WEIGHT"},{"$f":"IF('Tex-472-A'!$B$26=\"\",\"\",'Tex-472-A'!$B$26)","v":"Volume of bucket (ft³):"},{"$f":"IF('Tex-472-A'!$F$23=\"\",\"\",'Tex-472-A'!$F$23)","v":"Sample 1"}]
[18,{"$f":"IF('Tex-472-A'!$G$26=\"\",\"\",'Tex-472-A'!$G$26)","v":""},{"$f":"IF('Tex-472-A'!$B$24=\"\",\"\",'Tex-472-A'!$B$24)","v":"Tex-417-A:UNIT WEIGHT"},{"$f":"IF('Tex-472-A'!$B$26=\"\",\"\",'Tex-472-A'!$B$26)","v":"Volume of bucket (ft³):"},{"$f":"IF('Tex-472-A'!$G$23=\"\",\"\",'Tex-472-A'!$G$23)","v":"Sample 2"}]
[19,{"$f":"IF('Tex-472-A'!$F$27=\"\",\"\",'Tex-472-A'!$F$27)","v":""},{"$f":"IF('Tex-472-A'!$B$24=\"\",\"\",'Tex-472-A'!$B$24)","v":"Tex-417-A:UNIT WEIGHT"},{"$f":"IF('Tex-472-A'!$B$27=\"\",\"\",'Tex-472-A'!$B$27)","v":"Mass of bucket (filled with) concrete (lbs):"},{"$f":"IF('Tex-472-A'!$F$23=\"\",\"\",'Tex-472-A'!$F$23)","v":"Sample 1"}]
[20,{"$f":"IF('Tex-472-A'!$G$27=\"\",\"\",'Tex-472-A'!$G$27)","v":""},{"$f":"IF('Tex-472-A'!$B$24=\"\",\"\",'Tex-472-A'!$B$24)","v":"Tex-417-A:UNIT WEIGHT"},{"$f":"IF('Tex-472-A'!$B$27=\"\",\"\",'Tex-472-A'!$B$27)","v":"Mass of bucket (filled with) concrete (lbs):"},{"$f":"IF('Tex-472-A'!$G$23=\"\",\"\",'Tex-472-A'!$G$23)","v":"Sample 2"}]
[21,{"$f":"IF('Tex-472-A'!$F$28=\"\",\"\",'Tex-472-A'!$F$28)","v":""},{"$f":"IF('Tex-472-A'!$B$24=\"\",\"\",'Tex-472-A'!$B$24)","v":"Tex-417-A:UNIT WEIGHT"},{"$f":"IF('Tex-472-A'!$B$28=\"\",\"\",'Tex-472-A'!$B$28)","v":"Density (Unit weight ) of concrete (lb/ft³):"},{"$f":"IF('Tex-472-A'!$F$23=\"\",\"\",'Tex-472-A'!$F$23)","v":"Sample 1"}]
[22,{"$f":"IF('Tex-472-A'!$G$28=\"\",\"\",'Tex-472-A'!$G$28)","v":""},{"$f":"IF('Tex-472-A'!$B$24=\"\",\"\",'Tex-472-A'!$B$24)","v":"Tex-417-A:UNIT WEIGHT"},{"$f":"IF('Tex-472-A'!$B$28=\"\",\"\",'Tex-472-A'!$B$28)","v":"Density (Unit weight ) of concrete (lb/ft³):"},{"$f":"IF('Tex-472-A'!$G$23=\"\",\"\",'Tex-472-A'!$G$23)","v":"Sample 2"}]
[23,{"$f":"IF('Tex-472-A'!$H$28=\"\",\"\",'Tex-472-A'!$H$28)","v":""},{"$f":"IF('Tex-472-A'!$B$24=\"\",\"\",'Tex-472-A'!$B$24)","v":"Tex-417-A:UNIT WEIGHT"},{"$f":"IF('Tex-472-A'!$B$28=\"\",\"\",'Tex-472-A'!$B$28)","v":"Density (Unit weight ) of concrete (lb/ft³):"},{"$f":"IF('Tex-472-A'!$H$23=\"\",\"\",'Tex-472-A'!$H$23)","v":"Difference"}]
[24,{"$f":"IF('Tex-472-A'!$I$28=\"\",\"\",'Tex-472-A'!$I$28)","v":""},{"$f":"IF('Tex-472-A'!$B$24=\"\",\"\",'Tex-472-A'!$B$24)","v":"Tex-417-A:UNIT WEIGHT"},{"$f":"IF('Tex-472-A'!$B$28=\"\",\"\",'Tex-472-A'!$B$28)","v":"Density (Unit weight ) of concrete (lb/ft³):"},{"$f":"IF('Tex-472-A'!$I$23=\"\",\"\",'Tex-472-A'!$I$23)","v":"Meets Uniformity Requirements"}]
[25,{"$f":"IF('Tex-472-A'!$F$29=\"\",\"\",'Tex-472-A'!$F$29)","v":""},{"$f":"IF('Tex-472-A'!$B$24=\"\",\"\",'Tex-472-A'!$B$24)","v":"Tex-417-A:UNIT WEIGHT"},{"$f":"IF('Tex-472-A'!$B$29=\"\",\"\",'Tex-472-A'!$B$29)","v":"c* (lbs):"},{"$f":"IF('Tex-472-A'!$F$23=\"\",\"\",'Tex-472-A'!$F$23)","v":"Sample 1"}]
[26,{"$f":"IF('Tex-472-A'!$G$29=\"\",\"\",'Tex-472-A'!$G$29)","v":""},{"$f":"IF('Tex-472-A'!$B$24=\"\",\"\",'Tex-472-A'!$B$24)","v":"Tex-417-A:UNIT WEIGHT"},{"$f":"IF('Tex-472-A'!$B$29=\"\",\"\",'Tex-472-A'!$B$29)","v":"c* (lbs):"},{"$f":"IF('Tex-472-A'!$G$23=\"\",\"\",'Tex-472-A'!$G$23)","v":"Sample 2"}]
[27,{"$f":"IF('Tex-472-A'!$F$30=\"\",\"\",'Tex-472-A'!$F$30)","v":""},{"$f":"IF('Tex-472-A'!$B$24=\"\",\"\",'Tex-472-A'!$B$24)","v":"Tex-417-A:UNIT WEIGHT"},{"$f":"IF('Tex-472-A'!$B$30=\"\",\"\",'Tex-472-A'!$B$30)","v":"Specific Gravity:"},{"$f":"IF('Tex-472-A'!$F$23=\"\",\"\",'Tex-472-A'!$F$23)","v":"Sample 1"}]
[28,{"$f":"IF('Tex-472-A'!$G$30=\"\",\"\",'Tex-472-A'!$G$30)","v":""},{"$f":"IF('Tex-472-A'!$B$24=\"\",\"\",'Tex-472-A'!$B$24)","v":"Tex-417-A:UNIT WEIGHT"},{"$f":"IF('Tex-472-A'!$B$30=\"\",\"\",'Tex-472-A'!$B$30)","v":"Specific Gravity:"},{"$f":"IF('Tex-472-A'!$G$23=\"\",\"\",'Tex-472-A'!$G$23)","v":"Sample 2"}]
[29,{"$f":"IF('Tex-472-A'!$F$31=\"\",\"\",'Tex-472-A'!$F$31)","v":""},{"$f":"IF('Tex-472-A'!$B$24=\"\",\"\",'Tex-472-A'!$B$24)","v":"Tex-417-A:UNIT WEIGHT"},{"$f":"IF('Tex-472-A'!$B$31=\"\",\"\",'Tex-472-A'!$B$31)","v":"Unit Mass (lb/ft³):"},{"$f":"IF('Tex-472-A'!$F$23=\"\",\"\",'Tex-472-A'!$F$23)","v":"Sample 1"}]
[30,{"$f":"IF('Tex-472-A'!$G$31=\"\",\"\",'Tex-472-A'!$G$31)","v":""},{"$f":"IF('Tex-472-A'!$B$24=\"\",\"\",'Tex-472-A'!$B$24)","v":"Tex-417-A:UNIT WEIGHT"},{"$f":"IF('Tex-472-A'!$B$31=\"\",\"\",'Tex-472-A'!$B$31)","v":"Unit Mass (lb/ft³):"},{"$f":"IF('Tex-472-A'!$G$23=\"\",\"\",'Tex-472-A'!$G$23)","v":"Sample 2"}]
[31,{"$f":"IF('Tex-472-A'!$F$32=\"\",\"\",'Tex-472-A'!$F$32)","v":""},{"$f":"IF('Tex-472-A'!$B$24=\"\",\"\",'Tex-472-A'!$B$24)","v":"Tex-417-A:UNIT WEIGHT"},{"$f":"IF('Tex-472-A'!$B$32=\"\",\"\",'Tex-472-A'!$B$32)","v":"b** (lbs):"},{"$f":"IF('Tex-472-A'!$F$23=\"\",\"\",'Tex-472-A'!$F$23)","v":"Sample 1"}]
[32,{"$f":"IF('Tex-472-A'!$G$32=\"\",\"\",'Tex-472-A'!$G$32)","v":""},{"$f":"IF('Tex-472-A'!$B$24=\"\",\"\",'Tex-472-A'!$B$24)","v":"Tex-417-A:UNIT WEIGHT"},{"$f":"IF('Tex-472-A'!$B$32=\"\",\"\",'Tex-472-A'!$B$32)","v":"b** (lbs):"},{"$f":"IF('Tex-472-A'!$G$23=\"\",\"\",'Tex-472-A'!$G$23)","v":"Sample 2"}]
[33,{"$f":"IF('Tex-472-A'!$F$33=\"\",\"\",'Tex-472-A'!$F$33)","v":""},{"$f":"IF('Tex-472-A'!$B$24=\"\",\"\",'Tex-472-A'!$B$24)","v":"Tex-417-A:UNIT WEIGHT"},{"$f":"IF('Tex-472-A'!$B$33=\"\",\"\",'Tex-472-A'!$B$33)","v":"Coarse Aggregate Content (%):"},{"$f":"IF('Tex-472-A'!$F$23=\"\",\"\",'Tex-472-A'!$F$23)","v":"Sample 1"}]
[34,{"$f":"IF('Tex-472-A'!$G$33=\"\",\"\",'Tex-472-A'!$G$33)","v":""},{"$f":"IF('Tex-472-A'!$B$24=\"\",\"\",'Tex-472-A'!$B$24)","v":"Tex-417-A:UNIT WEIGHT"},{"$f":"IF('Tex-472-A'!$B$33=\"\",\"\",'Tex-472-A'!$B$33)","v":"Coarse Aggregate Content (%):"},{"$f":"IF('Tex-472-A'!$G$23=\"\",\"\",'Tex-472-A'!$G$23)","v":"Sample 2"}]
[35,{"$f":"IF('Tex-472-A'!$H$33=\"\",\"\",'Tex-472-A'!$H$33)","v":""},{"$f":"IF('Tex-472-A'!$B$24=\"\",\"\",'Tex-472-A'!$B$24)","v":"Tex-417-A:UNIT WEIGHT"},{"$f":"IF('Tex-472-A'!$B$33=\"\",\"\",'Tex-472-A'!$B$33)","v":"Coarse Aggregate Content (%):"},{"$f":"IF('Tex-472-A'!$H$23=\"\",\"\",'Tex-472-A'!$H$23)","v":"Difference"}]
[36,{"$f":"IF('Tex-472-A'!$I$33=\"\",\"\",'Tex-472-A'!$I$33)","v":""},{"$f":"IF('Tex-472-A'!$B$24=\"\",\"\",'Tex-472-A'!$B$24)","v":"Tex-417-A:UNIT WEIGHT"},{"$f":"IF('Tex-472-A'!$B$33=\"\",\"\",'Tex-472-A'!$B$33)","v":"Coarse Aggregate Content (%):"},{"$f":"IF('Tex-472-A'!$I$23=\"\",\"\",'Tex-472-A'!$I$23)","v":"Meets Uniformity Requirements"}]
[37,{"$f":"IF('Tex-472-A'!$F$35=\"\",\"\",'Tex-472-A'!$F$35)","v":""},{"$f":"IF('Tex-472-A'!$B$24=\"\",\"\",'Tex-472-A'!$B$24)","v":"Tex-417-A:UNIT WEIGHT"},{"$f":"IF('Tex-472-A'!$B$35=\"\",\"\",'Tex-472-A'!$B$35)","v":"Uncorrected Air Content (%):"},{"$f":"IF('Tex-472-A'!$F$23=\"\",\"\",'Tex-472-A'!$F$23)","v":"Sample 1"}]
[38,{"$f":"IF('Tex-472-A'!$G$35=\"\",\"\",'Tex-472-A'!$G$35)","v":""},{"$f":"IF('Tex-472-A'!$B$24=\"\",\"\",'Tex-472-A'!$B$24)","v":"Tex-417-A:UNIT WEIGHT"},{"$f":"IF('Tex-472-A'!$B$35=\"\",\"\",'Tex-472-A'!$B$35)","v":"Uncorrected Air Content (%):"},{"$f":"IF('Tex-472-A'!$G$23=\"\",\"\",'Tex-472-A'!$G$23)","v":"Sample 2"}]
[39,{"$f":"IF('Tex-472-A'!$F$36=\"\",\"\",'Tex-472-A'!$F$36)","v":""},{"$f":"IF('Tex-472-A'!$B$24=\"\",\"\",'Tex-472-A'!$B$24)","v":"Tex-417-A:UNIT WEIGHT"},{"$f":"IF('Tex-472-A'!$B$36=\"\",\"\",'Tex-472-A'!$B$36)","v":"Aggr. Correction Factor (%):"},{"$f":"IF('Tex-472-A'!$F$23=\"\",\"\",'Tex-472-A'!$F$23)","v":"Sample 1"}]
[40,{"$f":"IF('Tex-472-A'!$G$36=\"\",\"\",'Tex-472-A'!$G$36)","v":""},{"$f":"IF('Tex-472-A'!$B$24=\"\",\"\",'Tex-472-A'!$B$24)","v":"Tex-417-A:UNIT WEIGHT"},{"$f":"IF('Tex-472-A'!$B$36=\"\",\"\",'Tex-472-A'!$B$36)","v":"Aggr. Correction Factor (%):"},{"$f":"IF('Tex-472-A'!$G$23=\"\",\"\",'Tex-472-A'!$G$23)","v":"Sample 2"}]
[41,{"$f":"IF('Tex-472-A'!$F$37=\"\",\"\",'Tex-472-A'!$F$37)","v":""},{"$f":"IF('Tex-472-A'!$B$24=\"\",\"\",'Tex-472-A'!$B$24)","v":"Tex-417-A:UNIT WEIGHT"},{"$f":"IF('Tex-472-A'!$B$37=\"\",\"\",'Tex-472-A'!$B$37)","v":""},{"$f":"IF('Tex-472-A'!$F$23=\"\",\"\",'Tex-472-A'!$F$23)","v":"Sample 1"}]
[42,{"$f":"IF('Tex-472-A'!$G$37=\"\",\"\",'Tex-472-A'!$G$37)","v":""},{"$f":"IF('Tex-472-A'!$B$24=\"\",\"\",'Tex-472-A'!$B$24)","v":"Tex-417-A:UNIT WEIGHT"},{"$f":"IF('Tex-472-A'!$B$37=\"\",\"\",'Tex-472-A'!$B$37)","v":""},{"$f":"IF('Tex-472-A'!$G$23=\"\",\"\",'Tex-472-A'!$G$23)","v":"Sample 2"}]
[43,{"$f":"IF('Tex-472-A'!$F$38=\"\",\"\",'Tex-472-A'!$F$38)","v":""},{"$f":"IF('Tex-472-A'!$B$24=\"\",\"\",'Tex-472-A'!$B$24)","v":"Tex-417-A:UNIT WEIGHT"},{"$f":"IF('Tex-472-A'!$B$38=\"\",\"\",'Tex-472-A'!$B$38)","v":"Corrected Air Content (%):"},{"$f":"IF('Tex-472-A'!$F$23=\"\",\"\",'Tex-472-A'!$F$23)","v":"Sample 1"}]
[44,{"$f":"IF('Tex-472-A'!$G$38=\"\",\"\",'Tex-472-A'!$G$38)","v":""},{"$f":"IF('Tex-472-A'!$B$24=\"\",\"\",'Tex-472-A'!$B$24)","v":"Tex-417-A:UNIT WEIGHT"},{"$f":"IF('Tex-472-A'!$B$38=\"\",\"\",'Tex-472-A'!$B$38)","v":"Corrected Air Content (%):"},{"$f":"IF('Tex-472-A'!$G$23=\"\",\"\",'Tex-472-A'!$G$23)","v":"Sample 2"}]
[45,{"$f":"IF('Tex-472-A'!$H$38=\"\",\"\",'Tex-472-A'!$H$38)","v":""},{"$f":"IF('Tex-472-A'!$B$24=\"\",\"\",'Tex-472-A'!$B$24)","v":"Tex-417-A:UNIT WEIGHT"},{"$f":"IF('Tex-472-A'!$B$38=\"\",\"\",'Tex-472-A'!$B$38)","v":"Corrected Air Content (%):"},{"$f":"IF('Tex-472-A'!$H$23=\"\",\"\",'Tex-472-A'!$H$23)","v":"Difference"}]
[46,{"$f":"IF('Tex-472-A'!$I$38=\"\",\"\",'Tex-472-A'!$I$38)","v":""},{"$f":"IF('Tex-472-A'!$B$24=\"\",\"\",'Tex-472-A'!$B$24)","v":"Tex-417-A:UNIT WEIGHT"},{"$f":"IF('Tex-472-A'!$B$38=\"\",\"\",'Tex-472-A'!$B$38)","v":"Corrected Air Content (%):"},{"$f":"IF('Tex-472-A'!$I$23=\"\",\"\",'Tex-472-A'!$I$23)","v":"Meets Uniformity Requirements"}]
[47,{"$f":"IF('Tex-472-A'!$D$40=\"\",\"\",'Tex-472-A'!$D$40)","v":""},{"$f":"IF('Tex-472-A'!$B$39=\"\",\"\",'Tex-472-A'!$B$39)","v":"Tex-415-A:SLUMP"},{"$f":"IF('Tex-472-A'!$B$40=\"\",\"\",'Tex-472-A'!$B$40)","v":"Specified slump:"}]
[48,{"$f":"IF('Tex-472-A'!$F$41=\"\",\"\",'Tex-472-A'!$F$41)","v":""},{"$f":"IF('Tex-472-A'!$B$39=\"\",\"\",'Tex-472-A'!$B$39)","v":"Tex-415-A:SLUMP"},{"$f":"IF('Tex-472-A'!$B$41=\"\",\"\",'Tex-472-A'!$B$41)","v":"Slump (in.):"},{"$f":"IF('Tex-472-A'!$F$23=\"\",\"\",'Tex-472-A'!$F$23)","v":"Sample 1"}]
[49,{"$f":"IF('Tex-472-A'!$G$41=\"\",\"\",'Tex-472-A'!$G$41)","v":""},{"$f":"IF('Tex-472-A'!$B$39=\"\",\"\",'Tex-472-A'!$B$39)","v":"Tex-415-A:SLUMP"},{"$f":"IF('Tex-472-A'!$B$41=\"\",\"\",'Tex-472-A'!$B$41)","v":"Slump (in.):"},{"$f":"IF('Tex-472-A'!$G$23=\"\",\"\",'Tex-472-A'!$G$23)","v":"Sample 2"}]
[50,{"$f":"IF('Tex-472-A'!$H$41=\"\",\"\",'Tex-472-A'!$H$41)","v":""},{"$f":"IF('Tex-472-A'!$B$39=\"\",\"\",'Tex-472-A'!$B$39)","v":"Tex-415-A:SLUMP"},{"$f":"IF('Tex-472-A'!$B$41=\"\",\"\",'Tex-472-A'!$B$41)","v":"Slump (in.):"},{"$f":"IF('Tex-472-A'!$H$23=\"\",\"\",'Tex-472-A'!$H$23)","v":"Difference"}]
[51,{"$f":"IF('Tex-472-A'!$I$41=\"\",\"\",'Tex-472-A'!$I$41)","v":""},{"$f":"IF('Tex-472-A'!$B$39=\"\",\"\",'Tex-472-A'!$B$39)","v":"Tex-415-A:SLUMP"},{"$f":"IF('Tex-472-A'!$B$41=\"\",\"\",'Tex-472-A'!$B$41)","v":"Slump (in.):"},{"$f":"IF('Tex-472-A'!$I$23=\"\",\"\",'Tex-472-A'!$I$23)","v":"Meets Uniformity Requirements"}]
[52,{"$f":"IF('Tex-472-A'!$F$43=\"\",\"\",'Tex-472-A'!$F$43)","v":""},{"$f":"IF('Tex-472-A'!$B$42=\"\",\"\",'Tex-472-A'!$B$42)","v":"Tex-418-A:COMPRESSIVE STRENGTH"},{"$f":"IF('Tex-472-A'!$C$43=\"\",\"\",'Tex-472-A'!$C$43)","v":"7-day Average Compressive Strength (psi):"},{"$f":"IF('Tex-472-A'!$F$23=\"\",\"\",'Tex-472-A'!$F$23)","v":"Sample 1"}]
[53,{"$f":"IF('Tex-472-A'!$G$43=\"\",\"\",'Tex-472-A'!$G$43)","v":""},{"$f":"IF('Tex-472-A'!$B$42=\"\",\"\",'Tex-472-A'!$B$42)","v":"Tex-418-A:COMPRESSIVE STRENGTH"},{"$f":"IF('Tex-472-A'!$C$43=\"\",\"\",'Tex-472-A'!$C$43)","v":"7-day Average Compressive Strength (psi):"},{"$f":"IF('Tex-472-A'!$G$23=\"\",\"\",'Tex-472-A'!$G$23)","v":"Sample 2"}]
[54,{"$f":"IF('Tex-472-A'!$H$43=\"\",\"\",'Tex-472-A'!$H$43)","v":""},{"$f":"IF('Tex-472-A'!$B$42=\"\",\"\",'Tex-472-A'!$B$42)","v":"Tex-418-A:COMPRESSIVE STRENGTH"},{"$f":"IF('Tex-472-A'!$C$43=\"\",\"\",'Tex-472-A'!$C$43)","v":"7-day Average Compressive Strength (psi):"},{"$f":"IF('Tex-472-A'!$H$23=\"\",\"\",'Tex-472-A'!$H$23)","v":"Difference"}]
[55,{"$f":"IF('Tex-472-A'!$I$43=\"\",\"\",'Tex-472-A'!$I$43)","v":""},{"$f":"IF('Tex-472-A'!$B$42=\"\",\"\",'Tex-472-A'!$B$42)","v":"Tex-418-A:COMPRESSIVE STRENGTH"},{"$f":"IF('Tex-472-A'!$C$43=\"\",\"\",'Tex-472-A'!$C$43)","v":"7-day Average Compressive Strength (psi):"},{"$f":"IF('Tex-472-A'!$I$23=\"\",\"\",'Tex-472-A'!$I$23)","v":"Meets Uniformity Requirements"}]
[56,{"$f":"IF('Tex-472-A'!$F$45=\"\",\"\",'Tex-472-A'!$F$45)","v":""},{"$f":"IF('Tex-472-A'!$B$44=\"\",\"\",'Tex-472-A'!$B$44)","v":"UNIT WEIGHT OF AIR-FREE MORTAR"},{"$f":"IF('Tex-472-A'!$B$45=\"\",\"\",'Tex-472-A'!$B$45)","v":"Unit Weight of Air-free Mortar (lb/ft³):"},{"$f":"IF('Tex-472-A'!$F$23=\"\",\"\",'Tex-472-A'!$F$23)","v":"Sample 1"}]
[57,{"$f":"IF('Tex-472-A'!$G$45=\"\",\"\",'Tex-472-A'!$G$45)","v":""},{"$f":"IF('Tex-472-A'!$B$44=\"\",\"\",'Tex-472-A'!$B$44)","v":"UNIT WEIGHT OF AIR-FREE MORTAR"},{"$f":"IF('Tex-472-A'!$B$45=\"\",\"\",'Tex-472-A'!$B$45)","v":"Unit Weight of Air-free Mortar (lb/ft³):"},{"$f":"IF('Tex-472-A'!$G$23=\"\",\"\",'Tex-472-A'!$G$23)","v":"Sample 2"}]
[58,{"$f":"IF('Tex-472-A'!$H$45=\"\",\"\",'Tex-472-A'!$H$45)","v":""},{"$f":"IF('Tex-472-A'!$B$44=\"\",\"\",'Tex-472-A'!$B$44)","v":"UNIT WEIGHT OF AIR-FREE MORTAR"},{"$f":"IF('Tex-472-A'!$B$45=\"\",\"\",'Tex-472-A'!$B$45)","v":"Unit Weight of Air-free Mortar (lb/ft³):"},{"$f":"IF('Tex-472-A'!$H$23=\"\",\"\",'Tex-472-A'!$H$23)","v":"Difference"}]
[59,{"$f":"IF('Tex-472-A'!$I$45=\"\",\"\",'Tex-472-A'!$I$45)","v":""},{"$f":"IF('Tex-472-A'!$B$44=\"\",\"\",'Tex-472-A'!$B$44)","v":"UNIT WEIGHT OF AIR-FREE MORTAR"},{"$f":"IF('Tex-472-A'!$B$45=\"\",\"\",'Tex-472-A'!$B$45)","v":"Unit Weight of Air-free Mortar (lb/ft³):"},{"$f":"IF('Tex-472-A'!$I$23=\"\",\"\",'Tex-472-A'!$I$23)","v":"Meets Uniformity Requirements"}]
[60,{"$f":"IF('7-Day Compressive Strength'!$C$25=\"\",\"\",'7-Day Compressive Strength'!$C$25)","v":""},{"$f":"IF('7-Day Compressive Strength'!$B$21=\"\",\"\",'7-Day Compressive Strength'!$B$21)","v":"Test Method Tex-418-A"},{"$f":"IF('7-Day Compressive Strength'!$B$22=\"\",\"\",'7-Day Compressive Strength'!$B$22)","v":"Cylinder Number"},{"$f":"IF('7-Day Compressive Strength'!$B$25=\"\",\"\",'7-Day Compressive Strength'!$B$25)","v":"Sample 1-1"},{"$f":"IF('7-Day Compressive Strength'!$C$23=\"\",\"\",'7-Day Compressive Strength'!$C$23)","v":" of Cylinder (inches)"}]
[61,{"$f":"IF('7-Day Compressive Strength'!$D$25=\"\",\"\",'7-Day Compressive Strength'!$D$25)","v":""},{"$f":"IF('7-Day Compressive Strength'!$B$21=\"\",\"\",'7-Day Compressive Strength'!$B$21)","v":"Test Method Tex-418-A"},{"$f":"IF('7-Day Compressive Strength'!$B$22=\"\",\"\",'7-Day Compressive Strength'!$B$22)","v":"Cylinder Number"},{"$f":"IF('7-Day Compressive Strength'!$B$25=\"\",\"\",'7-Day Compressive Strength'!$B$25)","v":"Sample 1-1"},{"$f":"IF('7-Day Compressive Strength'!$D$22=\"\",\"\",'7-Day Compressive Strength'!$D$22)","v":"Length of Cylinder (inches)"}]
[62,{"$f":"IF('7-Day Compressive Strength'!$E$25=\"\",\"\",'7-Day Compressive Strength'!$E$25)","v":""},{"$f":"IF('7-Day Compressive Strength'!$B$21=\"\",\"\",'7-Day Compressive Strength'!$B$21)","v":"Test Method Tex-418-A"},{"$f":"IF('7-Day Compressive Strength'!$B$22=\"\",\"\",'7-Day Compressive Strength'!$B$22)","v":"Cylinder Number"},{"$f":"IF('7-Day Compressive Strength'!$B$25=\"\",\"\",'7-Day Compressive Strength'!$B$25)","v":"Sample 1-1"},{"$f":"IF('7-Day Compressive Strength'!$E$22=\"\",\"\",'7-Day Compressive Strength'!$E$22)","v":"Length to Diameter Ratio"}]
[63,{"$f":"IF('7-Day Compressive Strength'!$F$25=\"\",\"\",'7-Day Compressive Strength'!$F$25)","v":""},{"$f":"IF('7-Day Compressive Strength'!$B$21=\"\",\"\",'7-Day Compressive Strength'!$B$21)","v":"Test Method Tex-418-A"},{"$f":"IF('7-Day Compressive Strength'!$B$22=\"\",\"\",'7-Day Compressive Strength'!$B$22)","v":"Cylinder Number"},{"$f":"IF('7-Day Compressive Strength'!$B$25=\"\",\"\",'7-Day Compressive Strength'!$B$25)","v":"Sample 1-1"},{"$f":"IF('7-Day Compressive Strength'!$F$22=\"\",\"\",'7-Day Compressive Strength'!$F$22)","v":"Max Load (Lbs.)"}]
[64,{"$f":"IF('7-Day Compressive Strength'!$G$25=\"\",\"\",'7-Day Compressive Strength'!$G$25)","v":""},{"$f":"IF('7-Day Compressive Strength'!$B$21=\"\",\"\",'7-Day Compressive Strength'!$B$21)","v":"Test Method Tex-418-A"},{"$f":"IF('7-Day Compressive Strength'!$B$22=\"\",\"\",'7-Day Compressive Strength'!$B$22)","v":"Cylinder Number"},{"$f":"IF('7-Day Compressive Strength'!$B$25=\"\",\"\",'7-Day Compressive Strength'!$B$25)","v":"Sample 1-1"},{"$f":"IF('7-Day Compressive Strength'!$G$22=\"\",\"\",'7-Day Compressive Strength'!$G$22)","v":"Fracture Type"}]
[65,{"$f":"IF('7-Day Compressive Strength'!$H$25=\"\",\"\",'7-Day Compressive Strength'!$H$25)","v":""},{"$f":"IF('7-Day Compressive Strength'!$B$21=\"\",\"\",'7-Day Compressive Strength'!$B$21)","v":"Test Method Tex-418-A"},{"$f":"IF('7-Day Compressive Strength'!$B$22=\"\",\"\",'7-Day Compressive Strength'!$B$22)","v":"Cylinder Number"},{"$f":"IF('7-Day Compressive Strength'!$B$25=\"\",\"\",'7-Day Compressive Strength'!$B$25)","v":"Sample 1-1"},{"$f":"IF('7-Day Compressive Strength'!$H$22=\"\",\"\",'7-Day Compressive Strength'!$H$22)","v":"Correction Factor"}]
[66,{"$f":"IF('7-Day Compressive Strength'!$I$25=\"\",\"\",'7-Day Compressive Strength'!$I$25)","v":""},{"$f":"IF('7-Day Compressive Strength'!$B$21=\"\",\"\",'7-Day Compressive Strength'!$B$21)","v":"Test Method Tex-418-A"},{"$f":"IF('7-Day Compressive Strength'!$B$22=\"\",\"\",'7-Day Compressive Strength'!$B$22)","v":"Cylinder Number"},{"$f":"IF('7-Day Compressive Strength'!$B$25=\"\",\"\",'7-Day Compressive Strength'!$B$25)","v":"Sample 1-1"},{"$f":"IF('7-Day Compressive Strength'!$I$22=\"\",\"\",'7-Day Compressive Strength'!$I$22)","v":"Compressive Strength (psi)"}]
[67,{"$f":"IF('7-Day Compressive Strength'!$J$25=\"\",\"\",'7-Day Compressive Strength'!$J$25)","v":""},{"$f":"IF('7-Day Compressive Strength'!$B$21=\"\",\"\",'7-Day Compressive Strength'!$B$21)","v":"Test Method Tex-418-A"},{"$f":"IF('7-Day Compressive Strength'!$B$22=\"\",\"\",'7-Day Compressive Strength'!$B$22)","v":"Cylinder Number"},{"$f":"IF('7-Day Compressive Strength'!$B$25=\"\",\"\",'7-Day Compressive Strength'!$B$25)","v":"Sample 1-1"},{"$f":"IF('7-Day Compressive Strength'!$J$22=\"\",\"\",'7-Day Compressive Strength'!$J$22)","v":"Compressive Strength Average (psi)"}]
[68,{"$f":"IF('7-Day Compressive Strength'!$C$26=\"\",\"\",'7-Day Compressive Strength'!$C$26)","v":""},{"$f":"IF('7-Day Compressive Strength'!$B$21=\"\",\"\",'7-Day Compressive Strength'!$B$21)","v":"Test Method Tex-418-A"},{"$f":"IF('7-Day Compressive Strength'!$B$22=\"\",\"\",'7-Day Compressive Strength'!$B$22)","v":"Cylinder Number"},{"$f":"IF('7-Day Compressive Strength'!$B$26=\"\",\"\",'7-Day Compressive Strength'!$B$26)","v":"Sample 1-2"},{"$f":"IF('7-Day Compressive Strength'!$C$23=\"\",\"\",'7-Day Compressive Strength'!$C$23)","v":" of Cylinder (inches)"}]
[69,{"$f":"IF('7-Day Compressive Strength'!$D$26=\"\",\"\",'7-Day Compressive Strength'!$D$26)","v":""},{"$f":"IF('7-Day Compressive Strength'!$B$21=\"\",\"\",'7-Day Compressive Strength'!$B$21)","v":"Test Method Tex-418-A"},{"$f":"IF('7-Day Compressive Strength'!$B$22=\"\",\"\",'7-Day Compressive Strength'!$B$22)","v":"Cylinder Number"},{"$f":"IF('7-Day Compressive Strength'!$B$26=\"\",\"\",'7-Day Compressive Strength'!$B$26)","v":"Sample 1-2"},{"$f":"IF('7-Day Compressive Strength'!$D$22=\"\",\"\",'7-Day Compressive Strength'!$D$22)","v":"Length of Cylinder (inches)"}]
[70,{"$f":"IF('7-Day Compressive Strength'!$E$26=\"\",\"\",'7-Day Compressive Strength'!$E$26)","v":""},{"$f":"IF('7-Day Compressive Strength'!$B$21=\"\",\"\",'7-Day Compressive Strength'!$B$21)","v":"Test Method Tex-418-A"},{"$f":"IF('7-Day Compressive Strength'!$B$22=\"\",\"\",'7-Day Compressive Strength'!$B$22)","v":"Cylinder Number"},{"$f":"IF('7-Day Compressive Strength'!$B$26=\"\",\"\",'7-Day Compressive Strength'!$B$26)","v":"Sample 1-2"},{"$f":"IF('7-Day Compressive Strength'!$E$22=\"\",\"\",'7-Day Compressive Strength'!$E$22)","v":"Length to Diameter Ratio"}]
[71,{"$f":"IF('7-Day Compressive Strength'!$F$26=\"\",\"\",'7-Day Compressive Strength'!$F$26)","v":""},{"$f":"IF('7-Day Compressive Strength'!$B$21=\"\",\"\",'7-Day Compressive Strength'!$B$21)","v":"Test Method Tex-418-A"},{"$f":"IF('7-Day Compressive Strength'!$B$22=\"\",\"\",'7-Day Compressive Strength'!$B$22)","v":"Cylinder Number"},{"$f":"IF('7-Day Compressive Strength'!$B$26=\"\",\"\",'7-Day Compressive Strength'!$B$26)","v":"Sample 1-2"},{"$f":"IF('7-Day Compressive Strength'!$F$22=\"\",\"\",'7-Day Compressive Strength'!$F$22)","v":"Max Load (Lbs.)"}]
[72,{"$f":"IF('7-Day Compressive Strength'!$G$26=\"\",\"\",'7-Day Compressive Strength'!$G$26)","v":""},{"$f":"IF('7-Day Compressive Strength'!$B$21=\"\",\"\",'7-Day Compressive Strength'!$B$21)","v":"Test Method Tex-418-A"},{"$f":"IF('7-Day Compressive Strength'!$B$22=\"\",\"\",'7-Day Compressive Strength'!$B$22)","v":"Cylinder Number"},{"$f":"IF('7-Day Compressive Strength'!$B$26=\"\",\"\",'7-Day Compressive Strength'!$B$26)","v":"Sample 1-2"},{"$f":"IF('7-Day Compressive Strength'!$G$22=\"\",\"\",'7-Day Compressive Strength'!$G$22)","v":"Fracture Type"}]
[73,{"$f":"IF('7-Day Compressive Strength'!$H$26=\"\",\"\",'7-Day Compressive Strength'!$H$26)","v":""},{"$f":"IF('7-Day Compressive Strength'!$B$21=\"\",\"\",'7-Day Compressive Strength'!$B$21)","v":"Test Method Tex-418-A"},{"$f":"IF('7-Day Compressive Strength'!$B$22=\"\",\"\",'7-Day Compressive Strength'!$B$22)","v":"Cylinder Number"},{"$f":"IF('7-Day Compressive Strength'!$B$26=\"\",\"\",'7-Day Compressive Strength'!$B$26)","v":"Sample 1-2"},{"$f":"IF('7-Day Compressive Strength'!$H$22=\"\",\"\",'7-Day Compressive Strength'!$H$22)","v":"Correction Factor"}]
[74,{"$f":"IF('7-Day Compressive Strength'!$I$26=\"\",\"\",'7-Day Compressive Strength'!$I$26)","v":""},{"$f":"IF('7-Day Compressive Strength'!$B$21=\"\",\"\",'7-Day Compressive Strength'!$B$21)","v":"Test Method Tex-418-A"},{"$f":"IF('7-Day Compressive Strength'!$B$22=\"\",\"\",'7-Day Compressive Strength'!$B$22)","v":"Cylinder Number"},{"$f":"IF('7-Day Compressive Strength'!$B$26=\"\",\"\",'7-Day Compressive Strength'!$B$26)","v":"Sample 1-2"},{"$f":"IF('7-Day Compressive Strength'!$I$22=\"\",\"\",'7-Day Compressive Strength'!$I$22)","v":"Compressive Strength (psi)"}]
[75,{"$f":"IF('7-Day Compressive Strength'!$C$27=\"\",\"\",'7-Day Compressive Strength'!$C$27)","v":""},{"$f":"IF('7-Day Compressive Strength'!$B$21=\"\",\"\",'7-Day Compressive Strength'!$B$21)","v":"Test Method Tex-418-A"},{"$f":"IF('7-Day Compressive Strength'!$B$22=\"\",\"\",'7-Day Compressive Strength'!$B$22)","v":"Cylinder Number"},{"$f":"IF('7-Day Compressive Strength'!$B$27=\"\",\"\",'7-Day Compressive Strength'!$B$27)","v":"Sample 1-3"},{"$f":"IF('7-Day Compressive Strength'!$C$23=\"\",\"\",'7-Day Compressive Strength'!$C$23)","v":" of Cylinder (inches)"}]
[76,{"$f":"IF('7-Day Compressive Strength'!$D$27=\"\",\"\",'7-Day Compressive Strength'!$D$27)","v":""},{"$f":"IF('7-Day Compressive Strength'!$B$21=\"\",\"\",'7-Day Compressive Strength'!$B$21)","v":"Test Method Tex-418-A"},{"$f":"IF('7-Day Compressive Strength'!$B$22=\"\",\"\",'7-Day Compressive Strength'!$B$22)","v":"Cylinder Number"},{"$f":"IF('7-Day Compressive Strength'!$B$27=\"\",\"\",'7-Day Compressive Strength'!$B$27)","v":"Sample 1-3"},{"$f":"IF('7-Day Compressive Strength'!$D$22=\"\",\"\",'7-Day Compressive Strength'!$D$22)","v":"Length of Cylinder (inches)"}]
[77,{"$f":"IF('7-Day Compressive Strength'!$E$27=\"\",\"\",'7-Day Compressive Strength'!$E$27)","v":""},{"$f":"IF('7-Day Compressive Strength'!$B$21=\"\",\"\",'7-Day Compressive Strength'!$B$21)","v":"Test Method Tex-418-A"},{"$f":"IF('7-Day Compressive Strength'!$B$22=\"\",\"\",'7-Day Compressive Strength'!$B$22)","v":"Cylinder Number"},{"$f":"IF('7-Day Compressive Strength'!$B$27=\"\",\"\",'7-Day Compressive Strength'!$B$27)","v":"Sample 1-3"},{"$f":"IF('7-Day Compressive Strength'!$E$22=\"\",\"\",'7-Day Compressive Strength'!$E$22)","v":"Length to Diameter Ratio"}]
[78,{"$f":"IF('7-Day Compressive Strength'!$F$27=\"\",\"\",'7-Day Compressive Strength'!$F$27)","v":""},{"$f":"IF('7-Day Compressive Strength'!$B$21=\"\",\"\",'7-Day Compressive Strength'!$B$21)","v":"Test Method Tex-418-A"},{"$f":"IF('7-Day Compressive Strength'!$B$22=\"\",\"\",'7-Day Compressive Strength'!$B$22)","v":"Cylinder Number"},{"$f":"IF('7-Day Compressive Strength'!$B$27=\"\",\"\",'7-Day Compressive Strength'!$B$27)","v":"Sample 1-3"},{"$f":"IF('7-Day Compressive Strength'!$F$22=\"\",\"\",'7-Day Compressive Strength'!$F$22)","v":"Max Load (Lbs.)"}]
[79,{"$f":"IF('7-Day Compressive Strength'!$G$27=\"\",\"\",'7-Day Compressive Strength'!$G$27)","v":""},{"$f":"IF('7-Day Compressive Strength'!$B$21=\"\",\"\",'7-Day Compressive Strength'!$B$21)","v":"Test Method Tex-418-A"},{"$f":"IF('7-Day Compressive Strength'!$B$22=\"\",\"\",'7-Day Compressive Strength'!$B$22)","v":"Cylinder Number"},{"$f":"IF('7-Day Compressive Strength'!$B$27=\"\",\"\",'7-Day Compressive Strength'!$B$27)","v":"Sample 1-3"},{"$f":"IF('7-Day Compressive Strength'!$G$22=\"\",\"\",'7-Day Compressive Strength'!$G$22)","v":"Fracture Type"}]
[80,{"$f":"IF('7-Day Compressive Strength'!$H$27=\"\",\"\",'7-Day Compressive Strength'!$H$27)","v":""},{"$f":"IF('7-Day Compressive Strength'!$B$21=\"\",\"\",'7-Day Compressive Strength'!$B$21)","v":"Test Method Tex-418-A"},{"$f":"IF('7-Day Compressive Strength'!$B$22=\"\",\"\",'7-Day Compressive Strength'!$B$22)","v":"Cylinder Number"},{"$f":"IF('7-Day Compressive Strength'!$B$27=\"\",\"\",'7-Day Compressive Strength'!$B$27)","v":"Sample 1-3"},{"$f":"IF('7-Day Compressive Strength'!$H$22=\"\",\"\",'7-Day Compressive Strength'!$H$22)","v":"Correction Factor"}]
[81,{"$f":"IF('7-Day Compressive Strength'!$I$27=\"\",\"\",'7-Day Compressive Strength'!$I$27)","v":""},{"$f":"IF('7-Day Compressive Strength'!$B$21=\"\",\"\",'7-Day Compressive Strength'!$B$21)","v":"Test Method Tex-418-A"},{"$f":"IF('7-Day Compressive Strength'!$B$22=\"\",\"\",'7-Day Compressive Strength'!$B$22)","v":"Cylinder Number"},{"$f":"IF('7-Day Compressive Strength'!$B$27=\"\",\"\",'7-Day Compressive Strength'!$B$27)","v":"Sample 1-3"},{"$f":"IF('7-Day Compressive Strength'!$I$22=\"\",\"\",'7-Day Compressive Strength'!$I$22)","v":"Compressive Strength (psi)"}]
[82,{"$f":"IF('7-Day Compressive Strength'!$C$28=\"\",\"\",'7-Day Compressive Strength'!$C$28)","v":""},{"$f":"IF('7-Day Compressive Strength'!$B$21=\"\",\"\",'7-Day Compressive Strength'!$B$21)","v":"Test Method Tex-418-A"},{"$f":"IF('7-Day Compressive Strength'!$B$22=\"\",\"\",'7-Day Compressive Strength'!$B$22)","v":"Cylinder Number"},{"$f":"IF('7-Day Compressive Strength'!$B$28=\"\",\"\",'7-Day Compressive Strength'!$B$28)","v":"Sample 2-1"},{"$f":"IF('7-Day Compressive Strength'!$C$23=\"\",\"\",'7-Day Compressive Strength'!$C$23)","v":" of Cylinder (inches)"}]
[83,{"$f":"IF('7-Day Compressive Strength'!$D$28=\"\",\"\",'7-Day Compressive Strength'!$D$28)","v":""},{"$f":"IF('7-Day Compressive Strength'!$B$21=\"\",\"\",'7-Day Compressive Strength'!$B$21)","v":"Test Method Tex-418-A"},{"$f":"IF('7-Day Compressive Strength'!$B$22=\"\",\"\",'7-Day Compressive Strength'!$B$22)","v":"Cylinder Number"},{"$f":"IF('7-Day Compressive Strength'!$B$28=\"\",\"\",'7-Day Compressive Strength'!$B$28)","v":"Sample 2-1"},{"$f":"IF('7-Day Compressive Strength'!$D$22=\"\",\"\",'7-Day Compressive Strength'!$D$22)","v":"Length of Cylinder (inches)"}]
[84,{"$f":"IF('7-Day Compressive Strength'!$E$28=\"\",\"\",'7-Day Compressive Strength'!$E$28)","v":""},{"$f":"IF('7-Day Compressive Strength'!$B$21=\"\",\"\",'7-Day Compressive Strength'!$B$21)","v":"Test Method Tex-418-A"},{"$f":"IF('7-Day Compressive Strength'!$B$22=\"\",\"\",'7-Day Compressive Strength'!$B$22)","v":"Cylinder Number"},{"$f":"IF('7-Day Compressive Strength'!$B$28=\"\",\"\",'7-Day Compressive Strength'!$B$28)","v":"Sample 2-1"},{"$f":"IF('7-Day Compressive Strength'!$E$22=\"\",\"\",'7-Day Compressive Strength'!$E$22)","v":"Length to Diameter Ratio"}]
[85,{"$f":"IF('7-Day Compressive Strength'!$F$28=\"\",\"\",'7-Day Compressive Strength'!$F$28)","v":""},{"$f":"IF('7-Day Compressive Strength'!$B$21=\"\",\"\",'7-Day Compressive Strength'!$B$21)","v":"Test Method Tex-418-A"},{"$f":"IF('7-Day Compressive Strength'!$B$22=\"\",\"\",'7-Day Compressive Strength'!$B$22)","v":"Cylinder Number"},{"$f":"IF('7-Day Compressive Strength'!$B$28=\"\",\"\",'7-Day Compressive Strength'!$B$28)","v":"Sample 2-1"},{"$f":"IF('7-Day Compressive Strength'!$F$22=\"\",\"\",'7-Day Compressive Strength'!$F$22)","v":"Max Load (Lbs.)"}]
[86,{"$f":"IF('7-Day Compressive Strength'!$G$28=\"\",\"\",'7-Day Compressive Strength'!$G$28)","v":""},{"$f":"IF('7-Day Compressive Strength'!$B$21=\"\",\"\",'7-Day Compressive Strength'!$B$21)","v":"Test Method Tex-418-A"},{"$f":"IF('7-Day Compressive Strength'!$B$22=\"\",\"\",'7-Day Compressive Strength'!$B$22)","v":"Cylinder Number"},{"$f":"IF('7-Day Compressive Strength'!$B$28=\"\",\"\",'7-Day Compressive Strength'!$B$28)","v":"Sample 2-1"},{"$f":"IF('7-Day Compressive Strength'!$G$22=\"\",\"\",'7-Day Compressive Strength'!$G$22)","v":"Fracture Type"}]
[87,{"$f":"IF('7-Day Compressive Strength'!$H$28=\"\",\"\",'7-Day Compressive Strength'!$H$28)","v":""},{"$f":"IF('7-Day Compressive Strength'!$B$21=\"\",\"\",'7-Day Compressive Strength'!$B$21)","v":"Test Method Tex-418-A"},{"$f":"IF('7-Day Compressive Strength'!$B$22=\"\",\"\",'7-Day Compressive Strength'!$B$22)","v":"Cylinder Number"},{"$f":"IF('7-Day Compressive Strength'!$B$28=\"\",\"\",'7-Day Compressive Strength'!$B$28)","v":"Sample 2-1"},{"$f":"IF('7-Day Compressive Strength'!$H$22=\"\",\"\",'7-Day Compressive Strength'!$H$22)","v":"Correction Factor"}]
[88,{"$f":"IF('7-Day Compressive Strength'!$I$28=\"\",\"\",'7-Day Compressive Strength'!$I$28)","v":""},{"$f":"IF('7-Day Compressive Strength'!$B$21=\"\",\"\",'7-Day Compressive Strength'!$B$21)","v":"Test Method Tex-418-A"},{"$f":"IF('7-Day Compressive Strength'!$B$22=\"\",\"\",'7-Day Compressive Strength'!$B$22)","v":"Cylinder Number"},{"$f":"IF('7-Day Compressive Strength'!$B$28=\"\",\"\",'7-Day Compressive Strength'!$B$28)","v":"Sample 2-1"},{"$f":"IF('7-Day Compressive Strength'!$I$22=\"\",\"\",'7-Day Compressive Strength'!$I$22)","v":"Compressive Strength (psi)"}]
[89,{"$f":"IF('7-Day Compressive Strength'!$J$28=\"\",\"\",'7-Day Compressive Strength'!$J$28)","v":""},{"$f":"IF('7-Day Compressive Strength'!$B$21=\"\",\"\",'7-Day Compressive Strength'!$B$21)","v":"Test Method Tex-418-A"},{"$f":"IF('7-Day Compressive Strength'!$B$22=\"\",\"\",'7-Day Compressive Strength'!$B$22)","v":"Cylinder Number"},{"$f":"IF('7-Day Compressive Strength'!$B$28=\"\",\"\",'7-Day Compressive Strength'!$B$28)","v":"Sample 2-1"},{"$f":"IF('7-Day Compressive Strength'!$J$22=\"\",\"\",'7-Day Compressive Strength'!$J$22)","v":"Compressive Strength Average (psi)"}]
[90,{"$f":"IF('7-Day Compressive Strength'!$C$29=\"\",\"\",'7-Day Compressive Strength'!$C$29)","v":""},{"$f":"IF('7-Day Compressive Strength'!$B$21=\"\",\"\",'7-Day Compressive Strength'!$B$21)","v":"Test Method Tex-418-A"},{"$f":"IF('7-Day Compressive Strength'!$B$22=\"\",\"\",'7-Day Compressive Strength'!$B$22)","v":"Cylinder Number"},{"$f":"IF('7-Day Compressive Strength'!$B$29=\"\",\"\",'7-Day Compressive Strength'!$B$29)","v":"Sample 2-2"},{"$f":"IF('7-Day Compressive Strength'!$C$23=\"\",\"\",'7-Day Compressive Strength'!$C$23)","v":" of Cylinder (inches)"}]
[91,{"$f":"IF('7-Day Compressive Strength'!$D$29=\"\",\"\",'7-Day Compressive Strength'!$D$29)","v":""},{"$f":"IF('7-Day Compressive Strength'!$B$21=\"\",\"\",'7-Day Compressive Strength'!$B$21)","v":"Test Method Tex-418-A"},{"$f":"IF('7-Day Compressive Strength'!$B$22=\"\",\"\",'7-Day Compressive Strength'!$B$22)","v":"Cylinder Number"},{"$f":"IF('7-Day Compressive Strength'!$B$29=\"\",\"\",'7-Day Compressive Strength'!$B$29)","v":"Sample 2-2"},{"$f":"IF('7-Day Compressive Strength'!$D$22=\"\",\"\",'7-Day Compressive Strength'!$D$22)","v":"Length of Cylinder (inches)"}]
[92,{"$f":"IF('7-Day Compressive Strength'!$E$29=\"\",\"\",'7-Day Compressive Strength'!$E$29)","v":""},{"$f":"IF('7-Day Compressive Strength'!$B$21=\"\",\"\",'7-Day Compressive Strength'!$B$21)","v":"Test Method Tex-418-A"},{"$f":"IF('7-Day Compressive Strength'!$B$22=\"\",\"\",'7-Day Compressive Strength'!$B$22)","v":"Cylinder Number"},{"$f":"IF('7-Day Compressive Strength'!$B$29=\"\",\"\",'7-Day Compressive Strength'!$B$29)","v":"Sample 2-2"},{"$f":"IF('7-Day Compressive Strength'!$E$22=\"\",\"\",'7-Day Compressive Strength'!$E$22)","v":"Length to Diameter Ratio"}]
[93,{"$f":"IF('7-Day Compressive Strength'!$F$29=\"\",\"\",'7-Day Compressive Strength'!$F$29)","v":""},{"$f":"IF('7-Day Compressive Strength'!$B$21=\"\",\"\",'7-Day Compressive Strength'!$B$21)","v":"Test Method Tex-418-A"},{"$f":"IF('7-Day Compressive Strength'!$B$22=\"\",\"\",'7-Day Compressive Strength'!$B$22)","v":"Cylinder Number"},{"$f":"IF('7-Day Compressive Strength'!$B$29=\"\",\"\",'7-Day Compressive Strength'!$B$29)","v":"Sample 2-2"},{"$f":"IF('7-Day Compressive Strength'!$F$22=\"\",\"\",'7-Day Compressive Strength'!$F$22)","v":"Max Load (Lbs.)"}]
[94,{"$f":"IF('7-Day Compressive Strength'!$G$29=\"\",\"\",'7-Day Compressive Strength'!$G$29)","v":""},{"$f":"IF('7-Day Compressive Strength'!$B$21=\"\",\"\",'7-Day Compressive Strength'!$B$21)","v":"Test Method Tex-418-A"},{"$f":"IF('7-Day Compressive Strength'!$B$22=\"\",\"\",'7-Day Compressive Strength'!$B$22)","v":"Cylinder Number"},{"$f":"IF('7-Day Compressive Strength'!$B$29=\"\",\"\",'7-Day Compressive Strength'!$B$29)","v":"Sample 2-2"},{"$f":"IF('7-Day Compressive Strength'!$G$22=\"\",\"\",'7-Day Compressive Strength'!$G$22)","v":"Fracture Type"}]
[95,{"$f":"IF('7-Day Compressive Strength'!$H$29=\"\",\"\",'7-Day Compressive Strength'!$H$29)","v":""},{"$f":"IF('7-Day Compressive Strength'!$B$21=\"\",\"\",'7-Day Compressive Strength'!$B$21)","v":"Test Method Tex-418-A"},{"$f":"IF('7-Day Compressive Strength'!$B$22=\"\",\"\",'7-Day Compressive Strength'!$B$22)","v":"Cylinder Number"},{"$f":"IF('7-Day Compressive Strength'!$B$29=\"\",\"\",'7-Day Compressive Strength'!$B$29)","v":"Sample 2-2"},{"$f":"IF('7-Day Compressive Strength'!$H$22=\"\",\"\",'7-Day Compressive Strength'!$H$22)","v":"Correction Factor"}]
[96,{"$f":"IF('7-Day Compressive Strength'!$I$29=\"\",\"\",'7-Day Compressive Strength'!$I$29)","v":""},{"$f":"IF('7-Day Compressive Strength'!$B$21=\"\",\"\",'7-Day Compressive Strength'!$B$21)","v":"Test Method Tex-418-A"},{"$f":"IF('7-Day Compressive Strength'!$B$22=\"\",\"\",'7-Day Compressive Strength'!$B$22)","v":"Cylinder Number"},{"$f":"IF('7-Day Compressive Strength'!$B$29=\"\",\"\",'7-Day Compressive Strength'!$B$29)","v":"Sample 2-2"},{"$f":"IF('7-Day Compressive Strength'!$I$22=\"\",\"\",'7-Day Compressive Strength'!$I$22)","v":"Compressive Strength (psi)"}]
[97,{"$f":"IF('7-Day Compressive Strength'!$C$30=\"\",\"\",'7-Day Compressive Strength'!$C$30)","v":""},{"$f":"IF('7-Day Compressive Strength'!$B$21=\"\",\"\",'7-Day Compressive Strength'!$B$21)","v":"Test Method Tex-418-A"},{"$f":"IF('7-Day Compressive Strength'!$B$22=\"\",\"\",'7-Day Compressive Strength'!$B$22)","v":"Cylinder Number"},{"$f":"IF('7-Day Compressive Strength'!$B$30=\"\",\"\",'7-Day Compressive Strength'!$B$30)","v":"Sample 2-3"},{"$f":"IF('7-Day Compressive Strength'!$C$23=\"\",\"\",'7-Day Compressive Strength'!$C$23)","v":" of Cylinder (inches)"}]
[98,{"$f":"IF('7-Day Compressive Strength'!$D$30=\"\",\"\",'7-Day Compressive Strength'!$D$30)","v":""},{"$f":"IF('7-Day Compressive Strength'!$B$21=\"\",\"\",'7-Day Compressive Strength'!$B$21)","v":"Test Method Tex-418-A"},{"$f":"IF('7-Day Compressive Strength'!$B$22=\"\",\"\",'7-Day Compressive Strength'!$B$22)","v":"Cylinder Number"},{"$f":"IF('7-Day Compressive Strength'!$B$30=\"\",\"\",'7-Day Compressive Strength'!$B$30)","v":"Sample 2-3"},{"$f":"IF('7-Day Compressive Strength'!$D$22=\"\",\"\",'7-Day Compressive Strength'!$D$22)","v":"Length of Cylinder (inches)"}]
[99,{"$f":"IF('7-Day Compressive Strength'!$E$30=\"\",\"\",'7-Day Compressive Strength'!$E$30)","v":""},{"$f":"IF('7-Day Compressive Strength'!$B$21=\"\",\"\",'7-Day Compressive Strength'!$B$21)","v":"Test Method Tex-418-A"},{"$f":"IF('7-Day Compressive Strength'!$B$22=\"\",\"\",'7-Day Compressive Strength'!$B$22)","v":"Cylinder Number"},{"$f":"IF('7-Day Compressive Strength'!$B$30=\"\",\"\",'7-Day Compressive Strength'!$B$30)","v":"Sample 2-3"},{"$f":"IF('7-Day Compressive Strength'!$E$22=\"\",\"\",'7-Day Compressive Strength'!$E$22)","v":"Length to Diameter Ratio"}]
[100,{"$f":"IF('7-Day Compressive Strength'!$F$30=\"\",\"\",'7-Day Compressive Strength'!$F$30)","v":""},{"$f":"IF('7-Day Compressive Strength'!$B$21=\"\",\"\",'7-Day Compressive Strength'!$B$21)","v":"Test Method Tex-418-A"},{"$f":"IF('7-Day Compressive Strength'!$B$22=\"\",\"\",'7-Day Compressive Strength'!$B$22)","v":"Cylinder Number"},{"$f":"IF('7-Day Compressive Strength'!$B$30=\"\",\"\",'7-Day Compressive Strength'!$B$30)","v":"Sample 2-3"},{"$f":"IF('7-Day Compressive Strength'!$F$22=\"\",\"\",'7-Day Compressive Strength'!$F$22)","v":"Max Load (Lbs.)"}]
[101,{"$f":"IF('7-Day Compressive Strength'!$G$30=\"\",\"\",'7-Day Compressive Strength'!$G$30)","v":""},{"$f":"IF('7-Day Compressive Strength'!$B$21=\"\",\"\",'7-Day Compressive Strength'!$B$21)","v":"Test Method Tex-418-A"},{"$f":"IF('7-Day Compressive Strength'!$B$22=\"\",\"\",'7-Day Compressive Strength'!$B$22)","v":"Cylinder Number"},{"$f":"IF('7-Day Compressive Strength'!$B$30=\"\",\"\",'7-Day Compressive Strength'!$B$30)","v":"Sample 2-3"},{"$f":"IF('7-Day Compressive Strength'!$G$22=\"\",\"\",'7-Day Compressive Strength'!$G$22)","v":"Fracture Type"}]
[102,{"$f":"IF('7-Day Compressive Strength'!$H$30=\"\",\"\",'7-Day Compressive Strength'!$H$30)","v":""},{"$f":"IF('7-Day Compressive Strength'!$B$21=\"\",\"\",'7-Day Compressive Strength'!$B$21)","v":"Test Method Tex-418-A"},{"$f":"IF('7-Day Compressive Strength'!$B$22=\"\",\"\",'7-Day Compressive Strength'!$B$22)","v":"Cylinder Number"},{"$f":"IF('7-Day Compressive Strength'!$B$30=\"\",\"\",'7-Day Compressive Strength'!$B$30)","v":"Sample 2-3"},{"$f":"IF('7-Day Compressive Strength'!$H$22=\"\",\"\",'7-Day Compressive Strength'!$H$22)","v":"Correction Factor"}]
[103,{"$f":"IF('7-Day Compressive Strength'!$I$30=\"\",\"\",'7-Day Compressive Strength'!$I$30)","v":""},{"$f":"IF('7-Day Compressive Strength'!$B$21=\"\",\"\",'7-Day Compressive Strength'!$B$21)","v":"Test Method Tex-418-A"},{"$f":"IF('7-Day Compressive Strength'!$B$22=\"\",\"\",'7-Day Compressive Strength'!$B$22)","v":"Cylinder Number"},{"$f":"IF('7-Day Compressive Strength'!$B$30=\"\",\"\",'7-Day Compressive Strength'!$B$30)","v":"Sample 2-3"},{"$f":"IF('7-Day Compressive Strength'!$I$22=\"\",\"\",'7-Day Compressive Strength'!$I$22)","v":"Compressive Strength (psi)"}]
[104,{"$f":"IF('Tex-472-A'!$C$57=\"\",\"\",'Tex-472-A'!$C$57)","v":" "},"Sampled By ",{"$f":"IF('Tex-472-A'!$B$57=\"\",\"\",'Tex-472-A'!$B$57)","v":"TX407"}]
[105,{"$f":"IF('Tex-472-A'!$F$57=\"\",\"\",'Tex-472-A'!$F$57)","v":" "},"Sampled Date ",{"$f":"IF('Tex-472-A'!$B$57=\"\",\"\",'Tex-472-A'!$B$57)","v":"TX407"}]
[106,{"$f":"IF(ISBLANK('7-Day Compressive Strength'!J31), \"\", '7-Day Compressive Strength'!J31)","v":""},{"$f":"'7-Day Compressive Strength'!B21","v":"Test Method Tex-418-A"},{"$f":"'7-Day Compressive Strength'!J22","v":"Compressive Strength Average (psi)"},{"$f":"'7-Day Compressive Strength'!G31","v":"Difference"}]
[107,{"$f":"IF(ISBLANK('7-Day Compressive Strength'!J32), \"\", '7-Day Compressive Strength'!J32)","v":""},{"$f":"'7-Day Compressive Strength'!B21","v":"Test Method Tex-418-A"},{"$f":"'7-Day Compressive Strength'!J22","v":"Compressive Strength Average (psi)"},{"$f":"'7-Day Compressive Strength'!G32","v":"Difference, %"}]
[108,{"$f":"IF(ISBLANK('7-Day Compressive Strength'!J33), \"\", '7-Day Compressive Strength'!J33)","v":""},{"$f":"'7-Day Compressive Strength'!B21","v":"Test Method Tex-418-A"},{"$f":"'7-Day Compressive Strength'!J22","v":"Compressive Strength Average (psi)"},{"$f":"'7-Day Compressive Strength'!G33","v":"Meets Uniformity Requirements"}]

{"sheet":"Hidden Tables","index":3,"n_rows":110,"n_cols":8,"rows_kept":110,"cut":false,"hidden":false,"merged":[[23,0,23,2],[24,0,24,2],[25,0,25,2],[2,3,3,3],[1,0,1,3],[16,0,16,3],[21,0,21,2],[22,0,22,2],[18,0,18,2],[19,0,19,2],[20,0,20,2],[17,0,17,2],[2,0,2,2]]}
[]
["Tex-414-A Correction Factor Table",null,null,null,null,null,"Length to Diameter Ratio","Correction Factor"]
["70% Isopropyl Alcohol Used",null,null,"Correction Factor",null,null,1,0.87]
["Pints","Ounces","Liters",null,null,null,1.01,0.872]
[0.5,8,0.2,0,null,null,1.02,0.875]
[1,16,0.5,0,null,null,1.03,0.877]
[1.5,24,0.7,0,null,null,1.04,0.88]
[2,32,0.9,0,null,null,1.05,0.88200000000000001]
[2.5,40,1.2,0.15,null,null,1.06,0.88400000000000001]
[3,48,1.4,0.3,null,null,1.07,0.88700000000000001]
[3.5,56,1.7,0.45,null,null,1.08,0.88900000000000001]
[4,64,1.9,0.6,null,null,1.0900000000000001,0.89200000000000002]
[4.5,72,2.1,0.75,null,null,1.1000000000000001,0.89400000000000002]
[5,80,2.4,0.9,null,null,1.1100000000000001,0.89600000000000002]
[null,null,null,null,null,null,1.1200000000000001,0.89900000000000002]
[null,null,null,null,null,null,1.1299999999999999,0.90100000000000002]
["Uniformity Requirements",null,null,null,null,null,1.1399999999999999,0.90400000000000003]
["Property",null,null,"English","Metric",null,1.1599999999999999,0.90800000000000003]
["Unit Weight of Concrete",null,null,1,16,null,1.17,0.91100000000000003]
["Air Content",null,null,1,1,null,1.18,0.91300000000000003]
["Slump",null,null,null,null,null,1.19,0.91600000000000004]
["4 in. or less",null,null,1,25,null,1.2,0.91800000000000004]
["greater than 4 in. and up to 6 in.",null,null,1.5,40,null,1.21,0.92]
["Coarse Aggregate Content",null,null,6,6,null,1.22,0.92300000000000004]
["Unit Weight of the Air-free Mortar (%)",null,null,1.6E-2,1.6,null,1.23,0.92500000000000004]
["7-day Compressive Strength (%)",null,null,7.4999999999999997E-2,7.5,null,1.24,0.92800000000000005]
[null,null,null,null,null,null,1.27,0.93200000000000005]
[null,null,null,null,null,null,1.28,0.93300000000000005]
[null,null,null,null,null,null,1.29,0.93400000000000005]
[null,null,null,null,null,null,1.3,0.93600000000000005]
[null,null,null,null,null,null,1.31,0.93700000000000006]
[null,null,null,null,null,null,1.32,0.93799999999999994]
[null,null,null,null,null,null,1.33,0.93899999999999995]
[null,null,null,null,null,null,1.34,0.94]
[null,null,null,null,null,null,1.35,0.94199999999999995]
[null,null,null,null,null,null,1.36,0.94299999999999995]
[null,null,null,null,null,null,1.37,0.94399999999999995]
[null,null,null,null,null,null,1.38,0.94499999999999995]
[null,null,null,null,null,null,1.39,0.94599999999999995]
[null,null,null,null,null,null,1.4,0.94799999999999995]
[null,null,null,null,null,null,1.41,0.94899999999999995]
[null,null,null,null,null,null,1.42,0.95]
[null,null,null,null,null,null,1.43,0.95099999999999996]
[null,null,null,null,null,null,1.44,0.95199999999999996]
[null,null,null,null,null,null,1.45,0.95399999999999996]
[null,null,null,null,null,null,1.46,0.95499999999999996]
[null,null,null,null,null,null,1.47,0.95599999999999996]
[null,null,null,null,null,null,1.48,0.95699999999999996]
[null,null,null,null,null,null,1.49,0.95799999999999996]
[null,null,null,null,null,null,1.5,0.96]
[null,null,null,null,null,null,1.51,0.96099999999999997]
[null,null,null,null,null,null,1.52,0.96199999999999997]
[null,null,null,null,null,null,1.53,0.96199999999999997]
[null,null,null,null,null,null,1.54,0.96299999999999997]
[null,null,null,null,null,null,1.55,0.96399999999999997]
[null,null,null,null,null,null,1.56,0.96499999999999997]
[null,null,null,null,null,null,1.57,0.96599999999999997]
[null,null,null,null,null,null,1.58,0.96599999999999997]
[null,null,null,null,null,null,1.59,0.96699999999999997]
[null,null,null,null,null,null,1.6,0.96799999999999997]
[null,null,null,null,null,null,1.61,0.96899999999999997]
[null,null,null,null,null,null,1.62,0.97]
[null,null,null,null,null,null,1.63,0.97]
[null,null,null,null,null,null,1.64,0.97099999999999997]
[null,null,null,null,null,null,1.65,0.97199999999999998]
[null,null,null,null,null,null,1.66,0.97299999999999998]
[null,null,null,null,null,null,1.67,0.97399999999999998]
[null,null,null,null,null,null,1.68,0.97399999999999998]
[null,null,null,null,null,null,1.69,0.97499999999999998]
[null,null,null,null,null,null,1.7,0.97599999999999998]
[null,null,null,null,null,null,1.71,0.97699999999999998]
[null,null,null,null,null,null,1.72,0.97799999999999998]
[null,null,null,null,null,null,1.73,0.97799999999999998]
[null,null,null,null,null,null,1.74,0.97899999999999998]
[null,null,null,null,null,null,1.75,0.98]
[null,null,null,null,null,null,1.76,0.98099999999999998]
[null,null,null,null,null,null,1.77,0.98199999999999998]
[null,null,null,null,null,null,1.78,0.98199999999999998]
[null,null,null,null,null,null,1.79,0.98299999999999998]
[null,null,null,null,null,null,1.8,0.98399999999999999]
[null,null,null,null,null,null,1.81,0.98499999999999999]
[null,null,null,null,null,null,1.82,0.98599999999999999]
[null,null,null,null,null,null,1.83,0.98599999999999999]
[null,null,null,null,null,null,1.84,0.98699999999999999]
[null,null,null,null,null,null,1.85,0.98799999999999999]
[null,null,null,null,null,null,1.86,0.98899999999999999]
[null,null,null,null,null,null,1.87,0.99]
[null,null,null,null,null,null,1.88,0.99]
[null,null,null,null,null,null,1.89,0.99099999999999999]
[null,null,null,null,null,null,1.9,0.99199999999999999]
[null,null,null,null,null,null,1.91,0.99299999999999999]
[null,null,null,null,null,null,1.92,0.99399999999999999]
[null,null,null,null,null,null,1.93,0.99399999999999999]
[null,null,null,null,null,null,1.94,0.995]
[null,null,null,null,null,null,1.95,1]
[null,null,null,null,null,null,1.96,1]
[null,null,null,null,null,null,1.97,1]
[null,null,null,null,null,null,1.98,1]
[null,null,null,null,null,null,1.99,1]
[null,null,null,null,null,null,2,1]
[null,null,null,null,null,null,2.0099999999999998,1]
[null,null,null,null,null,null,2.02,1]
[null,null,null,null,null,null,2.0299999999999998,1]
[null,null,null,null,null,null,2.04,1]
[null,null,null,null,null,null,2.0499999999999998,1]
[null,null,null,null,null,null,2.06,1]
[null,null,null,null,null,null,2.0699999999999998,1]
[null,null,null,null,null,null,2.08,1]
[null,null,null,null,null,null,2.09,1]
[null,null,null,null,null,null,2.1,1]