{"text_format":"1","workbook":"xlsx","n_sheets":4,"sheets":["Tex-418-A","RX","Revisions","L to D Lookup"],"not_rendered":{"charts":0,"images":1,"macros":1,"external_links":0,"defined_names":172,"comments":2,"pivot_tables":0},"unopened":[],"bounds":{"document_bytes":16777216,"sheet_cells":100000,"rows_first":2000,"rows_last":500,"rows_between":2000,"halvings":0,"cell_chars":16384,"cell_head_chars":4096},"cells_cut":0,"cells_raw":0,"read":"whole","date_system":"1900"}

{"sheet":"Tex-418-A","index":0,"n_rows":60,"n_cols":18,"rows_kept":60,"cut":false,"hidden":false,"merged":[[55,10,55,12],[23,1,23,14],[36,1,39,1],[40,1,43,1],[29,1,31,1],[42,4,43,4],[40,5,41,5],[29,4,31,4],[32,4,33,4],[34,5,35,5],[29,11,30,11],[38,5,39,5],[29,13,31,13],[45,1,46,16],[32,1,35,1],[32,16,33,16],[29,17,31,18],[32,17,35,18],[36,17,39,18],[40,17,43,18],[32,2,35,2],[36,2,39,2],[40,2,43,2],[42,5,43,5],[29,12,31,12],[29,16,31,16],[29,15,30,15],[32,15,33,15],[29,10,31,10],[29,9,30,9],[29,5,31,5],[29,14,30,14],[14,12,14,14],[13,5,13,8],[14,5,14,8],[19,9,19,10],[19,13,19,14],[17,12,17,14],[16,5,16,14],[17,5,17,8],[13,12,13,14],[19,7,19,8],[19,5,19,6],[15,5,15,14],[0,0,0,3],[8,12,8,14],[9,12,9,14],[12,5,12,8],[10,5,10,8],[11,5,11,8],[10,12,10,14],[11,12,11,14],[12,12,12,14],[8,5,8,8],[9,5,9,8],[22,1,22,14],[59,1,59,8],[38,4,39,4],[40,4,41,4],[34,4,35,4],[29,3,31,3],[29,2,31,2],[32,3,35,3],[36,4,37,4],[36,3,39,3],[29,7,31,7],[36,5,37,5],[57,1,57,2],[55,1,55,7],[47,1,47,16],[40,3,43,3],[42,16,43,16],[42,15,43,15],[40,16,41,16],[38,15,39,15],[36,15,37,15],[29,6,31,6],[32,5,33,5],[40,15,41,15],[34,16,35,16],[36,16,37,16],[38,16,39,16],[34,15,35,15],[51,3,51,7],[50,1,50,2],[52,3,52,7],[53,3,53,7],[48,1,48,16],[50,3,50,7],[51,1,51,2],[53,1,53,2]]}
["TxDOT Manuals >",null,null,null,null,"Tex-418-A"]
[null,"TEXAS DEPARTMENT OF TRANSPORTATION",null,null,null,null,null,null,null,null,null,null,null,null,null,null,null,83]
[null,null,null,null,null,null,null,null,null,null,null,null,null,null,null,null,null,2]
[null,null,null,null,null,null,null,null,null,null,null,null,null,null,null,null,null,"tx4hard.xlsm::45028.635197"]
[null,"HYDRAULIC CEMENT CONCRETE REPORT FOR STRUCTURAL CONCRETE"]
[null,"Tex-418-A"]
[]
[null,null,null,null,null,null,null,null,null,null,null,null,null,null,{"$f":"\"TX4HARD :: File Version: \" & TEXT(MID(sn,SEARCH(\"::\",sn,1)+2,20),\"mm/dd/yy hh:mm:ss\")","v":"TX4HARD :: File Version: 04/12/23 15:14:41"}]
[null,null,null,null,"SAMPLE ID:",null,null,null,null,null,null,"SAMPLED DATE:"]
[null,null,null,null,"TEST NUMBER:",null,null,null,null,null,null,"LETTING DATE:"]
[null,null,null,null,"SAMPLE STATUS:",null,null,null,null,null,null,"CONTROLLING CSJ:"]
[null,null,null,null,"COUNTY:",null,null,null,null,null,null,"SPEC YEAR:"]
[null,null,null,null,"SAMPLED BY:",null,null,null,null,null,null,"SPEC ITEM:"]
[null,null,null,null,"SAMPLE LOCATION:","",null,null,null,null,null,"SPECIAL PROVISION:"]
[null,null,null,null,"MATERIAL CODE:",null,null,null,null,null,null,"CLASS:"]
[null,null,null,null,"MATERIAL NAME:"]
[null,null,null,null,"PRODUCER:"]
[null,null,null,null,"AREA ENGINEER:",null,null,null,null,null,null,"PROJECT MANAGER:"]
[]
[null,null,null,null,"COURSE\\LIFT:",null,null,"STATION:",null,null,null,null,"DIST. FROM CL:"]
[]
[]
[null,"This worksheet represents 180CY's of concrete. Three (3) sets representing 60 CY's each is expected."]
[null,{"$f":"IF(SpecYear=\"\",\"\",IF(AND(version>=1,SpecYear=\"2014\"),\"Four (4) cylinders should be made every  60 CY or per day . Test two cylinders at 7 days, and if the average value is below the design strength as defined in Item 421 Table 8, test the remaining 2 cylinders at 28 days.\"&\" If the average value of the 2 cylinders tested at 7 days meets the minimum design strength listed in Item 421 Table 8, the 2 remaining cylinders are not required to be tested.\",\"Four (4) cylinders should be made every  60 CY or per day . Two (2) of these four (4) cylinders are required to be tested at 7 days. Testing the remaining two (2) cylinders at 28 days is only required once per 180 CY\"&\", unless 7-day strength fails to meet 7-Day Target Strength.\"))","v":""}]
[]
[null,"COMPRESSIVE STRENGTH"]
[null,"Test Method Tex-418-A"]
[null,null,null,null,null,null,null,"7-Day Target Strength ( psi ) :",null,null,null,"28-Day Design Strength f'c ( psi ) :",{"$f":"IF(ISBLANK(M15),\"\",VLOOKUP(M15,'L to D Lookup'!D35:E49,2))","v":""},null,{"$f":"IF(M28=\"Input at right\",N28,M28)","v":""}]
[]
[null,"SET","Cast Date","Station","Age (Days)","Test Status","Cylinder","Cylinder Number",null,"Length of Cylinder","Length to Diameter Ratio","Max Load","Failure Type","Correction Factor","Compressive Strength","Compressive Strength (avg)","Meets Strength Requirement","Structure Description"]
[null,null,null,null,null,null,null,null,"of Cylinder"]
[null,null,null,null,null,null,null,null,{"$f":"IF(SpecYear=\"\",\"\",IF(SpecYear=\"1995\",\"( millimeter )\",\"( inches )\"))","v":""},{"$f":"IF(SpecYear=\"\",\"\",IF(SpecYear=\"1995\",\"( millimeter )\",\"( inches )\"))","v":""},null,{"$f":"IF(SpecYear=\"\",\"\",IF(SpecYear=\"1995\",\"( N* )\",\"( Lbs. )\"))","v":""},null,null,{"$f":" IF(SpecYear=\"\",\"\",IF(SpecYear=\"1995\",\"( MPa )\",\"( psi )\"))","v":""},{"$f":" IF(SpecYear=\"\",\"\",IF(SpecYear=\"1995\",\"( MPa )\",\"( psi )\"))","v":""}]
[null,1,null,null,7,"Required",1,null,null,null,{"$f":"IF(ISERROR(IF(CircumDiameter1=\"circumference\",$J33/(SQRT($I33/PI())*2),($J33/$I33))),\"\",IF(CircumDiameter1=\"circumference\",$J33/(SQRT($I33/PI())*2),($J33/$I33)))","v":""},null,null,{"$f":"IF(K33=\"\",\"\",IF(K33<1,\"CHK SIZES\",IF(K33>1.8,1,VLOOKUP(K33,CorrectionFactors,2))))","v":""},{"$f":"IF(ISERROR(IF(SpecYear=\"1993\",'L to D Lookup'!$E12,'L to D Lookup'!$F12)),0,IF(SpecYear=\"1993\",'L to D Lookup'!$E12,'L to D Lookup'!$F12))","v":""},{"$f":"IF(ISERROR(IF(SpecYear=\"1995\",ROUND(AVERAGE(O33:O34),2),ROUND(AVERAGE(O33:O34),-1))),\"\",IF(SpecYear=\"1995\",ROUND(AVERAGE(O33:O34),2),ROUND(AVERAGE(O33:O34),-1)))","v":""},{"$f":"IF(ISBLANK(L33),\"\",IF(AND(version>=1, SpecYear=\"2014\"), IF(P33>=O28, \"Yes\", \"No\"),IF(AND(E33=7,P33>=I28),\"Yes\",IF(AND(E33=28,P33>=O28),\"Yes\",\"No\"))))","v":""}]
[null,null,null,null,null,null,2,null,null,null,{"$f":"IF(ISERROR(IF(CircumDiameter1=\"circumference\",$J34/(SQRT($I34/PI())*2),($J34/$I34))),\"\",IF(CircumDiameter1=\"circumference\",$J34/(SQRT($I34/PI())*2),($J34/$I34)))","v":""},null,null,"",{"$f":"IF(ISERROR(IF(SpecYear=\"1993\",'L to D Lookup'!$E13,'L to D Lookup'!$F13)),0,IF(SpecYear=\"1993\",'L to D Lookup'!$E13,'L to D Lookup'!$F13))","v":""}]
[null,null,null,null,28,{"$f":"IF(AND(version>=1, SpecYear=\"2014\"), IF(OR(Q33=\"No\", Q33=\"\"), \"Required\", \"Not Required\"), IF(AND(Q33=\"Yes\",OR(F39=\"Required\",F43=\"Required\")),\"Not Required\",\"Required\"))","v":"Required"},1,null,null,null,{"$f":"IF(ISERROR(IF(CircumDiameter1=\"circumference\",$J35/(SQRT($I35/PI())*2),($J35/$I35))),\"\",IF(CircumDiameter1=\"circumference\",$J35/(SQRT($I35/PI())*2),($J35/$I35)))","v":""},null,null,"",{"$f":"IF(ISERROR(IF(SpecYear=\"1993\",'L to D Lookup'!$E14,'L to D Lookup'!$F14)),0,IF(SpecYear=\"1993\",'L to D Lookup'!$E14,'L to D Lookup'!$F14))","v":""},{"$f":"IF(ISERROR(IF(SpecYear=\"1995\",ROUND(AVERAGE(O35:O36),2),ROUND(AVERAGE(O35:O36),-1))),\"\",IF(SpecYear=\"1995\",ROUND(AVERAGE(O35:O36),2),ROUND(AVERAGE(O35:O36),-1)))","v":""},{"$f":"IF(ISBLANK(L35),\"\",IF(version>=1, IF(P35>=O28, \"Yes\", \"No\"),IF(AND(E35=7,P35>=I28),\"Yes\",IF(AND(E35=28,P35>=O28),\"Yes\",\"No\"))))","v":""}]
[null,null,null,null,null,null,2,null,null,null,"",null,null,"",{"$f":"IF(ISERROR(IF(SpecYear=\"1993\",'L to D Lookup'!$E15,'L to D Lookup'!$F15)),0,IF(SpecYear=\"1993\",'L to D Lookup'!$E15,'L to D Lookup'!$F15))","v":""}]
[null,2,null,null,7,"Required",1,null,null,null,"",null,null,"",{"$f":"IF(ISERROR(IF(SpecYear=\"1993\",'L to D Lookup'!$E16,'L to D Lookup'!$F16)),0,IF(SpecYear=\"1993\",'L to D Lookup'!$E16,'L to D Lookup'!$F16))","v":""},{"$f":"IF(ISERROR(IF(SpecYear=\"1995\",ROUND(AVERAGE(O37:O38),2),ROUND(AVERAGE(O37:O38),-1))),\"\",IF(SpecYear=\"1995\",ROUND(AVERAGE(O37:O38),2),ROUND(AVERAGE(O37:O38),-1)))","v":""},{"$f":"IF(ISBLANK(Field37),\"\",IF(version>=1, IF(P37>=O28, \"Yes\", \"No\"),IF(AND(E37=7,P37>=I28),\"Yes\",IF(AND(E37=28,P37>=O28),\"Yes\",\"No\"))))","v":""}]
[null,null,null,null,null,null,2,null,null,null,"",null,null,"",{"$f":"IF(ISERROR(IF(SpecYear=\"1993\",'L to D Lookup'!$E17,'L to D Lookup'!$F17)),0,IF(SpecYear=\"1993\",'L to D Lookup'!$E17,'L to D Lookup'!$F17))","v":""}]
[null,null,null,null,28,{"$f":"IF(AND(version>=1, SpecYear=\"2014\"), IF(OR(Q37=\"No\", Q37=\"\"), \"Required\", \"NOT Required\"), IF(Q37=\"No\",\"Required\",\"NOT Required\"))","v":"NOT Required"},1,null,null,null,"",null,null,"",{"$f":"IF(ISERROR(IF(SpecYear=\"1993\",'L to D Lookup'!$E18,'L to D Lookup'!$F18)),0,IF(SpecYear=\"1993\",'L to D Lookup'!$E18,'L to D Lookup'!$F18))","v":""},{"$f":"IF(ISERROR(IF(SpecYear=\"1995\",ROUND(AVERAGE(O39:O40),2),ROUND(AVERAGE(O39:O40),-1))),\"\",IF(SpecYear=\"1995\",ROUND(AVERAGE(O39:O40),2),ROUND(AVERAGE(O39:O40),-1)))","v":""},{"$f":"IF(ISBLANK(L39),\"\",IF(version>=1, IF(P39>=O28, \"Yes\", \"No\"),IF(AND(E39=7,P39>=I28),\"Yes\",IF(AND(E39=28,P39>=O28),\"Yes\",\"No\"))))","v":""}]
[null,null,null,null,null,null,2,null,null,null,"",null,null,"",{"$f":"IF(ISERROR(IF(SpecYear=\"1993\",'L to D Lookup'!$E19,'L to D Lookup'!$F19)),0,IF(SpecYear=\"1993\",'L to D Lookup'!$E19,'L to D Lookup'!$F19))","v":""}]
[null,3,null,null,7,"Required",1,null,null,null,"",null,null,{"$f":"IF(K41=\"\",\"\",IF(K41<1,\"CHK SIZES\",IF(K41>1.8,1,VLOOKUP(K41,CorrectionFactors,2))))","v":""},{"$f":"IF(ISERROR(IF(SpecYear=\"1993\",'L to D Lookup'!$E20,'L to D Lookup'!$F20)),0,IF(SpecYear=\"1993\",'L to D Lookup'!$E20,'L to D Lookup'!$F20))","v":""},{"$f":"IF(ISERROR(IF(SpecYear=\"1995\",ROUND(AVERAGE(O41:O42),2),ROUND(AVERAGE(O41:O42),-1))),\"\",IF(SpecYear=\"1995\",ROUND(AVERAGE(O41:O42),2),ROUND(AVERAGE(O41:O42),-1)))","v":""},{"$f":"IF(ISBLANK(L41),\"\",IF(version>=1, IF(P41>=O28, \"Yes\", \"No\"),IF(AND(E41=7,P41>=I28),\"Yes\",IF(AND(E41=28,P41>=O28),\"Yes\",\"No\"))))","v":""}]
[null,null,null,null,null,null,2,null,null,null,"",null,null,{"$f":"IF(K42=\"\",\"\",IF(K42<1,\"CHK SIZES\",IF(K42>1.8,1,VLOOKUP(K42,CorrectionFactors,2))))","v":""},{"$f":"IF(ISERROR(IF(SpecYear=\"1993\",'L to D Lookup'!$E21,'L to D Lookup'!$F21)),0,IF(SpecYear=\"1993\",'L to D Lookup'!$E21,'L to D Lookup'!$F21))","v":""}]
[null,null,null,null,28,{"$f":"IF(AND(version>=1, SpecYear=\"2014\"), IF(OR(Q41=\"No\", Q41=\"\"), \"Required\", \"NOT Required\"), IF(Q41=\"No\",\"Required\",\"NOT Required\"))","v":"NOT Required"},1,null,null,null,"",null,null,{"$f":"IF(K43=\"\",\"\",IF(K43<1,\"CHK SIZES\",IF(K43>1.8,1,VLOOKUP(K43,CorrectionFactors,2))))","v":""},{"$f":"IF(ISERROR(IF(SpecYear=\"1993\",'L to D Lookup'!$E22,'L to D Lookup'!$F22)),0,IF(SpecYear=\"1993\",'L to D Lookup'!$E22,'L to D Lookup'!$F22))","v":""},{"$f":"IF(ISERROR(IF(SpecYear=\"1995\",ROUND(AVERAGE(O43:O44),2),ROUND(AVERAGE(O43:O44),-1))),\"\",IF(SpecYear=\"1995\",ROUND(AVERAGE(O43:O44),2),ROUND(AVERAGE(O43:O44),-1)))","v":""},{"$f":"IF(ISBLANK(L43),\"\",IF(version>=1, IF(P43>=O28, \"Yes\", \"No\"),IF(AND(E43=7,P43>=I28),\"Yes\",IF(AND(E43=28,P43>=O28),\"Yes\",\"No\"))))","v":""}]
[null,null,null,null,null,null,2,null,null,null,"",null,null,{"$f":"IF(K44=\"\",\"\",IF(K44<1,\"CHK SIZES\",IF(K44>1.8,1,VLOOKUP(K44,CorrectionFactors,2))))","v":""},{"$f":"IF(ISERROR(IF(SpecYear=\"1993\",'L to D Lookup'!$E23,'L to D Lookup'!$F23)),0,IF(SpecYear=\"1993\",'L to D Lookup'!$E23,'L to D Lookup'!$F23))","v":""}]
[null,"Remarks:",null,null,null,null,null,null,null,{"$f":"NOW()","v":"2023-04-12T15:14:41.250"}]
[]
[]
[]
[]
[]
[null,"Sample Method:",null,"Sampled By:",null,null,null,null,"Sampled Date:"]
[null,"TX407"]
[null,"Test Method:",null,"Tested By:",null,null,null,null,"Tested Date:"]
[null,"TX418"]
[null,"Test Stamp Code:",null,null,null,null,null,null,"Omit Test:","Completed Date:","Reviewed By:"]
[]
[null,"Locked By:",null,"TxDOT:","District:","Area:"]
[]
[null,"Authorized By:",null,null,null,null,null,null,null,"Authorized Date:"]
[null,null,null,null,null,null,null,null,null,null,{"$f":"IF(OR(ISBLANK(AuthorizedDate),AuthorizedDate>=43139),1,0)","v":1}]

{"sheet":"RX","index":1,"n_rows":127,"n_cols":9,"rows_kept":127,"cut":false,"hidden":true,"merged":[]}
[125]
["Fld_nbr","Value","Desc_1","Desc_2","Desc_3","Desc_4","Desc_5","Desc_6","Desc_7"]
[1,{"$f":"IF('Tex-418-A'!$B$46=\"\",\"\",'Tex-418-A'!$B$46)","v":""},{"$f":"'Tex-418-A'!$B$45","v":"Remarks:"}]
[2,{"$f":"IF('Tex-418-A'!$F$20=\"\",\"\",'Tex-418-A'!$F$20)","v":""},{"$f":"IF('Tex-418-A'!$E$20=\"\",\"\",'Tex-418-A'!$E$20)","v":"COURSE\\LIFT:"}]
[3,{"$f":"IF('Tex-418-A'!$D$54=\"\",\"\",'Tex-418-A'!$D$54)","v":""},{"$f":"IF(\"Tested By \"=\"\",\"\",\"Tested By \")","v":"Tested By "},{"$f":"IF('Tex-418-A'!$B$54=\"\",\"\",'Tex-418-A'!$B$54)","v":"TX418"}]
[4,{"$f":"IF('Tex-418-A'!$I$54=\"\",\"\",'Tex-418-A'!$I$54)","v":""},{"$f":"IF(\"Tested Date \"=\"\",\"\",\"Tested Date \")","v":"Tested Date "},{"$f":"IF('Tex-418-A'!$B$54=\"\",\"\",'Tex-418-A'!$B$54)","v":"TX418"}]
[5,{"$f":"IF('Tex-418-A'!$I$28=\"\",\"\",'Tex-418-A'!$I$28)","v":""},{"$f":"IF('Tex-418-A'!$B$6=\"\",\"\",'Tex-418-A'!$B$6)","v":"Tex-418-A"},{"$f":"IF('Tex-418-A'!$H$28=\"\",\"\",'Tex-418-A'!$H$28)","v":"7-Day Target Strength ( psi ) :"}]
[6,{"$f":"IF('Tex-418-A'!$M$28=\"\",\"\",'Tex-418-A'!$M$28)","v":""},{"$f":"IF('Tex-418-A'!$B$6=\"\",\"\",'Tex-418-A'!$B$6)","v":"Tex-418-A"},{"$f":"IF('Tex-418-A'!$L$28=\"\",\"\",'Tex-418-A'!$L$28)","v":"28-Day Design Strength f'c ( psi ) :"}]
[7,{"$f":"IF('Tex-418-A'!$C$33=\"\",\"\",'Tex-418-A'!$C$33)","v":""},{"$f":"IF('Tex-418-A'!$B$6=\"\",\"\",'Tex-418-A'!$B$6)","v":"Tex-418-A"},{"$f":"IF('Tex-418-A'!$C$30=\"\",\"\",'Tex-418-A'!$C$30)","v":"Cast Date"},{"$f":"IF('Tex-418-A'!$B$30=\"\",\"\",'Tex-418-A'!$B$30)","v":"SET"},{"$f":"IF('Tex-418-A'!$B$33=\"\",\"\",'Tex-418-A'!$B$33)","v":1}]
[8,{"$f":"IF('Tex-418-A'!$C$37=\"\",\"\",'Tex-418-A'!$C$37)","v":""},{"$f":"IF('Tex-418-A'!$B$6=\"\",\"\",'Tex-418-A'!$B$6)","v":"Tex-418-A"},{"$f":"IF('Tex-418-A'!$C$30=\"\",\"\",'Tex-418-A'!$C$30)","v":"Cast Date"},{"$f":"IF('Tex-418-A'!$B$30=\"\",\"\",'Tex-418-A'!$B$30)","v":"SET"},{"$f":"IF('Tex-418-A'!$B$37=\"\",\"\",'Tex-418-A'!$B$37)","v":2}]
[9,{"$f":"IF('Tex-418-A'!$C$41=\"\",\"\",'Tex-418-A'!$C$41)","v":""},{"$f":"IF('Tex-418-A'!$B$6=\"\",\"\",'Tex-418-A'!$B$6)","v":"Tex-418-A"},{"$f":"IF('Tex-418-A'!$C$30=\"\",\"\",'Tex-418-A'!$C$30)","v":"Cast Date"},{"$f":"IF('Tex-418-A'!$B$30=\"\",\"\",'Tex-418-A'!$B$30)","v":"SET"},{"$f":"IF('Tex-418-A'!$B$41=\"\",\"\",'Tex-418-A'!$B$41)","v":3}]
[10,{"$f":"IF('Tex-418-A'!$D$33=\"\",\"\",'Tex-418-A'!$D$33)","v":""},{"$f":"IF('Tex-418-A'!$B$6=\"\",\"\",'Tex-418-A'!$B$6)","v":"Tex-418-A"},{"$f":"IF('Tex-418-A'!$D$30=\"\",\"\",'Tex-418-A'!$D$30)","v":"Station"},{"$f":"IF('Tex-418-A'!$B$30=\"\",\"\",'Tex-418-A'!$B$30)","v":"SET"},{"$f":"IF('Tex-418-A'!$B$33=\"\",\"\",'Tex-418-A'!$B$33)","v":1}]
[11,{"$f":"IF('Tex-418-A'!$D$37=\"\",\"\",'Tex-418-A'!$D$37)","v":""},{"$f":"IF('Tex-418-A'!$B$6=\"\",\"\",'Tex-418-A'!$B$6)","v":"Tex-418-A"},{"$f":"IF('Tex-418-A'!$D$30=\"\",\"\",'Tex-418-A'!$D$30)","v":"Station"},{"$f":"IF('Tex-418-A'!$B$30=\"\",\"\",'Tex-418-A'!$B$30)","v":"SET"},{"$f":"IF('Tex-418-A'!$B$37=\"\",\"\",'Tex-418-A'!$B$37)","v":2}]
[12,{"$f":"IF('Tex-418-A'!$D$41=\"\",\"\",'Tex-418-A'!$D$41)","v":""},{"$f":"IF('Tex-418-A'!$B$6=\"\",\"\",'Tex-418-A'!$B$6)","v":"Tex-418-A"},{"$f":"IF('Tex-418-A'!$D$30=\"\",\"\",'Tex-418-A'!$D$30)","v":"Station"},{"$f":"IF('Tex-418-A'!$B$30=\"\",\"\",'Tex-418-A'!$B$30)","v":"SET"},{"$f":"IF('Tex-418-A'!$B$41=\"\",\"\",'Tex-418-A'!$B$41)","v":3}]
[13,{"$f":"IF('Tex-418-A'!$H$33=\"\",\"\",'Tex-418-A'!$H$33)","v":""},{"$f":"IF('Tex-418-A'!$B$6=\"\",\"\",'Tex-418-A'!$B$6)","v":"Tex-418-A"},{"$f":"IF('Tex-418-A'!$H$30=\"\",\"\",'Tex-418-A'!$H$30)","v":"Cylinder Number"},{"$f":"IF('Tex-418-A'!$B$30=\"\",\"\",'Tex-418-A'!$B$30)","v":"SET"},{"$f":"IF('Tex-418-A'!$B$33=\"\",\"\",'Tex-418-A'!$B$33)","v":1},{"$f":"IF('Tex-418-A'!$E$33=\"\",\"\",'Tex-418-A'!$E$33)","v":7},{"$f":"IF('Tex-418-A'!$F$33=\"\",\"\",'Tex-418-A'!$F$33)","v":"Required"},{"$f":"IF('Tex-418-A'!$G$33=\"\",\"\",'Tex-418-A'!$G$33)","v":1}]
[14,{"$f":"IF('Tex-418-A'!$H$34=\"\",\"\",'Tex-418-A'!$H$34)","v":""},{"$f":"IF('Tex-418-A'!$B$6=\"\",\"\",'Tex-418-A'!$B$6)","v":"Tex-418-A"},{"$f":"IF('Tex-418-A'!$H$30=\"\",\"\",'Tex-418-A'!$H$30)","v":"Cylinder Number"},{"$f":"IF('Tex-418-A'!$B$30=\"\",\"\",'Tex-418-A'!$B$30)","v":"SET"},{"$f":"IF('Tex-418-A'!$B$33=\"\",\"\",'Tex-418-A'!$B$33)","v":1},{"$f":"IF('Tex-418-A'!$E$33=\"\",\"\",'Tex-418-A'!$E$33)","v":7},{"$f":"IF('Tex-418-A'!$F$33=\"\",\"\",'Tex-418-A'!$F$33)","v":"Required"},{"$f":"IF('Tex-418-A'!$G$34=\"\",\"\",'Tex-418-A'!$G$34)","v":2}]
[15,{"$f":"IF('Tex-418-A'!$H$35=\"\",\"\",'Tex-418-A'!$H$35)","v":""},{"$f":"IF('Tex-418-A'!$B$6=\"\",\"\",'Tex-418-A'!$B$6)","v":"Tex-418-A"},{"$f":"IF('Tex-418-A'!$H$30=\"\",\"\",'Tex-418-A'!$H$30)","v":"Cylinder Number"},{"$f":"IF('Tex-418-A'!$B$30=\"\",\"\",'Tex-418-A'!$B$30)","v":"SET"},{"$f":"IF('Tex-418-A'!$B$33=\"\",\"\",'Tex-418-A'!$B$33)","v":1},{"$f":"IF('Tex-418-A'!$E$35=\"\",\"\",'Tex-418-A'!$E$35)","v":28},{"$f":"IF('Tex-418-A'!$F$35=\"\",\"\",'Tex-418-A'!$F$35)","v":"Required"},{"$f":"IF('Tex-418-A'!$G$35=\"\",\"\",'Tex-418-A'!$G$35)","v":1}]
[16,{"$f":"IF('Tex-418-A'!$H$36=\"\",\"\",'Tex-418-A'!$H$36)","v":""},{"$f":"IF('Tex-418-A'!$B$6=\"\",\"\",'Tex-418-A'!$B$6)","v":"Tex-418-A"},{"$f":"IF('Tex-418-A'!$H$30=\"\",\"\",'Tex-418-A'!$H$30)","v":"Cylinder Number"},{"$f":"IF('Tex-418-A'!$B$30=\"\",\"\",'Tex-418-A'!$B$30)","v":"SET"},{"$f":"IF('Tex-418-A'!$B$33=\"\",\"\",'Tex-418-A'!$B$33)","v":1},{"$f":"IF('Tex-418-A'!$E$35=\"\",\"\",'Tex-418-A'!$E$35)","v":28},{"$f":"IF('Tex-418-A'!$F$35=\"\",\"\",'Tex-418-A'!$F$35)","v":"Required"},{"$f":"IF('Tex-418-A'!$G$36=\"\",\"\",'Tex-418-A'!$G$36)","v":2}]
[17,{"$f":"IF('Tex-418-A'!$H$37=\"\",\"\",'Tex-418-A'!$H$37)","v":""},{"$f":"IF('Tex-418-A'!$B$6=\"\",\"\",'Tex-418-A'!$B$6)","v":"Tex-418-A"},{"$f":"IF('Tex-418-A'!$H$30=\"\",\"\",'Tex-418-A'!$H$30)","v":"Cylinder Number"},{"$f":"IF('Tex-418-A'!$B$30=\"\",\"\",'Tex-418-A'!$B$30)","v":"SET"},{"$f":"IF('Tex-418-A'!$B$37=\"\",\"\",'Tex-418-A'!$B$37)","v":2},{"$f":"IF('Tex-418-A'!$E$37=\"\",\"\",'Tex-418-A'!$E$37)","v":7},{"$f":"IF('Tex-418-A'!$F$37=\"\",\"\",'Tex-418-A'!$F$37)","v":"Required"},{"$f":"IF('Tex-418-A'!$G$37=\"\",\"\",'Tex-418-A'!$G$37)","v":1}]
[18,{"$f":"IF('Tex-418-A'!$H$38=\"\",\"\",'Tex-418-A'!$H$38)","v":""},{"$f":"IF('Tex-418-A'!$B$6=\"\",\"\",'Tex-418-A'!$B$6)","v":"Tex-418-A"},{"$f":"IF('Tex-418-A'!$H$30=\"\",\"\",'Tex-418-A'!$H$30)","v":"Cylinder Number"},{"$f":"IF('Tex-418-A'!$B$30=\"\",\"\",'Tex-418-A'!$B$30)","v":"SET"},{"$f":"IF('Tex-418-A'!$B$37=\"\",\"\",'Tex-418-A'!$B$37)","v":2},{"$f":"IF('Tex-418-A'!$E$37=\"\",\"\",'Tex-418-A'!$E$37)","v":7},{"$f":"IF('Tex-418-A'!$F$37=\"\",\"\",'Tex-418-A'!$F$37)","v":"Required"},{"$f":"IF('Tex-418-A'!$G$38=\"\",\"\",'Tex-418-A'!$G$38)","v":2}]
[19,{"$f":"IF('Tex-418-A'!$H$39=\"\",\"\",'Tex-418-A'!$H$39)","v":""},{"$f":"IF('Tex-418-A'!$B$6=\"\",\"\",'Tex-418-A'!$B$6)","v":"Tex-418-A"},{"$f":"IF('Tex-418-A'!$H$30=\"\",\"\",'Tex-418-A'!$H$30)","v":"Cylinder Number"},{"$f":"IF('Tex-418-A'!$B$30=\"\",\"\",'Tex-418-A'!$B$30)","v":"SET"},{"$f":"IF('Tex-418-A'!$B$37=\"\",\"\",'Tex-418-A'!$B$37)","v":2},{"$f":"IF('Tex-418-A'!$E$39=\"\",\"\",'Tex-418-A'!$E$39)","v":28},{"$f":"IF('Tex-418-A'!$F$39=\"\",\"\",'Tex-418-A'!$F$39)","v":"NOT Required"},{"$f":"IF('Tex-418-A'!$G$39=\"\",\"\",'Tex-418-A'!$G$39)","v":1}]
[20,{"$f":"IF('Tex-418-A'!$H$40=\"\",\"\",'Tex-418-A'!$H$40)","v":""},{"$f":"IF('Tex-418-A'!$B$6=\"\",\"\",'Tex-418-A'!$B$6)","v":"Tex-418-A"},{"$f":"IF('Tex-418-A'!$H$30=\"\",\"\",'Tex-418-A'!$H$30)","v":"Cylinder Number"},{"$f":"IF('Tex-418-A'!$B$30=\"\",\"\",'Tex-418-A'!$B$30)","v":"SET"},{"$f":"IF('Tex-418-A'!$B$37=\"\",\"\",'Tex-418-A'!$B$37)","v":2},{"$f":"IF('Tex-418-A'!$E$39=\"\",\"\",'Tex-418-A'!$E$39)","v":28},{"$f":"IF('Tex-418-A'!$F$39=\"\",\"\",'Tex-418-A'!$F$39)","v":"NOT Required"},{"$f":"IF('Tex-418-A'!$G$40=\"\",\"\",'Tex-418-A'!$G$40)","v":2}]
[21,{"$f":"IF('Tex-418-A'!$H$41=\"\",\"\",'Tex-418-A'!$H$41)","v":""},{"$f":"IF('Tex-418-A'!$B$6=\"\",\"\",'Tex-418-A'!$B$6)","v":"Tex-418-A"},{"$f":"IF('Tex-418-A'!$H$30=\"\",\"\",'Tex-418-A'!$H$30)","v":"Cylinder Number"},{"$f":"IF('Tex-418-A'!$B$30=\"\",\"\",'Tex-418-A'!$B$30)","v":"SET"},{"$f":"IF('Tex-418-A'!$B$41=\"\",\"\",'Tex-418-A'!$B$41)","v":3},{"$f":"IF('Tex-418-A'!$E$41=\"\",\"\",'Tex-418-A'!$E$41)","v":7},{"$f":"IF('Tex-418-A'!$F$41=\"\",\"\",'Tex-418-A'!$F$41)","v":"Required"},{"$f":"IF('Tex-418-A'!$G$41=\"\",\"\",'Tex-418-A'!$G$41)","v":1}]
[22,{"$f":"IF('Tex-418-A'!$H$42=\"\",\"\",'Tex-418-A'!$H$42)","v":""},{"$f":"IF('Tex-418-A'!$B$6=\"\",\"\",'Tex-418-A'!$B$6)","v":"Tex-418-A"},{"$f":"IF('Tex-418-A'!$H$30=\"\",\"\",'Tex-418-A'!$H$30)","v":"Cylinder Number"},{"$f":"IF('Tex-418-A'!$B$30=\"\",\"\",'Tex-418-A'!$B$30)","v":"SET"},{"$f":"IF('Tex-418-A'!$B$41=\"\",\"\",'Tex-418-A'!$B$41)","v":3},{"$f":"IF('Tex-418-A'!$E$41=\"\",\"\",'Tex-418-A'!$E$41)","v":7},{"$f":"IF('Tex-418-A'!$F$41=\"\",\"\",'Tex-418-A'!$F$41)","v":"Required"},{"$f":"IF('Tex-418-A'!$G$42=\"\",\"\",'Tex-418-A'!$G$42)","v":2}]
[23,{"$f":"IF('Tex-418-A'!$H$43=\"\",\"\",'Tex-418-A'!$H$43)","v":""},{"$f":"IF('Tex-418-A'!$B$6=\"\",\"\",'Tex-418-A'!$B$6)","v":"Tex-418-A"},{"$f":"IF('Tex-418-A'!$H$30=\"\",\"\",'Tex-418-A'!$H$30)","v":"Cylinder Number"},{"$f":"IF('Tex-418-A'!$B$30=\"\",\"\",'Tex-418-A'!$B$30)","v":"SET"},{"$f":"IF('Tex-418-A'!$B$41=\"\",\"\",'Tex-418-A'!$B$41)","v":3},{"$f":"IF('Tex-418-A'!$E$43=\"\",\"\",'Tex-418-A'!$E$43)","v":28},{"$f":"IF('Tex-418-A'!$F$43=\"\",\"\",'Tex-418-A'!$F$43)","v":"NOT Required"},{"$f":"IF('Tex-418-A'!$G$43=\"\",\"\",'Tex-418-A'!$G$43)","v":1}]
[24,{"$f":"IF('Tex-418-A'!$H$44=\"\",\"\",'Tex-418-A'!$H$44)","v":""},{"$f":"IF('Tex-418-A'!$B$6=\"\",\"\",'Tex-418-A'!$B$6)","v":"Tex-418-A"},{"$f":"IF('Tex-418-A'!$H$30=\"\",\"\",'Tex-418-A'!$H$30)","v":"Cylinder Number"},{"$f":"IF('Tex-418-A'!$B$30=\"\",\"\",'Tex-418-A'!$B$30)","v":"SET"},{"$f":"IF('Tex-418-A'!$B$41=\"\",\"\",'Tex-418-A'!$B$41)","v":3},{"$f":"IF('Tex-418-A'!$E$43=\"\",\"\",'Tex-418-A'!$E$43)","v":28},{"$f":"IF('Tex-418-A'!$F$43=\"\",\"\",'Tex-418-A'!$F$43)","v":"NOT Required"},{"$f":"IF('Tex-418-A'!$G$44=\"\",\"\",'Tex-418-A'!$G$44)","v":2}]
[25,{"$f":"IF('Tex-418-A'!$I$33=\"\",\"\",'Tex-418-A'!$I$33)","v":""},{"$f":"IF('Tex-418-A'!$B$6=\"\",\"\",'Tex-418-A'!$B$6)","v":"Tex-418-A"},{"$f":"IF('Tex-418-A'!$I$31=\"\",\"\",'Tex-418-A'!$I$31)","v":"of Cylinder"},{"$f":"IF('Tex-418-A'!$B$30=\"\",\"\",'Tex-418-A'!$B$30)","v":"SET"},{"$f":"IF('Tex-418-A'!$B$33=\"\",\"\",'Tex-418-A'!$B$33)","v":1},{"$f":"IF('Tex-418-A'!$E$33=\"\",\"\",'Tex-418-A'!$E$33)","v":7},{"$f":"IF('Tex-418-A'!$F$33=\"\",\"\",'Tex-418-A'!$F$33)","v":"Required"},{"$f":"IF('Tex-418-A'!$G$33=\"\",\"\",'Tex-418-A'!$G$33)","v":1}]
[26,{"$f":"IF('Tex-418-A'!$I$34=\"\",\"\",'Tex-418-A'!$I$34)","v":""},{"$f":"IF('Tex-418-A'!$B$6=\"\",\"\",'Tex-418-A'!$B$6)","v":"Tex-418-A"},{"$f":"IF('Tex-418-A'!$I$31=\"\",\"\",'Tex-418-A'!$I$31)","v":"of Cylinder"},{"$f":"IF('Tex-418-A'!$B$30=\"\",\"\",'Tex-418-A'!$B$30)","v":"SET"},{"$f":"IF('Tex-418-A'!$B$33=\"\",\"\",'Tex-418-A'!$B$33)","v":1},{"$f":"IF('Tex-418-A'!$E$33=\"\",\"\",'Tex-418-A'!$E$33)","v":7},{"$f":"IF('Tex-418-A'!$F$33=\"\",\"\",'Tex-418-A'!$F$33)","v":"Required"},{"$f":"IF('Tex-418-A'!$G$34=\"\",\"\",'Tex-418-A'!$G$34)","v":2}]
[27,{"$f":"IF('Tex-418-A'!$I$35=\"\",\"\",'Tex-418-A'!$I$35)","v":""},{"$f":"IF('Tex-418-A'!$B$6=\"\",\"\",'Tex-418-A'!$B$6)","v":"Tex-418-A"},{"$f":"IF('Tex-418-A'!$I$31=\"\",\"\",'Tex-418-A'!$I$31)","v":"of Cylinder"},{"$f":"IF('Tex-418-A'!$B$30=\"\",\"\",'Tex-418-A'!$B$30)","v":"SET"},{"$f":"IF('Tex-418-A'!$B$33=\"\",\"\",'Tex-418-A'!$B$33)","v":1},{"$f":"IF('Tex-418-A'!$E$35=\"\",\"\",'Tex-418-A'!$E$35)","v":28},{"$f":"IF('Tex-418-A'!$F$35=\"\",\"\",'Tex-418-A'!$F$35)","v":"Required"},{"$f":"IF('Tex-418-A'!$G$35=\"\",\"\",'Tex-418-A'!$G$35)","v":1}]
[28,{"$f":"IF('Tex-418-A'!$I$36=\"\",\"\",'Tex-418-A'!$I$36)","v":""},{"$f":"IF('Tex-418-A'!$B$6=\"\",\"\",'Tex-418-A'!$B$6)","v":"Tex-418-A"},{"$f":"IF('Tex-418-A'!$I$31=\"\",\"\",'Tex-418-A'!$I$31)","v":"of Cylinder"},{"$f":"IF('Tex-418-A'!$B$30=\"\",\"\",'Tex-418-A'!$B$30)","v":"SET"},{"$f":"IF('Tex-418-A'!$B$33=\"\",\"\",'Tex-418-A'!$B$33)","v":1},{"$f":"IF('Tex-418-A'!$E$35=\"\",\"\",'Tex-418-A'!$E$35)","v":28},{"$f":"IF('Tex-418-A'!$F$35=\"\",\"\",'Tex-418-A'!$F$35)","v":"Required"},{"$f":"IF('Tex-418-A'!$G$36=\"\",\"\",'Tex-418-A'!$G$36)","v":2}]
[29,{"$f":"IF('Tex-418-A'!$I$37=\"\",\"\",'Tex-418-A'!$I$37)","v":""},{"$f":"IF('Tex-418-A'!$B$6=\"\",\"\",'Tex-418-A'!$B$6)","v":"Tex-418-A"},{"$f":"IF('Tex-418-A'!$I$31=\"\",\"\",'Tex-418-A'!$I$31)","v":"of Cylinder"},{"$f":"IF('Tex-418-A'!$B$30=\"\",\"\",'Tex-418-A'!$B$30)","v":"SET"},{"$f":"IF('Tex-418-A'!$B$37=\"\",\"\",'Tex-418-A'!$B$37)","v":2},{"$f":"IF('Tex-418-A'!$E$37=\"\",\"\",'Tex-418-A'!$E$37)","v":7},{"$f":"IF('Tex-418-A'!$F$37=\"\",\"\",'Tex-418-A'!$F$37)","v":"Required"},{"$f":"IF('Tex-418-A'!$G$37=\"\",\"\",'Tex-418-A'!$G$37)","v":1}]
[30,{"$f":"IF('Tex-418-A'!$I$38=\"\",\"\",'Tex-418-A'!$I$38)","v":""},{"$f":"IF('Tex-418-A'!$B$6=\"\",\"\",'Tex-418-A'!$B$6)","v":"Tex-418-A"},{"$f":"IF('Tex-418-A'!$I$31=\"\",\"\",'Tex-418-A'!$I$31)","v":"of Cylinder"},{"$f":"IF('Tex-418-A'!$B$30=\"\",\"\",'Tex-418-A'!$B$30)","v":"SET"},{"$f":"IF('Tex-418-A'!$B$37=\"\",\"\",'Tex-418-A'!$B$37)","v":2},{"$f":"IF('Tex-418-A'!$E$37=\"\",\"\",'Tex-418-A'!$E$37)","v":7},{"$f":"IF('Tex-418-A'!$F$37=\"\",\"\",'Tex-418-A'!$F$37)","v":"Required"},{"$f":"IF('Tex-418-A'!$G$38=\"\",\"\",'Tex-418-A'!$G$38)","v":2}]
[31,{"$f":"IF('Tex-418-A'!$I$39=\"\",\"\",'Tex-418-A'!$I$39)","v":""},{"$f":"IF('Tex-418-A'!$B$6=\"\",\"\",'Tex-418-A'!$B$6)","v":"Tex-418-A"},{"$f":"IF('Tex-418-A'!$I$31=\"\",\"\",'Tex-418-A'!$I$31)","v":"of Cylinder"},{"$f":"IF('Tex-418-A'!$B$30=\"\",\"\",'Tex-418-A'!$B$30)","v":"SET"},{"$f":"IF('Tex-418-A'!$B$37=\"\",\"\",'Tex-418-A'!$B$37)","v":2},{"$f":"IF('Tex-418-A'!$E$39=\"\",\"\",'Tex-418-A'!$E$39)","v":28},{"$f":"IF('Tex-418-A'!$F$39=\"\",\"\",'Tex-418-A'!$F$39)","v":"NOT Required"},{"$f":"IF('Tex-418-A'!$G$39=\"\",\"\",'Tex-418-A'!$G$39)","v":1}]
[32,{"$f":"IF('Tex-418-A'!$I$40=\"\",\"\",'Tex-418-A'!$I$40)","v":""},{"$f":"IF('Tex-418-A'!$B$6=\"\",\"\",'Tex-418-A'!$B$6)","v":"Tex-418-A"},{"$f":"IF('Tex-418-A'!$I$31=\"\",\"\",'Tex-418-A'!$I$31)","v":"of Cylinder"},{"$f":"IF('Tex-418-A'!$B$30=\"\",\"\",'Tex-418-A'!$B$30)","v":"SET"},{"$f":"IF('Tex-418-A'!$B$37=\"\",\"\",'Tex-418-A'!$B$37)","v":2},{"$f":"IF('Tex-418-A'!$E$39=\"\",\"\",'Tex-418-A'!$E$39)","v":28},{"$f":"IF('Tex-418-A'!$F$39=\"\",\"\",'Tex-418-A'!$F$39)","v":"NOT Required"},{"$f":"IF('Tex-418-A'!$G$40=\"\",\"\",'Tex-418-A'!$G$40)","v":2}]
[33,{"$f":"IF('Tex-418-A'!$I$41=\"\",\"\",'Tex-418-A'!$I$41)","v":""},{"$f":"IF('Tex-418-A'!$B$6=\"\",\"\",'Tex-418-A'!$B$6)","v":"Tex-418-A"},{"$f":"IF('Tex-418-A'!$I$31=\"\",\"\",'Tex-418-A'!$I$31)","v":"of Cylinder"},{"$f":"IF('Tex-418-A'!$B$30=\"\",\"\",'Tex-418-A'!$B$30)","v":"SET"},{"$f":"IF('Tex-418-A'!$B$41=\"\",\"\",'Tex-418-A'!$B$41)","v":3},{"$f":"IF('Tex-418-A'!$E$41=\"\",\"\",'Tex-418-A'!$E$41)","v":7},{"$f":"IF('Tex-418-A'!$F$41=\"\",\"\",'Tex-418-A'!$F$41)","v":"Required"},{"$f":"IF('Tex-418-A'!$G$41=\"\",\"\",'Tex-418-A'!$G$41)","v":1}]
[34,{"$f":"IF('Tex-418-A'!$I$42=\"\",\"\",'Tex-418-A'!$I$42)","v":""},{"$f":"IF('Tex-418-A'!$B$6=\"\",\"\",'Tex-418-A'!$B$6)","v":"Tex-418-A"},{"$f":"IF('Tex-418-A'!$I$31=\"\",\"\",'Tex-418-A'!$I$31)","v":"of Cylinder"},{"$f":"IF('Tex-418-A'!$B$30=\"\",\"\",'Tex-418-A'!$B$30)","v":"SET"},{"$f":"IF('Tex-418-A'!$B$41=\"\",\"\",'Tex-418-A'!$B$41)","v":3},{"$f":"IF('Tex-418-A'!$E$41=\"\",\"\",'Tex-418-A'!$E$41)","v":7},{"$f":"IF('Tex-418-A'!$F$41=\"\",\"\",'Tex-418-A'!$F$41)","v":"Required"},{"$f":"IF('Tex-418-A'!$G$42=\"\",\"\",'Tex-418-A'!$G$42)","v":2}]
[35,{"$f":"IF('Tex-418-A'!$I$43=\"\",\"\",'Tex-418-A'!$I$43)","v":""},{"$f":"IF('Tex-418-A'!$B$6=\"\",\"\",'Tex-418-A'!$B$6)","v":"Tex-418-A"},{"$f":"IF('Tex-418-A'!$I$31=\"\",\"\",'Tex-418-A'!$I$31)","v":"of Cylinder"},{"$f":"IF('Tex-418-A'!$B$30=\"\",\"\",'Tex-418-A'!$B$30)","v":"SET"},{"$f":"IF('Tex-418-A'!$B$41=\"\",\"\",'Tex-418-A'!$B$41)","v":3},{"$f":"IF('Tex-418-A'!$E$43=\"\",\"\",'Tex-418-A'!$E$43)","v":28},{"$f":"IF('Tex-418-A'!$F$43=\"\",\"\",'Tex-418-A'!$F$43)","v":"NOT Required"},{"$f":"IF('Tex-418-A'!$G$43=\"\",\"\",'Tex-418-A'!$G$43)","v":1}]
[36,{"$f":"IF('Tex-418-A'!$I$44=\"\",\"\",'Tex-418-A'!$I$44)","v":""},{"$f":"IF('Tex-418-A'!$B$6=\"\",\"\",'Tex-418-A'!$B$6)","v":"Tex-418-A"},{"$f":"IF('Tex-418-A'!$I$31=\"\",\"\",'Tex-418-A'!$I$31)","v":"of Cylinder"},{"$f":"IF('Tex-418-A'!$B$30=\"\",\"\",'Tex-418-A'!$B$30)","v":"SET"},{"$f":"IF('Tex-418-A'!$B$41=\"\",\"\",'Tex-418-A'!$B$41)","v":3},{"$f":"IF('Tex-418-A'!$E$43=\"\",\"\",'Tex-418-A'!$E$43)","v":28},{"$f":"IF('Tex-418-A'!$F$43=\"\",\"\",'Tex-418-A'!$F$43)","v":"NOT Required"},{"$f":"IF('Tex-418-A'!$G$44=\"\",\"\",'Tex-418-A'!$G$44)","v":2}]
[37,{"$f":"IF('Tex-418-A'!$J$33=\"\",\"\",'Tex-418-A'!$J$33)","v":""},{"$f":"IF('Tex-418-A'!$B$6=\"\",\"\",'Tex-418-A'!$B$6)","v":"Tex-418-A"},{"$f":"IF('Tex-418-A'!$J$30=\"\",\"\",'Tex-418-A'!$J$30)","v":"Length of Cylinder"},{"$f":"IF('Tex-418-A'!$B$30=\"\",\"\",'Tex-418-A'!$B$30)","v":"SET"},{"$f":"IF('Tex-418-A'!$B$33=\"\",\"\",'Tex-418-A'!$B$33)","v":1},{"$f":"IF('Tex-418-A'!$E$33=\"\",\"\",'Tex-418-A'!$E$33)","v":7},{"$f":"IF('Tex-418-A'!$F$33=\"\",\"\",'Tex-418-A'!$F$33)","v":"Required"},{"$f":"IF('Tex-418-A'!$G$33=\"\",\"\",'Tex-418-A'!$G$33)","v":1}]
[38,{"$f":"IF('Tex-418-A'!$J$34=\"\",\"\",'Tex-418-A'!$J$34)","v":""},{"$f":"IF('Tex-418-A'!$B$6=\"\",\"\",'Tex-418-A'!$B$6)","v":"Tex-418-A"},{"$f":"IF('Tex-418-A'!$J$30=\"\",\"\",'Tex-418-A'!$J$30)","v":"Length of Cylinder"},{"$f":"IF('Tex-418-A'!$B$30=\"\",\"\",'Tex-418-A'!$B$30)","v":"SET"},{"$f":"IF('Tex-418-A'!$B$33=\"\",\"\",'Tex-418-A'!$B$33)","v":1},{"$f":"IF('Tex-418-A'!$E$33=\"\",\"\",'Tex-418-A'!$E$33)","v":7},{"$f":"IF('Tex-418-A'!$F$33=\"\",\"\",'Tex-418-A'!$F$33)","v":"Required"},{"$f":"IF('Tex-418-A'!$G$34=\"\",\"\",'Tex-418-A'!$G$34)","v":2}]
[39,{"$f":"IF('Tex-418-A'!$J$35=\"\",\"\",'Tex-418-A'!$J$35)","v":""},{"$f":"IF('Tex-418-A'!$B$6=\"\",\"\",'Tex-418-A'!$B$6)","v":"Tex-418-A"},{"$f":"IF('Tex-418-A'!$J$30=\"\",\"\",'Tex-418-A'!$J$30)","v":"Length of Cylinder"},{"$f":"IF('Tex-418-A'!$B$30=\"\",\"\",'Tex-418-A'!$B$30)","v":"SET"},{"$f":"IF('Tex-418-A'!$B$33=\"\",\"\",'Tex-418-A'!$B$33)","v":1},{"$f":"IF('Tex-418-A'!$E$35=\"\",\"\",'Tex-418-A'!$E$35)","v":28},{"$f":"IF('Tex-418-A'!$F$35=\"\",\"\",'Tex-418-A'!$F$35)","v":"Required"},{"$f":"IF('Tex-418-A'!$G$35=\"\",\"\",'Tex-418-A'!$G$35)","v":1}]
[40,{"$f":"IF('Tex-418-A'!$J$36=\"\",\"\",'Tex-418-A'!$J$36)","v":""},{"$f":"IF('Tex-418-A'!$B$6=\"\",\"\",'Tex-418-A'!$B$6)","v":"Tex-418-A"},{"$f":"IF('Tex-418-A'!$J$30=\"\",\"\",'Tex-418-A'!$J$30)","v":"Length of Cylinder"},{"$f":"IF('Tex-418-A'!$B$30=\"\",\"\",'Tex-418-A'!$B$30)","v":"SET"},{"$f":"IF('Tex-418-A'!$B$33=\"\",\"\",'Tex-418-A'!$B$33)","v":1},{"$f":"IF('Tex-418-A'!$E$35=\"\",\"\",'Tex-418-A'!$E$35)","v":28},{"$f":"IF('Tex-418-A'!$F$35=\"\",\"\",'Tex-418-A'!$F$35)","v":"Required"},{"$f":"IF('Tex-418-A'!$G$36=\"\",\"\",'Tex-418-A'!$G$36)","v":2}]
[41,{"$f":"IF('Tex-418-A'!$J$37=\"\",\"\",'Tex-418-A'!$J$37)","v":""},{"$f":"IF('Tex-418-A'!$B$6=\"\",\"\",'Tex-418-A'!$B$6)","v":"Tex-418-A"},{"$f":"IF('Tex-418-A'!$J$30=\"\",\"\",'Tex-418-A'!$J$30)","v":"Length of Cylinder"},{"$f":"IF('Tex-418-A'!$B$30=\"\",\"\",'Tex-418-A'!$B$30)","v":"SET"},{"$f":"IF('Tex-418-A'!$B$37=\"\",\"\",'Tex-418-A'!$B$37)","v":2},{"$f":"IF('Tex-418-A'!$E$37=\"\",\"\",'Tex-418-A'!$E$37)","v":7},{"$f":"IF('Tex-418-A'!$F$37=\"\",\"\",'Tex-418-A'!$F$37)","v":"Required"},{"$f":"IF('Tex-418-A'!$G$37=\"\",\"\",'Tex-418-A'!$G$37)","v":1}]
[42,{"$f":"IF('Tex-418-A'!$J$38=\"\",\"\",'Tex-418-A'!$J$38)","v":""},{"$f":"IF('Tex-418-A'!$B$6=\"\",\"\",'Tex-418-A'!$B$6)","v":"Tex-418-A"},{"$f":"IF('Tex-418-A'!$J$30=\"\",\"\",'Tex-418-A'!$J$30)","v":"Length of Cylinder"},{"$f":"IF('Tex-418-A'!$B$30=\"\",\"\",'Tex-418-A'!$B$30)","v":"SET"},{"$f":"IF('Tex-418-A'!$B$37=\"\",\"\",'Tex-418-A'!$B$37)","v":2},{"$f":"IF('Tex-418-A'!$E$37=\"\",\"\",'Tex-418-A'!$E$37)","v":7},{"$f":"IF('Tex-418-A'!$F$37=\"\",\"\",'Tex-418-A'!$F$37)","v":"Required"},{"$f":"IF('Tex-418-A'!$G$38=\"\",\"\",'Tex-418-A'!$G$38)","v":2}]
[43,{"$f":"IF('Tex-418-A'!$J$39=\"\",\"\",'Tex-418-A'!$J$39)","v":""},{"$f":"IF('Tex-418-A'!$B$6=\"\",\"\",'Tex-418-A'!$B$6)","v":"Tex-418-A"},{"$f":"IF('Tex-418-A'!$J$30=\"\",\"\",'Tex-418-A'!$J$30)","v":"Length of Cylinder"},{"$f":"IF('Tex-418-A'!$B$30=\"\",\"\",'Tex-418-A'!$B$30)","v":"SET"},{"$f":"IF('Tex-418-A'!$B$37=\"\",\"\",'Tex-418-A'!$B$37)","v":2},{"$f":"IF('Tex-418-A'!$E$39=\"\",\"\",'Tex-418-A'!$E$39)","v":28},{"$f":"IF('Tex-418-A'!$F$39=\"\",\"\",'Tex-418-A'!$F$39)","v":"NOT Required"},{"$f":"IF('Tex-418-A'!$G$39=\"\",\"\",'Tex-418-A'!$G$39)","v":1}]
[44,{"$f":"IF('Tex-418-A'!$J$40=\"\",\"\",'Tex-418-A'!$J$40)","v":""},{"$f":"IF('Tex-418-A'!$B$6=\"\",\"\",'Tex-418-A'!$B$6)","v":"Tex-418-A"},{"$f":"IF('Tex-418-A'!$J$30=\"\",\"\",'Tex-418-A'!$J$30)","v":"Length of Cylinder"},{"$f":"IF('Tex-418-A'!$B$30=\"\",\"\",'Tex-418-A'!$B$30)","v":"SET"},{"$f":"IF('Tex-418-A'!$B$37=\"\",\"\",'Tex-418-A'!$B$37)","v":2},{"$f":"IF('Tex-418-A'!$E$39=\"\",\"\",'Tex-418-A'!$E$39)","v":28},{"$f":"IF('Tex-418-A'!$F$39=\"\",\"\",'Tex-418-A'!$F$39)","v":"NOT Required"},{"$f":"IF('Tex-418-A'!$G$40=\"\",\"\",'Tex-418-A'!$G$40)","v":2}]
[45,{"$f":"IF('Tex-418-A'!$J$41=\"\",\"\",'Tex-418-A'!$J$41)","v":""},{"$f":"IF('Tex-418-A'!$B$6=\"\",\"\",'Tex-418-A'!$B$6)","v":"Tex-418-A"},{"$f":"IF('Tex-418-A'!$J$30=\"\",\"\",'Tex-418-A'!$J$30)","v":"Length of Cylinder"},{"$f":"IF('Tex-418-A'!$B$30=\"\",\"\",'Tex-418-A'!$B$30)","v":"SET"},{"$f":"IF('Tex-418-A'!$B$41=\"\",\"\",'Tex-418-A'!$B$41)","v":3},{"$f":"IF('Tex-418-A'!$E$41=\"\",\"\",'Tex-418-A'!$E$41)","v":7},{"$f":"IF('Tex-418-A'!$F$41=\"\",\"\",'Tex-418-A'!$F$41)","v":"Required"},{"$f":"IF('Tex-418-A'!$G$41=\"\",\"\",'Tex-418-A'!$G$41)","v":1}]
[46,{"$f":"IF('Tex-418-A'!$J$42=\"\",\"\",'Tex-418-A'!$J$42)","v":""},{"$f":"IF('Tex-418-A'!$B$6=\"\",\"\",'Tex-418-A'!$B$6)","v":"Tex-418-A"},{"$f":"IF('Tex-418-A'!$J$30=\"\",\"\",'Tex-418-A'!$J$30)","v":"Length of Cylinder"},{"$f":"IF('Tex-418-A'!$B$30=\"\",\"\",'Tex-418-A'!$B$30)","v":"SET"},{"$f":"IF('Tex-418-A'!$B$41=\"\",\"\",'Tex-418-A'!$B$41)","v":3},{"$f":"IF('Tex-418-A'!$E$41=\"\",\"\",'Tex-418-A'!$E$41)","v":7},{"$f":"IF('Tex-418-A'!$F$41=\"\",\"\",'Tex-418-A'!$F$41)","v":"Required"},{"$f":"IF('Tex-418-A'!$G$42=\"\",\"\",'Tex-418-A'!$G$42)","v":2}]
[47,{"$f":"IF('Tex-418-A'!$J$43=\"\",\"\",'Tex-418-A'!$J$43)","v":""},{"$f":"IF('Tex-418-A'!$B$6=\"\",\"\",'Tex-418-A'!$B$6)","v":"Tex-418-A"},{"$f":"IF('Tex-418-A'!$J$30=\"\",\"\",'Tex-418-A'!$J$30)","v":"Length of Cylinder"},{"$f":"IF('Tex-418-A'!$B$30=\"\",\"\",'Tex-418-A'!$B$30)","v":"SET"},{"$f":"IF('Tex-418-A'!$B$41=\"\",\"\",'Tex-418-A'!$B$41)","v":3},{"$f":"IF('Tex-418-A'!$E$43=\"\",\"\",'Tex-418-A'!$E$43)","v":28},{"$f":"IF('Tex-418-A'!$F$43=\"\",\"\",'Tex-418-A'!$F$43)","v":"NOT Required"},{"$f":"IF('Tex-418-A'!$G$43=\"\",\"\",'Tex-418-A'!$G$43)","v":1}]
[48,{"$f":"IF('Tex-418-A'!$J$44=\"\",\"\",'Tex-418-A'!$J$44)","v":""},{"$f":"IF('Tex-418-A'!$B$6=\"\",\"\",'Tex-418-A'!$B$6)","v":"Tex-418-A"},{"$f":"IF('Tex-418-A'!$J$30=\"\",\"\",'Tex-418-A'!$J$30)","v":"Length of Cylinder"},{"$f":"IF('Tex-418-A'!$B$30=\"\",\"\",'Tex-418-A'!$B$30)","v":"SET"},{"$f":"IF('Tex-418-A'!$B$41=\"\",\"\",'Tex-418-A'!$B$41)","v":3},{"$f":"IF('Tex-418-A'!$E$43=\"\",\"\",'Tex-418-A'!$E$43)","v":28},{"$f":"IF('Tex-418-A'!$F$43=\"\",\"\",'Tex-418-A'!$F$43)","v":"NOT Required"},{"$f":"IF('Tex-418-A'!$G$44=\"\",\"\",'Tex-418-A'!$G$44)","v":2}]
[49,{"$f":"IF('Tex-418-A'!$K$33=\"\",\"\",'Tex-418-A'!$K$33)","v":""},{"$f":"IF('Tex-418-A'!$B$6=\"\",\"\",'Tex-418-A'!$B$6)","v":"Tex-418-A"},{"$f":"IF('Tex-418-A'!$K$30=\"\",\"\",'Tex-418-A'!$K$30)","v":"Length to Diameter Ratio"},{"$f":"IF('Tex-418-A'!$B$30=\"\",\"\",'Tex-418-A'!$B$30)","v":"SET"},{"$f":"IF('Tex-418-A'!$B$33=\"\",\"\",'Tex-418-A'!$B$33)","v":1},{"$f":"IF('Tex-418-A'!$E$33=\"\",\"\",'Tex-418-A'!$E$33)","v":7},{"$f":"IF('Tex-418-A'!$F$33=\"\",\"\",'Tex-418-A'!$F$33)","v":"Required"},{"$f":"IF('Tex-418-A'!$G$33=\"\",\"\",'Tex-418-A'!$G$33)","v":1}]
[50,{"$f":"IF('Tex-418-A'!$K$34=\"\",\"\",'Tex-418-A'!$K$34)","v":""},{"$f":"IF('Tex-418-A'!$B$6=\"\",\"\",'Tex-418-A'!$B$6)","v":"Tex-418-A"},{"$f":"IF('Tex-418-A'!$K$30=\"\",\"\",'Tex-418-A'!$K$30)","v":"Length to Diameter Ratio"},{"$f":"IF('Tex-418-A'!$B$30=\"\",\"\",'Tex-418-A'!$B$30)","v":"SET"},{"$f":"IF('Tex-418-A'!$B$33=\"\",\"\",'Tex-418-A'!$B$33)","v":1},{"$f":"IF('Tex-418-A'!$E$33=\"\",\"\",'Tex-418-A'!$E$33)","v":7},{"$f":"IF('Tex-418-A'!$F$33=\"\",\"\",'Tex-418-A'!$F$33)","v":"Required"},{"$f":"IF('Tex-418-A'!$G$34=\"\",\"\",'Tex-418-A'!$G$34)","v":2}]
[51,{"$f":"IF('Tex-418-A'!$K$35=\"\",\"\",'Tex-418-A'!$K$35)","v":""},{"$f":"IF('Tex-418-A'!$B$6=\"\",\"\",'Tex-418-A'!$B$6)","v":"Tex-418-A"},{"$f":"IF('Tex-418-A'!$K$30=\"\",\"\",'Tex-418-A'!$K$30)","v":"Length to Diameter Ratio"},{"$f":"IF('Tex-418-A'!$B$30=\"\",\"\",'Tex-418-A'!$B$30)","v":"SET"},{"$f":"IF('Tex-418-A'!$B$33=\"\",\"\",'Tex-418-A'!$B$33)","v":1},{"$f":"IF('Tex-418-A'!$E$35=\"\",\"\",'Tex-418-A'!$E$35)","v":28},{"$f":"IF('Tex-418-A'!$F$35=\"\",\"\",'Tex-418-A'!$F$35)","v":"Required"},{"$f":"IF('Tex-418-A'!$G$35=\"\",\"\",'Tex-418-A'!$G$35)","v":1}]
[52,{"$f":"IF('Tex-418-A'!$K$36=\"\",\"\",'Tex-418-A'!$K$36)","v":""},{"$f":"IF('Tex-418-A'!$B$6=\"\",\"\",'Tex-418-A'!$B$6)","v":"Tex-418-A"},{"$f":"IF('Tex-418-A'!$K$30=\"\",\"\",'Tex-418-A'!$K$30)","v":"Length to Diameter Ratio"},{"$f":"IF('Tex-418-A'!$B$30=\"\",\"\",'Tex-418-A'!$B$30)","v":"SET"},{"$f":"IF('Tex-418-A'!$B$33=\"\",\"\",'Tex-418-A'!$B$33)","v":1},{"$f":"IF('Tex-418-A'!$E$35=\"\",\"\",'Tex-418-A'!$E$35)","v":28},{"$f":"IF('Tex-418-A'!$F$35=\"\",\"\",'Tex-418-A'!$F$35)","v":"Required"},{"$f":"IF('Tex-418-A'!$G$36=\"\",\"\",'Tex-418-A'!$G$36)","v":2}]
[53,{"$f":"IF('Tex-418-A'!$K$37=\"\",\"\",'Tex-418-A'!$K$37)","v":""},{"$f":"IF('Tex-418-A'!$B$6=\"\",\"\",'Tex-418-A'!$B$6)","v":"Tex-418-A"},{"$f":"IF('Tex-418-A'!$K$30=\"\",\"\",'Tex-418-A'!$K$30)","v":"Length to Diameter Ratio"},{"$f":"IF('Tex-418-A'!$B$30=\"\",\"\",'Tex-418-A'!$B$30)","v":"SET"},{"$f":"IF('Tex-418-A'!$B$37=\"\",\"\",'Tex-418-A'!$B$37)","v":2},{"$f":"IF('Tex-418-A'!$E$37=\"\",\"\",'Tex-418-A'!$E$37)","v":7},{"$f":"IF('Tex-418-A'!$F$37=\"\",\"\",'Tex-418-A'!$F$37)","v":"Required"},{"$f":"IF('Tex-418-A'!$G$37=\"\",\"\",'Tex-418-A'!$G$37)","v":1}]
[54,{"$f":"IF('Tex-418-A'!$K$38=\"\",\"\",'Tex-418-A'!$K$38)","v":""},{"$f":"IF('Tex-418-A'!$B$6=\"\",\"\",'Tex-418-A'!$B$6)","v":"Tex-418-A"},{"$f":"IF('Tex-418-A'!$K$30=\"\",\"\",'Tex-418-A'!$K$30)","v":"Length to Diameter Ratio"},{"$f":"IF('Tex-418-A'!$B$30=\"\",\"\",'Tex-418-A'!$B$30)","v":"SET"},{"$f":"IF('Tex-418-A'!$B$37=\"\",\"\",'Tex-418-A'!$B$37)","v":2},{"$f":"IF('Tex-418-A'!$E$37=\"\",\"\",'Tex-418-A'!$E$37)","v":7},{"$f":"IF('Tex-418-A'!$F$37=\"\",\"\",'Tex-418-A'!$F$37)","v":"Required"},{"$f":"IF('Tex-418-A'!$G$38=\"\",\"\",'Tex-418-A'!$G$38)","v":2}]
[55,{"$f":"IF('Tex-418-A'!$K$39=\"\",\"\",'Tex-418-A'!$K$39)","v":""},{"$f":"IF('Tex-418-A'!$B$6=\"\",\"\",'Tex-418-A'!$B$6)","v":"Tex-418-A"},{"$f":"IF('Tex-418-A'!$K$30=\"\",\"\",'Tex-418-A'!$K$30)","v":"Length to Diameter Ratio"},{"$f":"IF('Tex-418-A'!$B$30=\"\",\"\",'Tex-418-A'!$B$30)","v":"SET"},{"$f":"IF('Tex-418-A'!$B$37=\"\",\"\",'Tex-418-A'!$B$37)","v":2},{"$f":"IF('Tex-418-A'!$E$39=\"\",\"\",'Tex-418-A'!$E$39)","v":28},{"$f":"IF('Tex-418-A'!$F$39=\"\",\"\",'Tex-418-A'!$F$39)","v":"NOT Required"},{"$f":"IF('Tex-418-A'!$G$39=\"\",\"\",'Tex-418-A'!$G$39)","v":1}]
[56,{"$f":"IF('Tex-418-A'!$K$40=\"\",\"\",'Tex-418-A'!$K$40)","v":""},{"$f":"IF('Tex-418-A'!$B$6=\"\",\"\",'Tex-418-A'!$B$6)","v":"Tex-418-A"},{"$f":"IF('Tex-418-A'!$K$30=\"\",\"\",'Tex-418-A'!$K$30)","v":"Length to Diameter Ratio"},{"$f":"IF('Tex-418-A'!$B$30=\"\",\"\",'Tex-418-A'!$B$30)","v":"SET"},{"$f":"IF('Tex-418-A'!$B$37=\"\",\"\",'Tex-418-A'!$B$37)","v":2},{"$f":"IF('Tex-418-A'!$E$39=\"\",\"\",'Tex-418-A'!$E$39)","v":28},{"$f":"IF('Tex-418-A'!$F$39=\"\",\"\",'Tex-418-A'!$F$39)","v":"NOT Required"},{"$f":"IF('Tex-418-A'!$G$40=\"\",\"\",'Tex-418-A'!$G$40)","v":2}]
[57,{"$f":"IF('Tex-418-A'!$K$41=\"\",\"\",'Tex-418-A'!$K$41)","v":""},{"$f":"IF('Tex-418-A'!$B$6=\"\",\"\",'Tex-418-A'!$B$6)","v":"Tex-418-A"},{"$f":"IF('Tex-418-A'!$K$30=\"\",\"\",'Tex-418-A'!$K$30)","v":"Length to Diameter Ratio"},{"$f":"IF('Tex-418-A'!$B$30=\"\",\"\",'Tex-418-A'!$B$30)","v":"SET"},{"$f":"IF('Tex-418-A'!$B$41=\"\",\"\",'Tex-418-A'!$B$41)","v":3},{"$f":"IF('Tex-418-A'!$E$41=\"\",\"\",'Tex-418-A'!$E$41)","v":7},{"$f":"IF('Tex-418-A'!$F$41=\"\",\"\",'Tex-418-A'!$F$41)","v":"Required"},{"$f":"IF('Tex-418-A'!$G$41=\"\",\"\",'Tex-418-A'!$G$41)","v":1}]
[58,{"$f":"IF('Tex-418-A'!$K$42=\"\",\"\",'Tex-418-A'!$K$42)","v":""},{"$f":"IF('Tex-418-A'!$B$6=\"\",\"\",'Tex-418-A'!$B$6)","v":"Tex-418-A"},{"$f":"IF('Tex-418-A'!$K$30=\"\",\"\",'Tex-418-A'!$K$30)","v":"Length to Diameter Ratio"},{"$f":"IF('Tex-418-A'!$B$30=\"\",\"\",'Tex-418-A'!$B$30)","v":"SET"},{"$f":"IF('Tex-418-A'!$B$41=\"\",\"\",'Tex-418-A'!$B$41)","v":3},{"$f":"IF('Tex-418-A'!$E$41=\"\",\"\",'Tex-418-A'!$E$41)","v":7},{"$f":"IF('Tex-418-A'!$F$41=\"\",\"\",'Tex-418-A'!$F$41)","v":"Required"},{"$f":"IF('Tex-418-A'!$G$42=\"\",\"\",'Tex-418-A'!$G$42)","v":2}]
[59,{"$f":"IF('Tex-418-A'!$K$43=\"\",\"\",'Tex-418-A'!$K$43)","v":""},{"$f":"IF('Tex-418-A'!$B$6=\"\",\"\",'Tex-418-A'!$B$6)","v":"Tex-418-A"},{"$f":"IF('Tex-418-A'!$K$30=\"\",\"\",'Tex-418-A'!$K$30)","v":"Length to Diameter Ratio"},{"$f":"IF('Tex-418-A'!$B$30=\"\",\"\",'Tex-418-A'!$B$30)","v":"SET"},{"$f":"IF('Tex-418-A'!$B$41=\"\",\"\",'Tex-418-A'!$B$41)","v":3},{"$f":"IF('Tex-418-A'!$E$43=\"\",\"\",'Tex-418-A'!$E$43)","v":28},{"$f":"IF('Tex-418-A'!$F$43=\"\",\"\",'Tex-418-A'!$F$43)","v":"NOT Required"},{"$f":"IF('Tex-418-A'!$G$43=\"\",\"\",'Tex-418-A'!$G$43)","v":1}]
[60,{"$f":"IF('Tex-418-A'!$K$44=\"\",\"\",'Tex-418-A'!$K$44)","v":""},{"$f":"IF('Tex-418-A'!$B$6=\"\",\"\",'Tex-418-A'!$B$6)","v":"Tex-418-A"},{"$f":"IF('Tex-418-A'!$K$30=\"\",\"\",'Tex-418-A'!$K$30)","v":"Length to Diameter Ratio"},{"$f":"IF('Tex-418-A'!$B$30=\"\",\"\",'Tex-418-A'!$B$30)","v":"SET"},{"$f":"IF('Tex-418-A'!$B$41=\"\",\"\",'Tex-418-A'!$B$41)","v":3},{"$f":"IF('Tex-418-A'!$E$43=\"\",\"\",'Tex-418-A'!$E$43)","v":28},{"$f":"IF('Tex-418-A'!$F$43=\"\",\"\",'Tex-418-A'!$F$43)","v":"NOT Required"},{"$f":"IF('Tex-418-A'!$G$44=\"\",\"\",'Tex-418-A'!$G$44)","v":2}]
[61,{"$f":"IF('Tex-418-A'!$L$33=\"\",\"\",'Tex-418-A'!$L$33)","v":""},{"$f":"IF('Tex-418-A'!$B$6=\"\",\"\",'Tex-418-A'!$B$6)","v":"Tex-418-A"},{"$f":"IF('Tex-418-A'!$L$30=\"\",\"\",'Tex-418-A'!$L$30)","v":"Max Load"},{"$f":"IF('Tex-418-A'!$B$30=\"\",\"\",'Tex-418-A'!$B$30)","v":"SET"},{"$f":"IF('Tex-418-A'!$B$33=\"\",\"\",'Tex-418-A'!$B$33)","v":1},{"$f":"IF('Tex-418-A'!$E$33=\"\",\"\",'Tex-418-A'!$E$33)","v":7},{"$f":"IF('Tex-418-A'!$F$33=\"\",\"\",'Tex-418-A'!$F$33)","v":"Required"},{"$f":"IF('Tex-418-A'!$G$33=\"\",\"\",'Tex-418-A'!$G$33)","v":1}]
[62,{"$f":"IF('Tex-418-A'!$L$34=\"\",\"\",'Tex-418-A'!$L$34)","v":""},{"$f":"IF('Tex-418-A'!$B$6=\"\",\"\",'Tex-418-A'!$B$6)","v":"Tex-418-A"},{"$f":"IF('Tex-418-A'!$L$30=\"\",\"\",'Tex-418-A'!$L$30)","v":"Max Load"},{"$f":"IF('Tex-418-A'!$B$30=\"\",\"\",'Tex-418-A'!$B$30)","v":"SET"},{"$f":"IF('Tex-418-A'!$B$33=\"\",\"\",'Tex-418-A'!$B$33)","v":1},{"$f":"IF('Tex-418-A'!$E$33=\"\",\"\",'Tex-418-A'!$E$33)","v":7},{"$f":"IF('Tex-418-A'!$F$33=\"\",\"\",'Tex-418-A'!$F$33)","v":"Required"},{"$f":"IF('Tex-418-A'!$G$34=\"\",\"\",'Tex-418-A'!$G$34)","v":2}]
[63,{"$f":"IF('Tex-418-A'!$L$35=\"\",\"\",'Tex-418-A'!$L$35)","v":""},{"$f":"IF('Tex-418-A'!$B$6=\"\",\"\",'Tex-418-A'!$B$6)","v":"Tex-418-A"},{"$f":"IF('Tex-418-A'!$L$30=\"\",\"\",'Tex-418-A'!$L$30)","v":"Max Load"},{"$f":"IF('Tex-418-A'!$B$30=\"\",\"\",'Tex-418-A'!$B$30)","v":"SET"},{"$f":"IF('Tex-418-A'!$B$33=\"\",\"\",'Tex-418-A'!$B$33)","v":1},{"$f":"IF('Tex-418-A'!$E$35=\"\",\"\",'Tex-418-A'!$E$35)","v":28},{"$f":"IF('Tex-418-A'!$F$35=\"\",\"\",'Tex-418-A'!$F$35)","v":"Required"},{"$f":"IF('Tex-418-A'!$G$35=\"\",\"\",'Tex-418-A'!$G$35)","v":1}]
[64,{"$f":"IF('Tex-418-A'!$L$36=\"\",\"\",'Tex-418-A'!$L$36)","v":""},{"$f":"IF('Tex-418-A'!$B$6=\"\",\"\",'Tex-418-A'!$B$6)","v":"Tex-418-A"},{"$f":"IF('Tex-418-A'!$L$30=\"\",\"\",'Tex-418-A'!$L$30)","v":"Max Load"},{"$f":"IF('Tex-418-A'!$B$30=\"\",\"\",'Tex-418-A'!$B$30)","v":"SET"},{"$f":"IF('Tex-418-A'!$B$33=\"\",\"\",'Tex-418-A'!$B$33)","v":1},{"$f":"IF('Tex-418-A'!$E$35=\"\",\"\",'Tex-418-A'!$E$35)","v":28},{"$f":"IF('Tex-418-A'!$F$35=\"\",\"\",'Tex-418-A'!$F$35)","v":"Required"},{"$f":"IF('Tex-418-A'!$G$36=\"\",\"\",'Tex-418-A'!$G$36)","v":2}]
[65,{"$f":"IF('Tex-418-A'!$L$37=\"\",\"\",'Tex-418-A'!$L$37)","v":""},{"$f":"IF('Tex-418-A'!$B$6=\"\",\"\",'Tex-418-A'!$B$6)","v":"Tex-418-A"},{"$f":"IF('Tex-418-A'!$L$30=\"\",\"\",'Tex-418-A'!$L$30)","v":"Max Load"},{"$f":"IF('Tex-418-A'!$B$30=\"\",\"\",'Tex-418-A'!$B$30)","v":"SET"},{"$f":"IF('Tex-418-A'!$B$37=\"\",\"\",'Tex-418-A'!$B$37)","v":2},{"$f":"IF('Tex-418-A'!$E$37=\"\",\"\",'Tex-418-A'!$E$37)","v":7},{"$f":"IF('Tex-418-A'!$F$37=\"\",\"\",'Tex-418-A'!$F$37)","v":"Required"},{"$f":"IF('Tex-418-A'!$G$37=\"\",\"\",'Tex-418-A'!$G$37)","v":1}]
[66,{"$f":"IF('Tex-418-A'!$L$38=\"\",\"\",'Tex-418-A'!$L$38)","v":""},{"$f":"IF('Tex-418-A'!$B$6=\"\",\"\",'Tex-418-A'!$B$6)","v":"Tex-418-A"},{"$f":"IF('Tex-418-A'!$L$30=\"\",\"\",'Tex-418-A'!$L$30)","v":"Max Load"},{"$f":"IF('Tex-418-A'!$B$30=\"\",\"\",'Tex-418-A'!$B$30)","v":"SET"},{"$f":"IF('Tex-418-A'!$B$37=\"\",\"\",'Tex-418-A'!$B$37)","v":2},{"$f":"IF('Tex-418-A'!$E$37=\"\",\"\",'Tex-418-A'!$E$37)","v":7},{"$f":"IF('Tex-418-A'!$F$37=\"\",\"\",'Tex-418-A'!$F$37)","v":"Required"},{"$f":"IF('Tex-418-A'!$G$38=\"\",\"\",'Tex-418-A'!$G$38)","v":2}]
[67,{"$f":"IF('Tex-418-A'!$L$39=\"\",\"\",'Tex-418-A'!$L$39)","v":""},{"$f":"IF('Tex-418-A'!$B$6=\"\",\"\",'Tex-418-A'!$B$6)","v":"Tex-418-A"},{"$f":"IF('Tex-418-A'!$L$30=\"\",\"\",'Tex-418-A'!$L$30)","v":"Max Load"},{"$f":"IF('Tex-418-A'!$B$30=\"\",\"\",'Tex-418-A'!$B$30)","v":"SET"},{"$f":"IF('Tex-418-A'!$B$37=\"\",\"\",'Tex-418-A'!$B$37)","v":2},{"$f":"IF('Tex-418-A'!$E$39=\"\",\"\",'Tex-418-A'!$E$39)","v":28},{"$f":"IF('Tex-418-A'!$F$39=\"\",\"\",'Tex-418-A'!$F$39)","v":"NOT Required"},{"$f":"IF('Tex-418-A'!$G$39=\"\",\"\",'Tex-418-A'!$G$39)","v":1}]
[68,{"$f":"IF('Tex-418-A'!$L$40=\"\",\"\",'Tex-418-A'!$L$40)","v":""},{"$f":"IF('Tex-418-A'!$B$6=\"\",\"\",'Tex-418-A'!$B$6)","v":"Tex-418-A"},{"$f":"IF('Tex-418-A'!$L$30=\"\",\"\",'Tex-418-A'!$L$30)","v":"Max Load"},{"$f":"IF('Tex-418-A'!$B$30=\"\",\"\",'Tex-418-A'!$B$30)","v":"SET"},{"$f":"IF('Tex-418-A'!$B$37=\"\",\"\",'Tex-418-A'!$B$37)","v":2},{"$f":"IF('Tex-418-A'!$E$39=\"\",\"\",'Tex-418-A'!$E$39)","v":28},{"$f":"IF('Tex-418-A'!$F$39=\"\",\"\",'Tex-418-A'!$F$39)","v":"NOT Required"},{"$f":"IF('Tex-418-A'!$G$40=\"\",\"\",'Tex-418-A'!$G$40)","v":2}]
[69,{"$f":"IF('Tex-418-A'!$L$41=\"\",\"\",'Tex-418-A'!$L$41)","v":""},{"$f":"IF('Tex-418-A'!$B$6=\"\",\"\",'Tex-418-A'!$B$6)","v":"Tex-418-A"},{"$f":"IF('Tex-418-A'!$L$30=\"\",\"\",'Tex-418-A'!$L$30)","v":"Max Load"},{"$f":"IF('Tex-418-A'!$B$30=\"\",\"\",'Tex-418-A'!$B$30)","v":"SET"},{"$f":"IF('Tex-418-A'!$B$41=\"\",\"\",'Tex-418-A'!$B$41)","v":3},{"$f":"IF('Tex-418-A'!$E$41=\"\",\"\",'Tex-418-A'!$E$41)","v":7},{"$f":"IF('Tex-418-A'!$F$41=\"\",\"\",'Tex-418-A'!$F$41)","v":"Required"},{"$f":"IF('Tex-418-A'!$G$41=\"\",\"\",'Tex-418-A'!$G$41)","v":1}]
[70,{"$f":"IF('Tex-418-A'!$L$42=\"\",\"\",'Tex-418-A'!$L$42)","v":""},{"$f":"IF('Tex-418-A'!$B$6=\"\",\"\",'Tex-418-A'!$B$6)","v":"Tex-418-A"},{"$f":"IF('Tex-418-A'!$L$30=\"\",\"\",'Tex-418-A'!$L$30)","v":"Max Load"},{"$f":"IF('Tex-418-A'!$B$30=\"\",\"\",'Tex-418-A'!$B$30)","v":"SET"},{"$f":"IF('Tex-418-A'!$B$41=\"\",\"\",'Tex-418-A'!$B$41)","v":3},{"$f":"IF('Tex-418-A'!$E$41=\"\",\"\",'Tex-418-A'!$E$41)","v":7},{"$f":"IF('Tex-418-A'!$F$41=\"\",\"\",'Tex-418-A'!$F$41)","v":"Required"},{"$f":"IF('Tex-418-A'!$G$42=\"\",\"\",'Tex-418-A'!$G$42)","v":2}]
[71,{"$f":"IF('Tex-418-A'!$L$43=\"\",\"\",'Tex-418-A'!$L$43)","v":""},{"$f":"IF('Tex-418-A'!$B$6=\"\",\"\",'Tex-418-A'!$B$6)","v":"Tex-418-A"},{"$f":"IF('Tex-418-A'!$L$30=\"\",\"\",'Tex-418-A'!$L$30)","v":"Max Load"},{"$f":"IF('Tex-418-A'!$B$30=\"\",\"\",'Tex-418-A'!$B$30)","v":"SET"},{"$f":"IF('Tex-418-A'!$B$41=\"\",\"\",'Tex-418-A'!$B$41)","v":3},{"$f":"IF('Tex-418-A'!$E$43=\"\",\"\",'Tex-418-A'!$E$43)","v":28},{"$f":"IF('Tex-418-A'!$F$43=\"\",\"\",'Tex-418-A'!$F$43)","v":"NOT Required"},{"$f":"IF('Tex-418-A'!$G$43=\"\",\"\",'Tex-418-A'!$G$43)","v":1}]
[72,{"$f":"IF('Tex-418-A'!$L$44=\"\",\"\",'Tex-418-A'!$L$44)","v":""},{"$f":"IF('Tex-418-A'!$B$6=\"\",\"\",'Tex-418-A'!$B$6)","v":"Tex-418-A"},{"$f":"IF('Tex-418-A'!$L$30=\"\",\"\",'Tex-418-A'!$L$30)","v":"Max Load"},{"$f":"IF('Tex-418-A'!$B$30=\"\",\"\",'Tex-418-A'!$B$30)","v":"SET"},{"$f":"IF('Tex-418-A'!$B$41=\"\",\"\",'Tex-418-A'!$B$41)","v":3},{"$f":"IF('Tex-418-A'!$E$43=\"\",\"\",'Tex-418-A'!$E$43)","v":28},{"$f":"IF('Tex-418-A'!$F$43=\"\",\"\",'Tex-418-A'!$F$43)","v":"NOT Required"},{"$f":"IF('Tex-418-A'!$G$44=\"\",\"\",'Tex-418-A'!$G$44)","v":2}]
[73,{"$f":"IF('Tex-418-A'!$M$33=\"\",\"\",'Tex-418-A'!$M$33)","v":""},{"$f":"IF('Tex-418-A'!$B$6=\"\",\"\",'Tex-418-A'!$B$6)","v":"Tex-418-A"},{"$f":"IF('Tex-418-A'!$M$30=\"\",\"\",'Tex-418-A'!$M$30)","v":"Failure Type"},{"$f":"IF('Tex-418-A'!$B$30=\"\",\"\",'Tex-418-A'!$B$30)","v":"SET"},{"$f":"IF('Tex-418-A'!$B$33=\"\",\"\",'Tex-418-A'!$B$33)","v":1},{"$f":"IF('Tex-418-A'!$E$33=\"\",\"\",'Tex-418-A'!$E$33)","v":7},{"$f":"IF('Tex-418-A'!$F$33=\"\",\"\",'Tex-418-A'!$F$33)","v":"Required"},{"$f":"IF('Tex-418-A'!$G$33=\"\",\"\",'Tex-418-A'!$G$33)","v":1}]
[74,{"$f":"IF('Tex-418-A'!$M$34=\"\",\"\",'Tex-418-A'!$M$34)","v":""},{"$f":"IF('Tex-418-A'!$B$6=\"\",\"\",'Tex-418-A'!$B$6)","v":"Tex-418-A"},{"$f":"IF('Tex-418-A'!$M$30=\"\",\"\",'Tex-418-A'!$M$30)","v":"Failure Type"},{"$f":"IF('Tex-418-A'!$B$30=\"\",\"\",'Tex-418-A'!$B$30)","v":"SET"},{"$f":"IF('Tex-418-A'!$B$33=\"\",\"\",'Tex-418-A'!$B$33)","v":1},{"$f":"IF('Tex-418-A'!$E$33=\"\",\"\",'Tex-418-A'!$E$33)","v":7},{"$f":"IF('Tex-418-A'!$F$33=\"\",\"\",'Tex-418-A'!$F$33)","v":"Required"},{"$f":"IF('Tex-418-A'!$G$34=\"\",\"\",'Tex-418-A'!$G$34)","v":2}]
[75,{"$f":"IF('Tex-418-A'!$M$35=\"\",\"\",'Tex-418-A'!$M$35)","v":""},{"$f":"IF('Tex-418-A'!$B$6=\"\",\"\",'Tex-418-A'!$B$6)","v":"Tex-418-A"},{"$f":"IF('Tex-418-A'!$M$30=\"\",\"\",'Tex-418-A'!$M$30)","v":"Failure Type"},{"$f":"IF('Tex-418-A'!$B$30=\"\",\"\",'Tex-418-A'!$B$30)","v":"SET"},{"$f":"IF('Tex-418-A'!$B$33=\"\",\"\",'Tex-418-A'!$B$33)","v":1},{"$f":"IF('Tex-418-A'!$E$35=\"\",\"\",'Tex-418-A'!$E$35)","v":28},{"$f":"IF('Tex-418-A'!$F$35=\"\",\"\",'Tex-418-A'!$F$35)","v":"Required"},{"$f":"IF('Tex-418-A'!$G$35=\"\",\"\",'Tex-418-A'!$G$35)","v":1}]
[76,{"$f":"IF('Tex-418-A'!$M$36=\"\",\"\",'Tex-418-A'!$M$36)","v":""},{"$f":"IF('Tex-418-A'!$B$6=\"\",\"\",'Tex-418-A'!$B$6)","v":"Tex-418-A"},{"$f":"IF('Tex-418-A'!$M$30=\"\",\"\",'Tex-418-A'!$M$30)","v":"Failure Type"},{"$f":"IF('Tex-418-A'!$B$30=\"\",\"\",'Tex-418-A'!$B$30)","v":"SET"},{"$f":"IF('Tex-418-A'!$B$33=\"\",\"\",'Tex-418-A'!$B$33)","v":1},{"$f":"IF('Tex-418-A'!$E$35=\"\",\"\",'Tex-418-A'!$E$35)","v":28},{"$f":"IF('Tex-418-A'!$F$35=\"\",\"\",'Tex-418-A'!$F$35)","v":"Required"},{"$f":"IF('Tex-418-A'!$G$36=\"\",\"\",'Tex-418-A'!$G$36)","v":2}]
[77,{"$f":"IF('Tex-418-A'!$M$37=\"\",\"\",'Tex-418-A'!$M$37)","v":""},{"$f":"IF('Tex-418-A'!$B$6=\"\",\"\",'Tex-418-A'!$B$6)","v":"Tex-418-A"},{"$f":"IF('Tex-418-A'!$M$30=\"\",\"\",'Tex-418-A'!$M$30)","v":"Failure Type"},{"$f":"IF('Tex-418-A'!$B$30=\"\",\"\",'Tex-418-A'!$B$30)","v":"SET"},{"$f":"IF('Tex-418-A'!$B$37=\"\",\"\",'Tex-418-A'!$B$37)","v":2},{"$f":"IF('Tex-418-A'!$E$37=\"\",\"\",'Tex-418-A'!$E$37)","v":7},{"$f":"IF('Tex-418-A'!$F$37=\"\",\"\",'Tex-418-A'!$F$37)","v":"Required"},{"$f":"IF('Tex-418-A'!$G$37=\"\",\"\",'Tex-418-A'!$G$37)","v":1}]
[78,{"$f":"IF('Tex-418-A'!$M$38=\"\",\"\",'Tex-418-A'!$M$38)","v":""},{"$f":"IF('Tex-418-A'!$B$6=\"\",\"\",'Tex-418-A'!$B$6)","v":"Tex-418-A"},{"$f":"IF('Tex-418-A'!$M$30=\"\",\"\",'Tex-418-A'!$M$30)","v":"Failure Type"},{"$f":"IF('Tex-418-A'!$B$30=\"\",\"\",'Tex-418-A'!$B$30)","v":"SET"},{"$f":"IF('Tex-418-A'!$B$37=\"\",\"\",'Tex-418-A'!$B$37)","v":2},{"$f":"IF('Tex-418-A'!$E$37=\"\",\"\",'Tex-418-A'!$E$37)","v":7},{"$f":"IF('Tex-418-A'!$F$37=\"\",\"\",'Tex-418-A'!$F$37)","v":"Required"},{"$f":"IF('Tex-418-A'!$G$38=\"\",\"\",'Tex-418-A'!$G$38)","v":2}]
[79,{"$f":"IF('Tex-418-A'!$M$39=\"\",\"\",'Tex-418-A'!$M$39)","v":""},{"$f":"IF('Tex-418-A'!$B$6=\"\",\"\",'Tex-418-A'!$B$6)","v":"Tex-418-A"},{"$f":"IF('Tex-418-A'!$M$30=\"\",\"\",'Tex-418-A'!$M$30)","v":"Failure Type"},{"$f":"IF('Tex-418-A'!$B$30=\"\",\"\",'Tex-418-A'!$B$30)","v":"SET"},{"$f":"IF('Tex-418-A'!$B$37=\"\",\"\",'Tex-418-A'!$B$37)","v":2},{"$f":"IF('Tex-418-A'!$E$39=\"\",\"\",'Tex-418-A'!$E$39)","v":28},{"$f":"IF('Tex-418-A'!$F$39=\"\",\"\",'Tex-418-A'!$F$39)","v":"NOT Required"},{"$f":"IF('Tex-418-A'!$G$39=\"\",\"\",'Tex-418-A'!$G$39)","v":1}]
[80,{"$f":"IF('Tex-418-A'!$M$40=\"\",\"\",'Tex-418-A'!$M$40)","v":""},{"$f":"IF('Tex-418-A'!$B$6=\"\",\"\",'Tex-418-A'!$B$6)","v":"Tex-418-A"},{"$f":"IF('Tex-418-A'!$M$30=\"\",\"\",'Tex-418-A'!$M$30)","v":"Failure Type"},{"$f":"IF('Tex-418-A'!$B$30=\"\",\"\",'Tex-418-A'!$B$30)","v":"SET"},{"$f":"IF('Tex-418-A'!$B$37=\"\",\"\",'Tex-418-A'!$B$37)","v":2},{"$f":"IF('Tex-418-A'!$E$39=\"\",\"\",'Tex-418-A'!$E$39)","v":28},{"$f":"IF('Tex-418-A'!$F$39=\"\",\"\",'Tex-418-A'!$F$39)","v":"NOT Required"},{"$f":"IF('Tex-418-A'!$G$40=\"\",\"\",'Tex-418-A'!$G$40)","v":2}]
[81,{"$f":"IF('Tex-418-A'!$M$41=\"\",\"\",'Tex-418-A'!$M$41)","v":""},{"$f":"IF('Tex-418-A'!$B$6=\"\",\"\",'Tex-418-A'!$B$6)","v":"Tex-418-A"},{"$f":"IF('Tex-418-A'!$M$30=\"\",\"\",'Tex-418-A'!$M$30)","v":"Failure Type"},{"$f":"IF('Tex-418-A'!$B$30=\"\",\"\",'Tex-418-A'!$B$30)","v":"SET"},{"$f":"IF('Tex-418-A'!$B$41=\"\",\"\",'Tex-418-A'!$B$41)","v":3},{"$f":"IF('Tex-418-A'!$E$41=\"\",\"\",'Tex-418-A'!$E$41)","v":7},{"$f":"IF('Tex-418-A'!$F$41=\"\",\"\",'Tex-418-A'!$F$41)","v":"Required"},{"$f":"IF('Tex-418-A'!$G$41=\"\",\"\",'Tex-418-A'!$G$41)","v":1}]
[82,{"$f":"IF('Tex-418-A'!$M$42=\"\",\"\",'Tex-418-A'!$M$42)","v":""},{"$f":"IF('Tex-418-A'!$B$6=\"\",\"\",'Tex-418-A'!$B$6)","v":"Tex-418-A"},{"$f":"IF('Tex-418-A'!$M$30=\"\",\"\",'Tex-418-A'!$M$30)","v":"Failure Type"},{"$f":"IF('Tex-418-A'!$B$30=\"\",\"\",'Tex-418-A'!$B$30)","v":"SET"},{"$f":"IF('Tex-418-A'!$B$41=\"\",\"\",'Tex-418-A'!$B$41)","v":3},{"$f":"IF('Tex-418-A'!$E$41=\"\",\"\",'Tex-418-A'!$E$41)","v":7},{"$f":"IF('Tex-418-A'!$F$41=\"\",\"\",'Tex-418-A'!$F$41)","v":"Required"},{"$f":"IF('Tex-418-A'!$G$42=\"\",\"\",'Tex-418-A'!$G$42)","v":2}]
[83,{"$f":"IF('Tex-418-A'!$M$43=\"\",\"\",'Tex-418-A'!$M$43)","v":""},{"$f":"IF('Tex-418-A'!$B$6=\"\",\"\",'Tex-418-A'!$B$6)","v":"Tex-418-A"},{"$f":"IF('Tex-418-A'!$M$30=\"\",\"\",'Tex-418-A'!$M$30)","v":"Failure Type"},{"$f":"IF('Tex-418-A'!$B$30=\"\",\"\",'Tex-418-A'!$B$30)","v":"SET"},{"$f":"IF('Tex-418-A'!$B$41=\"\",\"\",'Tex-418-A'!$B$41)","v":3},{"$f":"IF('Tex-418-A'!$E$43=\"\",\"\",'Tex-418-A'!$E$43)","v":28},{"$f":"IF('Tex-418-A'!$F$43=\"\",\"\",'Tex-418-A'!$F$43)","v":"NOT Required"},{"$f":"IF('Tex-418-A'!$G$43=\"\",\"\",'Tex-418-A'!$G$43)","v":1}]
[84,{"$f":"IF('Tex-418-A'!$M$44=\"\",\"\",'Tex-418-A'!$M$44)","v":""},{"$f":"IF('Tex-418-A'!$B$6=\"\",\"\",'Tex-418-A'!$B$6)","v":"Tex-418-A"},{"$f":"IF('Tex-418-A'!$M$30=\"\",\"\",'Tex-418-A'!$M$30)","v":"Failure Type"},{"$f":"IF('Tex-418-A'!$B$30=\"\",\"\",'Tex-418-A'!$B$30)","v":"SET"},{"$f":"IF('Tex-418-A'!$B$41=\"\",\"\",'Tex-418-A'!$B$41)","v":3},{"$f":"IF('Tex-418-A'!$E$43=\"\",\"\",'Tex-418-A'!$E$43)","v":28},{"$f":"IF('Tex-418-A'!$F$43=\"\",\"\",'Tex-418-A'!$F$43)","v":"NOT Required"},{"$f":"IF('Tex-418-A'!$G$44=\"\",\"\",'Tex-418-A'!$G$44)","v":2}]
[85,{"$f":"IF('Tex-418-A'!$N$33=\"\",\"\",'Tex-418-A'!$N$33)","v":""},{"$f":"IF('Tex-418-A'!$B$6=\"\",\"\",'Tex-418-A'!$B$6)","v":"Tex-418-A"},{"$f":"IF('Tex-418-A'!$N$30=\"\",\"\",'Tex-418-A'!$N$30)","v":"Correction Factor"},{"$f":"IF('Tex-418-A'!$B$30=\"\",\"\",'Tex-418-A'!$B$30)","v":"SET"},{"$f":"IF('Tex-418-A'!$B$33=\"\",\"\",'Tex-418-A'!$B$33)","v":1},{"$f":"IF('Tex-418-A'!$E$33=\"\",\"\",'Tex-418-A'!$E$33)","v":7},{"$f":"IF('Tex-418-A'!$F$33=\"\",\"\",'Tex-418-A'!$F$33)","v":"Required"},{"$f":"IF('Tex-418-A'!$G$33=\"\",\"\",'Tex-418-A'!$G$33)","v":1}]
[86,{"$f":"IF('Tex-418-A'!$N$34=\"\",\"\",'Tex-418-A'!$N$34)","v":""},{"$f":"IF('Tex-418-A'!$B$6=\"\",\"\",'Tex-418-A'!$B$6)","v":"Tex-418-A"},{"$f":"IF('Tex-418-A'!$N$30=\"\",\"\",'Tex-418-A'!$N$30)","v":"Correction Factor"},{"$f":"IF('Tex-418-A'!$B$30=\"\",\"\",'Tex-418-A'!$B$30)","v":"SET"},{"$f":"IF('Tex-418-A'!$B$33=\"\",\"\",'Tex-418-A'!$B$33)","v":1},{"$f":"IF('Tex-418-A'!$E$33=\"\",\"\",'Tex-418-A'!$E$33)","v":7},{"$f":"IF('Tex-418-A'!$F$33=\"\",\"\",'Tex-418-A'!$F$33)","v":"Required"},{"$f":"IF('Tex-418-A'!$G$34=\"\",\"\",'Tex-418-A'!$G$34)","v":2}]
[87,{"$f":"IF('Tex-418-A'!$N$35=\"\",\"\",'Tex-418-A'!$N$35)","v":""},{"$f":"IF('Tex-418-A'!$B$6=\"\",\"\",'Tex-418-A'!$B$6)","v":"Tex-418-A"},{"$f":"IF('Tex-418-A'!$N$30=\"\",\"\",'Tex-418-A'!$N$30)","v":"Correction Factor"},{"$f":"IF('Tex-418-A'!$B$30=\"\",\"\",'Tex-418-A'!$B$30)","v":"SET"},{"$f":"IF('Tex-418-A'!$B$33=\"\",\"\",'Tex-418-A'!$B$33)","v":1},{"$f":"IF('Tex-418-A'!$E$35=\"\",\"\",'Tex-418-A'!$E$35)","v":28},{"$f":"IF('Tex-418-A'!$F$35=\"\",\"\",'Tex-418-A'!$F$35)","v":"Required"},{"$f":"IF('Tex-418-A'!$G$35=\"\",\"\",'Tex-418-A'!$G$35)","v":1}]
[88,{"$f":"IF('Tex-418-A'!$N$36=\"\",\"\",'Tex-418-A'!$N$36)","v":""},{"$f":"IF('Tex-418-A'!$B$6=\"\",\"\",'Tex-418-A'!$B$6)","v":"Tex-418-A"},{"$f":"IF('Tex-418-A'!$N$30=\"\",\"\",'Tex-418-A'!$N$30)","v":"Correction Factor"},{"$f":"IF('Tex-418-A'!$B$30=\"\",\"\",'Tex-418-A'!$B$30)","v":"SET"},{"$f":"IF('Tex-418-A'!$B$33=\"\",\"\",'Tex-418-A'!$B$33)","v":1},{"$f":"IF('Tex-418-A'!$E$35=\"\",\"\",'Tex-418-A'!$E$35)","v":28},{"$f":"IF('Tex-418-A'!$F$35=\"\",\"\",'Tex-418-A'!$F$35)","v":"Required"},{"$f":"IF('Tex-418-A'!$G$36=\"\",\"\",'Tex-418-A'!$G$36)","v":2}]
[89,{"$f":"IF('Tex-418-A'!$N$37=\"\",\"\",'Tex-418-A'!$N$37)","v":""},{"$f":"IF('Tex-418-A'!$B$6=\"\",\"\",'Tex-418-A'!$B$6)","v":"Tex-418-A"},{"$f":"IF('Tex-418-A'!$N$30=\"\",\"\",'Tex-418-A'!$N$30)","v":"Correction Factor"},{"$f":"IF('Tex-418-A'!$B$30=\"\",\"\",'Tex-418-A'!$B$30)","v":"SET"},{"$f":"IF('Tex-418-A'!$B$37=\"\",\"\",'Tex-418-A'!$B$37)","v":2},{"$f":"IF('Tex-418-A'!$E$37=\"\",\"\",'Tex-418-A'!$E$37)","v":7},{"$f":"IF('Tex-418-A'!$F$37=\"\",\"\",'Tex-418-A'!$F$37)","v":"Required"},{"$f":"IF('Tex-418-A'!$G$37=\"\",\"\",'Tex-418-A'!$G$37)","v":1}]
[90,{"$f":"IF('Tex-418-A'!$N$38=\"\",\"\",'Tex-418-A'!$N$38)","v":""},{"$f":"IF('Tex-418-A'!$B$6=\"\",\"\",'Tex-418-A'!$B$6)","v":"Tex-418-A"},{"$f":"IF('Tex-418-A'!$N$30=\"\",\"\",'Tex-418-A'!$N$30)","v":"Correction Factor"},{"$f":"IF('Tex-418-A'!$B$30=\"\",\"\",'Tex-418-A'!$B$30)","v":"SET"},{"$f":"IF('Tex-418-A'!$B$37=\"\",\"\",'Tex-418-A'!$B$37)","v":2},{"$f":"IF('Tex-418-A'!$E$37=\"\",\"\",'Tex-418-A'!$E$37)","v":7},{"$f":"IF('Tex-418-A'!$F$37=\"\",\"\",'Tex-418-A'!$F$37)","v":"Required"},{"$f":"IF('Tex-418-A'!$G$38=\"\",\"\",'Tex-418-A'!$G$38)","v":2}]
[91,{"$f":"IF('Tex-418-A'!$N$39=\"\",\"\",'Tex-418-A'!$N$39)","v":""},{"$f":"IF('Tex-418-A'!$B$6=\"\",\"\",'Tex-418-A'!$B$6)","v":"Tex-418-A"},{"$f":"IF('Tex-418-A'!$N$30=\"\",\"\",'Tex-418-A'!$N$30)","v":"Correction Factor"},{"$f":"IF('Tex-418-A'!$B$30=\"\",\"\",'Tex-418-A'!$B$30)","v":"SET"},{"$f":"IF('Tex-418-A'!$B$37=\"\",\"\",'Tex-418-A'!$B$37)","v":2},{"$f":"IF('Tex-418-A'!$E$39=\"\",\"\",'Tex-418-A'!$E$39)","v":28},{"$f":"IF('Tex-418-A'!$F$39=\"\",\"\",'Tex-418-A'!$F$39)","v":"NOT Required"},{"$f":"IF('Tex-418-A'!$G$39=\"\",\"\",'Tex-418-A'!$G$39)","v":1}]
[92,{"$f":"IF('Tex-418-A'!$N$40=\"\",\"\",'Tex-418-A'!$N$40)","v":""},{"$f":"IF('Tex-418-A'!$B$6=\"\",\"\",'Tex-418-A'!$B$6)","v":"Tex-418-A"},{"$f":"IF('Tex-418-A'!$N$30=\"\",\"\",'Tex-418-A'!$N$30)","v":"Correction Factor"},{"$f":"IF('Tex-418-A'!$B$30=\"\",\"\",'Tex-418-A'!$B$30)","v":"SET"},{"$f":"IF('Tex-418-A'!$B$37=\"\",\"\",'Tex-418-A'!$B$37)","v":2},{"$f":"IF('Tex-418-A'!$E$39=\"\",\"\",'Tex-418-A'!$E$39)","v":28},{"$f":"IF('Tex-418-A'!$F$39=\"\",\"\",'Tex-418-A'!$F$39)","v":"NOT Required"},{"$f":"IF('Tex-418-A'!$G$40=\"\",\"\",'Tex-418-A'!$G$40)","v":2}]
[93,{"$f":"IF('Tex-418-A'!$N$41=\"\",\"\",'Tex-418-A'!$N$41)","v":""},{"$f":"IF('Tex-418-A'!$B$6=\"\",\"\",'Tex-418-A'!$B$6)","v":"Tex-418-A"},{"$f":"IF('Tex-418-A'!$N$30=\"\",\"\",'Tex-418-A'!$N$30)","v":"Correction Factor"},{"$f":"IF('Tex-418-A'!$B$30=\"\",\"\",'Tex-418-A'!$B$30)","v":"SET"},{"$f":"IF('Tex-418-A'!$B$41=\"\",\"\",'Tex-418-A'!$B$41)","v":3},{"$f":"IF('Tex-418-A'!$E$41=\"\",\"\",'Tex-418-A'!$E$41)","v":7},{"$f":"IF('Tex-418-A'!$F$41=\"\",\"\",'Tex-418-A'!$F$41)","v":"Required"},{"$f":"IF('Tex-418-A'!$G$41=\"\",\"\",'Tex-418-A'!$G$41)","v":1}]
[94,{"$f":"IF('Tex-418-A'!$N$42=\"\",\"\",'Tex-418-A'!$N$42)","v":""},{"$f":"IF('Tex-418-A'!$B$6=\"\",\"\",'Tex-418-A'!$B$6)","v":"Tex-418-A"},{"$f":"IF('Tex-418-A'!$N$30=\"\",\"\",'Tex-418-A'!$N$30)","v":"Correction Factor"},{"$f":"IF('Tex-418-A'!$B$30=\"\",\"\",'Tex-418-A'!$B$30)","v":"SET"},{"$f":"IF('Tex-418-A'!$B$41=\"\",\"\",'Tex-418-A'!$B$41)","v":3},{"$f":"IF('Tex-418-A'!$E$41=\"\",\"\",'Tex-418-A'!$E$41)","v":7},{"$f":"IF('Tex-418-A'!$F$41=\"\",\"\",'Tex-418-A'!$F$41)","v":"Required"},{"$f":"IF('Tex-418-A'!$G$42=\"\",\"\",'Tex-418-A'!$G$42)","v":2}]
[95,{"$f":"IF('Tex-418-A'!$N$43=\"\",\"\",'Tex-418-A'!$N$43)","v":""},{"$f":"IF('Tex-418-A'!$B$6=\"\",\"\",'Tex-418-A'!$B$6)","v":"Tex-418-A"},{"$f":"IF('Tex-418-A'!$N$30=\"\",\"\",'Tex-418-A'!$N$30)","v":"Correction Factor"},{"$f":"IF('Tex-418-A'!$B$30=\"\",\"\",'Tex-418-A'!$B$30)","v":"SET"},{"$f":"IF('Tex-418-A'!$B$41=\"\",\"\",'Tex-418-A'!$B$41)","v":3},{"$f":"IF('Tex-418-A'!$E$43=\"\",\"\",'Tex-418-A'!$E$43)","v":28},{"$f":"IF('Tex-418-A'!$F$43=\"\",\"\",'Tex-418-A'!$F$43)","v":"NOT Required"},{"$f":"IF('Tex-418-A'!$G$43=\"\",\"\",'Tex-418-A'!$G$43)","v":1}]
[96,{"$f":"IF('Tex-418-A'!$N$44=\"\",\"\",'Tex-418-A'!$N$44)","v":""},{"$f":"IF('Tex-418-A'!$B$6=\"\",\"\",'Tex-418-A'!$B$6)","v":"Tex-418-A"},{"$f":"IF('Tex-418-A'!$N$30=\"\",\"\",'Tex-418-A'!$N$30)","v":"Correction Factor"},{"$f":"IF('Tex-418-A'!$B$30=\"\",\"\",'Tex-418-A'!$B$30)","v":"SET"},{"$f":"IF('Tex-418-A'!$B$41=\"\",\"\",'Tex-418-A'!$B$41)","v":3},{"$f":"IF('Tex-418-A'!$E$43=\"\",\"\",'Tex-418-A'!$E$43)","v":28},{"$f":"IF('Tex-418-A'!$F$43=\"\",\"\",'Tex-418-A'!$F$43)","v":"NOT Required"},{"$f":"IF('Tex-418-A'!$G$44=\"\",\"\",'Tex-418-A'!$G$44)","v":2}]
[97,{"$f":"IF('Tex-418-A'!$O$33=\"\",\"\",'Tex-418-A'!$O$33)","v":""},{"$f":"IF('Tex-418-A'!$B$6=\"\",\"\",'Tex-418-A'!$B$6)","v":"Tex-418-A"},{"$f":"IF('Tex-418-A'!$O$30=\"\",\"\",'Tex-418-A'!$O$30)","v":"Compressive Strength"},{"$f":"IF('Tex-418-A'!$B$30=\"\",\"\",'Tex-418-A'!$B$30)","v":"SET"},{"$f":"IF('Tex-418-A'!$B$33=\"\",\"\",'Tex-418-A'!$B$33)","v":1},{"$f":"IF('Tex-418-A'!$E$33=\"\",\"\",'Tex-418-A'!$E$33)","v":7},{"$f":"IF('Tex-418-A'!$F$33=\"\",\"\",'Tex-418-A'!$F$33)","v":"Required"},{"$f":"IF('Tex-418-A'!$G$33=\"\",\"\",'Tex-418-A'!$G$33)","v":1}]
[98,{"$f":"IF('Tex-418-A'!$O$34=\"\",\"\",'Tex-418-A'!$O$34)","v":""},{"$f":"IF('Tex-418-A'!$B$6=\"\",\"\",'Tex-418-A'!$B$6)","v":"Tex-418-A"},{"$f":"IF('Tex-418-A'!$O$30=\"\",\"\",'Tex-418-A'!$O$30)","v":"Compressive Strength"},{"$f":"IF('Tex-418-A'!$B$30=\"\",\"\",'Tex-418-A'!$B$30)","v":"SET"},{"$f":"IF('Tex-418-A'!$B$33=\"\",\"\",'Tex-418-A'!$B$33)","v":1},{"$f":"IF('Tex-418-A'!$E$33=\"\",\"\",'Tex-418-A'!$E$33)","v":7},{"$f":"IF('Tex-418-A'!$F$33=\"\",\"\",'Tex-418-A'!$F$33)","v":"Required"},{"$f":"IF('Tex-418-A'!$G$34=\"\",\"\",'Tex-418-A'!$G$34)","v":2}]
[99,{"$f":"IF('Tex-418-A'!$O$35=\"\",\"\",'Tex-418-A'!$O$35)","v":""},{"$f":"IF('Tex-418-A'!$B$6=\"\",\"\",'Tex-418-A'!$B$6)","v":"Tex-418-A"},{"$f":"IF('Tex-418-A'!$O$30=\"\",\"\",'Tex-418-A'!$O$30)","v":"Compressive Strength"},{"$f":"IF('Tex-418-A'!$B$30=\"\",\"\",'Tex-418-A'!$B$30)","v":"SET"},{"$f":"IF('Tex-418-A'!$B$33=\"\",\"\",'Tex-418-A'!$B$33)","v":1},{"$f":"IF('Tex-418-A'!$E$35=\"\",\"\",'Tex-418-A'!$E$35)","v":28},{"$f":"IF('Tex-418-A'!$F$35=\"\",\"\",'Tex-418-A'!$F$35)","v":"Required"},{"$f":"IF('Tex-418-A'!$G$35=\"\",\"\",'Tex-418-A'!$G$35)","v":1}]
[100,{"$f":"IF('Tex-418-A'!$O$36=\"\",\"\",'Tex-418-A'!$O$36)","v":""},{"$f":"IF('Tex-418-A'!$B$6=\"\",\"\",'Tex-418-A'!$B$6)","v":"Tex-418-A"},{"$f":"IF('Tex-418-A'!$O$30=\"\",\"\",'Tex-418-A'!$O$30)","v":"Compressive Strength"},{"$f":"IF('Tex-418-A'!$B$30=\"\",\"\",'Tex-418-A'!$B$30)","v":"SET"},{"$f":"IF('Tex-418-A'!$B$33=\"\",\"\",'Tex-418-A'!$B$33)","v":1},{"$f":"IF('Tex-418-A'!$E$35=\"\",\"\",'Tex-418-A'!$E$35)","v":28},{"$f":"IF('Tex-418-A'!$F$35=\"\",\"\",'Tex-418-A'!$F$35)","v":"Required"},{"$f":"IF('Tex-418-A'!$G$36=\"\",\"\",'Tex-418-A'!$G$36)","v":2}]
[101,{"$f":"IF('Tex-418-A'!$O$37=\"\",\"\",'Tex-418-A'!$O$37)","v":""},{"$f":"IF('Tex-418-A'!$B$6=\"\",\"\",'Tex-418-A'!$B$6)","v":"Tex-418-A"},{"$f":"IF('Tex-418-A'!$O$30=\"\",\"\",'Tex-418-A'!$O$30)","v":"Compressive Strength"},{"$f":"IF('Tex-418-A'!$B$30=\"\",\"\",'Tex-418-A'!$B$30)","v":"SET"},{"$f":"IF('Tex-418-A'!$B$37=\"\",\"\",'Tex-418-A'!$B$37)","v":2},{"$f":"IF('Tex-418-A'!$E$37=\"\",\"\",'Tex-418-A'!$E$37)","v":7},{"$f":"IF('Tex-418-A'!$F$37=\"\",\"\",'Tex-418-A'!$F$37)","v":"Required"},{"$f":"IF('Tex-418-A'!$G$37=\"\",\"\",'Tex-418-A'!$G$37)","v":1}]
[102,{"$f":"IF('Tex-418-A'!$O$38=\"\",\"\",'Tex-418-A'!$O$38)","v":""},{"$f":"IF('Tex-418-A'!$B$6=\"\",\"\",'Tex-418-A'!$B$6)","v":"Tex-418-A"},{"$f":"IF('Tex-418-A'!$O$30=\"\",\"\",'Tex-418-A'!$O$30)","v":"Compressive Strength"},{"$f":"IF('Tex-418-A'!$B$30=\"\",\"\",'Tex-418-A'!$B$30)","v":"SET"},{"$f":"IF('Tex-418-A'!$B$37=\"\",\"\",'Tex-418-A'!$B$37)","v":2},{"$f":"IF('Tex-418-A'!$E$37=\"\",\"\",'Tex-418-A'!$E$37)","v":7},{"$f":"IF('Tex-418-A'!$F$37=\"\",\"\",'Tex-418-A'!$F$37)","v":"Required"},{"$f":"IF('Tex-418-A'!$G$38=\"\",\"\",'Tex-418-A'!$G$38)","v":2}]
[103,{"$f":"IF('Tex-418-A'!$O$39=\"\",\"\",'Tex-418-A'!$O$39)","v":""},{"$f":"IF('Tex-418-A'!$B$6=\"\",\"\",'Tex-418-A'!$B$6)","v":"Tex-418-A"},{"$f":"IF('Tex-418-A'!$O$30=\"\",\"\",'Tex-418-A'!$O$30)","v":"Compressive Strength"},{"$f":"IF('Tex-418-A'!$B$30=\"\",\"\",'Tex-418-A'!$B$30)","v":"SET"},{"$f":"IF('Tex-418-A'!$B$37=\"\",\"\",'Tex-418-A'!$B$37)","v":2},{"$f":"IF('Tex-418-A'!$E$39=\"\",\"\",'Tex-418-A'!$E$39)","v":28},{"$f":"IF('Tex-418-A'!$F$39=\"\",\"\",'Tex-418-A'!$F$39)","v":"NOT Required"},{"$f":"IF('Tex-418-A'!$G$39=\"\",\"\",'Tex-418-A'!$G$39)","v":1}]
[104,{"$f":"IF('Tex-418-A'!$O$40=\"\",\"\",'Tex-418-A'!$O$40)","v":""},{"$f":"IF('Tex-418-A'!$B$6=\"\",\"\",'Tex-418-A'!$B$6)","v":"Tex-418-A"},{"$f":"IF('Tex-418-A'!$O$30=\"\",\"\",'Tex-418-A'!$O$30)","v":"Compressive Strength"},{"$f":"IF('Tex-418-A'!$B$30=\"\",\"\",'Tex-418-A'!$B$30)","v":"SET"},{"$f":"IF('Tex-418-A'!$B$37=\"\",\"\",'Tex-418-A'!$B$37)","v":2},{"$f":"IF('Tex-418-A'!$E$39=\"\",\"\",'Tex-418-A'!$E$39)","v":28},{"$f":"IF('Tex-418-A'!$F$39=\"\",\"\",'Tex-418-A'!$F$39)","v":"NOT Required"},{"$f":"IF('Tex-418-A'!$G$40=\"\",\"\",'Tex-418-A'!$G$40)","v":2}]
[105,{"$f":"IF('Tex-418-A'!$O$41=\"\",\"\",'Tex-418-A'!$O$41)","v":""},{"$f":"IF('Tex-418-A'!$B$6=\"\",\"\",'Tex-418-A'!$B$6)","v":"Tex-418-A"},{"$f":"IF('Tex-418-A'!$O$30=\"\",\"\",'Tex-418-A'!$O$30)","v":"Compressive Strength"},{"$f":"IF('Tex-418-A'!$B$30=\"\",\"\",'Tex-418-A'!$B$30)","v":"SET"},{"$f":"IF('Tex-418-A'!$B$41=\"\",\"\",'Tex-418-A'!$B$41)","v":3},{"$f":"IF('Tex-418-A'!$E$41=\"\",\"\",'Tex-418-A'!$E$41)","v":7},{"$f":"IF('Tex-418-A'!$F$41=\"\",\"\",'Tex-418-A'!$F$41)","v":"Required"},{"$f":"IF('Tex-418-A'!$G$41=\"\",\"\",'Tex-418-A'!$G$41)","v":1}]
[106,{"$f":"IF('Tex-418-A'!$O$42=\"\",\"\",'Tex-418-A'!$O$42)","v":""},{"$f":"IF('Tex-418-A'!$B$6=\"\",\"\",'Tex-418-A'!$B$6)","v":"Tex-418-A"},{"$f":"IF('Tex-418-A'!$O$30=\"\",\"\",'Tex-418-A'!$O$30)","v":"Compressive Strength"},{"$f":"IF('Tex-418-A'!$B$30=\"\",\"\",'Tex-418-A'!$B$30)","v":"SET"},{"$f":"IF('Tex-418-A'!$B$41=\"\",\"\",'Tex-418-A'!$B$41)","v":3},{"$f":"IF('Tex-418-A'!$E$41=\"\",\"\",'Tex-418-A'!$E$41)","v":7},{"$f":"IF('Tex-418-A'!$F$41=\"\",\"\",'Tex-418-A'!$F$41)","v":"Required"},{"$f":"IF('Tex-418-A'!$G$42=\"\",\"\",'Tex-418-A'!$G$42)","v":2}]
[107,{"$f":"IF('Tex-418-A'!$O$43=\"\",\"\",'Tex-418-A'!$O$43)","v":""},{"$f":"IF('Tex-418-A'!$B$6=\"\",\"\",'Tex-418-A'!$B$6)","v":"Tex-418-A"},{"$f":"IF('Tex-418-A'!$O$30=\"\",\"\",'Tex-418-A'!$O$30)","v":"Compressive Strength"},{"$f":"IF('Tex-418-A'!$B$30=\"\",\"\",'Tex-418-A'!$B$30)","v":"SET"},{"$f":"IF('Tex-418-A'!$B$41=\"\",\"\",'Tex-418-A'!$B$41)","v":3},{"$f":"IF('Tex-418-A'!$E$43=\"\",\"\",'Tex-418-A'!$E$43)","v":28},{"$f":"IF('Tex-418-A'!$F$43=\"\",\"\",'Tex-418-A'!$F$43)","v":"NOT Required"},{"$f":"IF('Tex-418-A'!$G$43=\"\",\"\",'Tex-418-A'!$G$43)","v":1}]
[108,{"$f":"IF('Tex-418-A'!$O$44=\"\",\"\",'Tex-418-A'!$O$44)","v":""},{"$f":"IF('Tex-418-A'!$B$6=\"\",\"\",'Tex-418-A'!$B$6)","v":"Tex-418-A"},{"$f":"IF('Tex-418-A'!$O$30=\"\",\"\",'Tex-418-A'!$O$30)","v":"Compressive Strength"},{"$f":"IF('Tex-418-A'!$B$30=\"\",\"\",'Tex-418-A'!$B$30)","v":"SET"},{"$f":"IF('Tex-418-A'!$B$41=\"\",\"\",'Tex-418-A'!$B$41)","v":3},{"$f":"IF('Tex-418-A'!$E$43=\"\",\"\",'Tex-418-A'!$E$43)","v":28},{"$f":"IF('Tex-418-A'!$F$43=\"\",\"\",'Tex-418-A'!$F$43)","v":"NOT Required"},{"$f":"IF('Tex-418-A'!$G$44=\"\",\"\",'Tex-418-A'!$G$44)","v":2}]
[109,{"$f":"IF('Tex-418-A'!$P$33=\"\",\"\",'Tex-418-A'!$P$33)","v":""},{"$f":"IF('Tex-418-A'!$B$6=\"\",\"\",'Tex-418-A'!$B$6)","v":"Tex-418-A"},{"$f":"IF('Tex-418-A'!$P$30=\"\",\"\",'Tex-418-A'!$P$30)","v":"Compressive Strength (avg)"},{"$f":"IF('Tex-418-A'!$B$30=\"\",\"\",'Tex-418-A'!$B$30)","v":"SET"},{"$f":"IF('Tex-418-A'!$B$33=\"\",\"\",'Tex-418-A'!$B$33)","v":1},{"$f":"IF('Tex-418-A'!$E$33=\"\",\"\",'Tex-418-A'!$E$33)","v":7},{"$f":"IF('Tex-418-A'!$F$33=\"\",\"\",'Tex-418-A'!$F$33)","v":"Required"}]
[110,{"$f":"IF('Tex-418-A'!$P$35=\"\",\"\",'Tex-418-A'!$P$35)","v":""},{"$f":"IF('Tex-418-A'!$B$6=\"\",\"\",'Tex-418-A'!$B$6)","v":"Tex-418-A"},{"$f":"IF('Tex-418-A'!$P$30=\"\",\"\",'Tex-418-A'!$P$30)","v":"Compressive Strength (avg)"},{"$f":"IF('Tex-418-A'!$B$30=\"\",\"\",'Tex-418-A'!$B$30)","v":"SET"},{"$f":"IF('Tex-418-A'!$B$33=\"\",\"\",'Tex-418-A'!$B$33)","v":1},{"$f":"IF('Tex-418-A'!$E$35=\"\",\"\",'Tex-418-A'!$E$35)","v":28},{"$f":"IF('Tex-418-A'!$F$35=\"\",\"\",'Tex-418-A'!$F$35)","v":"Required"}]
[111,{"$f":"IF('Tex-418-A'!$P$37=\"\",\"\",'Tex-418-A'!$P$37)","v":""},{"$f":"IF('Tex-418-A'!$B$6=\"\",\"\",'Tex-418-A'!$B$6)","v":"Tex-418-A"},{"$f":"IF('Tex-418-A'!$P$30=\"\",\"\",'Tex-418-A'!$P$30)","v":"Compressive Strength (avg)"},{"$f":"IF('Tex-418-A'!$B$30=\"\",\"\",'Tex-418-A'!$B$30)","v":"SET"},{"$f":"IF('Tex-418-A'!$B$37=\"\",\"\",'Tex-418-A'!$B$37)","v":2},{"$f":"IF('Tex-418-A'!$E$37=\"\",\"\",'Tex-418-A'!$E$37)","v":7},{"$f":"IF('Tex-418-A'!$F$37=\"\",\"\",'Tex-418-A'!$F$37)","v":"Required"}]
[112,{"$f":"IF('Tex-418-A'!$P$39=\"\",\"\",'Tex-418-A'!$P$39)","v":""},{"$f":"IF('Tex-418-A'!$B$6=\"\",\"\",'Tex-418-A'!$B$6)","v":"Tex-418-A"},{"$f":"IF('Tex-418-A'!$P$30=\"\",\"\",'Tex-418-A'!$P$30)","v":"Compressive Strength (avg)"},{"$f":"IF('Tex-418-A'!$B$30=\"\",\"\",'Tex-418-A'!$B$30)","v":"SET"},{"$f":"IF('Tex-418-A'!$B$37=\"\",\"\",'Tex-418-A'!$B$37)","v":2},{"$f":"IF('Tex-418-A'!$E$39=\"\",\"\",'Tex-418-A'!$E$39)","v":28},{"$f":"IF('Tex-418-A'!$F$39=\"\",\"\",'Tex-418-A'!$F$39)","v":"NOT Required"}]
[113,{"$f":"IF('Tex-418-A'!$P$41=\"\",\"\",'Tex-418-A'!$P$41)","v":""},{"$f":"IF('Tex-418-A'!$B$6=\"\",\"\",'Tex-418-A'!$B$6)","v":"Tex-418-A"},{"$f":"IF('Tex-418-A'!$P$30=\"\",\"\",'Tex-418-A'!$P$30)","v":"Compressive Strength (avg)"},{"$f":"IF('Tex-418-A'!$B$30=\"\",\"\",'Tex-418-A'!$B$30)","v":"SET"},{"$f":"IF('Tex-418-A'!$B$41=\"\",\"\",'Tex-418-A'!$B$41)","v":3},{"$f":"IF('Tex-418-A'!$E$41=\"\",\"\",'Tex-418-A'!$E$41)","v":7},{"$f":"IF('Tex-418-A'!$F$41=\"\",\"\",'Tex-418-A'!$F$41)","v":"Required"}]
[114,{"$f":"IF('Tex-418-A'!$P$43=\"\",\"\",'Tex-418-A'!$P$43)","v":""},{"$f":"IF('Tex-418-A'!$B$6=\"\",\"\",'Tex-418-A'!$B$6)","v":"Tex-418-A"},{"$f":"IF('Tex-418-A'!$P$30=\"\",\"\",'Tex-418-A'!$P$30)","v":"Compressive Strength (avg)"},{"$f":"IF('Tex-418-A'!$B$30=\"\",\"\",'Tex-418-A'!$B$30)","v":"SET"},{"$f":"IF('Tex-418-A'!$B$41=\"\",\"\",'Tex-418-A'!$B$41)","v":3},{"$f":"IF('Tex-418-A'!$E$43=\"\",\"\",'Tex-418-A'!$E$43)","v":28},{"$f":"IF('Tex-418-A'!$F$43=\"\",\"\",'Tex-418-A'!$F$43)","v":"NOT Required"}]
[115,{"$f":"IF('Tex-418-A'!$Q$33=\"\",\"\",'Tex-418-A'!$Q$33)","v":""},{"$f":"IF('Tex-418-A'!$B$6=\"\",\"\",'Tex-418-A'!$B$6)","v":"Tex-418-A"},{"$f":"IF('Tex-418-A'!$Q$30=\"\",\"\",'Tex-418-A'!$Q$30)","v":"Meets Strength Requirement"},{"$f":"IF('Tex-418-A'!$B$30=\"\",\"\",'Tex-418-A'!$B$30)","v":"SET"},{"$f":"IF('Tex-418-A'!$B$33=\"\",\"\",'Tex-418-A'!$B$33)","v":1},{"$f":"IF('Tex-418-A'!$E$33=\"\",\"\",'Tex-418-A'!$E$33)","v":7},{"$f":"IF('Tex-418-A'!$F$33=\"\",\"\",'Tex-418-A'!$F$33)","v":"Required"}]
[116,{"$f":"IF('Tex-418-A'!$Q$35=\"\",\"\",'Tex-418-A'!$Q$35)","v":""},{"$f":"IF('Tex-418-A'!$B$6=\"\",\"\",'Tex-418-A'!$B$6)","v":"Tex-418-A"},{"$f":"IF('Tex-418-A'!$Q$30=\"\",\"\",'Tex-418-A'!$Q$30)","v":"Meets Strength Requirement"},{"$f":"IF('Tex-418-A'!$B$30=\"\",\"\",'Tex-418-A'!$B$30)","v":"SET"},{"$f":"IF('Tex-418-A'!$B$33=\"\",\"\",'Tex-418-A'!$B$33)","v":1},{"$f":"IF('Tex-418-A'!$E$35=\"\",\"\",'Tex-418-A'!$E$35)","v":28},{"$f":"IF('Tex-418-A'!$F$35=\"\",\"\",'Tex-418-A'!$F$35)","v":"Required"}]
[117,{"$f":"IF('Tex-418-A'!$Q$37=\"\",\"\",'Tex-418-A'!$Q$37)","v":""},{"$f":"IF('Tex-418-A'!$B$6=\"\",\"\",'Tex-418-A'!$B$6)","v":"Tex-418-A"},{"$f":"IF('Tex-418-A'!$Q$30=\"\",\"\",'Tex-418-A'!$Q$30)","v":"Meets Strength Requirement"},{"$f":"IF('Tex-418-A'!$B$30=\"\",\"\",'Tex-418-A'!$B$30)","v":"SET"},{"$f":"IF('Tex-418-A'!$B$37=\"\",\"\",'Tex-418-A'!$B$37)","v":2},{"$f":"IF('Tex-418-A'!$E$37=\"\",\"\",'Tex-418-A'!$E$37)","v":7},{"$f":"IF('Tex-418-A'!$F$37=\"\",\"\",'Tex-418-A'!$F$37)","v":"Required"}]
[118,{"$f":"IF('Tex-418-A'!$Q$39=\"\",\"\",'Tex-418-A'!$Q$39)","v":""},{"$f":"IF('Tex-418-A'!$B$6=\"\",\"\",'Tex-418-A'!$B$6)","v":"Tex-418-A"},{"$f":"IF('Tex-418-A'!$Q$30=\"\",\"\",'Tex-418-A'!$Q$30)","v":"Meets Strength Requirement"},{"$f":"IF('Tex-418-A'!$B$30=\"\",\"\",'Tex-418-A'!$B$30)","v":"SET"},{"$f":"IF('Tex-418-A'!$B$37=\"\",\"\",'Tex-418-A'!$B$37)","v":2},{"$f":"IF('Tex-418-A'!$E$39=\"\",\"\",'Tex-418-A'!$E$39)","v":28},{"$f":"IF('Tex-418-A'!$F$39=\"\",\"\",'Tex-418-A'!$F$39)","v":"NOT Required"}]
[119,{"$f":"IF('Tex-418-A'!$Q$41=\"\",\"\",'Tex-418-A'!$Q$41)","v":""},{"$f":"IF('Tex-418-A'!$B$6=\"\",\"\",'Tex-418-A'!$B$6)","v":"Tex-418-A"},{"$f":"IF('Tex-418-A'!$Q$30=\"\",\"\",'Tex-418-A'!$Q$30)","v":"Meets Strength Requirement"},{"$f":"IF('Tex-418-A'!$B$30=\"\",\"\",'Tex-418-A'!$B$30)","v":"SET"},{"$f":"IF('Tex-418-A'!$B$41=\"\",\"\",'Tex-418-A'!$B$41)","v":3},{"$f":"IF('Tex-418-A'!$E$41=\"\",\"\",'Tex-418-A'!$E$41)","v":7},{"$f":"IF('Tex-418-A'!$F$41=\"\",\"\",'Tex-418-A'!$F$41)","v":"Required"}]
[120,{"$f":"IF('Tex-418-A'!$Q$43=\"\",\"\",'Tex-418-A'!$Q$43)","v":""},{"$f":"IF('Tex-418-A'!$B$6=\"\",\"\",'Tex-418-A'!$B$6)","v":"Tex-418-A"},{"$f":"IF('Tex-418-A'!$Q$30=\"\",\"\",'Tex-418-A'!$Q$30)","v":"Meets Strength Requirement"},{"$f":"IF('Tex-418-A'!$B$30=\"\",\"\",'Tex-418-A'!$B$30)","v":"SET"},{"$f":"IF('Tex-418-A'!$B$41=\"\",\"\",'Tex-418-A'!$B$41)","v":3},{"$f":"IF('Tex-418-A'!$E$43=\"\",\"\",'Tex-418-A'!$E$43)","v":28},{"$f":"IF('Tex-418-A'!$F$43=\"\",\"\",'Tex-418-A'!$F$43)","v":"NOT Required"}]
[121,{"$f":"IF('Tex-418-A'!$R$33=\"\",\"\",'Tex-418-A'!$R$33)","v":""},{"$f":"IF('Tex-418-A'!$B$6=\"\",\"\",'Tex-418-A'!$B$6)","v":"Tex-418-A"},{"$f":"IF('Tex-418-A'!$R$30=\"\",\"\",'Tex-418-A'!$R$30)","v":"Structure Description"},{"$f":"IF('Tex-418-A'!$B$30=\"\",\"\",'Tex-418-A'!$B$30)","v":"SET"},{"$f":"IF('Tex-418-A'!$B$33=\"\",\"\",'Tex-418-A'!$B$33)","v":1},{"$f":"IF('Tex-418-A'!$E$33=\"\",\"\",'Tex-418-A'!$E$33)","v":7},{"$f":"IF('Tex-418-A'!$F$33=\"\",\"\",'Tex-418-A'!$F$33)","v":"Required"}]
[122,{"$f":"IF('Tex-418-A'!$R$37=\"\",\"\",'Tex-418-A'!$R$37)","v":""},{"$f":"IF('Tex-418-A'!$B$6=\"\",\"\",'Tex-418-A'!$B$6)","v":"Tex-418-A"},{"$f":"IF('Tex-418-A'!$R$30=\"\",\"\",'Tex-418-A'!$R$30)","v":"Structure Description"},{"$f":"IF('Tex-418-A'!$B$30=\"\",\"\",'Tex-418-A'!$B$30)","v":"SET"},{"$f":"IF('Tex-418-A'!$B$37=\"\",\"\",'Tex-418-A'!$B$37)","v":2},{"$f":"IF('Tex-418-A'!$E$37=\"\",\"\",'Tex-418-A'!$E$37)","v":7},{"$f":"IF('Tex-418-A'!$F$37=\"\",\"\",'Tex-418-A'!$F$37)","v":"Required"}]
[123,{"$f":"IF('Tex-418-A'!$R$41=\"\",\"\",'Tex-418-A'!$R$41)","v":""},{"$f":"IF('Tex-418-A'!$B$6=\"\",\"\",'Tex-418-A'!$B$6)","v":"Tex-418-A"},{"$f":"IF('Tex-418-A'!$R$30=\"\",\"\",'Tex-418-A'!$R$30)","v":"Structure Description"},{"$f":"IF('Tex-418-A'!$B$30=\"\",\"\",'Tex-418-A'!$B$30)","v":"SET"},{"$f":"IF('Tex-418-A'!$B$41=\"\",\"\",'Tex-418-A'!$B$41)","v":3},{"$f":"IF('Tex-418-A'!$E$41=\"\",\"\",'Tex-418-A'!$E$41)","v":7},{"$f":"IF('Tex-418-A'!$F$41=\"\",\"\",'Tex-418-A'!$F$41)","v":"Required"}]
[124,{"$f":"IF('Tex-418-A'!$D$52=\"\",\"\",'Tex-418-A'!$D$52)","v":""},{"$f":"IF(\"Sampled By \"=\"\",\"\",\"Sampled By \")","v":"Sampled By "},{"$f":"IF('Tex-418-A'!$B$52=\"\",\"\",'Tex-418-A'!$B$52)","v":"TX407"}]
[125,{"$f":"IF('Tex-418-A'!$I$52=\"\",\"\",'Tex-418-A'!$I$52)","v":""},{"$f":"IF(\"Sampled Date \"=\"\",\"\",\"Sampled Date \")","v":"Sampled Date "},{"$f":"IF('Tex-418-A'!$B$52=\"\",\"\",'Tex-418-A'!$B$52)","v":"TX407"}]

{"sheet":"Revisions","index":2,"n_rows":8,"n_cols":4,"rows_kept":8,"cut":false,"hidden":true,"merged":[]}
["Date","Changes","By","Comments"]
["2005-05-24","Change Range Name TestPerson1 from ='Tex-418-A'!$E$45  to ='Tex-418-A'!$C$45","Joe Liu"," no pull down list for the testers."]
["2005-06-21","Change test method from Tx4Hard to Tx418","Joe Liu"]
["2006-06-12","Added comments in cells B22:O22.","Jennifer Moore"]
["2018-02-08","Added versioning for changes going forward","Rachel Cano"]
["2018-02-08","changed text in cell B24 to reflect 2014 guide schedule update","Rachel Cano"]
["2018-02-08","added conditional formatting to 7-day target strength cells","Rachel Cano"]
["2018-02-08","changed equations in table columns F and Q to reflect 2014 requirements","Rachel Cano"]

{"sheet":"L to D Lookup","index":3,"n_rows":112,"n_cols":7,"rows_kept":112,"cut":false,"hidden":true,"merged":[[31,3,32,3]]}
["Length to Diameter Ratio","Correction Factor",null,null,"English MOR","Metric MOR"]
[1,0.87,null,null,{"$f":"IF(ISERROR(IF('Tex-418-A'!#REF!>('Tex-418-A'!#REF!*0.05),\"RETEST\",IF('Tex-418-A'!#REF!=0,((('Tex-418-A'!#REF!*6^3/'Tex-418-A'!#REF!)*'Tex-418-A'!#REF!)/('Tex-418-A'!#REF!*'Tex-418-A'!#REF!^2)),3*((('Tex-418-A'!#REF!*6^3/'Tex-418-A'!#REF!)*('Tex-418-A'!#REF!/3-'Tex-418-A'!#REF!))/('Tex-418-A'!#REF!*'Tex-418-A'!#REF!^2))))),\"\",IF('Tex-418-A'!#REF!>('Tex-418-A'!#REF!*0.05),\"RETEST\",IF('Tex-418-A'!#REF!=0,((('Tex-418-A'!#REF!*6^3/'Tex-418-A'!#REF!)*'Tex-418-A'!#REF!)/('Tex-418-A'!#REF!*'Tex-418-A'!#REF!^2)),3*((('Tex-418-A'!#REF!*6^3/'Tex-418-A'!#REF!)*('Tex-418-A'!#REF!/3-'Tex-418-A'!#REF!))/('Tex-418-A'!#REF!*'Tex-418-A'!#REF!^2)))))","v":""},{"$f":"IF(ISERROR(IF('Tex-418-A'!#REF!>('Tex-418-A'!#REF!*0.05),\"RETEST\",IF('Tex-418-A'!#REF!=0,(((('Tex-418-A'!#REF!*1000)*('Tex-418-A'!#REF!))/(('Tex-418-A'!#REF!)*(('Tex-418-A'!#REF!))^2))),(3*((('Tex-418-A'!#REF!*1000)*('Tex-418-A'!#REF!/3-'Tex-418-A'!#REF!))/('Tex-418-A'!#REF!*'Tex-418-A'!#REF!^2)))))),\"\",IF('Tex-418-A'!#REF!>('Tex-418-A'!#REF!*0.05),\"RETEST\",IF('Tex-418-A'!#REF!=0,(((('Tex-418-A'!#REF!*1000)*('Tex-418-A'!#REF!))/(('Tex-418-A'!#REF!)*(('Tex-418-A'!#REF!))^2))),(3*((('Tex-418-A'!#REF!*1000)*('Tex-418-A'!#REF!/3-'Tex-418-A'!#REF!))/('Tex-418-A'!#REF!*'Tex-418-A'!#REF!^2))))))","v":""}]
[1.01,{"$f":"0.87+((A3-1)*(0.93-0.87)/0.25)","v":0.872},null,null,{"$f":"IF(ISERROR(IF('Tex-418-A'!#REF!>('Tex-418-A'!#REF!*0.05),\"RETEST\",IF('Tex-418-A'!#REF!=0,((('Tex-418-A'!#REF!*6^3/'Tex-418-A'!#REF!)*'Tex-418-A'!#REF!)/('Tex-418-A'!#REF!*'Tex-418-A'!#REF!^2)),3*((('Tex-418-A'!#REF!*6^3/'Tex-418-A'!#REF!)*('Tex-418-A'!#REF!/3-'Tex-418-A'!#REF!))/('Tex-418-A'!#REF!*'Tex-418-A'!#REF!^2))))),\"\",IF('Tex-418-A'!#REF!>('Tex-418-A'!#REF!*0.05),\"RETEST\",IF('Tex-418-A'!#REF!=0,((('Tex-418-A'!#REF!*6^3/'Tex-418-A'!#REF!)*'Tex-418-A'!#REF!)/('Tex-418-A'!#REF!*'Tex-418-A'!#REF!^2)),3*((('Tex-418-A'!#REF!*6^3/'Tex-418-A'!#REF!)*('Tex-418-A'!#REF!/3-'Tex-418-A'!#REF!))/('Tex-418-A'!#REF!*'Tex-418-A'!#REF!^2)))))","v":""},{"$f":"IF(ISERROR(IF('Tex-418-A'!#REF!>('Tex-418-A'!#REF!*0.05),\"RETEST\",IF('Tex-418-A'!#REF!=0,(((('Tex-418-A'!#REF!*1000)*('Tex-418-A'!#REF!))/(('Tex-418-A'!#REF!)*(('Tex-418-A'!#REF!))^2))),(3*((('Tex-418-A'!#REF!*1000)*('Tex-418-A'!#REF!/3-'Tex-418-A'!#REF!))/('Tex-418-A'!#REF!*'Tex-418-A'!#REF!^2)))))),\"\",IF('Tex-418-A'!#REF!>('Tex-418-A'!#REF!*0.05),\"RETEST\",IF('Tex-418-A'!#REF!=0,(((('Tex-418-A'!#REF!*1000)*('Tex-418-A'!#REF!))/(('Tex-418-A'!#REF!)*(('Tex-418-A'!#REF!))^2))),(3*((('Tex-418-A'!#REF!*1000)*('Tex-418-A'!#REF!/3-'Tex-418-A'!#REF!))/('Tex-418-A'!#REF!*'Tex-418-A'!#REF!^2))))))","v":""}]
[1.02,{"$f":"0.87+((A4-1)*(0.93-0.87)/0.25)","v":0.875},null,null,{"$f":"IF(ISERROR(IF('Tex-418-A'!#REF!>('Tex-418-A'!#REF!*0.05),\"RETEST\",IF('Tex-418-A'!#REF!=0,((('Tex-418-A'!#REF!*6^3/'Tex-418-A'!#REF!)*'Tex-418-A'!#REF!)/('Tex-418-A'!#REF!*'Tex-418-A'!#REF!^2)),3*((('Tex-418-A'!#REF!*6^3/'Tex-418-A'!#REF!)*('Tex-418-A'!#REF!/3-'Tex-418-A'!#REF!))/('Tex-418-A'!#REF!*'Tex-418-A'!#REF!^2))))),\"\",IF('Tex-418-A'!#REF!>('Tex-418-A'!#REF!*0.05),\"RETEST\",IF('Tex-418-A'!#REF!=0,((('Tex-418-A'!#REF!*6^3/'Tex-418-A'!#REF!)*'Tex-418-A'!#REF!)/('Tex-418-A'!#REF!*'Tex-418-A'!#REF!^2)),3*((('Tex-418-A'!#REF!*6^3/'Tex-418-A'!#REF!)*('Tex-418-A'!#REF!/3-'Tex-418-A'!#REF!))/('Tex-418-A'!#REF!*'Tex-418-A'!#REF!^2)))))","v":""},{"$f":"IF(ISERROR(IF('Tex-418-A'!#REF!>('Tex-418-A'!#REF!*0.05),\"RETEST\",IF('Tex-418-A'!#REF!=0,(((('Tex-418-A'!#REF!*1000)*('Tex-418-A'!#REF!))/(('Tex-418-A'!#REF!)*(('Tex-418-A'!#REF!))^2))),(3*((('Tex-418-A'!#REF!*1000)*('Tex-418-A'!#REF!/3-'Tex-418-A'!#REF!))/('Tex-418-A'!#REF!*'Tex-418-A'!#REF!^2)))))),\"\",IF('Tex-418-A'!#REF!>('Tex-418-A'!#REF!*0.05),\"RETEST\",IF('Tex-418-A'!#REF!=0,(((('Tex-418-A'!#REF!*1000)*('Tex-418-A'!#REF!))/(('Tex-418-A'!#REF!)*(('Tex-418-A'!#REF!))^2))),(3*((('Tex-418-A'!#REF!*1000)*('Tex-418-A'!#REF!/3-'Tex-418-A'!#REF!))/('Tex-418-A'!#REF!*'Tex-418-A'!#REF!^2))))))","v":""}]
[1.03,0.877,null,null,{"$f":"IF(ISERROR(IF('Tex-418-A'!#REF!>('Tex-418-A'!#REF!*0.05),\"RETEST\",IF('Tex-418-A'!#REF!=0,((('Tex-418-A'!#REF!*6^3/'Tex-418-A'!#REF!)*'Tex-418-A'!#REF!)/('Tex-418-A'!#REF!*'Tex-418-A'!#REF!^2)),3*((('Tex-418-A'!#REF!*6^3/'Tex-418-A'!#REF!)*('Tex-418-A'!#REF!/3-'Tex-418-A'!#REF!))/('Tex-418-A'!#REF!*'Tex-418-A'!#REF!^2))))),\"\",IF('Tex-418-A'!#REF!>('Tex-418-A'!#REF!*0.05),\"RETEST\",IF('Tex-418-A'!#REF!=0,((('Tex-418-A'!#REF!*6^3/'Tex-418-A'!#REF!)*'Tex-418-A'!#REF!)/('Tex-418-A'!#REF!*'Tex-418-A'!#REF!^2)),3*((('Tex-418-A'!#REF!*6^3/'Tex-418-A'!#REF!)*('Tex-418-A'!#REF!/3-'Tex-418-A'!#REF!))/('Tex-418-A'!#REF!*'Tex-418-A'!#REF!^2)))))","v":""},{"$f":"IF(ISERROR(IF('Tex-418-A'!#REF!>('Tex-418-A'!#REF!*0.05),\"RETEST\",IF('Tex-418-A'!#REF!=0,(((('Tex-418-A'!#REF!*1000)*('Tex-418-A'!#REF!))/(('Tex-418-A'!#REF!)*(('Tex-418-A'!#REF!))^2))),(3*((('Tex-418-A'!#REF!*1000)*('Tex-418-A'!#REF!/3-'Tex-418-A'!#REF!))/('Tex-418-A'!#REF!*'Tex-418-A'!#REF!^2)))))),\"\",IF('Tex-418-A'!#REF!>('Tex-418-A'!#REF!*0.05),\"RETEST\",IF('Tex-418-A'!#REF!=0,(((('Tex-418-A'!#REF!*1000)*('Tex-418-A'!#REF!))/(('Tex-418-A'!#REF!)*(('Tex-418-A'!#REF!))^2))),(3*((('Tex-418-A'!#REF!*1000)*('Tex-418-A'!#REF!/3-'Tex-418-A'!#REF!))/('Tex-418-A'!#REF!*'Tex-418-A'!#REF!^2))))))","v":""}]
[1.04,0.88,null,null,{"$f":"IF(ISERROR(IF('Tex-418-A'!#REF!>('Tex-418-A'!#REF!*0.05),\"RETEST\",IF('Tex-418-A'!#REF!=0,((('Tex-418-A'!#REF!*6^3/'Tex-418-A'!#REF!)*'Tex-418-A'!#REF!)/('Tex-418-A'!#REF!*'Tex-418-A'!#REF!^2)),3*((('Tex-418-A'!#REF!*6^3/'Tex-418-A'!#REF!)*('Tex-418-A'!#REF!/3-'Tex-418-A'!#REF!))/('Tex-418-A'!#REF!*'Tex-418-A'!#REF!^2))))),\"\",IF('Tex-418-A'!#REF!>('Tex-418-A'!#REF!*0.05),\"RETEST\",IF('Tex-418-A'!#REF!=0,((('Tex-418-A'!#REF!*6^3/'Tex-418-A'!#REF!)*'Tex-418-A'!#REF!)/('Tex-418-A'!#REF!*'Tex-418-A'!#REF!^2)),3*((('Tex-418-A'!#REF!*6^3/'Tex-418-A'!#REF!)*('Tex-418-A'!#REF!/3-'Tex-418-A'!#REF!))/('Tex-418-A'!#REF!*'Tex-418-A'!#REF!^2)))))","v":""},{"$f":"IF(ISERROR(IF('Tex-418-A'!#REF!>('Tex-418-A'!#REF!*0.05),\"RETEST\",IF('Tex-418-A'!#REF!=0,(((('Tex-418-A'!#REF!*1000)*('Tex-418-A'!#REF!))/(('Tex-418-A'!#REF!)*(('Tex-418-A'!#REF!))^2))),(3*((('Tex-418-A'!#REF!*1000)*('Tex-418-A'!#REF!/3-'Tex-418-A'!#REF!))/('Tex-418-A'!#REF!*'Tex-418-A'!#REF!^2)))))),\"\",IF('Tex-418-A'!#REF!>('Tex-418-A'!#REF!*0.05),\"RETEST\",IF('Tex-418-A'!#REF!=0,(((('Tex-418-A'!#REF!*1000)*('Tex-418-A'!#REF!))/(('Tex-418-A'!#REF!)*(('Tex-418-A'!#REF!))^2))),(3*((('Tex-418-A'!#REF!*1000)*('Tex-418-A'!#REF!/3-'Tex-418-A'!#REF!))/('Tex-418-A'!#REF!*'Tex-418-A'!#REF!^2))))))","v":""}]
[1.05,0.88200000000000001,null,null,{"$f":"IF(ISERROR(IF('Tex-418-A'!#REF!>('Tex-418-A'!#REF!*0.05),\"RETEST\",IF('Tex-418-A'!#REF!=0,((('Tex-418-A'!#REF!*6^3/'Tex-418-A'!#REF!)*'Tex-418-A'!#REF!)/('Tex-418-A'!#REF!*'Tex-418-A'!#REF!^2)),3*((('Tex-418-A'!#REF!*6^3/'Tex-418-A'!#REF!)*('Tex-418-A'!#REF!/3-'Tex-418-A'!#REF!))/('Tex-418-A'!#REF!*'Tex-418-A'!#REF!^2))))),\"\",IF('Tex-418-A'!#REF!>('Tex-418-A'!#REF!*0.05),\"RETEST\",IF('Tex-418-A'!#REF!=0,((('Tex-418-A'!#REF!*6^3/'Tex-418-A'!#REF!)*'Tex-418-A'!#REF!)/('Tex-418-A'!#REF!*'Tex-418-A'!#REF!^2)),3*((('Tex-418-A'!#REF!*6^3/'Tex-418-A'!#REF!)*('Tex-418-A'!#REF!/3-'Tex-418-A'!#REF!))/('Tex-418-A'!#REF!*'Tex-418-A'!#REF!^2)))))","v":""},{"$f":"IF(ISERROR(IF('Tex-418-A'!#REF!>('Tex-418-A'!#REF!*0.05),\"RETEST\",IF('Tex-418-A'!#REF!=0,(((('Tex-418-A'!#REF!*1000)*('Tex-418-A'!#REF!))/(('Tex-418-A'!#REF!)*(('Tex-418-A'!#REF!))^2))),(3*((('Tex-418-A'!#REF!*1000)*('Tex-418-A'!#REF!/3-'Tex-418-A'!#REF!))/('Tex-418-A'!#REF!*'Tex-418-A'!#REF!^2)))))),\"\",IF('Tex-418-A'!#REF!>('Tex-418-A'!#REF!*0.05),\"RETEST\",IF('Tex-418-A'!#REF!=0,(((('Tex-418-A'!#REF!*1000)*('Tex-418-A'!#REF!))/(('Tex-418-A'!#REF!)*(('Tex-418-A'!#REF!))^2))),(3*((('Tex-418-A'!#REF!*1000)*('Tex-418-A'!#REF!/3-'Tex-418-A'!#REF!))/('Tex-418-A'!#REF!*'Tex-418-A'!#REF!^2))))))","v":""}]
[1.06,0.88400000000000001,null,null,{"$f":"IF(ISERROR(IF('Tex-418-A'!#REF!>('Tex-418-A'!#REF!*0.05),\"RETEST\",IF('Tex-418-A'!#REF!=0,((('Tex-418-A'!#REF!*6^3/'Tex-418-A'!#REF!)*'Tex-418-A'!#REF!)/('Tex-418-A'!#REF!*'Tex-418-A'!#REF!^2)),3*((('Tex-418-A'!#REF!*6^3/'Tex-418-A'!#REF!)*('Tex-418-A'!#REF!/3-'Tex-418-A'!#REF!))/('Tex-418-A'!#REF!*'Tex-418-A'!#REF!^2))))),\"\",IF('Tex-418-A'!#REF!>('Tex-418-A'!#REF!*0.05),\"RETEST\",IF('Tex-418-A'!#REF!=0,((('Tex-418-A'!#REF!*6^3/'Tex-418-A'!#REF!)*'Tex-418-A'!#REF!)/('Tex-418-A'!#REF!*'Tex-418-A'!#REF!^2)),3*((('Tex-418-A'!#REF!*6^3/'Tex-418-A'!#REF!)*('Tex-418-A'!#REF!/3-'Tex-418-A'!#REF!))/('Tex-418-A'!#REF!*'Tex-418-A'!#REF!^2)))))","v":""},{"$f":"IF(ISERROR(IF('Tex-418-A'!#REF!>('Tex-418-A'!#REF!*0.05),\"RETEST\",IF('Tex-418-A'!#REF!=0,(((('Tex-418-A'!#REF!*1000)*('Tex-418-A'!#REF!))/(('Tex-418-A'!#REF!)*(('Tex-418-A'!#REF!))^2))),(3*((('Tex-418-A'!#REF!*1000)*('Tex-418-A'!#REF!/3-'Tex-418-A'!#REF!))/('Tex-418-A'!#REF!*'Tex-418-A'!#REF!^2)))))),\"\",IF('Tex-418-A'!#REF!>('Tex-418-A'!#REF!*0.05),\"RETEST\",IF('Tex-418-A'!#REF!=0,(((('Tex-418-A'!#REF!*1000)*('Tex-418-A'!#REF!))/(('Tex-418-A'!#REF!)*(('Tex-418-A'!#REF!))^2))),(3*((('Tex-418-A'!#REF!*1000)*('Tex-418-A'!#REF!/3-'Tex-418-A'!#REF!))/('Tex-418-A'!#REF!*'Tex-418-A'!#REF!^2))))))","v":""}]
[1.07,0.88700000000000001,null,null,{"$f":"IF(ISERROR(IF('Tex-418-A'!#REF!>('Tex-418-A'!#REF!*0.05),\"RETEST\",IF('Tex-418-A'!#REF!=0,((('Tex-418-A'!#REF!*6^3/'Tex-418-A'!#REF!)*'Tex-418-A'!#REF!)/('Tex-418-A'!#REF!*'Tex-418-A'!#REF!^2)),3*((('Tex-418-A'!#REF!*6^3/'Tex-418-A'!#REF!)*('Tex-418-A'!#REF!/3-'Tex-418-A'!#REF!))/('Tex-418-A'!#REF!*'Tex-418-A'!#REF!^2))))),\"\",IF('Tex-418-A'!#REF!>('Tex-418-A'!#REF!*0.05),\"RETEST\",IF('Tex-418-A'!#REF!=0,((('Tex-418-A'!#REF!*6^3/'Tex-418-A'!#REF!)*'Tex-418-A'!#REF!)/('Tex-418-A'!#REF!*'Tex-418-A'!#REF!^2)),3*((('Tex-418-A'!#REF!*6^3/'Tex-418-A'!#REF!)*('Tex-418-A'!#REF!/3-'Tex-418-A'!#REF!))/('Tex-418-A'!#REF!*'Tex-418-A'!#REF!^2)))))","v":""},{"$f":"IF(ISERROR(IF('Tex-418-A'!#REF!>('Tex-418-A'!#REF!*0.05),\"RETEST\",IF('Tex-418-A'!#REF!=0,(((('Tex-418-A'!#REF!*1000)*('Tex-418-A'!#REF!))/(('Tex-418-A'!#REF!)*(('Tex-418-A'!#REF!))^2))),(3*((('Tex-418-A'!#REF!*1000)*('Tex-418-A'!#REF!/3-'Tex-418-A'!#REF!))/('Tex-418-A'!#REF!*'Tex-418-A'!#REF!^2)))))),\"\",IF('Tex-418-A'!#REF!>('Tex-418-A'!#REF!*0.05),\"RETEST\",IF('Tex-418-A'!#REF!=0,(((('Tex-418-A'!#REF!*1000)*('Tex-418-A'!#REF!))/(('Tex-418-A'!#REF!)*(('Tex-418-A'!#REF!))^2))),(3*((('Tex-418-A'!#REF!*1000)*('Tex-418-A'!#REF!/3-'Tex-418-A'!#REF!))/('Tex-418-A'!#REF!*'Tex-418-A'!#REF!^2))))))","v":""}]
[1.08,0.88900000000000001]
[1.0900000000000001,0.89200000000000002,null,null,"English f'c","Metric f'c"]
[1.1000000000000001,0.89400000000000002,null,null,{"$f":"IF(ISERROR('Tex-418-A'!$N33*('Tex-418-A'!$L33/(PI()*(IF(CircumDiameter1=\"circumference\",SQRT('Tex-418-A'!$I33/PI())*2,'Tex-418-A'!$I33)^2/4)))),\"\",'Tex-418-A'!$N33*('Tex-418-A'!$L33/(PI()*(IF(CircumDiameter1=\"circumference\",SQRT('Tex-418-A'!$I33/PI())*2,'Tex-418-A'!$I33)^2/4))))","v":""},{"$f":"IF(ISERROR(0.000001*('Tex-418-A'!$N33*('Tex-418-A'!$L33/(PI()*((IF(CircumDiameter1=\"circumference\",SQRT('Tex-418-A'!$I33/PI())*2,'Tex-418-A'!$I33)/1000)^2/4))))),\"\",0.000001*('Tex-418-A'!$N33*('Tex-418-A'!$L33/(PI()*((IF(CircumDiameter1=\"circumference\",SQRT('Tex-418-A'!$I33/PI())*2,'Tex-418-A'!$I33)/1000)^2/4)))))","v":""}]
[1.1100000000000001,0.89600000000000002,null,null,{"$f":"IF(ISERROR('Tex-418-A'!$N34*('Tex-418-A'!$L34/(PI()*(IF(CircumDiameter1=\"circumference\",SQRT('Tex-418-A'!$I34/PI())*2,'Tex-418-A'!$I34)^2/4)))),\"\",'Tex-418-A'!$N34*('Tex-418-A'!$L34/(PI()*(IF(CircumDiameter1=\"circumference\",SQRT('Tex-418-A'!$I34/PI())*2,'Tex-418-A'!$I34)^2/4))))","v":""},{"$f":"IF(ISERROR(0.000001*('Tex-418-A'!$N34*('Tex-418-A'!$L34/(PI()*((IF(CircumDiameter1=\"circumference\",SQRT('Tex-418-A'!$I34/PI())*2,'Tex-418-A'!$I34)/1000)^2/4))))),\"\",0.000001*('Tex-418-A'!$N34*('Tex-418-A'!$L34/(PI()*((IF(CircumDiameter1=\"circumference\",SQRT('Tex-418-A'!$I34/PI())*2,'Tex-418-A'!$I34)/1000)^2/4)))))","v":""}]
[1.1200000000000001,0.89900000000000002,null,null,{"$f":"IF(ISERROR('Tex-418-A'!$N35*('Tex-418-A'!$L35/(PI()*(IF(CircumDiameter1=\"circumference\",SQRT('Tex-418-A'!$I35/PI())*2,'Tex-418-A'!$I35)^2/4)))),\"\",'Tex-418-A'!$N35*('Tex-418-A'!$L35/(PI()*(IF(CircumDiameter1=\"circumference\",SQRT('Tex-418-A'!$I35/PI())*2,'Tex-418-A'!$I35)^2/4))))","v":""},{"$f":"IF(ISERROR(0.000001*('Tex-418-A'!$N35*('Tex-418-A'!$L35/(PI()*((IF(CircumDiameter1=\"circumference\",SQRT('Tex-418-A'!$I35/PI())*2,'Tex-418-A'!$I35)/1000)^2/4))))),\"\",0.000001*('Tex-418-A'!$N35*('Tex-418-A'!$L35/(PI()*((IF(CircumDiameter1=\"circumference\",SQRT('Tex-418-A'!$I35/PI())*2,'Tex-418-A'!$I35)/1000)^2/4)))))","v":""}]
[1.1299999999999999,0.90100000000000002,null,null,{"$f":"IF(ISERROR('Tex-418-A'!$N36*('Tex-418-A'!$L36/(PI()*(IF(CircumDiameter1=\"circumference\",SQRT('Tex-418-A'!$I36/PI())*2,'Tex-418-A'!$I36)^2/4)))),\"\",'Tex-418-A'!$N36*('Tex-418-A'!$L36/(PI()*(IF(CircumDiameter1=\"circumference\",SQRT('Tex-418-A'!$I36/PI())*2,'Tex-418-A'!$I36)^2/4))))","v":""},{"$f":"IF(ISERROR(0.000001*('Tex-418-A'!$N36*('Tex-418-A'!$L36/(PI()*((IF(CircumDiameter1=\"circumference\",SQRT('Tex-418-A'!$I36/PI())*2,'Tex-418-A'!$I36)/1000)^2/4))))),\"\",0.000001*('Tex-418-A'!$N36*('Tex-418-A'!$L36/(PI()*((IF(CircumDiameter1=\"circumference\",SQRT('Tex-418-A'!$I36/PI())*2,'Tex-418-A'!$I36)/1000)^2/4)))))","v":""}]
[1.1399999999999999,0.90400000000000003,null,null,{"$f":"IF(ISERROR('Tex-418-A'!$N37*('Tex-418-A'!$L37/(PI()*(IF(CircumDiameter1=\"circumference\",SQRT('Tex-418-A'!$I37/PI())*2,'Tex-418-A'!$I37)^2/4)))),\"\",'Tex-418-A'!$N37*('Tex-418-A'!$L37/(PI()*(IF(CircumDiameter1=\"circumference\",SQRT('Tex-418-A'!$I37/PI())*2,'Tex-418-A'!$I37)^2/4))))","v":""},{"$f":"IF(ISERROR(0.000001*('Tex-418-A'!$N37*('Tex-418-A'!$L37/(PI()*((IF(CircumDiameter1=\"circumference\",SQRT('Tex-418-A'!$I37/PI())*2,'Tex-418-A'!$I37)/1000)^2/4))))),\"\",0.000001*('Tex-418-A'!$N37*('Tex-418-A'!$L37/(PI()*((IF(CircumDiameter1=\"circumference\",SQRT('Tex-418-A'!$I37/PI())*2,'Tex-418-A'!$I37)/1000)^2/4)))))","v":""}]
[1.1499999999999999,0.90600000000000003,null,null,{"$f":"IF(ISERROR('Tex-418-A'!$N38*('Tex-418-A'!$L38/(PI()*(IF(CircumDiameter1=\"circumference\",SQRT('Tex-418-A'!$I38/PI())*2,'Tex-418-A'!$I38)^2/4)))),\"\",'Tex-418-A'!$N38*('Tex-418-A'!$L38/(PI()*(IF(CircumDiameter1=\"circumference\",SQRT('Tex-418-A'!$I38/PI())*2,'Tex-418-A'!$I38)^2/4))))","v":""},{"$f":"IF(ISERROR(0.000001*('Tex-418-A'!$N38*('Tex-418-A'!$L38/(PI()*((IF(CircumDiameter1=\"circumference\",SQRT('Tex-418-A'!$I38/PI())*2,'Tex-418-A'!$I38)/1000)^2/4))))),\"\",0.000001*('Tex-418-A'!$N38*('Tex-418-A'!$L38/(PI()*((IF(CircumDiameter1=\"circumference\",SQRT('Tex-418-A'!$I38/PI())*2,'Tex-418-A'!$I38)/1000)^2/4)))))","v":""}]
[1.1599999999999999,0.90800000000000003,null,null,{"$f":"IF(ISERROR('Tex-418-A'!$N39*('Tex-418-A'!$L39/(PI()*(IF(CircumDiameter1=\"circumference\",SQRT('Tex-418-A'!$I39/PI())*2,'Tex-418-A'!$I39)^2/4)))),\"\",'Tex-418-A'!$N39*('Tex-418-A'!$L39/(PI()*(IF(CircumDiameter1=\"circumference\",SQRT('Tex-418-A'!$I39/PI())*2,'Tex-418-A'!$I39)^2/4))))","v":""},{"$f":"IF(ISERROR(0.000001*('Tex-418-A'!$N39*('Tex-418-A'!$L39/(PI()*((IF(CircumDiameter1=\"circumference\",SQRT('Tex-418-A'!$I39/PI())*2,'Tex-418-A'!$I39)/1000)^2/4))))),\"\",0.000001*('Tex-418-A'!$N39*('Tex-418-A'!$L39/(PI()*((IF(CircumDiameter1=\"circumference\",SQRT('Tex-418-A'!$I39/PI())*2,'Tex-418-A'!$I39)/1000)^2/4)))))","v":""}]
[1.17,0.91100000000000003,null,null,{"$f":"IF(ISERROR('Tex-418-A'!$N40*('Tex-418-A'!$L40/(PI()*(IF(CircumDiameter1=\"circumference\",SQRT('Tex-418-A'!$I40/PI())*2,'Tex-418-A'!$I40)^2/4)))),\"\",'Tex-418-A'!$N40*('Tex-418-A'!$L40/(PI()*(IF(CircumDiameter1=\"circumference\",SQRT('Tex-418-A'!$I40/PI())*2,'Tex-418-A'!$I40)^2/4))))","v":""},{"$f":"IF(ISERROR(0.000001*('Tex-418-A'!$N40*('Tex-418-A'!$L40/(PI()*((IF(CircumDiameter1=\"circumference\",SQRT('Tex-418-A'!$I40/PI())*2,'Tex-418-A'!$I40)/1000)^2/4))))),\"\",0.000001*('Tex-418-A'!$N40*('Tex-418-A'!$L40/(PI()*((IF(CircumDiameter1=\"circumference\",SQRT('Tex-418-A'!$I40/PI())*2,'Tex-418-A'!$I40)/1000)^2/4)))))","v":""}]
[1.18,0.91300000000000003,null,null,{"$f":"IF(ISERROR('Tex-418-A'!$N41*('Tex-418-A'!$L41/(PI()*(IF(CircumDiameter1=\"circumference\",SQRT('Tex-418-A'!$I41/PI())*2,'Tex-418-A'!$I41)^2/4)))),\"\",'Tex-418-A'!$N41*('Tex-418-A'!$L41/(PI()*(IF(CircumDiameter1=\"circumference\",SQRT('Tex-418-A'!$I41/PI())*2,'Tex-418-A'!$I41)^2/4))))","v":""},{"$f":"IF(ISERROR(0.000001*('Tex-418-A'!$N41*('Tex-418-A'!$L41/(PI()*((IF(CircumDiameter1=\"circumference\",SQRT('Tex-418-A'!$I41/PI())*2,'Tex-418-A'!$I41)/1000)^2/4))))),\"\",0.000001*('Tex-418-A'!$N41*('Tex-418-A'!$L41/(PI()*((IF(CircumDiameter1=\"circumference\",SQRT('Tex-418-A'!$I41/PI())*2,'Tex-418-A'!$I41)/1000)^2/4)))))","v":""}]
[1.19,0.91600000000000004,null,null,{"$f":"IF(ISERROR('Tex-418-A'!$N42*('Tex-418-A'!$L42/(PI()*(IF(CircumDiameter1=\"circumference\",SQRT('Tex-418-A'!$I42/PI())*2,'Tex-418-A'!$I42)^2/4)))),\"\",'Tex-418-A'!$N42*('Tex-418-A'!$L42/(PI()*(IF(CircumDiameter1=\"circumference\",SQRT('Tex-418-A'!$I42/PI())*2,'Tex-418-A'!$I42)^2/4))))","v":""},{"$f":"IF(ISERROR(0.000001*('Tex-418-A'!$N42*('Tex-418-A'!$L42/(PI()*((IF(CircumDiameter1=\"circumference\",SQRT('Tex-418-A'!$I42/PI())*2,'Tex-418-A'!$I42)/1000)^2/4))))),\"\",0.000001*('Tex-418-A'!$N42*('Tex-418-A'!$L42/(PI()*((IF(CircumDiameter1=\"circumference\",SQRT('Tex-418-A'!$I42/PI())*2,'Tex-418-A'!$I42)/1000)^2/4)))))","v":""}]
[1.2,0.91800000000000004,null,null,{"$f":"IF(ISERROR('Tex-418-A'!$N43*('Tex-418-A'!$L43/(PI()*(IF(CircumDiameter1=\"circumference\",SQRT('Tex-418-A'!$I43/PI())*2,'Tex-418-A'!$I43)^2/4)))),\"\",'Tex-418-A'!$N43*('Tex-418-A'!$L43/(PI()*(IF(CircumDiameter1=\"circumference\",SQRT('Tex-418-A'!$I43/PI())*2,'Tex-418-A'!$I43)^2/4))))","v":""},{"$f":"IF(ISERROR(0.000001*('Tex-418-A'!$N43*('Tex-418-A'!$L43/(PI()*((IF(CircumDiameter1=\"circumference\",SQRT('Tex-418-A'!$I43/PI())*2,'Tex-418-A'!$I43)/1000)^2/4))))),\"\",0.000001*('Tex-418-A'!$N43*('Tex-418-A'!$L43/(PI()*((IF(CircumDiameter1=\"circumference\",SQRT('Tex-418-A'!$I43/PI())*2,'Tex-418-A'!$I43)/1000)^2/4)))))","v":""}]
[1.21,0.92,null,null,{"$f":"IF(ISERROR('Tex-418-A'!$N44*('Tex-418-A'!$L44/(PI()*(IF(CircumDiameter1=\"circumference\",SQRT('Tex-418-A'!$I44/PI())*2,'Tex-418-A'!$I44)^2/4)))),\"\",'Tex-418-A'!$N44*('Tex-418-A'!$L44/(PI()*(IF(CircumDiameter1=\"circumference\",SQRT('Tex-418-A'!$I44/PI())*2,'Tex-418-A'!$I44)^2/4))))","v":""},{"$f":"IF(ISERROR(0.000001*('Tex-418-A'!$N44*('Tex-418-A'!$L44/(PI()*((IF(CircumDiameter1=\"circumference\",SQRT('Tex-418-A'!$I44/PI())*2,'Tex-418-A'!$I44)/1000)^2/4))))),\"\",0.000001*('Tex-418-A'!$N44*('Tex-418-A'!$L44/(PI()*((IF(CircumDiameter1=\"circumference\",SQRT('Tex-418-A'!$I44/PI())*2,'Tex-418-A'!$I44)/1000)^2/4)))))","v":""}]
[1.22,0.92300000000000004]
[1.23,0.92500000000000004]
[1.24,0.92800000000000005]
[1.25,0.93]
[1.26,{"$f":"0.93+((A28-1.25)*(0.96-0.93)/0.25)","v":0.93100000000000005}]
[1.27,{"$f":"0.93+((A29-1.25)*(0.96-0.93)/0.25)","v":0.93200000000000005}]
[1.28,0.93400000000000005]
[1.29,0.93500000000000005]
[1.3,0.93600000000000005,null,"Concrete Class","Min. 28-Day Compressive Strength",null,"Note: Cell J23 is a conditional formated cell. Do not delete."]
[1.31,0.93700000000000006,null,null,2004,null,"Note: Cell K23 is a hidden formula. Do not delete."]
[1.32,0.93799999999999994,null,null,"(psi)"]
[1.33,0.94,null,"A",3000]
[1.34,0.94099999999999995,null,"B",2000]
[1.35,0.94199999999999995,null,"C",3600]
[1.36,0.94299999999999995,null,"CO",4600]
[1.37,0.94399999999999995,null,"D",1500]
[1.38,0.94599999999999995,null,"DC",5500]
[1.39,0.94699999999999995,null,"E",3000]
[1.4,0.94799999999999995,null,"F","Input at right"]
[1.41,0.94899999999999995,null,"H","Input at right"]
[1.42,0.95,null,"HES","Input at right"]
[1.43,0.95199999999999996,null,"K","Input at right"]
[1.44,0.95299999999999996,null,"LMC",4000]
[1.45,0.95399999999999996,null,"P","Input at right"]
[1.46,0.95499999999999996,null,"S",4000]
[1.47,0.95599999999999996,null,"SS","Input at right"]
[1.48,0.95799999999999996]
[1.49,0.95899999999999996]
[1.5,0.96]
[1.51,{"$f":"0.96+((A53-1.5)*(0.98-0.96)/0.25)","v":0.96099999999999997}]
[1.52,{"$f":"0.96+((A54-1.5)*(0.98-0.96)/0.25)","v":0.96199999999999997}]
[1.53,0.96199999999999997]
[1.54,0.96299999999999997]
[1.55,0.96399999999999997]
[1.56,0.96499999999999997]
[1.57,0.96599999999999997]
[1.58,0.96599999999999997]
[1.59,0.96699999999999997]
[1.6,0.96799999999999997]
[1.61,0.96899999999999997]
[1.62,0.97]
[1.63,0.97]
[1.64,0.97099999999999997]
[1.65,0.97199999999999998]
[1.66,0.97299999999999998]
[1.67,0.97399999999999998]
[1.68,0.97399999999999998]
[1.69,0.97499999999999998]
[1.7,0.97599999999999998]
[1.71,0.97699999999999998]
[1.72,0.97799999999999998]
[1.73,0.97799999999999998]
[1.74,0.97899999999999998]
[1.75,0.98]
[1.76,{"$f":"IF(version>=1, 1, 0.981)","v":1}]
[1.77,{"$f":"IF(version>=1, 1, 0.982)","v":1}]
[1.78,{"$f":"IF(version>=1, 1, 0.982)","v":1}]
[1.79,{"$f":"IF(version>=1, 1, 0.983)","v":1}]
[1.8,{"$f":"IF(version>=1, 1, 0.984)","v":1}]
[1.81,{"$f":"IF(version>=1, 1, 0.985)","v":1}]
[1.82,{"$f":"IF(version>=1, 1, 0.986)","v":1}]
[1.83,{"$f":"IF(version>=1, 1, 0.986)","v":1}]
[1.84,{"$f":"IF(version>=1, 1, 0.987)","v":1}]
[1.85,{"$f":"IF(version>=1, 1, 0.988)","v":1}]
[1.86,{"$f":"IF(version>=1, 1, 0.989)","v":1}]
[1.87,{"$f":"IF(version>=1, 1, 0.99)","v":1}]
[1.88,{"$f":"IF(version>=1, 1, 0.99)","v":1}]
[1.89,{"$f":"IF(version>=1, 1, 0.991)","v":1}]
[1.9,{"$f":"IF(version>=1, 1, 0.992)","v":1}]
[1.91,{"$f":"IF(version>=1, 1, 0.993)","v":1}]
[1.92,{"$f":"IF(version>=1, 1, 0.994)","v":1}]
[1.93,{"$f":"IF(version>=1, 1, 0.994)","v":1}]
[1.94,{"$f":"IF(version>=1, 1, 0.995)","v":1}]
[1.95,1]
[1.96,1]
[1.97,1]
[1.98,1]
[1.99,1]
[2,1]
[2.0099999999999998,1]
[2.02,1]
[2.0299999999999998,1]
[2.04,1]
[2.0499999999999998,1]
[2.06,1]
[2.0699999999999998,1]
[2.08,1]
[2.09,1]
[2.1,1]