{"text_format":"1","workbook":"xlsx","n_sheets":4,"sheets":["Tex-418-A","RX","Revisions","L to D Lookup"],"not_rendered":{"charts":0,"images":1,"macros":1,"external_links":0,"defined_names":172,"comments":2,"pivot_tables":0},"unopened":[],"bounds":{"document_bytes":16777216,"sheet_cells":100000,"rows_first":2000,"rows_last":500,"rows_between":2000,"halvings":0,"cell_chars":16384,"cell_head_chars":4096},"cells_cut":0,"cells_raw":0,"read":"whole","date_system":"1900"}

{"sheet":"Tex-418-A","index":0,"n_rows":60,"n_cols":18,"rows_kept":60,"cut":false,"hidden":false,"merged":[[55,10,55,12],[23,1,23,14],[36,1,39,1],[40,1,43,1],[29,1,31,1],[42,4,43,4],[40,5,41,5],[29,4,31,4],[32,4,33,4],[34,5,35,5],[29,11,30,11],[38,5,39,5],[29,13,31,13],[45,1,46,16],[32,1,35,1],[32,16,33,16],[29,17,31,18],[32,17,35,18],[36,17,39,18],[40,17,43,18],[32,2,35,2],[36,2,39,2],[40,2,43,2],[42,5,43,5],[29,12,31,12],[29,16,31,16],[29,15,30,15],[32,15,33,15],[29,10,31,10],[29,9,30,9],[29,5,31,5],[29,14,30,14],[14,12,14,14],[13,5,13,8],[14,5,14,8],[19,9,19,10],[19,13,19,14],[17,12,17,14],[16,5,16,14],[17,5,17,8],[13,12,13,14],[19,7,19,8],[19,5,19,6],[15,5,15,14],[0,0,0,3],[8,12,8,14],[9,12,9,14],[12,5,12,8],[10,5,10,8],[11,5,11,8],[10,12,10,14],[11,12,11,14],[12,12,12,14],[8,5,8,8],[9,5,9,8],[22,1,22,14],[59,1,59,8],[38,4,39,4],[40,4,41,4],[34,4,35,4],[29,3,31,3],[29,2,31,2],[32,3,35,3],[36,4,37,4],[36,3,39,3],[29,7,31,7],[36,5,37,5],[57,1,57,2],[55,1,55,7],[47,1,47,16],[40,3,43,3],[42,16,43,16],[42,15,43,15],[40,16,41,16],[38,15,39,15],[36,15,37,15],[29,6,31,6],[32,5,33,5],[40,15,41,15],[34,16,35,16],[36,16,37,16],[38,16,39,16],[34,15,35,15],[51,3,51,7],[50,1,50,2],[52,3,52,7],[53,3,53,7],[48,1,48,16],[50,3,50,7],[51,1,51,2],[53,1,53,2]]}
["TxDOT Manuals >",null,null,null,null,"Tex-418-A"]
[null,"TEXAS DEPARTMENT OF TRANSPORTATION",null,null,null,null,null,null,null,null,null,null,null,null,null,null,null,83]
[null,null,null,null,null,null,null,null,null,null,null,null,null,null,null,null,null,2]
[null,null,null,null,null,null,null,null,null,null,null,null,null,null,null,null,null,"tx4hard.xlsm::45028.635197"]
[null,"HYDRAULIC CEMENT CONCRETE REPORT FOR STRUCTURAL CONCRETE"]
[null,"Tex-418-A"]
[]
[null,null,null,null,null,null,null,null,null,null,null,null,null,null,{"$f":"\"TX4HARD :: File Version: \" & TEXT(MID(sn,SEARCH(\"::\",sn,1)+2,20),\"mm/dd/yy hh:mm:ss\")","v":"TX4HARD :: File Version: 04/12/23 15:14:41"}]
[null,null,null,null,"SAMPLE ID:",null,null,null,null,null,null,"SAMPLED DATE:"]
[null,null,null,null,"TEST NUMBER:",null,null,null,null,null,null,"LETTING DATE:"]
[null,null,null,null,"SAMPLE STATUS:",null,null,null,null,null,null,"CONTROLLING CSJ:"]
[null,null,null,null,"COUNTY:",null,null,null,null,null,null,"SPEC YEAR:"]
[null,null,null,null,"SAMPLED BY:",null,null,null,null,null,null,"SPEC ITEM:"]
[null,null,null,null,"SAMPLE LOCATION:","",null,null,null,null,null,"SPECIAL PROVISION:"]
[null,null,null,null,"MATERIAL CODE:",null,null,null,null,null,null,"CLASS:"]
{"$rows_left_out":46}
{"sheet":"RX","index":1,"n_rows":127,"n_cols":9,"rows_kept":127,"cut":false,"hidden":true,"merged":[]}
[125]
["Fld_nbr","Value","Desc_1","Desc_2","Desc_3","Desc_4","Desc_5","Desc_6","Desc_7"]
[1,{"$f":"IF('Tex-418-A'!$B$46=\"\",\"\",'Tex-418-A'!$B$46)","v":""},{"$f":"'Tex-418-A'!$B$45","v":"Remarks:"}]
[2,{"$f":"IF('Tex-418-A'!$F$20=\"\",\"\",'Tex-418-A'!$F$20)","v":""},{"$f":"IF('Tex-418-A'!$E$20=\"\",\"\",'Tex-418-A'!$E$20)","v":"COURSE\\LIFT:"}]
[3,{"$f":"IF('Tex-418-A'!$D$54=\"\",\"\",'Tex-418-A'!$D$54)","v":""},{"$f":"IF(\"Tested By \"=\"\",\"\",\"Tested By \")","v":"Tested By "},{"$f":"IF('Tex-418-A'!$B$54=\"\",\"\",'Tex-418-A'!$B$54)","v":"TX418"}]
[4,{"$f":"IF('Tex-418-A'!$I$54=\"\",\"\",'Tex-418-A'!$I$54)","v":""},{"$f":"IF(\"Tested Date \"=\"\",\"\",\"Tested Date \")","v":"Tested Date "},{"$f":"IF('Tex-418-A'!$B$54=\"\",\"\",'Tex-418-A'!$B$54)","v":"TX418"}]
[5,{"$f":"IF('Tex-418-A'!$I$28=\"\",\"\",'Tex-418-A'!$I$28)","v":""},{"$f":"IF('Tex-418-A'!$B$6=\"\",\"\",'Tex-418-A'!$B$6)","v":"Tex-418-A"},{"$f":"IF('Tex-418-A'!$H$28=\"\",\"\",'Tex-418-A'!$H$28)","v":"7-Day Target Strength ( psi ) :"}]
[6,{"$f":"IF('Tex-418-A'!$M$28=\"\",\"\",'Tex-418-A'!$M$28)","v":""},{"$f":"IF('Tex-418-A'!$B$6=\"\",\"\",'Tex-418-A'!$B$6)","v":"Tex-418-A"},{"$f":"IF('Tex-418-A'!$L$28=\"\",\"\",'Tex-418-A'!$L$28)","v":"28-Day Design Strength f'c ( psi ) :"}]
[7,{"$f":"IF('Tex-418-A'!$C$33=\"\",\"\",'Tex-418-A'!$C$33)","v":""},{"$f":"IF('Tex-418-A'!$B$6=\"\",\"\",'Tex-418-A'!$B$6)","v":"Tex-418-A"},{"$f":"IF('Tex-418-A'!$C$30=\"\",\"\",'Tex-418-A'!$C$30)","v":"Cast Date"},{"$f":"IF('Tex-418-A'!$B$30=\"\",\"\",'Tex-418-A'!$B$30)","v":"SET"},{"$f":"IF('Tex-418-A'!$B$33=\"\",\"\",'Tex-418-A'!$B$33)","v":1}]
[8,{"$f":"IF('Tex-418-A'!$C$37=\"\",\"\",'Tex-418-A'!$C$37)","v":""},{"$f":"IF('Tex-418-A'!$B$6=\"\",\"\",'Tex-418-A'!$B$6)","v":"Tex-418-A"},{"$f":"IF('Tex-418-A'!$C$30=\"\",\"\",'Tex-418-A'!$C$30)","v":"Cast Date"},{"$f":"IF('Tex-418-A'!$B$30=\"\",\"\",'Tex-418-A'!$B$30)","v":"SET"},{"$f":"IF('Tex-418-A'!$B$37=\"\",\"\",'Tex-418-A'!$B$37)","v":2}]
[9,{"$f":"IF('Tex-418-A'!$C$41=\"\",\"\",'Tex-418-A'!$C$41)","v":""},{"$f":"IF('Tex-418-A'!$B$6=\"\",\"\",'Tex-418-A'!$B$6)","v":"Tex-418-A"},{"$f":"IF('Tex-418-A'!$C$30=\"\",\"\",'Tex-418-A'!$C$30)","v":"Cast Date"},{"$f":"IF('Tex-418-A'!$B$30=\"\",\"\",'Tex-418-A'!$B$30)","v":"SET"},{"$f":"IF('Tex-418-A'!$B$41=\"\",\"\",'Tex-418-A'!$B$41)","v":3}]
[10,{"$f":"IF('Tex-418-A'!$D$33=\"\",\"\",'Tex-418-A'!$D$33)","v":""},{"$f":"IF('Tex-418-A'!$B$6=\"\",\"\",'Tex-418-A'!$B$6)","v":"Tex-418-A"},{"$f":"IF('Tex-418-A'!$D$30=\"\",\"\",'Tex-418-A'!$D$30)","v":"Station"},{"$f":"IF('Tex-418-A'!$B$30=\"\",\"\",'Tex-418-A'!$B$30)","v":"SET"},{"$f":"IF('Tex-418-A'!$B$33=\"\",\"\",'Tex-418-A'!$B$33)","v":1}]
[11,{"$f":"IF('Tex-418-A'!$D$37=\"\",\"\",'Tex-418-A'!$D$37)","v":""},{"$f":"IF('Tex-418-A'!$B$6=\"\",\"\",'Tex-418-A'!$B$6)","v":"Tex-418-A"},{"$f":"IF('Tex-418-A'!$D$30=\"\",\"\",'Tex-418-A'!$D$30)","v":"Station"},{"$f":"IF('Tex-418-A'!$B$30=\"\",\"\",'Tex-418-A'!$B$30)","v":"SET"},{"$f":"IF('Tex-418-A'!$B$37=\"\",\"\",'Tex-418-A'!$B$37)","v":2}]
[12,{"$f":"IF('Tex-418-A'!$D$41=\"\",\"\",'Tex-418-A'!$D$41)","v":""},{"$f":"IF('Tex-418-A'!$B$6=\"\",\"\",'Tex-418-A'!$B$6)","v":"Tex-418-A"},{"$f":"IF('Tex-418-A'!$D$30=\"\",\"\",'Tex-418-A'!$D$30)","v":"Station"},{"$f":"IF('Tex-418-A'!$B$30=\"\",\"\",'Tex-418-A'!$B$30)","v":"SET"},{"$f":"IF('Tex-418-A'!$B$41=\"\",\"\",'Tex-418-A'!$B$41)","v":3}]
[13,{"$f":"IF('Tex-418-A'!$H$33=\"\",\"\",'Tex-418-A'!$H$33)","v":""},{"$f":"IF('Tex-418-A'!$B$6=\"\",\"\",'Tex-418-A'!$B$6)","v":"Tex-418-A"},{"$f":"IF('Tex-418-A'!$H$30=\"\",\"\",'Tex-418-A'!$H$30)","v":"Cylinder Number"},{"$f":"IF('Tex-418-A'!$B$30=\"\",\"\",'Tex-418-A'!$B$30)","v":"SET"},{"$f":"IF('Tex-418-A'!$B$33=\"\",\"\",'Tex-418-A'!$B$33)","v":1},{"$f":"IF('Tex-418-A'!$E$33=\"\",\"\",'Tex-418-A'!$E$33)","v":7},{"$f":"IF('Tex-418-A'!$F$33=\"\",\"\",'Tex-418-A'!$F$33)","v":"Required"},{"$f":"IF('Tex-418-A'!$G$33=\"\",\"\",'Tex-418-A'!$G$33)","v":1}]
{"$rows_left_out":113}
{"sheet":"Revisions","index":2,"n_rows":8,"n_cols":4,"rows_kept":8,"cut":false,"hidden":true,"merged":[]}
["Date","Changes","By","Comments"]
["2005-05-24","Change Range Name TestPerson1 from ='Tex-418-A'!$E$45  to ='Tex-418-A'!$C$45","Joe Liu"," no pull down list for the testers."]
["2005-06-21","Change test method from Tx4Hard to Tx418","Joe Liu"]
["2006-06-12","Added comments in cells B22:O22.","Jennifer Moore"]
["2018-02-08","Added versioning for changes going forward","Rachel Cano"]
["2018-02-08","changed text in cell B24 to reflect 2014 guide schedule update","Rachel Cano"]
["2018-02-08","added conditional formatting to 7-day target strength cells","Rachel Cano"]
["2018-02-08","changed equations in table columns F and Q to reflect 2014 requirements","Rachel Cano"]

{"sheet":"L to D Lookup","index":3,"n_rows":112,"n_cols":7,"rows_kept":112,"cut":false,"hidden":true,"merged":[[31,3,32,3]]}
["Length to Diameter Ratio","Correction Factor",null,null,"English MOR","Metric MOR"]
[1,0.87,null,null,{"$f":"IF(ISERROR(IF('Tex-418-A'!#REF!>('Tex-418-A'!#REF!*0.05),\"RETEST\",IF('Tex-418-A'!#REF!=0,((('Tex-418-A'!#REF!*6^3/'Tex-418-A'!#REF!)*'Tex-418-A'!#REF!)/('Tex-418-A'!#REF!*'Tex-418-A'!#REF!^2)),3*((('Tex-418-A'!#REF!*6^3/'Tex-418-A'!#REF!)*('Tex-418-A'!#REF!/3-'Tex-418-A'!#REF!))/('Tex-418-A'!#REF!*'Tex-418-A'!#REF!^2))))),\"\",IF('Tex-418-A'!#REF!>('Tex-418-A'!#REF!*0.05),\"RETEST\",IF('Tex-418-A'!#REF!=0,((('Tex-418-A'!#REF!*6^3/'Tex-418-A'!#REF!)*'Tex-418-A'!#REF!)/('Tex-418-A'!#REF!*'Tex-418-A'!#REF!^2)),3*((('Tex-418-A'!#REF!*6^3/'Tex-418-A'!#REF!)*('Tex-418-A'!#REF!/3-'Tex-418-A'!#REF!))/('Tex-418-A'!#REF!*'Tex-418-A'!#REF!^2)))))","v":""},{"$f":"IF(ISERROR(IF('Tex-418-A'!#REF!>('Tex-418-A'!#REF!*0.05),\"RETEST\",IF('Tex-418-A'!#REF!=0,(((('Tex-418-A'!#REF!*1000)*('Tex-418-A'!#REF!))/(('Tex-418-A'!#REF!)*(('Tex-418-A'!#REF!))^2))),(3*((('Tex-418-A'!#REF!*1000)*('Tex-418-A'!#REF!/3-'Tex-418-A'!#REF!))/('Tex-418-A'!#REF!*'Tex-418-A'!#REF!^2)))))),\"\",IF('Tex-418-A'!#REF!>('Tex-418-A'!#REF!*0.05),\"RETEST\",IF('Tex-418-A'!#REF!=0,(((('Tex-418-A'!#REF!*1000)*('Tex-418-A'!#REF!))/(('Tex-418-A'!#REF!)*(('Tex-418-A'!#REF!))^2))),(3*((('Tex-418-A'!#REF!*1000)*('Tex-418-A'!#REF!/3-'Tex-418-A'!#REF!))/('Tex-418-A'!#REF!*'Tex-418-A'!#REF!^2))))))","v":""}]
[1.01,{"$f":"0.87+((A3-1)*(0.93-0.87)/0.25)","v":0.872},null,null,{"$f":"IF(ISERROR(IF('Tex-418-A'!#REF!>('Tex-418-A'!#REF!*0.05),\"RETEST\",IF('Tex-418-A'!#REF!=0,((('Tex-418-A'!#REF!*6^3/'Tex-418-A'!#REF!)*'Tex-418-A'!#REF!)/('Tex-418-A'!#REF!*'Tex-418-A'!#REF!^2)),3*((('Tex-418-A'!#REF!*6^3/'Tex-418-A'!#REF!)*('Tex-418-A'!#REF!/3-'Tex-418-A'!#REF!))/('Tex-418-A'!#REF!*'Tex-418-A'!#REF!^2))))),\"\",IF('Tex-418-A'!#REF!>('Tex-418-A'!#REF!*0.05),\"RETEST\",IF('Tex-418-A'!#REF!=0,((('Tex-418-A'!#REF!*6^3/'Tex-418-A'!#REF!)*'Tex-418-A'!#REF!)/('Tex-418-A'!#REF!*'Tex-418-A'!#REF!^2)),3*((('Tex-418-A'!#REF!*6^3/'Tex-418-A'!#REF!)*('Tex-418-A'!#REF!/3-'Tex-418-A'!#REF!))/('Tex-418-A'!#REF!*'Tex-418-A'!#REF!^2)))))","v":""},{"$f":"IF(ISERROR(IF('Tex-418-A'!#REF!>('Tex-418-A'!#REF!*0.05),\"RETEST\",IF('Tex-418-A'!#REF!=0,(((('Tex-418-A'!#REF!*1000)*('Tex-418-A'!#REF!))/(('Tex-418-A'!#REF!)*(('Tex-418-A'!#REF!))^2))),(3*((('Tex-418-A'!#REF!*1000)*('Tex-418-A'!#REF!/3-'Tex-418-A'!#REF!))/('Tex-418-A'!#REF!*'Tex-418-A'!#REF!^2)))))),\"\",IF('Tex-418-A'!#REF!>('Tex-418-A'!#REF!*0.05),\"RETEST\",IF('Tex-418-A'!#REF!=0,(((('Tex-418-A'!#REF!*1000)*('Tex-418-A'!#REF!))/(('Tex-418-A'!#REF!)*(('Tex-418-A'!#REF!))^2))),(3*((('Tex-418-A'!#REF!*1000)*('Tex-418-A'!#REF!/3-'Tex-418-A'!#REF!))/('Tex-418-A'!#REF!*'Tex-418-A'!#REF!^2))))))","v":""}]
[1.02,{"$f":"0.87+((A4-1)*(0.93-0.87)/0.25)","v":0.875},null,null,{"$f":"IF(ISERROR(IF('Tex-418-A'!#REF!>('Tex-418-A'!#REF!*0.05),\"RETEST\",IF('Tex-418-A'!#REF!=0,((('Tex-418-A'!#REF!*6^3/'Tex-418-A'!#REF!)*'Tex-418-A'!#REF!)/('Tex-418-A'!#REF!*'Tex-418-A'!#REF!^2)),3*((('Tex-418-A'!#REF!*6^3/'Tex-418-A'!#REF!)*('Tex-418-A'!#REF!/3-'Tex-418-A'!#REF!))/('Tex-418-A'!#REF!*'Tex-418-A'!#REF!^2))))),\"\",IF('Tex-418-A'!#REF!>('Tex-418-A'!#REF!*0.05),\"RETEST\",IF('Tex-418-A'!#REF!=0,((('Tex-418-A'!#REF!*6^3/'Tex-418-A'!#REF!)*'Tex-418-A'!#REF!)/('Tex-418-A'!#REF!*'Tex-418-A'!#REF!^2)),3*((('Tex-418-A'!#REF!*6^3/'Tex-418-A'!#REF!)*('Tex-418-A'!#REF!/3-'Tex-418-A'!#REF!))/('Tex-418-A'!#REF!*'Tex-418-A'!#REF!^2)))))","v":""},{"$f":"IF(ISERROR(IF('Tex-418-A'!#REF!>('Tex-418-A'!#REF!*0.05),\"RETEST\",IF('Tex-418-A'!#REF!=0,(((('Tex-418-A'!#REF!*1000)*('Tex-418-A'!#REF!))/(('Tex-418-A'!#REF!)*(('Tex-418-A'!#REF!))^2))),(3*((('Tex-418-A'!#REF!*1000)*('Tex-418-A'!#REF!/3-'Tex-418-A'!#REF!))/('Tex-418-A'!#REF!*'Tex-418-A'!#REF!^2)))))),\"\",IF('Tex-418-A'!#REF!>('Tex-418-A'!#REF!*0.05),\"RETEST\",IF('Tex-418-A'!#REF!=0,(((('Tex-418-A'!#REF!*1000)*('Tex-418-A'!#REF!))/(('Tex-418-A'!#REF!)*(('Tex-418-A'!#REF!))^2))),(3*((('Tex-418-A'!#REF!*1000)*('Tex-418-A'!#REF!/3-'Tex-418-A'!#REF!))/('Tex-418-A'!#REF!*'Tex-418-A'!#REF!^2))))))","v":""}]
[1.03,0.877,null,null,{"$f":"IF(ISERROR(IF('Tex-418-A'!#REF!>('Tex-418-A'!#REF!*0.05),\"RETEST\",IF('Tex-418-A'!#REF!=0,((('Tex-418-A'!#REF!*6^3/'Tex-418-A'!#REF!)*'Tex-418-A'!#REF!)/('Tex-418-A'!#REF!*'Tex-418-A'!#REF!^2)),3*((('Tex-418-A'!#REF!*6^3/'Tex-418-A'!#REF!)*('Tex-418-A'!#REF!/3-'Tex-418-A'!#REF!))/('Tex-418-A'!#REF!*'Tex-418-A'!#REF!^2))))),\"\",IF('Tex-418-A'!#REF!>('Tex-418-A'!#REF!*0.05),\"RETEST\",IF('Tex-418-A'!#REF!=0,((('Tex-418-A'!#REF!*6^3/'Tex-418-A'!#REF!)*'Tex-418-A'!#REF!)/('Tex-418-A'!#REF!*'Tex-418-A'!#REF!^2)),3*((('Tex-418-A'!#REF!*6^3/'Tex-418-A'!#REF!)*('Tex-418-A'!#REF!/3-'Tex-418-A'!#REF!))/('Tex-418-A'!#REF!*'Tex-418-A'!#REF!^2)))))","v":""},{"$f":"IF(ISERROR(IF('Tex-418-A'!#REF!>('Tex-418-A'!#REF!*0.05),\"RETEST\",IF('Tex-418-A'!#REF!=0,(((('Tex-418-A'!#REF!*1000)*('Tex-418-A'!#REF!))/(('Tex-418-A'!#REF!)*(('Tex-418-A'!#REF!))^2))),(3*((('Tex-418-A'!#REF!*1000)*('Tex-418-A'!#REF!/3-'Tex-418-A'!#REF!))/('Tex-418-A'!#REF!*'Tex-418-A'!#REF!^2)))))),\"\",IF('Tex-418-A'!#REF!>('Tex-418-A'!#REF!*0.05),\"RETEST\",IF('Tex-418-A'!#REF!=0,(((('Tex-418-A'!#REF!*1000)*('Tex-418-A'!#REF!))/(('Tex-418-A'!#REF!)*(('Tex-418-A'!#REF!))^2))),(3*((('Tex-418-A'!#REF!*1000)*('Tex-418-A'!#REF!/3-'Tex-418-A'!#REF!))/('Tex-418-A'!#REF!*'Tex-418-A'!#REF!^2))))))","v":""}]
[1.04,0.88,null,null,{"$f":"IF(ISERROR(IF('Tex-418-A'!#REF!>('Tex-418-A'!#REF!*0.05),\"RETEST\",IF('Tex-418-A'!#REF!=0,((('Tex-418-A'!#REF!*6^3/'Tex-418-A'!#REF!)*'Tex-418-A'!#REF!)/('Tex-418-A'!#REF!*'Tex-418-A'!#REF!^2)),3*((('Tex-418-A'!#REF!*6^3/'Tex-418-A'!#REF!)*('Tex-418-A'!#REF!/3-'Tex-418-A'!#REF!))/('Tex-418-A'!#REF!*'Tex-418-A'!#REF!^2))))),\"\",IF('Tex-418-A'!#REF!>('Tex-418-A'!#REF!*0.05),\"RETEST\",IF('Tex-418-A'!#REF!=0,((('Tex-418-A'!#REF!*6^3/'Tex-418-A'!#REF!)*'Tex-418-A'!#REF!)/('Tex-418-A'!#REF!*'Tex-418-A'!#REF!^2)),3*((('Tex-418-A'!#REF!*6^3/'Tex-418-A'!#REF!)*('Tex-418-A'!#REF!/3-'Tex-418-A'!#REF!))/('Tex-418-A'!#REF!*'Tex-418-A'!#REF!^2)))))","v":""},{"$f":"IF(ISERROR(IF('Tex-418-A'!#REF!>('Tex-418-A'!#REF!*0.05),\"RETEST\",IF('Tex-418-A'!#REF!=0,(((('Tex-418-A'!#REF!*1000)*('Tex-418-A'!#REF!))/(('Tex-418-A'!#REF!)*(('Tex-418-A'!#REF!))^2))),(3*((('Tex-418-A'!#REF!*1000)*('Tex-418-A'!#REF!/3-'Tex-418-A'!#REF!))/('Tex-418-A'!#REF!*'Tex-418-A'!#REF!^2)))))),\"\",IF('Tex-418-A'!#REF!>('Tex-418-A'!#REF!*0.05),\"RETEST\",IF('Tex-418-A'!#REF!=0,(((('Tex-418-A'!#REF!*1000)*('Tex-418-A'!#REF!))/(('Tex-418-A'!#REF!)*(('Tex-418-A'!#REF!))^2))),(3*((('Tex-418-A'!#REF!*1000)*('Tex-418-A'!#REF!/3-'Tex-418-A'!#REF!))/('Tex-418-A'!#REF!*'Tex-418-A'!#REF!^2))))))","v":""}]
[1.05,0.88200000000000001,null,null,{"$f":"IF(ISERROR(IF('Tex-418-A'!#REF!>('Tex-418-A'!#REF!*0.05),\"RETEST\",IF('Tex-418-A'!#REF!=0,((('Tex-418-A'!#REF!*6^3/'Tex-418-A'!#REF!)*'Tex-418-A'!#REF!)/('Tex-418-A'!#REF!*'Tex-418-A'!#REF!^2)),3*((('Tex-418-A'!#REF!*6^3/'Tex-418-A'!#REF!)*('Tex-418-A'!#REF!/3-'Tex-418-A'!#REF!))/('Tex-418-A'!#REF!*'Tex-418-A'!#REF!^2))))),\"\",IF('Tex-418-A'!#REF!>('Tex-418-A'!#REF!*0.05),\"RETEST\",IF('Tex-418-A'!#REF!=0,((('Tex-418-A'!#REF!*6^3/'Tex-418-A'!#REF!)*'Tex-418-A'!#REF!)/('Tex-418-A'!#REF!*'Tex-418-A'!#REF!^2)),3*((('Tex-418-A'!#REF!*6^3/'Tex-418-A'!#REF!)*('Tex-418-A'!#REF!/3-'Tex-418-A'!#REF!))/('Tex-418-A'!#REF!*'Tex-418-A'!#REF!^2)))))","v":""},{"$f":"IF(ISERROR(IF('Tex-418-A'!#REF!>('Tex-418-A'!#REF!*0.05),\"RETEST\",IF('Tex-418-A'!#REF!=0,(((('Tex-418-A'!#REF!*1000)*('Tex-418-A'!#REF!))/(('Tex-418-A'!#REF!)*(('Tex-418-A'!#REF!))^2))),(3*((('Tex-418-A'!#REF!*1000)*('Tex-418-A'!#REF!/3-'Tex-418-A'!#REF!))/('Tex-418-A'!#REF!*'Tex-418-A'!#REF!^2)))))),\"\",IF('Tex-418-A'!#REF!>('Tex-418-A'!#REF!*0.05),\"RETEST\",IF('Tex-418-A'!#REF!=0,(((('Tex-418-A'!#REF!*1000)*('Tex-418-A'!#REF!))/(('Tex-418-A'!#REF!)*(('Tex-418-A'!#REF!))^2))),(3*((('Tex-418-A'!#REF!*1000)*('Tex-418-A'!#REF!/3-'Tex-418-A'!#REF!))/('Tex-418-A'!#REF!*'Tex-418-A'!#REF!^2))))))","v":""}]
[1.06,0.88400000000000001,null,null,{"$f":"IF(ISERROR(IF('Tex-418-A'!#REF!>('Tex-418-A'!#REF!*0.05),\"RETEST\",IF('Tex-418-A'!#REF!=0,((('Tex-418-A'!#REF!*6^3/'Tex-418-A'!#REF!)*'Tex-418-A'!#REF!)/('Tex-418-A'!#REF!*'Tex-418-A'!#REF!^2)),3*((('Tex-418-A'!#REF!*6^3/'Tex-418-A'!#REF!)*('Tex-418-A'!#REF!/3-'Tex-418-A'!#REF!))/('Tex-418-A'!#REF!*'Tex-418-A'!#REF!^2))))),\"\",IF('Tex-418-A'!#REF!>('Tex-418-A'!#REF!*0.05),\"RETEST\",IF('Tex-418-A'!#REF!=0,((('Tex-418-A'!#REF!*6^3/'Tex-418-A'!#REF!)*'Tex-418-A'!#REF!)/('Tex-418-A'!#REF!*'Tex-418-A'!#REF!^2)),3*((('Tex-418-A'!#REF!*6^3/'Tex-418-A'!#REF!)*('Tex-418-A'!#REF!/3-'Tex-418-A'!#REF!))/('Tex-418-A'!#REF!*'Tex-418-A'!#REF!^2)))))","v":""},{"$f":"IF(ISERROR(IF('Tex-418-A'!#REF!>('Tex-418-A'!#REF!*0.05),\"RETEST\",IF('Tex-418-A'!#REF!=0,(((('Tex-418-A'!#REF!*1000)*('Tex-418-A'!#REF!))/(('Tex-418-A'!#REF!)*(('Tex-418-A'!#REF!))^2))),(3*((('Tex-418-A'!#REF!*1000)*('Tex-418-A'!#REF!/3-'Tex-418-A'!#REF!))/('Tex-418-A'!#REF!*'Tex-418-A'!#REF!^2)))))),\"\",IF('Tex-418-A'!#REF!>('Tex-418-A'!#REF!*0.05),\"RETEST\",IF('Tex-418-A'!#REF!=0,(((('Tex-418-A'!#REF!*1000)*('Tex-418-A'!#REF!))/(('Tex-418-A'!#REF!)*(('Tex-418-A'!#REF!))^2))),(3*((('Tex-418-A'!#REF!*1000)*('Tex-418-A'!#REF!/3-'Tex-418-A'!#REF!))/('Tex-418-A'!#REF!*'Tex-418-A'!#REF!^2))))))","v":""}]
[1.07,0.88700000000000001,null,null,{"$f":"IF(ISERROR(IF('Tex-418-A'!#REF!>('Tex-418-A'!#REF!*0.05),\"RETEST\",IF('Tex-418-A'!#REF!=0,((('Tex-418-A'!#REF!*6^3/'Tex-418-A'!#REF!)*'Tex-418-A'!#REF!)/('Tex-418-A'!#REF!*'Tex-418-A'!#REF!^2)),3*((('Tex-418-A'!#REF!*6^3/'Tex-418-A'!#REF!)*('Tex-418-A'!#REF!/3-'Tex-418-A'!#REF!))/('Tex-418-A'!#REF!*'Tex-418-A'!#REF!^2))))),\"\",IF('Tex-418-A'!#REF!>('Tex-418-A'!#REF!*0.05),\"RETEST\",IF('Tex-418-A'!#REF!=0,((('Tex-418-A'!#REF!*6^3/'Tex-418-A'!#REF!)*'Tex-418-A'!#REF!)/('Tex-418-A'!#REF!*'Tex-418-A'!#REF!^2)),3*((('Tex-418-A'!#REF!*6^3/'Tex-418-A'!#REF!)*('Tex-418-A'!#REF!/3-'Tex-418-A'!#REF!))/('Tex-418-A'!#REF!*'Tex-418-A'!#REF!^2)))))","v":""},{"$f":"IF(ISERROR(IF('Tex-418-A'!#REF!>('Tex-418-A'!#REF!*0.05),\"RETEST\",IF('Tex-418-A'!#REF!=0,(((('Tex-418-A'!#REF!*1000)*('Tex-418-A'!#REF!))/(('Tex-418-A'!#REF!)*(('Tex-418-A'!#REF!))^2))),(3*((('Tex-418-A'!#REF!*1000)*('Tex-418-A'!#REF!/3-'Tex-418-A'!#REF!))/('Tex-418-A'!#REF!*'Tex-418-A'!#REF!^2)))))),\"\",IF('Tex-418-A'!#REF!>('Tex-418-A'!#REF!*0.05),\"RETEST\",IF('Tex-418-A'!#REF!=0,(((('Tex-418-A'!#REF!*1000)*('Tex-418-A'!#REF!))/(('Tex-418-A'!#REF!)*(('Tex-418-A'!#REF!))^2))),(3*((('Tex-418-A'!#REF!*1000)*('Tex-418-A'!#REF!/3-'Tex-418-A'!#REF!))/('Tex-418-A'!#REF!*'Tex-418-A'!#REF!^2))))))","v":""}]
[1.08,0.88900000000000001]
[1.0900000000000001,0.89200000000000002,null,null,"English f'c","Metric f'c"]
[1.1000000000000001,0.89400000000000002,null,null,{"$f":"IF(ISERROR('Tex-418-A'!$N33*('Tex-418-A'!$L33/(PI()*(IF(CircumDiameter1=\"circumference\",SQRT('Tex-418-A'!$I33/PI())*2,'Tex-418-A'!$I33)^2/4)))),\"\",'Tex-418-A'!$N33*('Tex-418-A'!$L33/(PI()*(IF(CircumDiameter1=\"circumference\",SQRT('Tex-418-A'!$I33/PI())*2,'Tex-418-A'!$I33)^2/4))))","v":""},{"$f":"IF(ISERROR(0.000001*('Tex-418-A'!$N33*('Tex-418-A'!$L33/(PI()*((IF(CircumDiameter1=\"circumference\",SQRT('Tex-418-A'!$I33/PI())*2,'Tex-418-A'!$I33)/1000)^2/4))))),\"\",0.000001*('Tex-418-A'!$N33*('Tex-418-A'!$L33/(PI()*((IF(CircumDiameter1=\"circumference\",SQRT('Tex-418-A'!$I33/PI())*2,'Tex-418-A'!$I33)/1000)^2/4)))))","v":""}]
[1.1100000000000001,0.89600000000000002,null,null,{"$f":"IF(ISERROR('Tex-418-A'!$N34*('Tex-418-A'!$L34/(PI()*(IF(CircumDiameter1=\"circumference\",SQRT('Tex-418-A'!$I34/PI())*2,'Tex-418-A'!$I34)^2/4)))),\"\",'Tex-418-A'!$N34*('Tex-418-A'!$L34/(PI()*(IF(CircumDiameter1=\"circumference\",SQRT('Tex-418-A'!$I34/PI())*2,'Tex-418-A'!$I34)^2/4))))","v":""},{"$f":"IF(ISERROR(0.000001*('Tex-418-A'!$N34*('Tex-418-A'!$L34/(PI()*((IF(CircumDiameter1=\"circumference\",SQRT('Tex-418-A'!$I34/PI())*2,'Tex-418-A'!$I34)/1000)^2/4))))),\"\",0.000001*('Tex-418-A'!$N34*('Tex-418-A'!$L34/(PI()*((IF(CircumDiameter1=\"circumference\",SQRT('Tex-418-A'!$I34/PI())*2,'Tex-418-A'!$I34)/1000)^2/4)))))","v":""}]
[1.1200000000000001,0.89900000000000002,null,null,{"$f":"IF(ISERROR('Tex-418-A'!$N35*('Tex-418-A'!$L35/(PI()*(IF(CircumDiameter1=\"circumference\",SQRT('Tex-418-A'!$I35/PI())*2,'Tex-418-A'!$I35)^2/4)))),\"\",'Tex-418-A'!$N35*('Tex-418-A'!$L35/(PI()*(IF(CircumDiameter1=\"circumference\",SQRT('Tex-418-A'!$I35/PI())*2,'Tex-418-A'!$I35)^2/4))))","v":""},{"$f":"IF(ISERROR(0.000001*('Tex-418-A'!$N35*('Tex-418-A'!$L35/(PI()*((IF(CircumDiameter1=\"circumference\",SQRT('Tex-418-A'!$I35/PI())*2,'Tex-418-A'!$I35)/1000)^2/4))))),\"\",0.000001*('Tex-418-A'!$N35*('Tex-418-A'!$L35/(PI()*((IF(CircumDiameter1=\"circumference\",SQRT('Tex-418-A'!$I35/PI())*2,'Tex-418-A'!$I35)/1000)^2/4)))))","v":""}]
[1.1299999999999999,0.90100000000000002,null,null,{"$f":"IF(ISERROR('Tex-418-A'!$N36*('Tex-418-A'!$L36/(PI()*(IF(CircumDiameter1=\"circumference\",SQRT('Tex-418-A'!$I36/PI())*2,'Tex-418-A'!$I36)^2/4)))),\"\",'Tex-418-A'!$N36*('Tex-418-A'!$L36/(PI()*(IF(CircumDiameter1=\"circumference\",SQRT('Tex-418-A'!$I36/PI())*2,'Tex-418-A'!$I36)^2/4))))","v":""},{"$f":"IF(ISERROR(0.000001*('Tex-418-A'!$N36*('Tex-418-A'!$L36/(PI()*((IF(CircumDiameter1=\"circumference\",SQRT('Tex-418-A'!$I36/PI())*2,'Tex-418-A'!$I36)/1000)^2/4))))),\"\",0.000001*('Tex-418-A'!$N36*('Tex-418-A'!$L36/(PI()*((IF(CircumDiameter1=\"circumference\",SQRT('Tex-418-A'!$I36/PI())*2,'Tex-418-A'!$I36)/1000)^2/4)))))","v":""}]
{"$rows_left_out":97}