{"text_format":"1","workbook":"xlsx","n_sheets":4,"sheets":["Tex-418-A","RX","Revisions","Data_L to D Lookup"],"not_rendered":{"charts":0,"images":1,"macros":1,"external_links":0,"defined_names":119,"comments":2,"pivot_tables":0},"unopened":[],"bounds":{"document_bytes":16777216,"sheet_cells":100000,"rows_first":2000,"rows_last":500,"rows_between":2000,"halvings":0,"cell_chars":16384,"cell_head_chars":4096},"cells_cut":0,"cells_raw":0,"read":"whole","date_system":"1900"}

{"sheet":"Tex-418-A","index":0,"n_rows":53,"n_cols":20,"rows_kept":53,"cut":false,"hidden":false,"merged":[[27,16,29,17],[23,7,23,8],[25,7,25,8],[13,12,13,14],[13,5,13,8],[14,5,14,8],[27,6,29,6],[27,15,29,15],[17,12,17,14],[19,9,19,10],[19,13,19,14],[23,11,23,12],[19,5,19,6],[17,5,17,8],[27,5,29,5],[27,12,29,12],[48,9,48,11],[30,15,31,15],[30,14,31,14],[30,4,31,4],[32,15,33,15],[40,1,41,15],[32,14,33,14],[52,1,52,7],[32,3,33,3],[50,1,50,2],[48,1,48,6],[45,2,45,5],[46,2,46,5],[50,5,50,6],[43,2,43,5],[44,2,44,5],[27,13,29,13],[27,14,29,14],[27,2,29,2],[27,1,29,1],[30,3,31,3],[27,4,29,4],[27,3,29,3],[27,11,29,11],[27,9,29,9],[27,7,29,7],[27,8,29,8],[27,10,29,10],[21,1,21,14],[19,7,19,8],[0,0,0,2],[16,5,16,14],[8,5,8,8],[15,5,15,14],[12,12,12,14],[14,12,14,14],[9,5,9,8],[10,5,10,8],[8,12,8,14],[9,12,9,14],[10,12,10,14],[11,12,11,14],[12,5,12,8],[11,5,11,8],[30,16,37,17],[30,2,37,2],[30,1,37,1],[36,15,37,15],[34,15,35,15],[36,14,37,14],[34,14,35,14],[36,4,37,4],[34,4,35,4],[36,3,37,3],[34,3,35,3],[32,4,33,4]]}
["TxDOT Manuals >",null,null,null,null,"Tex-418-A"]
[null,"TEXAS DEPARTMENT OF TRANSPORTATION",null,null,null,null,null,null,null,null,null,null,null,null,null,null,57]
[null,null,null,null,null,null,null,null,null,null,null,null,null,null,null,null,2]
[null,null,null,null,null,null,null,null,null,null,null,null,null,null,null,null,"tx4hard3.xlsm::45698.69"]
[null,"HYDRAULIC CEMENT CONCRETE REPORT"]
[null,"Tex-418-A, Compressive Strength of Cylindrical Concrete Specimens"]
[]
[null,null,null,null,null,null,null,null,null,null,null,null,null,null,{"$f":"\"Tex-418-A :: File Version: \" & TEXT(MID(sn,SEARCH(\"::\",sn,1)+2,20),\"mm/dd/yy hh:mm:ss\")","v":"Tex-418-A :: File Version: 02/10/25 16:33:36"}]
[null,null,null,null,"SAMPLE ID:",null,null,null,null,null,null,"SAMPLED DATE:"]
[null,null,null,null,"TEST NUMBER:",null,null,null,null,null,null,"LETTING DATE:"]
[null,null,null,null,"SAMPLE STATUS:",null,null,null,null,null,null,"CONTROLLING CSJ:"]
[null,null,null,null,"COUNTY:",null,null,null,null,null,null,"SPEC YEAR:"]
[null,null,null,null,"SAMPLED BY:",null,null,null,null,null,null,"SPEC ITEM:"]
[null,null,null,null,"SAMPLE LOCATION:","",null,null,null,null,null,"SPECIAL PROVISION:"]
[null,null,null,null,"MATERIAL CODE:",null,null,null,null,null,null,"CLASS:",null,null,null,{"$f":"IF(OR(AND(SpecYear=\"2004\",OR(Field4=\"CLASS C(SRC)\",Field4=\"CLASS H(SRC)\")),AND(SpecYear=\"2014\",OR(Field4=\"CLASS D\",Field4=\"CLASS DC\"))),\"Not valid for selected Spec Year.\",\"\")","v":""}]
[null,null,null,null,"MATERIAL NAME:"]
[null,null,null,null,"PRODUCER:"]
[null,null,null,null,"AREA ENGINEER:",null,null,null,null,null,null,"PROJECT MANAGER:"]
[]
[null,null,null,null,"COURSE\\LIFT:",null,null,"STATION:",null,null,null,null,"DIST. FROM CL:"]
{"$rows_left_out":34}
{"sheet":"RX","index":1,"n_rows":89,"n_cols":9,"rows_kept":89,"cut":false,"hidden":true,"merged":[]}
[{"$f":"COUNTA(A3:A5000)","v":87}]
["Fld_nbr","Value","Desc_1","Desc_2","Desc_3","Desc_4","Desc_5","Desc_6","Desc_7"]
[1,{"$f":"IF('Tex-418-A'!$B$41=\"\",\"\",'Tex-418-A'!$B$41)","v":""},{"$f":"'Tex-418-A'!$B$40","v":"Remarks:"}]
[2,{"$f":"IF('Tex-418-A'!$F$20=\"\",\"\",'Tex-418-A'!$F$20)","v":""},{"$f":"IF('Tex-418-A'!$E$20=\"\",\"\",'Tex-418-A'!$E$20)","v":"COURSE\\LIFT:"}]
[3,{"$f":"IF('Tex-418-A'!$C$47=\"\",\"\",'Tex-418-A'!$C$47)","v":""},{"$f":"IF(\"Tested By \"=\"\",\"\",\"Tested By \")","v":"Tested By "},{"$f":"IF('Tex-418-A'!$B$47=\"\",\"\",'Tex-418-A'!$B$47)","v":"TX418"}]
[4,{"$f":"IF('Tex-418-A'!$G$47=\"\",\"\",'Tex-418-A'!$G$47)","v":""},{"$f":"IF(\"Tested Date \"=\"\",\"\",\"Tested Date \")","v":"Tested Date "},{"$f":"IF('Tex-418-A'!$B$47=\"\",\"\",'Tex-418-A'!$B$47)","v":"TX418"}]
[5,{"$f":"IF('Tex-418-A'!$H$25=\"\",\"\",'Tex-418-A'!$H$25)","v":""},{"$f":"IF('Tex-418-A'!$B$6=\"\",\"\",'Tex-418-A'!$B$6)","v":"Tex-418-A, Compressive Strength of Cylindrical Concrete Specimens"},{"$f":"IF('Tex-418-A'!$G$25=\"\",\"\",'Tex-418-A'!$G$25)","v":"7-Day Target Strength ( psi ) :"}]
[6,{"$f":"IF('Tex-418-A'!$N$25=\"\",\"\",'Tex-418-A'!$N$25)","v":""},{"$f":"IF('Tex-418-A'!$B$6=\"\",\"\",'Tex-418-A'!$B$6)","v":"Tex-418-A, Compressive Strength of Cylindrical Concrete Specimens"},{"$f":"IF('Tex-418-A'!$K$25=\"\",\"\",'Tex-418-A'!$K$25)","v":"28-Day Design Strength f'c ( psi ) :"}]
[7,{"$f":"IF('Tex-418-A'!$B$31=\"\",\"\",'Tex-418-A'!$B$31)","v":""},{"$f":"IF('Tex-418-A'!$B$6=\"\",\"\",'Tex-418-A'!$B$6)","v":"Tex-418-A, Compressive Strength of Cylindrical Concrete Specimens"},{"$f":"IF('Tex-418-A'!$B$28=\"\",\"\",'Tex-418-A'!$B$28)","v":"Cast Date"}]
[8,{"$f":"IF('Tex-418-A'!$C$31=\"\",\"\",'Tex-418-A'!$C$31)","v":""},{"$f":"IF('Tex-418-A'!$B$6=\"\",\"\",'Tex-418-A'!$B$6)","v":"Tex-418-A, Compressive Strength of Cylindrical Concrete Specimens"},{"$f":"IF('Tex-418-A'!$C$28=\"\",\"\",'Tex-418-A'!$C$28)","v":"Station"}]
[9,{"$f":"IF('Tex-418-A'!$G$31=\"\",\"\",'Tex-418-A'!$G$31)","v":""},{"$f":"IF('Tex-418-A'!$B$6=\"\",\"\",'Tex-418-A'!$B$6)","v":"Tex-418-A, Compressive Strength of Cylindrical Concrete Specimens"},{"$f":"IF('Tex-418-A'!$G$28=\"\",\"\",'Tex-418-A'!$G$28)","v":"Cylinder Number"},{"$f":"IF('Tex-418-A'!$D$31=\"\",\"\",'Tex-418-A'!$D$31)","v":7},{"$f":"IF('Tex-418-A'!$E$31=\"\",\"\",'Tex-418-A'!$E$31)","v":"Required"},{"$f":"IF('Tex-418-A'!$F$31=\"\",\"\",'Tex-418-A'!$F$31)","v":"1"}]
[10,{"$f":"IF('Tex-418-A'!$G$32=\"\",\"\",'Tex-418-A'!$G$32)","v":""},{"$f":"IF('Tex-418-A'!$B$6=\"\",\"\",'Tex-418-A'!$B$6)","v":"Tex-418-A, Compressive Strength of Cylindrical Concrete Specimens"},{"$f":"IF('Tex-418-A'!$G$28=\"\",\"\",'Tex-418-A'!$G$28)","v":"Cylinder Number"},{"$f":"IF('Tex-418-A'!$D$31=\"\",\"\",'Tex-418-A'!$D$31)","v":7},{"$f":"IF('Tex-418-A'!$E$31=\"\",\"\",'Tex-418-A'!$E$31)","v":"Required"},{"$f":"IF('Tex-418-A'!$F$32=\"\",\"\",'Tex-418-A'!$F$32)","v":"2"}]
[11,{"$f":"IF('Tex-418-A'!$G$33=\"\",\"\",'Tex-418-A'!$G$33)","v":""},{"$f":"IF('Tex-418-A'!$B$6=\"\",\"\",'Tex-418-A'!$B$6)","v":"Tex-418-A, Compressive Strength of Cylindrical Concrete Specimens"},{"$f":"IF('Tex-418-A'!$G$28=\"\",\"\",'Tex-418-A'!$G$28)","v":"Cylinder Number"},{"$f":"IF('Tex-418-A'!$D$33=\"\",\"\",'Tex-418-A'!$D$33)","v":28},{"$f":"IF('Tex-418-A'!$E$33=\"\",\"\",'Tex-418-A'!$E$33)","v":"Required"},{"$f":"IF('Tex-418-A'!$F$33=\"\",\"\",'Tex-418-A'!$F$33)","v":"1"}]
[12,{"$f":"IF('Tex-418-A'!$G$34=\"\",\"\",'Tex-418-A'!$G$34)","v":""},{"$f":"IF('Tex-418-A'!$B$6=\"\",\"\",'Tex-418-A'!$B$6)","v":"Tex-418-A, Compressive Strength of Cylindrical Concrete Specimens"},{"$f":"IF('Tex-418-A'!$G$28=\"\",\"\",'Tex-418-A'!$G$28)","v":"Cylinder Number"},{"$f":"IF('Tex-418-A'!$D$33=\"\",\"\",'Tex-418-A'!$D$33)","v":28},{"$f":"IF('Tex-418-A'!$E$33=\"\",\"\",'Tex-418-A'!$E$33)","v":"Required"},{"$f":"IF('Tex-418-A'!$F$34=\"\",\"\",'Tex-418-A'!$F$34)","v":"2"}]
[13,{"$f":"IF('Tex-418-A'!$H$31=\"\",\"\",'Tex-418-A'!$H$31)","v":""},{"$f":"IF('Tex-418-A'!$B$6=\"\",\"\",'Tex-418-A'!$B$6)","v":"Tex-418-A, Compressive Strength of Cylindrical Concrete Specimens"},{"$f":"IF('Tex-418-A'!$H$28=\"\",\"\",'Tex-418-A'!$H$28)","v":"Diameter of Cylinder (inches)"},{"$f":"IF('Tex-418-A'!$D$31=\"\",\"\",'Tex-418-A'!$D$31)","v":7},{"$f":"IF('Tex-418-A'!$E$31=\"\",\"\",'Tex-418-A'!$E$31)","v":"Required"},{"$f":"IF('Tex-418-A'!$F$31=\"\",\"\",'Tex-418-A'!$F$31)","v":"1"}]
[14,{"$f":"IF('Tex-418-A'!$H$32=\"\",\"\",'Tex-418-A'!$H$32)","v":""},{"$f":"IF('Tex-418-A'!$B$6=\"\",\"\",'Tex-418-A'!$B$6)","v":"Tex-418-A, Compressive Strength of Cylindrical Concrete Specimens"},{"$f":"IF('Tex-418-A'!$H$28=\"\",\"\",'Tex-418-A'!$H$28)","v":"Diameter of Cylinder (inches)"},{"$f":"IF('Tex-418-A'!$D$31=\"\",\"\",'Tex-418-A'!$D$31)","v":7},{"$f":"IF('Tex-418-A'!$E$31=\"\",\"\",'Tex-418-A'!$E$31)","v":"Required"},{"$f":"IF('Tex-418-A'!$F$32=\"\",\"\",'Tex-418-A'!$F$32)","v":"2"}]
[15,{"$f":"IF('Tex-418-A'!$H$33=\"\",\"\",'Tex-418-A'!$H$33)","v":""},{"$f":"IF('Tex-418-A'!$B$6=\"\",\"\",'Tex-418-A'!$B$6)","v":"Tex-418-A, Compressive Strength of Cylindrical Concrete Specimens"},{"$f":"IF('Tex-418-A'!$H$28=\"\",\"\",'Tex-418-A'!$H$28)","v":"Diameter of Cylinder (inches)"},{"$f":"IF('Tex-418-A'!$D$33=\"\",\"\",'Tex-418-A'!$D$33)","v":28},{"$f":"IF('Tex-418-A'!$E$33=\"\",\"\",'Tex-418-A'!$E$33)","v":"Required"},{"$f":"IF('Tex-418-A'!$F$33=\"\",\"\",'Tex-418-A'!$F$33)","v":"1"}]
[16,{"$f":"IF('Tex-418-A'!$H$34=\"\",\"\",'Tex-418-A'!$H$34)","v":""},{"$f":"IF('Tex-418-A'!$B$6=\"\",\"\",'Tex-418-A'!$B$6)","v":"Tex-418-A, Compressive Strength of Cylindrical Concrete Specimens"},{"$f":"IF('Tex-418-A'!$H$28=\"\",\"\",'Tex-418-A'!$H$28)","v":"Diameter of Cylinder (inches)"},{"$f":"IF('Tex-418-A'!$D$33=\"\",\"\",'Tex-418-A'!$D$33)","v":28},{"$f":"IF('Tex-418-A'!$E$33=\"\",\"\",'Tex-418-A'!$E$33)","v":"Required"},{"$f":"IF('Tex-418-A'!$F$34=\"\",\"\",'Tex-418-A'!$F$34)","v":"2"}]
[17,{"$f":"IF('Tex-418-A'!$I$31=\"\",\"\",'Tex-418-A'!$I$31)","v":""},{"$f":"IF('Tex-418-A'!$B$6=\"\",\"\",'Tex-418-A'!$B$6)","v":"Tex-418-A, Compressive Strength of Cylindrical Concrete Specimens"},{"$f":"IF('Tex-418-A'!$I$28=\"\",\"\",'Tex-418-A'!$I$28)","v":"Length of Cylinder (inches)"},{"$f":"IF('Tex-418-A'!$D$31=\"\",\"\",'Tex-418-A'!$D$31)","v":7},{"$f":"IF('Tex-418-A'!$E$31=\"\",\"\",'Tex-418-A'!$E$31)","v":"Required"},{"$f":"IF('Tex-418-A'!$F$31=\"\",\"\",'Tex-418-A'!$F$31)","v":"1"}]
[18,{"$f":"IF('Tex-418-A'!$I$32=\"\",\"\",'Tex-418-A'!$I$32)","v":""},{"$f":"IF('Tex-418-A'!$B$6=\"\",\"\",'Tex-418-A'!$B$6)","v":"Tex-418-A, Compressive Strength of Cylindrical Concrete Specimens"},{"$f":"IF('Tex-418-A'!$I$28=\"\",\"\",'Tex-418-A'!$I$28)","v":"Length of Cylinder (inches)"},{"$f":"IF('Tex-418-A'!$D$31=\"\",\"\",'Tex-418-A'!$D$31)","v":7},{"$f":"IF('Tex-418-A'!$E$31=\"\",\"\",'Tex-418-A'!$E$31)","v":"Required"},{"$f":"IF('Tex-418-A'!$F$32=\"\",\"\",'Tex-418-A'!$F$32)","v":"2"}]
{"$rows_left_out":70}
{"sheet":"Revisions","index":2,"n_rows":18,"n_cols":4,"rows_kept":18,"cut":false,"hidden":true,"merged":[]}
["Date","Changes","By","Comments"]
["2005-05-24","Change Range Name TestPerson1 from ='Tex-418-A'!$E$45  to ='Tex-418-A'!$C$45","Joe Liu"," no pull down list for the testers."]
["2005-06-21","Change test method from Tx4Hard to Tx418","Joe Liu"]
["2006-06-12","Added comments in cells B22:O22.","Jennifer Moore"]
["2007-11-13","Modified/added verbage to comments in cells B22:O22","Jennifer Moore"]
["2008-08-25","Corrected formula in E32:33 to properly show when the test is required","Jennifer Moore"]
["2008-08-25","Corrected formula in P30:31 to properly if results meet strength requirements","Jennifer Moore"]
["2008-08-25","Added formula for to display * note when P30:31 has *","Jennifer Moore"]
["2008-08-25","Updated formula in P32:33 to only reflect 28-day tests","Jennifer Moore"]
["2009-08-12","- Updated L/D correction factors\n- Added grade of aggregate input (cell H28) and comment (cell J28)\n- Added cylinder size verifications (cells T33:37 and B37)\n- Added Type of Concrete and Mix Design cells (cell H26 and L26 respectively)\n- Added code to Sheet1 Macro to hide row \"Structural_Info\"","Jennifer Moore"]
["2009-09-22","- Added Class C(Non-Structural), Class C(HPC), Class F(HPC), Class H(HPC), Class S(HPC) , and Other to drop-down list\n- Added above listed classes to hidden table list","Jennifer Moore"]
["2016-01-06","added 2014 spec compressive strengths and classes to Class dropdown menu","R. Cano"]
["2016-01-06","removed \"circumference\" from dropdown menu in table","R. Cano"]
["2016-01-06","added 2014 structural concrete information in row 22. updated code to show/hide appropriate row","R. Cano"]
["2016-01-06","added conditional formatting to 7-day target strength cell to gray out when specyear=2014 and type of concrete=structural","R. Cano"]
["2016-01-06","moved compressive strength calculations to Tex-418-A sheet and edited formula to remove metric calculations","R. Cano"]
["2016-01-06","edited 28-day design strength formula to include 2004 and 2014 values from table in L to D Lookup","R. Cano"]
["2019-05-07","edited formula in cell P31 to generate message requiring target strength for non-structural concrete, includes version control (2)"]

{"sheet":"Data_L to D Lookup","index":3,"n_rows":112,"n_cols":15,"rows_kept":112,"cut":false,"hidden":true,"merged":[[17,14,17,27],[8,4,9,4],[8,3,11,3],[8,5,9,5],[11,14,11,27],[15,14,15,27],[8,6,9,6]]}
["Length to Diameter Ratio","Correction Factor",null,null,"English f'c","Metric f'c"]
[1,0.87,null,null,{"$f":"IF(ISERROR('Tex-418-A'!$M31*('Tex-418-A'!$K31/(PI()*(IF(CircumDiameter1=\"circumference\",SQRT('Tex-418-A'!$H31/PI())*2,'Tex-418-A'!$H31)^2/4)))),\"\",'Tex-418-A'!$M31*('Tex-418-A'!$K31/(PI()*(IF(CircumDiameter1=\"circumference\",SQRT('Tex-418-A'!$H31/PI())*2,'Tex-418-A'!$H31)^2/4))))","v":""},{"$f":"IF(ISERROR(0.000001*('Tex-418-A'!$M31*('Tex-418-A'!$K31/(PI()*((IF(CircumDiameter1=\"circumference\",SQRT('Tex-418-A'!$H31/PI())*2,'Tex-418-A'!$H31)/1000)^2/4))))),\"\",0.000001*('Tex-418-A'!$M31*('Tex-418-A'!$K31/(PI()*((IF(CircumDiameter1=\"circumference\",SQRT('Tex-418-A'!$H31/PI())*2,'Tex-418-A'!$H31)/1000)^2/4)))))","v":""}]
[1.01,0.87239999999999995,null,null,{"$f":"IF(ISERROR('Tex-418-A'!$M32*('Tex-418-A'!$K32/(PI()*(IF(CircumDiameter1=\"circumference\",SQRT('Tex-418-A'!$H32/PI())*2,'Tex-418-A'!$H32)^2/4)))),\"\",'Tex-418-A'!$M32*('Tex-418-A'!$K32/(PI()*(IF(CircumDiameter1=\"circumference\",SQRT('Tex-418-A'!$H32/PI())*2,'Tex-418-A'!$H32)^2/4))))","v":""},{"$f":"IF(ISERROR(0.000001*('Tex-418-A'!$M32*('Tex-418-A'!$K32/(PI()*((IF(CircumDiameter1=\"circumference\",SQRT('Tex-418-A'!$H32/PI())*2,'Tex-418-A'!$H32)/1000)^2/4))))),\"\",0.000001*('Tex-418-A'!$M32*('Tex-418-A'!$K32/(PI()*((IF(CircumDiameter1=\"circumference\",SQRT('Tex-418-A'!$H32/PI())*2,'Tex-418-A'!$H32)/1000)^2/4)))))","v":""}]
[1.02,0.87480000000000002,null,null,{"$f":"IF(ISERROR('Tex-418-A'!$M33*('Tex-418-A'!$K33/(PI()*(IF(CircumDiameter1=\"circumference\",SQRT('Tex-418-A'!$H33/PI())*2,'Tex-418-A'!$H33)^2/4)))),\"\",'Tex-418-A'!$M33*('Tex-418-A'!$K33/(PI()*(IF(CircumDiameter1=\"circumference\",SQRT('Tex-418-A'!$H33/PI())*2,'Tex-418-A'!$H33)^2/4))))","v":""},{"$f":"IF(ISERROR(0.000001*('Tex-418-A'!$M33*('Tex-418-A'!$K33/(PI()*((IF(CircumDiameter1=\"circumference\",SQRT('Tex-418-A'!$H33/PI())*2,'Tex-418-A'!$H33)/1000)^2/4))))),\"\",0.000001*('Tex-418-A'!$M33*('Tex-418-A'!$K33/(PI()*((IF(CircumDiameter1=\"circumference\",SQRT('Tex-418-A'!$H33/PI())*2,'Tex-418-A'!$H33)/1000)^2/4)))))","v":""}]
[1.03,0.87719999999999998,null,null,{"$f":"IF(ISERROR('Tex-418-A'!$M34*('Tex-418-A'!$K34/(PI()*(IF(CircumDiameter1=\"circumference\",SQRT('Tex-418-A'!$H34/PI())*2,'Tex-418-A'!$H34)^2/4)))),\"\",'Tex-418-A'!$M34*('Tex-418-A'!$K34/(PI()*(IF(CircumDiameter1=\"circumference\",SQRT('Tex-418-A'!$H34/PI())*2,'Tex-418-A'!$H34)^2/4))))","v":""},{"$f":"IF(ISERROR(0.000001*('Tex-418-A'!$M34*('Tex-418-A'!$K34/(PI()*((IF(CircumDiameter1=\"circumference\",SQRT('Tex-418-A'!$H34/PI())*2,'Tex-418-A'!$H34)/1000)^2/4))))),\"\",0.000001*('Tex-418-A'!$M34*('Tex-418-A'!$K34/(PI()*((IF(CircumDiameter1=\"circumference\",SQRT('Tex-418-A'!$H34/PI())*2,'Tex-418-A'!$H34)/1000)^2/4)))))","v":""}]
[1.04,0.87960000000000005]
[1.05,0.88200000000000001]
[1.06,0.88439999999999996]
[1.07,0.88680000000000003,null,"Concrete Class","Min. 28-Day Compressive Strength","Min. 28-Day Compressive Strength","Min. 28-Day Compressive Strength"]
[1.08,0.88919999999999999]
[1.0900000000000001,0.89159999999999995,null,null,2004,2014,2014]
[1.1000000000000001,0.89400000000000002,null,null,"(psi)","(psi)","(psi)",null,null,null,null,null,null,"Str_Info-","Make four (4) cylinders every 60 CY or per day. Two (2) of these four (4) cylinders are required to be tested at 7 days and \n• if the average value of the two cylinders tested at 7 days meets the minimum design strength listed in Item 421 Table 5, the two remaining cylinders are not required to be tested.\n• If the average value is below the 7-day target value as defined in 421.4.B, the remaining two (2) cylinders shall be tested at 28 days.\n• If the average value is above the 7-day target value, but below the minimum design strength, the remaining two (2) cylinders are required to be tested once every 180 CY. However, testing and recording all the 28 day strengths would be helpful to adjust the required strength overdesign."]
[1.1100000000000001,0.89639999999999997,null,"CLASS A",3000,3000,3000]
[1.1200000000000001,0.89880000000000004,null,"CLASS B",2000,2000,2000]
[1.1299999999999999,0.9012,null,"CLASS C",3600,3600,3600]
[1.1399999999999999,0.90359999999999996,null,"CLASS C(HPC)",3600,3600,3600,null,null,null,null,null,null,"Str_Info14-","Make a minimum four (4) cylinders every 60 CY or per day. Two (2) of these four (4) cylinders are required to be tested at 7 days and \n• if the average value of the two cylinders tested at 7 days meets the minimum design strength listed in Item 421 Table 8, the two remaining cylinders are not required to be tested.\n• If the average value is below the minimum design strength, the remaining two (2) cylinders shall be tested at 28 days or 56 days."]
[1.1499999999999999,0.90600000000000003,null,"CLASS C(Non-Structural)",3600,3600,3600]
[1.1599999999999999,0.90839999999999999,null,"CLASS C(SRC)","--",3600,3600,null,null,null,null,null,null,"NStr_Info 14","Make two (2) cylinders every 180 CY. Both cylinders are required to be tested at 7 days. The average value must meet or exceed the target value as defined in 2004 Spec Item 421.4.B or 2014 Spec Item 421.4.3."]
[1.17,0.91080000000000005,null,"CLASS CO",4600,4600,4600]
[1.18,0.91320000000000001,null,"CLASS D",1500,"--","--",null,null,null,null,null,null,"NStr_Info 24","Make two (2) cylinders every 180 CY. Both cylinders are required to be tested at 7 days. Acceptance is based on attaining the design strength or attaining the 7-day target value established in accordance with Tex-427-A."]
{"$rows_left_out":92}