{"text_format":"1","workbook":"xlsx","n_sheets":6,"sheets":["RCC Data","Gradation","ASTM 1557","Optimum Cement Content Graph","RX","Reference"],"not_rendered":{"charts":4,"images":1,"macros":1,"external_links":0,"defined_names":243,"comments":3,"pivot_tables":0},"unopened":[{"sheet":"Gradation","index":1,"reason":"not_a_worksheet"}],"bounds":{"document_bytes":16777216,"sheet_cells":100000,"rows_first":2000,"rows_last":500,"rows_between":2000,"halvings":0,"cell_chars":16384,"cell_head_chars":4096},"cells_cut":0,"cells_raw":0,"read":"whole","date_system":"1900"}

{"sheet":"RCC Data","index":0,"n_rows":96,"n_cols":18,"rows_kept":96,"cut":false,"hidden":false,"merged":[[10,1,10,3],[11,1,11,3],[12,1,12,3],[13,1,13,3],[14,1,14,3],[15,1,15,3],[26,2,27,3],[0,0,0,2],[35,2,35,3],[34,2,34,3],[33,2,33,3],[32,2,32,3],[31,2,31,3],[7,1,7,3],[8,1,8,3],[9,1,9,3],[16,1,16,3],[18,1,18,3],[30,2,30,3],[27,6,27,7],[27,4,27,5],[28,4,28,5],[28,6,28,7],[28,8,28,9],[23,2,23,4],[21,1,21,16],[18,11,18,12],[29,2,29,3],[25,2,25,11],[19,1,19,12],[23,5,23,7],[28,2,28,3],[30,8,30,9],[31,6,31,7],[31,8,31,9],[41,2,41,4],[43,5,43,7],[29,10,29,11],[26,10,27,11],[26,8,27,9],[33,4,33,5],[33,6,33,7],[33,8,33,9],[33,10,33,11],[32,4,32,5],[32,6,32,7],[32,8,32,9],[32,10,32,11],[29,4,29,5],[29,6,29,7],[29,8,29,9],[28,10,28,11],[26,4,26,7],[30,4,30,5],[30,6,30,7],[30,10,30,11],[31,10,31,11],[34,10,34,11],[31,4,31,5],[59,5,59,6],[48,5,48,6],[48,2,48,4],[50,5,50,6],[49,5,49,6],[49,2,49,4],[58,5,58,6],[56,7,56,8],[34,8,34,9],[34,4,34,5],[34,6,34,7],[48,7,48,8],[54,1,54,16],[56,2,56,4],[56,5,56,6],[42,5,42,7],[35,10,35,11],[50,2,50,4],[51,2,51,4],[51,7,51,8],[50,7,50,8],[43,2,43,4],[42,2,42,4],[59,7,59,8],[58,7,58,8],[57,7,57,8],[57,5,57,6],[38,1,38,16],[46,1,46,16],[40,2,40,7],[57,2,59,4],[35,4,35,5],[35,6,35,7],[35,8,35,9],[76,2,78,4],[76,5,76,6],[77,5,77,6],[78,5,78,6],[73,2,75,4],[73,5,73,6],[72,5,72,6],[72,7,72,8],[41,5,41,7],[69,9,69,10],[63,2,65,4],[60,2,62,4],[61,5,61,6],[62,5,62,6],[63,5,63,6],[64,5,64,6],[65,5,65,6],[67,1,67,16],[69,13,69,14],[65,7,65,8],[64,7,64,8],[62,7,62,8],[61,7,61,8],[60,7,60,8],[75,11,75,12],[74,11,74,12],[73,11,73,12],[78,7,78,8],[77,7,77,8],[76,7,76,8],[75,7,75,8],[74,7,74,8],[71,9,71,10],[75,5,75,6],[72,9,72,10],[73,9,73,10],[71,11,71,12],[70,11,70,12],[13,10,13,12],[12,10,12,12],[11,10,11,12],[13,4,13,6],[16,4,16,6],[69,11,69,12],[60,5,60,6],[49,7,49,8],[51,5,51,6],[69,2,69,4],[69,5,69,6],[69,7,69,8],[70,2,72,4],[70,5,70,6],[70,7,70,8],[71,5,71,6],[71,7,71,8],[70,9,70,10],[63,7,63,8],[92,6,92,7],[16,7,16,9],[16,10,16,12],[96,1,96,3],[92,1,92,3],[89,2,89,4],[82,1,84,16],[76,15,78,16],[77,9,77,10],[78,9,78,10],[76,13,78,14],[73,13,75,14],[70,13,72,14],[73,7,73,8],[78,11,78,12],[77,11,77,12],[76,11,76,12],[74,9,74,10],[75,9,75,10],[76,9,76,10],[73,15,75,16],[70,15,72,16],[69,15,69,16],[72,11,72,12],[87,2,87,4],[7,10,7,12],[8,7,8,9],[7,7,7,9],[7,4,7,6],[18,9,18,10],[15,4,15,12],[14,4,14,12],[13,7,13,9],[12,7,12,9],[11,7,11,9],[8,4,8,6],[9,4,9,6],[10,4,10,6],[11,4,11,6],[12,4,12,6],[10,10,10,12],[8,10,8,12],[9,10,9,12],[10,7,10,9],[9,7,9,9],[18,4,18,5],[18,7,18,8],[74,5,74,6]]}
["TxDOT Manuals >"]
[null,"TEXAS DEPARTMENT OF TRANSPORTATION",null,null,null,null,null,null,null,null,null,null,null,null,null,null,null,255]
[null,null,null,null,null,null,null,null,null,null,null,null,null,null,161,null,null,2]
[null,null,null,null,null,null,null,null,null,null,null,null,null,null,2,null,null,"Tx113,4.xls::41085.660347"]
[null,"Roller Compacted Concrete Worksheet",null,null,null,null,null,null,null,null,null,null,null,null,"tx4rcc.xlsm::45183.390625",null,null,45]
[]
[null,null,null,null,null,null,null,null,null,null,null,null,{"$f":"\"File Version: \" & TEXT(MID(sn,SEARCH(\"::\",sn,1)+2,20),\"mm/dd/yy hh:mm:ss\")","v":"File Version: 09/14/23 09:22:30"}]
[null,"SAMPLE ID:",null,null,null,null,null,"SAMPLED DATE:"]
[null,"TEST NUMBER:",null,null,null,null,null,"LETTING DATE:"]
[null,"SAMPLE STATUS:",null,null,null,null,null,"CONTROLLING CSJ:"]
[null,"COUNTY:",null,null,null,null,null,"SPEC YEAR:"]
[null,"SAMPLED BY:",null,null,null,null,null,"SPEC ITEM:"]
[null,"SAMPLE LOCATION:",null,null,null,null,null,"SPECIAL PROVISION:"]
[null,"MATERIAL CODE:",null,null,null,null,null,"GRADE:"]
[null,"MATERIAL NAME:"]
[null,"PRODUCER:",null,null,""]
[null,"AREA ENGINEER:",null,null,null,null,null,"PROJECT MANAGER:"]
[]
[null,"COURSE\\LIFT:",null,null,null,null,"STATION:",null,null,"DIST. FROM CL:"]
[null,"Roller Compacted Concrete Mix Design"]
[]
[null,"1. Select aggregates meeting the requirements of section 2.A in Special Specification 3258 \"Roller Compacted Concrete\""]
[]
[null,null,"Select RCC Application: "]
[]
[null,null,{"$f":"\"RCC Combined Aggregate Gradation for \"&F24","v":"RCC Combined Aggregate Gradation for "}]
[null,null,"Sieve Size",null,"Percent Passing by Weight",null,null,null,"Actual Gradation - Percent Passing by Weight",null,"Within Master Grading"]
[null,null,null,null,"Minimum\nSpec Limit",null,"Maximum\nSpec Limit"]
[null,null,"1 in",null,{"$f":"IF($F$24=\"\",\"\",IF($F$24=\"Surface Course\",Reference!$X$5,IF($F$24=\"Base/Subbase Course\",Reference!$Z$5)))","v":""},null,{"$f":"IF($F$24=\"\",\"\",IF($F$24=\"Surface Course\",Reference!$Y$5,IF($F$24=\"Base/Subbase Course\",Reference!$AA$5)))","v":""},null,null,null,{"$f":"IF($I29=\"\",\"\",IF(AND($I29<=$G29,$I29>=$E29),\"Yes\",\"No\"))","v":""}]
[null,null,"3/4 in",null,{"$f":"IF($F$24=\"\",\"\",IF($F$24=\"Surface Course\",Reference!$X$6,IF($F$24=\"Base/Subbase Course\",Reference!$Z$6)))","v":""},null,{"$f":"IF($F$24=\"\",\"\",IF($F$24=\"Surface Course\",Reference!$Y$6,IF($F$24=\"Base/Subbase Course\",Reference!$AA$6)))","v":""},null,null,null,""]
[null,null,"1/2 in",null,{"$f":"IF($F$24=\"\",\"\",IF($F$24=\"Surface Course\",Reference!$X$7,IF($F$24=\"Base/Subbase Course\",Reference!$Z$7)))","v":""},null,{"$f":"IF($F$24=\"\",\"\",IF($F$24=\"Surface Course\",Reference!$Y$7,IF($F$24=\"Base/Subbase Course\",Reference!$AA$7)))","v":""},null,null,null,""]
[null,null,"3/8 in",null,{"$f":"IF($F$24=\"\",\"\",IF($F$24=\"Surface Course\",Reference!$X$8,IF($F$24=\"Base/Subbase Course\",Reference!$Z$8)))","v":""},null,{"$f":"IF($F$24=\"\",\"\",IF($F$24=\"Surface Course\",Reference!$Y$8,IF($F$24=\"Base/Subbase Course\",Reference!$AA$8)))","v":""},null,null,null,""]
[null,null,"No. 4",null,{"$f":"IF($F$24=\"\",\"\",IF($F$24=\"Surface Course\",Reference!$X$9,IF($F$24=\"Base/Subbase Course\",Reference!$Z$9)))","v":""},null,{"$f":"IF($F$24=\"\",\"\",IF($F$24=\"Surface Course\",Reference!$Y$9,IF($F$24=\"Base/Subbase Course\",Reference!$AA$9)))","v":""},null,null,null,""]
[null,null,"No. 16",null,{"$f":"IF($F$24=\"\",\"\",IF($F$24=\"Surface Course\",Reference!$X$10,IF($F$24=\"Base/Subbase Course\",Reference!$Z$10)))","v":""},null,{"$f":"IF($F$24=\"\",\"\",IF($F$24=\"Surface Course\",Reference!$Y$10,IF($F$24=\"Base/Subbase Course\",Reference!$AA$10)))","v":""},null,null,null,""]
[null,null,"No. 100",null,{"$f":"IF($F$24=\"\",\"\",IF($F$24=\"Surface Course\",Reference!$X$11,IF($F$24=\"Base/Subbase Course\",Reference!$Z$11)))","v":""},null,{"$f":"IF($F$24=\"\",\"\",IF($F$24=\"Surface Course\",Reference!$Y$11,IF($F$24=\"Base/Subbase Course\",Reference!$AA$11)))","v":""},null,null,null,""]
[null,null,"No. 200",null,{"$f":"IF($F$24=\"\",\"\",IF($F$24=\"Surface Course\",Reference!$X$12,IF($F$24=\"Base/Subbase Course\",Reference!$Z$12)))","v":""},null,{"$f":"IF($F$24=\"\",\"\",IF($F$24=\"Surface Course\",Reference!$Y$12,IF($F$24=\"Base/Subbase Course\",Reference!$AA$12)))","v":""},null,null,null,{"$f":"IF(F24=\"Base/Subbase Course\",\"--\",IF($I36=\"\",\"\",IF(AND($I36<=$G36,$I36>=$E36),\"Yes\",\"No\")))","v":""}]
[]
[]
[null,"2. Select a minimum of three (3) cementitious contents. (Select the cementitious contents such that one content will be at an estimated optimum content, a \n    minimum of one additional content below estimated optimum and aminimum of one above estimated optimum)"]
[]
[null,null,"Estimated Cementitious Content"]
[null,null,"Optimum (A):"]
[null,null,"Below Optimum (B):",null,null,null,null,null,{"$f":"IF($F$43=\"\",\"\",IF($F$43>=$F$42,\"Select an estimated cementitious content BELOW the estimated optimum\",\"\"))","v":""}]
[null,null,"Above Optimum (C):"]
[null,null,null,null,null,null,null,null,null,null,null,null,null,null,null,{"$f":"IF($F$44=\"\",\"\",IF($F$44<=$F$42,\"Select an estimated cementitious content ABOVE the estimated optimum\",\"\"))","v":""}]
[]
[null,"3. Determine the optimum moisture content for each cementitious content in accordance with ASTM 1557 (Tex-113, 4-E)"]
[]
[null,null,"Moisture-Denisty Curve Label",null,null,"Cementitious Content",null,"Optimum Moisture Content %"]
[null,null,"Optimum (A):",null,null,{"$f":"IF($F$42=\"\",\"\",$F$42)","v":""},null,6.2]
[null,null,"Below Optimum (B):",null,null,{"$f":"IF($F$43=\"\",\"\",$F$43)","v":""},null,5.8]
[null,null,"Above Optimum (C):",null,null,{"$f":"IF($F$44=\"\",\"\",$F$44)","v":""},null,6]
[]
[]
[null,"4. Cast three (3) samples at optimum moisture content for each cementitious content in accordance with ASTM C 1435"]
[]
[null,null,"Moisture-Denisty Curve Label",null,null,"Sample No.",null,"OMC %"]
[null,null,"Optimum (A):",null,null,"A1",null,{"$f":"IF($H$50=\"\",\"\",$H$50)","v":6.2}]
[null,null,null,null,null,"A2",null,{"$f":"IF($H$50=\"\",\"\",$H$50)","v":6.2}]
[null,null,null,null,null,"A3",null,{"$f":"IF($H$50=\"\",\"\",$H$50)","v":6.2}]
[null,null,"Below Optimum (B):",null,null,"B1",null,{"$f":"IF($H$51=\"\",\"\",$H$51)","v":5.8}]
[null,null,null,null,null,"B2",null,{"$f":"IF($H$51=\"\",\"\",$H$51)","v":5.8}]
[null,null,null,null,null,"B3",null,{"$f":"IF($H$51=\"\",\"\",$H$51)","v":5.8}]
[null,null,"Above Optimum (C):",null,null,"C1",null,{"$f":"IF($H$52=\"\",\"\",$H$52)","v":6}]
[null,null,null,null,null,"C2",null,{"$f":"IF($H$52=\"\",\"\",$H$52)","v":6}]
[null,null,null,null,null,"C3",null,{"$f":"IF($H$52=\"\",\"\",$H$52)","v":6}]
[]
[null,"5. Test all specimens cast for strength in acordacne with TEX 418-A, with the exception that the average minimum compressive strength shall be 4,400 psi at 28 days."]
[]
[null,null,"Moisture-Denisty Curve Label",null,null,"Sample No.",null,"Cementitious Content\n(%)",null,"Optimum Moisture Content\n(%)",null,"28-Day Compressive Strength, f'c (psi)",null,"Average f'c  (psi)",null,"Notes"]
[null,null,"Optimum (A):",null,null,"A1",null,{"$f":"IF($F$50=\"\",\"\",$F$50)","v":""},null,{"$f":"IF($H$50=\"\",\"\",$H$50)","v":6.2},null,null,null,{"$f":"IF(L71=\"\",\"\",AVERAGE($L$71:$L$73))","v":""},null,{"$f":"IF(N71=\"\",\"\",IF(N71<4400,\"Min. Avg. Comp. Strength ≠ 4,400 psi at 28 days\",\"\"))","v":""}]
[null,null,null,null,null,"A2",null,{"$f":"IF($F$50=\"\",\"\",$F$50)","v":""},null,{"$f":"IF($H$50=\"\",\"\",$H$50)","v":6.2}]
[null,null,null,null,null,"A3",null,{"$f":"IF($F$50=\"\",\"\",$F$50)","v":""},null,{"$f":"IF($H$50=\"\",\"\",$H$50)","v":6.2}]
[null,null,"Below Optimum (B):",null,null,"B1",null,{"$f":"IF($F$51=\"\",\"\",$F$51)","v":""},null,{"$f":"IF($H$51=\"\",\"\",$H$51)","v":5.8},null,null,null,{"$f":"IF(L74=\"\",\"\",AVERAGE($L$74:$L$76))","v":""},null,{"$f":"IF(N74=\"\",\"\",IF(N74<4400,\"Min. Avg. Comp. Strength ≠ 4,400 psi at 28 days\",\"\"))","v":""}]
[null,null,null,null,null,"B2",null,{"$f":"IF($F$51=\"\",\"\",$F$51)","v":""},null,{"$f":"IF($H$51=\"\",\"\",$H$51)","v":5.8}]
[null,null,null,null,null,"B3",null,{"$f":"IF($F$51=\"\",\"\",$F$51)","v":""},null,{"$f":"IF($H$51=\"\",\"\",$H$51)","v":5.8}]
[null,null,"Above Optimum (C):",null,null,"C1",null,{"$f":"IF($F$52=\"\",\"\",$F$52)","v":""},null,{"$f":"IF($H$52=\"\",\"\",$H$52)","v":6},null,null,null,{"$f":"IF(L77=\"\",\"\",AVERAGE($L$77:$L$79))","v":""},null,{"$f":"IF(N77=\"\",\"\",IF(N77<4400,\"Min. Avg. Comp. Strength ≠ 4,400 psi at 28 days\",\"\"))","v":""}]
[null,null,null,null,null,"C2",null,{"$f":"IF($F$52=\"\",\"\",$F$52)","v":""},null,{"$f":"IF($H$52=\"\",\"\",$H$52)","v":6}]
[null,null,null,null,null,"C3",null,{"$f":"IF($F$52=\"\",\"\",$F$52)","v":""},null,{"$f":"IF($H$52=\"\",\"\",$H$52)","v":6}]
[]
[]
[null,"Remarks:",{"$f":"NOW()","v":"2023-09-14T09:22:30.600"}]
[]
[]
[]
[]
[null,"Sample Method:","Sampled By:",null,null,"Sampled Date:"]
[null,"TX407",null,null,null," "]
[null,"Test Method:","Tested By:",null,null,"Tested Date:"]
[null,"TX418"," ",null,null," "]
[]
[null,"Test Stamp Code:",null,null,"Omit Test:","Completed Date:","Reviewed By:"]
[]
[null,"Locked By:","TxDOT:","District:","Area:"]
[null,"","","",""]
[null,"Authorized By:",null,null,"Authorized Date:"]

{"sheet":"ASTM 1557","index":2,"n_rows":70,"n_cols":18,"rows_kept":70,"cut":false,"hidden":false,"merged":[[67,2,67,4],[7,1,7,3],[8,9,8,12],[11,9,11,12],[13,1,13,3],[12,1,12,3],[11,1,11,3],[10,1,10,3],[9,1,9,3],[8,1,8,3],[10,9,10,12],[9,9,9,12],[7,4,7,8],[8,4,8,8],[9,4,9,8],[10,4,10,8],[7,9,7,12],[23,1,23,2],[21,1,21,2],[57,13,57,16],[58,13,58,16],[27,1,27,2],[25,1,25,2],[24,1,24,2],[13,9,13,12],[12,9,12,12],[16,13,16,16],[16,9,16,12],[18,14,18,16],[18,11,18,13],[18,9,18,10],[15,1,15,3],[59,13,59,16],[30,3,30,6],[30,1,30,2],[41,1,41,2],[30,8,30,11],[32,1,32,2],[31,1,31,2],[59,3,59,6],[30,13,30,16],[37,1,37,2],[58,3,58,6],[57,3,57,6],[57,8,57,11],[58,8,58,11],[59,8,59,11],[14,1,14,3],[15,4,15,16],[14,4,14,16],[13,13,13,16],[22,1,22,2],[16,1,16,3],[18,1,18,3],[16,4,16,8],[18,4,18,5],[18,6,18,8],[19,1,19,16],[69,2,69,4],[11,4,11,8],[12,4,12,8],[13,4,13,8],[7,13,7,16],[8,13,8,16],[9,13,9,16],[10,13,10,16],[11,13,11,16],[12,13,12,16],[48,1,48,2],[53,1,53,2],[52,1,52,2],[51,1,51,2],[50,1,50,2],[47,1,47,2],[62,1,64,16],[34,1,34,2],[35,1,35,2],[59,1,59,2],[58,1,58,2],[57,1,57,2],[55,1,55,2],[54,1,54,2],[49,1,49,2],[46,1,46,2],[36,1,36,2],[40,1,40,2],[44,1,44,2],[43,1,43,2],[42,1,42,2],[39,1,39,2]]}
[]
[null,"TEXAS DEPARTMENT OF TRANSPORTATION"]
[]
[]
[null,"Moisture-Density Curve for Roller Compacted Concrete",null,null,null,null,null,null,null,null,null,null,null,null,null,null,null,45]
[null,"ASTM D1557"]
[]
[null,"SAMPLE ID:",null,null,{"$f":"IF(sampleid=\"\",\"\",sampleid)","v":""},null,null,null,null,"SAMPLED DATE:",null,null,null,{"$f":"IF(sampleddate=\"\",\"\",sampleddate)","v":""}]
[null,"TEST NUMBER:",null,null,{"$f":"IF(testnumber=\"\",\"\",testnumber)","v":""},null,null,null,null,"LETTING DATE:",null,null,null,{"$f":"IF(lettingdate=\"\",\"\",lettingdate)","v":""}]
[null,"SAMPLE STATUS:",null,null,{"$f":"IF(status=\"\",\"\",status)","v":""},null,null,null,null,"CONTROLLING CSJ:",null,null,null,{"$f":"IF(ccsj=\"\",\"\",ccsj)","v":""}]
[null,"COUNTY:",null,null,{"$f":"IF(county=\"\",\"\",county)","v":""},null,null,null,null,"SPEC YEAR:",null,null,null,{"$f":"+IF(specyear=\"\",\"\",specyear)","v":""}]
[null,"SAMPLED BY:",null,null,{"$f":"IF(sampledby=\"\",\"\",sampledby)","v":""},null,null,null,null,"SPEC ITEM:",null,null,null,{"$f":"IF(specitem=\"\",\"\",specitem)","v":""}]
[null,"SAMPLE LOCATION:",null,null,{"$f":"IF(samplelocation=\"\",\"\",samplelocation)","v":""},null,null,null,null,"SPECIAL PROVISION:",null,null,null,{"$f":"IF(specialprovision=\"\",\"\",specialprovision)","v":""}]
[null,"MATERIAL CODE:",null,null,{"$f":"IF(material=\"\",\"\",material)","v":""},null,null,null,null,"GRADE:",null,null,null,{"$f":"IF(grade=\"\",\"\",grade)","v":""}]
[null,"MATERIAL NAME:",null,null,{"$f":"IF(matl_nm=\"\",\"\",matl_nm)","v":""}]
[null,"PRODUCER:",null,null,{"$f":"IF(producer=\"\",\"\",producer)","v":""}]
[null,"AREA ENGINEER:",null,null,{"$f":"IF(areaengineer=\"\",\"\",areaengineer)","v":""},null,null,null,null,"PROJECT MANAGER:",null,null,null,{"$f":"IF(PROJECTMANAGER=\"\",\"\",PROJECTMANAGER)","v":""}]
[]
[null,"COURSE\\LIFT:",null,null,{"$f":"IF(courselift=\"\",\"\",courselift)","v":""},null,"STATION:",null,null,{"$f":"IF(station=\"\",\"\",station)","v":""},null,"DIST. FROM CL:",null,null,{"$f":"IF(distfromcl=\"\",\"\",distfromcl)","v":""}]
[null,"Moisture-Density Work Sheet"]
[]
[null,"Oven Dry Weight, (g):"]
[null,"Weight of Pycnometer & Water, (g):"]
[null,"Weight of Aggr., Pycn.& Water, (g):"]
[null,"Specific Gravity (Apparent)(Override):"]
[null,"Specific Gravity (Apparent)(Calc):",null,{"$f":"IF(D25=\"\",IF(ISERROR(D22/(D22+D23-D24)),2.65,D22/(D22+D23-D24)),D25)","v":2.65}]
[]
[null,"Hygroscopic Moisture, (%):"]
[]
[null,null,null,"1-1","1-2","1-3","1-4",null,"2-1","2-2","2-3","2-4",null,"3-1","3-2","3-3","3-4"]
[null,"Cementitious Material (%) :",null,{"$f":"IF(OR(ISERROR('RCC Data'!$F$42),'RCC Data'!$F$42=\"\"),\"\",'RCC Data'!$F$42)","v":""},null,null,null,null,{"$f":"IF(OR(ISERROR('RCC Data'!$F$43),'RCC Data'!$F$43=\"\"),\"\",'RCC Data'!$F$43)","v":""},null,null,null,null,{"$f":"IF(OR(ISERROR('RCC Data'!$F$44),'RCC Data'!$F$44=\"\"),\"\",'RCC Data'!$F$44)","v":""}]
[null,"Sample Number :",null,{"$f":"$D$31&\"% - 1\"","v":"% - 1"},{"$f":"$D$31&\"% - 2\"","v":"% - 2"},{"$f":"$D$31&\"% - 3\"","v":"% - 3"},{"$f":"$D$31&\"% - 4\"","v":"% - 4"},null,{"$f":"$I$31&\"% - 1\"","v":"% - 1"},{"$f":"$I$31&\"% - 2\"","v":"% - 2"},{"$f":"$I$31&\"% - 3\"","v":"% - 3"},{"$f":"$I$31&\"% - 4\"","v":"% - 4"},null,{"$f":"$N$31&\"% - 1\"","v":"% - 1"},{"$f":"$N$31&\"% - 2\"","v":"% - 2"},{"$f":"$N$31&\"% - 3\"","v":"% - 3"},{"$f":"$N$31&\"% - 4\"","v":"% - 4"}]
[null,"Percent Water Content, (%) :"]
[]
[null,"Mass of Dry Aggregate, (lb) :"]
[null,"Total Mass of Cementitios Materials, (lb) :"]
[null,"Total Mass of Dry Material, (lb) :"]
[null,"Mass Water Added, (lb) :",null,{"$f":"IF(OR(ISERROR((D33/100)*D37),COUNTBLANK(D33:D37)=3,D$37=\"\"),\"\",(D33/100)*D37)","v":""},{"$f":"IF(OR(ISERROR((E33/100)*E37),COUNTBLANK(E33:E37)=3,E$37=\"\"),\"\",(E33/100)*E37)","v":""},{"$f":"IF(OR(ISERROR((F33/100)*F37),COUNTBLANK(F33:F37)=3,F$37=\"\"),\"\",(F33/100)*F37)","v":""},{"$f":"IF(OR(ISERROR((G33/100)*G37),COUNTBLANK(G33:G37)=3,G$37=\"\"),\"\",(G33/100)*G37)","v":""},null,{"$f":"IF(OR(ISERROR((I33/100)*I37),COUNTBLANK(I33:I37)=3,I$37=\"\"),\"\",(I33/100)*I37)","v":""},{"$f":"IF(OR(ISERROR((J33/100)*J37),COUNTBLANK(J33:J37)=3,J$37=\"\"),\"\",(J33/100)*J37)","v":""},{"$f":"IF(OR(ISERROR((K33/100)*K37),COUNTBLANK(K33:K37)=3,K$37=\"\"),\"\",(K33/100)*K37)","v":""},{"$f":"IF(OR(ISERROR((L33/100)*L37),COUNTBLANK(L33:L37)=3,L$37=\"\"),\"\",(L33/100)*L37)","v":""},null,{"$f":"IF(OR(ISERROR((N33/100)*N37),COUNTBLANK(N33:N37)=3,N$37=\"\"),\"\",(N33/100)*N37)","v":""},{"$f":"IF(OR(ISERROR((O33/100)*O37),COUNTBLANK(O33:O37)=3,O$37=\"\"),\"\",(O33/100)*O37)","v":""},{"$f":"IF(OR(ISERROR((P33/100)*P37),COUNTBLANK(P33:P37)=3,P$37=\"\"),\"\",(P33/100)*P37)","v":""},{"$f":"IF(OR(ISERROR((Q33/100)*Q37),COUNTBLANK(Q33:Q37)=3,Q$37=\"\"),\"\",(Q33/100)*Q37)","v":""}]
[]
[null,"Wet Mass Specimen & Mold, (lb) :"]
[null,"Mass of Mold, (lb):"]
[null,null,null,{"$f":"IF(OR(ISERROR(D$41),D$41=\"\",D$40=\"\"),\"\",D$41)","v":""},{"$f":"IF(OR(ISERROR(E41),E41=\"\"),IF(OR(ISERROR($D$41),$D$41=\"\",E40=\"\"),\"\",$D$41),E41)","v":""},{"$f":"IF(OR(ISERROR(F41),F41=\"\"),IF(OR(ISERROR($D$41),$D$41=\"\",F40=\"\"),\"\",$D$41),F41)","v":""},{"$f":"IF(OR(ISERROR(G41),G41=\"\"),IF(OR(ISERROR($D$41),$D$41=\"\",G40=\"\"),\"\",$D$41),G41)","v":""},null,{"$f":"IF(OR(ISERROR(I41),I41=\"\",I40=\"\"),\"\",I41)","v":""},{"$f":"IF(OR(ISERROR(J41),J41=\"\"),IF(OR(ISERROR(I41),I41=\"\",J40=\"\"),\"\",I41),J41)","v":""},{"$f":"IF(OR(ISERROR(K41),K41=\"\"),IF(OR(ISERROR(I41),I41=\"\",K40=\"\"),\"\",I41),K41)","v":""},{"$f":"IF(OR(ISERROR(L41),L41=\"\"),IF(OR(ISERROR(I41),I41=\"\",L40=\"\"),\"\",I41),L41)","v":""},null,{"$f":"IF(OR(ISERROR(N41),N41=\"\",N40=\"\"),\"\",N41)","v":""},{"$f":"IF(OR(ISERROR(O41),O41=\"\"),IF(OR(ISERROR(N41),N41=\"\",O40=\"\"),\"\",N41),O41)","v":""},{"$f":"IF(OR(ISERROR(P41),P41=\"\"),IF(OR(ISERROR(N41),N41=\"\",P40=\"\"),\"\",N41),P41)","v":""},{"$f":"IF(OR(ISERROR(Q41),Q41=\"\"),IF(OR(ISERROR(N41),N41=\"\",Q40=\"\"),\"\",N41),Q41)","v":""}]
[null,"Wet Mass Specimen, (lb):",null,{"$f":"IF(N(D40)+N(D42)=0,\"\",N(D40)-N(D42))","v":""},{"$f":"IF(N(E40)+N(E42)=0,\"\",N(E40)-N(E42))","v":""},{"$f":"IF(N(F40)+N(F42)=0,\"\",N(F40)-N(F42))","v":""},{"$f":"IF(N(G40)+N(G42)=0,\"\",N(G40)-N(G42))","v":""},null,{"$f":"IF(N(I40)+N(I42)=0,\"\",N(I40)-N(I42))","v":""},{"$f":"IF(N(J40)+N(J42)=0,\"\",N(J40)-N(J42))","v":""},{"$f":"IF(N(K40)+N(K42)=0,\"\",N(K40)-N(K42))","v":""},{"$f":"IF(N(L40)+N(L42)=0,\"\",N(L40)-N(L42))","v":""},null,{"$f":"IF(N(N40)+N(N42)=0,\"\",N(N40)-N(N42))","v":""},{"$f":"IF(N(O40)+N(O42)=0,\"\",N(O40)-N(O42))","v":""},{"$f":"IF(N(P40)+N(P42)=0,\"\",N(P40)-N(P42))","v":""},{"$f":"IF(N(Q40)+N(Q42)=0,\"\",N(Q40)-N(Q42))","v":""}]
[null,"Height of Specimen, (in.):"]
[null,"Volume per Linear mm., (in.):"]
[null,null,null,{"$f":"IF(OR(ISERROR(D45),D45=\"\",D44=\"\"),\"\",D45)","v":""},{"$f":"IF(OR(ISERROR(E45),E45=\"\"),IF(OR(ISERROR($D$45),$D$45=\"\",E44=\"\"),\"\",$D$45),E45)","v":""},{"$f":"IF(OR(ISERROR(F45),F45=\"\"),IF(OR(ISERROR($D$45),$D$45=\"\",F44=\"\"),\"\",$D$45),F45)","v":""},{"$f":"IF(OR(ISERROR(G45),G45=\"\"),IF(OR(ISERROR($D$45),$D$45=\"\",G44=\"\"),\"\",$D$45),G45)","v":""},null,{"$f":"IF(OR(ISERROR(I45),I45=\"\",I44=\"\"),\"\",I45)","v":""},{"$f":"IF(OR(ISERROR(J45),J45=\"\"),IF(OR(ISERROR(I45),I45=\"\",J44=\"\"),\"\",I45),J45)","v":""},{"$f":"IF(OR(ISERROR(K45),K45=\"\"),IF(OR(ISERROR(I45),I45=\"\",K44=\"\"),\"\",I45),K45)","v":""},{"$f":"IF(OR(ISERROR(L45),L45=\"\"),IF(OR(ISERROR(I45),I45=\"\",L44=\"\"),\"\",I45),L45)","v":""},null,{"$f":"IF(OR(ISERROR(N45),N45=\"\",N44=\"\"),\"\",N45)","v":""},{"$f":"IF(OR(ISERROR(O45),O45=\"\"),IF(OR(ISERROR(N45),N45=\"\",O44=\"\"),\"\",N45),O45)","v":""},{"$f":"IF(OR(ISERROR(P45),P45=\"\"),IF(OR(ISERROR(N45),N45=\"\",P44=\"\"),\"\",N45),P45)","v":""},{"$f":"IF(OR(ISERROR(Q45),Q45=\"\"),IF(OR(ISERROR(N45),N45=\"\",Q44=\"\"),\"\",N45),Q45)","v":""}]
[null,"Volume of Specimen, (ft^3):",null,{"$f":"IF(ISERROR(IF(AND(D44=\"\",D46=\"\"),\"\",D46*D44)),\"\",IF(AND(D44=\"\",D46=\"\"),\"\",D46*D44))","v":""},{"$f":"IF(ISERROR(IF(AND(E44=\"\",E46=\"\"),\"\",E46*E44)),\"\",IF(AND(E44=\"\",E46=\"\"),\"\",E46*E44))","v":""},{"$f":"IF(ISERROR(IF(AND(F44=\"\",F46=\"\"),\"\",F46*F44)),\"\",IF(AND(F44=\"\",F46=\"\"),\"\",F46*F44))","v":""},{"$f":"IF(ISERROR(IF(AND(G44=\"\",G46=\"\"),\"\",G46*G44)),\"\",IF(AND(G44=\"\",G46=\"\"),\"\",G46*G44))","v":""},null,{"$f":"IF(ISERROR(IF(AND(I44=\"\",I46=\"\"),\"\",I46*I44)),\"\",IF(AND(I44=\"\",I46=\"\"),\"\",I46*I44))","v":""},{"$f":"IF(ISERROR(IF(AND(J44=\"\",J46=\"\"),\"\",J46*J44)),\"\",IF(AND(J44=\"\",J46=\"\"),\"\",J46*J44))","v":""},{"$f":"IF(ISERROR(IF(AND(K44=\"\",K46=\"\"),\"\",K46*K44)),\"\",IF(AND(K44=\"\",K46=\"\"),\"\",K46*K44))","v":""},{"$f":"IF(ISERROR(IF(AND(L44=\"\",L46=\"\"),\"\",L46*L44)),\"\",IF(AND(L44=\"\",L46=\"\"),\"\",L46*L44))","v":""},null,{"$f":"IF(ISERROR(IF(AND(N44=\"\",N46=\"\"),\"\",N46*N44)),\"\",IF(AND(N44=\"\",N46=\"\"),\"\",N46*N44))","v":""},{"$f":"IF(ISERROR(IF(AND(O44=\"\",O46=\"\"),\"\",O46*O44)),\"\",IF(AND(O44=\"\",O46=\"\"),\"\",O46*O44))","v":""},{"$f":"IF(ISERROR(IF(AND(P44=\"\",P46=\"\"),\"\",P46*P44)),\"\",IF(AND(P44=\"\",P46=\"\"),\"\",P46*P44))","v":""},{"$f":"IF(ISERROR(IF(AND(Q44=\"\",Q46=\"\"),\"\",Q46*Q44)),\"\",IF(AND(Q44=\"\",Q46=\"\"),\"\",Q46*Q44))","v":""}]
[null,"Wet Density of Specimen, (lb):",null,{"$f":"IF(ISERROR(D43/D47),\"\",D43/D47)","v":""},{"$f":"IF(ISERROR(E43/E47),\"\",E43/E47)","v":""},{"$f":"IF(ISERROR(F43/F47),\"\",F43/F47)","v":""},{"$f":"IF(ISERROR(G43/G47),\"\",G43/G47)","v":""},null,{"$f":"IF(ISERROR(I43/I47),\"\",I43/I47)","v":""},{"$f":"IF(ISERROR(J43/J47),\"\",J43/J47)","v":""},{"$f":"IF(ISERROR(K43/K47),\"\",K43/K47)","v":""},{"$f":"IF(ISERROR(L43/L47),\"\",L43/L47)","v":""},null,{"$f":"IF(ISERROR(N43/N47),\"\",N43/N47)","v":""},{"$f":"IF(ISERROR(O43/O47),\"\",O43/O47)","v":""},{"$f":"IF(ISERROR(P43/P47),\"\",P43/P47)","v":""},{"$f":"IF(ISERROR(Q43/Q47),\"\",Q43/Q47)","v":""}]
[null,"Wet Mass of Pan & Specimen, (lb):"]
[null,"Dry Mass Pan & Specimen, (lb):"]
[null,"Tare Mass Pan, (lb):"]
[null,"Dry Mass Material , (lb):",null,{"$f":"IF(COUNTBLANK(D50:D51)=2,\"\",D50-D51)","v":""},{"$f":"IF(COUNTBLANK(E50:E51)=2,\"\",E50-E51)","v":""},{"$f":"IF(COUNTBLANK(F50:F51)=2,\"\",F50-F51)","v":""},{"$f":"IF(COUNTBLANK(G50:G51)=2,\"\",G50-G51)","v":""},null,{"$f":"IF(COUNTBLANK(I50:I51)=2,\"\",I50-I51)","v":""},{"$f":"IF(COUNTBLANK(J50:J51)=2,\"\",J50-J51)","v":""},{"$f":"IF(COUNTBLANK(K50:K51)=2,\"\",K50-K51)","v":""},{"$f":"IF(COUNTBLANK(L50:L51)=2,\"\",L50-L51)","v":""},null,{"$f":"IF(COUNTBLANK(N50:N51)=2,\"\",N50-N51)","v":""},{"$f":"IF(COUNTBLANK(O50:O51)=2,\"\",O50-O51)","v":""},{"$f":"IF(COUNTBLANK(P50:P51)=2,\"\",P50-P51)","v":""},{"$f":"IF(COUNTBLANK(Q50:Q51)=2,\"\",Q50-Q51)","v":""}]
[null,"Mass Water, (lb):",null,{"$f":"IF(COUNTBLANK(D49:D50)=2,\"\",D49-D50)","v":""},{"$f":"IF(COUNTBLANK(E49:E50)=2,\"\",E49-E50)","v":""},{"$f":"IF(COUNTBLANK(F49:F50)=2,\"\",F49-F50)","v":""},{"$f":"IF(COUNTBLANK(G49:G50)=2,\"\",G49-G50)","v":""},null,{"$f":"IF(COUNTBLANK(I49:I50)=2,\"\",I49-I50)","v":""},{"$f":"IF(COUNTBLANK(J49:J50)=2,\"\",J49-J50)","v":""},{"$f":"IF(COUNTBLANK(K49:K50)=2,\"\",K49-K50)","v":""},{"$f":"IF(COUNTBLANK(L49:L50)=2,\"\",L49-L50)","v":""},null,{"$f":"IF(COUNTBLANK(N49:N50)=2,\"\",N49-N50)","v":""},{"$f":"IF(COUNTBLANK(O49:O50)=2,\"\",O49-O50)","v":""},{"$f":"IF(COUNTBLANK(P49:P50)=2,\"\",P49-P50)","v":""},{"$f":"IF(COUNTBLANK(Q49:Q50)=2,\"\",Q49-Q50)","v":""}]
[null,"Percent Water on Total , (%):",null,{"$f":"IF(ISERROR((D53/D52)*100),\"\",(D53/D52)*100)","v":""},{"$f":"IF(ISERROR((E53/E52)*100),\"\",(E53/E52)*100)","v":""},{"$f":"IF(ISERROR((F53/F52)*100),\"\",(F53/F52)*100)","v":""},{"$f":"IF(ISERROR((G53/G52)*100),\"\",(G53/G52)*100)","v":""},null,{"$f":"IF(ISERROR((I53/I52)*100),\"\",(I53/I52)*100)","v":""},{"$f":"IF(ISERROR((J53/J52)*100),\"\",(J53/J52)*100)","v":""},{"$f":"IF(ISERROR((K53/K52)*100),\"\",(K53/K52)*100)","v":""},{"$f":"IF(ISERROR((L53/L52)*100),\"\",(L53/L52)*100)","v":""},null,{"$f":"IF(ISERROR((N53/N52)*100),\"\",(N53/N52)*100)","v":""},{"$f":"IF(ISERROR((O53/O52)*100),\"\",(O53/O52)*100)","v":""},{"$f":"IF(ISERROR((P53/P52)*100),\"\",(P53/P52)*100)","v":""},{"$f":"IF(ISERROR((Q53/Q52)*100),\"\",(Q53/Q52)*100)","v":""}]
[null,"Dry Density, (pcf):",null,{"$f":"IF(ISERROR(D48/(1+(D54/100))),\"\",D48/(1+(D54/100)))","v":""},{"$f":"IF(ISERROR(E48/(1+(E54/100))),\"\",E48/(1+(E54/100)))","v":""},{"$f":"IF(ISERROR(F48/(1+(F54/100))),\"\",F48/(1+(F54/100)))","v":""},{"$f":"IF(ISERROR(G48/(1+(G54/100))),\"\",G48/(1+(G54/100)))","v":""},null,{"$f":"IF(ISERROR(I48/(1+(I54/100))),\"\",I48/(1+(I54/100)))","v":""},{"$f":"IF(ISERROR(J48/(1+(J54/100))),\"\",J48/(1+(J54/100)))","v":""},{"$f":"IF(ISERROR(K48/(1+(K54/100))),\"\",K48/(1+(K54/100)))","v":""},{"$f":"IF(ISERROR(L48/(1+(L54/100))),\"\",L48/(1+(L54/100)))","v":""},null,{"$f":"IF(ISERROR(N48/(1+(N54/100))),\"\",N48/(1+(N54/100)))","v":""},{"$f":"IF(ISERROR(O48/(1+(O54/100))),\"\",O48/(1+(O54/100)))","v":""},{"$f":"IF(ISERROR(P48/(1+(P54/100))),\"\",P48/(1+(P54/100)))","v":""},{"$f":"IF(ISERROR(Q48/(1+(Q54/100))),\"\",Q48/(1+(Q54/100)))","v":""}]
[null,"Estimated Dry Density, (pcf):",null,{"$f":"IF(ISERROR(D48/(1+(D33/100))),\"\",D48/(1+(D33/100)))","v":""},{"$f":"IF(ISERROR(E48/(1+(E33/100))),\"\",E48/(1+(E33/100)))","v":""},{"$f":"IF(ISERROR(F48/(1+(F33/100))),\"\",F48/(1+(F33/100)))","v":""},{"$f":"IF(ISERROR(G48/(1+(G33/100))),\"\",G48/(1+(G33/100)))","v":""},null,{"$f":"IF(ISERROR(I48/(1+(I33/100))),\"\",I48/(1+(I33/100)))","v":""},{"$f":"IF(ISERROR(J48/(1+(J33/100))),\"\",J48/(1+(J33/100)))","v":""},{"$f":"IF(ISERROR(K48/(1+(K33/100))),\"\",K48/(1+(K33/100)))","v":""},{"$f":"IF(ISERROR(L48/(1+(L33/100))),\"\",L48/(1+(L33/100)))","v":""},null,{"$f":"IF(ISERROR(N48/(1+(N33/100))),\"\",N48/(1+(N33/100)))","v":""},{"$f":"IF(ISERROR(O48/(1+(O33/100))),\"\",O48/(1+(O33/100)))","v":""},{"$f":"IF(ISERROR(P48/(1+(P33/100))),\"\",P48/(1+(P33/100)))","v":""},{"$f":"IF(ISERROR(Q48/(1+(Q33/100))),\"\",Q48/(1+(Q33/100)))","v":""}]
[]
[null,"Max Dry Density, (pcf):",null,{"$f":"IF(ISERROR(IF(AND(D23>0,D24>0),Reference!C6,IF(G53>0,Reference!C6,\"Need SG\"))),\"\",IF(AND(D23>0,D24>0),Reference!C6,IF(G53>0,Reference!C6,\"Need SG\")))","v":""},null,null,null,null,{"$f":"IF(ISERROR(IF(AND(D23>0,D24>0),Reference!E6,IF(L53>0,Reference!E6,\"Need SG\"))),\"\",IF(AND(D23>0,D24>0),Reference!E6,IF(L53>0,Reference!E6,\"Need SG\")))","v":""},null,null,null,null,{"$f":"IF(ISERROR(IF(AND(D23>0,D24>0),Reference!G6,IF(Q53>0,Reference!G6,\"Need SG\"))),\"\",IF(AND(D23>0,D24>0),Reference!G6,IF(Q53>0,Reference!G6,\"Need SG\")))","v":""}]
[null,"Optimum Moisture Content, (%):",null,{"$f":"IF(ISERROR(Reference!C7),\"\",Reference!C7)","v":""},null,null,null,null,{"$f":"IF(ISERROR(Reference!E7),\"\",Reference!E7)","v":""},null,null,null,null,{"$f":"IF(ISERROR(Reference!G7),\"\",Reference!G7)","v":""}]
[null,"M-D Graph R2 Value:",null,{"$f":"IF(ISERROR(Reference!C8),\"\",Reference!C8)","v":""},null,null,null,null,{"$f":"IF(ISERROR(Reference!E8),\"\",Reference!E8)","v":""},null,null,null,null,{"$f":"IF(ISERROR(Reference!G8),\"\",Reference!G8)","v":""}]
[]
[null,"Remarks:"]
[]
[]
[]
[]
[null,"Sample Method:","Sampled By:",null,null,"Sampled Date:"]
[null,"TX407"," ",null,null," "]
[null,"Test Method:","Tested By:",null,null,"Tested Date:"]
[null,"ASTM D1557"," ",null,null," "]

{"sheet":"Optimum Cement Content Graph","index":3,"n_rows":33,"n_cols":10,"rows_kept":33,"cut":false,"hidden":false,"merged":[[32,6,32,8],[31,6,31,8],[31,1,31,3],[32,1,32,3],[30,1,30,4],[30,6,30,9]]}
[]
[]
[]
[]
[]
[]
[]
[]
[]
[]
[]
[]
[]
[]
[]
[]
[]
[]
[]
[]
[]
[]
[]
[]
[]
[]
[]
[]
[]
[]
[null,"Best-Fit Coefficients",null,null,null,null,"Optimum Cement Values"]
[null,"Slope, m =",null,null,{"$f":"IF(ISERROR(ROUND(SLOPE('RCC Data'!$L$71:$L$79,'RCC Data'!$H$71:$H$79),1)),\"\",ROUND(SLOPE('RCC Data'!$L$71:$L$79,'RCC Data'!$H$71:$H$79),1))","v":""},null,"Target Strength (psi):",null,null,4400]
[null,"Intercept, b =",null,null,{"$f":"IF(ISERROR(ROUND(INTERCEPT('RCC Data'!$L$71:$L$79,'RCC Data'!$H$71:$H$79),1)),\"\",ROUND(INTERCEPT('RCC Data'!$L$71:$L$79,'RCC Data'!$H$71:$H$79),1))","v":""},null,"Optimum Cement Content (%):",null,null,{"$f":"IF($E$32=\"\",\"\",(($J$32)-($E$33))/$E$32)","v":""}]

{"sheet":"RX","index":4,"n_rows":388,"n_cols":9,"rows_kept":388,"cut":false,"hidden":true,"merged":[]}
[386]
["Fld_nbr","Value","Desc_1","Desc_2","Desc_3","Desc_4","Desc_5","Desc_6","Desc_7"]
[1,{"$f":"IF('RCC Data'!$B$83=\"\",\"\",'RCC Data'!$B$83)","v":""},{"$f":"'RCC Data'!$B$82","v":"Remarks:"}]
[2,{"$f":"IF('RCC Data'!$E$19=\"\",\"\",'RCC Data'!$E$19)","v":""},{"$f":"IF('RCC Data'!$D$19=\"\",\"\",'RCC Data'!$D$19)","v":""}]
[3,{"$f":"IF('RCC Data'!$C$90=\"\",\"\",'RCC Data'!$C$90)","v":" "},"Tested By ",{"$f":"IF('RCC Data'!$B$90=\"\",\"\",'RCC Data'!$B$90)","v":"TX418"}]
[4,{"$f":"IF('RCC Data'!$F$90=\"\",\"\",'RCC Data'!$F$90)","v":" "},"Tested Date ",{"$f":"IF('RCC Data'!$B$90=\"\",\"\",'RCC Data'!$B$90)","v":"TX418"}]
[5,{"$f":"IF('ASTM 1557'!$C$70=\"\",\"\",'ASTM 1557'!$C$70)","v":" "},"Tested By ",{"$f":"IF('ASTM 1557'!$B$70=\"\",\"\",'ASTM 1557'!$B$70)","v":"ASTM D1557"}]
[6,{"$f":"IF('ASTM 1557'!$F$70=\"\",\"\",'ASTM 1557'!$F$70)","v":" "},"Tested Date ",{"$f":"IF('ASTM 1557'!$B$70=\"\",\"\",'ASTM 1557'!$B$70)","v":"ASTM D1557"}]
[7,{"$f":"IF('RCC Data'!$F$24=\"\",\"\",'RCC Data'!$F$24)","v":""},{"$f":"IF( 'RCC Data'!$B$5=\"\",\"\", 'RCC Data'!$B$5)","v":"Roller Compacted Concrete Worksheet"},{"$f":"IF('RCC Data'!$C$24=\"\",\"\",'RCC Data'!$C$24)","v":"Select RCC Application: "}]
[8,{"$f":"IF('RCC Data'!$E$29=\"\",\"\",'RCC Data'!$E$29)","v":""},{"$f":"IF( 'RCC Data'!$C$26=\"\",\"\", 'RCC Data'!$C$26)","v":"RCC Combined Aggregate Gradation for "},{"$f":"IF('RCC Data'!$E$27=\"\",\"\",'RCC Data'!$E$27)","v":"Percent Passing by Weight"},{"$f":"IF('RCC Data'!$E$28=\"\",\"\",'RCC Data'!$E$28)","v":"Minimum\nSpec Limit"},{"$f":"IF('RCC Data'!$C$27=\"\",\"\",'RCC Data'!$C$27)","v":"Sieve Size"},{"$f":"IF('RCC Data'!$C$29=\"\",\"\",'RCC Data'!$C$29)","v":"1 in"}]
[9,{"$f":"IF('RCC Data'!$E$30=\"\",\"\",'RCC Data'!$E$30)","v":""},{"$f":"IF( 'RCC Data'!$C$26=\"\",\"\", 'RCC Data'!$C$26)","v":"RCC Combined Aggregate Gradation for "},{"$f":"IF('RCC Data'!$E$27=\"\",\"\",'RCC Data'!$E$27)","v":"Percent Passing by Weight"},{"$f":"IF('RCC Data'!$E$28=\"\",\"\",'RCC Data'!$E$28)","v":"Minimum\nSpec Limit"},{"$f":"IF('RCC Data'!$C$27=\"\",\"\",'RCC Data'!$C$27)","v":"Sieve Size"},{"$f":"IF('RCC Data'!$C$30=\"\",\"\",'RCC Data'!$C$30)","v":"3/4 in"}]
[10,{"$f":"IF('RCC Data'!$E$31=\"\",\"\",'RCC Data'!$E$31)","v":""},{"$f":"IF( 'RCC Data'!$C$26=\"\",\"\", 'RCC Data'!$C$26)","v":"RCC Combined Aggregate Gradation for "},{"$f":"IF('RCC Data'!$E$27=\"\",\"\",'RCC Data'!$E$27)","v":"Percent Passing by Weight"},{"$f":"IF('RCC Data'!$E$28=\"\",\"\",'RCC Data'!$E$28)","v":"Minimum\nSpec Limit"},{"$f":"IF('RCC Data'!$C$27=\"\",\"\",'RCC Data'!$C$27)","v":"Sieve Size"},{"$f":"IF('RCC Data'!$C$31=\"\",\"\",'RCC Data'!$C$31)","v":"1/2 in"}]
[11,{"$f":"IF('RCC Data'!$E$32=\"\",\"\",'RCC Data'!$E$32)","v":""},{"$f":"IF( 'RCC Data'!$C$26=\"\",\"\", 'RCC Data'!$C$26)","v":"RCC Combined Aggregate Gradation for "},{"$f":"IF('RCC Data'!$E$27=\"\",\"\",'RCC Data'!$E$27)","v":"Percent Passing by Weight"},{"$f":"IF('RCC Data'!$E$28=\"\",\"\",'RCC Data'!$E$28)","v":"Minimum\nSpec Limit"},{"$f":"IF('RCC Data'!$C$27=\"\",\"\",'RCC Data'!$C$27)","v":"Sieve Size"},{"$f":"IF('RCC Data'!$C$32=\"\",\"\",'RCC Data'!$C$32)","v":"3/8 in"}]
[12,{"$f":"IF('RCC Data'!$E$33=\"\",\"\",'RCC Data'!$E$33)","v":""},{"$f":"IF( 'RCC Data'!$C$26=\"\",\"\", 'RCC Data'!$C$26)","v":"RCC Combined Aggregate Gradation for "},{"$f":"IF('RCC Data'!$E$27=\"\",\"\",'RCC Data'!$E$27)","v":"Percent Passing by Weight"},{"$f":"IF('RCC Data'!$E$28=\"\",\"\",'RCC Data'!$E$28)","v":"Minimum\nSpec Limit"},{"$f":"IF('RCC Data'!$C$27=\"\",\"\",'RCC Data'!$C$27)","v":"Sieve Size"},{"$f":"IF('RCC Data'!$C$33=\"\",\"\",'RCC Data'!$C$33)","v":"No. 4"}]
[13,{"$f":"IF('RCC Data'!$E$34=\"\",\"\",'RCC Data'!$E$34)","v":""},{"$f":"IF( 'RCC Data'!$C$26=\"\",\"\", 'RCC Data'!$C$26)","v":"RCC Combined Aggregate Gradation for "},{"$f":"IF('RCC Data'!$E$27=\"\",\"\",'RCC Data'!$E$27)","v":"Percent Passing by Weight"},{"$f":"IF('RCC Data'!$E$28=\"\",\"\",'RCC Data'!$E$28)","v":"Minimum\nSpec Limit"},{"$f":"IF('RCC Data'!$C$27=\"\",\"\",'RCC Data'!$C$27)","v":"Sieve Size"},{"$f":"IF('RCC Data'!$C$34=\"\",\"\",'RCC Data'!$C$34)","v":"No. 16"}]
[14,{"$f":"IF('RCC Data'!$E$35=\"\",\"\",'RCC Data'!$E$35)","v":""},{"$f":"IF( 'RCC Data'!$C$26=\"\",\"\", 'RCC Data'!$C$26)","v":"RCC Combined Aggregate Gradation for "},{"$f":"IF('RCC Data'!$E$27=\"\",\"\",'RCC Data'!$E$27)","v":"Percent Passing by Weight"},{"$f":"IF('RCC Data'!$E$28=\"\",\"\",'RCC Data'!$E$28)","v":"Minimum\nSpec Limit"},{"$f":"IF('RCC Data'!$C$27=\"\",\"\",'RCC Data'!$C$27)","v":"Sieve Size"},{"$f":"IF('RCC Data'!$C$35=\"\",\"\",'RCC Data'!$C$35)","v":"No. 100"}]
[15,{"$f":"IF('RCC Data'!$E$36=\"\",\"\",'RCC Data'!$E$36)","v":""},{"$f":"IF( 'RCC Data'!$C$26=\"\",\"\", 'RCC Data'!$C$26)","v":"RCC Combined Aggregate Gradation for "},{"$f":"IF('RCC Data'!$E$27=\"\",\"\",'RCC Data'!$E$27)","v":"Percent Passing by Weight"},{"$f":"IF('RCC Data'!$E$28=\"\",\"\",'RCC Data'!$E$28)","v":"Minimum\nSpec Limit"},{"$f":"IF('RCC Data'!$C$27=\"\",\"\",'RCC Data'!$C$27)","v":"Sieve Size"},{"$f":"IF('RCC Data'!$C$36=\"\",\"\",'RCC Data'!$C$36)","v":"No. 200"}]
[16,{"$f":"IF('RCC Data'!$G$29=\"\",\"\",'RCC Data'!$G$29)","v":""},{"$f":"IF( 'RCC Data'!$C$26=\"\",\"\", 'RCC Data'!$C$26)","v":"RCC Combined Aggregate Gradation for "},{"$f":"IF('RCC Data'!$E$27=\"\",\"\",'RCC Data'!$E$27)","v":"Percent Passing by Weight"},{"$f":"IF('RCC Data'!$G$28=\"\",\"\",'RCC Data'!$G$28)","v":"Maximum\nSpec Limit"},{"$f":"IF('RCC Data'!$C$27=\"\",\"\",'RCC Data'!$C$27)","v":"Sieve Size"},{"$f":"IF('RCC Data'!$C$29=\"\",\"\",'RCC Data'!$C$29)","v":"1 in"}]
[17,{"$f":"IF('RCC Data'!$G$30=\"\",\"\",'RCC Data'!$G$30)","v":""},{"$f":"IF( 'RCC Data'!$C$26=\"\",\"\", 'RCC Data'!$C$26)","v":"RCC Combined Aggregate Gradation for "},{"$f":"IF('RCC Data'!$E$27=\"\",\"\",'RCC Data'!$E$27)","v":"Percent Passing by Weight"},{"$f":"IF('RCC Data'!$G$28=\"\",\"\",'RCC Data'!$G$28)","v":"Maximum\nSpec Limit"},{"$f":"IF('RCC Data'!$C$27=\"\",\"\",'RCC Data'!$C$27)","v":"Sieve Size"},{"$f":"IF('RCC Data'!$C$30=\"\",\"\",'RCC Data'!$C$30)","v":"3/4 in"}]
[18,{"$f":"IF('RCC Data'!$G$31=\"\",\"\",'RCC Data'!$G$31)","v":""},{"$f":"IF( 'RCC Data'!$C$26=\"\",\"\", 'RCC Data'!$C$26)","v":"RCC Combined Aggregate Gradation for "},{"$f":"IF('RCC Data'!$E$27=\"\",\"\",'RCC Data'!$E$27)","v":"Percent Passing by Weight"},{"$f":"IF('RCC Data'!$G$28=\"\",\"\",'RCC Data'!$G$28)","v":"Maximum\nSpec Limit"},{"$f":"IF('RCC Data'!$C$27=\"\",\"\",'RCC Data'!$C$27)","v":"Sieve Size"},{"$f":"IF('RCC Data'!$C$31=\"\",\"\",'RCC Data'!$C$31)","v":"1/2 in"}]
[19,{"$f":"IF('RCC Data'!$G$32=\"\",\"\",'RCC Data'!$G$32)","v":""},{"$f":"IF( 'RCC Data'!$C$26=\"\",\"\", 'RCC Data'!$C$26)","v":"RCC Combined Aggregate Gradation for "},{"$f":"IF('RCC Data'!$E$27=\"\",\"\",'RCC Data'!$E$27)","v":"Percent Passing by Weight"},{"$f":"IF('RCC Data'!$G$28=\"\",\"\",'RCC Data'!$G$28)","v":"Maximum\nSpec Limit"},{"$f":"IF('RCC Data'!$C$27=\"\",\"\",'RCC Data'!$C$27)","v":"Sieve Size"},{"$f":"IF('RCC Data'!$C$32=\"\",\"\",'RCC Data'!$C$32)","v":"3/8 in"}]
[20,{"$f":"IF('RCC Data'!$G$33=\"\",\"\",'RCC Data'!$G$33)","v":""},{"$f":"IF( 'RCC Data'!$C$26=\"\",\"\", 'RCC Data'!$C$26)","v":"RCC Combined Aggregate Gradation for "},{"$f":"IF('RCC Data'!$E$27=\"\",\"\",'RCC Data'!$E$27)","v":"Percent Passing by Weight"},{"$f":"IF('RCC Data'!$G$28=\"\",\"\",'RCC Data'!$G$28)","v":"Maximum\nSpec Limit"},{"$f":"IF('RCC Data'!$C$27=\"\",\"\",'RCC Data'!$C$27)","v":"Sieve Size"},{"$f":"IF('RCC Data'!$C$33=\"\",\"\",'RCC Data'!$C$33)","v":"No. 4"}]
[21,{"$f":"IF('RCC Data'!$G$34=\"\",\"\",'RCC Data'!$G$34)","v":""},{"$f":"IF( 'RCC Data'!$C$26=\"\",\"\", 'RCC Data'!$C$26)","v":"RCC Combined Aggregate Gradation for "},{"$f":"IF('RCC Data'!$E$27=\"\",\"\",'RCC Data'!$E$27)","v":"Percent Passing by Weight"},{"$f":"IF('RCC Data'!$G$28=\"\",\"\",'RCC Data'!$G$28)","v":"Maximum\nSpec Limit"},{"$f":"IF('RCC Data'!$C$27=\"\",\"\",'RCC Data'!$C$27)","v":"Sieve Size"},{"$f":"IF('RCC Data'!$C$34=\"\",\"\",'RCC Data'!$C$34)","v":"No. 16"}]
[22,{"$f":"IF('RCC Data'!$G$35=\"\",\"\",'RCC Data'!$G$35)","v":""},{"$f":"IF( 'RCC Data'!$C$26=\"\",\"\", 'RCC Data'!$C$26)","v":"RCC Combined Aggregate Gradation for "},{"$f":"IF('RCC Data'!$E$27=\"\",\"\",'RCC Data'!$E$27)","v":"Percent Passing by Weight"},{"$f":"IF('RCC Data'!$G$28=\"\",\"\",'RCC Data'!$G$28)","v":"Maximum\nSpec Limit"},{"$f":"IF('RCC Data'!$C$27=\"\",\"\",'RCC Data'!$C$27)","v":"Sieve Size"},{"$f":"IF('RCC Data'!$C$35=\"\",\"\",'RCC Data'!$C$35)","v":"No. 100"}]
[23,{"$f":"IF('RCC Data'!$G$36=\"\",\"\",'RCC Data'!$G$36)","v":""},{"$f":"IF( 'RCC Data'!$C$26=\"\",\"\", 'RCC Data'!$C$26)","v":"RCC Combined Aggregate Gradation for "},{"$f":"IF('RCC Data'!$E$27=\"\",\"\",'RCC Data'!$E$27)","v":"Percent Passing by Weight"},{"$f":"IF('RCC Data'!$G$28=\"\",\"\",'RCC Data'!$G$28)","v":"Maximum\nSpec Limit"},{"$f":"IF('RCC Data'!$C$27=\"\",\"\",'RCC Data'!$C$27)","v":"Sieve Size"},{"$f":"IF('RCC Data'!$C$36=\"\",\"\",'RCC Data'!$C$36)","v":"No. 200"}]
[24,{"$f":"IF('RCC Data'!$I$29=\"\",\"\",'RCC Data'!$I$29)","v":""},{"$f":"IF( 'RCC Data'!$C$26=\"\",\"\", 'RCC Data'!$C$26)","v":"RCC Combined Aggregate Gradation for "},{"$f":"IF('RCC Data'!$I$27=\"\",\"\",'RCC Data'!$I$27)","v":"Actual Gradation - Percent Passing by Weight"},{"$f":"IF('RCC Data'!$C$27=\"\",\"\",'RCC Data'!$C$27)","v":"Sieve Size"},{"$f":"IF('RCC Data'!$C$29=\"\",\"\",'RCC Data'!$C$29)","v":"1 in"}]
[25,{"$f":"IF('RCC Data'!$I$30=\"\",\"\",'RCC Data'!$I$30)","v":""},{"$f":"IF( 'RCC Data'!$C$26=\"\",\"\", 'RCC Data'!$C$26)","v":"RCC Combined Aggregate Gradation for "},{"$f":"IF('RCC Data'!$I$27=\"\",\"\",'RCC Data'!$I$27)","v":"Actual Gradation - Percent Passing by Weight"},{"$f":"IF('RCC Data'!$C$27=\"\",\"\",'RCC Data'!$C$27)","v":"Sieve Size"},{"$f":"IF('RCC Data'!$C$30=\"\",\"\",'RCC Data'!$C$30)","v":"3/4 in"}]
[26,{"$f":"IF('RCC Data'!$I$31=\"\",\"\",'RCC Data'!$I$31)","v":""},{"$f":"IF( 'RCC Data'!$C$26=\"\",\"\", 'RCC Data'!$C$26)","v":"RCC Combined Aggregate Gradation for "},{"$f":"IF('RCC Data'!$I$27=\"\",\"\",'RCC Data'!$I$27)","v":"Actual Gradation - Percent Passing by Weight"},{"$f":"IF('RCC Data'!$C$27=\"\",\"\",'RCC Data'!$C$27)","v":"Sieve Size"},{"$f":"IF('RCC Data'!$C$31=\"\",\"\",'RCC Data'!$C$31)","v":"1/2 in"}]
[27,{"$f":"IF('RCC Data'!$I$32=\"\",\"\",'RCC Data'!$I$32)","v":""},{"$f":"IF( 'RCC Data'!$C$26=\"\",\"\", 'RCC Data'!$C$26)","v":"RCC Combined Aggregate Gradation for "},{"$f":"IF('RCC Data'!$I$27=\"\",\"\",'RCC Data'!$I$27)","v":"Actual Gradation - Percent Passing by Weight"},{"$f":"IF('RCC Data'!$C$27=\"\",\"\",'RCC Data'!$C$27)","v":"Sieve Size"},{"$f":"IF('RCC Data'!$C$32=\"\",\"\",'RCC Data'!$C$32)","v":"3/8 in"}]
[28,{"$f":"IF('RCC Data'!$I$33=\"\",\"\",'RCC Data'!$I$33)","v":""},{"$f":"IF( 'RCC Data'!$C$26=\"\",\"\", 'RCC Data'!$C$26)","v":"RCC Combined Aggregate Gradation for "},{"$f":"IF('RCC Data'!$I$27=\"\",\"\",'RCC Data'!$I$27)","v":"Actual Gradation - Percent Passing by Weight"},{"$f":"IF('RCC Data'!$C$27=\"\",\"\",'RCC Data'!$C$27)","v":"Sieve Size"},{"$f":"IF('RCC Data'!$C$33=\"\",\"\",'RCC Data'!$C$33)","v":"No. 4"}]
[29,{"$f":"IF('RCC Data'!$I$34=\"\",\"\",'RCC Data'!$I$34)","v":""},{"$f":"IF( 'RCC Data'!$C$26=\"\",\"\", 'RCC Data'!$C$26)","v":"RCC Combined Aggregate Gradation for "},{"$f":"IF('RCC Data'!$I$27=\"\",\"\",'RCC Data'!$I$27)","v":"Actual Gradation - Percent Passing by Weight"},{"$f":"IF('RCC Data'!$C$27=\"\",\"\",'RCC Data'!$C$27)","v":"Sieve Size"},{"$f":"IF('RCC Data'!$C$34=\"\",\"\",'RCC Data'!$C$34)","v":"No. 16"}]
[30,{"$f":"IF('RCC Data'!$I$35=\"\",\"\",'RCC Data'!$I$35)","v":""},{"$f":"IF( 'RCC Data'!$C$26=\"\",\"\", 'RCC Data'!$C$26)","v":"RCC Combined Aggregate Gradation for "},{"$f":"IF('RCC Data'!$I$27=\"\",\"\",'RCC Data'!$I$27)","v":"Actual Gradation - Percent Passing by Weight"},{"$f":"IF('RCC Data'!$C$27=\"\",\"\",'RCC Data'!$C$27)","v":"Sieve Size"},{"$f":"IF('RCC Data'!$C$35=\"\",\"\",'RCC Data'!$C$35)","v":"No. 100"}]
[31,{"$f":"IF('RCC Data'!$I$36=\"\",\"\",'RCC Data'!$I$36)","v":""},{"$f":"IF( 'RCC Data'!$C$26=\"\",\"\", 'RCC Data'!$C$26)","v":"RCC Combined Aggregate Gradation for "},{"$f":"IF('RCC Data'!$I$27=\"\",\"\",'RCC Data'!$I$27)","v":"Actual Gradation - Percent Passing by Weight"},{"$f":"IF('RCC Data'!$C$27=\"\",\"\",'RCC Data'!$C$27)","v":"Sieve Size"},{"$f":"IF('RCC Data'!$C$36=\"\",\"\",'RCC Data'!$C$36)","v":"No. 200"}]
[32,{"$f":"IF('RCC Data'!$K$29=\"\",\"\",'RCC Data'!$K$29)","v":""},{"$f":"IF( 'RCC Data'!$C$26=\"\",\"\", 'RCC Data'!$C$26)","v":"RCC Combined Aggregate Gradation for "},{"$f":"IF('RCC Data'!$K$27=\"\",\"\",'RCC Data'!$K$27)","v":"Within Master Grading"},{"$f":"IF('RCC Data'!$C$27=\"\",\"\",'RCC Data'!$C$27)","v":"Sieve Size"},{"$f":"IF('RCC Data'!$C$29=\"\",\"\",'RCC Data'!$C$29)","v":"1 in"}]
[33,{"$f":"IF('RCC Data'!$K$30=\"\",\"\",'RCC Data'!$K$30)","v":""},{"$f":"IF( 'RCC Data'!$C$26=\"\",\"\", 'RCC Data'!$C$26)","v":"RCC Combined Aggregate Gradation for "},{"$f":"IF('RCC Data'!$K$27=\"\",\"\",'RCC Data'!$K$27)","v":"Within Master Grading"},{"$f":"IF('RCC Data'!$C$27=\"\",\"\",'RCC Data'!$C$27)","v":"Sieve Size"},{"$f":"IF('RCC Data'!$C$30=\"\",\"\",'RCC Data'!$C$30)","v":"3/4 in"}]
[34,{"$f":"IF('RCC Data'!$K$31=\"\",\"\",'RCC Data'!$K$31)","v":""},{"$f":"IF( 'RCC Data'!$C$26=\"\",\"\", 'RCC Data'!$C$26)","v":"RCC Combined Aggregate Gradation for "},{"$f":"IF('RCC Data'!$K$27=\"\",\"\",'RCC Data'!$K$27)","v":"Within Master Grading"},{"$f":"IF('RCC Data'!$C$27=\"\",\"\",'RCC Data'!$C$27)","v":"Sieve Size"},{"$f":"IF('RCC Data'!$C$31=\"\",\"\",'RCC Data'!$C$31)","v":"1/2 in"}]
[35,{"$f":"IF('RCC Data'!$K$32=\"\",\"\",'RCC Data'!$K$32)","v":""},{"$f":"IF( 'RCC Data'!$C$26=\"\",\"\", 'RCC Data'!$C$26)","v":"RCC Combined Aggregate Gradation for "},{"$f":"IF('RCC Data'!$K$27=\"\",\"\",'RCC Data'!$K$27)","v":"Within Master Grading"},{"$f":"IF('RCC Data'!$C$27=\"\",\"\",'RCC Data'!$C$27)","v":"Sieve Size"},{"$f":"IF('RCC Data'!$C$32=\"\",\"\",'RCC Data'!$C$32)","v":"3/8 in"}]
[36,{"$f":"IF('RCC Data'!$K$33=\"\",\"\",'RCC Data'!$K$33)","v":""},{"$f":"IF( 'RCC Data'!$C$26=\"\",\"\", 'RCC Data'!$C$26)","v":"RCC Combined Aggregate Gradation for "},{"$f":"IF('RCC Data'!$K$27=\"\",\"\",'RCC Data'!$K$27)","v":"Within Master Grading"},{"$f":"IF('RCC Data'!$C$27=\"\",\"\",'RCC Data'!$C$27)","v":"Sieve Size"},{"$f":"IF('RCC Data'!$C$33=\"\",\"\",'RCC Data'!$C$33)","v":"No. 4"}]
[37,{"$f":"IF('RCC Data'!$K$34=\"\",\"\",'RCC Data'!$K$34)","v":""},{"$f":"IF( 'RCC Data'!$C$26=\"\",\"\", 'RCC Data'!$C$26)","v":"RCC Combined Aggregate Gradation for "},{"$f":"IF('RCC Data'!$K$27=\"\",\"\",'RCC Data'!$K$27)","v":"Within Master Grading"},{"$f":"IF('RCC Data'!$C$27=\"\",\"\",'RCC Data'!$C$27)","v":"Sieve Size"},{"$f":"IF('RCC Data'!$C$34=\"\",\"\",'RCC Data'!$C$34)","v":"No. 16"}]
[38,{"$f":"IF('RCC Data'!$K$35=\"\",\"\",'RCC Data'!$K$35)","v":""},{"$f":"IF( 'RCC Data'!$C$26=\"\",\"\", 'RCC Data'!$C$26)","v":"RCC Combined Aggregate Gradation for "},{"$f":"IF('RCC Data'!$K$27=\"\",\"\",'RCC Data'!$K$27)","v":"Within Master Grading"},{"$f":"IF('RCC Data'!$C$27=\"\",\"\",'RCC Data'!$C$27)","v":"Sieve Size"},{"$f":"IF('RCC Data'!$C$35=\"\",\"\",'RCC Data'!$C$35)","v":"No. 100"}]
[39,{"$f":"IF('RCC Data'!$K$36=\"\",\"\",'RCC Data'!$K$36)","v":""},{"$f":"IF( 'RCC Data'!$C$26=\"\",\"\", 'RCC Data'!$C$26)","v":"RCC Combined Aggregate Gradation for "},{"$f":"IF('RCC Data'!$K$27=\"\",\"\",'RCC Data'!$K$27)","v":"Within Master Grading"},{"$f":"IF('RCC Data'!$C$27=\"\",\"\",'RCC Data'!$C$27)","v":"Sieve Size"},{"$f":"IF('RCC Data'!$C$36=\"\",\"\",'RCC Data'!$C$36)","v":"No. 200"}]
[40,{"$f":"IF('RCC Data'!$F$42=\"\",\"\",'RCC Data'!$F$42)","v":""},{"$f":"IF( 'RCC Data'!$C$41=\"\",\"\", 'RCC Data'!$C$41)","v":"Estimated Cementitious Content"},{"$f":"IF('RCC Data'!$C$42=\"\",\"\",'RCC Data'!$C$42)","v":"Optimum (A):"}]
[41,{"$f":"IF('RCC Data'!$F$43=\"\",\"\",'RCC Data'!$F$43)","v":""},{"$f":"IF( 'RCC Data'!$C$41=\"\",\"\", 'RCC Data'!$C$41)","v":"Estimated Cementitious Content"},{"$f":"IF('RCC Data'!$C$43=\"\",\"\",'RCC Data'!$C$43)","v":"Below Optimum (B):"}]
[42,{"$f":"IF('RCC Data'!$F$44=\"\",\"\",'RCC Data'!$F$44)","v":""},{"$f":"IF( 'RCC Data'!$C$41=\"\",\"\", 'RCC Data'!$C$41)","v":"Estimated Cementitious Content"},{"$f":"IF('RCC Data'!$C$44=\"\",\"\",'RCC Data'!$C$44)","v":"Above Optimum (C):"}]
[43,{"$f":"IF('RCC Data'!$F$50=\"\",\"\",'RCC Data'!$F$50)","v":""},{"$f":"IF( 'RCC Data'!$C$49=\"\",\"\", 'RCC Data'!$C$49)","v":"Moisture-Denisty Curve Label"},{"$f":"IF('RCC Data'!$F$49=\"\",\"\",'RCC Data'!$F$49)","v":"Cementitious Content"},{"$f":"IF('RCC Data'!$C$50=\"\",\"\",'RCC Data'!$C$50)","v":"Optimum (A):"}]
[44,{"$f":"IF('RCC Data'!$F$51=\"\",\"\",'RCC Data'!$F$51)","v":""},{"$f":"IF( 'RCC Data'!$C$49=\"\",\"\", 'RCC Data'!$C$49)","v":"Moisture-Denisty Curve Label"},{"$f":"IF('RCC Data'!$F$49=\"\",\"\",'RCC Data'!$F$49)","v":"Cementitious Content"},{"$f":"IF('RCC Data'!$C$51=\"\",\"\",'RCC Data'!$C$51)","v":"Below Optimum (B):"}]
[45,{"$f":"IF('RCC Data'!$F$52=\"\",\"\",'RCC Data'!$F$52)","v":""},{"$f":"IF( 'RCC Data'!$C$49=\"\",\"\", 'RCC Data'!$C$49)","v":"Moisture-Denisty Curve Label"},{"$f":"IF('RCC Data'!$F$49=\"\",\"\",'RCC Data'!$F$49)","v":"Cementitious Content"},{"$f":"IF('RCC Data'!$C$52=\"\",\"\",'RCC Data'!$C$52)","v":"Above Optimum (C):"}]
[46,{"$f":"IF('RCC Data'!$H$50=\"\",\"\",'RCC Data'!$H$50)","v":6.2},{"$f":"IF( 'RCC Data'!$C$49=\"\",\"\", 'RCC Data'!$C$49)","v":"Moisture-Denisty Curve Label"},{"$f":"IF('RCC Data'!$H$49=\"\",\"\",'RCC Data'!$H$49)","v":"Optimum Moisture Content %"},{"$f":"IF('RCC Data'!$C$50=\"\",\"\",'RCC Data'!$C$50)","v":"Optimum (A):"}]
[47,{"$f":"IF('RCC Data'!$H$51=\"\",\"\",'RCC Data'!$H$51)","v":5.8},{"$f":"IF( 'RCC Data'!$C$49=\"\",\"\", 'RCC Data'!$C$49)","v":"Moisture-Denisty Curve Label"},{"$f":"IF('RCC Data'!$H$49=\"\",\"\",'RCC Data'!$H$49)","v":"Optimum Moisture Content %"},{"$f":"IF('RCC Data'!$C$51=\"\",\"\",'RCC Data'!$C$51)","v":"Below Optimum (B):"}]
[48,{"$f":"IF('RCC Data'!$H$52=\"\",\"\",'RCC Data'!$H$52)","v":6},{"$f":"IF( 'RCC Data'!$C$49=\"\",\"\", 'RCC Data'!$C$49)","v":"Moisture-Denisty Curve Label"},{"$f":"IF('RCC Data'!$H$49=\"\",\"\",'RCC Data'!$H$49)","v":"Optimum Moisture Content %"},{"$f":"IF('RCC Data'!$C$52=\"\",\"\",'RCC Data'!$C$52)","v":"Above Optimum (C):"}]
[49,{"$f":"IF('RCC Data'!$H$58=\"\",\"\",'RCC Data'!$H$58)","v":6.2},{"$f":"IF( 'RCC Data'!$C$57=\"\",\"\", 'RCC Data'!$C$57)","v":"Moisture-Denisty Curve Label"},{"$f":"IF('RCC Data'!$C$58=\"\",\"\",'RCC Data'!$C$58)","v":"Optimum (A):"},{"$f":"IF('RCC Data'!$F$49=\"\",\"\",'RCC Data'!$F$49)","v":"Cementitious Content"},{"$f":"IF('RCC Data'!$F$57=\"\",\"\",'RCC Data'!$F$57)","v":"Sample No."},{"$f":"IF('RCC Data'!$F$58=\"\",\"\",'RCC Data'!$F$58)","v":"A1"}]
[50,{"$f":"IF('RCC Data'!$H$59=\"\",\"\",'RCC Data'!$H$59)","v":6.2},{"$f":"IF( 'RCC Data'!$C$57=\"\",\"\", 'RCC Data'!$C$57)","v":"Moisture-Denisty Curve Label"},{"$f":"IF('RCC Data'!$C$58=\"\",\"\",'RCC Data'!$C$58)","v":"Optimum (A):"},{"$f":"IF('RCC Data'!$F$49=\"\",\"\",'RCC Data'!$F$49)","v":"Cementitious Content"},{"$f":"IF('RCC Data'!$F$57=\"\",\"\",'RCC Data'!$F$57)","v":"Sample No."},{"$f":"IF('RCC Data'!$F$59=\"\",\"\",'RCC Data'!$F$59)","v":"A2"}]
[51,{"$f":"IF('RCC Data'!$H$60=\"\",\"\",'RCC Data'!$H$60)","v":6.2},{"$f":"IF( 'RCC Data'!$C$57=\"\",\"\", 'RCC Data'!$C$57)","v":"Moisture-Denisty Curve Label"},{"$f":"IF('RCC Data'!$C$58=\"\",\"\",'RCC Data'!$C$58)","v":"Optimum (A):"},{"$f":"IF('RCC Data'!$F$49=\"\",\"\",'RCC Data'!$F$49)","v":"Cementitious Content"},{"$f":"IF('RCC Data'!$F$57=\"\",\"\",'RCC Data'!$F$57)","v":"Sample No."},{"$f":"IF('RCC Data'!$F$60=\"\",\"\",'RCC Data'!$F$60)","v":"A3"}]
[52,{"$f":"IF('RCC Data'!$H$61=\"\",\"\",'RCC Data'!$H$61)","v":5.8},{"$f":"IF( 'RCC Data'!$C$57=\"\",\"\", 'RCC Data'!$C$57)","v":"Moisture-Denisty Curve Label"},{"$f":"IF('RCC Data'!$C$61=\"\",\"\",'RCC Data'!$C$61)","v":"Below Optimum (B):"},{"$f":"IF('RCC Data'!$F$49=\"\",\"\",'RCC Data'!$F$49)","v":"Cementitious Content"},{"$f":"IF('RCC Data'!$F$57=\"\",\"\",'RCC Data'!$F$57)","v":"Sample No."},{"$f":"IF('RCC Data'!$F$61=\"\",\"\",'RCC Data'!$F$61)","v":"B1"}]
[53,{"$f":"IF('RCC Data'!$H$62=\"\",\"\",'RCC Data'!$H$62)","v":5.8},{"$f":"IF( 'RCC Data'!$C$57=\"\",\"\", 'RCC Data'!$C$57)","v":"Moisture-Denisty Curve Label"},{"$f":"IF('RCC Data'!$C$61=\"\",\"\",'RCC Data'!$C$61)","v":"Below Optimum (B):"},{"$f":"IF('RCC Data'!$F$49=\"\",\"\",'RCC Data'!$F$49)","v":"Cementitious Content"},{"$f":"IF('RCC Data'!$F$57=\"\",\"\",'RCC Data'!$F$57)","v":"Sample No."},{"$f":"IF('RCC Data'!$F$62=\"\",\"\",'RCC Data'!$F$62)","v":"B2"}]
[54,{"$f":"IF('RCC Data'!$H$63=\"\",\"\",'RCC Data'!$H$63)","v":5.8},{"$f":"IF( 'RCC Data'!$C$57=\"\",\"\", 'RCC Data'!$C$57)","v":"Moisture-Denisty Curve Label"},{"$f":"IF('RCC Data'!$C$61=\"\",\"\",'RCC Data'!$C$61)","v":"Below Optimum (B):"},{"$f":"IF('RCC Data'!$F$49=\"\",\"\",'RCC Data'!$F$49)","v":"Cementitious Content"},{"$f":"IF('RCC Data'!$F$57=\"\",\"\",'RCC Data'!$F$57)","v":"Sample No."},{"$f":"IF('RCC Data'!$F$63=\"\",\"\",'RCC Data'!$F$63)","v":"B3"}]
[55,{"$f":"IF('RCC Data'!$H$64=\"\",\"\",'RCC Data'!$H$64)","v":6},{"$f":"IF( 'RCC Data'!$C$57=\"\",\"\", 'RCC Data'!$C$57)","v":"Moisture-Denisty Curve Label"},{"$f":"IF('RCC Data'!$C$64=\"\",\"\",'RCC Data'!$C$64)","v":"Above Optimum (C):"},{"$f":"IF('RCC Data'!$F$49=\"\",\"\",'RCC Data'!$F$49)","v":"Cementitious Content"},{"$f":"IF('RCC Data'!$F$57=\"\",\"\",'RCC Data'!$F$57)","v":"Sample No."},{"$f":"IF('RCC Data'!$F$64=\"\",\"\",'RCC Data'!$F$64)","v":"C1"}]
[56,{"$f":"IF('RCC Data'!$H$65=\"\",\"\",'RCC Data'!$H$65)","v":6},{"$f":"IF( 'RCC Data'!$C$57=\"\",\"\", 'RCC Data'!$C$57)","v":"Moisture-Denisty Curve Label"},{"$f":"IF('RCC Data'!$C$64=\"\",\"\",'RCC Data'!$C$64)","v":"Above Optimum (C):"},{"$f":"IF('RCC Data'!$F$49=\"\",\"\",'RCC Data'!$F$49)","v":"Cementitious Content"},{"$f":"IF('RCC Data'!$F$57=\"\",\"\",'RCC Data'!$F$57)","v":"Sample No."},{"$f":"IF('RCC Data'!$F$65=\"\",\"\",'RCC Data'!$F$65)","v":"C2"}]
[57,{"$f":"IF('RCC Data'!$H$66=\"\",\"\",'RCC Data'!$H$66)","v":6},{"$f":"IF( 'RCC Data'!$C$57=\"\",\"\", 'RCC Data'!$C$57)","v":"Moisture-Denisty Curve Label"},{"$f":"IF('RCC Data'!$C$64=\"\",\"\",'RCC Data'!$C$64)","v":"Above Optimum (C):"},{"$f":"IF('RCC Data'!$F$49=\"\",\"\",'RCC Data'!$F$49)","v":"Cementitious Content"},{"$f":"IF('RCC Data'!$F$57=\"\",\"\",'RCC Data'!$F$57)","v":"Sample No."},{"$f":"IF('RCC Data'!$F$66=\"\",\"\",'RCC Data'!$F$66)","v":"C3"}]
[58,{"$f":"IF('RCC Data'!$H$71=\"\",\"\",'RCC Data'!$H$71)","v":""},{"$f":"IF( 'RCC Data'!$C$70=\"\",\"\", 'RCC Data'!$C$70)","v":"Moisture-Denisty Curve Label"},{"$f":"IF('RCC Data'!$C$71=\"\",\"\",'RCC Data'!$C$71)","v":"Optimum (A):"},{"$f":"IF('RCC Data'!$F$49=\"\",\"\",'RCC Data'!$F$49)","v":"Cementitious Content"},{"$f":"IF('RCC Data'!$F$70=\"\",\"\",'RCC Data'!$F$70)","v":"Sample No."},{"$f":"IF('RCC Data'!$F$71=\"\",\"\",'RCC Data'!$F$71)","v":"A1"}]
[59,{"$f":"IF('RCC Data'!$H$72=\"\",\"\",'RCC Data'!$H$72)","v":""},{"$f":"IF( 'RCC Data'!$C$70=\"\",\"\", 'RCC Data'!$C$70)","v":"Moisture-Denisty Curve Label"},{"$f":"IF('RCC Data'!$C$71=\"\",\"\",'RCC Data'!$C$71)","v":"Optimum (A):"},{"$f":"IF('RCC Data'!$F$49=\"\",\"\",'RCC Data'!$F$49)","v":"Cementitious Content"},{"$f":"IF('RCC Data'!$F$70=\"\",\"\",'RCC Data'!$F$70)","v":"Sample No."},{"$f":"IF('RCC Data'!$F$72=\"\",\"\",'RCC Data'!$F$72)","v":"A2"}]
[60,{"$f":"IF('RCC Data'!$H$73=\"\",\"\",'RCC Data'!$H$73)","v":""},{"$f":"IF( 'RCC Data'!$C$70=\"\",\"\", 'RCC Data'!$C$70)","v":"Moisture-Denisty Curve Label"},{"$f":"IF('RCC Data'!$C$71=\"\",\"\",'RCC Data'!$C$71)","v":"Optimum (A):"},{"$f":"IF('RCC Data'!$F$49=\"\",\"\",'RCC Data'!$F$49)","v":"Cementitious Content"},{"$f":"IF('RCC Data'!$F$70=\"\",\"\",'RCC Data'!$F$70)","v":"Sample No."},{"$f":"IF('RCC Data'!$F$73=\"\",\"\",'RCC Data'!$F$73)","v":"A3"}]
[61,{"$f":"IF('RCC Data'!$H$74=\"\",\"\",'RCC Data'!$H$74)","v":""},{"$f":"IF( 'RCC Data'!$C$70=\"\",\"\", 'RCC Data'!$C$70)","v":"Moisture-Denisty Curve Label"},{"$f":"IF('RCC Data'!$C$74=\"\",\"\",'RCC Data'!$C$74)","v":"Below Optimum (B):"},{"$f":"IF('RCC Data'!$F$49=\"\",\"\",'RCC Data'!$F$49)","v":"Cementitious Content"},{"$f":"IF('RCC Data'!$F$70=\"\",\"\",'RCC Data'!$F$70)","v":"Sample No."},{"$f":"IF('RCC Data'!$F$74=\"\",\"\",'RCC Data'!$F$74)","v":"B1"}]
[62,{"$f":"IF('RCC Data'!$H$75=\"\",\"\",'RCC Data'!$H$75)","v":""},{"$f":"IF( 'RCC Data'!$C$70=\"\",\"\", 'RCC Data'!$C$70)","v":"Moisture-Denisty Curve Label"},{"$f":"IF('RCC Data'!$C$74=\"\",\"\",'RCC Data'!$C$74)","v":"Below Optimum (B):"},{"$f":"IF('RCC Data'!$F$49=\"\",\"\",'RCC Data'!$F$49)","v":"Cementitious Content"},{"$f":"IF('RCC Data'!$F$70=\"\",\"\",'RCC Data'!$F$70)","v":"Sample No."},{"$f":"IF('RCC Data'!$F$75=\"\",\"\",'RCC Data'!$F$75)","v":"B2"}]
[63,{"$f":"IF('RCC Data'!$H$76=\"\",\"\",'RCC Data'!$H$76)","v":""},{"$f":"IF( 'RCC Data'!$C$70=\"\",\"\", 'RCC Data'!$C$70)","v":"Moisture-Denisty Curve Label"},{"$f":"IF('RCC Data'!$C$74=\"\",\"\",'RCC Data'!$C$74)","v":"Below Optimum (B):"},{"$f":"IF('RCC Data'!$F$49=\"\",\"\",'RCC Data'!$F$49)","v":"Cementitious Content"},{"$f":"IF('RCC Data'!$F$70=\"\",\"\",'RCC Data'!$F$70)","v":"Sample No."},{"$f":"IF('RCC Data'!$F$76=\"\",\"\",'RCC Data'!$F$76)","v":"B3"}]
[64,{"$f":"IF('RCC Data'!$H$77=\"\",\"\",'RCC Data'!$H$77)","v":""},{"$f":"IF( 'RCC Data'!$C$70=\"\",\"\", 'RCC Data'!$C$70)","v":"Moisture-Denisty Curve Label"},{"$f":"IF('RCC Data'!$C$77=\"\",\"\",'RCC Data'!$C$77)","v":"Above Optimum (C):"},{"$f":"IF('RCC Data'!$F$49=\"\",\"\",'RCC Data'!$F$49)","v":"Cementitious Content"},{"$f":"IF('RCC Data'!$F$70=\"\",\"\",'RCC Data'!$F$70)","v":"Sample No."},{"$f":"IF('RCC Data'!$F$77=\"\",\"\",'RCC Data'!$F$77)","v":"C1"}]
[65,{"$f":"IF('RCC Data'!$H$78=\"\",\"\",'RCC Data'!$H$78)","v":""},{"$f":"IF( 'RCC Data'!$C$70=\"\",\"\", 'RCC Data'!$C$70)","v":"Moisture-Denisty Curve Label"},{"$f":"IF('RCC Data'!$C$77=\"\",\"\",'RCC Data'!$C$77)","v":"Above Optimum (C):"},{"$f":"IF('RCC Data'!$F$49=\"\",\"\",'RCC Data'!$F$49)","v":"Cementitious Content"},{"$f":"IF('RCC Data'!$F$70=\"\",\"\",'RCC Data'!$F$70)","v":"Sample No."},{"$f":"IF('RCC Data'!$F$78=\"\",\"\",'RCC Data'!$F$78)","v":"C2"}]
[66,{"$f":"IF('RCC Data'!$H$79=\"\",\"\",'RCC Data'!$H$79)","v":""},{"$f":"IF( 'RCC Data'!$C$70=\"\",\"\", 'RCC Data'!$C$70)","v":"Moisture-Denisty Curve Label"},{"$f":"IF('RCC Data'!$C$77=\"\",\"\",'RCC Data'!$C$77)","v":"Above Optimum (C):"},{"$f":"IF('RCC Data'!$F$49=\"\",\"\",'RCC Data'!$F$49)","v":"Cementitious Content"},{"$f":"IF('RCC Data'!$F$70=\"\",\"\",'RCC Data'!$F$70)","v":"Sample No."},{"$f":"IF('RCC Data'!$F$79=\"\",\"\",'RCC Data'!$F$79)","v":"C3"}]
[67,{"$f":"IF('RCC Data'!$J$71=\"\",\"\",'RCC Data'!$J$71)","v":6.2},{"$f":"IF( 'RCC Data'!$C$70=\"\",\"\", 'RCC Data'!$C$70)","v":"Moisture-Denisty Curve Label"},{"$f":"IF('RCC Data'!$C$71=\"\",\"\",'RCC Data'!$C$71)","v":"Optimum (A):"},{"$f":"IF('RCC Data'!$F$49=\"\",\"\",'RCC Data'!$F$49)","v":"Cementitious Content"},{"$f":"IF('RCC Data'!$F$70=\"\",\"\",'RCC Data'!$F$70)","v":"Sample No."},{"$f":"IF('RCC Data'!$F$71=\"\",\"\",'RCC Data'!$F$71)","v":"A1"}]
[68,{"$f":"IF('RCC Data'!$J$72=\"\",\"\",'RCC Data'!$J$72)","v":6.2},{"$f":"IF( 'RCC Data'!$C$70=\"\",\"\", 'RCC Data'!$C$70)","v":"Moisture-Denisty Curve Label"},{"$f":"IF('RCC Data'!$C$71=\"\",\"\",'RCC Data'!$C$71)","v":"Optimum (A):"},{"$f":"IF('RCC Data'!$F$49=\"\",\"\",'RCC Data'!$F$49)","v":"Cementitious Content"},{"$f":"IF('RCC Data'!$F$70=\"\",\"\",'RCC Data'!$F$70)","v":"Sample No."},{"$f":"IF('RCC Data'!$F$72=\"\",\"\",'RCC Data'!$F$72)","v":"A2"}]
[69,{"$f":"IF('RCC Data'!$J$73=\"\",\"\",'RCC Data'!$J$73)","v":6.2},{"$f":"IF( 'RCC Data'!$C$70=\"\",\"\", 'RCC Data'!$C$70)","v":"Moisture-Denisty Curve Label"},{"$f":"IF('RCC Data'!$C$71=\"\",\"\",'RCC Data'!$C$71)","v":"Optimum (A):"},{"$f":"IF('RCC Data'!$F$49=\"\",\"\",'RCC Data'!$F$49)","v":"Cementitious Content"},{"$f":"IF('RCC Data'!$F$70=\"\",\"\",'RCC Data'!$F$70)","v":"Sample No."},{"$f":"IF('RCC Data'!$F$73=\"\",\"\",'RCC Data'!$F$73)","v":"A3"}]
[70,{"$f":"IF('RCC Data'!$J$74=\"\",\"\",'RCC Data'!$J$74)","v":5.8},{"$f":"IF( 'RCC Data'!$C$70=\"\",\"\", 'RCC Data'!$C$70)","v":"Moisture-Denisty Curve Label"},{"$f":"IF('RCC Data'!$C$74=\"\",\"\",'RCC Data'!$C$74)","v":"Below Optimum (B):"},{"$f":"IF('RCC Data'!$F$49=\"\",\"\",'RCC Data'!$F$49)","v":"Cementitious Content"},{"$f":"IF('RCC Data'!$F$70=\"\",\"\",'RCC Data'!$F$70)","v":"Sample No."},{"$f":"IF('RCC Data'!$F$74=\"\",\"\",'RCC Data'!$F$74)","v":"B1"}]
[71,{"$f":"IF('RCC Data'!$J$75=\"\",\"\",'RCC Data'!$J$75)","v":5.8},{"$f":"IF( 'RCC Data'!$C$70=\"\",\"\", 'RCC Data'!$C$70)","v":"Moisture-Denisty Curve Label"},{"$f":"IF('RCC Data'!$C$74=\"\",\"\",'RCC Data'!$C$74)","v":"Below Optimum (B):"},{"$f":"IF('RCC Data'!$F$49=\"\",\"\",'RCC Data'!$F$49)","v":"Cementitious Content"},{"$f":"IF('RCC Data'!$F$70=\"\",\"\",'RCC Data'!$F$70)","v":"Sample No."},{"$f":"IF('RCC Data'!$F$75=\"\",\"\",'RCC Data'!$F$75)","v":"B2"}]
[72,{"$f":"IF('RCC Data'!$J$76=\"\",\"\",'RCC Data'!$J$76)","v":5.8},{"$f":"IF( 'RCC Data'!$C$70=\"\",\"\", 'RCC Data'!$C$70)","v":"Moisture-Denisty Curve Label"},{"$f":"IF('RCC Data'!$C$74=\"\",\"\",'RCC Data'!$C$74)","v":"Below Optimum (B):"},{"$f":"IF('RCC Data'!$F$49=\"\",\"\",'RCC Data'!$F$49)","v":"Cementitious Content"},{"$f":"IF('RCC Data'!$F$70=\"\",\"\",'RCC Data'!$F$70)","v":"Sample No."},{"$f":"IF('RCC Data'!$F$76=\"\",\"\",'RCC Data'!$F$76)","v":"B3"}]
[73,{"$f":"IF('RCC Data'!$J$77=\"\",\"\",'RCC Data'!$J$77)","v":6},{"$f":"IF( 'RCC Data'!$C$70=\"\",\"\", 'RCC Data'!$C$70)","v":"Moisture-Denisty Curve Label"},{"$f":"IF('RCC Data'!$C$77=\"\",\"\",'RCC Data'!$C$77)","v":"Above Optimum (C):"},{"$f":"IF('RCC Data'!$F$49=\"\",\"\",'RCC Data'!$F$49)","v":"Cementitious Content"},{"$f":"IF('RCC Data'!$F$70=\"\",\"\",'RCC Data'!$F$70)","v":"Sample No."},{"$f":"IF('RCC Data'!$F$77=\"\",\"\",'RCC Data'!$F$77)","v":"C1"}]
[74,{"$f":"IF('RCC Data'!$J$78=\"\",\"\",'RCC Data'!$J$78)","v":6},{"$f":"IF( 'RCC Data'!$C$70=\"\",\"\", 'RCC Data'!$C$70)","v":"Moisture-Denisty Curve Label"},{"$f":"IF('RCC Data'!$C$77=\"\",\"\",'RCC Data'!$C$77)","v":"Above Optimum (C):"},{"$f":"IF('RCC Data'!$F$49=\"\",\"\",'RCC Data'!$F$49)","v":"Cementitious Content"},{"$f":"IF('RCC Data'!$F$70=\"\",\"\",'RCC Data'!$F$70)","v":"Sample No."},{"$f":"IF('RCC Data'!$F$78=\"\",\"\",'RCC Data'!$F$78)","v":"C2"}]
[75,{"$f":"IF('RCC Data'!$J$79=\"\",\"\",'RCC Data'!$J$79)","v":6},{"$f":"IF( 'RCC Data'!$C$70=\"\",\"\", 'RCC Data'!$C$70)","v":"Moisture-Denisty Curve Label"},{"$f":"IF('RCC Data'!$C$77=\"\",\"\",'RCC Data'!$C$77)","v":"Above Optimum (C):"},{"$f":"IF('RCC Data'!$F$49=\"\",\"\",'RCC Data'!$F$49)","v":"Cementitious Content"},{"$f":"IF('RCC Data'!$F$70=\"\",\"\",'RCC Data'!$F$70)","v":"Sample No."},{"$f":"IF('RCC Data'!$F$79=\"\",\"\",'RCC Data'!$F$79)","v":"C3"}]
[76,{"$f":"IF('RCC Data'!$L$71=\"\",\"\",'RCC Data'!$L$71)","v":""},{"$f":"IF( 'RCC Data'!$C$70=\"\",\"\", 'RCC Data'!$C$70)","v":"Moisture-Denisty Curve Label"},{"$f":"IF('RCC Data'!$C$71=\"\",\"\",'RCC Data'!$C$71)","v":"Optimum (A):"},{"$f":"IF('RCC Data'!$F$49=\"\",\"\",'RCC Data'!$F$49)","v":"Cementitious Content"},{"$f":"IF('RCC Data'!$F$70=\"\",\"\",'RCC Data'!$F$70)","v":"Sample No."},{"$f":"IF('RCC Data'!$F$71=\"\",\"\",'RCC Data'!$F$71)","v":"A1"}]
[77,{"$f":"IF('RCC Data'!$L$72=\"\",\"\",'RCC Data'!$L$72)","v":""},{"$f":"IF( 'RCC Data'!$C$70=\"\",\"\", 'RCC Data'!$C$70)","v":"Moisture-Denisty Curve Label"},{"$f":"IF('RCC Data'!$C$71=\"\",\"\",'RCC Data'!$C$71)","v":"Optimum (A):"},{"$f":"IF('RCC Data'!$F$49=\"\",\"\",'RCC Data'!$F$49)","v":"Cementitious Content"},{"$f":"IF('RCC Data'!$F$70=\"\",\"\",'RCC Data'!$F$70)","v":"Sample No."},{"$f":"IF('RCC Data'!$F$72=\"\",\"\",'RCC Data'!$F$72)","v":"A2"}]
[78,{"$f":"IF('RCC Data'!$L$73=\"\",\"\",'RCC Data'!$L$73)","v":""},{"$f":"IF( 'RCC Data'!$C$70=\"\",\"\", 'RCC Data'!$C$70)","v":"Moisture-Denisty Curve Label"},{"$f":"IF('RCC Data'!$C$71=\"\",\"\",'RCC Data'!$C$71)","v":"Optimum (A):"},{"$f":"IF('RCC Data'!$F$49=\"\",\"\",'RCC Data'!$F$49)","v":"Cementitious Content"},{"$f":"IF('RCC Data'!$F$70=\"\",\"\",'RCC Data'!$F$70)","v":"Sample No."},{"$f":"IF('RCC Data'!$F$73=\"\",\"\",'RCC Data'!$F$73)","v":"A3"}]
[79,{"$f":"IF('RCC Data'!$L$74=\"\",\"\",'RCC Data'!$L$74)","v":""},{"$f":"IF( 'RCC Data'!$C$70=\"\",\"\", 'RCC Data'!$C$70)","v":"Moisture-Denisty Curve Label"},{"$f":"IF('RCC Data'!$C$74=\"\",\"\",'RCC Data'!$C$74)","v":"Below Optimum (B):"},{"$f":"IF('RCC Data'!$F$49=\"\",\"\",'RCC Data'!$F$49)","v":"Cementitious Content"},{"$f":"IF('RCC Data'!$F$70=\"\",\"\",'RCC Data'!$F$70)","v":"Sample No."},{"$f":"IF('RCC Data'!$F$74=\"\",\"\",'RCC Data'!$F$74)","v":"B1"}]
[80,{"$f":"IF('RCC Data'!$L$75=\"\",\"\",'RCC Data'!$L$75)","v":""},{"$f":"IF( 'RCC Data'!$C$70=\"\",\"\", 'RCC Data'!$C$70)","v":"Moisture-Denisty Curve Label"},{"$f":"IF('RCC Data'!$C$74=\"\",\"\",'RCC Data'!$C$74)","v":"Below Optimum (B):"},{"$f":"IF('RCC Data'!$F$49=\"\",\"\",'RCC Data'!$F$49)","v":"Cementitious Content"},{"$f":"IF('RCC Data'!$F$70=\"\",\"\",'RCC Data'!$F$70)","v":"Sample No."},{"$f":"IF('RCC Data'!$F$75=\"\",\"\",'RCC Data'!$F$75)","v":"B2"}]
[81,{"$f":"IF('RCC Data'!$L$76=\"\",\"\",'RCC Data'!$L$76)","v":""},{"$f":"IF( 'RCC Data'!$C$70=\"\",\"\", 'RCC Data'!$C$70)","v":"Moisture-Denisty Curve Label"},{"$f":"IF('RCC Data'!$C$74=\"\",\"\",'RCC Data'!$C$74)","v":"Below Optimum (B):"},{"$f":"IF('RCC Data'!$F$49=\"\",\"\",'RCC Data'!$F$49)","v":"Cementitious Content"},{"$f":"IF('RCC Data'!$F$70=\"\",\"\",'RCC Data'!$F$70)","v":"Sample No."},{"$f":"IF('RCC Data'!$F$76=\"\",\"\",'RCC Data'!$F$76)","v":"B3"}]
[82,{"$f":"IF('RCC Data'!$L$77=\"\",\"\",'RCC Data'!$L$77)","v":""},{"$f":"IF( 'RCC Data'!$C$70=\"\",\"\", 'RCC Data'!$C$70)","v":"Moisture-Denisty Curve Label"},{"$f":"IF('RCC Data'!$C$77=\"\",\"\",'RCC Data'!$C$77)","v":"Above Optimum (C):"},{"$f":"IF('RCC Data'!$F$49=\"\",\"\",'RCC Data'!$F$49)","v":"Cementitious Content"},{"$f":"IF('RCC Data'!$F$70=\"\",\"\",'RCC Data'!$F$70)","v":"Sample No."},{"$f":"IF('RCC Data'!$F$77=\"\",\"\",'RCC Data'!$F$77)","v":"C1"}]
[83,{"$f":"IF('RCC Data'!$L$78=\"\",\"\",'RCC Data'!$L$78)","v":""},{"$f":"IF( 'RCC Data'!$C$70=\"\",\"\", 'RCC Data'!$C$70)","v":"Moisture-Denisty Curve Label"},{"$f":"IF('RCC Data'!$C$77=\"\",\"\",'RCC Data'!$C$77)","v":"Above Optimum (C):"},{"$f":"IF('RCC Data'!$F$49=\"\",\"\",'RCC Data'!$F$49)","v":"Cementitious Content"},{"$f":"IF('RCC Data'!$F$70=\"\",\"\",'RCC Data'!$F$70)","v":"Sample No."},{"$f":"IF('RCC Data'!$F$78=\"\",\"\",'RCC Data'!$F$78)","v":"C2"}]
[84,{"$f":"IF('RCC Data'!$L$79=\"\",\"\",'RCC Data'!$L$79)","v":""},{"$f":"IF( 'RCC Data'!$C$70=\"\",\"\", 'RCC Data'!$C$70)","v":"Moisture-Denisty Curve Label"},{"$f":"IF('RCC Data'!$C$77=\"\",\"\",'RCC Data'!$C$77)","v":"Above Optimum (C):"},{"$f":"IF('RCC Data'!$F$49=\"\",\"\",'RCC Data'!$F$49)","v":"Cementitious Content"},{"$f":"IF('RCC Data'!$F$70=\"\",\"\",'RCC Data'!$F$70)","v":"Sample No."},{"$f":"IF('RCC Data'!$F$79=\"\",\"\",'RCC Data'!$F$79)","v":"C3"}]
[85,{"$f":"IF('RCC Data'!$N$71=\"\",\"\",'RCC Data'!$N$71)","v":""},{"$f":"IF( 'RCC Data'!$C$70=\"\",\"\", 'RCC Data'!$C$70)","v":"Moisture-Denisty Curve Label"},{"$f":"IF('RCC Data'!$C$71=\"\",\"\",'RCC Data'!$C$71)","v":"Optimum (A):"},{"$f":"IF('RCC Data'!$F$49=\"\",\"\",'RCC Data'!$F$49)","v":"Cementitious Content"},{"$f":"IF('RCC Data'!$F$70=\"\",\"\",'RCC Data'!$F$70)","v":"Sample No."},{"$f":"IF('RCC Data'!$F$71=\"\",\"\",'RCC Data'!$F$71)","v":"A1"}]
[86,{"$f":"IF('RCC Data'!$N$74=\"\",\"\",'RCC Data'!$N$74)","v":""},{"$f":"IF( 'RCC Data'!$C$70=\"\",\"\", 'RCC Data'!$C$70)","v":"Moisture-Denisty Curve Label"},{"$f":"IF('RCC Data'!$C$74=\"\",\"\",'RCC Data'!$C$74)","v":"Below Optimum (B):"},{"$f":"IF('RCC Data'!$F$49=\"\",\"\",'RCC Data'!$F$49)","v":"Cementitious Content"},{"$f":"IF('RCC Data'!$F$70=\"\",\"\",'RCC Data'!$F$70)","v":"Sample No."},{"$f":"IF('RCC Data'!$F$74=\"\",\"\",'RCC Data'!$F$74)","v":"B1"}]
[87,{"$f":"IF('RCC Data'!$N$77=\"\",\"\",'RCC Data'!$N$77)","v":""},{"$f":"IF( 'RCC Data'!$C$70=\"\",\"\", 'RCC Data'!$C$70)","v":"Moisture-Denisty Curve Label"},{"$f":"IF('RCC Data'!$C$77=\"\",\"\",'RCC Data'!$C$77)","v":"Above Optimum (C):"},{"$f":"IF('RCC Data'!$F$49=\"\",\"\",'RCC Data'!$F$49)","v":"Cementitious Content"},{"$f":"IF('RCC Data'!$F$70=\"\",\"\",'RCC Data'!$F$70)","v":"Sample No."},{"$f":"IF('RCC Data'!$F$77=\"\",\"\",'RCC Data'!$F$77)","v":"C1"}]
[88,{"$f":"IF('RCC Data'!$P$71=\"\",\"\",'RCC Data'!$P$71)","v":""},{"$f":"IF( 'RCC Data'!$C$70=\"\",\"\", 'RCC Data'!$C$70)","v":"Moisture-Denisty Curve Label"},{"$f":"IF('RCC Data'!$C$71=\"\",\"\",'RCC Data'!$C$71)","v":"Optimum (A):"},{"$f":"IF('RCC Data'!$F$49=\"\",\"\",'RCC Data'!$F$49)","v":"Cementitious Content"},{"$f":"IF('RCC Data'!$F$70=\"\",\"\",'RCC Data'!$F$70)","v":"Sample No."},{"$f":"IF('RCC Data'!$F$71=\"\",\"\",'RCC Data'!$F$71)","v":"A1"}]
[89,{"$f":"IF('RCC Data'!$P$74=\"\",\"\",'RCC Data'!$P$74)","v":""},{"$f":"IF( 'RCC Data'!$C$70=\"\",\"\", 'RCC Data'!$C$70)","v":"Moisture-Denisty Curve Label"},{"$f":"IF('RCC Data'!$C$74=\"\",\"\",'RCC Data'!$C$74)","v":"Below Optimum (B):"},{"$f":"IF('RCC Data'!$F$49=\"\",\"\",'RCC Data'!$F$49)","v":"Cementitious Content"},{"$f":"IF('RCC Data'!$F$70=\"\",\"\",'RCC Data'!$F$70)","v":"Sample No."},{"$f":"IF('RCC Data'!$F$74=\"\",\"\",'RCC Data'!$F$74)","v":"B1"}]
[90,{"$f":"IF('RCC Data'!$P$77=\"\",\"\",'RCC Data'!$P$77)","v":""},{"$f":"IF( 'RCC Data'!$C$70=\"\",\"\", 'RCC Data'!$C$70)","v":"Moisture-Denisty Curve Label"},{"$f":"IF('RCC Data'!$C$77=\"\",\"\",'RCC Data'!$C$77)","v":"Above Optimum (C):"},{"$f":"IF('RCC Data'!$F$49=\"\",\"\",'RCC Data'!$F$49)","v":"Cementitious Content"},{"$f":"IF('RCC Data'!$F$70=\"\",\"\",'RCC Data'!$F$70)","v":"Sample No."},{"$f":"IF('RCC Data'!$F$77=\"\",\"\",'RCC Data'!$F$77)","v":"C1"}]
[91,{"$f":"IF('ASTM 1557'!$D$22=\"\",\"\",'ASTM 1557'!$D$22)","v":""},{"$f":"IF( 'ASTM 1557'!$B$6=\"\",\"\", 'ASTM 1557'!$B$6)","v":"ASTM D1557"},{"$f":"IF('ASTM 1557'!$B$22=\"\",\"\",'ASTM 1557'!$B$22)","v":"Oven Dry Weight, (g):"}]
[92,{"$f":"IF('ASTM 1557'!$D$23=\"\",\"\",'ASTM 1557'!$D$23)","v":""},{"$f":"IF( 'ASTM 1557'!$B$6=\"\",\"\", 'ASTM 1557'!$B$6)","v":"ASTM D1557"},{"$f":"IF('ASTM 1557'!$B$23=\"\",\"\",'ASTM 1557'!$B$23)","v":"Weight of Pycnometer & Water, (g):"}]
[93,{"$f":"IF('ASTM 1557'!$D$24=\"\",\"\",'ASTM 1557'!$D$24)","v":""},{"$f":"IF( 'ASTM 1557'!$B$6=\"\",\"\", 'ASTM 1557'!$B$6)","v":"ASTM D1557"},{"$f":"IF('ASTM 1557'!$B$24=\"\",\"\",'ASTM 1557'!$B$24)","v":"Weight of Aggr., Pycn.& Water, (g):"}]
[94,{"$f":"IF('ASTM 1557'!$D$25=\"\",\"\",'ASTM 1557'!$D$25)","v":""},{"$f":"IF( 'ASTM 1557'!$B$6=\"\",\"\", 'ASTM 1557'!$B$6)","v":"ASTM D1557"},{"$f":"IF('ASTM 1557'!$B$25=\"\",\"\",'ASTM 1557'!$B$25)","v":"Specific Gravity (Apparent)(Override):"}]
[95,{"$f":"IF('ASTM 1557'!$D$26=\"\",\"\",'ASTM 1557'!$D$26)","v":2.65},{"$f":"IF( 'ASTM 1557'!$B$6=\"\",\"\", 'ASTM 1557'!$B$6)","v":"ASTM D1557"},{"$f":"IF('ASTM 1557'!$B$26=\"\",\"\",'ASTM 1557'!$B$26)","v":"Specific Gravity (Apparent)(Calc):"}]
[96,{"$f":"IF('ASTM 1557'!$D$28=\"\",\"\",'ASTM 1557'!$D$28)","v":""},{"$f":"IF( 'ASTM 1557'!$B$6=\"\",\"\", 'ASTM 1557'!$B$6)","v":"ASTM D1557"},{"$f":"IF('ASTM 1557'!$B$28=\"\",\"\",'ASTM 1557'!$B$28)","v":"Hygroscopic Moisture, (%):"}]
[97,{"$f":"IF('ASTM 1557'!$D$32=\"\",\"\",'ASTM 1557'!$D$32)","v":"% - 1"},{"$f":"IF( 'ASTM 1557'!$B$6=\"\",\"\", 'ASTM 1557'!$B$6)","v":"ASTM D1557"},{"$f":"IF('ASTM 1557'!$B$32=\"\",\"\",'ASTM 1557'!$B$32)","v":"Sample Number :"},{"$f":"IF('ASTM 1557'!$D$30=\"\",\"\",'ASTM 1557'!$D$30)","v":"1-1"}]
[98,{"$f":"IF('ASTM 1557'!$E$32=\"\",\"\",'ASTM 1557'!$E$32)","v":"% - 2"},{"$f":"IF( 'ASTM 1557'!$B$6=\"\",\"\", 'ASTM 1557'!$B$6)","v":"ASTM D1557"},{"$f":"IF('ASTM 1557'!$B$32=\"\",\"\",'ASTM 1557'!$B$32)","v":"Sample Number :"},{"$f":"IF('ASTM 1557'!$E$30=\"\",\"\",'ASTM 1557'!$E$30)","v":"1-2"}]
[99,{"$f":"IF('ASTM 1557'!$F$32=\"\",\"\",'ASTM 1557'!$F$32)","v":"% - 3"},{"$f":"IF( 'ASTM 1557'!$B$6=\"\",\"\", 'ASTM 1557'!$B$6)","v":"ASTM D1557"},{"$f":"IF('ASTM 1557'!$B$32=\"\",\"\",'ASTM 1557'!$B$32)","v":"Sample Number :"},{"$f":"IF('ASTM 1557'!$F$30=\"\",\"\",'ASTM 1557'!$F$30)","v":"1-3"}]
[100,{"$f":"IF('ASTM 1557'!$G$32=\"\",\"\",'ASTM 1557'!$G$32)","v":"% - 4"},{"$f":"IF( 'ASTM 1557'!$B$6=\"\",\"\", 'ASTM 1557'!$B$6)","v":"ASTM D1557"},{"$f":"IF('ASTM 1557'!$B$32=\"\",\"\",'ASTM 1557'!$B$32)","v":"Sample Number :"},{"$f":"IF('ASTM 1557'!$G$30=\"\",\"\",'ASTM 1557'!$G$30)","v":"1-4"}]
[101,{"$f":"IF('ASTM 1557'!$I$32=\"\",\"\",'ASTM 1557'!$I$32)","v":"% - 1"},{"$f":"IF( 'ASTM 1557'!$B$6=\"\",\"\", 'ASTM 1557'!$B$6)","v":"ASTM D1557"},{"$f":"IF('ASTM 1557'!$B$32=\"\",\"\",'ASTM 1557'!$B$32)","v":"Sample Number :"},{"$f":"IF('ASTM 1557'!$I$30=\"\",\"\",'ASTM 1557'!$I$30)","v":"2-1"}]
[102,{"$f":"IF('ASTM 1557'!$J$32=\"\",\"\",'ASTM 1557'!$J$32)","v":"% - 2"},{"$f":"IF( 'ASTM 1557'!$B$6=\"\",\"\", 'ASTM 1557'!$B$6)","v":"ASTM D1557"},{"$f":"IF('ASTM 1557'!$B$32=\"\",\"\",'ASTM 1557'!$B$32)","v":"Sample Number :"},{"$f":"IF('ASTM 1557'!$J$30=\"\",\"\",'ASTM 1557'!$J$30)","v":"2-2"}]
[103,{"$f":"IF('ASTM 1557'!$K$32=\"\",\"\",'ASTM 1557'!$K$32)","v":"% - 3"},{"$f":"IF( 'ASTM 1557'!$B$6=\"\",\"\", 'ASTM 1557'!$B$6)","v":"ASTM D1557"},{"$f":"IF('ASTM 1557'!$B$32=\"\",\"\",'ASTM 1557'!$B$32)","v":"Sample Number :"},{"$f":"IF('ASTM 1557'!$K$30=\"\",\"\",'ASTM 1557'!$K$30)","v":"2-3"}]
[104,{"$f":"IF('ASTM 1557'!$L$32=\"\",\"\",'ASTM 1557'!$L$32)","v":"% - 4"},{"$f":"IF( 'ASTM 1557'!$B$6=\"\",\"\", 'ASTM 1557'!$B$6)","v":"ASTM D1557"},{"$f":"IF('ASTM 1557'!$B$32=\"\",\"\",'ASTM 1557'!$B$32)","v":"Sample Number :"},{"$f":"IF('ASTM 1557'!$L$30=\"\",\"\",'ASTM 1557'!$L$30)","v":"2-4"}]
[105,{"$f":"IF('ASTM 1557'!$N$32=\"\",\"\",'ASTM 1557'!$N$32)","v":"% - 1"},{"$f":"IF( 'ASTM 1557'!$B$6=\"\",\"\", 'ASTM 1557'!$B$6)","v":"ASTM D1557"},{"$f":"IF('ASTM 1557'!$B$32=\"\",\"\",'ASTM 1557'!$B$32)","v":"Sample Number :"},{"$f":"IF('ASTM 1557'!$N$30=\"\",\"\",'ASTM 1557'!$N$30)","v":"3-1"}]
[106,{"$f":"IF('ASTM 1557'!$O$32=\"\",\"\",'ASTM 1557'!$O$32)","v":"% - 2"},{"$f":"IF( 'ASTM 1557'!$B$6=\"\",\"\", 'ASTM 1557'!$B$6)","v":"ASTM D1557"},{"$f":"IF('ASTM 1557'!$B$32=\"\",\"\",'ASTM 1557'!$B$32)","v":"Sample Number :"},{"$f":"IF('ASTM 1557'!$O$30=\"\",\"\",'ASTM 1557'!$O$30)","v":"3-2"}]
[107,{"$f":"IF('ASTM 1557'!$P$32=\"\",\"\",'ASTM 1557'!$P$32)","v":"% - 3"},{"$f":"IF( 'ASTM 1557'!$B$6=\"\",\"\", 'ASTM 1557'!$B$6)","v":"ASTM D1557"},{"$f":"IF('ASTM 1557'!$B$32=\"\",\"\",'ASTM 1557'!$B$32)","v":"Sample Number :"},{"$f":"IF('ASTM 1557'!$P$30=\"\",\"\",'ASTM 1557'!$P$30)","v":"3-3"}]
[108,{"$f":"IF('ASTM 1557'!$Q$32=\"\",\"\",'ASTM 1557'!$Q$32)","v":"% - 4"},{"$f":"IF( 'ASTM 1557'!$B$6=\"\",\"\", 'ASTM 1557'!$B$6)","v":"ASTM D1557"},{"$f":"IF('ASTM 1557'!$B$32=\"\",\"\",'ASTM 1557'!$B$32)","v":"Sample Number :"},{"$f":"IF('ASTM 1557'!$Q$30=\"\",\"\",'ASTM 1557'!$Q$30)","v":"3-4"}]
[109,{"$f":"IF('ASTM 1557'!$D$33=\"\",\"\",'ASTM 1557'!$D$33)","v":""},{"$f":"IF( 'ASTM 1557'!$B$6=\"\",\"\", 'ASTM 1557'!$B$6)","v":"ASTM D1557"},{"$f":"IF('ASTM 1557'!$B$33=\"\",\"\",'ASTM 1557'!$B$33)","v":"Percent Water Content, (%) :"},{"$f":"IF('ASTM 1557'!$D$30=\"\",\"\",'ASTM 1557'!$D$30)","v":"1-1"}]
[110,{"$f":"IF('ASTM 1557'!$E$33=\"\",\"\",'ASTM 1557'!$E$33)","v":""},{"$f":"IF( 'ASTM 1557'!$B$6=\"\",\"\", 'ASTM 1557'!$B$6)","v":"ASTM D1557"},{"$f":"IF('ASTM 1557'!$B$33=\"\",\"\",'ASTM 1557'!$B$33)","v":"Percent Water Content, (%) :"},{"$f":"IF('ASTM 1557'!$E$30=\"\",\"\",'ASTM 1557'!$E$30)","v":"1-2"}]
[111,{"$f":"IF('ASTM 1557'!$F$33=\"\",\"\",'ASTM 1557'!$F$33)","v":""},{"$f":"IF( 'ASTM 1557'!$B$6=\"\",\"\", 'ASTM 1557'!$B$6)","v":"ASTM D1557"},{"$f":"IF('ASTM 1557'!$B$33=\"\",\"\",'ASTM 1557'!$B$33)","v":"Percent Water Content, (%) :"},{"$f":"IF('ASTM 1557'!$F$30=\"\",\"\",'ASTM 1557'!$F$30)","v":"1-3"}]
[112,{"$f":"IF('ASTM 1557'!$G$33=\"\",\"\",'ASTM 1557'!$G$33)","v":""},{"$f":"IF( 'ASTM 1557'!$B$6=\"\",\"\", 'ASTM 1557'!$B$6)","v":"ASTM D1557"},{"$f":"IF('ASTM 1557'!$B$33=\"\",\"\",'ASTM 1557'!$B$33)","v":"Percent Water Content, (%) :"},{"$f":"IF('ASTM 1557'!$G$30=\"\",\"\",'ASTM 1557'!$G$30)","v":"1-4"}]
[113,{"$f":"IF('ASTM 1557'!$I$33=\"\",\"\",'ASTM 1557'!$I$33)","v":""},{"$f":"IF( 'ASTM 1557'!$B$6=\"\",\"\", 'ASTM 1557'!$B$6)","v":"ASTM D1557"},{"$f":"IF('ASTM 1557'!$B$33=\"\",\"\",'ASTM 1557'!$B$33)","v":"Percent Water Content, (%) :"},{"$f":"IF('ASTM 1557'!$I$30=\"\",\"\",'ASTM 1557'!$I$30)","v":"2-1"}]
[114,{"$f":"IF('ASTM 1557'!$J$33=\"\",\"\",'ASTM 1557'!$J$33)","v":""},{"$f":"IF( 'ASTM 1557'!$B$6=\"\",\"\", 'ASTM 1557'!$B$6)","v":"ASTM D1557"},{"$f":"IF('ASTM 1557'!$B$33=\"\",\"\",'ASTM 1557'!$B$33)","v":"Percent Water Content, (%) :"},{"$f":"IF('ASTM 1557'!$J$30=\"\",\"\",'ASTM 1557'!$J$30)","v":"2-2"}]
[115,{"$f":"IF('ASTM 1557'!$K$33=\"\",\"\",'ASTM 1557'!$K$33)","v":""},{"$f":"IF( 'ASTM 1557'!$B$6=\"\",\"\", 'ASTM 1557'!$B$6)","v":"ASTM D1557"},{"$f":"IF('ASTM 1557'!$B$33=\"\",\"\",'ASTM 1557'!$B$33)","v":"Percent Water Content, (%) :"},{"$f":"IF('ASTM 1557'!$K$30=\"\",\"\",'ASTM 1557'!$K$30)","v":"2-3"}]
[116,{"$f":"IF('ASTM 1557'!$L$33=\"\",\"\",'ASTM 1557'!$L$33)","v":""},{"$f":"IF( 'ASTM 1557'!$B$6=\"\",\"\", 'ASTM 1557'!$B$6)","v":"ASTM D1557"},{"$f":"IF('ASTM 1557'!$B$33=\"\",\"\",'ASTM 1557'!$B$33)","v":"Percent Water Content, (%) :"},{"$f":"IF('ASTM 1557'!$L$30=\"\",\"\",'ASTM 1557'!$L$30)","v":"2-4"}]
[117,{"$f":"IF('ASTM 1557'!$N$33=\"\",\"\",'ASTM 1557'!$N$33)","v":""},{"$f":"IF( 'ASTM 1557'!$B$6=\"\",\"\", 'ASTM 1557'!$B$6)","v":"ASTM D1557"},{"$f":"IF('ASTM 1557'!$B$33=\"\",\"\",'ASTM 1557'!$B$33)","v":"Percent Water Content, (%) :"},{"$f":"IF('ASTM 1557'!$N$30=\"\",\"\",'ASTM 1557'!$N$30)","v":"3-1"}]
[118,{"$f":"IF('ASTM 1557'!$O$33=\"\",\"\",'ASTM 1557'!$O$33)","v":""},{"$f":"IF( 'ASTM 1557'!$B$6=\"\",\"\", 'ASTM 1557'!$B$6)","v":"ASTM D1557"},{"$f":"IF('ASTM 1557'!$B$33=\"\",\"\",'ASTM 1557'!$B$33)","v":"Percent Water Content, (%) :"},{"$f":"IF('ASTM 1557'!$O$30=\"\",\"\",'ASTM 1557'!$O$30)","v":"3-2"}]
[119,{"$f":"IF('ASTM 1557'!$P$33=\"\",\"\",'ASTM 1557'!$P$33)","v":""},{"$f":"IF( 'ASTM 1557'!$B$6=\"\",\"\", 'ASTM 1557'!$B$6)","v":"ASTM D1557"},{"$f":"IF('ASTM 1557'!$B$33=\"\",\"\",'ASTM 1557'!$B$33)","v":"Percent Water Content, (%) :"},{"$f":"IF('ASTM 1557'!$P$30=\"\",\"\",'ASTM 1557'!$P$30)","v":"3-3"}]
[120,{"$f":"IF('ASTM 1557'!$Q$33=\"\",\"\",'ASTM 1557'!$Q$33)","v":""},{"$f":"IF( 'ASTM 1557'!$B$6=\"\",\"\", 'ASTM 1557'!$B$6)","v":"ASTM D1557"},{"$f":"IF('ASTM 1557'!$B$33=\"\",\"\",'ASTM 1557'!$B$33)","v":"Percent Water Content, (%) :"},{"$f":"IF('ASTM 1557'!$Q$30=\"\",\"\",'ASTM 1557'!$Q$30)","v":"3-4"}]
[121,{"$f":"IF('ASTM 1557'!$D$35=\"\",\"\",'ASTM 1557'!$D$35)","v":""},{"$f":"IF( 'ASTM 1557'!$B$6=\"\",\"\", 'ASTM 1557'!$B$6)","v":"ASTM D1557"},{"$f":"IF('ASTM 1557'!$B$35=\"\",\"\",'ASTM 1557'!$B$35)","v":"Mass of Dry Aggregate, (lb) :"},{"$f":"IF('ASTM 1557'!$D$30=\"\",\"\",'ASTM 1557'!$D$30)","v":"1-1"}]
[122,{"$f":"IF('ASTM 1557'!$E$35=\"\",\"\",'ASTM 1557'!$E$35)","v":""},{"$f":"IF( 'ASTM 1557'!$B$6=\"\",\"\", 'ASTM 1557'!$B$6)","v":"ASTM D1557"},{"$f":"IF('ASTM 1557'!$B$35=\"\",\"\",'ASTM 1557'!$B$35)","v":"Mass of Dry Aggregate, (lb) :"},{"$f":"IF('ASTM 1557'!$E$30=\"\",\"\",'ASTM 1557'!$E$30)","v":"1-2"}]
[123,{"$f":"IF('ASTM 1557'!$F$35=\"\",\"\",'ASTM 1557'!$F$35)","v":""},{"$f":"IF( 'ASTM 1557'!$B$6=\"\",\"\", 'ASTM 1557'!$B$6)","v":"ASTM D1557"},{"$f":"IF('ASTM 1557'!$B$35=\"\",\"\",'ASTM 1557'!$B$35)","v":"Mass of Dry Aggregate, (lb) :"},{"$f":"IF('ASTM 1557'!$F$30=\"\",\"\",'ASTM 1557'!$F$30)","v":"1-3"}]
[124,{"$f":"IF('ASTM 1557'!$G$35=\"\",\"\",'ASTM 1557'!$G$35)","v":""},{"$f":"IF( 'ASTM 1557'!$B$6=\"\",\"\", 'ASTM 1557'!$B$6)","v":"ASTM D1557"},{"$f":"IF('ASTM 1557'!$B$35=\"\",\"\",'ASTM 1557'!$B$35)","v":"Mass of Dry Aggregate, (lb) :"},{"$f":"IF('ASTM 1557'!$G$30=\"\",\"\",'ASTM 1557'!$G$30)","v":"1-4"}]
[125,{"$f":"IF('ASTM 1557'!$I$35=\"\",\"\",'ASTM 1557'!$I$35)","v":""},{"$f":"IF( 'ASTM 1557'!$B$6=\"\",\"\", 'ASTM 1557'!$B$6)","v":"ASTM D1557"},{"$f":"IF('ASTM 1557'!$B$35=\"\",\"\",'ASTM 1557'!$B$35)","v":"Mass of Dry Aggregate, (lb) :"},{"$f":"IF('ASTM 1557'!$I$30=\"\",\"\",'ASTM 1557'!$I$30)","v":"2-1"}]
[126,{"$f":"IF('ASTM 1557'!$J$35=\"\",\"\",'ASTM 1557'!$J$35)","v":""},{"$f":"IF( 'ASTM 1557'!$B$6=\"\",\"\", 'ASTM 1557'!$B$6)","v":"ASTM D1557"},{"$f":"IF('ASTM 1557'!$B$35=\"\",\"\",'ASTM 1557'!$B$35)","v":"Mass of Dry Aggregate, (lb) :"},{"$f":"IF('ASTM 1557'!$J$30=\"\",\"\",'ASTM 1557'!$J$30)","v":"2-2"}]
[127,{"$f":"IF('ASTM 1557'!$K$35=\"\",\"\",'ASTM 1557'!$K$35)","v":""},{"$f":"IF( 'ASTM 1557'!$B$6=\"\",\"\", 'ASTM 1557'!$B$6)","v":"ASTM D1557"},{"$f":"IF('ASTM 1557'!$B$35=\"\",\"\",'ASTM 1557'!$B$35)","v":"Mass of Dry Aggregate, (lb) :"},{"$f":"IF('ASTM 1557'!$K$30=\"\",\"\",'ASTM 1557'!$K$30)","v":"2-3"}]
[128,{"$f":"IF('ASTM 1557'!$L$35=\"\",\"\",'ASTM 1557'!$L$35)","v":""},{"$f":"IF( 'ASTM 1557'!$B$6=\"\",\"\", 'ASTM 1557'!$B$6)","v":"ASTM D1557"},{"$f":"IF('ASTM 1557'!$B$35=\"\",\"\",'ASTM 1557'!$B$35)","v":"Mass of Dry Aggregate, (lb) :"},{"$f":"IF('ASTM 1557'!$L$30=\"\",\"\",'ASTM 1557'!$L$30)","v":"2-4"}]
[129,{"$f":"IF('ASTM 1557'!$N$35=\"\",\"\",'ASTM 1557'!$N$35)","v":""},{"$f":"IF( 'ASTM 1557'!$B$6=\"\",\"\", 'ASTM 1557'!$B$6)","v":"ASTM D1557"},{"$f":"IF('ASTM 1557'!$B$35=\"\",\"\",'ASTM 1557'!$B$35)","v":"Mass of Dry Aggregate, (lb) :"},{"$f":"IF('ASTM 1557'!$N$30=\"\",\"\",'ASTM 1557'!$N$30)","v":"3-1"}]
[130,{"$f":"IF('ASTM 1557'!$O$35=\"\",\"\",'ASTM 1557'!$O$35)","v":""},{"$f":"IF( 'ASTM 1557'!$B$6=\"\",\"\", 'ASTM 1557'!$B$6)","v":"ASTM D1557"},{"$f":"IF('ASTM 1557'!$B$35=\"\",\"\",'ASTM 1557'!$B$35)","v":"Mass of Dry Aggregate, (lb) :"},{"$f":"IF('ASTM 1557'!$O$30=\"\",\"\",'ASTM 1557'!$O$30)","v":"3-2"}]
[131,{"$f":"IF('ASTM 1557'!$P$35=\"\",\"\",'ASTM 1557'!$P$35)","v":""},{"$f":"IF( 'ASTM 1557'!$B$6=\"\",\"\", 'ASTM 1557'!$B$6)","v":"ASTM D1557"},{"$f":"IF('ASTM 1557'!$B$35=\"\",\"\",'ASTM 1557'!$B$35)","v":"Mass of Dry Aggregate, (lb) :"},{"$f":"IF('ASTM 1557'!$P$30=\"\",\"\",'ASTM 1557'!$P$30)","v":"3-3"}]
[132,{"$f":"IF('ASTM 1557'!$Q$35=\"\",\"\",'ASTM 1557'!$Q$35)","v":""},{"$f":"IF( 'ASTM 1557'!$B$6=\"\",\"\", 'ASTM 1557'!$B$6)","v":"ASTM D1557"},{"$f":"IF('ASTM 1557'!$B$35=\"\",\"\",'ASTM 1557'!$B$35)","v":"Mass of Dry Aggregate, (lb) :"},{"$f":"IF('ASTM 1557'!$Q$30=\"\",\"\",'ASTM 1557'!$Q$30)","v":"3-4"}]
[133,{"$f":"IF('ASTM 1557'!$D$36=\"\",\"\",'ASTM 1557'!$D$36)","v":""},{"$f":"IF( 'ASTM 1557'!$B$6=\"\",\"\", 'ASTM 1557'!$B$6)","v":"ASTM D1557"},{"$f":"IF('ASTM 1557'!$B$36=\"\",\"\",'ASTM 1557'!$B$36)","v":"Total Mass of Cementitios Materials, (lb) :"},{"$f":"IF('ASTM 1557'!$D$30=\"\",\"\",'ASTM 1557'!$D$30)","v":"1-1"}]
[134,{"$f":"IF('ASTM 1557'!$E$36=\"\",\"\",'ASTM 1557'!$E$36)","v":""},{"$f":"IF( 'ASTM 1557'!$B$6=\"\",\"\", 'ASTM 1557'!$B$6)","v":"ASTM D1557"},{"$f":"IF('ASTM 1557'!$B$36=\"\",\"\",'ASTM 1557'!$B$36)","v":"Total Mass of Cementitios Materials, (lb) :"},{"$f":"IF('ASTM 1557'!$E$30=\"\",\"\",'ASTM 1557'!$E$30)","v":"1-2"}]
[135,{"$f":"IF('ASTM 1557'!$F$36=\"\",\"\",'ASTM 1557'!$F$36)","v":""},{"$f":"IF( 'ASTM 1557'!$B$6=\"\",\"\", 'ASTM 1557'!$B$6)","v":"ASTM D1557"},{"$f":"IF('ASTM 1557'!$B$36=\"\",\"\",'ASTM 1557'!$B$36)","v":"Total Mass of Cementitios Materials, (lb) :"},{"$f":"IF('ASTM 1557'!$F$30=\"\",\"\",'ASTM 1557'!$F$30)","v":"1-3"}]
[136,{"$f":"IF('ASTM 1557'!$G$36=\"\",\"\",'ASTM 1557'!$G$36)","v":""},{"$f":"IF( 'ASTM 1557'!$B$6=\"\",\"\", 'ASTM 1557'!$B$6)","v":"ASTM D1557"},{"$f":"IF('ASTM 1557'!$B$36=\"\",\"\",'ASTM 1557'!$B$36)","v":"Total Mass of Cementitios Materials, (lb) :"},{"$f":"IF('ASTM 1557'!$G$30=\"\",\"\",'ASTM 1557'!$G$30)","v":"1-4"}]
[137,{"$f":"IF('ASTM 1557'!$I$36=\"\",\"\",'ASTM 1557'!$I$36)","v":""},{"$f":"IF( 'ASTM 1557'!$B$6=\"\",\"\", 'ASTM 1557'!$B$6)","v":"ASTM D1557"},{"$f":"IF('ASTM 1557'!$B$36=\"\",\"\",'ASTM 1557'!$B$36)","v":"Total Mass of Cementitios Materials, (lb) :"},{"$f":"IF('ASTM 1557'!$I$30=\"\",\"\",'ASTM 1557'!$I$30)","v":"2-1"}]
[138,{"$f":"IF('ASTM 1557'!$J$36=\"\",\"\",'ASTM 1557'!$J$36)","v":""},{"$f":"IF( 'ASTM 1557'!$B$6=\"\",\"\", 'ASTM 1557'!$B$6)","v":"ASTM D1557"},{"$f":"IF('ASTM 1557'!$B$36=\"\",\"\",'ASTM 1557'!$B$36)","v":"Total Mass of Cementitios Materials, (lb) :"},{"$f":"IF('ASTM 1557'!$J$30=\"\",\"\",'ASTM 1557'!$J$30)","v":"2-2"}]
[139,{"$f":"IF('ASTM 1557'!$K$36=\"\",\"\",'ASTM 1557'!$K$36)","v":""},{"$f":"IF( 'ASTM 1557'!$B$6=\"\",\"\", 'ASTM 1557'!$B$6)","v":"ASTM D1557"},{"$f":"IF('ASTM 1557'!$B$36=\"\",\"\",'ASTM 1557'!$B$36)","v":"Total Mass of Cementitios Materials, (lb) :"},{"$f":"IF('ASTM 1557'!$K$30=\"\",\"\",'ASTM 1557'!$K$30)","v":"2-3"}]
[140,{"$f":"IF('ASTM 1557'!$L$36=\"\",\"\",'ASTM 1557'!$L$36)","v":""},{"$f":"IF( 'ASTM 1557'!$B$6=\"\",\"\", 'ASTM 1557'!$B$6)","v":"ASTM D1557"},{"$f":"IF('ASTM 1557'!$B$36=\"\",\"\",'ASTM 1557'!$B$36)","v":"Total Mass of Cementitios Materials, (lb) :"},{"$f":"IF('ASTM 1557'!$L$30=\"\",\"\",'ASTM 1557'!$L$30)","v":"2-4"}]
[141,{"$f":"IF('ASTM 1557'!$N$36=\"\",\"\",'ASTM 1557'!$N$36)","v":""},{"$f":"IF( 'ASTM 1557'!$B$6=\"\",\"\", 'ASTM 1557'!$B$6)","v":"ASTM D1557"},{"$f":"IF('ASTM 1557'!$B$36=\"\",\"\",'ASTM 1557'!$B$36)","v":"Total Mass of Cementitios Materials, (lb) :"},{"$f":"IF('ASTM 1557'!$N$30=\"\",\"\",'ASTM 1557'!$N$30)","v":"3-1"}]
[142,{"$f":"IF('ASTM 1557'!$O$36=\"\",\"\",'ASTM 1557'!$O$36)","v":""},{"$f":"IF( 'ASTM 1557'!$B$6=\"\",\"\", 'ASTM 1557'!$B$6)","v":"ASTM D1557"},{"$f":"IF('ASTM 1557'!$B$36=\"\",\"\",'ASTM 1557'!$B$36)","v":"Total Mass of Cementitios Materials, (lb) :"},{"$f":"IF('ASTM 1557'!$O$30=\"\",\"\",'ASTM 1557'!$O$30)","v":"3-2"}]
[143,{"$f":"IF('ASTM 1557'!$P$36=\"\",\"\",'ASTM 1557'!$P$36)","v":""},{"$f":"IF( 'ASTM 1557'!$B$6=\"\",\"\", 'ASTM 1557'!$B$6)","v":"ASTM D1557"},{"$f":"IF('ASTM 1557'!$B$36=\"\",\"\",'ASTM 1557'!$B$36)","v":"Total Mass of Cementitios Materials, (lb) :"},{"$f":"IF('ASTM 1557'!$P$30=\"\",\"\",'ASTM 1557'!$P$30)","v":"3-3"}]
[144,{"$f":"IF('ASTM 1557'!$Q$36=\"\",\"\",'ASTM 1557'!$Q$36)","v":""},{"$f":"IF( 'ASTM 1557'!$B$6=\"\",\"\", 'ASTM 1557'!$B$6)","v":"ASTM D1557"},{"$f":"IF('ASTM 1557'!$B$36=\"\",\"\",'ASTM 1557'!$B$36)","v":"Total Mass of Cementitios Materials, (lb) :"},{"$f":"IF('ASTM 1557'!$Q$30=\"\",\"\",'ASTM 1557'!$Q$30)","v":"3-4"}]
[145,{"$f":"IF('ASTM 1557'!$D$37=\"\",\"\",'ASTM 1557'!$D$37)","v":""},{"$f":"IF( 'ASTM 1557'!$B$6=\"\",\"\", 'ASTM 1557'!$B$6)","v":"ASTM D1557"},{"$f":"IF('ASTM 1557'!$B$37=\"\",\"\",'ASTM 1557'!$B$37)","v":"Total Mass of Dry Material, (lb) :"},{"$f":"IF('ASTM 1557'!$D$30=\"\",\"\",'ASTM 1557'!$D$30)","v":"1-1"}]
[146,{"$f":"IF('ASTM 1557'!$E$37=\"\",\"\",'ASTM 1557'!$E$37)","v":""},{"$f":"IF( 'ASTM 1557'!$B$6=\"\",\"\", 'ASTM 1557'!$B$6)","v":"ASTM D1557"},{"$f":"IF('ASTM 1557'!$B$37=\"\",\"\",'ASTM 1557'!$B$37)","v":"Total Mass of Dry Material, (lb) :"},{"$f":"IF('ASTM 1557'!$E$30=\"\",\"\",'ASTM 1557'!$E$30)","v":"1-2"}]
[147,{"$f":"IF('ASTM 1557'!$F$37=\"\",\"\",'ASTM 1557'!$F$37)","v":""},{"$f":"IF( 'ASTM 1557'!$B$6=\"\",\"\", 'ASTM 1557'!$B$6)","v":"ASTM D1557"},{"$f":"IF('ASTM 1557'!$B$37=\"\",\"\",'ASTM 1557'!$B$37)","v":"Total Mass of Dry Material, (lb) :"},{"$f":"IF('ASTM 1557'!$F$30=\"\",\"\",'ASTM 1557'!$F$30)","v":"1-3"}]
[148,{"$f":"IF('ASTM 1557'!$G$37=\"\",\"\",'ASTM 1557'!$G$37)","v":""},{"$f":"IF( 'ASTM 1557'!$B$6=\"\",\"\", 'ASTM 1557'!$B$6)","v":"ASTM D1557"},{"$f":"IF('ASTM 1557'!$B$37=\"\",\"\",'ASTM 1557'!$B$37)","v":"Total Mass of Dry Material, (lb) :"},{"$f":"IF('ASTM 1557'!$G$30=\"\",\"\",'ASTM 1557'!$G$30)","v":"1-4"}]
[149,{"$f":"IF('ASTM 1557'!$I$37=\"\",\"\",'ASTM 1557'!$I$37)","v":""},{"$f":"IF( 'ASTM 1557'!$B$6=\"\",\"\", 'ASTM 1557'!$B$6)","v":"ASTM D1557"},{"$f":"IF('ASTM 1557'!$B$37=\"\",\"\",'ASTM 1557'!$B$37)","v":"Total Mass of Dry Material, (lb) :"},{"$f":"IF('ASTM 1557'!$I$30=\"\",\"\",'ASTM 1557'!$I$30)","v":"2-1"}]
[150,{"$f":"IF('ASTM 1557'!$J$37=\"\",\"\",'ASTM 1557'!$J$37)","v":""},{"$f":"IF( 'ASTM 1557'!$B$6=\"\",\"\", 'ASTM 1557'!$B$6)","v":"ASTM D1557"},{"$f":"IF('ASTM 1557'!$B$37=\"\",\"\",'ASTM 1557'!$B$37)","v":"Total Mass of Dry Material, (lb) :"},{"$f":"IF('ASTM 1557'!$J$30=\"\",\"\",'ASTM 1557'!$J$30)","v":"2-2"}]
[151,{"$f":"IF('ASTM 1557'!$K$37=\"\",\"\",'ASTM 1557'!$K$37)","v":""},{"$f":"IF( 'ASTM 1557'!$B$6=\"\",\"\", 'ASTM 1557'!$B$6)","v":"ASTM D1557"},{"$f":"IF('ASTM 1557'!$B$37=\"\",\"\",'ASTM 1557'!$B$37)","v":"Total Mass of Dry Material, (lb) :"},{"$f":"IF('ASTM 1557'!$K$30=\"\",\"\",'ASTM 1557'!$K$30)","v":"2-3"}]
[152,{"$f":"IF('ASTM 1557'!$L$37=\"\",\"\",'ASTM 1557'!$L$37)","v":""},{"$f":"IF( 'ASTM 1557'!$B$6=\"\",\"\", 'ASTM 1557'!$B$6)","v":"ASTM D1557"},{"$f":"IF('ASTM 1557'!$B$37=\"\",\"\",'ASTM 1557'!$B$37)","v":"Total Mass of Dry Material, (lb) :"},{"$f":"IF('ASTM 1557'!$L$30=\"\",\"\",'ASTM 1557'!$L$30)","v":"2-4"}]
[153,{"$f":"IF('ASTM 1557'!$N$37=\"\",\"\",'ASTM 1557'!$N$37)","v":""},{"$f":"IF( 'ASTM 1557'!$B$6=\"\",\"\", 'ASTM 1557'!$B$6)","v":"ASTM D1557"},{"$f":"IF('ASTM 1557'!$B$37=\"\",\"\",'ASTM 1557'!$B$37)","v":"Total Mass of Dry Material, (lb) :"},{"$f":"IF('ASTM 1557'!$N$30=\"\",\"\",'ASTM 1557'!$N$30)","v":"3-1"}]
[154,{"$f":"IF('ASTM 1557'!$O$37=\"\",\"\",'ASTM 1557'!$O$37)","v":""},{"$f":"IF( 'ASTM 1557'!$B$6=\"\",\"\", 'ASTM 1557'!$B$6)","v":"ASTM D1557"},{"$f":"IF('ASTM 1557'!$B$37=\"\",\"\",'ASTM 1557'!$B$37)","v":"Total Mass of Dry Material, (lb) :"},{"$f":"IF('ASTM 1557'!$O$30=\"\",\"\",'ASTM 1557'!$O$30)","v":"3-2"}]
[155,{"$f":"IF('ASTM 1557'!$P$37=\"\",\"\",'ASTM 1557'!$P$37)","v":""},{"$f":"IF( 'ASTM 1557'!$B$6=\"\",\"\", 'ASTM 1557'!$B$6)","v":"ASTM D1557"},{"$f":"IF('ASTM 1557'!$B$37=\"\",\"\",'ASTM 1557'!$B$37)","v":"Total Mass of Dry Material, (lb) :"},{"$f":"IF('ASTM 1557'!$P$30=\"\",\"\",'ASTM 1557'!$P$30)","v":"3-3"}]
[156,{"$f":"IF('ASTM 1557'!$Q$37=\"\",\"\",'ASTM 1557'!$Q$37)","v":""},{"$f":"IF( 'ASTM 1557'!$B$6=\"\",\"\", 'ASTM 1557'!$B$6)","v":"ASTM D1557"},{"$f":"IF('ASTM 1557'!$B$37=\"\",\"\",'ASTM 1557'!$B$37)","v":"Total Mass of Dry Material, (lb) :"},{"$f":"IF('ASTM 1557'!$Q$30=\"\",\"\",'ASTM 1557'!$Q$30)","v":"3-4"}]
[157,{"$f":"IF('ASTM 1557'!$D$38=\"\",\"\",'ASTM 1557'!$D$38)","v":""},{"$f":"IF( 'ASTM 1557'!$B$6=\"\",\"\", 'ASTM 1557'!$B$6)","v":"ASTM D1557"},{"$f":"IF('ASTM 1557'!$B$38=\"\",\"\",'ASTM 1557'!$B$38)","v":"Mass Water Added, (lb) :"},{"$f":"IF('ASTM 1557'!$D$30=\"\",\"\",'ASTM 1557'!$D$30)","v":"1-1"}]
[158,{"$f":"IF('ASTM 1557'!$E$38=\"\",\"\",'ASTM 1557'!$E$38)","v":""},{"$f":"IF( 'ASTM 1557'!$B$6=\"\",\"\", 'ASTM 1557'!$B$6)","v":"ASTM D1557"},{"$f":"IF('ASTM 1557'!$B$38=\"\",\"\",'ASTM 1557'!$B$38)","v":"Mass Water Added, (lb) :"},{"$f":"IF('ASTM 1557'!$E$30=\"\",\"\",'ASTM 1557'!$E$30)","v":"1-2"}]
[159,{"$f":"IF('ASTM 1557'!$F$38=\"\",\"\",'ASTM 1557'!$F$38)","v":""},{"$f":"IF( 'ASTM 1557'!$B$6=\"\",\"\", 'ASTM 1557'!$B$6)","v":"ASTM D1557"},{"$f":"IF('ASTM 1557'!$B$38=\"\",\"\",'ASTM 1557'!$B$38)","v":"Mass Water Added, (lb) :"},{"$f":"IF('ASTM 1557'!$F$30=\"\",\"\",'ASTM 1557'!$F$30)","v":"1-3"}]
[160,{"$f":"IF('ASTM 1557'!$G$38=\"\",\"\",'ASTM 1557'!$G$38)","v":""},{"$f":"IF( 'ASTM 1557'!$B$6=\"\",\"\", 'ASTM 1557'!$B$6)","v":"ASTM D1557"},{"$f":"IF('ASTM 1557'!$B$38=\"\",\"\",'ASTM 1557'!$B$38)","v":"Mass Water Added, (lb) :"},{"$f":"IF('ASTM 1557'!$G$30=\"\",\"\",'ASTM 1557'!$G$30)","v":"1-4"}]
[161,{"$f":"IF('ASTM 1557'!$I$38=\"\",\"\",'ASTM 1557'!$I$38)","v":""},{"$f":"IF( 'ASTM 1557'!$B$6=\"\",\"\", 'ASTM 1557'!$B$6)","v":"ASTM D1557"},{"$f":"IF('ASTM 1557'!$B$38=\"\",\"\",'ASTM 1557'!$B$38)","v":"Mass Water Added, (lb) :"},{"$f":"IF('ASTM 1557'!$I$30=\"\",\"\",'ASTM 1557'!$I$30)","v":"2-1"}]
[162,{"$f":"IF('ASTM 1557'!$J$38=\"\",\"\",'ASTM 1557'!$J$38)","v":""},{"$f":"IF( 'ASTM 1557'!$B$6=\"\",\"\", 'ASTM 1557'!$B$6)","v":"ASTM D1557"},{"$f":"IF('ASTM 1557'!$B$38=\"\",\"\",'ASTM 1557'!$B$38)","v":"Mass Water Added, (lb) :"},{"$f":"IF('ASTM 1557'!$J$30=\"\",\"\",'ASTM 1557'!$J$30)","v":"2-2"}]
[163,{"$f":"IF('ASTM 1557'!$K$38=\"\",\"\",'ASTM 1557'!$K$38)","v":""},{"$f":"IF( 'ASTM 1557'!$B$6=\"\",\"\", 'ASTM 1557'!$B$6)","v":"ASTM D1557"},{"$f":"IF('ASTM 1557'!$B$38=\"\",\"\",'ASTM 1557'!$B$38)","v":"Mass Water Added, (lb) :"},{"$f":"IF('ASTM 1557'!$K$30=\"\",\"\",'ASTM 1557'!$K$30)","v":"2-3"}]
[164,{"$f":"IF('ASTM 1557'!$L$38=\"\",\"\",'ASTM 1557'!$L$38)","v":""},{"$f":"IF( 'ASTM 1557'!$B$6=\"\",\"\", 'ASTM 1557'!$B$6)","v":"ASTM D1557"},{"$f":"IF('ASTM 1557'!$B$38=\"\",\"\",'ASTM 1557'!$B$38)","v":"Mass Water Added, (lb) :"},{"$f":"IF('ASTM 1557'!$L$30=\"\",\"\",'ASTM 1557'!$L$30)","v":"2-4"}]
[165,{"$f":"IF('ASTM 1557'!$N$38=\"\",\"\",'ASTM 1557'!$N$38)","v":""},{"$f":"IF( 'ASTM 1557'!$B$6=\"\",\"\", 'ASTM 1557'!$B$6)","v":"ASTM D1557"},{"$f":"IF('ASTM 1557'!$B$38=\"\",\"\",'ASTM 1557'!$B$38)","v":"Mass Water Added, (lb) :"},{"$f":"IF('ASTM 1557'!$N$30=\"\",\"\",'ASTM 1557'!$N$30)","v":"3-1"}]
[166,{"$f":"IF('ASTM 1557'!$O$38=\"\",\"\",'ASTM 1557'!$O$38)","v":""},{"$f":"IF( 'ASTM 1557'!$B$6=\"\",\"\", 'ASTM 1557'!$B$6)","v":"ASTM D1557"},{"$f":"IF('ASTM 1557'!$B$38=\"\",\"\",'ASTM 1557'!$B$38)","v":"Mass Water Added, (lb) :"},{"$f":"IF('ASTM 1557'!$O$30=\"\",\"\",'ASTM 1557'!$O$30)","v":"3-2"}]
[167,{"$f":"IF('ASTM 1557'!$P$38=\"\",\"\",'ASTM 1557'!$P$38)","v":""},{"$f":"IF( 'ASTM 1557'!$B$6=\"\",\"\", 'ASTM 1557'!$B$6)","v":"ASTM D1557"},{"$f":"IF('ASTM 1557'!$B$38=\"\",\"\",'ASTM 1557'!$B$38)","v":"Mass Water Added, (lb) :"},{"$f":"IF('ASTM 1557'!$P$30=\"\",\"\",'ASTM 1557'!$P$30)","v":"3-3"}]
[168,{"$f":"IF('ASTM 1557'!$Q$38=\"\",\"\",'ASTM 1557'!$Q$38)","v":""},{"$f":"IF( 'ASTM 1557'!$B$6=\"\",\"\", 'ASTM 1557'!$B$6)","v":"ASTM D1557"},{"$f":"IF('ASTM 1557'!$B$38=\"\",\"\",'ASTM 1557'!$B$38)","v":"Mass Water Added, (lb) :"},{"$f":"IF('ASTM 1557'!$Q$30=\"\",\"\",'ASTM 1557'!$Q$30)","v":"3-4"}]
[169,{"$f":"IF('ASTM 1557'!$D$40=\"\",\"\",'ASTM 1557'!$D$40)","v":""},{"$f":"IF( 'ASTM 1557'!$B$6=\"\",\"\", 'ASTM 1557'!$B$6)","v":"ASTM D1557"},{"$f":"IF('ASTM 1557'!$B$40=\"\",\"\",'ASTM 1557'!$B$40)","v":"Wet Mass Specimen & Mold, (lb) :"},{"$f":"IF('ASTM 1557'!$D$30=\"\",\"\",'ASTM 1557'!$D$30)","v":"1-1"}]
[170,{"$f":"IF('ASTM 1557'!$E$40=\"\",\"\",'ASTM 1557'!$E$40)","v":""},{"$f":"IF( 'ASTM 1557'!$B$6=\"\",\"\", 'ASTM 1557'!$B$6)","v":"ASTM D1557"},{"$f":"IF('ASTM 1557'!$B$40=\"\",\"\",'ASTM 1557'!$B$40)","v":"Wet Mass Specimen & Mold, (lb) :"},{"$f":"IF('ASTM 1557'!$E$30=\"\",\"\",'ASTM 1557'!$E$30)","v":"1-2"}]
[171,{"$f":"IF('ASTM 1557'!$F$40=\"\",\"\",'ASTM 1557'!$F$40)","v":""},{"$f":"IF( 'ASTM 1557'!$B$6=\"\",\"\", 'ASTM 1557'!$B$6)","v":"ASTM D1557"},{"$f":"IF('ASTM 1557'!$B$40=\"\",\"\",'ASTM 1557'!$B$40)","v":"Wet Mass Specimen & Mold, (lb) :"},{"$f":"IF('ASTM 1557'!$F$30=\"\",\"\",'ASTM 1557'!$F$30)","v":"1-3"}]
[172,{"$f":"IF('ASTM 1557'!$G$40=\"\",\"\",'ASTM 1557'!$G$40)","v":""},{"$f":"IF( 'ASTM 1557'!$B$6=\"\",\"\", 'ASTM 1557'!$B$6)","v":"ASTM D1557"},{"$f":"IF('ASTM 1557'!$B$40=\"\",\"\",'ASTM 1557'!$B$40)","v":"Wet Mass Specimen & Mold, (lb) :"},{"$f":"IF('ASTM 1557'!$G$30=\"\",\"\",'ASTM 1557'!$G$30)","v":"1-4"}]
[173,{"$f":"IF('ASTM 1557'!$I$40=\"\",\"\",'ASTM 1557'!$I$40)","v":""},{"$f":"IF( 'ASTM 1557'!$B$6=\"\",\"\", 'ASTM 1557'!$B$6)","v":"ASTM D1557"},{"$f":"IF('ASTM 1557'!$B$40=\"\",\"\",'ASTM 1557'!$B$40)","v":"Wet Mass Specimen & Mold, (lb) :"},{"$f":"IF('ASTM 1557'!$I$30=\"\",\"\",'ASTM 1557'!$I$30)","v":"2-1"}]
[174,{"$f":"IF('ASTM 1557'!$J$40=\"\",\"\",'ASTM 1557'!$J$40)","v":""},{"$f":"IF( 'ASTM 1557'!$B$6=\"\",\"\", 'ASTM 1557'!$B$6)","v":"ASTM D1557"},{"$f":"IF('ASTM 1557'!$B$40=\"\",\"\",'ASTM 1557'!$B$40)","v":"Wet Mass Specimen & Mold, (lb) :"},{"$f":"IF('ASTM 1557'!$J$30=\"\",\"\",'ASTM 1557'!$J$30)","v":"2-2"}]
[175,{"$f":"IF('ASTM 1557'!$K$40=\"\",\"\",'ASTM 1557'!$K$40)","v":""},{"$f":"IF( 'ASTM 1557'!$B$6=\"\",\"\", 'ASTM 1557'!$B$6)","v":"ASTM D1557"},{"$f":"IF('ASTM 1557'!$B$40=\"\",\"\",'ASTM 1557'!$B$40)","v":"Wet Mass Specimen & Mold, (lb) :"},{"$f":"IF('ASTM 1557'!$K$30=\"\",\"\",'ASTM 1557'!$K$30)","v":"2-3"}]
[176,{"$f":"IF('ASTM 1557'!$L$40=\"\",\"\",'ASTM 1557'!$L$40)","v":""},{"$f":"IF( 'ASTM 1557'!$B$6=\"\",\"\", 'ASTM 1557'!$B$6)","v":"ASTM D1557"},{"$f":"IF('ASTM 1557'!$B$40=\"\",\"\",'ASTM 1557'!$B$40)","v":"Wet Mass Specimen & Mold, (lb) :"},{"$f":"IF('ASTM 1557'!$L$30=\"\",\"\",'ASTM 1557'!$L$30)","v":"2-4"}]
[177,{"$f":"IF('ASTM 1557'!$N$40=\"\",\"\",'ASTM 1557'!$N$40)","v":""},{"$f":"IF( 'ASTM 1557'!$B$6=\"\",\"\", 'ASTM 1557'!$B$6)","v":"ASTM D1557"},{"$f":"IF('ASTM 1557'!$B$40=\"\",\"\",'ASTM 1557'!$B$40)","v":"Wet Mass Specimen & Mold, (lb) :"},{"$f":"IF('ASTM 1557'!$N$30=\"\",\"\",'ASTM 1557'!$N$30)","v":"3-1"}]
[178,{"$f":"IF('ASTM 1557'!$O$40=\"\",\"\",'ASTM 1557'!$O$40)","v":""},{"$f":"IF( 'ASTM 1557'!$B$6=\"\",\"\", 'ASTM 1557'!$B$6)","v":"ASTM D1557"},{"$f":"IF('ASTM 1557'!$B$40=\"\",\"\",'ASTM 1557'!$B$40)","v":"Wet Mass Specimen & Mold, (lb) :"},{"$f":"IF('ASTM 1557'!$O$30=\"\",\"\",'ASTM 1557'!$O$30)","v":"3-2"}]
[179,{"$f":"IF('ASTM 1557'!$P$40=\"\",\"\",'ASTM 1557'!$P$40)","v":""},{"$f":"IF( 'ASTM 1557'!$B$6=\"\",\"\", 'ASTM 1557'!$B$6)","v":"ASTM D1557"},{"$f":"IF('ASTM 1557'!$B$40=\"\",\"\",'ASTM 1557'!$B$40)","v":"Wet Mass Specimen & Mold, (lb) :"},{"$f":"IF('ASTM 1557'!$P$30=\"\",\"\",'ASTM 1557'!$P$30)","v":"3-3"}]
[180,{"$f":"IF('ASTM 1557'!$Q$40=\"\",\"\",'ASTM 1557'!$Q$40)","v":""},{"$f":"IF( 'ASTM 1557'!$B$6=\"\",\"\", 'ASTM 1557'!$B$6)","v":"ASTM D1557"},{"$f":"IF('ASTM 1557'!$B$40=\"\",\"\",'ASTM 1557'!$B$40)","v":"Wet Mass Specimen & Mold, (lb) :"},{"$f":"IF('ASTM 1557'!$Q$30=\"\",\"\",'ASTM 1557'!$Q$30)","v":"3-4"}]
[181,{"$f":"IF('ASTM 1557'!$D$41=\"\",\"\",'ASTM 1557'!$D$41)","v":""},{"$f":"IF( 'ASTM 1557'!$B$6=\"\",\"\", 'ASTM 1557'!$B$6)","v":"ASTM D1557"},{"$f":"IF('ASTM 1557'!$B$41=\"\",\"\",'ASTM 1557'!$B$41)","v":"Mass of Mold, (lb):"},{"$f":"IF('ASTM 1557'!$D$30=\"\",\"\",'ASTM 1557'!$D$30)","v":"1-1"}]
[182,{"$f":"IF('ASTM 1557'!$E$41=\"\",\"\",'ASTM 1557'!$E$41)","v":""},{"$f":"IF( 'ASTM 1557'!$B$6=\"\",\"\", 'ASTM 1557'!$B$6)","v":"ASTM D1557"},{"$f":"IF('ASTM 1557'!$B$41=\"\",\"\",'ASTM 1557'!$B$41)","v":"Mass of Mold, (lb):"},{"$f":"IF('ASTM 1557'!$E$30=\"\",\"\",'ASTM 1557'!$E$30)","v":"1-2"}]
[183,{"$f":"IF('ASTM 1557'!$F$41=\"\",\"\",'ASTM 1557'!$F$41)","v":""},{"$f":"IF( 'ASTM 1557'!$B$6=\"\",\"\", 'ASTM 1557'!$B$6)","v":"ASTM D1557"},{"$f":"IF('ASTM 1557'!$B$41=\"\",\"\",'ASTM 1557'!$B$41)","v":"Mass of Mold, (lb):"},{"$f":"IF('ASTM 1557'!$F$30=\"\",\"\",'ASTM 1557'!$F$30)","v":"1-3"}]
[184,{"$f":"IF('ASTM 1557'!$G$41=\"\",\"\",'ASTM 1557'!$G$41)","v":""},{"$f":"IF( 'ASTM 1557'!$B$6=\"\",\"\", 'ASTM 1557'!$B$6)","v":"ASTM D1557"},{"$f":"IF('ASTM 1557'!$B$41=\"\",\"\",'ASTM 1557'!$B$41)","v":"Mass of Mold, (lb):"},{"$f":"IF('ASTM 1557'!$G$30=\"\",\"\",'ASTM 1557'!$G$30)","v":"1-4"}]
[185,{"$f":"IF('ASTM 1557'!$I$41=\"\",\"\",'ASTM 1557'!$I$41)","v":""},{"$f":"IF( 'ASTM 1557'!$B$6=\"\",\"\", 'ASTM 1557'!$B$6)","v":"ASTM D1557"},{"$f":"IF('ASTM 1557'!$B$41=\"\",\"\",'ASTM 1557'!$B$41)","v":"Mass of Mold, (lb):"},{"$f":"IF('ASTM 1557'!$I$30=\"\",\"\",'ASTM 1557'!$I$30)","v":"2-1"}]
[186,{"$f":"IF('ASTM 1557'!$J$41=\"\",\"\",'ASTM 1557'!$J$41)","v":""},{"$f":"IF( 'ASTM 1557'!$B$6=\"\",\"\", 'ASTM 1557'!$B$6)","v":"ASTM D1557"},{"$f":"IF('ASTM 1557'!$B$41=\"\",\"\",'ASTM 1557'!$B$41)","v":"Mass of Mold, (lb):"},{"$f":"IF('ASTM 1557'!$J$30=\"\",\"\",'ASTM 1557'!$J$30)","v":"2-2"}]
[187,{"$f":"IF('ASTM 1557'!$K$41=\"\",\"\",'ASTM 1557'!$K$41)","v":""},{"$f":"IF( 'ASTM 1557'!$B$6=\"\",\"\", 'ASTM 1557'!$B$6)","v":"ASTM D1557"},{"$f":"IF('ASTM 1557'!$B$41=\"\",\"\",'ASTM 1557'!$B$41)","v":"Mass of Mold, (lb):"},{"$f":"IF('ASTM 1557'!$K$30=\"\",\"\",'ASTM 1557'!$K$30)","v":"2-3"}]
[188,{"$f":"IF('ASTM 1557'!$L$41=\"\",\"\",'ASTM 1557'!$L$41)","v":""},{"$f":"IF( 'ASTM 1557'!$B$6=\"\",\"\", 'ASTM 1557'!$B$6)","v":"ASTM D1557"},{"$f":"IF('ASTM 1557'!$B$41=\"\",\"\",'ASTM 1557'!$B$41)","v":"Mass of Mold, (lb):"},{"$f":"IF('ASTM 1557'!$L$30=\"\",\"\",'ASTM 1557'!$L$30)","v":"2-4"}]
[189,{"$f":"IF('ASTM 1557'!$N$41=\"\",\"\",'ASTM 1557'!$N$41)","v":""},{"$f":"IF( 'ASTM 1557'!$B$6=\"\",\"\", 'ASTM 1557'!$B$6)","v":"ASTM D1557"},{"$f":"IF('ASTM 1557'!$B$41=\"\",\"\",'ASTM 1557'!$B$41)","v":"Mass of Mold, (lb):"},{"$f":"IF('ASTM 1557'!$N$30=\"\",\"\",'ASTM 1557'!$N$30)","v":"3-1"}]
[190,{"$f":"IF('ASTM 1557'!$O$41=\"\",\"\",'ASTM 1557'!$O$41)","v":""},{"$f":"IF( 'ASTM 1557'!$B$6=\"\",\"\", 'ASTM 1557'!$B$6)","v":"ASTM D1557"},{"$f":"IF('ASTM 1557'!$B$41=\"\",\"\",'ASTM 1557'!$B$41)","v":"Mass of Mold, (lb):"},{"$f":"IF('ASTM 1557'!$O$30=\"\",\"\",'ASTM 1557'!$O$30)","v":"3-2"}]
[191,{"$f":"IF('ASTM 1557'!$P$41=\"\",\"\",'ASTM 1557'!$P$41)","v":""},{"$f":"IF( 'ASTM 1557'!$B$6=\"\",\"\", 'ASTM 1557'!$B$6)","v":"ASTM D1557"},{"$f":"IF('ASTM 1557'!$B$41=\"\",\"\",'ASTM 1557'!$B$41)","v":"Mass of Mold, (lb):"},{"$f":"IF('ASTM 1557'!$P$30=\"\",\"\",'ASTM 1557'!$P$30)","v":"3-3"}]
[192,{"$f":"IF('ASTM 1557'!$Q$41=\"\",\"\",'ASTM 1557'!$Q$41)","v":""},{"$f":"IF( 'ASTM 1557'!$B$6=\"\",\"\", 'ASTM 1557'!$B$6)","v":"ASTM D1557"},{"$f":"IF('ASTM 1557'!$B$41=\"\",\"\",'ASTM 1557'!$B$41)","v":"Mass of Mold, (lb):"},{"$f":"IF('ASTM 1557'!$Q$30=\"\",\"\",'ASTM 1557'!$Q$30)","v":"3-4"}]
[193,{"$f":"IF('ASTM 1557'!$D$42=\"\",\"\",'ASTM 1557'!$D$42)","v":""},{"$f":"IF( 'ASTM 1557'!$B$6=\"\",\"\", 'ASTM 1557'!$B$6)","v":"ASTM D1557"},{"$f":"IF('ASTM 1557'!$B$42=\"\",\"\",'ASTM 1557'!$B$42)","v":""},{"$f":"IF('ASTM 1557'!$D$30=\"\",\"\",'ASTM 1557'!$D$30)","v":"1-1"}]
[194,{"$f":"IF('ASTM 1557'!$E$42=\"\",\"\",'ASTM 1557'!$E$42)","v":""},{"$f":"IF( 'ASTM 1557'!$B$6=\"\",\"\", 'ASTM 1557'!$B$6)","v":"ASTM D1557"},{"$f":"IF('ASTM 1557'!$B$42=\"\",\"\",'ASTM 1557'!$B$42)","v":""},{"$f":"IF('ASTM 1557'!$E$30=\"\",\"\",'ASTM 1557'!$E$30)","v":"1-2"}]
[195,{"$f":"IF('ASTM 1557'!$F$42=\"\",\"\",'ASTM 1557'!$F$42)","v":""},{"$f":"IF( 'ASTM 1557'!$B$6=\"\",\"\", 'ASTM 1557'!$B$6)","v":"ASTM D1557"},{"$f":"IF('ASTM 1557'!$B$42=\"\",\"\",'ASTM 1557'!$B$42)","v":""},{"$f":"IF('ASTM 1557'!$F$30=\"\",\"\",'ASTM 1557'!$F$30)","v":"1-3"}]
[196,{"$f":"IF('ASTM 1557'!$G$42=\"\",\"\",'ASTM 1557'!$G$42)","v":""},{"$f":"IF( 'ASTM 1557'!$B$6=\"\",\"\", 'ASTM 1557'!$B$6)","v":"ASTM D1557"},{"$f":"IF('ASTM 1557'!$B$42=\"\",\"\",'ASTM 1557'!$B$42)","v":""},{"$f":"IF('ASTM 1557'!$G$30=\"\",\"\",'ASTM 1557'!$G$30)","v":"1-4"}]
[197,{"$f":"IF('ASTM 1557'!$I$42=\"\",\"\",'ASTM 1557'!$I$42)","v":""},{"$f":"IF( 'ASTM 1557'!$B$6=\"\",\"\", 'ASTM 1557'!$B$6)","v":"ASTM D1557"},{"$f":"IF('ASTM 1557'!$B$42=\"\",\"\",'ASTM 1557'!$B$42)","v":""},{"$f":"IF('ASTM 1557'!$I$30=\"\",\"\",'ASTM 1557'!$I$30)","v":"2-1"}]
[198,{"$f":"IF('ASTM 1557'!$J$42=\"\",\"\",'ASTM 1557'!$J$42)","v":""},{"$f":"IF( 'ASTM 1557'!$B$6=\"\",\"\", 'ASTM 1557'!$B$6)","v":"ASTM D1557"},{"$f":"IF('ASTM 1557'!$B$42=\"\",\"\",'ASTM 1557'!$B$42)","v":""},{"$f":"IF('ASTM 1557'!$J$30=\"\",\"\",'ASTM 1557'!$J$30)","v":"2-2"}]
[199,{"$f":"IF('ASTM 1557'!$K$42=\"\",\"\",'ASTM 1557'!$K$42)","v":""},{"$f":"IF( 'ASTM 1557'!$B$6=\"\",\"\", 'ASTM 1557'!$B$6)","v":"ASTM D1557"},{"$f":"IF('ASTM 1557'!$B$42=\"\",\"\",'ASTM 1557'!$B$42)","v":""},{"$f":"IF('ASTM 1557'!$K$30=\"\",\"\",'ASTM 1557'!$K$30)","v":"2-3"}]
[200,{"$f":"IF('ASTM 1557'!$L$42=\"\",\"\",'ASTM 1557'!$L$42)","v":""},{"$f":"IF( 'ASTM 1557'!$B$6=\"\",\"\", 'ASTM 1557'!$B$6)","v":"ASTM D1557"},{"$f":"IF('ASTM 1557'!$B$42=\"\",\"\",'ASTM 1557'!$B$42)","v":""},{"$f":"IF('ASTM 1557'!$L$30=\"\",\"\",'ASTM 1557'!$L$30)","v":"2-4"}]
[201,{"$f":"IF('ASTM 1557'!$N$42=\"\",\"\",'ASTM 1557'!$N$42)","v":""},{"$f":"IF( 'ASTM 1557'!$B$6=\"\",\"\", 'ASTM 1557'!$B$6)","v":"ASTM D1557"},{"$f":"IF('ASTM 1557'!$B$42=\"\",\"\",'ASTM 1557'!$B$42)","v":""},{"$f":"IF('ASTM 1557'!$N$30=\"\",\"\",'ASTM 1557'!$N$30)","v":"3-1"}]
[202,{"$f":"IF('ASTM 1557'!$O$42=\"\",\"\",'ASTM 1557'!$O$42)","v":""},{"$f":"IF( 'ASTM 1557'!$B$6=\"\",\"\", 'ASTM 1557'!$B$6)","v":"ASTM D1557"},{"$f":"IF('ASTM 1557'!$B$42=\"\",\"\",'ASTM 1557'!$B$42)","v":""},{"$f":"IF('ASTM 1557'!$O$30=\"\",\"\",'ASTM 1557'!$O$30)","v":"3-2"}]
[203,{"$f":"IF('ASTM 1557'!$P$42=\"\",\"\",'ASTM 1557'!$P$42)","v":""},{"$f":"IF( 'ASTM 1557'!$B$6=\"\",\"\", 'ASTM 1557'!$B$6)","v":"ASTM D1557"},{"$f":"IF('ASTM 1557'!$B$42=\"\",\"\",'ASTM 1557'!$B$42)","v":""},{"$f":"IF('ASTM 1557'!$P$30=\"\",\"\",'ASTM 1557'!$P$30)","v":"3-3"}]
[204,{"$f":"IF('ASTM 1557'!$Q$42=\"\",\"\",'ASTM 1557'!$Q$42)","v":""},{"$f":"IF( 'ASTM 1557'!$B$6=\"\",\"\", 'ASTM 1557'!$B$6)","v":"ASTM D1557"},{"$f":"IF('ASTM 1557'!$B$42=\"\",\"\",'ASTM 1557'!$B$42)","v":""},{"$f":"IF('ASTM 1557'!$Q$30=\"\",\"\",'ASTM 1557'!$Q$30)","v":"3-4"}]
[205,{"$f":"IF('ASTM 1557'!$D$43=\"\",\"\",'ASTM 1557'!$D$43)","v":""},{"$f":"IF( 'ASTM 1557'!$B$6=\"\",\"\", 'ASTM 1557'!$B$6)","v":"ASTM D1557"},{"$f":"IF('ASTM 1557'!$B$43=\"\",\"\",'ASTM 1557'!$B$43)","v":"Wet Mass Specimen, (lb):"},{"$f":"IF('ASTM 1557'!$D$30=\"\",\"\",'ASTM 1557'!$D$30)","v":"1-1"}]
[206,{"$f":"IF('ASTM 1557'!$E$43=\"\",\"\",'ASTM 1557'!$E$43)","v":""},{"$f":"IF( 'ASTM 1557'!$B$6=\"\",\"\", 'ASTM 1557'!$B$6)","v":"ASTM D1557"},{"$f":"IF('ASTM 1557'!$B$43=\"\",\"\",'ASTM 1557'!$B$43)","v":"Wet Mass Specimen, (lb):"},{"$f":"IF('ASTM 1557'!$E$30=\"\",\"\",'ASTM 1557'!$E$30)","v":"1-2"}]
[207,{"$f":"IF('ASTM 1557'!$F$43=\"\",\"\",'ASTM 1557'!$F$43)","v":""},{"$f":"IF( 'ASTM 1557'!$B$6=\"\",\"\", 'ASTM 1557'!$B$6)","v":"ASTM D1557"},{"$f":"IF('ASTM 1557'!$B$43=\"\",\"\",'ASTM 1557'!$B$43)","v":"Wet Mass Specimen, (lb):"},{"$f":"IF('ASTM 1557'!$F$30=\"\",\"\",'ASTM 1557'!$F$30)","v":"1-3"}]
[208,{"$f":"IF('ASTM 1557'!$G$43=\"\",\"\",'ASTM 1557'!$G$43)","v":""},{"$f":"IF( 'ASTM 1557'!$B$6=\"\",\"\", 'ASTM 1557'!$B$6)","v":"ASTM D1557"},{"$f":"IF('ASTM 1557'!$B$43=\"\",\"\",'ASTM 1557'!$B$43)","v":"Wet Mass Specimen, (lb):"},{"$f":"IF('ASTM 1557'!$G$30=\"\",\"\",'ASTM 1557'!$G$30)","v":"1-4"}]
[209,{"$f":"IF('ASTM 1557'!$I$43=\"\",\"\",'ASTM 1557'!$I$43)","v":""},{"$f":"IF( 'ASTM 1557'!$B$6=\"\",\"\", 'ASTM 1557'!$B$6)","v":"ASTM D1557"},{"$f":"IF('ASTM 1557'!$B$43=\"\",\"\",'ASTM 1557'!$B$43)","v":"Wet Mass Specimen, (lb):"},{"$f":"IF('ASTM 1557'!$I$30=\"\",\"\",'ASTM 1557'!$I$30)","v":"2-1"}]
[210,{"$f":"IF('ASTM 1557'!$J$43=\"\",\"\",'ASTM 1557'!$J$43)","v":""},{"$f":"IF( 'ASTM 1557'!$B$6=\"\",\"\", 'ASTM 1557'!$B$6)","v":"ASTM D1557"},{"$f":"IF('ASTM 1557'!$B$43=\"\",\"\",'ASTM 1557'!$B$43)","v":"Wet Mass Specimen, (lb):"},{"$f":"IF('ASTM 1557'!$J$30=\"\",\"\",'ASTM 1557'!$J$30)","v":"2-2"}]
[211,{"$f":"IF('ASTM 1557'!$K$43=\"\",\"\",'ASTM 1557'!$K$43)","v":""},{"$f":"IF( 'ASTM 1557'!$B$6=\"\",\"\", 'ASTM 1557'!$B$6)","v":"ASTM D1557"},{"$f":"IF('ASTM 1557'!$B$43=\"\",\"\",'ASTM 1557'!$B$43)","v":"Wet Mass Specimen, (lb):"},{"$f":"IF('ASTM 1557'!$K$30=\"\",\"\",'ASTM 1557'!$K$30)","v":"2-3"}]
[212,{"$f":"IF('ASTM 1557'!$L$43=\"\",\"\",'ASTM 1557'!$L$43)","v":""},{"$f":"IF( 'ASTM 1557'!$B$6=\"\",\"\", 'ASTM 1557'!$B$6)","v":"ASTM D1557"},{"$f":"IF('ASTM 1557'!$B$43=\"\",\"\",'ASTM 1557'!$B$43)","v":"Wet Mass Specimen, (lb):"},{"$f":"IF('ASTM 1557'!$L$30=\"\",\"\",'ASTM 1557'!$L$30)","v":"2-4"}]
[213,{"$f":"IF('ASTM 1557'!$N$43=\"\",\"\",'ASTM 1557'!$N$43)","v":""},{"$f":"IF( 'ASTM 1557'!$B$6=\"\",\"\", 'ASTM 1557'!$B$6)","v":"ASTM D1557"},{"$f":"IF('ASTM 1557'!$B$43=\"\",\"\",'ASTM 1557'!$B$43)","v":"Wet Mass Specimen, (lb):"},{"$f":"IF('ASTM 1557'!$N$30=\"\",\"\",'ASTM 1557'!$N$30)","v":"3-1"}]
[214,{"$f":"IF('ASTM 1557'!$O$43=\"\",\"\",'ASTM 1557'!$O$43)","v":""},{"$f":"IF( 'ASTM 1557'!$B$6=\"\",\"\", 'ASTM 1557'!$B$6)","v":"ASTM D1557"},{"$f":"IF('ASTM 1557'!$B$43=\"\",\"\",'ASTM 1557'!$B$43)","v":"Wet Mass Specimen, (lb):"},{"$f":"IF('ASTM 1557'!$O$30=\"\",\"\",'ASTM 1557'!$O$30)","v":"3-2"}]
[215,{"$f":"IF('ASTM 1557'!$P$43=\"\",\"\",'ASTM 1557'!$P$43)","v":""},{"$f":"IF( 'ASTM 1557'!$B$6=\"\",\"\", 'ASTM 1557'!$B$6)","v":"ASTM D1557"},{"$f":"IF('ASTM 1557'!$B$43=\"\",\"\",'ASTM 1557'!$B$43)","v":"Wet Mass Specimen, (lb):"},{"$f":"IF('ASTM 1557'!$P$30=\"\",\"\",'ASTM 1557'!$P$30)","v":"3-3"}]
[216,{"$f":"IF('ASTM 1557'!$Q$43=\"\",\"\",'ASTM 1557'!$Q$43)","v":""},{"$f":"IF( 'ASTM 1557'!$B$6=\"\",\"\", 'ASTM 1557'!$B$6)","v":"ASTM D1557"},{"$f":"IF('ASTM 1557'!$B$43=\"\",\"\",'ASTM 1557'!$B$43)","v":"Wet Mass Specimen, (lb):"},{"$f":"IF('ASTM 1557'!$Q$30=\"\",\"\",'ASTM 1557'!$Q$30)","v":"3-4"}]
[217,{"$f":"IF('ASTM 1557'!$D$44=\"\",\"\",'ASTM 1557'!$D$44)","v":""},{"$f":"IF( 'ASTM 1557'!$B$6=\"\",\"\", 'ASTM 1557'!$B$6)","v":"ASTM D1557"},{"$f":"IF('ASTM 1557'!$B$44=\"\",\"\",'ASTM 1557'!$B$44)","v":"Height of Specimen, (in.):"},{"$f":"IF('ASTM 1557'!$D$30=\"\",\"\",'ASTM 1557'!$D$30)","v":"1-1"}]
[218,{"$f":"IF('ASTM 1557'!$E$44=\"\",\"\",'ASTM 1557'!$E$44)","v":""},{"$f":"IF( 'ASTM 1557'!$B$6=\"\",\"\", 'ASTM 1557'!$B$6)","v":"ASTM D1557"},{"$f":"IF('ASTM 1557'!$B$44=\"\",\"\",'ASTM 1557'!$B$44)","v":"Height of Specimen, (in.):"},{"$f":"IF('ASTM 1557'!$E$30=\"\",\"\",'ASTM 1557'!$E$30)","v":"1-2"}]
[219,{"$f":"IF('ASTM 1557'!$F$44=\"\",\"\",'ASTM 1557'!$F$44)","v":""},{"$f":"IF( 'ASTM 1557'!$B$6=\"\",\"\", 'ASTM 1557'!$B$6)","v":"ASTM D1557"},{"$f":"IF('ASTM 1557'!$B$44=\"\",\"\",'ASTM 1557'!$B$44)","v":"Height of Specimen, (in.):"},{"$f":"IF('ASTM 1557'!$F$30=\"\",\"\",'ASTM 1557'!$F$30)","v":"1-3"}]
[220,{"$f":"IF('ASTM 1557'!$G$44=\"\",\"\",'ASTM 1557'!$G$44)","v":""},{"$f":"IF( 'ASTM 1557'!$B$6=\"\",\"\", 'ASTM 1557'!$B$6)","v":"ASTM D1557"},{"$f":"IF('ASTM 1557'!$B$44=\"\",\"\",'ASTM 1557'!$B$44)","v":"Height of Specimen, (in.):"},{"$f":"IF('ASTM 1557'!$G$30=\"\",\"\",'ASTM 1557'!$G$30)","v":"1-4"}]
[221,{"$f":"IF('ASTM 1557'!$I$44=\"\",\"\",'ASTM 1557'!$I$44)","v":""},{"$f":"IF( 'ASTM 1557'!$B$6=\"\",\"\", 'ASTM 1557'!$B$6)","v":"ASTM D1557"},{"$f":"IF('ASTM 1557'!$B$44=\"\",\"\",'ASTM 1557'!$B$44)","v":"Height of Specimen, (in.):"},{"$f":"IF('ASTM 1557'!$I$30=\"\",\"\",'ASTM 1557'!$I$30)","v":"2-1"}]
[222,{"$f":"IF('ASTM 1557'!$J$44=\"\",\"\",'ASTM 1557'!$J$44)","v":""},{"$f":"IF( 'ASTM 1557'!$B$6=\"\",\"\", 'ASTM 1557'!$B$6)","v":"ASTM D1557"},{"$f":"IF('ASTM 1557'!$B$44=\"\",\"\",'ASTM 1557'!$B$44)","v":"Height of Specimen, (in.):"},{"$f":"IF('ASTM 1557'!$J$30=\"\",\"\",'ASTM 1557'!$J$30)","v":"2-2"}]
[223,{"$f":"IF('ASTM 1557'!$K$44=\"\",\"\",'ASTM 1557'!$K$44)","v":""},{"$f":"IF( 'ASTM 1557'!$B$6=\"\",\"\", 'ASTM 1557'!$B$6)","v":"ASTM D1557"},{"$f":"IF('ASTM 1557'!$B$44=\"\",\"\",'ASTM 1557'!$B$44)","v":"Height of Specimen, (in.):"},{"$f":"IF('ASTM 1557'!$K$30=\"\",\"\",'ASTM 1557'!$K$30)","v":"2-3"}]
[224,{"$f":"IF('ASTM 1557'!$L$44=\"\",\"\",'ASTM 1557'!$L$44)","v":""},{"$f":"IF( 'ASTM 1557'!$B$6=\"\",\"\", 'ASTM 1557'!$B$6)","v":"ASTM D1557"},{"$f":"IF('ASTM 1557'!$B$44=\"\",\"\",'ASTM 1557'!$B$44)","v":"Height of Specimen, (in.):"},{"$f":"IF('ASTM 1557'!$L$30=\"\",\"\",'ASTM 1557'!$L$30)","v":"2-4"}]
[225,{"$f":"IF('ASTM 1557'!$N$44=\"\",\"\",'ASTM 1557'!$N$44)","v":""},{"$f":"IF( 'ASTM 1557'!$B$6=\"\",\"\", 'ASTM 1557'!$B$6)","v":"ASTM D1557"},{"$f":"IF('ASTM 1557'!$B$44=\"\",\"\",'ASTM 1557'!$B$44)","v":"Height of Specimen, (in.):"},{"$f":"IF('ASTM 1557'!$N$30=\"\",\"\",'ASTM 1557'!$N$30)","v":"3-1"}]
[226,{"$f":"IF('ASTM 1557'!$O$44=\"\",\"\",'ASTM 1557'!$O$44)","v":""},{"$f":"IF( 'ASTM 1557'!$B$6=\"\",\"\", 'ASTM 1557'!$B$6)","v":"ASTM D1557"},{"$f":"IF('ASTM 1557'!$B$44=\"\",\"\",'ASTM 1557'!$B$44)","v":"Height of Specimen, (in.):"},{"$f":"IF('ASTM 1557'!$O$30=\"\",\"\",'ASTM 1557'!$O$30)","v":"3-2"}]
[227,{"$f":"IF('ASTM 1557'!$P$44=\"\",\"\",'ASTM 1557'!$P$44)","v":""},{"$f":"IF( 'ASTM 1557'!$B$6=\"\",\"\", 'ASTM 1557'!$B$6)","v":"ASTM D1557"},{"$f":"IF('ASTM 1557'!$B$44=\"\",\"\",'ASTM 1557'!$B$44)","v":"Height of Specimen, (in.):"},{"$f":"IF('ASTM 1557'!$P$30=\"\",\"\",'ASTM 1557'!$P$30)","v":"3-3"}]
[228,{"$f":"IF('ASTM 1557'!$Q$44=\"\",\"\",'ASTM 1557'!$Q$44)","v":""},{"$f":"IF( 'ASTM 1557'!$B$6=\"\",\"\", 'ASTM 1557'!$B$6)","v":"ASTM D1557"},{"$f":"IF('ASTM 1557'!$B$44=\"\",\"\",'ASTM 1557'!$B$44)","v":"Height of Specimen, (in.):"},{"$f":"IF('ASTM 1557'!$Q$30=\"\",\"\",'ASTM 1557'!$Q$30)","v":"3-4"}]
[229,{"$f":"IF('ASTM 1557'!$D$45=\"\",\"\",'ASTM 1557'!$D$45)","v":""},{"$f":"IF( 'ASTM 1557'!$B$6=\"\",\"\", 'ASTM 1557'!$B$6)","v":"ASTM D1557"},{"$f":"IF('ASTM 1557'!$B$45=\"\",\"\",'ASTM 1557'!$B$45)","v":"Volume per Linear mm., (in.):"},{"$f":"IF('ASTM 1557'!$D$30=\"\",\"\",'ASTM 1557'!$D$30)","v":"1-1"}]
[230,{"$f":"IF('ASTM 1557'!$E$45=\"\",\"\",'ASTM 1557'!$E$45)","v":""},{"$f":"IF( 'ASTM 1557'!$B$6=\"\",\"\", 'ASTM 1557'!$B$6)","v":"ASTM D1557"},{"$f":"IF('ASTM 1557'!$B$45=\"\",\"\",'ASTM 1557'!$B$45)","v":"Volume per Linear mm., (in.):"},{"$f":"IF('ASTM 1557'!$E$30=\"\",\"\",'ASTM 1557'!$E$30)","v":"1-2"}]
[231,{"$f":"IF('ASTM 1557'!$F$45=\"\",\"\",'ASTM 1557'!$F$45)","v":""},{"$f":"IF( 'ASTM 1557'!$B$6=\"\",\"\", 'ASTM 1557'!$B$6)","v":"ASTM D1557"},{"$f":"IF('ASTM 1557'!$B$45=\"\",\"\",'ASTM 1557'!$B$45)","v":"Volume per Linear mm., (in.):"},{"$f":"IF('ASTM 1557'!$F$30=\"\",\"\",'ASTM 1557'!$F$30)","v":"1-3"}]
[232,{"$f":"IF('ASTM 1557'!$G$45=\"\",\"\",'ASTM 1557'!$G$45)","v":""},{"$f":"IF( 'ASTM 1557'!$B$6=\"\",\"\", 'ASTM 1557'!$B$6)","v":"ASTM D1557"},{"$f":"IF('ASTM 1557'!$B$45=\"\",\"\",'ASTM 1557'!$B$45)","v":"Volume per Linear mm., (in.):"},{"$f":"IF('ASTM 1557'!$G$30=\"\",\"\",'ASTM 1557'!$G$30)","v":"1-4"}]
[233,{"$f":"IF('ASTM 1557'!$I$45=\"\",\"\",'ASTM 1557'!$I$45)","v":""},{"$f":"IF( 'ASTM 1557'!$B$6=\"\",\"\", 'ASTM 1557'!$B$6)","v":"ASTM D1557"},{"$f":"IF('ASTM 1557'!$B$45=\"\",\"\",'ASTM 1557'!$B$45)","v":"Volume per Linear mm., (in.):"},{"$f":"IF('ASTM 1557'!$I$30=\"\",\"\",'ASTM 1557'!$I$30)","v":"2-1"}]
[234,{"$f":"IF('ASTM 1557'!$J$45=\"\",\"\",'ASTM 1557'!$J$45)","v":""},{"$f":"IF( 'ASTM 1557'!$B$6=\"\",\"\", 'ASTM 1557'!$B$6)","v":"ASTM D1557"},{"$f":"IF('ASTM 1557'!$B$45=\"\",\"\",'ASTM 1557'!$B$45)","v":"Volume per Linear mm., (in.):"},{"$f":"IF('ASTM 1557'!$J$30=\"\",\"\",'ASTM 1557'!$J$30)","v":"2-2"}]
[235,{"$f":"IF('ASTM 1557'!$K$45=\"\",\"\",'ASTM 1557'!$K$45)","v":""},{"$f":"IF( 'ASTM 1557'!$B$6=\"\",\"\", 'ASTM 1557'!$B$6)","v":"ASTM D1557"},{"$f":"IF('ASTM 1557'!$B$45=\"\",\"\",'ASTM 1557'!$B$45)","v":"Volume per Linear mm., (in.):"},{"$f":"IF('ASTM 1557'!$K$30=\"\",\"\",'ASTM 1557'!$K$30)","v":"2-3"}]
[236,{"$f":"IF('ASTM 1557'!$L$45=\"\",\"\",'ASTM 1557'!$L$45)","v":""},{"$f":"IF( 'ASTM 1557'!$B$6=\"\",\"\", 'ASTM 1557'!$B$6)","v":"ASTM D1557"},{"$f":"IF('ASTM 1557'!$B$45=\"\",\"\",'ASTM 1557'!$B$45)","v":"Volume per Linear mm., (in.):"},{"$f":"IF('ASTM 1557'!$L$30=\"\",\"\",'ASTM 1557'!$L$30)","v":"2-4"}]
[237,{"$f":"IF('ASTM 1557'!$N$45=\"\",\"\",'ASTM 1557'!$N$45)","v":""},{"$f":"IF( 'ASTM 1557'!$B$6=\"\",\"\", 'ASTM 1557'!$B$6)","v":"ASTM D1557"},{"$f":"IF('ASTM 1557'!$B$45=\"\",\"\",'ASTM 1557'!$B$45)","v":"Volume per Linear mm., (in.):"},{"$f":"IF('ASTM 1557'!$N$30=\"\",\"\",'ASTM 1557'!$N$30)","v":"3-1"}]
[238,{"$f":"IF('ASTM 1557'!$O$45=\"\",\"\",'ASTM 1557'!$O$45)","v":""},{"$f":"IF( 'ASTM 1557'!$B$6=\"\",\"\", 'ASTM 1557'!$B$6)","v":"ASTM D1557"},{"$f":"IF('ASTM 1557'!$B$45=\"\",\"\",'ASTM 1557'!$B$45)","v":"Volume per Linear mm., (in.):"},{"$f":"IF('ASTM 1557'!$O$30=\"\",\"\",'ASTM 1557'!$O$30)","v":"3-2"}]
[239,{"$f":"IF('ASTM 1557'!$P$45=\"\",\"\",'ASTM 1557'!$P$45)","v":""},{"$f":"IF( 'ASTM 1557'!$B$6=\"\",\"\", 'ASTM 1557'!$B$6)","v":"ASTM D1557"},{"$f":"IF('ASTM 1557'!$B$45=\"\",\"\",'ASTM 1557'!$B$45)","v":"Volume per Linear mm., (in.):"},{"$f":"IF('ASTM 1557'!$P$30=\"\",\"\",'ASTM 1557'!$P$30)","v":"3-3"}]
[240,{"$f":"IF('ASTM 1557'!$Q$45=\"\",\"\",'ASTM 1557'!$Q$45)","v":""},{"$f":"IF( 'ASTM 1557'!$B$6=\"\",\"\", 'ASTM 1557'!$B$6)","v":"ASTM D1557"},{"$f":"IF('ASTM 1557'!$B$45=\"\",\"\",'ASTM 1557'!$B$45)","v":"Volume per Linear mm., (in.):"},{"$f":"IF('ASTM 1557'!$Q$30=\"\",\"\",'ASTM 1557'!$Q$30)","v":"3-4"}]
[241,{"$f":"IF('ASTM 1557'!$D$46=\"\",\"\",'ASTM 1557'!$D$46)","v":""},{"$f":"IF( 'ASTM 1557'!$B$6=\"\",\"\", 'ASTM 1557'!$B$6)","v":"ASTM D1557"},{"$f":"IF('ASTM 1557'!$C$46=\"\",\"\",'ASTM 1557'!$C$46)","v":""},{"$f":"IF('ASTM 1557'!$D$30=\"\",\"\",'ASTM 1557'!$D$30)","v":"1-1"}]
[242,{"$f":"IF('ASTM 1557'!$E$46=\"\",\"\",'ASTM 1557'!$E$46)","v":""},{"$f":"IF( 'ASTM 1557'!$B$6=\"\",\"\", 'ASTM 1557'!$B$6)","v":"ASTM D1557"},{"$f":"IF('ASTM 1557'!$C$46=\"\",\"\",'ASTM 1557'!$C$46)","v":""},{"$f":"IF('ASTM 1557'!$E$30=\"\",\"\",'ASTM 1557'!$E$30)","v":"1-2"}]
[243,{"$f":"IF('ASTM 1557'!$F$46=\"\",\"\",'ASTM 1557'!$F$46)","v":""},{"$f":"IF( 'ASTM 1557'!$B$6=\"\",\"\", 'ASTM 1557'!$B$6)","v":"ASTM D1557"},{"$f":"IF('ASTM 1557'!$C$46=\"\",\"\",'ASTM 1557'!$C$46)","v":""},{"$f":"IF('ASTM 1557'!$F$30=\"\",\"\",'ASTM 1557'!$F$30)","v":"1-3"}]
[244,{"$f":"IF('ASTM 1557'!$G$46=\"\",\"\",'ASTM 1557'!$G$46)","v":""},{"$f":"IF( 'ASTM 1557'!$B$6=\"\",\"\", 'ASTM 1557'!$B$6)","v":"ASTM D1557"},{"$f":"IF('ASTM 1557'!$C$46=\"\",\"\",'ASTM 1557'!$C$46)","v":""},{"$f":"IF('ASTM 1557'!$G$30=\"\",\"\",'ASTM 1557'!$G$30)","v":"1-4"}]
[245,{"$f":"IF('ASTM 1557'!$I$46=\"\",\"\",'ASTM 1557'!$I$46)","v":""},{"$f":"IF( 'ASTM 1557'!$B$6=\"\",\"\", 'ASTM 1557'!$B$6)","v":"ASTM D1557"},{"$f":"IF('ASTM 1557'!$C$46=\"\",\"\",'ASTM 1557'!$C$46)","v":""},{"$f":"IF('ASTM 1557'!$I$30=\"\",\"\",'ASTM 1557'!$I$30)","v":"2-1"}]
[246,{"$f":"IF('ASTM 1557'!$J$46=\"\",\"\",'ASTM 1557'!$J$46)","v":""},{"$f":"IF( 'ASTM 1557'!$B$6=\"\",\"\", 'ASTM 1557'!$B$6)","v":"ASTM D1557"},{"$f":"IF('ASTM 1557'!$C$46=\"\",\"\",'ASTM 1557'!$C$46)","v":""},{"$f":"IF('ASTM 1557'!$J$30=\"\",\"\",'ASTM 1557'!$J$30)","v":"2-2"}]
[247,{"$f":"IF('ASTM 1557'!$K$46=\"\",\"\",'ASTM 1557'!$K$46)","v":""},{"$f":"IF( 'ASTM 1557'!$B$6=\"\",\"\", 'ASTM 1557'!$B$6)","v":"ASTM D1557"},{"$f":"IF('ASTM 1557'!$C$46=\"\",\"\",'ASTM 1557'!$C$46)","v":""},{"$f":"IF('ASTM 1557'!$K$30=\"\",\"\",'ASTM 1557'!$K$30)","v":"2-3"}]
[248,{"$f":"IF('ASTM 1557'!$L$46=\"\",\"\",'ASTM 1557'!$L$46)","v":""},{"$f":"IF( 'ASTM 1557'!$B$6=\"\",\"\", 'ASTM 1557'!$B$6)","v":"ASTM D1557"},{"$f":"IF('ASTM 1557'!$C$46=\"\",\"\",'ASTM 1557'!$C$46)","v":""},{"$f":"IF('ASTM 1557'!$L$30=\"\",\"\",'ASTM 1557'!$L$30)","v":"2-4"}]
[249,{"$f":"IF('ASTM 1557'!$N$46=\"\",\"\",'ASTM 1557'!$N$46)","v":""},{"$f":"IF( 'ASTM 1557'!$B$6=\"\",\"\", 'ASTM 1557'!$B$6)","v":"ASTM D1557"},{"$f":"IF('ASTM 1557'!$C$46=\"\",\"\",'ASTM 1557'!$C$46)","v":""},{"$f":"IF('ASTM 1557'!$N$30=\"\",\"\",'ASTM 1557'!$N$30)","v":"3-1"}]
[250,{"$f":"IF('ASTM 1557'!$O$46=\"\",\"\",'ASTM 1557'!$O$46)","v":""},{"$f":"IF( 'ASTM 1557'!$B$6=\"\",\"\", 'ASTM 1557'!$B$6)","v":"ASTM D1557"},{"$f":"IF('ASTM 1557'!$C$46=\"\",\"\",'ASTM 1557'!$C$46)","v":""},{"$f":"IF('ASTM 1557'!$O$30=\"\",\"\",'ASTM 1557'!$O$30)","v":"3-2"}]
[251,{"$f":"IF('ASTM 1557'!$P$46=\"\",\"\",'ASTM 1557'!$P$46)","v":""},{"$f":"IF( 'ASTM 1557'!$B$6=\"\",\"\", 'ASTM 1557'!$B$6)","v":"ASTM D1557"},{"$f":"IF('ASTM 1557'!$C$46=\"\",\"\",'ASTM 1557'!$C$46)","v":""},{"$f":"IF('ASTM 1557'!$P$30=\"\",\"\",'ASTM 1557'!$P$30)","v":"3-3"}]
[252,{"$f":"IF('ASTM 1557'!$Q$46=\"\",\"\",'ASTM 1557'!$Q$46)","v":""},{"$f":"IF( 'ASTM 1557'!$B$6=\"\",\"\", 'ASTM 1557'!$B$6)","v":"ASTM D1557"},{"$f":"IF('ASTM 1557'!$C$46=\"\",\"\",'ASTM 1557'!$C$46)","v":""},{"$f":"IF('ASTM 1557'!$Q$30=\"\",\"\",'ASTM 1557'!$Q$30)","v":"3-4"}]
[253,{"$f":"IF('ASTM 1557'!$D$47=\"\",\"\",'ASTM 1557'!$D$47)","v":""},{"$f":"IF( 'ASTM 1557'!$B$6=\"\",\"\", 'ASTM 1557'!$B$6)","v":"ASTM D1557"},{"$f":"IF('ASTM 1557'!$B$47=\"\",\"\",'ASTM 1557'!$B$47)","v":"Volume of Specimen, (ft^3):"},{"$f":"IF('ASTM 1557'!$D$30=\"\",\"\",'ASTM 1557'!$D$30)","v":"1-1"}]
[254,{"$f":"IF('ASTM 1557'!$E$47=\"\",\"\",'ASTM 1557'!$E$47)","v":""},{"$f":"IF( 'ASTM 1557'!$B$6=\"\",\"\", 'ASTM 1557'!$B$6)","v":"ASTM D1557"},{"$f":"IF('ASTM 1557'!$B$47=\"\",\"\",'ASTM 1557'!$B$47)","v":"Volume of Specimen, (ft^3):"},{"$f":"IF('ASTM 1557'!$E$30=\"\",\"\",'ASTM 1557'!$E$30)","v":"1-2"}]
[255,{"$f":"IF('ASTM 1557'!$F$47=\"\",\"\",'ASTM 1557'!$F$47)","v":""},{"$f":"IF( 'ASTM 1557'!$B$6=\"\",\"\", 'ASTM 1557'!$B$6)","v":"ASTM D1557"},{"$f":"IF('ASTM 1557'!$B$47=\"\",\"\",'ASTM 1557'!$B$47)","v":"Volume of Specimen, (ft^3):"},{"$f":"IF('ASTM 1557'!$F$30=\"\",\"\",'ASTM 1557'!$F$30)","v":"1-3"}]
[256,{"$f":"IF('ASTM 1557'!$G$47=\"\",\"\",'ASTM 1557'!$G$47)","v":""},{"$f":"IF( 'ASTM 1557'!$B$6=\"\",\"\", 'ASTM 1557'!$B$6)","v":"ASTM D1557"},{"$f":"IF('ASTM 1557'!$B$47=\"\",\"\",'ASTM 1557'!$B$47)","v":"Volume of Specimen, (ft^3):"},{"$f":"IF('ASTM 1557'!$G$30=\"\",\"\",'ASTM 1557'!$G$30)","v":"1-4"}]
[257,{"$f":"IF('ASTM 1557'!$I$47=\"\",\"\",'ASTM 1557'!$I$47)","v":""},{"$f":"IF( 'ASTM 1557'!$B$6=\"\",\"\", 'ASTM 1557'!$B$6)","v":"ASTM D1557"},{"$f":"IF('ASTM 1557'!$B$47=\"\",\"\",'ASTM 1557'!$B$47)","v":"Volume of Specimen, (ft^3):"},{"$f":"IF('ASTM 1557'!$I$30=\"\",\"\",'ASTM 1557'!$I$30)","v":"2-1"}]
[258,{"$f":"IF('ASTM 1557'!$J$47=\"\",\"\",'ASTM 1557'!$J$47)","v":""},{"$f":"IF( 'ASTM 1557'!$B$6=\"\",\"\", 'ASTM 1557'!$B$6)","v":"ASTM D1557"},{"$f":"IF('ASTM 1557'!$B$47=\"\",\"\",'ASTM 1557'!$B$47)","v":"Volume of Specimen, (ft^3):"},{"$f":"IF('ASTM 1557'!$J$30=\"\",\"\",'ASTM 1557'!$J$30)","v":"2-2"}]
[259,{"$f":"IF('ASTM 1557'!$K$47=\"\",\"\",'ASTM 1557'!$K$47)","v":""},{"$f":"IF( 'ASTM 1557'!$B$6=\"\",\"\", 'ASTM 1557'!$B$6)","v":"ASTM D1557"},{"$f":"IF('ASTM 1557'!$B$47=\"\",\"\",'ASTM 1557'!$B$47)","v":"Volume of Specimen, (ft^3):"},{"$f":"IF('ASTM 1557'!$K$30=\"\",\"\",'ASTM 1557'!$K$30)","v":"2-3"}]
[260,{"$f":"IF('ASTM 1557'!$L$47=\"\",\"\",'ASTM 1557'!$L$47)","v":""},{"$f":"IF( 'ASTM 1557'!$B$6=\"\",\"\", 'ASTM 1557'!$B$6)","v":"ASTM D1557"},{"$f":"IF('ASTM 1557'!$B$47=\"\",\"\",'ASTM 1557'!$B$47)","v":"Volume of Specimen, (ft^3):"},{"$f":"IF('ASTM 1557'!$L$30=\"\",\"\",'ASTM 1557'!$L$30)","v":"2-4"}]
[261,{"$f":"IF('ASTM 1557'!$N$47=\"\",\"\",'ASTM 1557'!$N$47)","v":""},{"$f":"IF( 'ASTM 1557'!$B$6=\"\",\"\", 'ASTM 1557'!$B$6)","v":"ASTM D1557"},{"$f":"IF('ASTM 1557'!$B$47=\"\",\"\",'ASTM 1557'!$B$47)","v":"Volume of Specimen, (ft^3):"},{"$f":"IF('ASTM 1557'!$N$30=\"\",\"\",'ASTM 1557'!$N$30)","v":"3-1"}]
[262,{"$f":"IF('ASTM 1557'!$O$47=\"\",\"\",'ASTM 1557'!$O$47)","v":""},{"$f":"IF( 'ASTM 1557'!$B$6=\"\",\"\", 'ASTM 1557'!$B$6)","v":"ASTM D1557"},{"$f":"IF('ASTM 1557'!$B$47=\"\",\"\",'ASTM 1557'!$B$47)","v":"Volume of Specimen, (ft^3):"},{"$f":"IF('ASTM 1557'!$O$30=\"\",\"\",'ASTM 1557'!$O$30)","v":"3-2"}]
[263,{"$f":"IF('ASTM 1557'!$P$47=\"\",\"\",'ASTM 1557'!$P$47)","v":""},{"$f":"IF( 'ASTM 1557'!$B$6=\"\",\"\", 'ASTM 1557'!$B$6)","v":"ASTM D1557"},{"$f":"IF('ASTM 1557'!$B$47=\"\",\"\",'ASTM 1557'!$B$47)","v":"Volume of Specimen, (ft^3):"},{"$f":"IF('ASTM 1557'!$P$30=\"\",\"\",'ASTM 1557'!$P$30)","v":"3-3"}]
[264,{"$f":"IF('ASTM 1557'!$Q$47=\"\",\"\",'ASTM 1557'!$Q$47)","v":""},{"$f":"IF( 'ASTM 1557'!$B$6=\"\",\"\", 'ASTM 1557'!$B$6)","v":"ASTM D1557"},{"$f":"IF('ASTM 1557'!$B$47=\"\",\"\",'ASTM 1557'!$B$47)","v":"Volume of Specimen, (ft^3):"},{"$f":"IF('ASTM 1557'!$Q$30=\"\",\"\",'ASTM 1557'!$Q$30)","v":"3-4"}]
[265,{"$f":"IF('ASTM 1557'!$D$48=\"\",\"\",'ASTM 1557'!$D$48)","v":""},{"$f":"IF( 'ASTM 1557'!$B$6=\"\",\"\", 'ASTM 1557'!$B$6)","v":"ASTM D1557"},{"$f":"IF('ASTM 1557'!$B$48=\"\",\"\",'ASTM 1557'!$B$48)","v":"Wet Density of Specimen, (lb):"},{"$f":"IF('ASTM 1557'!$D$30=\"\",\"\",'ASTM 1557'!$D$30)","v":"1-1"}]
[266,{"$f":"IF('ASTM 1557'!$E$48=\"\",\"\",'ASTM 1557'!$E$48)","v":""},{"$f":"IF( 'ASTM 1557'!$B$6=\"\",\"\", 'ASTM 1557'!$B$6)","v":"ASTM D1557"},{"$f":"IF('ASTM 1557'!$B$48=\"\",\"\",'ASTM 1557'!$B$48)","v":"Wet Density of Specimen, (lb):"},{"$f":"IF('ASTM 1557'!$E$30=\"\",\"\",'ASTM 1557'!$E$30)","v":"1-2"}]
[267,{"$f":"IF('ASTM 1557'!$F$48=\"\",\"\",'ASTM 1557'!$F$48)","v":""},{"$f":"IF( 'ASTM 1557'!$B$6=\"\",\"\", 'ASTM 1557'!$B$6)","v":"ASTM D1557"},{"$f":"IF('ASTM 1557'!$B$48=\"\",\"\",'ASTM 1557'!$B$48)","v":"Wet Density of Specimen, (lb):"},{"$f":"IF('ASTM 1557'!$F$30=\"\",\"\",'ASTM 1557'!$F$30)","v":"1-3"}]
[268,{"$f":"IF('ASTM 1557'!$G$48=\"\",\"\",'ASTM 1557'!$G$48)","v":""},{"$f":"IF( 'ASTM 1557'!$B$6=\"\",\"\", 'ASTM 1557'!$B$6)","v":"ASTM D1557"},{"$f":"IF('ASTM 1557'!$B$48=\"\",\"\",'ASTM 1557'!$B$48)","v":"Wet Density of Specimen, (lb):"},{"$f":"IF('ASTM 1557'!$G$30=\"\",\"\",'ASTM 1557'!$G$30)","v":"1-4"}]
[269,{"$f":"IF('ASTM 1557'!$I$48=\"\",\"\",'ASTM 1557'!$I$48)","v":""},{"$f":"IF( 'ASTM 1557'!$B$6=\"\",\"\", 'ASTM 1557'!$B$6)","v":"ASTM D1557"},{"$f":"IF('ASTM 1557'!$B$48=\"\",\"\",'ASTM 1557'!$B$48)","v":"Wet Density of Specimen, (lb):"},{"$f":"IF('ASTM 1557'!$I$30=\"\",\"\",'ASTM 1557'!$I$30)","v":"2-1"}]
[270,{"$f":"IF('ASTM 1557'!$J$48=\"\",\"\",'ASTM 1557'!$J$48)","v":""},{"$f":"IF( 'ASTM 1557'!$B$6=\"\",\"\", 'ASTM 1557'!$B$6)","v":"ASTM D1557"},{"$f":"IF('ASTM 1557'!$B$48=\"\",\"\",'ASTM 1557'!$B$48)","v":"Wet Density of Specimen, (lb):"},{"$f":"IF('ASTM 1557'!$J$30=\"\",\"\",'ASTM 1557'!$J$30)","v":"2-2"}]
[271,{"$f":"IF('ASTM 1557'!$K$48=\"\",\"\",'ASTM 1557'!$K$48)","v":""},{"$f":"IF( 'ASTM 1557'!$B$6=\"\",\"\", 'ASTM 1557'!$B$6)","v":"ASTM D1557"},{"$f":"IF('ASTM 1557'!$B$48=\"\",\"\",'ASTM 1557'!$B$48)","v":"Wet Density of Specimen, (lb):"},{"$f":"IF('ASTM 1557'!$K$30=\"\",\"\",'ASTM 1557'!$K$30)","v":"2-3"}]
[272,{"$f":"IF('ASTM 1557'!$L$48=\"\",\"\",'ASTM 1557'!$L$48)","v":""},{"$f":"IF( 'ASTM 1557'!$B$6=\"\",\"\", 'ASTM 1557'!$B$6)","v":"ASTM D1557"},{"$f":"IF('ASTM 1557'!$B$48=\"\",\"\",'ASTM 1557'!$B$48)","v":"Wet Density of Specimen, (lb):"},{"$f":"IF('ASTM 1557'!$L$30=\"\",\"\",'ASTM 1557'!$L$30)","v":"2-4"}]
[273,{"$f":"IF('ASTM 1557'!$N$48=\"\",\"\",'ASTM 1557'!$N$48)","v":""},{"$f":"IF( 'ASTM 1557'!$B$6=\"\",\"\", 'ASTM 1557'!$B$6)","v":"ASTM D1557"},{"$f":"IF('ASTM 1557'!$B$48=\"\",\"\",'ASTM 1557'!$B$48)","v":"Wet Density of Specimen, (lb):"},{"$f":"IF('ASTM 1557'!$N$30=\"\",\"\",'ASTM 1557'!$N$30)","v":"3-1"}]
[274,{"$f":"IF('ASTM 1557'!$O$48=\"\",\"\",'ASTM 1557'!$O$48)","v":""},{"$f":"IF( 'ASTM 1557'!$B$6=\"\",\"\", 'ASTM 1557'!$B$6)","v":"ASTM D1557"},{"$f":"IF('ASTM 1557'!$B$48=\"\",\"\",'ASTM 1557'!$B$48)","v":"Wet Density of Specimen, (lb):"},{"$f":"IF('ASTM 1557'!$O$30=\"\",\"\",'ASTM 1557'!$O$30)","v":"3-2"}]
[275,{"$f":"IF('ASTM 1557'!$P$48=\"\",\"\",'ASTM 1557'!$P$48)","v":""},{"$f":"IF( 'ASTM 1557'!$B$6=\"\",\"\", 'ASTM 1557'!$B$6)","v":"ASTM D1557"},{"$f":"IF('ASTM 1557'!$B$48=\"\",\"\",'ASTM 1557'!$B$48)","v":"Wet Density of Specimen, (lb):"},{"$f":"IF('ASTM 1557'!$P$30=\"\",\"\",'ASTM 1557'!$P$30)","v":"3-3"}]
[276,{"$f":"IF('ASTM 1557'!$Q$48=\"\",\"\",'ASTM 1557'!$Q$48)","v":""},{"$f":"IF( 'ASTM 1557'!$B$6=\"\",\"\", 'ASTM 1557'!$B$6)","v":"ASTM D1557"},{"$f":"IF('ASTM 1557'!$B$48=\"\",\"\",'ASTM 1557'!$B$48)","v":"Wet Density of Specimen, (lb):"},{"$f":"IF('ASTM 1557'!$Q$30=\"\",\"\",'ASTM 1557'!$Q$30)","v":"3-4"}]
[277,{"$f":"IF('ASTM 1557'!$D$49=\"\",\"\",'ASTM 1557'!$D$49)","v":""},{"$f":"IF( 'ASTM 1557'!$B$6=\"\",\"\", 'ASTM 1557'!$B$6)","v":"ASTM D1557"},{"$f":"IF('ASTM 1557'!$B$49=\"\",\"\",'ASTM 1557'!$B$49)","v":"Wet Mass of Pan & Specimen, (lb):"},{"$f":"IF('ASTM 1557'!$D$30=\"\",\"\",'ASTM 1557'!$D$30)","v":"1-1"}]
[278,{"$f":"IF('ASTM 1557'!$E$49=\"\",\"\",'ASTM 1557'!$E$49)","v":""},{"$f":"IF( 'ASTM 1557'!$B$6=\"\",\"\", 'ASTM 1557'!$B$6)","v":"ASTM D1557"},{"$f":"IF('ASTM 1557'!$B$49=\"\",\"\",'ASTM 1557'!$B$49)","v":"Wet Mass of Pan & Specimen, (lb):"},{"$f":"IF('ASTM 1557'!$E$30=\"\",\"\",'ASTM 1557'!$E$30)","v":"1-2"}]
[279,{"$f":"IF('ASTM 1557'!$F$49=\"\",\"\",'ASTM 1557'!$F$49)","v":""},{"$f":"IF( 'ASTM 1557'!$B$6=\"\",\"\", 'ASTM 1557'!$B$6)","v":"ASTM D1557"},{"$f":"IF('ASTM 1557'!$B$49=\"\",\"\",'ASTM 1557'!$B$49)","v":"Wet Mass of Pan & Specimen, (lb):"},{"$f":"IF('ASTM 1557'!$F$30=\"\",\"\",'ASTM 1557'!$F$30)","v":"1-3"}]
[280,{"$f":"IF('ASTM 1557'!$G$49=\"\",\"\",'ASTM 1557'!$G$49)","v":""},{"$f":"IF( 'ASTM 1557'!$B$6=\"\",\"\", 'ASTM 1557'!$B$6)","v":"ASTM D1557"},{"$f":"IF('ASTM 1557'!$B$49=\"\",\"\",'ASTM 1557'!$B$49)","v":"Wet Mass of Pan & Specimen, (lb):"},{"$f":"IF('ASTM 1557'!$G$30=\"\",\"\",'ASTM 1557'!$G$30)","v":"1-4"}]
[281,{"$f":"IF('ASTM 1557'!$I$49=\"\",\"\",'ASTM 1557'!$I$49)","v":""},{"$f":"IF( 'ASTM 1557'!$B$6=\"\",\"\", 'ASTM 1557'!$B$6)","v":"ASTM D1557"},{"$f":"IF('ASTM 1557'!$B$49=\"\",\"\",'ASTM 1557'!$B$49)","v":"Wet Mass of Pan & Specimen, (lb):"},{"$f":"IF('ASTM 1557'!$I$30=\"\",\"\",'ASTM 1557'!$I$30)","v":"2-1"}]
[282,{"$f":"IF('ASTM 1557'!$J$49=\"\",\"\",'ASTM 1557'!$J$49)","v":""},{"$f":"IF( 'ASTM 1557'!$B$6=\"\",\"\", 'ASTM 1557'!$B$6)","v":"ASTM D1557"},{"$f":"IF('ASTM 1557'!$B$49=\"\",\"\",'ASTM 1557'!$B$49)","v":"Wet Mass of Pan & Specimen, (lb):"},{"$f":"IF('ASTM 1557'!$J$30=\"\",\"\",'ASTM 1557'!$J$30)","v":"2-2"}]
[283,{"$f":"IF('ASTM 1557'!$K$49=\"\",\"\",'ASTM 1557'!$K$49)","v":""},{"$f":"IF( 'ASTM 1557'!$B$6=\"\",\"\", 'ASTM 1557'!$B$6)","v":"ASTM D1557"},{"$f":"IF('ASTM 1557'!$B$49=\"\",\"\",'ASTM 1557'!$B$49)","v":"Wet Mass of Pan & Specimen, (lb):"},{"$f":"IF('ASTM 1557'!$K$30=\"\",\"\",'ASTM 1557'!$K$30)","v":"2-3"}]
[284,{"$f":"IF('ASTM 1557'!$L$49=\"\",\"\",'ASTM 1557'!$L$49)","v":""},{"$f":"IF( 'ASTM 1557'!$B$6=\"\",\"\", 'ASTM 1557'!$B$6)","v":"ASTM D1557"},{"$f":"IF('ASTM 1557'!$B$49=\"\",\"\",'ASTM 1557'!$B$49)","v":"Wet Mass of Pan & Specimen, (lb):"},{"$f":"IF('ASTM 1557'!$L$30=\"\",\"\",'ASTM 1557'!$L$30)","v":"2-4"}]
[285,{"$f":"IF('ASTM 1557'!$N$49=\"\",\"\",'ASTM 1557'!$N$49)","v":""},{"$f":"IF( 'ASTM 1557'!$B$6=\"\",\"\", 'ASTM 1557'!$B$6)","v":"ASTM D1557"},{"$f":"IF('ASTM 1557'!$B$49=\"\",\"\",'ASTM 1557'!$B$49)","v":"Wet Mass of Pan & Specimen, (lb):"},{"$f":"IF('ASTM 1557'!$N$30=\"\",\"\",'ASTM 1557'!$N$30)","v":"3-1"}]
[286,{"$f":"IF('ASTM 1557'!$O$49=\"\",\"\",'ASTM 1557'!$O$49)","v":""},{"$f":"IF( 'ASTM 1557'!$B$6=\"\",\"\", 'ASTM 1557'!$B$6)","v":"ASTM D1557"},{"$f":"IF('ASTM 1557'!$B$49=\"\",\"\",'ASTM 1557'!$B$49)","v":"Wet Mass of Pan & Specimen, (lb):"},{"$f":"IF('ASTM 1557'!$O$30=\"\",\"\",'ASTM 1557'!$O$30)","v":"3-2"}]
[287,{"$f":"IF('ASTM 1557'!$P$49=\"\",\"\",'ASTM 1557'!$P$49)","v":""},{"$f":"IF( 'ASTM 1557'!$B$6=\"\",\"\", 'ASTM 1557'!$B$6)","v":"ASTM D1557"},{"$f":"IF('ASTM 1557'!$B$49=\"\",\"\",'ASTM 1557'!$B$49)","v":"Wet Mass of Pan & Specimen, (lb):"},{"$f":"IF('ASTM 1557'!$P$30=\"\",\"\",'ASTM 1557'!$P$30)","v":"3-3"}]
[288,{"$f":"IF('ASTM 1557'!$Q$49=\"\",\"\",'ASTM 1557'!$Q$49)","v":""},{"$f":"IF( 'ASTM 1557'!$B$6=\"\",\"\", 'ASTM 1557'!$B$6)","v":"ASTM D1557"},{"$f":"IF('ASTM 1557'!$B$49=\"\",\"\",'ASTM 1557'!$B$49)","v":"Wet Mass of Pan & Specimen, (lb):"},{"$f":"IF('ASTM 1557'!$Q$30=\"\",\"\",'ASTM 1557'!$Q$30)","v":"3-4"}]
[289,{"$f":"IF('ASTM 1557'!$D$50=\"\",\"\",'ASTM 1557'!$D$50)","v":""},{"$f":"IF( 'ASTM 1557'!$B$6=\"\",\"\", 'ASTM 1557'!$B$6)","v":"ASTM D1557"},{"$f":"IF('ASTM 1557'!$B$50=\"\",\"\",'ASTM 1557'!$B$50)","v":"Dry Mass Pan & Specimen, (lb):"},{"$f":"IF('ASTM 1557'!$D$30=\"\",\"\",'ASTM 1557'!$D$30)","v":"1-1"}]
[290,{"$f":"IF('ASTM 1557'!$E$50=\"\",\"\",'ASTM 1557'!$E$50)","v":""},{"$f":"IF( 'ASTM 1557'!$B$6=\"\",\"\", 'ASTM 1557'!$B$6)","v":"ASTM D1557"},{"$f":"IF('ASTM 1557'!$B$50=\"\",\"\",'ASTM 1557'!$B$50)","v":"Dry Mass Pan & Specimen, (lb):"},{"$f":"IF('ASTM 1557'!$E$30=\"\",\"\",'ASTM 1557'!$E$30)","v":"1-2"}]
[291,{"$f":"IF('ASTM 1557'!$F$50=\"\",\"\",'ASTM 1557'!$F$50)","v":""},{"$f":"IF( 'ASTM 1557'!$B$6=\"\",\"\", 'ASTM 1557'!$B$6)","v":"ASTM D1557"},{"$f":"IF('ASTM 1557'!$B$50=\"\",\"\",'ASTM 1557'!$B$50)","v":"Dry Mass Pan & Specimen, (lb):"},{"$f":"IF('ASTM 1557'!$F$30=\"\",\"\",'ASTM 1557'!$F$30)","v":"1-3"}]
[292,{"$f":"IF('ASTM 1557'!$G$50=\"\",\"\",'ASTM 1557'!$G$50)","v":""},{"$f":"IF( 'ASTM 1557'!$B$6=\"\",\"\", 'ASTM 1557'!$B$6)","v":"ASTM D1557"},{"$f":"IF('ASTM 1557'!$B$50=\"\",\"\",'ASTM 1557'!$B$50)","v":"Dry Mass Pan & Specimen, (lb):"},{"$f":"IF('ASTM 1557'!$G$30=\"\",\"\",'ASTM 1557'!$G$30)","v":"1-4"}]
[293,{"$f":"IF('ASTM 1557'!$I$50=\"\",\"\",'ASTM 1557'!$I$50)","v":""},{"$f":"IF( 'ASTM 1557'!$B$6=\"\",\"\", 'ASTM 1557'!$B$6)","v":"ASTM D1557"},{"$f":"IF('ASTM 1557'!$B$50=\"\",\"\",'ASTM 1557'!$B$50)","v":"Dry Mass Pan & Specimen, (lb):"},{"$f":"IF('ASTM 1557'!$I$30=\"\",\"\",'ASTM 1557'!$I$30)","v":"2-1"}]
[294,{"$f":"IF('ASTM 1557'!$J$50=\"\",\"\",'ASTM 1557'!$J$50)","v":""},{"$f":"IF( 'ASTM 1557'!$B$6=\"\",\"\", 'ASTM 1557'!$B$6)","v":"ASTM D1557"},{"$f":"IF('ASTM 1557'!$B$50=\"\",\"\",'ASTM 1557'!$B$50)","v":"Dry Mass Pan & Specimen, (lb):"},{"$f":"IF('ASTM 1557'!$J$30=\"\",\"\",'ASTM 1557'!$J$30)","v":"2-2"}]
[295,{"$f":"IF('ASTM 1557'!$K$50=\"\",\"\",'ASTM 1557'!$K$50)","v":""},{"$f":"IF( 'ASTM 1557'!$B$6=\"\",\"\", 'ASTM 1557'!$B$6)","v":"ASTM D1557"},{"$f":"IF('ASTM 1557'!$B$50=\"\",\"\",'ASTM 1557'!$B$50)","v":"Dry Mass Pan & Specimen, (lb):"},{"$f":"IF('ASTM 1557'!$K$30=\"\",\"\",'ASTM 1557'!$K$30)","v":"2-3"}]
[296,{"$f":"IF('ASTM 1557'!$L$50=\"\",\"\",'ASTM 1557'!$L$50)","v":""},{"$f":"IF( 'ASTM 1557'!$B$6=\"\",\"\", 'ASTM 1557'!$B$6)","v":"ASTM D1557"},{"$f":"IF('ASTM 1557'!$B$50=\"\",\"\",'ASTM 1557'!$B$50)","v":"Dry Mass Pan & Specimen, (lb):"},{"$f":"IF('ASTM 1557'!$L$30=\"\",\"\",'ASTM 1557'!$L$30)","v":"2-4"}]
[297,{"$f":"IF('ASTM 1557'!$N$50=\"\",\"\",'ASTM 1557'!$N$50)","v":""},{"$f":"IF( 'ASTM 1557'!$B$6=\"\",\"\", 'ASTM 1557'!$B$6)","v":"ASTM D1557"},{"$f":"IF('ASTM 1557'!$B$50=\"\",\"\",'ASTM 1557'!$B$50)","v":"Dry Mass Pan & Specimen, (lb):"},{"$f":"IF('ASTM 1557'!$N$30=\"\",\"\",'ASTM 1557'!$N$30)","v":"3-1"}]
[298,{"$f":"IF('ASTM 1557'!$O$50=\"\",\"\",'ASTM 1557'!$O$50)","v":""},{"$f":"IF( 'ASTM 1557'!$B$6=\"\",\"\", 'ASTM 1557'!$B$6)","v":"ASTM D1557"},{"$f":"IF('ASTM 1557'!$B$50=\"\",\"\",'ASTM 1557'!$B$50)","v":"Dry Mass Pan & Specimen, (lb):"},{"$f":"IF('ASTM 1557'!$O$30=\"\",\"\",'ASTM 1557'!$O$30)","v":"3-2"}]
[299,{"$f":"IF('ASTM 1557'!$P$50=\"\",\"\",'ASTM 1557'!$P$50)","v":""},{"$f":"IF( 'ASTM 1557'!$B$6=\"\",\"\", 'ASTM 1557'!$B$6)","v":"ASTM D1557"},{"$f":"IF('ASTM 1557'!$B$50=\"\",\"\",'ASTM 1557'!$B$50)","v":"Dry Mass Pan & Specimen, (lb):"},{"$f":"IF('ASTM 1557'!$P$30=\"\",\"\",'ASTM 1557'!$P$30)","v":"3-3"}]
[300,{"$f":"IF('ASTM 1557'!$Q$50=\"\",\"\",'ASTM 1557'!$Q$50)","v":""},{"$f":"IF( 'ASTM 1557'!$B$6=\"\",\"\", 'ASTM 1557'!$B$6)","v":"ASTM D1557"},{"$f":"IF('ASTM 1557'!$B$50=\"\",\"\",'ASTM 1557'!$B$50)","v":"Dry Mass Pan & Specimen, (lb):"},{"$f":"IF('ASTM 1557'!$Q$30=\"\",\"\",'ASTM 1557'!$Q$30)","v":"3-4"}]
[301,{"$f":"IF('ASTM 1557'!$D$51=\"\",\"\",'ASTM 1557'!$D$51)","v":""},{"$f":"IF( 'ASTM 1557'!$B$6=\"\",\"\", 'ASTM 1557'!$B$6)","v":"ASTM D1557"},{"$f":"IF('ASTM 1557'!$B$51=\"\",\"\",'ASTM 1557'!$B$51)","v":"Tare Mass Pan, (lb):"},{"$f":"IF('ASTM 1557'!$D$30=\"\",\"\",'ASTM 1557'!$D$30)","v":"1-1"}]
[302,{"$f":"IF('ASTM 1557'!$E$51=\"\",\"\",'ASTM 1557'!$E$51)","v":""},{"$f":"IF( 'ASTM 1557'!$B$6=\"\",\"\", 'ASTM 1557'!$B$6)","v":"ASTM D1557"},{"$f":"IF('ASTM 1557'!$B$51=\"\",\"\",'ASTM 1557'!$B$51)","v":"Tare Mass Pan, (lb):"},{"$f":"IF('ASTM 1557'!$E$30=\"\",\"\",'ASTM 1557'!$E$30)","v":"1-2"}]
[303,{"$f":"IF('ASTM 1557'!$F$51=\"\",\"\",'ASTM 1557'!$F$51)","v":""},{"$f":"IF( 'ASTM 1557'!$B$6=\"\",\"\", 'ASTM 1557'!$B$6)","v":"ASTM D1557"},{"$f":"IF('ASTM 1557'!$B$51=\"\",\"\",'ASTM 1557'!$B$51)","v":"Tare Mass Pan, (lb):"},{"$f":"IF('ASTM 1557'!$F$30=\"\",\"\",'ASTM 1557'!$F$30)","v":"1-3"}]
[304,{"$f":"IF('ASTM 1557'!$G$51=\"\",\"\",'ASTM 1557'!$G$51)","v":""},{"$f":"IF( 'ASTM 1557'!$B$6=\"\",\"\", 'ASTM 1557'!$B$6)","v":"ASTM D1557"},{"$f":"IF('ASTM 1557'!$B$51=\"\",\"\",'ASTM 1557'!$B$51)","v":"Tare Mass Pan, (lb):"},{"$f":"IF('ASTM 1557'!$G$30=\"\",\"\",'ASTM 1557'!$G$30)","v":"1-4"}]
[305,{"$f":"IF('ASTM 1557'!$I$51=\"\",\"\",'ASTM 1557'!$I$51)","v":""},{"$f":"IF( 'ASTM 1557'!$B$6=\"\",\"\", 'ASTM 1557'!$B$6)","v":"ASTM D1557"},{"$f":"IF('ASTM 1557'!$B$51=\"\",\"\",'ASTM 1557'!$B$51)","v":"Tare Mass Pan, (lb):"},{"$f":"IF('ASTM 1557'!$I$30=\"\",\"\",'ASTM 1557'!$I$30)","v":"2-1"}]
[306,{"$f":"IF('ASTM 1557'!$J$51=\"\",\"\",'ASTM 1557'!$J$51)","v":""},{"$f":"IF( 'ASTM 1557'!$B$6=\"\",\"\", 'ASTM 1557'!$B$6)","v":"ASTM D1557"},{"$f":"IF('ASTM 1557'!$B$51=\"\",\"\",'ASTM 1557'!$B$51)","v":"Tare Mass Pan, (lb):"},{"$f":"IF('ASTM 1557'!$J$30=\"\",\"\",'ASTM 1557'!$J$30)","v":"2-2"}]
[307,{"$f":"IF('ASTM 1557'!$K$51=\"\",\"\",'ASTM 1557'!$K$51)","v":""},{"$f":"IF( 'ASTM 1557'!$B$6=\"\",\"\", 'ASTM 1557'!$B$6)","v":"ASTM D1557"},{"$f":"IF('ASTM 1557'!$B$51=\"\",\"\",'ASTM 1557'!$B$51)","v":"Tare Mass Pan, (lb):"},{"$f":"IF('ASTM 1557'!$K$30=\"\",\"\",'ASTM 1557'!$K$30)","v":"2-3"}]
[308,{"$f":"IF('ASTM 1557'!$L$51=\"\",\"\",'ASTM 1557'!$L$51)","v":""},{"$f":"IF( 'ASTM 1557'!$B$6=\"\",\"\", 'ASTM 1557'!$B$6)","v":"ASTM D1557"},{"$f":"IF('ASTM 1557'!$B$51=\"\",\"\",'ASTM 1557'!$B$51)","v":"Tare Mass Pan, (lb):"},{"$f":"IF('ASTM 1557'!$L$30=\"\",\"\",'ASTM 1557'!$L$30)","v":"2-4"}]
[309,{"$f":"IF('ASTM 1557'!$N$51=\"\",\"\",'ASTM 1557'!$N$51)","v":""},{"$f":"IF( 'ASTM 1557'!$B$6=\"\",\"\", 'ASTM 1557'!$B$6)","v":"ASTM D1557"},{"$f":"IF('ASTM 1557'!$B$51=\"\",\"\",'ASTM 1557'!$B$51)","v":"Tare Mass Pan, (lb):"},{"$f":"IF('ASTM 1557'!$N$30=\"\",\"\",'ASTM 1557'!$N$30)","v":"3-1"}]
[310,{"$f":"IF('ASTM 1557'!$O$51=\"\",\"\",'ASTM 1557'!$O$51)","v":""},{"$f":"IF( 'ASTM 1557'!$B$6=\"\",\"\", 'ASTM 1557'!$B$6)","v":"ASTM D1557"},{"$f":"IF('ASTM 1557'!$B$51=\"\",\"\",'ASTM 1557'!$B$51)","v":"Tare Mass Pan, (lb):"},{"$f":"IF('ASTM 1557'!$O$30=\"\",\"\",'ASTM 1557'!$O$30)","v":"3-2"}]
[311,{"$f":"IF('ASTM 1557'!$P$51=\"\",\"\",'ASTM 1557'!$P$51)","v":""},{"$f":"IF( 'ASTM 1557'!$B$6=\"\",\"\", 'ASTM 1557'!$B$6)","v":"ASTM D1557"},{"$f":"IF('ASTM 1557'!$B$51=\"\",\"\",'ASTM 1557'!$B$51)","v":"Tare Mass Pan, (lb):"},{"$f":"IF('ASTM 1557'!$P$30=\"\",\"\",'ASTM 1557'!$P$30)","v":"3-3"}]
[312,{"$f":"IF('ASTM 1557'!$Q$51=\"\",\"\",'ASTM 1557'!$Q$51)","v":""},{"$f":"IF( 'ASTM 1557'!$B$6=\"\",\"\", 'ASTM 1557'!$B$6)","v":"ASTM D1557"},{"$f":"IF('ASTM 1557'!$B$51=\"\",\"\",'ASTM 1557'!$B$51)","v":"Tare Mass Pan, (lb):"},{"$f":"IF('ASTM 1557'!$Q$30=\"\",\"\",'ASTM 1557'!$Q$30)","v":"3-4"}]
[313,{"$f":"IF('ASTM 1557'!$D$52=\"\",\"\",'ASTM 1557'!$D$52)","v":""},{"$f":"IF( 'ASTM 1557'!$B$6=\"\",\"\", 'ASTM 1557'!$B$6)","v":"ASTM D1557"},{"$f":"IF('ASTM 1557'!$B$52=\"\",\"\",'ASTM 1557'!$B$52)","v":"Dry Mass Material , (lb):"},{"$f":"IF('ASTM 1557'!$D$30=\"\",\"\",'ASTM 1557'!$D$30)","v":"1-1"}]
[314,{"$f":"IF('ASTM 1557'!$E$52=\"\",\"\",'ASTM 1557'!$E$52)","v":""},{"$f":"IF( 'ASTM 1557'!$B$6=\"\",\"\", 'ASTM 1557'!$B$6)","v":"ASTM D1557"},{"$f":"IF('ASTM 1557'!$B$52=\"\",\"\",'ASTM 1557'!$B$52)","v":"Dry Mass Material , (lb):"},{"$f":"IF('ASTM 1557'!$E$30=\"\",\"\",'ASTM 1557'!$E$30)","v":"1-2"}]
[315,{"$f":"IF('ASTM 1557'!$F$52=\"\",\"\",'ASTM 1557'!$F$52)","v":""},{"$f":"IF( 'ASTM 1557'!$B$6=\"\",\"\", 'ASTM 1557'!$B$6)","v":"ASTM D1557"},{"$f":"IF('ASTM 1557'!$B$52=\"\",\"\",'ASTM 1557'!$B$52)","v":"Dry Mass Material , (lb):"},{"$f":"IF('ASTM 1557'!$F$30=\"\",\"\",'ASTM 1557'!$F$30)","v":"1-3"}]
[316,{"$f":"IF('ASTM 1557'!$G$52=\"\",\"\",'ASTM 1557'!$G$52)","v":""},{"$f":"IF( 'ASTM 1557'!$B$6=\"\",\"\", 'ASTM 1557'!$B$6)","v":"ASTM D1557"},{"$f":"IF('ASTM 1557'!$B$52=\"\",\"\",'ASTM 1557'!$B$52)","v":"Dry Mass Material , (lb):"},{"$f":"IF('ASTM 1557'!$G$30=\"\",\"\",'ASTM 1557'!$G$30)","v":"1-4"}]
[317,{"$f":"IF('ASTM 1557'!$I$52=\"\",\"\",'ASTM 1557'!$I$52)","v":""},{"$f":"IF( 'ASTM 1557'!$B$6=\"\",\"\", 'ASTM 1557'!$B$6)","v":"ASTM D1557"},{"$f":"IF('ASTM 1557'!$B$52=\"\",\"\",'ASTM 1557'!$B$52)","v":"Dry Mass Material , (lb):"},{"$f":"IF('ASTM 1557'!$I$30=\"\",\"\",'ASTM 1557'!$I$30)","v":"2-1"}]
[318,{"$f":"IF('ASTM 1557'!$J$52=\"\",\"\",'ASTM 1557'!$J$52)","v":""},{"$f":"IF( 'ASTM 1557'!$B$6=\"\",\"\", 'ASTM 1557'!$B$6)","v":"ASTM D1557"},{"$f":"IF('ASTM 1557'!$B$52=\"\",\"\",'ASTM 1557'!$B$52)","v":"Dry Mass Material , (lb):"},{"$f":"IF('ASTM 1557'!$J$30=\"\",\"\",'ASTM 1557'!$J$30)","v":"2-2"}]
[319,{"$f":"IF('ASTM 1557'!$K$52=\"\",\"\",'ASTM 1557'!$K$52)","v":""},{"$f":"IF( 'ASTM 1557'!$B$6=\"\",\"\", 'ASTM 1557'!$B$6)","v":"ASTM D1557"},{"$f":"IF('ASTM 1557'!$B$52=\"\",\"\",'ASTM 1557'!$B$52)","v":"Dry Mass Material , (lb):"},{"$f":"IF('ASTM 1557'!$K$30=\"\",\"\",'ASTM 1557'!$K$30)","v":"2-3"}]
[320,{"$f":"IF('ASTM 1557'!$L$52=\"\",\"\",'ASTM 1557'!$L$52)","v":""},{"$f":"IF( 'ASTM 1557'!$B$6=\"\",\"\", 'ASTM 1557'!$B$6)","v":"ASTM D1557"},{"$f":"IF('ASTM 1557'!$B$52=\"\",\"\",'ASTM 1557'!$B$52)","v":"Dry Mass Material , (lb):"},{"$f":"IF('ASTM 1557'!$L$30=\"\",\"\",'ASTM 1557'!$L$30)","v":"2-4"}]
[321,{"$f":"IF('ASTM 1557'!$N$52=\"\",\"\",'ASTM 1557'!$N$52)","v":""},{"$f":"IF( 'ASTM 1557'!$B$6=\"\",\"\", 'ASTM 1557'!$B$6)","v":"ASTM D1557"},{"$f":"IF('ASTM 1557'!$B$52=\"\",\"\",'ASTM 1557'!$B$52)","v":"Dry Mass Material , (lb):"},{"$f":"IF('ASTM 1557'!$N$30=\"\",\"\",'ASTM 1557'!$N$30)","v":"3-1"}]
[322,{"$f":"IF('ASTM 1557'!$O$52=\"\",\"\",'ASTM 1557'!$O$52)","v":""},{"$f":"IF( 'ASTM 1557'!$B$6=\"\",\"\", 'ASTM 1557'!$B$6)","v":"ASTM D1557"},{"$f":"IF('ASTM 1557'!$B$52=\"\",\"\",'ASTM 1557'!$B$52)","v":"Dry Mass Material , (lb):"},{"$f":"IF('ASTM 1557'!$O$30=\"\",\"\",'ASTM 1557'!$O$30)","v":"3-2"}]
[323,{"$f":"IF('ASTM 1557'!$P$52=\"\",\"\",'ASTM 1557'!$P$52)","v":""},{"$f":"IF( 'ASTM 1557'!$B$6=\"\",\"\", 'ASTM 1557'!$B$6)","v":"ASTM D1557"},{"$f":"IF('ASTM 1557'!$B$52=\"\",\"\",'ASTM 1557'!$B$52)","v":"Dry Mass Material , (lb):"},{"$f":"IF('ASTM 1557'!$P$30=\"\",\"\",'ASTM 1557'!$P$30)","v":"3-3"}]
[324,{"$f":"IF('ASTM 1557'!$Q$52=\"\",\"\",'ASTM 1557'!$Q$52)","v":""},{"$f":"IF( 'ASTM 1557'!$B$6=\"\",\"\", 'ASTM 1557'!$B$6)","v":"ASTM D1557"},{"$f":"IF('ASTM 1557'!$B$52=\"\",\"\",'ASTM 1557'!$B$52)","v":"Dry Mass Material , (lb):"},{"$f":"IF('ASTM 1557'!$Q$30=\"\",\"\",'ASTM 1557'!$Q$30)","v":"3-4"}]
[325,{"$f":"IF('ASTM 1557'!$D$53=\"\",\"\",'ASTM 1557'!$D$53)","v":""},{"$f":"IF( 'ASTM 1557'!$B$6=\"\",\"\", 'ASTM 1557'!$B$6)","v":"ASTM D1557"},{"$f":"IF('ASTM 1557'!$B$53=\"\",\"\",'ASTM 1557'!$B$53)","v":"Mass Water, (lb):"},{"$f":"IF('ASTM 1557'!$D$30=\"\",\"\",'ASTM 1557'!$D$30)","v":"1-1"}]
[326,{"$f":"IF('ASTM 1557'!$E$53=\"\",\"\",'ASTM 1557'!$E$53)","v":""},{"$f":"IF( 'ASTM 1557'!$B$6=\"\",\"\", 'ASTM 1557'!$B$6)","v":"ASTM D1557"},{"$f":"IF('ASTM 1557'!$B$53=\"\",\"\",'ASTM 1557'!$B$53)","v":"Mass Water, (lb):"},{"$f":"IF('ASTM 1557'!$E$30=\"\",\"\",'ASTM 1557'!$E$30)","v":"1-2"}]
[327,{"$f":"IF('ASTM 1557'!$F$53=\"\",\"\",'ASTM 1557'!$F$53)","v":""},{"$f":"IF( 'ASTM 1557'!$B$6=\"\",\"\", 'ASTM 1557'!$B$6)","v":"ASTM D1557"},{"$f":"IF('ASTM 1557'!$B$53=\"\",\"\",'ASTM 1557'!$B$53)","v":"Mass Water, (lb):"},{"$f":"IF('ASTM 1557'!$F$30=\"\",\"\",'ASTM 1557'!$F$30)","v":"1-3"}]
[328,{"$f":"IF('ASTM 1557'!$G$53=\"\",\"\",'ASTM 1557'!$G$53)","v":""},{"$f":"IF( 'ASTM 1557'!$B$6=\"\",\"\", 'ASTM 1557'!$B$6)","v":"ASTM D1557"},{"$f":"IF('ASTM 1557'!$B$53=\"\",\"\",'ASTM 1557'!$B$53)","v":"Mass Water, (lb):"},{"$f":"IF('ASTM 1557'!$G$30=\"\",\"\",'ASTM 1557'!$G$30)","v":"1-4"}]
[329,{"$f":"IF('ASTM 1557'!$I$53=\"\",\"\",'ASTM 1557'!$I$53)","v":""},{"$f":"IF( 'ASTM 1557'!$B$6=\"\",\"\", 'ASTM 1557'!$B$6)","v":"ASTM D1557"},{"$f":"IF('ASTM 1557'!$B$53=\"\",\"\",'ASTM 1557'!$B$53)","v":"Mass Water, (lb):"},{"$f":"IF('ASTM 1557'!$I$30=\"\",\"\",'ASTM 1557'!$I$30)","v":"2-1"}]
[330,{"$f":"IF('ASTM 1557'!$J$53=\"\",\"\",'ASTM 1557'!$J$53)","v":""},{"$f":"IF( 'ASTM 1557'!$B$6=\"\",\"\", 'ASTM 1557'!$B$6)","v":"ASTM D1557"},{"$f":"IF('ASTM 1557'!$B$53=\"\",\"\",'ASTM 1557'!$B$53)","v":"Mass Water, (lb):"},{"$f":"IF('ASTM 1557'!$J$30=\"\",\"\",'ASTM 1557'!$J$30)","v":"2-2"}]
[331,{"$f":"IF('ASTM 1557'!$K$53=\"\",\"\",'ASTM 1557'!$K$53)","v":""},{"$f":"IF( 'ASTM 1557'!$B$6=\"\",\"\", 'ASTM 1557'!$B$6)","v":"ASTM D1557"},{"$f":"IF('ASTM 1557'!$B$53=\"\",\"\",'ASTM 1557'!$B$53)","v":"Mass Water, (lb):"},{"$f":"IF('ASTM 1557'!$K$30=\"\",\"\",'ASTM 1557'!$K$30)","v":"2-3"}]
[332,{"$f":"IF('ASTM 1557'!$L$53=\"\",\"\",'ASTM 1557'!$L$53)","v":""},{"$f":"IF( 'ASTM 1557'!$B$6=\"\",\"\", 'ASTM 1557'!$B$6)","v":"ASTM D1557"},{"$f":"IF('ASTM 1557'!$B$53=\"\",\"\",'ASTM 1557'!$B$53)","v":"Mass Water, (lb):"},{"$f":"IF('ASTM 1557'!$L$30=\"\",\"\",'ASTM 1557'!$L$30)","v":"2-4"}]
[333,{"$f":"IF('ASTM 1557'!$N$53=\"\",\"\",'ASTM 1557'!$N$53)","v":""},{"$f":"IF( 'ASTM 1557'!$B$6=\"\",\"\", 'ASTM 1557'!$B$6)","v":"ASTM D1557"},{"$f":"IF('ASTM 1557'!$B$53=\"\",\"\",'ASTM 1557'!$B$53)","v":"Mass Water, (lb):"},{"$f":"IF('ASTM 1557'!$N$30=\"\",\"\",'ASTM 1557'!$N$30)","v":"3-1"}]
[334,{"$f":"IF('ASTM 1557'!$O$53=\"\",\"\",'ASTM 1557'!$O$53)","v":""},{"$f":"IF( 'ASTM 1557'!$B$6=\"\",\"\", 'ASTM 1557'!$B$6)","v":"ASTM D1557"},{"$f":"IF('ASTM 1557'!$B$53=\"\",\"\",'ASTM 1557'!$B$53)","v":"Mass Water, (lb):"},{"$f":"IF('ASTM 1557'!$O$30=\"\",\"\",'ASTM 1557'!$O$30)","v":"3-2"}]
[335,{"$f":"IF('ASTM 1557'!$P$53=\"\",\"\",'ASTM 1557'!$P$53)","v":""},{"$f":"IF( 'ASTM 1557'!$B$6=\"\",\"\", 'ASTM 1557'!$B$6)","v":"ASTM D1557"},{"$f":"IF('ASTM 1557'!$B$53=\"\",\"\",'ASTM 1557'!$B$53)","v":"Mass Water, (lb):"},{"$f":"IF('ASTM 1557'!$P$30=\"\",\"\",'ASTM 1557'!$P$30)","v":"3-3"}]
[336,{"$f":"IF('ASTM 1557'!$Q$53=\"\",\"\",'ASTM 1557'!$Q$53)","v":""},{"$f":"IF( 'ASTM 1557'!$B$6=\"\",\"\", 'ASTM 1557'!$B$6)","v":"ASTM D1557"},{"$f":"IF('ASTM 1557'!$B$53=\"\",\"\",'ASTM 1557'!$B$53)","v":"Mass Water, (lb):"},{"$f":"IF('ASTM 1557'!$Q$30=\"\",\"\",'ASTM 1557'!$Q$30)","v":"3-4"}]
[337,{"$f":"IF('ASTM 1557'!$D$54=\"\",\"\",'ASTM 1557'!$D$54)","v":""},{"$f":"IF( 'ASTM 1557'!$B$6=\"\",\"\", 'ASTM 1557'!$B$6)","v":"ASTM D1557"},{"$f":"IF('ASTM 1557'!$B$54=\"\",\"\",'ASTM 1557'!$B$54)","v":"Percent Water on Total , (%):"},{"$f":"IF('ASTM 1557'!$D$30=\"\",\"\",'ASTM 1557'!$D$30)","v":"1-1"}]
[338,{"$f":"IF('ASTM 1557'!$E$54=\"\",\"\",'ASTM 1557'!$E$54)","v":""},{"$f":"IF( 'ASTM 1557'!$B$6=\"\",\"\", 'ASTM 1557'!$B$6)","v":"ASTM D1557"},{"$f":"IF('ASTM 1557'!$B$54=\"\",\"\",'ASTM 1557'!$B$54)","v":"Percent Water on Total , (%):"},{"$f":"IF('ASTM 1557'!$E$30=\"\",\"\",'ASTM 1557'!$E$30)","v":"1-2"}]
[339,{"$f":"IF('ASTM 1557'!$F$54=\"\",\"\",'ASTM 1557'!$F$54)","v":""},{"$f":"IF( 'ASTM 1557'!$B$6=\"\",\"\", 'ASTM 1557'!$B$6)","v":"ASTM D1557"},{"$f":"IF('ASTM 1557'!$B$54=\"\",\"\",'ASTM 1557'!$B$54)","v":"Percent Water on Total , (%):"},{"$f":"IF('ASTM 1557'!$F$30=\"\",\"\",'ASTM 1557'!$F$30)","v":"1-3"}]
[340,{"$f":"IF('ASTM 1557'!$G$54=\"\",\"\",'ASTM 1557'!$G$54)","v":""},{"$f":"IF( 'ASTM 1557'!$B$6=\"\",\"\", 'ASTM 1557'!$B$6)","v":"ASTM D1557"},{"$f":"IF('ASTM 1557'!$B$54=\"\",\"\",'ASTM 1557'!$B$54)","v":"Percent Water on Total , (%):"},{"$f":"IF('ASTM 1557'!$G$30=\"\",\"\",'ASTM 1557'!$G$30)","v":"1-4"}]
[341,{"$f":"IF('ASTM 1557'!$I$54=\"\",\"\",'ASTM 1557'!$I$54)","v":""},{"$f":"IF( 'ASTM 1557'!$B$6=\"\",\"\", 'ASTM 1557'!$B$6)","v":"ASTM D1557"},{"$f":"IF('ASTM 1557'!$B$54=\"\",\"\",'ASTM 1557'!$B$54)","v":"Percent Water on Total , (%):"},{"$f":"IF('ASTM 1557'!$I$30=\"\",\"\",'ASTM 1557'!$I$30)","v":"2-1"}]
[342,{"$f":"IF('ASTM 1557'!$J$54=\"\",\"\",'ASTM 1557'!$J$54)","v":""},{"$f":"IF( 'ASTM 1557'!$B$6=\"\",\"\", 'ASTM 1557'!$B$6)","v":"ASTM D1557"},{"$f":"IF('ASTM 1557'!$B$54=\"\",\"\",'ASTM 1557'!$B$54)","v":"Percent Water on Total , (%):"},{"$f":"IF('ASTM 1557'!$J$30=\"\",\"\",'ASTM 1557'!$J$30)","v":"2-2"}]
[343,{"$f":"IF('ASTM 1557'!$K$54=\"\",\"\",'ASTM 1557'!$K$54)","v":""},{"$f":"IF( 'ASTM 1557'!$B$6=\"\",\"\", 'ASTM 1557'!$B$6)","v":"ASTM D1557"},{"$f":"IF('ASTM 1557'!$B$54=\"\",\"\",'ASTM 1557'!$B$54)","v":"Percent Water on Total , (%):"},{"$f":"IF('ASTM 1557'!$K$30=\"\",\"\",'ASTM 1557'!$K$30)","v":"2-3"}]
[344,{"$f":"IF('ASTM 1557'!$L$54=\"\",\"\",'ASTM 1557'!$L$54)","v":""},{"$f":"IF( 'ASTM 1557'!$B$6=\"\",\"\", 'ASTM 1557'!$B$6)","v":"ASTM D1557"},{"$f":"IF('ASTM 1557'!$B$54=\"\",\"\",'ASTM 1557'!$B$54)","v":"Percent Water on Total , (%):"},{"$f":"IF('ASTM 1557'!$L$30=\"\",\"\",'ASTM 1557'!$L$30)","v":"2-4"}]
[345,{"$f":"IF('ASTM 1557'!$N$54=\"\",\"\",'ASTM 1557'!$N$54)","v":""},{"$f":"IF( 'ASTM 1557'!$B$6=\"\",\"\", 'ASTM 1557'!$B$6)","v":"ASTM D1557"},{"$f":"IF('ASTM 1557'!$B$54=\"\",\"\",'ASTM 1557'!$B$54)","v":"Percent Water on Total , (%):"},{"$f":"IF('ASTM 1557'!$N$30=\"\",\"\",'ASTM 1557'!$N$30)","v":"3-1"}]
[346,{"$f":"IF('ASTM 1557'!$O$54=\"\",\"\",'ASTM 1557'!$O$54)","v":""},{"$f":"IF( 'ASTM 1557'!$B$6=\"\",\"\", 'ASTM 1557'!$B$6)","v":"ASTM D1557"},{"$f":"IF('ASTM 1557'!$B$54=\"\",\"\",'ASTM 1557'!$B$54)","v":"Percent Water on Total , (%):"},{"$f":"IF('ASTM 1557'!$O$30=\"\",\"\",'ASTM 1557'!$O$30)","v":"3-2"}]
[347,{"$f":"IF('ASTM 1557'!$P$54=\"\",\"\",'ASTM 1557'!$P$54)","v":""},{"$f":"IF( 'ASTM 1557'!$B$6=\"\",\"\", 'ASTM 1557'!$B$6)","v":"ASTM D1557"},{"$f":"IF('ASTM 1557'!$B$54=\"\",\"\",'ASTM 1557'!$B$54)","v":"Percent Water on Total , (%):"},{"$f":"IF('ASTM 1557'!$P$30=\"\",\"\",'ASTM 1557'!$P$30)","v":"3-3"}]
[348,{"$f":"IF('ASTM 1557'!$Q$54=\"\",\"\",'ASTM 1557'!$Q$54)","v":""},{"$f":"IF( 'ASTM 1557'!$B$6=\"\",\"\", 'ASTM 1557'!$B$6)","v":"ASTM D1557"},{"$f":"IF('ASTM 1557'!$B$54=\"\",\"\",'ASTM 1557'!$B$54)","v":"Percent Water on Total , (%):"},{"$f":"IF('ASTM 1557'!$Q$30=\"\",\"\",'ASTM 1557'!$Q$30)","v":"3-4"}]
[349,{"$f":"IF('ASTM 1557'!$D$55=\"\",\"\",'ASTM 1557'!$D$55)","v":""},{"$f":"IF( 'ASTM 1557'!$B$6=\"\",\"\", 'ASTM 1557'!$B$6)","v":"ASTM D1557"},{"$f":"IF('ASTM 1557'!$B$55=\"\",\"\",'ASTM 1557'!$B$55)","v":"Dry Density, (pcf):"},{"$f":"IF('ASTM 1557'!$D$30=\"\",\"\",'ASTM 1557'!$D$30)","v":"1-1"}]
[350,{"$f":"IF('ASTM 1557'!$E$55=\"\",\"\",'ASTM 1557'!$E$55)","v":""},{"$f":"IF( 'ASTM 1557'!$B$6=\"\",\"\", 'ASTM 1557'!$B$6)","v":"ASTM D1557"},{"$f":"IF('ASTM 1557'!$B$55=\"\",\"\",'ASTM 1557'!$B$55)","v":"Dry Density, (pcf):"},{"$f":"IF('ASTM 1557'!$E$30=\"\",\"\",'ASTM 1557'!$E$30)","v":"1-2"}]
[351,{"$f":"IF('ASTM 1557'!$F$55=\"\",\"\",'ASTM 1557'!$F$55)","v":""},{"$f":"IF( 'ASTM 1557'!$B$6=\"\",\"\", 'ASTM 1557'!$B$6)","v":"ASTM D1557"},{"$f":"IF('ASTM 1557'!$B$55=\"\",\"\",'ASTM 1557'!$B$55)","v":"Dry Density, (pcf):"},{"$f":"IF('ASTM 1557'!$F$30=\"\",\"\",'ASTM 1557'!$F$30)","v":"1-3"}]
[352,{"$f":"IF('ASTM 1557'!$G$55=\"\",\"\",'ASTM 1557'!$G$55)","v":""},{"$f":"IF( 'ASTM 1557'!$B$6=\"\",\"\", 'ASTM 1557'!$B$6)","v":"ASTM D1557"},{"$f":"IF('ASTM 1557'!$B$55=\"\",\"\",'ASTM 1557'!$B$55)","v":"Dry Density, (pcf):"},{"$f":"IF('ASTM 1557'!$G$30=\"\",\"\",'ASTM 1557'!$G$30)","v":"1-4"}]
[353,{"$f":"IF('ASTM 1557'!$I$55=\"\",\"\",'ASTM 1557'!$I$55)","v":""},{"$f":"IF( 'ASTM 1557'!$B$6=\"\",\"\", 'ASTM 1557'!$B$6)","v":"ASTM D1557"},{"$f":"IF('ASTM 1557'!$B$55=\"\",\"\",'ASTM 1557'!$B$55)","v":"Dry Density, (pcf):"},{"$f":"IF('ASTM 1557'!$I$30=\"\",\"\",'ASTM 1557'!$I$30)","v":"2-1"}]
[354,{"$f":"IF('ASTM 1557'!$J$55=\"\",\"\",'ASTM 1557'!$J$55)","v":""},{"$f":"IF( 'ASTM 1557'!$B$6=\"\",\"\", 'ASTM 1557'!$B$6)","v":"ASTM D1557"},{"$f":"IF('ASTM 1557'!$B$55=\"\",\"\",'ASTM 1557'!$B$55)","v":"Dry Density, (pcf):"},{"$f":"IF('ASTM 1557'!$J$30=\"\",\"\",'ASTM 1557'!$J$30)","v":"2-2"}]
[355,{"$f":"IF('ASTM 1557'!$K$55=\"\",\"\",'ASTM 1557'!$K$55)","v":""},{"$f":"IF( 'ASTM 1557'!$B$6=\"\",\"\", 'ASTM 1557'!$B$6)","v":"ASTM D1557"},{"$f":"IF('ASTM 1557'!$B$55=\"\",\"\",'ASTM 1557'!$B$55)","v":"Dry Density, (pcf):"},{"$f":"IF('ASTM 1557'!$K$30=\"\",\"\",'ASTM 1557'!$K$30)","v":"2-3"}]
[356,{"$f":"IF('ASTM 1557'!$L$55=\"\",\"\",'ASTM 1557'!$L$55)","v":""},{"$f":"IF( 'ASTM 1557'!$B$6=\"\",\"\", 'ASTM 1557'!$B$6)","v":"ASTM D1557"},{"$f":"IF('ASTM 1557'!$B$55=\"\",\"\",'ASTM 1557'!$B$55)","v":"Dry Density, (pcf):"},{"$f":"IF('ASTM 1557'!$L$30=\"\",\"\",'ASTM 1557'!$L$30)","v":"2-4"}]
[357,{"$f":"IF('ASTM 1557'!$N$55=\"\",\"\",'ASTM 1557'!$N$55)","v":""},{"$f":"IF( 'ASTM 1557'!$B$6=\"\",\"\", 'ASTM 1557'!$B$6)","v":"ASTM D1557"},{"$f":"IF('ASTM 1557'!$B$55=\"\",\"\",'ASTM 1557'!$B$55)","v":"Dry Density, (pcf):"},{"$f":"IF('ASTM 1557'!$N$30=\"\",\"\",'ASTM 1557'!$N$30)","v":"3-1"}]
[358,{"$f":"IF('ASTM 1557'!$O$55=\"\",\"\",'ASTM 1557'!$O$55)","v":""},{"$f":"IF( 'ASTM 1557'!$B$6=\"\",\"\", 'ASTM 1557'!$B$6)","v":"ASTM D1557"},{"$f":"IF('ASTM 1557'!$B$55=\"\",\"\",'ASTM 1557'!$B$55)","v":"Dry Density, (pcf):"},{"$f":"IF('ASTM 1557'!$O$30=\"\",\"\",'ASTM 1557'!$O$30)","v":"3-2"}]
[359,{"$f":"IF('ASTM 1557'!$P$55=\"\",\"\",'ASTM 1557'!$P$55)","v":""},{"$f":"IF( 'ASTM 1557'!$B$6=\"\",\"\", 'ASTM 1557'!$B$6)","v":"ASTM D1557"},{"$f":"IF('ASTM 1557'!$B$55=\"\",\"\",'ASTM 1557'!$B$55)","v":"Dry Density, (pcf):"},{"$f":"IF('ASTM 1557'!$P$30=\"\",\"\",'ASTM 1557'!$P$30)","v":"3-3"}]
[360,{"$f":"IF('ASTM 1557'!$Q$55=\"\",\"\",'ASTM 1557'!$Q$55)","v":""},{"$f":"IF( 'ASTM 1557'!$B$6=\"\",\"\", 'ASTM 1557'!$B$6)","v":"ASTM D1557"},{"$f":"IF('ASTM 1557'!$B$55=\"\",\"\",'ASTM 1557'!$B$55)","v":"Dry Density, (pcf):"},{"$f":"IF('ASTM 1557'!$Q$30=\"\",\"\",'ASTM 1557'!$Q$30)","v":"3-4"}]
[361,{"$f":"IF('ASTM 1557'!$D$56=\"\",\"\",'ASTM 1557'!$D$56)","v":""},{"$f":"IF( 'ASTM 1557'!$B$6=\"\",\"\", 'ASTM 1557'!$B$6)","v":"ASTM D1557"},{"$f":"IF('ASTM 1557'!$B$56=\"\",\"\",'ASTM 1557'!$B$56)","v":"Estimated Dry Density, (pcf):"},{"$f":"IF('ASTM 1557'!$D$30=\"\",\"\",'ASTM 1557'!$D$30)","v":"1-1"}]
[362,{"$f":"IF('ASTM 1557'!$E$56=\"\",\"\",'ASTM 1557'!$E$56)","v":""},{"$f":"IF( 'ASTM 1557'!$B$6=\"\",\"\", 'ASTM 1557'!$B$6)","v":"ASTM D1557"},{"$f":"IF('ASTM 1557'!$B$56=\"\",\"\",'ASTM 1557'!$B$56)","v":"Estimated Dry Density, (pcf):"},{"$f":"IF('ASTM 1557'!$E$30=\"\",\"\",'ASTM 1557'!$E$30)","v":"1-2"}]
[363,{"$f":"IF('ASTM 1557'!$F$56=\"\",\"\",'ASTM 1557'!$F$56)","v":""},{"$f":"IF( 'ASTM 1557'!$B$6=\"\",\"\", 'ASTM 1557'!$B$6)","v":"ASTM D1557"},{"$f":"IF('ASTM 1557'!$B$56=\"\",\"\",'ASTM 1557'!$B$56)","v":"Estimated Dry Density, (pcf):"},{"$f":"IF('ASTM 1557'!$F$30=\"\",\"\",'ASTM 1557'!$F$30)","v":"1-3"}]
[364,{"$f":"IF('ASTM 1557'!$G$56=\"\",\"\",'ASTM 1557'!$G$56)","v":""},{"$f":"IF( 'ASTM 1557'!$B$6=\"\",\"\", 'ASTM 1557'!$B$6)","v":"ASTM D1557"},{"$f":"IF('ASTM 1557'!$B$56=\"\",\"\",'ASTM 1557'!$B$56)","v":"Estimated Dry Density, (pcf):"},{"$f":"IF('ASTM 1557'!$G$30=\"\",\"\",'ASTM 1557'!$G$30)","v":"1-4"}]
[365,{"$f":"IF('ASTM 1557'!$I$56=\"\",\"\",'ASTM 1557'!$I$56)","v":""},{"$f":"IF( 'ASTM 1557'!$B$6=\"\",\"\", 'ASTM 1557'!$B$6)","v":"ASTM D1557"},{"$f":"IF('ASTM 1557'!$B$56=\"\",\"\",'ASTM 1557'!$B$56)","v":"Estimated Dry Density, (pcf):"},{"$f":"IF('ASTM 1557'!$I$30=\"\",\"\",'ASTM 1557'!$I$30)","v":"2-1"}]
[366,{"$f":"IF('ASTM 1557'!$J$56=\"\",\"\",'ASTM 1557'!$J$56)","v":""},{"$f":"IF( 'ASTM 1557'!$B$6=\"\",\"\", 'ASTM 1557'!$B$6)","v":"ASTM D1557"},{"$f":"IF('ASTM 1557'!$B$56=\"\",\"\",'ASTM 1557'!$B$56)","v":"Estimated Dry Density, (pcf):"},{"$f":"IF('ASTM 1557'!$J$30=\"\",\"\",'ASTM 1557'!$J$30)","v":"2-2"}]
[367,{"$f":"IF('ASTM 1557'!$K$56=\"\",\"\",'ASTM 1557'!$K$56)","v":""},{"$f":"IF( 'ASTM 1557'!$B$6=\"\",\"\", 'ASTM 1557'!$B$6)","v":"ASTM D1557"},{"$f":"IF('ASTM 1557'!$B$56=\"\",\"\",'ASTM 1557'!$B$56)","v":"Estimated Dry Density, (pcf):"},{"$f":"IF('ASTM 1557'!$K$30=\"\",\"\",'ASTM 1557'!$K$30)","v":"2-3"}]
[368,{"$f":"IF('ASTM 1557'!$L$56=\"\",\"\",'ASTM 1557'!$L$56)","v":""},{"$f":"IF( 'ASTM 1557'!$B$6=\"\",\"\", 'ASTM 1557'!$B$6)","v":"ASTM D1557"},{"$f":"IF('ASTM 1557'!$B$56=\"\",\"\",'ASTM 1557'!$B$56)","v":"Estimated Dry Density, (pcf):"},{"$f":"IF('ASTM 1557'!$L$30=\"\",\"\",'ASTM 1557'!$L$30)","v":"2-4"}]
[369,{"$f":"IF('ASTM 1557'!$N$56=\"\",\"\",'ASTM 1557'!$N$56)","v":""},{"$f":"IF( 'ASTM 1557'!$B$6=\"\",\"\", 'ASTM 1557'!$B$6)","v":"ASTM D1557"},{"$f":"IF('ASTM 1557'!$B$56=\"\",\"\",'ASTM 1557'!$B$56)","v":"Estimated Dry Density, (pcf):"},{"$f":"IF('ASTM 1557'!$N$30=\"\",\"\",'ASTM 1557'!$N$30)","v":"3-1"}]
[370,{"$f":"IF('ASTM 1557'!$O$56=\"\",\"\",'ASTM 1557'!$O$56)","v":""},{"$f":"IF( 'ASTM 1557'!$B$6=\"\",\"\", 'ASTM 1557'!$B$6)","v":"ASTM D1557"},{"$f":"IF('ASTM 1557'!$B$56=\"\",\"\",'ASTM 1557'!$B$56)","v":"Estimated Dry Density, (pcf):"},{"$f":"IF('ASTM 1557'!$O$30=\"\",\"\",'ASTM 1557'!$O$30)","v":"3-2"}]
[371,{"$f":"IF('ASTM 1557'!$P$56=\"\",\"\",'ASTM 1557'!$P$56)","v":""},{"$f":"IF( 'ASTM 1557'!$B$6=\"\",\"\", 'ASTM 1557'!$B$6)","v":"ASTM D1557"},{"$f":"IF('ASTM 1557'!$B$56=\"\",\"\",'ASTM 1557'!$B$56)","v":"Estimated Dry Density, (pcf):"},{"$f":"IF('ASTM 1557'!$P$30=\"\",\"\",'ASTM 1557'!$P$30)","v":"3-3"}]
[372,{"$f":"IF('ASTM 1557'!$Q$56=\"\",\"\",'ASTM 1557'!$Q$56)","v":""},{"$f":"IF( 'ASTM 1557'!$B$6=\"\",\"\", 'ASTM 1557'!$B$6)","v":"ASTM D1557"},{"$f":"IF('ASTM 1557'!$B$56=\"\",\"\",'ASTM 1557'!$B$56)","v":"Estimated Dry Density, (pcf):"},{"$f":"IF('ASTM 1557'!$Q$30=\"\",\"\",'ASTM 1557'!$Q$30)","v":"3-4"}]
[373,{"$f":"IF('ASTM 1557'!$D$58=\"\",\"\",'ASTM 1557'!$D$58)","v":""},{"$f":"IF( 'ASTM 1557'!$B$6=\"\",\"\", 'ASTM 1557'!$B$6)","v":"ASTM D1557"},{"$f":"IF('ASTM 1557'!$B$58=\"\",\"\",'ASTM 1557'!$B$58)","v":"Max Dry Density, (pcf):"},{"$f":"IF('ASTM 1557'!$D$30=\"\",\"\",'ASTM 1557'!$D$30)","v":"1-1"}]
[374,{"$f":"IF('ASTM 1557'!$I$58=\"\",\"\",'ASTM 1557'!$I$58)","v":""},{"$f":"IF( 'ASTM 1557'!$B$6=\"\",\"\", 'ASTM 1557'!$B$6)","v":"ASTM D1557"},{"$f":"IF('ASTM 1557'!$B$58=\"\",\"\",'ASTM 1557'!$B$58)","v":"Max Dry Density, (pcf):"},{"$f":"IF('ASTM 1557'!$I$30=\"\",\"\",'ASTM 1557'!$I$30)","v":"2-1"}]
[375,{"$f":"IF('ASTM 1557'!$N$58=\"\",\"\",'ASTM 1557'!$N$58)","v":""},{"$f":"IF( 'ASTM 1557'!$B$6=\"\",\"\", 'ASTM 1557'!$B$6)","v":"ASTM D1557"},{"$f":"IF('ASTM 1557'!$B$58=\"\",\"\",'ASTM 1557'!$B$58)","v":"Max Dry Density, (pcf):"},{"$f":"IF('ASTM 1557'!$N$30=\"\",\"\",'ASTM 1557'!$N$30)","v":"3-1"}]
[376,{"$f":"IF('ASTM 1557'!$D$59=\"\",\"\",'ASTM 1557'!$D$59)","v":""},{"$f":"IF( 'ASTM 1557'!$B$6=\"\",\"\", 'ASTM 1557'!$B$6)","v":"ASTM D1557"},{"$f":"IF('ASTM 1557'!$B$59=\"\",\"\",'ASTM 1557'!$B$59)","v":"Optimum Moisture Content, (%):"},{"$f":"IF('ASTM 1557'!$D$30=\"\",\"\",'ASTM 1557'!$D$30)","v":"1-1"}]
[377,{"$f":"IF('ASTM 1557'!$I$59=\"\",\"\",'ASTM 1557'!$I$59)","v":""},{"$f":"IF( 'ASTM 1557'!$B$6=\"\",\"\", 'ASTM 1557'!$B$6)","v":"ASTM D1557"},{"$f":"IF('ASTM 1557'!$B$59=\"\",\"\",'ASTM 1557'!$B$59)","v":"Optimum Moisture Content, (%):"},{"$f":"IF('ASTM 1557'!$I$30=\"\",\"\",'ASTM 1557'!$I$30)","v":"2-1"}]
[378,{"$f":"IF('ASTM 1557'!$N$59=\"\",\"\",'ASTM 1557'!$N$59)","v":""},{"$f":"IF( 'ASTM 1557'!$B$6=\"\",\"\", 'ASTM 1557'!$B$6)","v":"ASTM D1557"},{"$f":"IF('ASTM 1557'!$B$59=\"\",\"\",'ASTM 1557'!$B$59)","v":"Optimum Moisture Content, (%):"},{"$f":"IF('ASTM 1557'!$N$30=\"\",\"\",'ASTM 1557'!$N$30)","v":"3-1"}]
[379,{"$f":"IF('ASTM 1557'!$D$60=\"\",\"\",'ASTM 1557'!$D$60)","v":""},{"$f":"IF( 'ASTM 1557'!$B$6=\"\",\"\", 'ASTM 1557'!$B$6)","v":"ASTM D1557"},{"$f":"IF('ASTM 1557'!$B$60=\"\",\"\",'ASTM 1557'!$B$60)","v":"M-D Graph R2 Value:"},{"$f":"IF('ASTM 1557'!$D$30=\"\",\"\",'ASTM 1557'!$D$30)","v":"1-1"}]
[380,{"$f":"IF('ASTM 1557'!$I$60=\"\",\"\",'ASTM 1557'!$I$60)","v":""},{"$f":"IF( 'ASTM 1557'!$B$6=\"\",\"\", 'ASTM 1557'!$B$6)","v":"ASTM D1557"},{"$f":"IF('ASTM 1557'!$B$60=\"\",\"\",'ASTM 1557'!$B$60)","v":"M-D Graph R2 Value:"},{"$f":"IF('ASTM 1557'!$I$30=\"\",\"\",'ASTM 1557'!$I$30)","v":"2-1"}]
[381,{"$f":"IF('ASTM 1557'!$N$60=\"\",\"\",'ASTM 1557'!$N$60)","v":""},{"$f":"IF( 'ASTM 1557'!$B$6=\"\",\"\", 'ASTM 1557'!$B$6)","v":"ASTM D1557"},{"$f":"IF('ASTM 1557'!$B$60=\"\",\"\",'ASTM 1557'!$B$60)","v":"M-D Graph R2 Value:"},{"$f":"IF('ASTM 1557'!$N$30=\"\",\"\",'ASTM 1557'!$N$30)","v":"3-1"}]
[382,{"$f":"IF('ASTM 1557'!$B$63=\"\",\"\",'ASTM 1557'!$B$63)","v":""},{"$f":"IF( 'ASTM 1557'!$B$6=\"\",\"\", 'ASTM 1557'!$B$6)","v":"ASTM D1557"},{"$f":"IF('ASTM 1557'!$B$62=\"\",\"\",'ASTM 1557'!$B$62)","v":"Remarks:"}]
[383,{"$f":"IF('RCC Data'!$C$88=\"\",\"\",'RCC Data'!$C$88)","v":""},"Sampled By ",{"$f":"IF('RCC Data'!$B$88=\"\",\"\",'RCC Data'!$B$88)","v":"TX407"}]
[384,{"$f":"IF('RCC Data'!$F$88=\"\",\"\",'RCC Data'!$F$88)","v":" "},"Sampled Date ",{"$f":"IF('RCC Data'!$B$88=\"\",\"\",'RCC Data'!$B$88)","v":"TX407"}]
[385,{"$f":"IF('ASTM 1557'!$C$68=\"\",\"\",'ASTM 1557'!$C$68)","v":" "},"Sampled By ",{"$f":"IF('ASTM 1557'!$B$68=\"\",\"\",'ASTM 1557'!$B$68)","v":"TX407"}]
[386,{"$f":"IF('ASTM 1557'!$F$68=\"\",\"\",'ASTM 1557'!$F$68)","v":" "},"Sampled Date ",{"$f":"IF('ASTM 1557'!$B$68=\"\",\"\",'ASTM 1557'!$B$68)","v":"TX407"}]

{"sheet":"Reference","index":5,"n_rows":180,"n_cols":40,"rows_kept":180,"cut":false,"hidden":true,"merged":[[1,33,1,36],[3,38,3,39],[13,2,13,3],[12,2,12,3],[11,2,11,3],[10,2,10,3],[6,17,6,18],[13,6,13,7],[12,6,12,7],[11,6,11,7],[4,2,4,3],[9,1,9,7],[7,2,7,3],[6,2,6,3],[7,6,7,7],[6,6,6,7],[14,9,14,10],[27,4,27,5],[26,4,26,5],[28,2,28,3],[28,6,28,7],[28,4,28,5],[27,2,27,3],[26,2,26,3],[27,6,27,7],[26,6,26,7],[25,2,25,3],[25,4,25,5],[25,6,25,7],[5,2,5,3],[10,4,10,5],[14,4,14,5],[14,6,14,7],[10,6,10,7],[13,4,13,5],[12,4,12,5],[11,4,11,5],[7,4,7,5],[6,4,6,5],[5,4,5,5],[24,12,24,13],[24,14,24,15],[17,6,17,7],[16,1,16,7],[17,4,17,5],[17,2,17,3],[11,34,11,36],[9,34,9,36],[10,34,10,36],[24,1,24,7],[1,20,1,26],[2,20,2,22],[2,23,2,24],[2,25,2,26],[4,4,4,5],[3,12,3,15],[1,17,1,18],[3,1,3,7],[1,1,1,15],[4,6,4,7],[5,6,5,7],[14,2,14,3],[3,9,3,10],[4,34,4,36],[6,34,6,36],[5,34,5,36],[8,33,8,36],[3,33,3,36]]}
[]
[null,"M-D Graph Reference Data and Calculations",null,null,null,null,null,null,null,null,null,null,null,null,null,null,null,"Optimum Cement Content",null,null,"Gradation Limits & Sieve Sizes",null,null,null,null,null,null,null,null,null,null,null,null,"Optimum Cement Content Plot"]
[null,null,null,null,null,null,null,null,null,null,null,null,null,null,null,null,null,{"$f":"'Optimum Cement Content Graph'!$B$32","v":"Slope, m ="},{"$f":"SLOPE('RCC Data'!$L$71:$L$79,'RCC Data'!$H$71:$H$79)","v":{"$error":"#DIV/0!"}},null,"Sieve Sizes",null,null,"Surface",null,"Base/Subbase"]
[null,"Test Results",null,null,null,null,null,null,null,"M-D Curve Graph Limits",null,null,"Best-Fit Line Coefficient Reference Data",null,null,null,null,{"$f":"'Optimum Cement Content Graph'!$B$33","v":"Intercept, b ="},{"$f":"INTERCEPT('RCC Data'!$L$71:$L$79,'RCC Data'!$H$71:$H$79)","v":{"$error":"#DIV/0!"}},null,"Standard","Metric","Graph","Min","Max","Min","Max",null,null,null,null,null,null,"Best Fit Line Coefficients",null,null,null,null,"M-D Curve Graph Limits"]
[null,"Cement Content",{"$f":"ROUND('ASTM 1557'!D31,1)","v":{"$error":"#VALUE!"}},null,{"$f":"ROUND('ASTM 1557'!I31,1)","v":{"$error":"#VALUE!"}},null,{"$f":"ROUND('ASTM 1557'!N31,1)","v":{"$error":"#VALUE!"}},null,null,"Min Moisture",{"$f":"MIN('ASTM 1557'!$D$54:$Q$54)","v":0},null,"N","Y","X","X^2",null,"Y-Target = ",4400,null,"1\"",{"$f":"VLOOKUP(U5,$U$15:$V$43,2,FALSE)","v":"25 mm"},{"$f":"VLOOKUP(U5,$U$15:$W$43,3,FALSE)","v":25},100,100,100,100,null,{"$f":"W5","v":25},{"$f":"AC5","v":25},0,100,null,"Slope, m",{"$f":"IF(ISERROR(ROUND(SLOPE('RCC Data'!$L$71:$L$79,'RCC Data'!$H$71:$H$79),1)),\"\",SLOPE('RCC Data'!$L$71:$L$79,'RCC Data'!$H$71:$H$79))","v":""},null,null,null,"Min Cement",5]
[null,"Max Dry Density",{"$f":"C14*C7^2+C13*C7+C12","v":{"$error":"#DIV/0!"}},null,{"$f":"E14*E7^2+E13*E7+E12","v":{"$error":"#DIV/0!"}},null,{"$f":"G14*G7^2+G13*G7+G12","v":{"$error":"#DIV/0!"}},null,null,"Max Moisture",{"$f":"MAX('ASTM 1557'!$D$54:$Q$54)","v":0},null,1,{"$f":"N('ASTM 1557'!D55)","v":0},{"$f":"N('ASTM 1557'!D54)","v":0},{"$f":"O6^2","v":0},null,"x = ",{"$f":"ROUND((S5-S4)/S3,1)","v":{"$error":"#DIV/0!"}},null,"3/4\"","19 mm",{"$f":"VLOOKUP(U6,$U$15:$W$43,3,FALSE)","v":19},100,100,90,100,null,{"$f":"W6","v":19},{"$f":"AC6","v":19},0,100,null,"Intercept, b",{"$f":"IF(ISERROR(ROUND(INTERCEPT('RCC Data'!$L$71:$L$79,'RCC Data'!$H$71:$H$79),1)),\"\",INTERCEPT('RCC Data'!$L$71:$L$79,'RCC Data'!$H$71:$H$79))","v":""},null,null,null,"Max Cement",{"$f":"MAX('ASTM 1557'!$D$31:$Q$31)","v":0}]
[null,"Opt Moist Content",{"$f":"-C13/(2*C14)","v":{"$error":"#DIV/0!"}},null,{"$f":"-E13/(2*E14)","v":{"$error":"#DIV/0!"}},null,{"$f":"-G13/(2*G14)","v":{"$error":"#DIV/0!"}},null,null,"Min Density",{"$f":"MIN('ASTM 1557'!D55:Q55)","v":0},null,2,{"$f":"N('ASTM 1557'!E55)","v":0},{"$f":"N('ASTM 1557'!E54)","v":0},{"$f":"O7^2","v":0},null,"Optimum Cement Content Plot",null,null,"1/2\"","12.5 mm",12.5,70,90,70,90,null,12.5,12.5,0,100,null,"Equation",{"$f":"\"y = \"&ROUND(AI5,2)&\"x + \" &ROUND(AI6,2)","v":{"$error":"#VALUE!"}},null,null,null,"Min Strength",3000]
[null,"R^2",{"$f":"ROUND(RSQ(C20:C23,D20:D23),4)","v":{"$error":"#DIV/0!"}},null,{"$f":"ROUND(RSQ(E20:E23,F20:F23),4)","v":{"$error":"#DIV/0!"}},null,{"$f":"ROUND(RSQ(G20:G23,H20:H23),4)","v":{"$error":"#DIV/0!"}},null,null,"Max Density",{"$f":"MAX('ASTM 1557'!D55:Q55)","v":0},null,3,{"$f":"N('ASTM 1557'!F55)","v":0},{"$f":"N('ASTM 1557'!F54)","v":0},{"$f":"O8^2","v":0},null,{"$f":"AN5","v":5},{"$f":"S5","v":4400},null,"3/8\"","9.5 mm",9.5,60,85,60,85,null,9.5,9.5,0,100,null,null,null,null,null,null,"Max Strength",{"$f":"MAX('RCC Data'!N71:O79)","v":0}]
[null,null,null,null,null,null,null,null,null,"Maximum Value, x-axis",{"$f":"MROUND(K6+1,1)","v":1},null,4,{"$f":"IF(AND(N8>0,N('ASTM 1557'!G53)=0),#REF!,N('ASTM 1557'!G55))","v":0},{"$f":"IF(AND(O8>0,N('ASTM 1557'!G53)=0),#REF!+2,N('ASTM 1557'!G54))","v":0},{"$f":"O9^2","v":0},null,{"$f":"IF(OR(ISERROR(S6),S6=\"\"),\"\",S6)","v":{"$error":"#DIV/0!"}},{"$f":"S8","v":4400},null,"No. 4","4.75 mm",4.75,40,60,40,60,null,4.75,4.75,0,100,null,"M-D Curve Begin & End Points",null,null,null,null,"Maximum Value, x-axis",{"$f":"MROUND(AN6+2,5)","v":0}]
[null,"Best Fit Line Coefficients",null,null,null,null,null,null,null,"Minimum Value, x-axis",{"$f":"IF(ISERROR(MROUND(K5-1,1)),0,MROUND(K5-1,1))","v":0},null,5,{"$f":"#REF!","v":{"$error":"#REF!"}},{"$f":"#REF!","v":{"$error":"#REF!"}},{"$f":"O10^2","v":{"$error":"#REF!"}},null,{"$f":"IF(OR(ISERROR(S6),S6=\"\"),\"\",S6)","v":{"$error":"#DIV/0!"}},3000,null,"No. 16","1.18 mm",1.18,20,40,20,40,null,1.18,1.18,0,100,null,"Minimum Strength",{"$f":"IF(ISERROR((AN13-AI6)/AI5),0,(AN13-AI6)/AI5)","v":0},null,null,null,"Minimum Value, x-axis",{"$f":"AN5","v":5}]
[null,"Cement Content",{"$f":"C5","v":{"$error":"#VALUE!"}},null,{"$f":"E5","v":{"$error":"#VALUE!"}},null,{"$f":"G5","v":{"$error":"#VALUE!"}},null,null,"Scale",{"$f":"(K9-K10)/150","v":6.6666666666670002E-3},null,"SUM",{"$f":"SUM(N8:N10)","v":{"$error":"#REF!"}},{"$f":"SUM(O8:O10)","v":{"$error":"#REF!"}},{"$f":"SUM(P6:P10)","v":{"$error":"#REF!"}},null,null,null,null,"No. 100",".15 µm",0.15,6,18,0,10,null,0.15,0.15,0,100,null,"Wet End Moisture",{"$f":"IF(ISERROR((AN12-AI6)/AI5),0,(AN12-AI6)/AI5)","v":0},null,null,null,"Scale",{"$f":"(AN9-AN10)/50","v":-0.1}]
[null,"A0",{"$f":"INDEX(LINEST($N$6:$N$9,$O$6:$P$9),3)","v":0},null,{"$f":"INDEX(LINEST($N$13:$N$16,$O$13:$P$16),3)","v":0},null,{"$f":"INDEX(LINEST($N$18:$N$21,$O$18:$P$21),3)","v":0},null,null,"Maximum Value, y-axis",{"$f":"ROUND(K8,0)+2","v":2},null,"N","Y","X","X^2",null,null,null,null,"No. 200",".075 µm",7.4999999999999997E-2,2,8,"--","--",null,7.4999999999999997E-2,7.4999999999999997E-2,0,100,null,null,"Best-fit Plot",null,null,null,"Maximum Value, y-axis",{"$f":"MROUND(AN8+2000,1000)","v":2000}]
[null,"A1",{"$f":"INDEX(LINEST($N$6:$N$9,$O$6:$P$9),2)","v":0},null,{"$f":"INDEX(LINEST($N$13:$N$16,$O$13:$P$16),2)","v":0},null,{"$f":"INDEX(LINEST($N$18:$N$21,$O$18:$P$21),2)","v":0},null,null,"Minimum Value, y-axis",{"$f":"IF(ROUND(K7,0)-2<0,0,ROUND(K7,0)-2)","v":0},null,1,{"$f":"N('ASTM 1557'!I55)","v":0},{"$f":"N('ASTM 1557'!I54)","v":0},{"$f":"O13^2","v":0},null,null,null,null,null,null,null,null,null,null,null,null,null,null,null,null,null,null,{"$f":"IF(AI10<AN10,AY,AN10)","v":{"$error":"#NAME?"}},{"$f":"(AI13-$AI$6)/$AI$5","v":{"$error":"#NAME?"}},{"$f":"(AI13*AI$5)+AI$6","v":{"$error":"#NAME?"}},null,"Minimum Value, y-axis",{"$f":"IF(ROUND(AN7,0)-2<0,0,ROUND(AN7,0))","v":3000}]
[null,"A2",{"$f":"INDEX(LINEST($N$6:$N$9,$O$6:$P$9),1)","v":0},null,{"$f":"INDEX(LINEST($N$13:$N$16,$O$13:$P$16),1)","v":0},null,{"$f":"INDEX(LINEST($N$18:$N$21,$O$18:$P$21),1)","v":0},null,null,null,null,null,2,{"$f":"N('ASTM 1557'!J55)","v":0},{"$f":"N('ASTM 1557'!J54)","v":0},{"$f":"O14^2","v":0},null,null,null,null,"English","Metric","Size",null,null,null,null,null,null,null,null,null,null,null,{"$f":"IF(AI13+$AN$11<=MIN($AN$9,$AI$11),AI13+$AN$11,AI13)","v":{"$error":"#NAME?"}},{"$f":"(AI14-$AI$6)/$AI$5","v":{"$error":"#NAME?"}},{"$error":"#NAME?"}]
[null,"Equation",{"$f":"\"y = \"&ROUND(C14,3)&\"x^2 + \"&ROUND(C13,3)&\"x + \" &ROUND(C12,3)","v":"y = 0x^2 + 0x + 0"},null,{"$f":"\"y = \"&ROUND(E14,3)&\"x^2 + \"&ROUND(E13,3)&\"x + \" &ROUND(E12,3)","v":"y = 0x^2 + 0x + 0"},null,{"$f":"\"y = \"&ROUND(G14,3)&\"x^2 + \"&ROUND(G13,3)&\"x + \" &ROUND(G12,3)","v":"y = 0x^2 + 0x + 0"},null,null,"M-D Graph Limit boundaries",null,null,3,{"$f":"N('ASTM 1557'!K55)","v":0},{"$f":"N('ASTM 1557'!K54)","v":0},{"$f":"O15^2","v":0},null,null,null,null,"6\"","152 mm",152,null,null,null,null,null,null,null,null,null,null,null,{"$f":"IF(AI14+$AN$11<=$AN$9,AI14+$AN$11,AI14)","v":{"$error":"#NAME?"}},{"$error":"#NAME?"},{"$error":"#NAME?"},null,"Label X",10.1]
[null,null,null,null,null,null,null,null,null,"X","Y",null,4,{"$f":"IF(AND(N15>0,N('ASTM 1557'!L55)=0),#REF!,N('ASTM 1557'!L55))","v":0},{"$f":"IF(AND(O15>0,N('ASTM 1557'!L54)=0),#REF!+2,N('ASTM 1557'!L54))","v":0},{"$f":"O16^2","v":0},null,null,null,null,"3\"","76 mm",76,null,null,null,null,null,null,null,null,null,null,null,{"$error":"#NAME?"},{"$error":"#NAME?"},{"$error":"#NAME?"},null,"Label Y",{"$f":"((AI5*AN15)+AI6)+1000","v":{"$error":"#VALUE!"}}]
[null,"R^2 Calculations",null,null,null,null,null,null,null,{"$f":"K10","v":0},{"$f":"MROUND(K13,5)","v":0},null,"N","Y","X","X^2",null,null,null,null,"2-1/2\"","63 mm",63,null,null,null,null,null,null,null,null,null,null,null,{"$error":"#NAME?"},{"$error":"#NAME?"},{"$error":"#NAME?"}]
[null,"Cement Content",{"$f":"C11","v":{"$error":"#VALUE!"}},null,{"$f":"E11","v":{"$error":"#VALUE!"}},null,{"$f":"G11","v":{"$error":"#VALUE!"}},null,null,{"$f":"K10","v":0},{"$f":"MROUND(K12,5)","v":0},null,1,{"$f":"N('ASTM 1557'!N55)","v":0},{"$f":"N('ASTM 1557'!N54)","v":0},{"$f":"O18^2","v":0},null,null,null,null,"2\"","50 mm",50,null,null,null,null,null,null,null,null,null,null,null,{"$error":"#NAME?"},{"$error":"#NAME?"},{"$error":"#NAME?"}]
[null,null,"Y-Known","Y-Calculated","Y-Known","Y-Calculated","Y-Known","Y-Calculated",null,{"$f":"K10","v":0},{"$f":"K18","v":0},null,2,{"$f":"N('ASTM 1557'!O55)","v":0},{"$f":"N('ASTM 1557'!O54)","v":0},{"$f":"O19^2","v":0},null,null,null,null,"1-3/4\"","45 mm",45,null,null,null,null,null,null,null,null,null,null,null,{"$error":"#NAME?"},{"$error":"#NAME?"},{"$error":"#NAME?"}]
[null,"X-1",{"$f":"N6","v":0},{"$f":"($C$14*(VLOOKUP(C20,$N$6:$O$9,2,FALSE))^2)+($C$13*(VLOOKUP(C20,$N$6:$O$9,2,FALSE)))+$C$12","v":0},{"$f":"N13","v":0},{"$f":"($E$14*(VLOOKUP(E20,$N$13:$O$16,2,FALSE))^2)+($E$13*(VLOOKUP(E20,$N$13:$O$16,2,FALSE)))+$E$12","v":0},{"$f":"N18","v":0},{"$f":"($G$14*(VLOOKUP(G20,$N$18:$O$21,2,FALSE))^2)+($G$13*(VLOOKUP(G20,$N$18:$O$21,2,FALSE)))+$G$12","v":0},null,{"$f":"K9","v":1},{"$f":"K19","v":0},null,3,{"$f":"N('ASTM 1557'!P55)","v":0},{"$f":"N('ASTM 1557'!P54)","v":0},{"$f":"O20^2","v":0},null,null,null,null,"1-1/2\"","37.5 mm",37.5,null,null,null,null,null,null,null,null,null,null,null,{"$error":"#NAME?"},{"$error":"#NAME?"},{"$error":"#NAME?"}]
[null,"X-2",{"$f":"N7","v":0},{"$f":"($C$14*(VLOOKUP(C21,$N$6:$O$9,2,FALSE))^2)+($C$13*(VLOOKUP(C21,$N$6:$O$9,2,FALSE)))+$C$12","v":0},{"$f":"N14","v":0},{"$f":"($E$14*(VLOOKUP(E21,$N$13:$O$16,2,FALSE))^2)+($E$13*(VLOOKUP(E21,$N$13:$O$16,2,FALSE)))+$E$12","v":0},{"$f":"N19","v":0},{"$f":"($G$14*(VLOOKUP(G21,$N$18:$O$21,2,FALSE))^2)+($G$13*(VLOOKUP(G21,$N$18:$O$21,2,FALSE)))+$G$12","v":0},null,{"$f":"J20","v":1},{"$f":"K20","v":0},null,4,{"$f":"IF(AND(N20>0,N('ASTM 1557'!Q55)=0),#REF!,N('ASTM 1557'!Q55))","v":0},{"$f":"IF(AND(O20>0,N('ASTM 1557'!Q54)=0),#REF!+2,N('ASTM 1557'!Q54))","v":0},{"$f":"O21^2","v":0},null,null,null,null,"1-1/4\"","31.5 mm",31.5,null,null,null,null,null,null,null,null,null,null,null,{"$error":"#NAME?"},{"$error":"#NAME?"},{"$error":"#NAME?"}]
[null,"X-3",{"$f":"N8","v":0},{"$f":"($C$14*(VLOOKUP(C22,$N$6:$O$9,2,FALSE))^2)+($C$13*(VLOOKUP(C22,$N$6:$O$9,2,FALSE)))+$C$12","v":0},{"$f":"N15","v":0},{"$f":"($E$14*(VLOOKUP(E22,$N$13:$O$16,2,FALSE))^2)+($E$13*(VLOOKUP(E22,$N$13:$O$16,2,FALSE)))+$E$12","v":0},{"$f":"N20","v":0},{"$f":"($G$14*(VLOOKUP(G22,$N$18:$O$21,2,FALSE))^2)+($G$13*(VLOOKUP(G22,$N$18:$O$21,2,FALSE)))+$G$12","v":0},null,{"$f":"J21","v":1},{"$f":"K17","v":0},null,null,null,null,null,null,null,null,null,"1\"","25 mm",25,null,null,null,null,null,null,null,null,null,null,null,{"$error":"#NAME?"},{"$error":"#NAME?"},{"$error":"#NAME?"}]
[null,"X-4",{"$f":"N9","v":0},{"$f":"($C$14*(VLOOKUP(C23,$N$6:$O$9,2,FALSE))^2)+($C$13*(VLOOKUP(C23,$N$6:$O$9,2,FALSE)))+$C$12","v":0},{"$f":"N16","v":0},{"$f":"($E$14*(VLOOKUP(E23,$N$13:$O$16,2,FALSE))^2)+($E$13*(VLOOKUP(E23,$N$13:$O$16,2,FALSE)))+$E$12","v":0},{"$f":"N21","v":0},{"$f":"($G$14*(VLOOKUP(G23,$N$18:$O$21,2,FALSE))^2)+($G$13*(VLOOKUP(G23,$N$18:$O$21,2,FALSE)))+$G$12","v":0},null,{"$f":"J17","v":0},{"$f":"K22","v":0},null,"Gs=",{"$f":"IF(OR('ASTM 1557'!D24=\"\",'ASTM 1557'!D23=\"\",'ASTM 1557'!D22=\"\"),IF('ASTM 1557'!D26=\"\",2.65,N('ASTM 1557'!D26)),N('ASTM 1557'!D26))","v":2.65},"ZAV",null,null,null,null,null,"7/8\"","22.4 mm",22.4,null,null,null,null,null,null,null,null,null,null,null,{"$error":"#NAME?"},{"$error":"#NAME?"},{"$error":"#NAME?"}]
[null,null,null,null,null,null,null,null,null,{"$f":"J22","v":1},{"$f":"K23","v":0},null,"γw=",62.5,"Closest point to Max y-Scale",{"$f":"INDEX(O26:O176,MATCH(MIN(ABS(O26:O176-K12)),ABS(O26:O176-K12),0))","v":161.349245007306},null,null,null,null,"3/4\"","19 mm",19,null,null,null,null,null,null,null,null,null,null,null,{"$error":"#NAME?"},{"$error":"#NAME?"},{"$error":"#NAME?"}]
[null,"M-D Curve Begin & End Points",null,null,null,null,null,null,null,null,null,null,"ZAV Plot within scale",null,"ZAV - Reference Data",null,null,null,null,null,"5/8\"","16 mm",16,null,null,null,null,null,null,null,null,null,null,null,{"$error":"#NAME?"},{"$error":"#NAME?"},{"$error":"#NAME?"}]
[null,"Cement Content",{"$f":"C18","v":{"$error":"#VALUE!"}},null,{"$f":"E18","v":{"$error":"#VALUE!"}},null,{"$f":"G18","v":{"$error":"#VALUE!"}},null,null,null,null,null,{"$f":"VLOOKUP(P24,O26:P176,2)","v":1},{"$f":"($N$23*$N$24)/(1+$N$23*(M26/100))","v":161.349245007306},{"$f":"($N$23*$N$24)/(1+$N$23*(P26/100))","v":161.349245007306},{"$f":"K9","v":1},null,null,null,null,"1/2\"","12.5 mm",12.5,null,null,null,null,null,null,null,null,null,null,null,{"$error":"#NAME?"},{"$error":"#NAME?"},{"$error":"#NAME?"}]
[null,"Dry End Moisture",{"$f":"IF(ISERROR(((-C13)+(SQRT((C13^2)-(4*C14*(C12-K13)))))/(2*C14)),0,((-C13)+(SQRT((C13^2)-(4*C14*(C12-K13)))))/(2*C14))","v":0},null,{"$f":"IF(ISERROR(((-E13)+(SQRT((E13^2)-(4*E14*(E12-K13)))))/(2*E14)),0,((-E13)+(SQRT((E13^2)-(4*E14*(E12-K13)))))/(2*E14))","v":0},null,{"$f":"IF(ISERROR(((-G13)+(SQRT((G13^2)-(4*G14*(G12-K13)))))/(2*G14)),0,((-G13)+(SQRT((G13^2)-(4*G14*(G12-K13)))))/(2*G14))","v":0},null,null,null,null,null,{"$f":"IF(M26+$K$11<=$K$9,M26+$K$11,M26)","v":1},161.349245007306,161.377018938151,{"$f":"P26-$K$11","v":0.99333333333333296},null,null,null,null,"7/16\"","11.2 mm",11.2,null,null,null,null,null,null,null,null,null,null,null,{"$error":"#NAME?"},{"$error":"#NAME?"},{"$error":"#NAME?"}]
[null,"Wet End Moisture",{"$f":"IF(ISERROR(((-C13)-(SQRT((C13^2)-(4*C14*(C12-K13)))))/(2*C14)),0,((-C13)-(SQRT((C13^2)-(4*C14*(C12-K13)))))/(2*C14))","v":0},null,{"$f":"IF(ISERROR(((-E13)-(SQRT((E13^2)-(4*E14*(E12-K13)))))/(2*E14)),0,((-E13)-(SQRT((E13^2)-(4*E14*(E12-K13)))))/(2*E14))","v":0},null,{"$f":"IF(ISERROR(((-G13)-(SQRT((G13^2)-(4*G14*(G12-K13)))))/(2*G14)),0,((-G13)-(SQRT((G13^2)-(4*G14*(G12-K13)))))/(2*G14))","v":0},null,null,null,null,null,1,161.349245007306,161.404802432401,0.98666666666666603,null,null,null,null,"3/8\"","9.5 mm",9.5,null,null,null,null,null,null,null,null,null,null,null,{"$error":"#NAME?"},{"$error":"#NAME?"},{"$error":"#NAME?"}]
[null,null,"M_D Best-fit Plot within scale",null,"M_D Best-fit Plot within scale",null,"M_D Best-fit Plot within scale",null,null,null,null,null,1,161.349245007306,161.43259549499501,0.97999999999999898,null,null,null,null,"5/16\"","8 mm",8,null,null,null,null,null,null,null,null,null,null,null,{"$error":"#NAME?"},{"$error":"#NAME?"},{"$error":"#NAME?"}]
[null,null,{"$f":"IF(C27<K10,K10,C27)","v":0},{"$f":"$C$12+$C$13*C30+$C$14*C30^2","v":0},{"$f":"IF(E27<K10,K10,E27)","v":0},{"$f":"$E$12+$E$13*E30+$E$14*E30^2","v":0},{"$f":"IF(G27<K10,K10,G27)","v":0},{"$f":"$G$12+$G$13*G30+$G$14*G30^2","v":0},null,null,null,null,1,161.349245007306,161.46039813087799,0.97333333333333205,null,null,null,null,"1/4\"","6.3 mm",6.3,null,null,null,null,null,null,null,null,null,null,null,{"$error":"#NAME?"},{"$error":"#NAME?"},{"$error":"#NAME?"}]
[null,null,{"$f":"IF(C30+$K$11<=MIN($K$9,$C$28),C30+$K$11,C30)","v":0},0,{"$f":"IF(E30+$K$11<=MIN($K$9,$E$28),E30+$K$11,E30)","v":0},0,{"$f":"IF(G30+$K$11<=MIN($K$9,$G$28),G30+$K$11,G30)","v":0},0,null,null,null,null,1,161.349245007306,161.48821034499599,0.96666666666666501,null,null,null,null,"No. 4","4.75 mm",4.75,null,null,null,null,null,null,null,null,null,null,null,{"$error":"#NAME?"},{"$error":"#NAME?"},{"$error":"#NAME?"}]
[null,null,{"$f":"IF(C31+$K$11<=$K$9,C31+$K$11,C31)","v":6.6666666666670002E-3},0,0,0,0,0,null,null,null,null,1,161.349245007306,161.51603214229999,0.95999999999999797,null,null,null,null,"No. 6","3.35 mm",3.35,null,null,null,null,null,null,null,null,null,null,null,{"$error":"#NAME?"},{"$error":"#NAME?"},{"$error":"#NAME?"}]
[null,null,1.3333333333334E-2,0,0,0,0,0,null,null,null,null,1,161.349245007306,161.54386352774401,0.95333333333333103,null,null,null,null,"No. 8","2.36 mm",2.36,null,null,null,null,null,null,null,null,null,null,null,{"$error":"#NAME?"},{"$error":"#NAME?"},{"$error":"#NAME?"}]
[null,null,2.0000000000001E-2,0,0,0,0,0,null,null,null,null,1,161.349245007306,161.57170450628601,0.94666666666666399,null,null,null,null,"No. 10","2 mm",2,null,null,null,null,null,null,null,null,null,null,null,{"$error":"#NAME?"},{"$error":"#NAME?"},{"$error":"#NAME?"}]
[null,null,2.6666666666668001E-2,0,0,0,0,0,null,null,null,null,1,161.349245007306,161.59955508288499,0.93999999999999695,null,null,null,null,"No. 14","1.4 mm",1.4,null,null,null,null,null,null,null,null,null,null,null,{"$error":"#NAME?"},{"$error":"#NAME?"},{"$error":"#NAME?"}]
[null,null,3.3333333333334998E-2,0,0,0,0,0,null,null,null,null,1,161.349245007306,161.62741526250699,0.93333333333333002,null,null,null,null,"No. 16","1.18 mm",1.18,null,null,null,null,null,null,null,null,null,null,null,{"$error":"#NAME?"},{"$error":"#NAME?"},{"$error":"#NAME?"}]
[null,null,4.0000000000001999E-2,0,0,0,0,0,null,null,null,null,1,161.349245007306,161.65528505011901,0.92666666666666297,null,null,null,null,"No. 20",".85 µm",0.85,null,null,null,null,null,null,null,null,null,null,null,{"$error":"#NAME?"},{"$error":"#NAME?"},{"$error":"#NAME?"}]
[null,null,4.6666666666669E-2,0,0,0,0,0,null,null,null,null,1,161.349245007306,161.683164450692,0.91999999999999604,null,null,null,null,"No. 30",".6 µm",0.6,null,null,null,null,null,null,null,null,null,null,null,{"$error":"#NAME?"},{"$error":"#NAME?"},{"$error":"#NAME?"}]
[null,null,5.3333333333336001E-2,0,0,0,0,0,null,null,null,null,1,161.349245007306,161.71105346920001,0.913333333333329,null,null,null,null,"No. 40",".425 µm",0.42499999999999999,null,null,null,null,null,null,null,null,null,null,null,{"$error":"#NAME?"},{"$error":"#NAME?"},{"$error":"#NAME?"}]
[null,null,6.0000000000003002E-2,0,0,0,0,0,null,null,null,null,1,161.349245007306,161.73895211062199,0.90666666666666196,null,null,null,null,"No. 50",".3 µm",0.3,null,null,null,null,null,null,null,null,null,null,null,{"$error":"#NAME?"},{"$error":"#NAME?"},{"$error":"#NAME?"}]
[null,null,6.6666666666669996E-2,0,0,0,0,0,null,null,null,null,1,161.349245007306,161.76686037993801,0.89999999999999503,null,null,null,null,"No. 80",".18 µm",0.18,null,null,null,null,null,null,null,null,null,null,null,{"$error":"#NAME?"},{"$error":"#NAME?"},{"$error":"#NAME?"}]
[null,null,7.3333333333336997E-2,0,0,0,0,0,null,null,null,null,1,161.349245007306,161.79477828213399,0.89333333333332798,null,null,null,null,"No. 100",".15 µm",0.15,null,null,null,null,null,null,null,null,null,null,null,{"$error":"#NAME?"},{"$error":"#NAME?"},{"$error":"#NAME?"}]
[null,null,8.0000000000003998E-2,0,0,0,0,0,null,null,null,null,1,161.349245007306,161.822705822198,0.88666666666666105,null,null,null,null,"No. 200",".075 µm",7.4999999999999997E-2,null,null,null,null,null,null,null,null,null,null,null,{"$error":"#NAME?"},{"$error":"#NAME?"},{"$error":"#NAME?"}]
[null,null,8.6666666666670999E-2,0,0,0,0,0,null,null,null,null,1,161.349245007306,161.85064300512099,0.87999999999999401,null,null,null,null,null,null,null,null,null,null,null,null,null,null,null,null,null,null,{"$error":"#NAME?"},{"$error":"#NAME?"},{"$error":"#NAME?"}]
[null,null,9.3333333333338001E-2,0,0,0,0,0,null,null,null,null,1,161.349245007306,161.878589835898,0.87333333333332697,null,null,null,null,null,null,null,null,null,null,null,null,null,null,null,null,null,null,{"$error":"#NAME?"},{"$error":"#NAME?"},{"$error":"#NAME?"}]
[null,null,0.100000000000005,0,0,0,0,0,null,null,null,null,1,161.349245007306,161.90654631952799,0.86666666666666003,null,null,null,null,null,null,null,null,null,null,null,null,null,null,null,null,null,null,{"$error":"#NAME?"},{"$error":"#NAME?"},{"$error":"#NAME?"}]
[null,null,0.106666666666672,0,0,0,0,0,null,null,null,null,1,161.349245007306,161.93451246101401,0.85999999999999299,null,null,null,null,null,null,null,null,null,null,null,null,null,null,null,null,null,null,{"$f":"IF(AI46+$AN$11<=$AN$9,AI46+$AN$11,AI46)","v":{"$error":"#NAME?"}},{"$error":"#NAME?"},{"$error":"#NAME?"}]
[null,null,0.113333333333339,0,0,0,0,0,null,null,null,null,1,161.349245007306,161.96248826535901,0.85333333333332595,null,null,null,null,null,null,null,null,null,null,null,null,null,null,null,null,null,null,{"$error":"#NAME?"},{"$error":"#NAME?"},{"$error":"#NAME?"}]
[null,null,0.120000000000006,0,0,0,0,0,null,null,null,null,1,161.349245007306,161.990473737575,0.84666666666665902,null,null,null,null,null,null,null,null,null,null,null,null,null,null,null,null,null,null,{"$error":"#NAME?"},{"$error":"#NAME?"},{"$error":"#NAME?"}]
[null,null,0.12666666666667301,0,0,0,0,0,null,null,null,null,1,161.349245007306,162.01846888267201,0.83999999999999198,null,null,null,null,null,null,null,null,null,null,null,null,null,null,null,null,null,null,{"$error":"#NAME?"},{"$error":"#NAME?"},{"$error":"#NAME?"}]
[null,null,0.13333333333333999,0,0,0,0,0,null,null,null,null,1,161.349245007306,162.04647370566701,0.83333333333332504,null,null,null,null,null,null,null,null,null,null,null,null,null,null,null,null,null,null,{"$error":"#NAME?"},{"$error":"#NAME?"},{"$error":"#NAME?"}]
[null,null,0.14000000000000701,0,0,0,0,0,null,null,null,null,1,161.349245007306,162.074488211578,0.826666666666658,null,null,null,null,null,null,null,null,null,null,null,null,null,null,null,null,null,null,{"$error":"#NAME?"},{"$error":"#NAME?"},{"$error":"#NAME?"}]
[null,null,0.14666666666667399,0,0,0,0,0,null,null,null,null,1,161.349245007306,162.10251240542999,0.81999999999999096,null,null,null,null,null,null,null,null,null,null,null,null,null,null,null,null,null,null,{"$error":"#NAME?"},{"$error":"#NAME?"},{"$error":"#NAME?"}]
[null,null,0.15333333333334101,0,0,0,0,0,null,null,null,null,1,161.349245007306,162.130546292248,0.81333333333332403,null,null,null,null,null,null,null,null,null,null,null,null,null,null,null,null,null,null,{"$error":"#NAME?"},{"$error":"#NAME?"},{"$error":"#NAME?"}]
[null,null,0.160000000000008,0,0,0,0,0,null,null,null,null,1,161.349245007306,162.15858987706099,0.80666666666665698,null,null,null,null,null,null,null,null,null,null,null,null,null,null,null,null,null,null,{"$error":"#NAME?"},{"$error":"#NAME?"},{"$error":"#NAME?"}]
[null,null,0.16666666666667501,0,0,0,0,0,null,null,null,null,1,161.349245007306,162.18664316490401,0.79999999999999005,null,null,null,null,null,null,null,null,null,null,null,null,null,null,null,null,null,null,{"$error":"#NAME?"},{"$error":"#NAME?"},{"$error":"#NAME?"}]
[null,null,0.173333333333342,0,0,0,0,0,null,null,null,null,1,161.349245007306,162.21470616081299,0.79333333333332301,null,null,null,null,null,null,null,null,null,null,null,null,null,null,null,null,null,null,{"$error":"#NAME?"},{"$error":"#NAME?"},{"$error":"#NAME?"}]
[null,null,0.18000000000000899,0,0,0,0,0,null,null,null,null,1,{"$f":"($N$23*$N$24)/(1+$N$23*(M58/100))","v":161.349245007306},{"$f":"($N$23*$N$24)/(1+$N$23*(P58/100))","v":162.24277886982699},0.78666666666665597,null,null,null,null,null,null,null,null,null,null,null,null,null,null,null,null,null,null,{"$error":"#NAME?"},{"$error":"#NAME?"},{"$error":"#NAME?"}]
[null,null,0.186666666666676,0,0,0,0,0,null,null,null,null,{"$f":"IF(M58+$K$11<=$K$9,M58+$K$11,M58)","v":1},161.349245007306,162.270861296991,{"$f":"P58-$K$11","v":0.77999999999998904},null,null,null,null,null,null,null,null,null,null,null,null,null,null,null,null,null,null,{"$error":"#NAME?"},{"$error":"#NAME?"},{"$error":"#NAME?"}]
[null,null,0.19333333333334299,0,0,0,0,0,null,null,null,null,1,161.349245007306,162.29895344735201,0.77333333333332199,null,null,null,null,null,null,null,null,null,null,null,null,null,null,null,null,null,null,{"$error":"#NAME?"},{"$error":"#NAME?"},{"$error":"#NAME?"}]
[null,null,0.20000000000001,0,0,0,0,0,null,null,null,null,1,161.349245007306,162.327055325961,0.76666666666665495,null,null,null,null,null,null,null,null,null,null,null,null,null,null,null,null,null,null,{"$error":"#NAME?"},{"$error":"#NAME?"},{"$error":"#NAME?"}]
[null,null,0.20666666666667699,{"$f":"$C$12+$C$13*C62+$C$14*C62^2","v":0},0,{"$f":"$E$12+$E$13*E62+$E$14*E62^2","v":0},0,{"$f":"$G$12+$G$13*G62+$G$14*G62^2","v":0},null,null,null,null,1,161.349245007306,162.35516693787099,0.75999999999998802,null,null,null,null,null,null,null,null,null,null,null,null,null,null,null,null,null,null,{"$error":"#NAME?"},{"$error":"#NAME?"},{"$error":"#NAME?"}]
[null,null,0.21333333333334401,0,{"$f":"IF(E62+$K$11<=MIN($K$9,$E$28),E62+$K$11,E62)","v":0},0,{"$f":"IF(G62+$K$11<=MIN($K$9,$G$28),G62+$K$11,G62)","v":0},0,null,null,null,null,1,161.349245007306,162.38328828814099,0.75333333333332098,null,null,null,null,null,null,null,null,null,null,null,null,null,null,null,null,null,null,{"$error":"#NAME?"},{"$error":"#NAME?"},{"$error":"#NAME?"}]
[null,null,{"$f":"IF(C63+$K$11<=$K$9,C63+$K$11,C63)","v":0.22000000000001099},0,0,0,0,0,null,null,null,null,1,161.349245007306,162.41141938183199,0.74666666666665404,null,null,null,null,null,null,null,null,null,null,null,null,null,null,null,null,null,null,{"$error":"#NAME?"},{"$error":"#NAME?"},{"$error":"#NAME?"}]
[null,null,0.22666666666667801,0,0,0,0,0,null,null,null,null,1,161.349245007306,162.43956022400701,0.739999999999987,null,null,null,null,null,null,null,null,null,null,null,null,null,null,null,null,null,null,{"$error":"#NAME?"},{"$error":"#NAME?"},{"$error":"#NAME?"}]
[null,null,0.23333333333334499,0,0,0,0,0,null,null,null,null,1,161.349245007306,162.46771081973699,0.73333333333331996,null,null,null,null,null,null,null,null,null,null,null,null,null,null,null,null,null,null,{"$error":"#NAME?"},{"$error":"#NAME?"},{"$error":"#NAME?"}]
[null,null,0.24000000000001201,0,0,0,0,0,null,null,null,null,1,161.349245007306,162.49587117409101,0.72666666666665303,null,null,null,null,null,null,null,null,null,null,null,null,null,null,null,null,null,null,{"$error":"#NAME?"},{"$error":"#NAME?"},{"$error":"#NAME?"}]
[null,null,0.246666666666679,0,0,0,0,0,null,null,null,null,1,161.349245007306,162.52404129214599,0.71999999999998598,null,null,null,null,null,null,null,null,null,null,null,null,null,null,null,null,null,null,{"$error":"#NAME?"},{"$error":"#NAME?"},{"$error":"#NAME?"}]
[null,null,0.25333333333334601,0,0,0,0,0,null,null,null,null,1,161.349245007306,162.55222117898001,0.71333333333331905,null,null,null,null,null,null,null,null,null,null,null,null,null,null,null,null,null,null,{"$error":"#NAME?"},{"$error":"#NAME?"},{"$error":"#NAME?"}]
[null,null,0.260000000000013,0,0,0,0,0,null,null,null,null,1,161.349245007306,162.58041083967601,0.70666666666665201,null,null,null,null,null,null,null,null,null,null,null,null,null,null,null,null,null,null,{"$error":"#NAME?"},{"$error":"#NAME?"},{"$error":"#NAME?"}]
[null,null,0.26666666666667999,0,0,0,0,0,null,null,null,null,1,161.349245007306,162.60861027931901,0.69999999999998497,null,null,null,null,null,null,null,null,null,null,null,null,null,null,null,null,null,null,{"$error":"#NAME?"},{"$error":"#NAME?"},{"$error":"#NAME?"}]
[null,null,0.27333333333334697,0,0,0,0,0,null,null,null,null,1,161.349245007306,162.63681950299801,0.69333333333331804,null,null,null,null,null,null,null,null,null,null,null,null,null,null,null,null,null,null,{"$error":"#NAME?"},{"$error":"#NAME?"},{"$error":"#NAME?"}]
[null,null,0.28000000000001402,0,0,0,0,0,null,null,null,null,1,161.349245007306,162.665038515807,0.68666666666665099,null,null,null,null,null,null,null,null,null,null,null,null,null,null,null,null,null,null,{"$error":"#NAME?"},{"$error":"#NAME?"},{"$error":"#NAME?"}]
[null,null,0.286666666666681,0,0,0,0,0,null,null,null,null,1,161.349245007306,162.69326732284199,0.67999999999998395,null,null,null,null,null,null,null,null,null,null,null,null,null,null,null,null,null,null,{"$error":"#NAME?"},{"$error":"#NAME?"},{"$error":"#NAME?"}]
[null,null,0.29333333333334799,0,0,0,0,0,null,null,null,null,1,161.349245007306,162.721505929203,0.67333333333331702,null,null,null,null,null,null,null,null,null,null,null,null,null,null,null,null,null,null,{"$error":"#NAME?"},{"$error":"#NAME?"},{"$error":"#NAME?"}]
[null,null,0.30000000000001498,0,0,0,0,0,null,null,null,null,1,161.349245007306,162.74975433999401,0.66666666666664998,null,null,null,null,null,null,null,null,null,null,null,null,null,null,null,null,null,null,{"$error":"#NAME?"},{"$error":"#NAME?"},{"$error":"#NAME?"}]
[null,null,0.30666666666668202,0,0,0,0,0,null,null,null,null,1,161.349245007306,162.77801256032001,0.65999999999998304,null,null,null,null,null,null,null,null,null,null,null,null,null,null,null,null,null,null,{"$error":"#NAME?"},{"$error":"#NAME?"},{"$error":"#NAME?"}]
[null,null,0.31333333333334901,0,0,0,0,0,null,null,null,null,1,161.349245007306,162.806280595294,0.653333333333316,null,null,null,null,null,null,null,null,null,null,null,null,null,null,null,null,null,null,{"$error":"#NAME?"},{"$f":"(AI78-$AI$6)/$AI$5","v":{"$error":"#NAME?"}},{"$f":"(AI78*AI$5)+AI$6","v":{"$error":"#NAME?"}}]
[null,null,0.32000000000001599,0,0,0,0,0,null,null,null,null,1,161.349245007306,162.834558450028,0.64666666666664896,null,null,null,null,null,null,null,null,null,null,null,null,null,null,null,null,null,null,{"$f":"IF(AI78+$AN$11<=$AN$9,AI78+$AN$11,AI78)","v":{"$error":"#NAME?"}},{"$error":"#NAME?"},{"$error":"#NAME?"}]
[null,null,0.32666666666668298,0,0,0,0,0,null,null,null,null,1,161.349245007306,162.86284612964101,0.63999999999998203,null,null,null,null,null,null,null,null,null,null,null,null,null,null,null,null,null,null,{"$error":"#NAME?"},{"$error":"#NAME?"},{"$error":"#NAME?"}]
[null,null,0.33333333333335002,0,0,0,0,0,null,null,null,null,1,161.349245007306,162.89114363925501,0.63333333333331499,null,null,null,null,null,null,null,null,null,null,null,null,null,null,null,null,null,null,{"$error":"#NAME?"},{"$error":"#NAME?"},{"$error":"#NAME?"}]
[null,null,0.34000000000001701,0,0,0,0,0,null,null,null,null,1,161.349245007306,162.91945098399299,0.62666666666664805,null,null,null,null,null,null,null,null,null,null,null,null,null,null,null,null,null,null,{"$error":"#NAME?"},{"$error":"#NAME?"},{"$error":"#NAME?"}]
[null,null,0.346666666666684,0,0,0,0,0,null,null,null,null,1,161.349245007306,162.947768168984,0.61999999999998101,null,null,null,null,null,null,null,null,null,null,null,null,null,null,null,null,null,null,{"$error":"#NAME?"},{"$error":"#NAME?"},{"$error":"#NAME?"}]
[null,null,0.35333333333335099,0,0,0,0,0,null,null,null,null,1,161.349245007306,162.97609519936,0.61333333333331397,null,null,null,null,null,null,null,null,null,null,null,null,null,null,null,null,null,null,{"$error":"#NAME?"},{"$error":"#NAME?"},{"$error":"#NAME?"}]
[null,null,0.36000000000001797,0,0,0,0,0,null,null,null,null,1,161.349245007306,163.00443208025601,0.60666666666664704,null,null,null,null,null,null,null,null,null,null,null,null,null,null,null,null,null,null,{"$error":"#NAME?"},{"$error":"#NAME?"},{"$error":"#NAME?"}]
[null,null,0.36666666666668501,0,0,0,0,0,null,null,null,null,1,161.349245007306,163.03277881681299,0.59999999999997999,null,null,null,null,null,null,null,null,null,null,null,null,null,null,null,null,null,null,{"$error":"#NAME?"},{"$error":"#NAME?"},{"$error":"#NAME?"}]
[null,null,0.373333333333352,0,0,0,0,0,null,null,null,null,1,161.349245007306,163.06113541417099,0.59333333333331295,null,null,null,null,null,null,null,null,null,null,null,null,null,null,null,null,null,null,{"$f":"IF(AND($C$12+$C$13*AI86+$C$14*AI86^2>$K$13,$C$12+$C$13*(AI86+$K$11)+$C$14*(AI86+$K$11)^2>$K$13),AI86+$K$11,AI86)","v":{"$error":"#NAME?"}},{"$error":"#NAME?"},{"$error":"#NAME?"}]
[null,null,0.38000000000001899,0,0,0,0,0,null,null,null,null,1,161.349245007306,163.089501877478,0.58666666666664602,null,null,null,null,null,null,null,null,null,null,null,null,null,null,null,null,null,null,{"$error":"#NAME?"},{"$error":"#NAME?"},{"$error":"#NAME?"}]
[null,null,0.38666666666668598,0,0,0,0,0,null,null,null,null,1,161.349245007306,163.11787821188301,0.57999999999997898,null,null,null,null,null,null,null,null,null,null,null,null,null,null,null,null,null,null,{"$error":"#NAME?"},{"$error":"#NAME?"},{"$error":"#NAME?"}]
[null,null,0.39333333333335302,0,0,0,0,0,null,null,null,null,1,{"$f":"($N$23*$N$24)/(1+$N$23*(M90/100))","v":161.349245007306},{"$f":"($N$23*$N$24)/(1+$N$23*(P90/100))","v":163.14626442254001},0.57333333333331205,null,null,null,null,null,null,null,null,null,null,null,null,null,null,null,null,null,null,{"$error":"#NAME?"},{"$error":"#NAME?"},{"$error":"#NAME?"}]
[null,null,0.40000000000002001,0,0,0,0,0,null,null,null,null,{"$f":"IF(M90+$K$11<=$K$9,M90+$K$11,M90)","v":1},161.349245007306,163.17466051460599,{"$f":"P90-$K$11","v":0.566666666666645},null,null,null,null,null,null,null,null,null,null,null,null,null,null,null,null,null,null,{"$error":"#NAME?"},{"$error":"#NAME?"},{"$error":"#NAME?"}]
[null,null,0.40666666666668699,0,0,0,0,0,null,null,null,null,1,161.349245007306,163.20306649323999,0.55999999999997796,null,null,null,null,null,null,null,null,null,null,null,null,null,null,null,null,null,null,{"$error":"#NAME?"},{"$error":"#NAME?"},{"$error":"#NAME?"}]
[null,null,0.41333333333335398,0,0,0,0,0,null,null,null,null,1,161.349245007306,163.231482363608,0.55333333333331103,null,null,null,null,null,null,null,null,null,null,null,null,null,null,null,null,null,null,{"$error":"#NAME?"},{"$error":"#NAME?"},{"$error":"#NAME?"}]
[null,null,0.42000000000002102,{"$f":"$C$12+$C$13*C94+$C$14*C94^2","v":0},0,{"$f":"$E$12+$E$13*E94+$E$14*E94^2","v":0},0,{"$f":"$G$12+$G$13*G94+$G$14*G94^2","v":0},null,null,null,null,1,161.349245007306,163.25990813087699,0.54666666666664399,null,null,null,null,null,null,null,null,null,null,null,null,null,null,null,null,null,null,{"$error":"#NAME?"},{"$error":"#NAME?"},{"$error":"#NAME?"}]
[null,null,0.42666666666668801,0,{"$f":"IF(E94+$K$11<=MIN($K$9,$E$28),E94+$K$11,E94)","v":0},0,{"$f":"IF(G94+$K$11<=MIN($K$9,$G$28),G94+$K$11,G94)","v":0},0,null,null,null,null,1,161.349245007306,163.288343800219,0.53999999999997705,null,null,null,null,null,null,null,null,null,null,null,null,null,null,null,null,null,null,{"$error":"#NAME?"},{"$error":"#NAME?"},{"$error":"#NAME?"}]
[null,null,{"$f":"IF(C95+$K$11<=$K$9,C95+$K$11,C95)","v":0.433333333333355},0,0,0,0,0,null,null,null,null,1,161.349245007306,163.316789376808,0.53333333333331001,null,null,null,null,null,null,null,null,null,null,null,null,null,null,null,null,null,null,{"$error":"#NAME?"},{"$error":"#NAME?"},{"$error":"#NAME?"}]
[null,null,0.44000000000002198,0,0,0,0,0,null,null,null,null,1,161.349245007306,163.34524486582299,0.52666666666664297,null,null,null,null,null,null,null,null,null,null,null,null,null,null,null,null,null,null,{"$error":"#NAME?"},{"$error":"#NAME?"},{"$error":"#NAME?"}]
[null,null,0.44666666666668903,0,0,0,0,0,null,null,null,null,1,161.349245007306,163.373710272446,0.51999999999997604,null,null,null,null,null,null,null,null,null,null,null,null,null,null,null,null,null,null,{"$error":"#NAME?"},{"$error":"#NAME?"},{"$error":"#NAME?"}]
[null,null,0.45333333333335601,0,0,0,0,0,null,null,null,null,1,161.349245007306,163.40218560186301,0.51333333333330899,null,null,null,null,null,null,null,null,null,null,null,null,null,null,null,null,null,null,{"$error":"#NAME?"},{"$error":"#NAME?"},{"$error":"#NAME?"}]
[null,null,0.460000000000023,0,0,0,0,0,null,null,null,null,1,161.349245007306,163.43067085926299,0.50666666666664195,null,null,null,null,null,null,null,null,null,null,null,null,null,null,null,null,null,null,{"$error":"#NAME?"},{"$error":"#NAME?"},{"$error":"#NAME?"}]
[null,null,0.46666666666668999,0,0,0,0,0,null,null,null,null,1,161.349245007306,163.45916604984001,0.49999999999997502,null,null,null,null,null,null,null,null,null,null,null,null,null,null,null,null,null,null,{"$error":"#NAME?"},{"$error":"#NAME?"},{"$error":"#NAME?"}]
[null,null,0.47333333333335698,0,0,0,0,0,null,null,null,null,1,161.349245007306,163.48767117878899,0.49333333333330798,null,null,null,null,null,null,null,null,null,null,null,null,null,null,null,null,null,null,{"$error":"#NAME?"},{"$error":"#NAME?"},{"$error":"#NAME?"}]
[null,null,0.48000000000002402,0,0,0,0,0,null,null,null,null,1,161.349245007306,163.51618625131201,0.48666666666664099,null,null,null,null,null,null,null,null,null,null,null,null,null,null,null,null,null,null,{"$error":"#NAME?"},{"$error":"#NAME?"},{"$error":"#NAME?"}]
[null,null,{"$f":"IF(AND($C$12+$C$13*C103+$C$14*C103^2>$K$13,$C$12+$C$13*(C103+$K$11)+$C$14*(C103+$K$11)^2>$K$13),C103+$K$11,C103)","v":0.48000000000002402},0,{"$f":"IF(AND($E$12+$E$13*E103+$E$14*E103^2>$K$13,$E$12+$E$13*(E103+$K$11)+$E$14*(E103+$K$11)^2>$K$13),E103+$K$11,E103)","v":0},0,{"$f":"IF(AND($G$12+$G$13*G103+$G$14*G103^2>$K$13,$G$12+$G$13*(G103+$K$11)+$G$14*(G103+$K$11)^2>$K$13),G103+$K$11,G103)","v":0},0,null,null,null,null,1,161.349245007306,163.54471127261201,0.479999999999974,null,null,null,null,null,null,null,null,null,null,null,null,null,null,null,null,null,null,{"$error":"#NAME?"}]
[null,null,0.48000000000002402,0,0,0,0,0,null,null,null,null,1,161.349245007306,163.573246247897,0.47333333333330702,null,null,null,null,null,null,null,null,null,null,null,null,null,null,null,null,null,null,{"$error":"#NAME?"}]
[null,null,0.48000000000002402,0,0,0,0,0,null,null,null,null,1,161.349245007306,163.60179118237801,0.46666666666663997,null,null,null,null,null,null,null,null,null,null,null,null,null,null,null,null,null,null,{"$error":"#NAME?"}]
[null,null,0.48000000000002402,0,0,0,0,0,null,null,null,null,1,161.349245007306,163.63034608126901,0.45999999999997299,null,null,null,null,null,null,null,null,null,null,null,null,null,null,null,null,null,null,{"$error":"#NAME?"}]
[null,null,0.48000000000002402,0,0,0,0,0,null,null,null,null,1,161.349245007306,163.65891094979,0.453333333333306,null,null,null,null,null,null,null,null,null,null,null,null,null,null,null,null,null,null,{"$error":"#NAME?"}]
[null,null,0.48000000000002402,0,0,0,0,0,null,null,null,null,1,161.349245007306,163.68748579316201,0.44666666666663901,null,null,null,null,null,null,null,null,null,null,null,null,null,null,null,null,null,null,{"$error":"#NAME?"}]
[null,null,0.48000000000002402,0,0,0,0,0,null,null,null,null,1,161.349245007306,163.71607061661001,0.43999999999997202,null,null,null,null,null,null,null,null,null,null,null,null,null,null,null,null,null,null,{"$error":"#NAME?"}]
[null,null,0.48000000000002402,0,0,0,0,0,null,null,null,null,1,161.349245007306,163.74466542536501,0.43333333333330498,null,null,null,null,null,null,null,null,null,null,null,null,null,null,null,null,null,null,{"$error":"#NAME?"}]
[null,null,0.48000000000002402,0,0,0,0,0,null,null,null,null,1,161.349245007306,163.77327022466,0.42666666666663799,null,null,null,null,null,null,null,null,null,null,null,null,null,null,null,null,null,null,{"$error":"#NAME?"}]
[null,null,0.48000000000002402,0,0,0,0,0,null,null,null,null,1,161.349245007306,163.801885019731,0.41999999999997101,null,null,null,null,null,null,null,null,null,null,null,null,null,null,null,null,null,null,{"$error":"#NAME?"}]
[null,null,0.48000000000002402,0,0,0,0,0,null,null,null,null,1,161.349245007306,163.830509815818,0.41333333333330402,null,null,null,null,null,null,null,null,null,null,null,null,null,null,null,null,null,null,{"$error":"#NAME?"}]
[null,null,0.48000000000002402,0,0,0,0,0,null,null,null,null,1,161.349245007306,163.859144618165,0.40666666666663698,null,null,null,null,null,null,null,null,null,null,null,null,null,null,null,null,null,null,{"$error":"#NAME?"}]
[null,null,0.48000000000002402,0,0,0,0,0,null,null,null,null,1,161.349245007306,163.88778943202101,0.39999999999996999,null,null,null,null,null,null,null,null,null,null,null,null,null,null,null,null,null,null,{"$error":"#NAME?"}]
[null,null,0.48000000000002402,0,0,0,0,0,null,null,null,null,1,161.349245007306,163.91644426263599,0.393333333333303,null,null,null,null,null,null,null,null,null,null,null,null,null,null,null,null,null,null,{"$error":"#NAME?"}]
[null,null,0.48000000000002402,0,0,0,0,0,null,null,null,null,1,161.349245007306,163.94510911526601,0.38666666666663602,null,null,null,null,null,null,null,null,null,null,null,null,null,null,null,null,null,null,{"$error":"#NAME?"}]
[null,null,0.48000000000002402,0,0,0,0,0,null,null,null,null,1,161.349245007306,163.97378399516899,0.37999999999996897,null,null,null,null,null,null,null,null,null,null,null,null,null,null,null,null,null,null,{"$error":"#NAME?"}]
[null,null,0.48000000000002402,0,0,0,0,0,null,null,null,null,1,161.349245007306,164.00246890760801,0.37333333333330199,null,null,null,null,null,null,null,null,null,null,null,null,null,null,null,null,null,null,{"$error":"#NAME?"}]
[null,null,0.48000000000002402,0,0,0,0,0,null,null,null,null,1,161.349245007306,164.03116385784799,0.366666666666635,null,null,null,null,null,null,null,null,null,null,null,null,null,null,null,null,null,null,{"$error":"#NAME?"}]
[null,null,0.48000000000002402,0,0,0,0,0,null,null,null,null,1,{"$f":"($N$23*$N$24)/(1+$N$23*(M122/100))","v":161.349245007306},{"$f":"($N$23*$N$24)/(1+$N$23*(P122/100))","v":164.05986885115999},0.35999999999996801,null,null,null,null,null,null,null,null,null,null,null,null,null,null,null,null,null,null,{"$error":"#NAME?"}]
[null,null,0.48000000000002402,0,0,0,0,0,null,null,null,null,{"$f":"IF(M122+$K$11<=$K$9,M122+$K$11,M122)","v":1},161.349245007306,164.08858389281701,{"$f":"P122-$K$11","v":0.35333333333330103},null,null,null,null,null,null,null,null,null,null,null,null,null,null,null,null,null,null,{"$error":"#NAME?"}]
[null,null,0.48000000000002402,0,0,0,0,0,null,null,null,null,1,161.349245007306,164.117308988096,0.34666666666663398,null,null,null,null,null,null,null,null,null,null,null,null,null,null,null,null,null,null,{"$error":"#NAME?"}]
[null,null,0.48000000000002402,0,0,0,0,0,null,null,null,null,1,161.349245007306,164.14604414227799,0.339999999999967,null,null,null,null,null,null,null,null,null,null,null,null,null,null,null,null,null,null,{"$error":"#NAME?"}]
[null,null,0.48000000000002402,{"$f":"$C$12+$C$13*C126+$C$14*C126^2","v":0},0,{"$f":"$E$12+$E$13*E126+$E$14*E126^2","v":0},0,{"$f":"$G$12+$G$13*G126+$G$14*G126^2","v":0},null,null,null,null,1,161.349245007306,164.17478936064799,0.33333333333330001,null,null,null,null,null,null,null,null,null,null,null,null,null,null,null,null,null,null,{"$error":"#NAME?"}]
[null,null,0.48000000000002402,0,0,0,0,0,null,null,null,null,1,161.349245007306,164.20354464849299,0.32666666666663302,null,null,null,null,null,null,null,null,null,null,null,null,null,null,null,null,null,null,{"$error":"#NAME?"}]
[null,null,0.48000000000002402,0,0,0,0,0,null,null,null,null,1,161.349245007306,164.23231001110599,0.31999999999996598,null,null,null,null,null,null,null,null,null,null,null,null,null,null,null,null,null,null,{"$error":"#NAME?"}]
[null,null,0.48000000000002402,0,0,0,0,0,null,null,null,null,1,161.349245007306,164.26108545378199,0.31333333333329899,null,null,null,null,null,null,null,null,null,null,null,null,null,null,null,null,null,null,{"$error":"#NAME?"}]
[null,null,0.48000000000002402,0,0,0,0,0,null,null,null,null,1,161.349245007306,164.289870981821,0.306666666666632,null,null,null,null,null,null,null,null,null,null,null,null,null,null,null,null,null,null,{"$error":"#NAME?"}]
[null,null,0.48000000000002402,0,0,0,0,0,null,null,null,null,1,161.349245007306,164.318666600526,0.29999999999996502,null,null,null,null,null,null,null,null,null,null,null,null,null,null,null,null,null,null,{"$error":"#NAME?"}]
[null,null,0.48000000000002402,0,0,0,0,0,null,null,null,null,1,161.349245007306,164.34747231520299,0.29333333333329797,null,null,null,null,null,null,null,null,null,null,null,null,null,null,null,null,null,null,{"$error":"#NAME?"}]
[null,null,0.48000000000002402,0,0,0,0,0,null,null,null,null,1,161.349245007306,164.37628813116399,0.28666666666663099,null,null,null,null,null,null,null,null,null,null,null,null,null,null,null,null,null,null,{"$error":"#NAME?"}]
[null,null,0.48000000000002402,0,0,0,0,0,null,null,null,null,1,161.349245007306,164.405114053722,0.279999999999964,null,null,null,null,null,null,null,null,null,null,null,null,null,null,null,null,null,null,{"$error":"#NAME?"}]
[null,null,0.48000000000002402,0,0,0,0,0,null,null,null,null,1,161.349245007306,164.43395008819499,0.27333333333329701,null,null,null,null,null,null,null,null,null,null,null,null,null,null,null,null,null,null,{"$error":"#NAME?"}]
[null,null,{"$f":"IF(AND($C$12+$C$13*C135+$C$14*C135^2>$K$13,$C$12+$C$13*(C135+$K$11)+$C$14*(C135+$K$11)^2>$K$13),C135+$K$11,C135)","v":0.48000000000002402},0,{"$f":"IF(AND($E$12+$E$13*E135+$E$14*E135^2>$K$13,$E$12+$E$13*(E135+$K$11)+$E$14*(E135+$K$11)^2>$K$13),E135+$K$11,E135)","v":0},0,{"$f":"IF(AND($G$12+$G$13*G135+$G$14*G135^2>$K$13,$G$12+$G$13*(G135+$K$11)+$G$14*(G135+$K$11)^2>$K$13),G135+$K$11,G135)","v":0},0,null,null,null,null,1,161.349245007306,164.462796239905,0.26666666666663003,null,null,null,null,null,null,null,null,null,null,null,null,null,null,null,null,null,null,{"$error":"#NAME?"}]
[null,null,0.48000000000002402,0,0,0,0,0,null,null,null,null,1,161.349245007306,164.49165251417801,0.25999999999996298,null,null,null,null,null,null,null,null,null,null,null,null,null,null,null,null,null,null,{"$error":"#NAME?"}]
[null,null,0.48000000000002402,0,0,0,0,0,null,null,null,null,1,161.349245007306,164.52051891634201,0.253333333333296,null,null,null,null,null,null,null,null,null,null,null,null,null,null,null,null,null,null,{"$error":"#NAME?"}]
[null,null,0.48000000000002402,0,0,0,0,0,null,null,null,null,1,161.349245007306,164.54939545173099,0.24666666666662901,null,null,null,null,null,null,null,null,null,null,null,null,null,null,null,null,null,null,{"$error":"#NAME?"}]
[null,null,0.48000000000002402,0,0,0,0,0,null,null,null,null,1,161.349245007306,164.578282125681,0.23999999999996199,null,null,null,null,null,null,null,null,null,null,null,null,null,null,null,null,null,null,{"$error":"#NAME?"}]
[null,null,0.48000000000002402,0,0,0,0,0,null,null,null,null,1,161.349245007306,164.607178943533,0.23333333333329501,null,null,null,null,null,null,null,null,null,null,null,null,null,null,null,null,null,null,{"$error":"#NAME?"}]
[null,null,0.48000000000002402,0,0,0,0,0,null,null,null,null,1,161.349245007306,164.63608591062999,0.22666666666662799,null,null,null,null,null,null,null,null,null,null,null,null,null,null,null,null,null,null,{"$error":"#NAME?"}]
[null,null,0.48000000000002402,0,0,0,0,0,null,null,null,null,1,161.349245007306,164.66500303232201,0.219999999999961,null,null,null,null,null,null,null,null,null,null,null,null,null,null,null,null,null,null,{"$error":"#NAME?"}]
[null,null,0.48000000000002402,0,0,0,0,0,null,null,null,null,1,161.349245007306,164.69393031395899,0.21333333333329399,null,null,null,null,null,null,null,null,null,null,null,null,null,null,null,null,null,null,{"$error":"#NAME?"}]
[null,null,0.48000000000002402,0,0,0,0,0,null,null,null,null,1,161.349245007306,164.72286776089601,0.206666666666627,null,null,null,null,null,null,null,null,null,null,null,null,null,null,null,null,null,null,{"$error":"#NAME?"}]
[null,null,0.48000000000002402,0,0,0,0,0,null,null,null,null,1,161.349245007306,164.751815378494,0.19999999999995999,null,null,null,null,null,null,null,null,null,null,null,null,null,null,null,null,null,null,{"$error":"#NAME?"}]
[null,null,0.48000000000002402,0,0,0,0,0,null,null,null,null,1,161.349245007306,164.780773172115,0.193333333333293,null,null,null,null,null,null,null,null,null,null,null,null,null,null,null,null,null,null,{"$error":"#NAME?"}]
[null,null,0.48000000000002402,0,0,0,0,0,null,null,null,null,1,161.349245007306,164.809741147126,0.18666666666662601,null,null,null,null,null,null,null,null,null,null,null,null,null,null,null,null,null,null,{"$error":"#NAME?"}]
[null,null,0.48000000000002402,0,0,0,0,0,null,null,null,null,1,161.349245007306,164.838719308897,0.179999999999959,null,null,null,null,null,null,null,null,null,null,null,null,null,null,null,null,null,null,{"$error":"#NAME?"}]
[null,null,0.48000000000002402,0,0,0,0,0,null,null,null,null,1,161.349245007306,164.86770766280199,0.17333333333329201,null,null,null,null,null,null,null,null,null,null,null,null,null,null,null,null,null,null,{"$error":"#NAME?"}]
[null,null,0.48000000000002402,0,0,0,0,0,null,null,null,null,1,161.349245007306,164.89670621422101,0.166666666666625,null,null,null,null,null,null,null,null,null,null,null,null,null,null,null,null,null,null,{"$f":"IF(AND($C$12+$C$13*AI150+$C$14*AI150^2>$K$13,$C$12+$C$13*(AI150+$K$11)+$C$14*(AI150+$K$11)^2>$K$13),AI150+$K$11,AI150)","v":{"$error":"#NAME?"}}]
[null,null,0.48000000000002402,0,0,0,0,0,null,null,null,null,1,161.349245007306,164.92571496853401,0.15999999999995801,null,null,null,null,null,null,null,null,null,null,null,null,null,null,null,null,null,null,{"$error":"#NAME?"}]
[null,null,0.48000000000002402,0,0,0,0,0,null,null,null,null,1,161.349245007306,164.95473393112701,0.15333333333329099,null,null,null,null,null,null,null,null,null,null,null,null,null,null,null,null,null,null,{"$error":"#NAME?"}]
[null,null,0.48000000000002402,0,0,0,0,0,null,null,null,null,1,{"$f":"($N$23*$N$24)/(1+$N$23*(M154/100))","v":161.349245007306},{"$f":"($N$23*$N$24)/(1+$N$23*(P154/100))","v":164.983763107389},0.14666666666662401,null,null,null,null,null,null,null,null,null,null,null,null,null,null,null,null,null,null,{"$error":"#NAME?"}]
[null,null,0.48000000000002402,0,0,0,0,0,null,null,null,null,{"$f":"IF(M154+$K$11<=$K$9,M154+$K$11,M154)","v":1},161.349245007306,165.012802502715,{"$f":"P154-$K$11","v":0.13999999999995699},null,null,null,null,null,null,null,null,null,null,null,null,null,null,null,null,null,null,{"$error":"#NAME?"}]
[null,null,0.48000000000002402,0,0,0,0,0,null,null,null,null,1,161.349245007306,165.04185212250101,0.13333333333329001,null,null,null,null,null,null,null,null,null,null,null,null,null,null,null,null,null,null,{"$error":"#NAME?"}]
[null,null,0.48000000000002402,0,0,0,0,0,null,null,null,null,1,161.349245007306,165.070911972147,0.12666666666662299,null,null,null,null,null,null,null,null,null,null,null,null,null,null,null,null,null,null,{"$error":"#NAME?"}]
[null,null,0.48000000000002402,{"$f":"$C$12+$C$13*C158+$C$14*C158^2","v":0},0,{"$f":"$E$12+$E$13*E158+$E$14*E158^2","v":0},0,{"$f":"$G$12+$G$13*G158+$G$14*G158^2","v":0},null,null,null,null,1,161.349245007306,165.09998205705901,0.119999999999956,null,null,null,null,null,null,null,null,null,null,null,null,null,null,null,null,null,null,{"$error":"#NAME?"}]
[null,null,0.48000000000002402,0,0,0,0,0,null,null,null,null,1,161.349245007306,165.12906238264401,0.113333333333289,null,null,null,null,null,null,null,null,null,null,null,null,null,null,null,null,null,null,{"$error":"#NAME?"}]
[null,null,0.48000000000002402,0,0,0,0,0,null,null,null,null,1,161.349245007306,165.15815295431599,0.106666666666622,null,null,null,null,null,null,null,null,null,null,null,null,null,null,null,null,null,null,{"$error":"#NAME?"}]
[null,null,0.48000000000002402,0,0,0,0,0,null,null,null,null,1,161.349245007306,165.18725377749001,9.9999999999955E-2,null,null,null,null,null,null,null,null,null,null,null,null,null,null,null,null,null,null,{"$error":"#NAME?"}]
[null,null,0.48000000000002402,0,0,0,0,0,null,null,null,null,1,161.349245007306,165.216364857586,9.3333333333287999E-2,null,null,null,null,null,null,null,null,null,null,null,null,null,null,null,null,null,null,{"$error":"#NAME?"}]
[null,null,0.48000000000002402,0,0,0,0,0,null,null,null,null,1,161.349245007306,165.24548620002699,8.6666666666620998E-2,null,null,null,null,null,null,null,null,null,null,null,null,null,null,null,null,null,null,{"$error":"#NAME?"}]
[null,null,0.48000000000002402,0,0,0,0,0,null,null,null,null,1,161.349245007306,165.27461781024201,7.9999999999953997E-2]
[null,null,0.48000000000002402,0,0,0,0,0,null,null,null,null,1,161.349245007306,165.30375969366199,7.3333333333286996E-2]
[null,null,0.48000000000002402,0,0,0,0,0,null,null,null,null,1,161.349245007306,165.33291185572199,6.6666666666619995E-2]
[null,null,0.48000000000002402,0,0,0,0,0,null,null,null,null,1,161.349245007306,165.36207430185999,5.9999999999953001E-2]
[null,null,{"$f":"IF(AND($C$12+$C$13*C167+$C$14*C167^2>$K$13,$C$12+$C$13*(C167+$K$11)+$C$14*(C167+$K$11)^2>$K$13),C167+$K$11,C167)","v":0.48000000000002402},0,{"$f":"IF(AND($E$12+$E$13*E167+$E$14*E167^2>$K$13,$E$12+$E$13*(E167+$K$11)+$E$14*(E167+$K$11)^2>$K$13),E167+$K$11,E167)","v":0},0,{"$f":"IF(AND($G$12+$G$13*G167+$G$14*G167^2>$K$13,$G$12+$G$13*(G167+$K$11)+$G$14*(G167+$K$11)^2>$K$13),G167+$K$11,G167)","v":0},0,null,null,null,null,1,161.349245007306,165.39124703752,5.3333333333286E-2]
[null,null,0.48000000000002402,0,0,0,0,0,null,null,null,null,1,161.349245007306,165.42043006814899,4.6666666666618999E-2]
[null,null,0.48000000000002402,0,0,0,0,0,null,null,null,null,1,161.349245007306,165.44962339919701,3.9999999999951998E-2]
[null,null,0.48000000000002402,0,0,0,0,0,null,null,null,null,1,161.349245007306,165.47882703611799,3.3333333333284997E-2]
[null,null,0.48000000000002402,0,0,0,0,0,null,null,null,null,1,161.349245007306,165.50804098437101,2.6666666666617999E-2]
[null,null,0.48000000000002402,0,0,0,0,0,null,null,null,null,1,161.349245007306,165.537265249418,1.9999999999951001E-2]
[null,null,0.48000000000002402,0,0,0,0,0,null,null,null,null,1,161.349245007306,165.566499836725,1.3333333333284E-2]
[null,null,0.48000000000002402,0,0,0,0,0,null,null,null,null,1,161.349245007306,165.595744751761,6.6666666666170002E-3]
[null,null,0.48000000000002402,0,0,0,0,0,null,null,null,null,1,161.349245007306,165.625,-5.0000000000000002E-14]
[null,null,0.48000000000002402,0,0,0,0,0]
[null,null,0.48000000000002402,0,0,0,0,0]
[null,null,0.48000000000002402,0,0,0,0,0]
[null,null,0.48000000000002402,0,0,0,0,0]