{"text_format":"1","workbook":"xlsx","n_sheets":6,"sheets":["RCC Data","Gradation","ASTM 1557","Optimum Cement Content Graph","RX","Reference"],"not_rendered":{"charts":4,"images":1,"macros":1,"external_links":0,"defined_names":243,"comments":3,"pivot_tables":0},"unopened":[{"sheet":"Gradation","index":1,"reason":"not_a_worksheet"}],"bounds":{"document_bytes":16777216,"sheet_cells":100000,"rows_first":2000,"rows_last":500,"rows_between":2000,"halvings":0,"cell_chars":16384,"cell_head_chars":4096},"cells_cut":0,"cells_raw":0,"read":"whole","date_system":"1900"}

{"sheet":"RCC Data","index":0,"n_rows":96,"n_cols":18,"rows_kept":96,"cut":false,"hidden":false,"merged":[[10,1,10,3],[11,1,11,3],[12,1,12,3],[13,1,13,3],[14,1,14,3],[15,1,15,3],[26,2,27,3],[0,0,0,2],[35,2,35,3],[34,2,34,3],[33,2,33,3],[32,2,32,3],[31,2,31,3],[7,1,7,3],[8,1,8,3],[9,1,9,3],[16,1,16,3],[18,1,18,3],[30,2,30,3],[27,6,27,7],[27,4,27,5],[28,4,28,5],[28,6,28,7],[28,8,28,9],[23,2,23,4],[21,1,21,16],[18,11,18,12],[29,2,29,3],[25,2,25,11],[19,1,19,12],[23,5,23,7],[28,2,28,3],[30,8,30,9],[31,6,31,7],[31,8,31,9],[41,2,41,4],[43,5,43,7],[29,10,29,11],[26,10,27,11],[26,8,27,9],[33,4,33,5],[33,6,33,7],[33,8,33,9],[33,10,33,11],[32,4,32,5],[32,6,32,7],[32,8,32,9],[32,10,32,11],[29,4,29,5],[29,6,29,7],[29,8,29,9],[28,10,28,11],[26,4,26,7],[30,4,30,5],[30,6,30,7],[30,10,30,11],[31,10,31,11],[34,10,34,11],[31,4,31,5],[59,5,59,6],[48,5,48,6],[48,2,48,4],[50,5,50,6],[49,5,49,6],[49,2,49,4],[58,5,58,6],[56,7,56,8],[34,8,34,9],[34,4,34,5],[34,6,34,7],[48,7,48,8],[54,1,54,16],[56,2,56,4],[56,5,56,6],[42,5,42,7],[35,10,35,11],[50,2,50,4],[51,2,51,4],[51,7,51,8],[50,7,50,8],[43,2,43,4],[42,2,42,4],[59,7,59,8],[58,7,58,8],[57,7,57,8],[57,5,57,6],[38,1,38,16],[46,1,46,16],[40,2,40,7],[57,2,59,4],[35,4,35,5],[35,6,35,7],[35,8,35,9],[76,2,78,4],[76,5,76,6],[77,5,77,6],[78,5,78,6],[73,2,75,4],[73,5,73,6],[72,5,72,6],[72,7,72,8],[41,5,41,7],[69,9,69,10],[63,2,65,4],[60,2,62,4],[61,5,61,6],[62,5,62,6],[63,5,63,6],[64,5,64,6],[65,5,65,6],[67,1,67,16],[69,13,69,14],[65,7,65,8],[64,7,64,8],[62,7,62,8],[61,7,61,8],[60,7,60,8],[75,11,75,12],[74,11,74,12],[73,11,73,12],[78,7,78,8],[77,7,77,8],[76,7,76,8],[75,7,75,8],[74,7,74,8],[71,9,71,10],[75,5,75,6],[72,9,72,10],[73,9,73,10],[71,11,71,12],[70,11,70,12],[13,10,13,12],[12,10,12,12],[11,10,11,12],[13,4,13,6],[16,4,16,6],[69,11,69,12],[60,5,60,6],[49,7,49,8],[51,5,51,6],[69,2,69,4],[69,5,69,6],[69,7,69,8],[70,2,72,4],[70,5,70,6],[70,7,70,8],[71,5,71,6],[71,7,71,8],[70,9,70,10],[63,7,63,8],[92,6,92,7],[16,7,16,9],[16,10,16,12],[96,1,96,3],[92,1,92,3],[89,2,89,4],[82,1,84,16],[76,15,78,16],[77,9,77,10],[78,9,78,10],[76,13,78,14],[73,13,75,14],[70,13,72,14],[73,7,73,8],[78,11,78,12],[77,11,77,12],[76,11,76,12],[74,9,74,10],[75,9,75,10],[76,9,76,10],[73,15,75,16],[70,15,72,16],[69,15,69,16],[72,11,72,12],[87,2,87,4],[7,10,7,12],[8,7,8,9],[7,7,7,9],[7,4,7,6],[18,9,18,10],[15,4,15,12],[14,4,14,12],[13,7,13,9],[12,7,12,9],[11,7,11,9],[8,4,8,6],[9,4,9,6],[10,4,10,6],[11,4,11,6],[12,4,12,6],[10,10,10,12],[8,10,8,12],[9,10,9,12],[10,7,10,9],[9,7,9,9],[18,4,18,5],[18,7,18,8],[74,5,74,6]]}
["TxDOT Manuals >"]
[null,"TEXAS DEPARTMENT OF TRANSPORTATION",null,null,null,null,null,null,null,null,null,null,null,null,null,null,null,255]
[null,null,null,null,null,null,null,null,null,null,null,null,null,null,161,null,null,2]
[null,null,null,null,null,null,null,null,null,null,null,null,null,null,2,null,null,"Tx113,4.xls::41085.660347"]
[null,"Roller Compacted Concrete Worksheet",null,null,null,null,null,null,null,null,null,null,null,null,"tx4rcc.xlsm::45183.390625",null,null,45]
[]
[null,null,null,null,null,null,null,null,null,null,null,null,{"$f":"\"File Version: \" & TEXT(MID(sn,SEARCH(\"::\",sn,1)+2,20),\"mm/dd/yy hh:mm:ss\")","v":"File Version: 09/14/23 09:22:30"}]
[null,"SAMPLE ID:",null,null,null,null,null,"SAMPLED DATE:"]
[null,"TEST NUMBER:",null,null,null,null,null,"LETTING DATE:"]
[null,"SAMPLE STATUS:",null,null,null,null,null,"CONTROLLING CSJ:"]
[null,"COUNTY:",null,null,null,null,null,"SPEC YEAR:"]
[null,"SAMPLED BY:",null,null,null,null,null,"SPEC ITEM:"]
[null,"SAMPLE LOCATION:",null,null,null,null,null,"SPECIAL PROVISION:"]
[null,"MATERIAL CODE:",null,null,null,null,null,"GRADE:"]
[null,"MATERIAL NAME:"]
[null,"PRODUCER:",null,null,""]
[null,"AREA ENGINEER:",null,null,null,null,null,"PROJECT MANAGER:"]
[]
[null,"COURSE\\LIFT:",null,null,null,null,"STATION:",null,null,"DIST. FROM CL:"]
[null,"Roller Compacted Concrete Mix Design"]
{"$rows_left_out":77}
{"sheet":"ASTM 1557","index":2,"n_rows":70,"n_cols":18,"rows_kept":70,"cut":false,"hidden":false,"merged":[[67,2,67,4],[7,1,7,3],[8,9,8,12],[11,9,11,12],[13,1,13,3],[12,1,12,3],[11,1,11,3],[10,1,10,3],[9,1,9,3],[8,1,8,3],[10,9,10,12],[9,9,9,12],[7,4,7,8],[8,4,8,8],[9,4,9,8],[10,4,10,8],[7,9,7,12],[23,1,23,2],[21,1,21,2],[57,13,57,16],[58,13,58,16],[27,1,27,2],[25,1,25,2],[24,1,24,2],[13,9,13,12],[12,9,12,12],[16,13,16,16],[16,9,16,12],[18,14,18,16],[18,11,18,13],[18,9,18,10],[15,1,15,3],[59,13,59,16],[30,3,30,6],[30,1,30,2],[41,1,41,2],[30,8,30,11],[32,1,32,2],[31,1,31,2],[59,3,59,6],[30,13,30,16],[37,1,37,2],[58,3,58,6],[57,3,57,6],[57,8,57,11],[58,8,58,11],[59,8,59,11],[14,1,14,3],[15,4,15,16],[14,4,14,16],[13,13,13,16],[22,1,22,2],[16,1,16,3],[18,1,18,3],[16,4,16,8],[18,4,18,5],[18,6,18,8],[19,1,19,16],[69,2,69,4],[11,4,11,8],[12,4,12,8],[13,4,13,8],[7,13,7,16],[8,13,8,16],[9,13,9,16],[10,13,10,16],[11,13,11,16],[12,13,12,16],[48,1,48,2],[53,1,53,2],[52,1,52,2],[51,1,51,2],[50,1,50,2],[47,1,47,2],[62,1,64,16],[34,1,34,2],[35,1,35,2],[59,1,59,2],[58,1,58,2],[57,1,57,2],[55,1,55,2],[54,1,54,2],[49,1,49,2],[46,1,46,2],[36,1,36,2],[40,1,40,2],[44,1,44,2],[43,1,43,2],[42,1,42,2],[39,1,39,2]]}
[]
[null,"TEXAS DEPARTMENT OF TRANSPORTATION"]
[]
[]
[null,"Moisture-Density Curve for Roller Compacted Concrete",null,null,null,null,null,null,null,null,null,null,null,null,null,null,null,45]
[null,"ASTM D1557"]
[]
[null,"SAMPLE ID:",null,null,{"$f":"IF(sampleid=\"\",\"\",sampleid)","v":""},null,null,null,null,"SAMPLED DATE:",null,null,null,{"$f":"IF(sampleddate=\"\",\"\",sampleddate)","v":""}]
[null,"TEST NUMBER:",null,null,{"$f":"IF(testnumber=\"\",\"\",testnumber)","v":""},null,null,null,null,"LETTING DATE:",null,null,null,{"$f":"IF(lettingdate=\"\",\"\",lettingdate)","v":""}]
[null,"SAMPLE STATUS:",null,null,{"$f":"IF(status=\"\",\"\",status)","v":""},null,null,null,null,"CONTROLLING CSJ:",null,null,null,{"$f":"IF(ccsj=\"\",\"\",ccsj)","v":""}]
[null,"COUNTY:",null,null,{"$f":"IF(county=\"\",\"\",county)","v":""},null,null,null,null,"SPEC YEAR:",null,null,null,{"$f":"+IF(specyear=\"\",\"\",specyear)","v":""}]
[null,"SAMPLED BY:",null,null,{"$f":"IF(sampledby=\"\",\"\",sampledby)","v":""},null,null,null,null,"SPEC ITEM:",null,null,null,{"$f":"IF(specitem=\"\",\"\",specitem)","v":""}]
[null,"SAMPLE LOCATION:",null,null,{"$f":"IF(samplelocation=\"\",\"\",samplelocation)","v":""},null,null,null,null,"SPECIAL PROVISION:",null,null,null,{"$f":"IF(specialprovision=\"\",\"\",specialprovision)","v":""}]
[null,"MATERIAL CODE:",null,null,{"$f":"IF(material=\"\",\"\",material)","v":""},null,null,null,null,"GRADE:",null,null,null,{"$f":"IF(grade=\"\",\"\",grade)","v":""}]
[null,"MATERIAL NAME:",null,null,{"$f":"IF(matl_nm=\"\",\"\",matl_nm)","v":""}]
[null,"PRODUCER:",null,null,{"$f":"IF(producer=\"\",\"\",producer)","v":""}]
[null,"AREA ENGINEER:",null,null,{"$f":"IF(areaengineer=\"\",\"\",areaengineer)","v":""},null,null,null,null,"PROJECT MANAGER:",null,null,null,{"$f":"IF(PROJECTMANAGER=\"\",\"\",PROJECTMANAGER)","v":""}]
[]
[null,"COURSE\\LIFT:",null,null,{"$f":"IF(courselift=\"\",\"\",courselift)","v":""},null,"STATION:",null,null,{"$f":"IF(station=\"\",\"\",station)","v":""},null,"DIST. FROM CL:",null,null,{"$f":"IF(distfromcl=\"\",\"\",distfromcl)","v":""}]
[null,"Moisture-Density Work Sheet"]
{"$rows_left_out":51}
{"sheet":"Optimum Cement Content Graph","index":3,"n_rows":33,"n_cols":10,"rows_kept":33,"cut":false,"hidden":false,"merged":[[32,6,32,8],[31,6,31,8],[31,1,31,3],[32,1,32,3],[30,1,30,4],[30,6,30,9]]}
[]
[]
[]
[]
[]
[]
[]
[]
[]
[]
[]
[]
[]
[]
[]
[]
[]
[]
[]
[]
{"$rows_left_out":14}
{"sheet":"RX","index":4,"n_rows":388,"n_cols":9,"rows_kept":388,"cut":false,"hidden":true,"merged":[]}
[386]
["Fld_nbr","Value","Desc_1","Desc_2","Desc_3","Desc_4","Desc_5","Desc_6","Desc_7"]
[1,{"$f":"IF('RCC Data'!$B$83=\"\",\"\",'RCC Data'!$B$83)","v":""},{"$f":"'RCC Data'!$B$82","v":"Remarks:"}]
[2,{"$f":"IF('RCC Data'!$E$19=\"\",\"\",'RCC Data'!$E$19)","v":""},{"$f":"IF('RCC Data'!$D$19=\"\",\"\",'RCC Data'!$D$19)","v":""}]
[3,{"$f":"IF('RCC Data'!$C$90=\"\",\"\",'RCC Data'!$C$90)","v":" "},"Tested By ",{"$f":"IF('RCC Data'!$B$90=\"\",\"\",'RCC Data'!$B$90)","v":"TX418"}]
[4,{"$f":"IF('RCC Data'!$F$90=\"\",\"\",'RCC Data'!$F$90)","v":" "},"Tested Date ",{"$f":"IF('RCC Data'!$B$90=\"\",\"\",'RCC Data'!$B$90)","v":"TX418"}]
[5,{"$f":"IF('ASTM 1557'!$C$70=\"\",\"\",'ASTM 1557'!$C$70)","v":" "},"Tested By ",{"$f":"IF('ASTM 1557'!$B$70=\"\",\"\",'ASTM 1557'!$B$70)","v":"ASTM D1557"}]
[6,{"$f":"IF('ASTM 1557'!$F$70=\"\",\"\",'ASTM 1557'!$F$70)","v":" "},"Tested Date ",{"$f":"IF('ASTM 1557'!$B$70=\"\",\"\",'ASTM 1557'!$B$70)","v":"ASTM D1557"}]
[7,{"$f":"IF('RCC Data'!$F$24=\"\",\"\",'RCC Data'!$F$24)","v":""},{"$f":"IF( 'RCC Data'!$B$5=\"\",\"\", 'RCC Data'!$B$5)","v":"Roller Compacted Concrete Worksheet"},{"$f":"IF('RCC Data'!$C$24=\"\",\"\",'RCC Data'!$C$24)","v":"Select RCC Application: "}]
[8,{"$f":"IF('RCC Data'!$E$29=\"\",\"\",'RCC Data'!$E$29)","v":""},{"$f":"IF( 'RCC Data'!$C$26=\"\",\"\", 'RCC Data'!$C$26)","v":"RCC Combined Aggregate Gradation for "},{"$f":"IF('RCC Data'!$E$27=\"\",\"\",'RCC Data'!$E$27)","v":"Percent Passing by Weight"},{"$f":"IF('RCC Data'!$E$28=\"\",\"\",'RCC Data'!$E$28)","v":"Minimum\nSpec Limit"},{"$f":"IF('RCC Data'!$C$27=\"\",\"\",'RCC Data'!$C$27)","v":"Sieve Size"},{"$f":"IF('RCC Data'!$C$29=\"\",\"\",'RCC Data'!$C$29)","v":"1 in"}]
[9,{"$f":"IF('RCC Data'!$E$30=\"\",\"\",'RCC Data'!$E$30)","v":""},{"$f":"IF( 'RCC Data'!$C$26=\"\",\"\", 'RCC Data'!$C$26)","v":"RCC Combined Aggregate Gradation for "},{"$f":"IF('RCC Data'!$E$27=\"\",\"\",'RCC Data'!$E$27)","v":"Percent Passing by Weight"},{"$f":"IF('RCC Data'!$E$28=\"\",\"\",'RCC Data'!$E$28)","v":"Minimum\nSpec Limit"},{"$f":"IF('RCC Data'!$C$27=\"\",\"\",'RCC Data'!$C$27)","v":"Sieve Size"},{"$f":"IF('RCC Data'!$C$30=\"\",\"\",'RCC Data'!$C$30)","v":"3/4 in"}]
[10,{"$f":"IF('RCC Data'!$E$31=\"\",\"\",'RCC Data'!$E$31)","v":""},{"$f":"IF( 'RCC Data'!$C$26=\"\",\"\", 'RCC Data'!$C$26)","v":"RCC Combined Aggregate Gradation for "},{"$f":"IF('RCC Data'!$E$27=\"\",\"\",'RCC Data'!$E$27)","v":"Percent Passing by Weight"},{"$f":"IF('RCC Data'!$E$28=\"\",\"\",'RCC Data'!$E$28)","v":"Minimum\nSpec Limit"},{"$f":"IF('RCC Data'!$C$27=\"\",\"\",'RCC Data'!$C$27)","v":"Sieve Size"},{"$f":"IF('RCC Data'!$C$31=\"\",\"\",'RCC Data'!$C$31)","v":"1/2 in"}]
[11,{"$f":"IF('RCC Data'!$E$32=\"\",\"\",'RCC Data'!$E$32)","v":""},{"$f":"IF( 'RCC Data'!$C$26=\"\",\"\", 'RCC Data'!$C$26)","v":"RCC Combined Aggregate Gradation for "},{"$f":"IF('RCC Data'!$E$27=\"\",\"\",'RCC Data'!$E$27)","v":"Percent Passing by Weight"},{"$f":"IF('RCC Data'!$E$28=\"\",\"\",'RCC Data'!$E$28)","v":"Minimum\nSpec Limit"},{"$f":"IF('RCC Data'!$C$27=\"\",\"\",'RCC Data'!$C$27)","v":"Sieve Size"},{"$f":"IF('RCC Data'!$C$32=\"\",\"\",'RCC Data'!$C$32)","v":"3/8 in"}]
[12,{"$f":"IF('RCC Data'!$E$33=\"\",\"\",'RCC Data'!$E$33)","v":""},{"$f":"IF( 'RCC Data'!$C$26=\"\",\"\", 'RCC Data'!$C$26)","v":"RCC Combined Aggregate Gradation for "},{"$f":"IF('RCC Data'!$E$27=\"\",\"\",'RCC Data'!$E$27)","v":"Percent Passing by Weight"},{"$f":"IF('RCC Data'!$E$28=\"\",\"\",'RCC Data'!$E$28)","v":"Minimum\nSpec Limit"},{"$f":"IF('RCC Data'!$C$27=\"\",\"\",'RCC Data'!$C$27)","v":"Sieve Size"},{"$f":"IF('RCC Data'!$C$33=\"\",\"\",'RCC Data'!$C$33)","v":"No. 4"}]
[13,{"$f":"IF('RCC Data'!$E$34=\"\",\"\",'RCC Data'!$E$34)","v":""},{"$f":"IF( 'RCC Data'!$C$26=\"\",\"\", 'RCC Data'!$C$26)","v":"RCC Combined Aggregate Gradation for "},{"$f":"IF('RCC Data'!$E$27=\"\",\"\",'RCC Data'!$E$27)","v":"Percent Passing by Weight"},{"$f":"IF('RCC Data'!$E$28=\"\",\"\",'RCC Data'!$E$28)","v":"Minimum\nSpec Limit"},{"$f":"IF('RCC Data'!$C$27=\"\",\"\",'RCC Data'!$C$27)","v":"Sieve Size"},{"$f":"IF('RCC Data'!$C$34=\"\",\"\",'RCC Data'!$C$34)","v":"No. 16"}]
[14,{"$f":"IF('RCC Data'!$E$35=\"\",\"\",'RCC Data'!$E$35)","v":""},{"$f":"IF( 'RCC Data'!$C$26=\"\",\"\", 'RCC Data'!$C$26)","v":"RCC Combined Aggregate Gradation for "},{"$f":"IF('RCC Data'!$E$27=\"\",\"\",'RCC Data'!$E$27)","v":"Percent Passing by Weight"},{"$f":"IF('RCC Data'!$E$28=\"\",\"\",'RCC Data'!$E$28)","v":"Minimum\nSpec Limit"},{"$f":"IF('RCC Data'!$C$27=\"\",\"\",'RCC Data'!$C$27)","v":"Sieve Size"},{"$f":"IF('RCC Data'!$C$35=\"\",\"\",'RCC Data'!$C$35)","v":"No. 100"}]
[15,{"$f":"IF('RCC Data'!$E$36=\"\",\"\",'RCC Data'!$E$36)","v":""},{"$f":"IF( 'RCC Data'!$C$26=\"\",\"\", 'RCC Data'!$C$26)","v":"RCC Combined Aggregate Gradation for "},{"$f":"IF('RCC Data'!$E$27=\"\",\"\",'RCC Data'!$E$27)","v":"Percent Passing by Weight"},{"$f":"IF('RCC Data'!$E$28=\"\",\"\",'RCC Data'!$E$28)","v":"Minimum\nSpec Limit"},{"$f":"IF('RCC Data'!$C$27=\"\",\"\",'RCC Data'!$C$27)","v":"Sieve Size"},{"$f":"IF('RCC Data'!$C$36=\"\",\"\",'RCC Data'!$C$36)","v":"No. 200"}]
[16,{"$f":"IF('RCC Data'!$G$29=\"\",\"\",'RCC Data'!$G$29)","v":""},{"$f":"IF( 'RCC Data'!$C$26=\"\",\"\", 'RCC Data'!$C$26)","v":"RCC Combined Aggregate Gradation for "},{"$f":"IF('RCC Data'!$E$27=\"\",\"\",'RCC Data'!$E$27)","v":"Percent Passing by Weight"},{"$f":"IF('RCC Data'!$G$28=\"\",\"\",'RCC Data'!$G$28)","v":"Maximum\nSpec Limit"},{"$f":"IF('RCC Data'!$C$27=\"\",\"\",'RCC Data'!$C$27)","v":"Sieve Size"},{"$f":"IF('RCC Data'!$C$29=\"\",\"\",'RCC Data'!$C$29)","v":"1 in"}]
[17,{"$f":"IF('RCC Data'!$G$30=\"\",\"\",'RCC Data'!$G$30)","v":""},{"$f":"IF( 'RCC Data'!$C$26=\"\",\"\", 'RCC Data'!$C$26)","v":"RCC Combined Aggregate Gradation for "},{"$f":"IF('RCC Data'!$E$27=\"\",\"\",'RCC Data'!$E$27)","v":"Percent Passing by Weight"},{"$f":"IF('RCC Data'!$G$28=\"\",\"\",'RCC Data'!$G$28)","v":"Maximum\nSpec Limit"},{"$f":"IF('RCC Data'!$C$27=\"\",\"\",'RCC Data'!$C$27)","v":"Sieve Size"},{"$f":"IF('RCC Data'!$C$30=\"\",\"\",'RCC Data'!$C$30)","v":"3/4 in"}]
[18,{"$f":"IF('RCC Data'!$G$31=\"\",\"\",'RCC Data'!$G$31)","v":""},{"$f":"IF( 'RCC Data'!$C$26=\"\",\"\", 'RCC Data'!$C$26)","v":"RCC Combined Aggregate Gradation for "},{"$f":"IF('RCC Data'!$E$27=\"\",\"\",'RCC Data'!$E$27)","v":"Percent Passing by Weight"},{"$f":"IF('RCC Data'!$G$28=\"\",\"\",'RCC Data'!$G$28)","v":"Maximum\nSpec Limit"},{"$f":"IF('RCC Data'!$C$27=\"\",\"\",'RCC Data'!$C$27)","v":"Sieve Size"},{"$f":"IF('RCC Data'!$C$31=\"\",\"\",'RCC Data'!$C$31)","v":"1/2 in"}]
{"$rows_left_out":369}
{"sheet":"Reference","index":5,"n_rows":180,"n_cols":40,"rows_kept":180,"cut":false,"hidden":true,"merged":[[1,33,1,36],[3,38,3,39],[13,2,13,3],[12,2,12,3],[11,2,11,3],[10,2,10,3],[6,17,6,18],[13,6,13,7],[12,6,12,7],[11,6,11,7],[4,2,4,3],[9,1,9,7],[7,2,7,3],[6,2,6,3],[7,6,7,7],[6,6,6,7],[14,9,14,10],[27,4,27,5],[26,4,26,5],[28,2,28,3],[28,6,28,7],[28,4,28,5],[27,2,27,3],[26,2,26,3],[27,6,27,7],[26,6,26,7],[25,2,25,3],[25,4,25,5],[25,6,25,7],[5,2,5,3],[10,4,10,5],[14,4,14,5],[14,6,14,7],[10,6,10,7],[13,4,13,5],[12,4,12,5],[11,4,11,5],[7,4,7,5],[6,4,6,5],[5,4,5,5],[24,12,24,13],[24,14,24,15],[17,6,17,7],[16,1,16,7],[17,4,17,5],[17,2,17,3],[11,34,11,36],[9,34,9,36],[10,34,10,36],[24,1,24,7],[1,20,1,26],[2,20,2,22],[2,23,2,24],[2,25,2,26],[4,4,4,5],[3,12,3,15],[1,17,1,18],[3,1,3,7],[1,1,1,15],[4,6,4,7],[5,6,5,7],[14,2,14,3],[3,9,3,10],[4,34,4,36],[6,34,6,36],[5,34,5,36],[8,33,8,36],[3,33,3,36]]}
[]
[null,"M-D Graph Reference Data and Calculations",null,null,null,null,null,null,null,null,null,null,null,null,null,null,null,"Optimum Cement Content",null,null,"Gradation Limits & Sieve Sizes",null,null,null,null,null,null,null,null,null,null,null,null,"Optimum Cement Content Plot"]
[null,null,null,null,null,null,null,null,null,null,null,null,null,null,null,null,null,{"$f":"'Optimum Cement Content Graph'!$B$32","v":"Slope, m ="},{"$f":"SLOPE('RCC Data'!$L$71:$L$79,'RCC Data'!$H$71:$H$79)","v":{"$error":"#DIV/0!"}},null,"Sieve Sizes",null,null,"Surface",null,"Base/Subbase"]
[null,"Test Results",null,null,null,null,null,null,null,"M-D Curve Graph Limits",null,null,"Best-Fit Line Coefficient Reference Data",null,null,null,null,{"$f":"'Optimum Cement Content Graph'!$B$33","v":"Intercept, b ="},{"$f":"INTERCEPT('RCC Data'!$L$71:$L$79,'RCC Data'!$H$71:$H$79)","v":{"$error":"#DIV/0!"}},null,"Standard","Metric","Graph","Min","Max","Min","Max",null,null,null,null,null,null,"Best Fit Line Coefficients",null,null,null,null,"M-D Curve Graph Limits"]
[null,"Cement Content",{"$f":"ROUND('ASTM 1557'!D31,1)","v":{"$error":"#VALUE!"}},null,{"$f":"ROUND('ASTM 1557'!I31,1)","v":{"$error":"#VALUE!"}},null,{"$f":"ROUND('ASTM 1557'!N31,1)","v":{"$error":"#VALUE!"}},null,null,"Min Moisture",{"$f":"MIN('ASTM 1557'!$D$54:$Q$54)","v":0},null,"N","Y","X","X^2",null,"Y-Target = ",4400,null,"1\"",{"$f":"VLOOKUP(U5,$U$15:$V$43,2,FALSE)","v":"25 mm"},{"$f":"VLOOKUP(U5,$U$15:$W$43,3,FALSE)","v":25},100,100,100,100,null,{"$f":"W5","v":25},{"$f":"AC5","v":25},0,100,null,"Slope, m",{"$f":"IF(ISERROR(ROUND(SLOPE('RCC Data'!$L$71:$L$79,'RCC Data'!$H$71:$H$79),1)),\"\",SLOPE('RCC Data'!$L$71:$L$79,'RCC Data'!$H$71:$H$79))","v":""},null,null,null,"Min Cement",5]
[null,"Max Dry Density",{"$f":"C14*C7^2+C13*C7+C12","v":{"$error":"#DIV/0!"}},null,{"$f":"E14*E7^2+E13*E7+E12","v":{"$error":"#DIV/0!"}},null,{"$f":"G14*G7^2+G13*G7+G12","v":{"$error":"#DIV/0!"}},null,null,"Max Moisture",{"$f":"MAX('ASTM 1557'!$D$54:$Q$54)","v":0},null,1,{"$f":"N('ASTM 1557'!D55)","v":0},{"$f":"N('ASTM 1557'!D54)","v":0},{"$f":"O6^2","v":0},null,"x = ",{"$f":"ROUND((S5-S4)/S3,1)","v":{"$error":"#DIV/0!"}},null,"3/4\"","19 mm",{"$f":"VLOOKUP(U6,$U$15:$W$43,3,FALSE)","v":19},100,100,90,100,null,{"$f":"W6","v":19},{"$f":"AC6","v":19},0,100,null,"Intercept, b",{"$f":"IF(ISERROR(ROUND(INTERCEPT('RCC Data'!$L$71:$L$79,'RCC Data'!$H$71:$H$79),1)),\"\",INTERCEPT('RCC Data'!$L$71:$L$79,'RCC Data'!$H$71:$H$79))","v":""},null,null,null,"Max Cement",{"$f":"MAX('ASTM 1557'!$D$31:$Q$31)","v":0}]
[null,"Opt Moist Content",{"$f":"-C13/(2*C14)","v":{"$error":"#DIV/0!"}},null,{"$f":"-E13/(2*E14)","v":{"$error":"#DIV/0!"}},null,{"$f":"-G13/(2*G14)","v":{"$error":"#DIV/0!"}},null,null,"Min Density",{"$f":"MIN('ASTM 1557'!D55:Q55)","v":0},null,2,{"$f":"N('ASTM 1557'!E55)","v":0},{"$f":"N('ASTM 1557'!E54)","v":0},{"$f":"O7^2","v":0},null,"Optimum Cement Content Plot",null,null,"1/2\"","12.5 mm",12.5,70,90,70,90,null,12.5,12.5,0,100,null,"Equation",{"$f":"\"y = \"&ROUND(AI5,2)&\"x + \" &ROUND(AI6,2)","v":{"$error":"#VALUE!"}},null,null,null,"Min Strength",3000]
[null,"R^2",{"$f":"ROUND(RSQ(C20:C23,D20:D23),4)","v":{"$error":"#DIV/0!"}},null,{"$f":"ROUND(RSQ(E20:E23,F20:F23),4)","v":{"$error":"#DIV/0!"}},null,{"$f":"ROUND(RSQ(G20:G23,H20:H23),4)","v":{"$error":"#DIV/0!"}},null,null,"Max Density",{"$f":"MAX('ASTM 1557'!D55:Q55)","v":0},null,3,{"$f":"N('ASTM 1557'!F55)","v":0},{"$f":"N('ASTM 1557'!F54)","v":0},{"$f":"O8^2","v":0},null,{"$f":"AN5","v":5},{"$f":"S5","v":4400},null,"3/8\"","9.5 mm",9.5,60,85,60,85,null,9.5,9.5,0,100,null,null,null,null,null,null,"Max Strength",{"$f":"MAX('RCC Data'!N71:O79)","v":0}]
[null,null,null,null,null,null,null,null,null,"Maximum Value, x-axis",{"$f":"MROUND(K6+1,1)","v":1},null,4,{"$f":"IF(AND(N8>0,N('ASTM 1557'!G53)=0),#REF!,N('ASTM 1557'!G55))","v":0},{"$f":"IF(AND(O8>0,N('ASTM 1557'!G53)=0),#REF!+2,N('ASTM 1557'!G54))","v":0},{"$f":"O9^2","v":0},null,{"$f":"IF(OR(ISERROR(S6),S6=\"\"),\"\",S6)","v":{"$error":"#DIV/0!"}},{"$f":"S8","v":4400},null,"No. 4","4.75 mm",4.75,40,60,40,60,null,4.75,4.75,0,100,null,"M-D Curve Begin & End Points",null,null,null,null,"Maximum Value, x-axis",{"$f":"MROUND(AN6+2,5)","v":0}]
[null,"Best Fit Line Coefficients",null,null,null,null,null,null,null,"Minimum Value, x-axis",{"$f":"IF(ISERROR(MROUND(K5-1,1)),0,MROUND(K5-1,1))","v":0},null,5,{"$f":"#REF!","v":{"$error":"#REF!"}},{"$f":"#REF!","v":{"$error":"#REF!"}},{"$f":"O10^2","v":{"$error":"#REF!"}},null,{"$f":"IF(OR(ISERROR(S6),S6=\"\"),\"\",S6)","v":{"$error":"#DIV/0!"}},3000,null,"No. 16","1.18 mm",1.18,20,40,20,40,null,1.18,1.18,0,100,null,"Minimum Strength",{"$f":"IF(ISERROR((AN13-AI6)/AI5),0,(AN13-AI6)/AI5)","v":0},null,null,null,"Minimum Value, x-axis",{"$f":"AN5","v":5}]
[null,"Cement Content",{"$f":"C5","v":{"$error":"#VALUE!"}},null,{"$f":"E5","v":{"$error":"#VALUE!"}},null,{"$f":"G5","v":{"$error":"#VALUE!"}},null,null,"Scale",{"$f":"(K9-K10)/150","v":6.6666666666670002E-3},null,"SUM",{"$f":"SUM(N8:N10)","v":{"$error":"#REF!"}},{"$f":"SUM(O8:O10)","v":{"$error":"#REF!"}},{"$f":"SUM(P6:P10)","v":{"$error":"#REF!"}},null,null,null,null,"No. 100",".15 µm",0.15,6,18,0,10,null,0.15,0.15,0,100,null,"Wet End Moisture",{"$f":"IF(ISERROR((AN12-AI6)/AI5),0,(AN12-AI6)/AI5)","v":0},null,null,null,"Scale",{"$f":"(AN9-AN10)/50","v":-0.1}]
[null,"A0",{"$f":"INDEX(LINEST($N$6:$N$9,$O$6:$P$9),3)","v":0},null,{"$f":"INDEX(LINEST($N$13:$N$16,$O$13:$P$16),3)","v":0},null,{"$f":"INDEX(LINEST($N$18:$N$21,$O$18:$P$21),3)","v":0},null,null,"Maximum Value, y-axis",{"$f":"ROUND(K8,0)+2","v":2},null,"N","Y","X","X^2",null,null,null,null,"No. 200",".075 µm",7.4999999999999997E-2,2,8,"--","--",null,7.4999999999999997E-2,7.4999999999999997E-2,0,100,null,null,"Best-fit Plot",null,null,null,"Maximum Value, y-axis",{"$f":"MROUND(AN8+2000,1000)","v":2000}]
[null,"A1",{"$f":"INDEX(LINEST($N$6:$N$9,$O$6:$P$9),2)","v":0},null,{"$f":"INDEX(LINEST($N$13:$N$16,$O$13:$P$16),2)","v":0},null,{"$f":"INDEX(LINEST($N$18:$N$21,$O$18:$P$21),2)","v":0},null,null,"Minimum Value, y-axis",{"$f":"IF(ROUND(K7,0)-2<0,0,ROUND(K7,0)-2)","v":0},null,1,{"$f":"N('ASTM 1557'!I55)","v":0},{"$f":"N('ASTM 1557'!I54)","v":0},{"$f":"O13^2","v":0},null,null,null,null,null,null,null,null,null,null,null,null,null,null,null,null,null,null,{"$f":"IF(AI10<AN10,AY,AN10)","v":{"$error":"#NAME?"}},{"$f":"(AI13-$AI$6)/$AI$5","v":{"$error":"#NAME?"}},{"$f":"(AI13*AI$5)+AI$6","v":{"$error":"#NAME?"}},null,"Minimum Value, y-axis",{"$f":"IF(ROUND(AN7,0)-2<0,0,ROUND(AN7,0))","v":3000}]
[null,"A2",{"$f":"INDEX(LINEST($N$6:$N$9,$O$6:$P$9),1)","v":0},null,{"$f":"INDEX(LINEST($N$13:$N$16,$O$13:$P$16),1)","v":0},null,{"$f":"INDEX(LINEST($N$18:$N$21,$O$18:$P$21),1)","v":0},null,null,null,null,null,2,{"$f":"N('ASTM 1557'!J55)","v":0},{"$f":"N('ASTM 1557'!J54)","v":0},{"$f":"O14^2","v":0},null,null,null,null,"English","Metric","Size",null,null,null,null,null,null,null,null,null,null,null,{"$f":"IF(AI13+$AN$11<=MIN($AN$9,$AI$11),AI13+$AN$11,AI13)","v":{"$error":"#NAME?"}},{"$f":"(AI14-$AI$6)/$AI$5","v":{"$error":"#NAME?"}},{"$error":"#NAME?"}]
[null,"Equation",{"$f":"\"y = \"&ROUND(C14,3)&\"x^2 + \"&ROUND(C13,3)&\"x + \" &ROUND(C12,3)","v":"y = 0x^2 + 0x + 0"},null,{"$f":"\"y = \"&ROUND(E14,3)&\"x^2 + \"&ROUND(E13,3)&\"x + \" &ROUND(E12,3)","v":"y = 0x^2 + 0x + 0"},null,{"$f":"\"y = \"&ROUND(G14,3)&\"x^2 + \"&ROUND(G13,3)&\"x + \" &ROUND(G12,3)","v":"y = 0x^2 + 0x + 0"},null,null,"M-D Graph Limit boundaries",null,null,3,{"$f":"N('ASTM 1557'!K55)","v":0},{"$f":"N('ASTM 1557'!K54)","v":0},{"$f":"O15^2","v":0},null,null,null,null,"6\"","152 mm",152,null,null,null,null,null,null,null,null,null,null,null,{"$f":"IF(AI14+$AN$11<=$AN$9,AI14+$AN$11,AI14)","v":{"$error":"#NAME?"}},{"$error":"#NAME?"},{"$error":"#NAME?"},null,"Label X",10.1]
[null,null,null,null,null,null,null,null,null,"X","Y",null,4,{"$f":"IF(AND(N15>0,N('ASTM 1557'!L55)=0),#REF!,N('ASTM 1557'!L55))","v":0},{"$f":"IF(AND(O15>0,N('ASTM 1557'!L54)=0),#REF!+2,N('ASTM 1557'!L54))","v":0},{"$f":"O16^2","v":0},null,null,null,null,"3\"","76 mm",76,null,null,null,null,null,null,null,null,null,null,null,{"$error":"#NAME?"},{"$error":"#NAME?"},{"$error":"#NAME?"},null,"Label Y",{"$f":"((AI5*AN15)+AI6)+1000","v":{"$error":"#VALUE!"}}]
[null,"R^2 Calculations",null,null,null,null,null,null,null,{"$f":"K10","v":0},{"$f":"MROUND(K13,5)","v":0},null,"N","Y","X","X^2",null,null,null,null,"2-1/2\"","63 mm",63,null,null,null,null,null,null,null,null,null,null,null,{"$error":"#NAME?"},{"$error":"#NAME?"},{"$error":"#NAME?"}]
[null,"Cement Content",{"$f":"C11","v":{"$error":"#VALUE!"}},null,{"$f":"E11","v":{"$error":"#VALUE!"}},null,{"$f":"G11","v":{"$error":"#VALUE!"}},null,null,{"$f":"K10","v":0},{"$f":"MROUND(K12,5)","v":0},null,1,{"$f":"N('ASTM 1557'!N55)","v":0},{"$f":"N('ASTM 1557'!N54)","v":0},{"$f":"O18^2","v":0},null,null,null,null,"2\"","50 mm",50,null,null,null,null,null,null,null,null,null,null,null,{"$error":"#NAME?"},{"$error":"#NAME?"},{"$error":"#NAME?"}]
[null,null,"Y-Known","Y-Calculated","Y-Known","Y-Calculated","Y-Known","Y-Calculated",null,{"$f":"K10","v":0},{"$f":"K18","v":0},null,2,{"$f":"N('ASTM 1557'!O55)","v":0},{"$f":"N('ASTM 1557'!O54)","v":0},{"$f":"O19^2","v":0},null,null,null,null,"1-3/4\"","45 mm",45,null,null,null,null,null,null,null,null,null,null,null,{"$error":"#NAME?"},{"$error":"#NAME?"},{"$error":"#NAME?"}]
[null,"X-1",{"$f":"N6","v":0},{"$f":"($C$14*(VLOOKUP(C20,$N$6:$O$9,2,FALSE))^2)+($C$13*(VLOOKUP(C20,$N$6:$O$9,2,FALSE)))+$C$12","v":0},{"$f":"N13","v":0},{"$f":"($E$14*(VLOOKUP(E20,$N$13:$O$16,2,FALSE))^2)+($E$13*(VLOOKUP(E20,$N$13:$O$16,2,FALSE)))+$E$12","v":0},{"$f":"N18","v":0},{"$f":"($G$14*(VLOOKUP(G20,$N$18:$O$21,2,FALSE))^2)+($G$13*(VLOOKUP(G20,$N$18:$O$21,2,FALSE)))+$G$12","v":0},null,{"$f":"K9","v":1},{"$f":"K19","v":0},null,3,{"$f":"N('ASTM 1557'!P55)","v":0},{"$f":"N('ASTM 1557'!P54)","v":0},{"$f":"O20^2","v":0},null,null,null,null,"1-1/2\"","37.5 mm",37.5,null,null,null,null,null,null,null,null,null,null,null,{"$error":"#NAME?"},{"$error":"#NAME?"},{"$error":"#NAME?"}]
{"$rows_left_out":160}