{"text_format":"1","workbook":"xlsx","n_sheets":4,"sheets":["Tex-743-I","Bar Size","Specs.","RX"],"not_rendered":{"charts":0,"images":1,"macros":1,"external_links":0,"defined_names":106,"comments":1,"pivot_tables":0},"unopened":[],"bounds":{"document_bytes":16777216,"sheet_cells":100000,"rows_first":2000,"rows_last":500,"rows_between":2000,"halvings":0,"cell_chars":16384,"cell_head_chars":4096},"cells_cut":0,"cells_raw":0,"read":"whole","date_system":"1900"}

{"sheet":"Tex-743-I","index":0,"n_rows":55,"n_cols":12,"rows_kept":55,"cut":false,"hidden":false,"merged":[[24,1,24,3],[25,1,25,3],[20,1,20,3],[21,1,21,3],[22,1,22,3],[23,1,23,3],[49,1,49,2],[53,1,53,2],[47,1,47,9],[27,8,30,8],[46,1,46,9],[48,3,48,5],[27,9,30,9],[51,1,51,4],[27,2,30,2],[40,3,40,5],[41,3,41,5],[27,1,30,1],[20,5,20,6],[22,4,22,8],[24,4,24,5],[7,8,7,9],[10,8,10,9],[7,4,7,5],[8,4,8,5],[8,8,8,9],[10,4,10,5],[9,8,9,9],[9,4,9,5],[14,4,14,9],[16,8,16,9],[0,0,0,1],[55,1,55,4],[51,7,51,9],[44,1,45,9],[49,3,49,5],[12,8,12,9],[11,4,11,5],[12,4,12,5],[11,8,11,9],[13,8,13,9],[21,4,21,5],[25,4,25,6],[13,4,13,5],[15,4,15,9],[16,4,16,5],[23,7,23,8],[27,10,30,10],[27,3,30,3],[27,4,30,4],[27,5,30,5],[27,6,30,6],[27,7,30,7]]}
["TxDOT Manuals >",null,null,null,"Tex-743-I"]
[null,"TEXAS DEPARTMENT OF TRANSPORTATION",null,null,null,null,null,null,null,null,null,59]
[null,null,null,null,null,null,null,null,null,null,null,1]
[null,null,null,null,null,null,null,null,null,null,null,"Tx743.xlsm::42072.435891"]
[null,"TESTING MECHANICAL COUPLERS FOR SLIP, FATIGUE AND TENSILE STRENGTH"]
[null,"Tex-743-I:DMS-4510"]
[null,null,null,null,null,null,null,null,null,{"$f":"\"File Version: \" & TEXT(MID(sn,SEARCH(\"::\",sn,1)+2,20),\"mm/dd/yy hh:mm:ss\")","v":"File Version: 03/09/15 10:27:41"}]
[null,null,null,"SAMPLE ID:",null,null,null,"SAMPLED DATE:"]
[null,null,null,"TEST NUMBER:",null,null,null,"LETTING DATE:"]
[null,null,null,"SAMPLE STATUS:",null,null,null,"CONTROLLING CSJ:"]
[null,null,null,"COUNTY:",null,null,null,"SPEC YEAR:"]
[null,null,null,"SAMPLED BY:",null,null,null,"SPEC ITEM:"]
[null,null,null,"SAMPLE LOCATION:",null,null,null,"SPECIAL PROVISION:"]
[null,null,null,"MATERIAL CODE:",null,null,null,"GRADE:"]
[null,null,null,"MATERIAL NAME:"]
[null,null,null,"PRODUCER:"]
[null,null,null,"AREA ENGINEER:",null,null,null,"PROJECT MANAGER:"]
[]
[null,null,null,"COURSE\\LIFT:",null,"STATION:",null,null,"DIST. FROM CL:"]
[]
[null,"Lot Size :",null,null,null,"Quantity to be Tested :"]
[null,"Samples were received in :"]
[null,"Samples are die stamped with :"]
[null,"Bar Size :",null,null,null,null,"Bar Grade :"]
[null,"Mechanical Coupler Type :"]
[null,"Sample Type :"]
[]
[null,"Sample","Sample Number",{"$f":"\"Nominal Diameter \"& IF(SpecYear=\"\",\"\",IF(SpecYear=\"1993\",\"(inches)\",IF(SpecYear>=\"2004\",\"(inches)\",\"(mm)\")))","v":"Nominal Diameter "},{"$f":"\"Nominal Area \"&IF(SpecYear=\"\",\"\",IF(SpecYear=\"1995\",\"(sq. mm)\",\"(sq. inches)\"))","v":"Nominal Area "},{"$f":"\"Ultimate Load \"& IF(SpecYear=\"\",\"\",IF(SpecYear=\"1995\",\"(Newtons)\",\"(Lbs.)\"))","v":"Ultimate Load "},{"$f":"\"Ultimate Strength \"& IF(SpecYear=\"\",\"\",IF(SpecYear=\"1995\",\"(MPa)\",\"(psi)\"))","v":"Ultimate Strength "},"Percent of Nominal Yield, (%)","Fatigue Loaded","Fracture Location",{"$f":"\"Slip \" & IF(SpecYear=\"\",\"\",IF(SpecYear=\"1995\",\"(mm)\",\"(inches)\"))","v":"Slip "}]
[]
[]
[]
[null,1,null,{"$f":"IF(C32=\"\",\"\",IF(SpecYear=\"1995\",VLOOKUP($E$24,Specs.!$A$26:$C$36,2,FALSE),VLOOKUP($E$24,Specs.!$A$8:$C$18,2,FALSE)))","v":""},{"$f":"IF(C32=\"\",\"\",IF(SpecYear=\"1995\",VLOOKUP($E$24,Specs.!$A$26:$C$36,3,FALSE),VLOOKUP($E$24,Specs.!$A$8:$C$18,3,FALSE)))","v":""},null,{"$f":"IF(ISERROR(F32/E32),\"\",(F32/E32))","v":""},{"$f":"IF(ISERROR((G32/BarGrade*1000)*100),\"\",((G32/(BarGrade*1000))*100))","v":""}]
[null,2,null,{"$f":"IF(C33=\"\",\"\",IF(SpecYear=\"1995\",VLOOKUP($E$24,Specs.!$A$26:$C$36,2,FALSE),VLOOKUP($E$24,Specs.!$A$8:$C$18,2,FALSE)))","v":""},{"$f":"IF(C33=\"\",\"\",IF(SpecYear=\"1995\",VLOOKUP($E$24,Specs.!$A$26:$C$36,3,FALSE),VLOOKUP($E$24,Specs.!$A$8:$C$18,3,FALSE)))","v":""},null,{"$f":"IF(ISERROR(F33/E33),\"\",(F33/E33))","v":""},""]
[null,3,null,{"$f":"IF(C34=\"\",\"\",IF(SpecYear=\"1995\",VLOOKUP($E$24,Specs.!$A$26:$C$36,2,FALSE),VLOOKUP($E$24,Specs.!$A$8:$C$18,2,FALSE)))","v":""},{"$f":"IF(C34=\"\",\"\",IF(SpecYear=\"1995\",VLOOKUP($E$24,Specs.!$A$26:$C$36,3,FALSE),VLOOKUP($E$24,Specs.!$A$8:$C$18,3,FALSE)))","v":""},null,"",""]
[null,4,null,{"$f":"IF(C35=\"\",\"\",IF(SpecYear=\"1995\",VLOOKUP($E$24,Specs.!$A$26:$C$36,2,FALSE),VLOOKUP($E$24,Specs.!$A$8:$C$18,2,FALSE)))","v":""},{"$f":"IF(C35=\"\",\"\",IF(SpecYear=\"1995\",VLOOKUP($E$24,Specs.!$A$26:$C$36,3,FALSE),VLOOKUP($E$24,Specs.!$A$8:$C$18,3,FALSE)))","v":""},null,"",""]
[null,5,null,{"$f":"IF(C36=\"\",\"\",IF(SpecYear=\"1995\",VLOOKUP($E$24,Specs.!$A$26:$C$36,2,FALSE),VLOOKUP($E$24,Specs.!$A$8:$C$18,2,FALSE)))","v":""},{"$f":"IF(C36=\"\",\"\",IF(SpecYear=\"1995\",VLOOKUP($E$24,Specs.!$A$26:$C$36,3,FALSE),VLOOKUP($E$24,Specs.!$A$8:$C$18,3,FALSE)))","v":""},null,"",""]
[null,6,null,{"$f":"IF(C37=\"\",\"\",IF(SpecYear=\"1995\",VLOOKUP($E$24,Specs.!$A$26:$C$36,2,FALSE),VLOOKUP($E$24,Specs.!$A$8:$C$18,2,FALSE)))","v":""},{"$f":"IF(C37=\"\",\"\",IF(SpecYear=\"1995\",VLOOKUP($E$24,Specs.!$A$26:$C$36,3,FALSE),VLOOKUP($E$24,Specs.!$A$8:$C$18,3,FALSE)))","v":""},null,"",""]
[null,7,null,{"$f":"IF(C38=\"\",\"\",IF(SpecYear=\"1995\",VLOOKUP($E$24,Specs.!$A$26:$C$36,2,FALSE),VLOOKUP($E$24,Specs.!$A$8:$C$18,2,FALSE)))","v":""},{"$f":"IF(C38=\"\",\"\",IF(SpecYear=\"1995\",VLOOKUP($E$24,Specs.!$A$26:$C$36,3,FALSE),VLOOKUP($E$24,Specs.!$A$8:$C$18,3,FALSE)))","v":""},null,"",""]
[null,8,null,{"$f":"IF(C39=\"\",\"\",IF(SpecYear=\"1995\",VLOOKUP($E$24,Specs.!$A$26:$C$36,2,FALSE),VLOOKUP($E$24,Specs.!$A$8:$C$18,2,FALSE)))","v":""},{"$f":"IF(C39=\"\",\"\",IF(SpecYear=\"1995\",VLOOKUP($E$24,Specs.!$A$26:$C$36,3,FALSE),VLOOKUP($E$24,Specs.!$A$8:$C$18,3,FALSE)))","v":""},null,"",""]
[]
[null,null,null,"Were samples taken to breaking point?"]
[null,null,null,"Did samples meet specifications?"]
[]
[null,"Remarks:",null,{"$f":"NOW()","v":"2015-06-23T14:57:40.730"}]
[]
[]
[]
[]
[null,"Test Method:",null,"Tested By:",null,null,"Tested Date:"]
[null,"TX743"]
[null,"Test Stamp Code:",null,null,null,"Omit Test:","Completed Date:","Reviewed By:"]
[]
[null,"Locked By:",null,"TxDOT:","District:","Area:"]
[]
[null,"Authorized By:",null,null,null,"Authorized Date:"]

{"sheet":"Bar Size","index":1,"n_rows":12,"n_cols":2,"rows_kept":12,"cut":false,"hidden":true,"merged":[]}
["English","Metric"]
[3,10]
[4,13]
[5,16]
[6,19]
[7,22]
[8,25]
[9,29]
[10,32]
[11,36]
[14,43]
[18,57]

{"sheet":"Specs.","index":2,"n_rows":36,"n_cols":6,"rows_kept":36,"cut":false,"hidden":false,"merged":[]}
["Mechanical Couplers"]
[]
["English Specifications"]
["MINIMUM SPECIFICATIONS (Unless Otherwise Noted)"]
[]
["Bar Size","Nominal Diameter","Nominal Area","Ultimate Load","Ultimate Strength","Slippage"]
["(No.)","(in.)","(sq. in.)","(lbs.)","(psi)","(in.)"]
[3,0.375,0.11,8250,{"$f":"D8/C8","v":75000},0.01]
[4,0.50600000000000001,0.2,15000,75000,0.01]
[5,0.625,0.31,23250,75000,0.01]
[6,0.75,0.44,33000,75000,0.01]
[7,0.875,0.6,45000,75000,0.01]
[8,1,0.79,59250,75000,0.01]
[9,1.1279999999999999,1,75000,75000,0.01]
[10,1.27,1.27,95250,75000,0.01]
[11,1.41,1.56,117000,75000,0.01]
[14,1.6930000000000001,2.25,168750,75000,0.01]
[18,2.2570000000000001,4,300000,75000,0.01]
[]
[]
["Metric Specifications"]
["MINIMUM SPECIFICATIONS (Unless Otherwise Noted)"]
[]
["Bar Size","Nominal Diameter","Nominal Area","Ultimate Load","Ultimate Strength","Slippage"]
["(No.)","(mm)","(sq. mm)","(Newtons)","(Mpa)","(mm)"]
[10,9.5,71,{"$f":"E26*C26","v":36920},520,0.254]
[13,12.7,129,67080,520,0.254]
[16,15.9,199,103480,520,0.254]
[19,19.100000000000001,284,147680,520,0.254]
[22,22.2,387,201240,520,0.254]
[25,25.4,510,265200,520,0.254]
[29,28.7,645,335400,520,0.254]
[32,32.299999999999997,819,425880,520,0.254]
[36,35.799999999999997,1006,523120,520,0.254]
[43,43,1452,755040,520,0.254]
[57,57.3,2581,1342120,520,0.254]

{"sheet":"RX","index":3,"n_rows":88,"n_cols":9,"rows_kept":88,"cut":false,"hidden":true,"merged":[]}
[86]
["Fld_nbr","Value","Desc_1","Desc_2","Desc_3","Desc_4","Desc_5","Desc_6","Desc_7"]
[1,{"$f":"IF('Tex-743-I'!$B$45=\"\",\"\",'Tex-743-I'!$B$45)","v":""},{"$f":"'Tex-743-I'!$B$44","v":"Remarks:"}]
[2,{"$f":"IF('Tex-743-I'!$E$19=\"\",\"\",'Tex-743-I'!$E$19)","v":""},{"$f":"IF('Tex-743-I'!$D$19=\"\",\"\",'Tex-743-I'!$D$19)","v":"COURSE\\LIFT:"}]
[3,{"$f":"IF('Tex-743-I'!$D$50=\"\",\"\",'Tex-743-I'!$D$50)","v":""},"Tested By ",{"$f":"IF('Tex-743-I'!$B$50=\"\",\"\",'Tex-743-I'!$B$50)","v":"TX743"}]
[4,{"$f":"IF('Tex-743-I'!$G$50=\"\",\"\",'Tex-743-I'!$G$50)","v":""},"Tested Date ",{"$f":"IF('Tex-743-I'!$B$50=\"\",\"\",'Tex-743-I'!$B$50)","v":"TX743"}]
[5,{"$f":"IF('Tex-743-I'!$E$21=\"\",\"\",'Tex-743-I'!$E$21)","v":""},{"$f":"IF('Tex-743-I'!$B$6=\"\",\"\",'Tex-743-I'!$B$6)","v":"Tex-743-I:DMS-4510"},{"$f":"IF('Tex-743-I'!$B$21=\"\",\"\",'Tex-743-I'!$B$21)","v":"Lot Size :"}]
[6,{"$f":"IF('Tex-743-I'!$H$21=\"\",\"\",'Tex-743-I'!$H$21)","v":""},{"$f":"IF('Tex-743-I'!$B$6=\"\",\"\",'Tex-743-I'!$B$6)","v":"Tex-743-I:DMS-4510"},{"$f":"IF('Tex-743-I'!$F$21=\"\",\"\",'Tex-743-I'!$F$21)","v":"Quantity to be Tested :"}]
[7,{"$f":"IF('Tex-743-I'!$E$22=\"\",\"\",'Tex-743-I'!$E$22)","v":""},{"$f":"IF('Tex-743-I'!$B$6=\"\",\"\",'Tex-743-I'!$B$6)","v":"Tex-743-I:DMS-4510"},{"$f":"IF('Tex-743-I'!$B$22=\"\",\"\",'Tex-743-I'!$B$22)","v":"Samples were received in :"}]
[8,{"$f":"IF('Tex-743-I'!$E$23=\"\",\"\",'Tex-743-I'!$E$23)","v":""},{"$f":"IF('Tex-743-I'!$B$6=\"\",\"\",'Tex-743-I'!$B$6)","v":"Tex-743-I:DMS-4510"},{"$f":"IF('Tex-743-I'!$B$23=\"\",\"\",'Tex-743-I'!$B$23)","v":"Samples are die stamped with :"}]
[9,{"$f":"IF('Tex-743-I'!$E$24=\"\",\"\",'Tex-743-I'!$E$24)","v":""},{"$f":"IF('Tex-743-I'!$B$6=\"\",\"\",'Tex-743-I'!$B$6)","v":"Tex-743-I:DMS-4510"},{"$f":"IF('Tex-743-I'!$B$24=\"\",\"\",'Tex-743-I'!$B$24)","v":"Bar Size :"}]
[10,{"$f":"IF('Tex-743-I'!$H$24=\"\",\"\",'Tex-743-I'!$H$24)","v":""},{"$f":"IF('Tex-743-I'!$B$6=\"\",\"\",'Tex-743-I'!$B$6)","v":"Tex-743-I:DMS-4510"},{"$f":"IF('Tex-743-I'!$G$24=\"\",\"\",'Tex-743-I'!$G$24)","v":"Bar Grade :"}]
[11,{"$f":"IF('Tex-743-I'!$E$25=\"\",\"\",'Tex-743-I'!$E$25)","v":""},{"$f":"IF('Tex-743-I'!$B$6=\"\",\"\",'Tex-743-I'!$B$6)","v":"Tex-743-I:DMS-4510"},{"$f":"IF('Tex-743-I'!$B$25=\"\",\"\",'Tex-743-I'!$B$25)","v":"Mechanical Coupler Type :"}]
[12,{"$f":"IF('Tex-743-I'!$E$26=\"\",\"\",'Tex-743-I'!$E$26)","v":""},{"$f":"IF('Tex-743-I'!$B$6=\"\",\"\",'Tex-743-I'!$B$6)","v":"Tex-743-I:DMS-4510"},{"$f":"IF('Tex-743-I'!$B$26=\"\",\"\",'Tex-743-I'!$B$26)","v":"Sample Type :"}]
[13,{"$f":"IF('Tex-743-I'!$C$32=\"\",\"\",'Tex-743-I'!$C$32)","v":""},{"$f":"IF('Tex-743-I'!$B$6=\"\",\"\",'Tex-743-I'!$B$6)","v":"Tex-743-I:DMS-4510"},{"$f":"IF('Tex-743-I'!$B$28=\"\",\"\",'Tex-743-I'!$B$28)","v":"Sample"},{"$f":"IF('Tex-743-I'!$B$32=\"\",\"\",'Tex-743-I'!$B$32)","v":1},{"$f":"IF('Tex-743-I'!$C$28=\"\",\"\",'Tex-743-I'!$C$28)","v":"Sample Number"}]
[14,{"$f":"IF('Tex-743-I'!$D$32=\"\",\"\",'Tex-743-I'!$D$32)","v":""},{"$f":"IF('Tex-743-I'!$B$6=\"\",\"\",'Tex-743-I'!$B$6)","v":"Tex-743-I:DMS-4510"},{"$f":"IF('Tex-743-I'!$B$28=\"\",\"\",'Tex-743-I'!$B$28)","v":"Sample"},{"$f":"IF('Tex-743-I'!$B$32=\"\",\"\",'Tex-743-I'!$B$32)","v":1},{"$f":"IF('Tex-743-I'!$D$28=\"\",\"\",'Tex-743-I'!$D$28)","v":"Nominal Diameter "}]
[15,{"$f":"IF('Tex-743-I'!$E$32=\"\",\"\",'Tex-743-I'!$E$32)","v":""},{"$f":"IF('Tex-743-I'!$B$6=\"\",\"\",'Tex-743-I'!$B$6)","v":"Tex-743-I:DMS-4510"},{"$f":"IF('Tex-743-I'!$B$28=\"\",\"\",'Tex-743-I'!$B$28)","v":"Sample"},{"$f":"IF('Tex-743-I'!$B$32=\"\",\"\",'Tex-743-I'!$B$32)","v":1},{"$f":"IF('Tex-743-I'!$E$28=\"\",\"\",'Tex-743-I'!$E$28)","v":"Nominal Area "}]
[16,{"$f":"IF('Tex-743-I'!$F$32=\"\",\"\",'Tex-743-I'!$F$32)","v":""},{"$f":"IF('Tex-743-I'!$B$6=\"\",\"\",'Tex-743-I'!$B$6)","v":"Tex-743-I:DMS-4510"},{"$f":"IF('Tex-743-I'!$B$28=\"\",\"\",'Tex-743-I'!$B$28)","v":"Sample"},{"$f":"IF('Tex-743-I'!$B$32=\"\",\"\",'Tex-743-I'!$B$32)","v":1},{"$f":"IF('Tex-743-I'!$F$28=\"\",\"\",'Tex-743-I'!$F$28)","v":"Ultimate Load "}]
[17,{"$f":"IF('Tex-743-I'!$G$32=\"\",\"\",'Tex-743-I'!$G$32)","v":""},{"$f":"IF('Tex-743-I'!$B$6=\"\",\"\",'Tex-743-I'!$B$6)","v":"Tex-743-I:DMS-4510"},{"$f":"IF('Tex-743-I'!$B$28=\"\",\"\",'Tex-743-I'!$B$28)","v":"Sample"},{"$f":"IF('Tex-743-I'!$B$32=\"\",\"\",'Tex-743-I'!$B$32)","v":1},{"$f":"IF('Tex-743-I'!$G$28=\"\",\"\",'Tex-743-I'!$G$28)","v":"Ultimate Strength "}]
[18,{"$f":"IF('Tex-743-I'!$H$32=\"\",\"\",'Tex-743-I'!$H$32)","v":""},{"$f":"IF('Tex-743-I'!$B$6=\"\",\"\",'Tex-743-I'!$B$6)","v":"Tex-743-I:DMS-4510"},{"$f":"IF('Tex-743-I'!$B$28=\"\",\"\",'Tex-743-I'!$B$28)","v":"Sample"},{"$f":"IF('Tex-743-I'!$B$32=\"\",\"\",'Tex-743-I'!$B$32)","v":1},{"$f":"IF('Tex-743-I'!$H$28=\"\",\"\",'Tex-743-I'!$H$28)","v":"Percent of Nominal Yield, (%)"}]
[19,{"$f":"IF('Tex-743-I'!$I$32=\"\",\"\",'Tex-743-I'!$I$32)","v":""},{"$f":"IF('Tex-743-I'!$B$6=\"\",\"\",'Tex-743-I'!$B$6)","v":"Tex-743-I:DMS-4510"},{"$f":"IF('Tex-743-I'!$B$28=\"\",\"\",'Tex-743-I'!$B$28)","v":"Sample"},{"$f":"IF('Tex-743-I'!$B$32=\"\",\"\",'Tex-743-I'!$B$32)","v":1},{"$f":"IF('Tex-743-I'!$I$28=\"\",\"\",'Tex-743-I'!$I$28)","v":"Fatigue Loaded"}]
[20,{"$f":"IF('Tex-743-I'!$J$32=\"\",\"\",'Tex-743-I'!$J$32)","v":""},{"$f":"IF('Tex-743-I'!$B$6=\"\",\"\",'Tex-743-I'!$B$6)","v":"Tex-743-I:DMS-4510"},{"$f":"IF('Tex-743-I'!$B$28=\"\",\"\",'Tex-743-I'!$B$28)","v":"Sample"},{"$f":"IF('Tex-743-I'!$B$32=\"\",\"\",'Tex-743-I'!$B$32)","v":1},{"$f":"IF('Tex-743-I'!$J$28=\"\",\"\",'Tex-743-I'!$J$28)","v":"Fracture Location"}]
[21,{"$f":"IF('Tex-743-I'!$K$32=\"\",\"\",'Tex-743-I'!$K$32)","v":""},{"$f":"IF('Tex-743-I'!$B$6=\"\",\"\",'Tex-743-I'!$B$6)","v":"Tex-743-I:DMS-4510"},{"$f":"IF('Tex-743-I'!$B$28=\"\",\"\",'Tex-743-I'!$B$28)","v":"Sample"},{"$f":"IF('Tex-743-I'!$B$32=\"\",\"\",'Tex-743-I'!$B$32)","v":1},{"$f":"IF('Tex-743-I'!$K$28=\"\",\"\",'Tex-743-I'!$K$28)","v":"Slip "}]
[22,{"$f":"IF('Tex-743-I'!$C$33=\"\",\"\",'Tex-743-I'!$C$33)","v":""},{"$f":"IF('Tex-743-I'!$B$6=\"\",\"\",'Tex-743-I'!$B$6)","v":"Tex-743-I:DMS-4510"},{"$f":"IF('Tex-743-I'!$B$28=\"\",\"\",'Tex-743-I'!$B$28)","v":"Sample"},{"$f":"IF('Tex-743-I'!$B$33=\"\",\"\",'Tex-743-I'!$B$33)","v":2},{"$f":"IF('Tex-743-I'!$C$28=\"\",\"\",'Tex-743-I'!$C$28)","v":"Sample Number"}]
[23,{"$f":"IF('Tex-743-I'!$D$33=\"\",\"\",'Tex-743-I'!$D$33)","v":""},{"$f":"IF('Tex-743-I'!$B$6=\"\",\"\",'Tex-743-I'!$B$6)","v":"Tex-743-I:DMS-4510"},{"$f":"IF('Tex-743-I'!$B$28=\"\",\"\",'Tex-743-I'!$B$28)","v":"Sample"},{"$f":"IF('Tex-743-I'!$B$33=\"\",\"\",'Tex-743-I'!$B$33)","v":2},{"$f":"IF('Tex-743-I'!$D$28=\"\",\"\",'Tex-743-I'!$D$28)","v":"Nominal Diameter "}]
[24,{"$f":"IF('Tex-743-I'!$E$33=\"\",\"\",'Tex-743-I'!$E$33)","v":""},{"$f":"IF('Tex-743-I'!$B$6=\"\",\"\",'Tex-743-I'!$B$6)","v":"Tex-743-I:DMS-4510"},{"$f":"IF('Tex-743-I'!$B$28=\"\",\"\",'Tex-743-I'!$B$28)","v":"Sample"},{"$f":"IF('Tex-743-I'!$B$33=\"\",\"\",'Tex-743-I'!$B$33)","v":2},{"$f":"IF('Tex-743-I'!$E$28=\"\",\"\",'Tex-743-I'!$E$28)","v":"Nominal Area "}]
[25,{"$f":"IF('Tex-743-I'!$F$33=\"\",\"\",'Tex-743-I'!$F$33)","v":""},{"$f":"IF('Tex-743-I'!$B$6=\"\",\"\",'Tex-743-I'!$B$6)","v":"Tex-743-I:DMS-4510"},{"$f":"IF('Tex-743-I'!$B$28=\"\",\"\",'Tex-743-I'!$B$28)","v":"Sample"},{"$f":"IF('Tex-743-I'!$B$33=\"\",\"\",'Tex-743-I'!$B$33)","v":2},{"$f":"IF('Tex-743-I'!$F$28=\"\",\"\",'Tex-743-I'!$F$28)","v":"Ultimate Load "}]
[26,{"$f":"IF('Tex-743-I'!$G$33=\"\",\"\",'Tex-743-I'!$G$33)","v":""},{"$f":"IF('Tex-743-I'!$B$6=\"\",\"\",'Tex-743-I'!$B$6)","v":"Tex-743-I:DMS-4510"},{"$f":"IF('Tex-743-I'!$B$28=\"\",\"\",'Tex-743-I'!$B$28)","v":"Sample"},{"$f":"IF('Tex-743-I'!$B$33=\"\",\"\",'Tex-743-I'!$B$33)","v":2},{"$f":"IF('Tex-743-I'!$G$28=\"\",\"\",'Tex-743-I'!$G$28)","v":"Ultimate Strength "}]
[27,{"$f":"IF('Tex-743-I'!$H$33=\"\",\"\",'Tex-743-I'!$H$33)","v":""},{"$f":"IF('Tex-743-I'!$B$6=\"\",\"\",'Tex-743-I'!$B$6)","v":"Tex-743-I:DMS-4510"},{"$f":"IF('Tex-743-I'!$B$28=\"\",\"\",'Tex-743-I'!$B$28)","v":"Sample"},{"$f":"IF('Tex-743-I'!$B$33=\"\",\"\",'Tex-743-I'!$B$33)","v":2},{"$f":"IF('Tex-743-I'!$H$28=\"\",\"\",'Tex-743-I'!$H$28)","v":"Percent of Nominal Yield, (%)"}]
[28,{"$f":"IF('Tex-743-I'!$I$33=\"\",\"\",'Tex-743-I'!$I$33)","v":""},{"$f":"IF('Tex-743-I'!$B$6=\"\",\"\",'Tex-743-I'!$B$6)","v":"Tex-743-I:DMS-4510"},{"$f":"IF('Tex-743-I'!$B$28=\"\",\"\",'Tex-743-I'!$B$28)","v":"Sample"},{"$f":"IF('Tex-743-I'!$B$33=\"\",\"\",'Tex-743-I'!$B$33)","v":2},{"$f":"IF('Tex-743-I'!$I$28=\"\",\"\",'Tex-743-I'!$I$28)","v":"Fatigue Loaded"}]
[29,{"$f":"IF('Tex-743-I'!$J$33=\"\",\"\",'Tex-743-I'!$J$33)","v":""},{"$f":"IF('Tex-743-I'!$B$6=\"\",\"\",'Tex-743-I'!$B$6)","v":"Tex-743-I:DMS-4510"},{"$f":"IF('Tex-743-I'!$B$28=\"\",\"\",'Tex-743-I'!$B$28)","v":"Sample"},{"$f":"IF('Tex-743-I'!$B$33=\"\",\"\",'Tex-743-I'!$B$33)","v":2},{"$f":"IF('Tex-743-I'!$J$28=\"\",\"\",'Tex-743-I'!$J$28)","v":"Fracture Location"}]
[30,{"$f":"IF('Tex-743-I'!$K$33=\"\",\"\",'Tex-743-I'!$K$33)","v":""},{"$f":"IF('Tex-743-I'!$B$6=\"\",\"\",'Tex-743-I'!$B$6)","v":"Tex-743-I:DMS-4510"},{"$f":"IF('Tex-743-I'!$B$28=\"\",\"\",'Tex-743-I'!$B$28)","v":"Sample"},{"$f":"IF('Tex-743-I'!$B$33=\"\",\"\",'Tex-743-I'!$B$33)","v":2},{"$f":"IF('Tex-743-I'!$K$28=\"\",\"\",'Tex-743-I'!$K$28)","v":"Slip "}]
[31,{"$f":"IF('Tex-743-I'!$C$34=\"\",\"\",'Tex-743-I'!$C$34)","v":""},{"$f":"IF('Tex-743-I'!$B$6=\"\",\"\",'Tex-743-I'!$B$6)","v":"Tex-743-I:DMS-4510"},{"$f":"IF('Tex-743-I'!$B$28=\"\",\"\",'Tex-743-I'!$B$28)","v":"Sample"},{"$f":"IF('Tex-743-I'!$B$34=\"\",\"\",'Tex-743-I'!$B$34)","v":3},{"$f":"IF('Tex-743-I'!$C$28=\"\",\"\",'Tex-743-I'!$C$28)","v":"Sample Number"}]
[32,{"$f":"IF('Tex-743-I'!$D$34=\"\",\"\",'Tex-743-I'!$D$34)","v":""},{"$f":"IF('Tex-743-I'!$B$6=\"\",\"\",'Tex-743-I'!$B$6)","v":"Tex-743-I:DMS-4510"},{"$f":"IF('Tex-743-I'!$B$28=\"\",\"\",'Tex-743-I'!$B$28)","v":"Sample"},{"$f":"IF('Tex-743-I'!$B$34=\"\",\"\",'Tex-743-I'!$B$34)","v":3},{"$f":"IF('Tex-743-I'!$D$28=\"\",\"\",'Tex-743-I'!$D$28)","v":"Nominal Diameter "}]
[33,{"$f":"IF('Tex-743-I'!$E$34=\"\",\"\",'Tex-743-I'!$E$34)","v":""},{"$f":"IF('Tex-743-I'!$B$6=\"\",\"\",'Tex-743-I'!$B$6)","v":"Tex-743-I:DMS-4510"},{"$f":"IF('Tex-743-I'!$B$28=\"\",\"\",'Tex-743-I'!$B$28)","v":"Sample"},{"$f":"IF('Tex-743-I'!$B$34=\"\",\"\",'Tex-743-I'!$B$34)","v":3},{"$f":"IF('Tex-743-I'!$E$28=\"\",\"\",'Tex-743-I'!$E$28)","v":"Nominal Area "}]
[34,{"$f":"IF('Tex-743-I'!$F$34=\"\",\"\",'Tex-743-I'!$F$34)","v":""},{"$f":"IF('Tex-743-I'!$B$6=\"\",\"\",'Tex-743-I'!$B$6)","v":"Tex-743-I:DMS-4510"},{"$f":"IF('Tex-743-I'!$B$28=\"\",\"\",'Tex-743-I'!$B$28)","v":"Sample"},{"$f":"IF('Tex-743-I'!$B$34=\"\",\"\",'Tex-743-I'!$B$34)","v":3},{"$f":"IF('Tex-743-I'!$F$28=\"\",\"\",'Tex-743-I'!$F$28)","v":"Ultimate Load "}]
[35,{"$f":"IF('Tex-743-I'!$G$34=\"\",\"\",'Tex-743-I'!$G$34)","v":""},{"$f":"IF('Tex-743-I'!$B$6=\"\",\"\",'Tex-743-I'!$B$6)","v":"Tex-743-I:DMS-4510"},{"$f":"IF('Tex-743-I'!$B$28=\"\",\"\",'Tex-743-I'!$B$28)","v":"Sample"},{"$f":"IF('Tex-743-I'!$B$34=\"\",\"\",'Tex-743-I'!$B$34)","v":3},{"$f":"IF('Tex-743-I'!$G$28=\"\",\"\",'Tex-743-I'!$G$28)","v":"Ultimate Strength "}]
[36,{"$f":"IF('Tex-743-I'!$H$34=\"\",\"\",'Tex-743-I'!$H$34)","v":""},{"$f":"IF('Tex-743-I'!$B$6=\"\",\"\",'Tex-743-I'!$B$6)","v":"Tex-743-I:DMS-4510"},{"$f":"IF('Tex-743-I'!$B$28=\"\",\"\",'Tex-743-I'!$B$28)","v":"Sample"},{"$f":"IF('Tex-743-I'!$B$34=\"\",\"\",'Tex-743-I'!$B$34)","v":3},{"$f":"IF('Tex-743-I'!$H$28=\"\",\"\",'Tex-743-I'!$H$28)","v":"Percent of Nominal Yield, (%)"}]
[37,{"$f":"IF('Tex-743-I'!$I$34=\"\",\"\",'Tex-743-I'!$I$34)","v":""},{"$f":"IF('Tex-743-I'!$B$6=\"\",\"\",'Tex-743-I'!$B$6)","v":"Tex-743-I:DMS-4510"},{"$f":"IF('Tex-743-I'!$B$28=\"\",\"\",'Tex-743-I'!$B$28)","v":"Sample"},{"$f":"IF('Tex-743-I'!$B$34=\"\",\"\",'Tex-743-I'!$B$34)","v":3},{"$f":"IF('Tex-743-I'!$I$28=\"\",\"\",'Tex-743-I'!$I$28)","v":"Fatigue Loaded"}]
[38,{"$f":"IF('Tex-743-I'!$J$34=\"\",\"\",'Tex-743-I'!$J$34)","v":""},{"$f":"IF('Tex-743-I'!$B$6=\"\",\"\",'Tex-743-I'!$B$6)","v":"Tex-743-I:DMS-4510"},{"$f":"IF('Tex-743-I'!$B$28=\"\",\"\",'Tex-743-I'!$B$28)","v":"Sample"},{"$f":"IF('Tex-743-I'!$B$34=\"\",\"\",'Tex-743-I'!$B$34)","v":3},{"$f":"IF('Tex-743-I'!$J$28=\"\",\"\",'Tex-743-I'!$J$28)","v":"Fracture Location"}]
[39,{"$f":"IF('Tex-743-I'!$K$34=\"\",\"\",'Tex-743-I'!$K$34)","v":""},{"$f":"IF('Tex-743-I'!$B$6=\"\",\"\",'Tex-743-I'!$B$6)","v":"Tex-743-I:DMS-4510"},{"$f":"IF('Tex-743-I'!$B$28=\"\",\"\",'Tex-743-I'!$B$28)","v":"Sample"},{"$f":"IF('Tex-743-I'!$B$34=\"\",\"\",'Tex-743-I'!$B$34)","v":3},{"$f":"IF('Tex-743-I'!$K$28=\"\",\"\",'Tex-743-I'!$K$28)","v":"Slip "}]
[40,{"$f":"IF('Tex-743-I'!$C$35=\"\",\"\",'Tex-743-I'!$C$35)","v":""},{"$f":"IF('Tex-743-I'!$B$6=\"\",\"\",'Tex-743-I'!$B$6)","v":"Tex-743-I:DMS-4510"},{"$f":"IF('Tex-743-I'!$B$28=\"\",\"\",'Tex-743-I'!$B$28)","v":"Sample"},{"$f":"IF('Tex-743-I'!$B$35=\"\",\"\",'Tex-743-I'!$B$35)","v":4},{"$f":"IF('Tex-743-I'!$C$28=\"\",\"\",'Tex-743-I'!$C$28)","v":"Sample Number"}]
[41,{"$f":"IF('Tex-743-I'!$D$35=\"\",\"\",'Tex-743-I'!$D$35)","v":""},{"$f":"IF('Tex-743-I'!$B$6=\"\",\"\",'Tex-743-I'!$B$6)","v":"Tex-743-I:DMS-4510"},{"$f":"IF('Tex-743-I'!$B$28=\"\",\"\",'Tex-743-I'!$B$28)","v":"Sample"},{"$f":"IF('Tex-743-I'!$B$35=\"\",\"\",'Tex-743-I'!$B$35)","v":4},{"$f":"IF('Tex-743-I'!$D$28=\"\",\"\",'Tex-743-I'!$D$28)","v":"Nominal Diameter "}]
[42,{"$f":"IF('Tex-743-I'!$E$35=\"\",\"\",'Tex-743-I'!$E$35)","v":""},{"$f":"IF('Tex-743-I'!$B$6=\"\",\"\",'Tex-743-I'!$B$6)","v":"Tex-743-I:DMS-4510"},{"$f":"IF('Tex-743-I'!$B$28=\"\",\"\",'Tex-743-I'!$B$28)","v":"Sample"},{"$f":"IF('Tex-743-I'!$B$35=\"\",\"\",'Tex-743-I'!$B$35)","v":4},{"$f":"IF('Tex-743-I'!$E$28=\"\",\"\",'Tex-743-I'!$E$28)","v":"Nominal Area "}]
[43,{"$f":"IF('Tex-743-I'!$F$35=\"\",\"\",'Tex-743-I'!$F$35)","v":""},{"$f":"IF('Tex-743-I'!$B$6=\"\",\"\",'Tex-743-I'!$B$6)","v":"Tex-743-I:DMS-4510"},{"$f":"IF('Tex-743-I'!$B$28=\"\",\"\",'Tex-743-I'!$B$28)","v":"Sample"},{"$f":"IF('Tex-743-I'!$B$35=\"\",\"\",'Tex-743-I'!$B$35)","v":4},{"$f":"IF('Tex-743-I'!$F$28=\"\",\"\",'Tex-743-I'!$F$28)","v":"Ultimate Load "}]
[44,{"$f":"IF('Tex-743-I'!$G$35=\"\",\"\",'Tex-743-I'!$G$35)","v":""},{"$f":"IF('Tex-743-I'!$B$6=\"\",\"\",'Tex-743-I'!$B$6)","v":"Tex-743-I:DMS-4510"},{"$f":"IF('Tex-743-I'!$B$28=\"\",\"\",'Tex-743-I'!$B$28)","v":"Sample"},{"$f":"IF('Tex-743-I'!$B$35=\"\",\"\",'Tex-743-I'!$B$35)","v":4},{"$f":"IF('Tex-743-I'!$G$28=\"\",\"\",'Tex-743-I'!$G$28)","v":"Ultimate Strength "}]
[45,{"$f":"IF('Tex-743-I'!$H$35=\"\",\"\",'Tex-743-I'!$H$35)","v":""},{"$f":"IF('Tex-743-I'!$B$6=\"\",\"\",'Tex-743-I'!$B$6)","v":"Tex-743-I:DMS-4510"},{"$f":"IF('Tex-743-I'!$B$28=\"\",\"\",'Tex-743-I'!$B$28)","v":"Sample"},{"$f":"IF('Tex-743-I'!$B$35=\"\",\"\",'Tex-743-I'!$B$35)","v":4},{"$f":"IF('Tex-743-I'!$H$28=\"\",\"\",'Tex-743-I'!$H$28)","v":"Percent of Nominal Yield, (%)"}]
[46,{"$f":"IF('Tex-743-I'!$I$35=\"\",\"\",'Tex-743-I'!$I$35)","v":""},{"$f":"IF('Tex-743-I'!$B$6=\"\",\"\",'Tex-743-I'!$B$6)","v":"Tex-743-I:DMS-4510"},{"$f":"IF('Tex-743-I'!$B$28=\"\",\"\",'Tex-743-I'!$B$28)","v":"Sample"},{"$f":"IF('Tex-743-I'!$B$35=\"\",\"\",'Tex-743-I'!$B$35)","v":4},{"$f":"IF('Tex-743-I'!$I$28=\"\",\"\",'Tex-743-I'!$I$28)","v":"Fatigue Loaded"}]
[47,{"$f":"IF('Tex-743-I'!$J$35=\"\",\"\",'Tex-743-I'!$J$35)","v":""},{"$f":"IF('Tex-743-I'!$B$6=\"\",\"\",'Tex-743-I'!$B$6)","v":"Tex-743-I:DMS-4510"},{"$f":"IF('Tex-743-I'!$B$28=\"\",\"\",'Tex-743-I'!$B$28)","v":"Sample"},{"$f":"IF('Tex-743-I'!$B$35=\"\",\"\",'Tex-743-I'!$B$35)","v":4},{"$f":"IF('Tex-743-I'!$J$28=\"\",\"\",'Tex-743-I'!$J$28)","v":"Fracture Location"}]
[48,{"$f":"IF('Tex-743-I'!$K$35=\"\",\"\",'Tex-743-I'!$K$35)","v":""},{"$f":"IF('Tex-743-I'!$B$6=\"\",\"\",'Tex-743-I'!$B$6)","v":"Tex-743-I:DMS-4510"},{"$f":"IF('Tex-743-I'!$B$28=\"\",\"\",'Tex-743-I'!$B$28)","v":"Sample"},{"$f":"IF('Tex-743-I'!$B$35=\"\",\"\",'Tex-743-I'!$B$35)","v":4},{"$f":"IF('Tex-743-I'!$K$28=\"\",\"\",'Tex-743-I'!$K$28)","v":"Slip "}]
[49,{"$f":"IF('Tex-743-I'!$C$36=\"\",\"\",'Tex-743-I'!$C$36)","v":""},{"$f":"IF('Tex-743-I'!$B$6=\"\",\"\",'Tex-743-I'!$B$6)","v":"Tex-743-I:DMS-4510"},{"$f":"IF('Tex-743-I'!$B$28=\"\",\"\",'Tex-743-I'!$B$28)","v":"Sample"},{"$f":"IF('Tex-743-I'!$B$36=\"\",\"\",'Tex-743-I'!$B$36)","v":5},{"$f":"IF('Tex-743-I'!$C$28=\"\",\"\",'Tex-743-I'!$C$28)","v":"Sample Number"}]
[50,{"$f":"IF('Tex-743-I'!$D$36=\"\",\"\",'Tex-743-I'!$D$36)","v":""},{"$f":"IF('Tex-743-I'!$B$6=\"\",\"\",'Tex-743-I'!$B$6)","v":"Tex-743-I:DMS-4510"},{"$f":"IF('Tex-743-I'!$B$28=\"\",\"\",'Tex-743-I'!$B$28)","v":"Sample"},{"$f":"IF('Tex-743-I'!$B$36=\"\",\"\",'Tex-743-I'!$B$36)","v":5},{"$f":"IF('Tex-743-I'!$D$28=\"\",\"\",'Tex-743-I'!$D$28)","v":"Nominal Diameter "}]
[51,{"$f":"IF('Tex-743-I'!$E$36=\"\",\"\",'Tex-743-I'!$E$36)","v":""},{"$f":"IF('Tex-743-I'!$B$6=\"\",\"\",'Tex-743-I'!$B$6)","v":"Tex-743-I:DMS-4510"},{"$f":"IF('Tex-743-I'!$B$28=\"\",\"\",'Tex-743-I'!$B$28)","v":"Sample"},{"$f":"IF('Tex-743-I'!$B$36=\"\",\"\",'Tex-743-I'!$B$36)","v":5},{"$f":"IF('Tex-743-I'!$E$28=\"\",\"\",'Tex-743-I'!$E$28)","v":"Nominal Area "}]
[52,{"$f":"IF('Tex-743-I'!$F$36=\"\",\"\",'Tex-743-I'!$F$36)","v":""},{"$f":"IF('Tex-743-I'!$B$6=\"\",\"\",'Tex-743-I'!$B$6)","v":"Tex-743-I:DMS-4510"},{"$f":"IF('Tex-743-I'!$B$28=\"\",\"\",'Tex-743-I'!$B$28)","v":"Sample"},{"$f":"IF('Tex-743-I'!$B$36=\"\",\"\",'Tex-743-I'!$B$36)","v":5},{"$f":"IF('Tex-743-I'!$F$28=\"\",\"\",'Tex-743-I'!$F$28)","v":"Ultimate Load "}]
[53,{"$f":"IF('Tex-743-I'!$G$36=\"\",\"\",'Tex-743-I'!$G$36)","v":""},{"$f":"IF('Tex-743-I'!$B$6=\"\",\"\",'Tex-743-I'!$B$6)","v":"Tex-743-I:DMS-4510"},{"$f":"IF('Tex-743-I'!$B$28=\"\",\"\",'Tex-743-I'!$B$28)","v":"Sample"},{"$f":"IF('Tex-743-I'!$B$36=\"\",\"\",'Tex-743-I'!$B$36)","v":5},{"$f":"IF('Tex-743-I'!$G$28=\"\",\"\",'Tex-743-I'!$G$28)","v":"Ultimate Strength "}]
[54,{"$f":"IF('Tex-743-I'!$H$36=\"\",\"\",'Tex-743-I'!$H$36)","v":""},{"$f":"IF('Tex-743-I'!$B$6=\"\",\"\",'Tex-743-I'!$B$6)","v":"Tex-743-I:DMS-4510"},{"$f":"IF('Tex-743-I'!$B$28=\"\",\"\",'Tex-743-I'!$B$28)","v":"Sample"},{"$f":"IF('Tex-743-I'!$B$36=\"\",\"\",'Tex-743-I'!$B$36)","v":5},{"$f":"IF('Tex-743-I'!$H$28=\"\",\"\",'Tex-743-I'!$H$28)","v":"Percent of Nominal Yield, (%)"}]
[55,{"$f":"IF('Tex-743-I'!$I$36=\"\",\"\",'Tex-743-I'!$I$36)","v":""},{"$f":"IF('Tex-743-I'!$B$6=\"\",\"\",'Tex-743-I'!$B$6)","v":"Tex-743-I:DMS-4510"},{"$f":"IF('Tex-743-I'!$B$28=\"\",\"\",'Tex-743-I'!$B$28)","v":"Sample"},{"$f":"IF('Tex-743-I'!$B$36=\"\",\"\",'Tex-743-I'!$B$36)","v":5},{"$f":"IF('Tex-743-I'!$I$28=\"\",\"\",'Tex-743-I'!$I$28)","v":"Fatigue Loaded"}]
[56,{"$f":"IF('Tex-743-I'!$J$36=\"\",\"\",'Tex-743-I'!$J$36)","v":""},{"$f":"IF('Tex-743-I'!$B$6=\"\",\"\",'Tex-743-I'!$B$6)","v":"Tex-743-I:DMS-4510"},{"$f":"IF('Tex-743-I'!$B$28=\"\",\"\",'Tex-743-I'!$B$28)","v":"Sample"},{"$f":"IF('Tex-743-I'!$B$36=\"\",\"\",'Tex-743-I'!$B$36)","v":5},{"$f":"IF('Tex-743-I'!$J$28=\"\",\"\",'Tex-743-I'!$J$28)","v":"Fracture Location"}]
[57,{"$f":"IF('Tex-743-I'!$K$36=\"\",\"\",'Tex-743-I'!$K$36)","v":""},{"$f":"IF('Tex-743-I'!$B$6=\"\",\"\",'Tex-743-I'!$B$6)","v":"Tex-743-I:DMS-4510"},{"$f":"IF('Tex-743-I'!$B$28=\"\",\"\",'Tex-743-I'!$B$28)","v":"Sample"},{"$f":"IF('Tex-743-I'!$B$36=\"\",\"\",'Tex-743-I'!$B$36)","v":5},{"$f":"IF('Tex-743-I'!$K$28=\"\",\"\",'Tex-743-I'!$K$28)","v":"Slip "}]
[58,{"$f":"IF('Tex-743-I'!$C$37=\"\",\"\",'Tex-743-I'!$C$37)","v":""},{"$f":"IF('Tex-743-I'!$B$6=\"\",\"\",'Tex-743-I'!$B$6)","v":"Tex-743-I:DMS-4510"},{"$f":"IF('Tex-743-I'!$B$28=\"\",\"\",'Tex-743-I'!$B$28)","v":"Sample"},{"$f":"IF('Tex-743-I'!$B$37=\"\",\"\",'Tex-743-I'!$B$37)","v":6},{"$f":"IF('Tex-743-I'!$C$28=\"\",\"\",'Tex-743-I'!$C$28)","v":"Sample Number"}]
[59,{"$f":"IF('Tex-743-I'!$D$37=\"\",\"\",'Tex-743-I'!$D$37)","v":""},{"$f":"IF('Tex-743-I'!$B$6=\"\",\"\",'Tex-743-I'!$B$6)","v":"Tex-743-I:DMS-4510"},{"$f":"IF('Tex-743-I'!$B$28=\"\",\"\",'Tex-743-I'!$B$28)","v":"Sample"},{"$f":"IF('Tex-743-I'!$B$37=\"\",\"\",'Tex-743-I'!$B$37)","v":6},{"$f":"IF('Tex-743-I'!$D$28=\"\",\"\",'Tex-743-I'!$D$28)","v":"Nominal Diameter "}]
[60,{"$f":"IF('Tex-743-I'!$E$37=\"\",\"\",'Tex-743-I'!$E$37)","v":""},{"$f":"IF('Tex-743-I'!$B$6=\"\",\"\",'Tex-743-I'!$B$6)","v":"Tex-743-I:DMS-4510"},{"$f":"IF('Tex-743-I'!$B$28=\"\",\"\",'Tex-743-I'!$B$28)","v":"Sample"},{"$f":"IF('Tex-743-I'!$B$37=\"\",\"\",'Tex-743-I'!$B$37)","v":6},{"$f":"IF('Tex-743-I'!$E$28=\"\",\"\",'Tex-743-I'!$E$28)","v":"Nominal Area "}]
[61,{"$f":"IF('Tex-743-I'!$F$37=\"\",\"\",'Tex-743-I'!$F$37)","v":""},{"$f":"IF('Tex-743-I'!$B$6=\"\",\"\",'Tex-743-I'!$B$6)","v":"Tex-743-I:DMS-4510"},{"$f":"IF('Tex-743-I'!$B$28=\"\",\"\",'Tex-743-I'!$B$28)","v":"Sample"},{"$f":"IF('Tex-743-I'!$B$37=\"\",\"\",'Tex-743-I'!$B$37)","v":6},{"$f":"IF('Tex-743-I'!$F$28=\"\",\"\",'Tex-743-I'!$F$28)","v":"Ultimate Load "}]
[62,{"$f":"IF('Tex-743-I'!$G$37=\"\",\"\",'Tex-743-I'!$G$37)","v":""},{"$f":"IF('Tex-743-I'!$B$6=\"\",\"\",'Tex-743-I'!$B$6)","v":"Tex-743-I:DMS-4510"},{"$f":"IF('Tex-743-I'!$B$28=\"\",\"\",'Tex-743-I'!$B$28)","v":"Sample"},{"$f":"IF('Tex-743-I'!$B$37=\"\",\"\",'Tex-743-I'!$B$37)","v":6},{"$f":"IF('Tex-743-I'!$G$28=\"\",\"\",'Tex-743-I'!$G$28)","v":"Ultimate Strength "}]
[63,{"$f":"IF('Tex-743-I'!$H$37=\"\",\"\",'Tex-743-I'!$H$37)","v":""},{"$f":"IF('Tex-743-I'!$B$6=\"\",\"\",'Tex-743-I'!$B$6)","v":"Tex-743-I:DMS-4510"},{"$f":"IF('Tex-743-I'!$B$28=\"\",\"\",'Tex-743-I'!$B$28)","v":"Sample"},{"$f":"IF('Tex-743-I'!$B$37=\"\",\"\",'Tex-743-I'!$B$37)","v":6},{"$f":"IF('Tex-743-I'!$H$28=\"\",\"\",'Tex-743-I'!$H$28)","v":"Percent of Nominal Yield, (%)"}]
[64,{"$f":"IF('Tex-743-I'!$I$37=\"\",\"\",'Tex-743-I'!$I$37)","v":""},{"$f":"IF('Tex-743-I'!$B$6=\"\",\"\",'Tex-743-I'!$B$6)","v":"Tex-743-I:DMS-4510"},{"$f":"IF('Tex-743-I'!$B$28=\"\",\"\",'Tex-743-I'!$B$28)","v":"Sample"},{"$f":"IF('Tex-743-I'!$B$37=\"\",\"\",'Tex-743-I'!$B$37)","v":6},{"$f":"IF('Tex-743-I'!$I$28=\"\",\"\",'Tex-743-I'!$I$28)","v":"Fatigue Loaded"}]
[65,{"$f":"IF('Tex-743-I'!$J$37=\"\",\"\",'Tex-743-I'!$J$37)","v":""},{"$f":"IF('Tex-743-I'!$B$6=\"\",\"\",'Tex-743-I'!$B$6)","v":"Tex-743-I:DMS-4510"},{"$f":"IF('Tex-743-I'!$B$28=\"\",\"\",'Tex-743-I'!$B$28)","v":"Sample"},{"$f":"IF('Tex-743-I'!$B$37=\"\",\"\",'Tex-743-I'!$B$37)","v":6},{"$f":"IF('Tex-743-I'!$J$28=\"\",\"\",'Tex-743-I'!$J$28)","v":"Fracture Location"}]
[66,{"$f":"IF('Tex-743-I'!$K$37=\"\",\"\",'Tex-743-I'!$K$37)","v":""},{"$f":"IF('Tex-743-I'!$B$6=\"\",\"\",'Tex-743-I'!$B$6)","v":"Tex-743-I:DMS-4510"},{"$f":"IF('Tex-743-I'!$B$28=\"\",\"\",'Tex-743-I'!$B$28)","v":"Sample"},{"$f":"IF('Tex-743-I'!$B$37=\"\",\"\",'Tex-743-I'!$B$37)","v":6},{"$f":"IF('Tex-743-I'!$K$28=\"\",\"\",'Tex-743-I'!$K$28)","v":"Slip "}]
[67,{"$f":"IF('Tex-743-I'!$C$38=\"\",\"\",'Tex-743-I'!$C$38)","v":""},{"$f":"IF('Tex-743-I'!$B$6=\"\",\"\",'Tex-743-I'!$B$6)","v":"Tex-743-I:DMS-4510"},{"$f":"IF('Tex-743-I'!$B$28=\"\",\"\",'Tex-743-I'!$B$28)","v":"Sample"},{"$f":"IF('Tex-743-I'!$B$38=\"\",\"\",'Tex-743-I'!$B$38)","v":7},{"$f":"IF('Tex-743-I'!$C$28=\"\",\"\",'Tex-743-I'!$C$28)","v":"Sample Number"}]
[68,{"$f":"IF('Tex-743-I'!$D$38=\"\",\"\",'Tex-743-I'!$D$38)","v":""},{"$f":"IF('Tex-743-I'!$B$6=\"\",\"\",'Tex-743-I'!$B$6)","v":"Tex-743-I:DMS-4510"},{"$f":"IF('Tex-743-I'!$B$28=\"\",\"\",'Tex-743-I'!$B$28)","v":"Sample"},{"$f":"IF('Tex-743-I'!$B$38=\"\",\"\",'Tex-743-I'!$B$38)","v":7},{"$f":"IF('Tex-743-I'!$D$28=\"\",\"\",'Tex-743-I'!$D$28)","v":"Nominal Diameter "}]
[69,{"$f":"IF('Tex-743-I'!$E$38=\"\",\"\",'Tex-743-I'!$E$38)","v":""},{"$f":"IF('Tex-743-I'!$B$6=\"\",\"\",'Tex-743-I'!$B$6)","v":"Tex-743-I:DMS-4510"},{"$f":"IF('Tex-743-I'!$B$28=\"\",\"\",'Tex-743-I'!$B$28)","v":"Sample"},{"$f":"IF('Tex-743-I'!$B$38=\"\",\"\",'Tex-743-I'!$B$38)","v":7},{"$f":"IF('Tex-743-I'!$E$28=\"\",\"\",'Tex-743-I'!$E$28)","v":"Nominal Area "}]
[70,{"$f":"IF('Tex-743-I'!$F$38=\"\",\"\",'Tex-743-I'!$F$38)","v":""},{"$f":"IF('Tex-743-I'!$B$6=\"\",\"\",'Tex-743-I'!$B$6)","v":"Tex-743-I:DMS-4510"},{"$f":"IF('Tex-743-I'!$B$28=\"\",\"\",'Tex-743-I'!$B$28)","v":"Sample"},{"$f":"IF('Tex-743-I'!$B$38=\"\",\"\",'Tex-743-I'!$B$38)","v":7},{"$f":"IF('Tex-743-I'!$F$28=\"\",\"\",'Tex-743-I'!$F$28)","v":"Ultimate Load "}]
[71,{"$f":"IF('Tex-743-I'!$G$38=\"\",\"\",'Tex-743-I'!$G$38)","v":""},{"$f":"IF('Tex-743-I'!$B$6=\"\",\"\",'Tex-743-I'!$B$6)","v":"Tex-743-I:DMS-4510"},{"$f":"IF('Tex-743-I'!$B$28=\"\",\"\",'Tex-743-I'!$B$28)","v":"Sample"},{"$f":"IF('Tex-743-I'!$B$38=\"\",\"\",'Tex-743-I'!$B$38)","v":7},{"$f":"IF('Tex-743-I'!$G$28=\"\",\"\",'Tex-743-I'!$G$28)","v":"Ultimate Strength "}]
[72,{"$f":"IF('Tex-743-I'!$H$38=\"\",\"\",'Tex-743-I'!$H$38)","v":""},{"$f":"IF('Tex-743-I'!$B$6=\"\",\"\",'Tex-743-I'!$B$6)","v":"Tex-743-I:DMS-4510"},{"$f":"IF('Tex-743-I'!$B$28=\"\",\"\",'Tex-743-I'!$B$28)","v":"Sample"},{"$f":"IF('Tex-743-I'!$B$38=\"\",\"\",'Tex-743-I'!$B$38)","v":7},{"$f":"IF('Tex-743-I'!$H$28=\"\",\"\",'Tex-743-I'!$H$28)","v":"Percent of Nominal Yield, (%)"}]
[73,{"$f":"IF('Tex-743-I'!$I$38=\"\",\"\",'Tex-743-I'!$I$38)","v":""},{"$f":"IF('Tex-743-I'!$B$6=\"\",\"\",'Tex-743-I'!$B$6)","v":"Tex-743-I:DMS-4510"},{"$f":"IF('Tex-743-I'!$B$28=\"\",\"\",'Tex-743-I'!$B$28)","v":"Sample"},{"$f":"IF('Tex-743-I'!$B$38=\"\",\"\",'Tex-743-I'!$B$38)","v":7},{"$f":"IF('Tex-743-I'!$I$28=\"\",\"\",'Tex-743-I'!$I$28)","v":"Fatigue Loaded"}]
[74,{"$f":"IF('Tex-743-I'!$J$38=\"\",\"\",'Tex-743-I'!$J$38)","v":""},{"$f":"IF('Tex-743-I'!$B$6=\"\",\"\",'Tex-743-I'!$B$6)","v":"Tex-743-I:DMS-4510"},{"$f":"IF('Tex-743-I'!$B$28=\"\",\"\",'Tex-743-I'!$B$28)","v":"Sample"},{"$f":"IF('Tex-743-I'!$B$38=\"\",\"\",'Tex-743-I'!$B$38)","v":7},{"$f":"IF('Tex-743-I'!$J$28=\"\",\"\",'Tex-743-I'!$J$28)","v":"Fracture Location"}]
[75,{"$f":"IF('Tex-743-I'!$K$38=\"\",\"\",'Tex-743-I'!$K$38)","v":""},{"$f":"IF('Tex-743-I'!$B$6=\"\",\"\",'Tex-743-I'!$B$6)","v":"Tex-743-I:DMS-4510"},{"$f":"IF('Tex-743-I'!$B$28=\"\",\"\",'Tex-743-I'!$B$28)","v":"Sample"},{"$f":"IF('Tex-743-I'!$B$38=\"\",\"\",'Tex-743-I'!$B$38)","v":7},{"$f":"IF('Tex-743-I'!$K$28=\"\",\"\",'Tex-743-I'!$K$28)","v":"Slip "}]
[76,{"$f":"IF('Tex-743-I'!$C$39=\"\",\"\",'Tex-743-I'!$C$39)","v":""},{"$f":"IF('Tex-743-I'!$B$6=\"\",\"\",'Tex-743-I'!$B$6)","v":"Tex-743-I:DMS-4510"},{"$f":"IF('Tex-743-I'!$B$28=\"\",\"\",'Tex-743-I'!$B$28)","v":"Sample"},{"$f":"IF('Tex-743-I'!$B$39=\"\",\"\",'Tex-743-I'!$B$39)","v":8},{"$f":"IF('Tex-743-I'!$C$28=\"\",\"\",'Tex-743-I'!$C$28)","v":"Sample Number"}]
[77,{"$f":"IF('Tex-743-I'!$D$39=\"\",\"\",'Tex-743-I'!$D$39)","v":""},{"$f":"IF('Tex-743-I'!$B$6=\"\",\"\",'Tex-743-I'!$B$6)","v":"Tex-743-I:DMS-4510"},{"$f":"IF('Tex-743-I'!$B$28=\"\",\"\",'Tex-743-I'!$B$28)","v":"Sample"},{"$f":"IF('Tex-743-I'!$B$39=\"\",\"\",'Tex-743-I'!$B$39)","v":8},{"$f":"IF('Tex-743-I'!$D$28=\"\",\"\",'Tex-743-I'!$D$28)","v":"Nominal Diameter "}]
[78,{"$f":"IF('Tex-743-I'!$E$39=\"\",\"\",'Tex-743-I'!$E$39)","v":""},{"$f":"IF('Tex-743-I'!$B$6=\"\",\"\",'Tex-743-I'!$B$6)","v":"Tex-743-I:DMS-4510"},{"$f":"IF('Tex-743-I'!$B$28=\"\",\"\",'Tex-743-I'!$B$28)","v":"Sample"},{"$f":"IF('Tex-743-I'!$B$39=\"\",\"\",'Tex-743-I'!$B$39)","v":8},{"$f":"IF('Tex-743-I'!$E$28=\"\",\"\",'Tex-743-I'!$E$28)","v":"Nominal Area "}]
[79,{"$f":"IF('Tex-743-I'!$F$39=\"\",\"\",'Tex-743-I'!$F$39)","v":""},{"$f":"IF('Tex-743-I'!$B$6=\"\",\"\",'Tex-743-I'!$B$6)","v":"Tex-743-I:DMS-4510"},{"$f":"IF('Tex-743-I'!$B$28=\"\",\"\",'Tex-743-I'!$B$28)","v":"Sample"},{"$f":"IF('Tex-743-I'!$B$39=\"\",\"\",'Tex-743-I'!$B$39)","v":8},{"$f":"IF('Tex-743-I'!$F$28=\"\",\"\",'Tex-743-I'!$F$28)","v":"Ultimate Load "}]
[80,{"$f":"IF('Tex-743-I'!$G$39=\"\",\"\",'Tex-743-I'!$G$39)","v":""},{"$f":"IF('Tex-743-I'!$B$6=\"\",\"\",'Tex-743-I'!$B$6)","v":"Tex-743-I:DMS-4510"},{"$f":"IF('Tex-743-I'!$B$28=\"\",\"\",'Tex-743-I'!$B$28)","v":"Sample"},{"$f":"IF('Tex-743-I'!$B$39=\"\",\"\",'Tex-743-I'!$B$39)","v":8},{"$f":"IF('Tex-743-I'!$G$28=\"\",\"\",'Tex-743-I'!$G$28)","v":"Ultimate Strength "}]
[81,{"$f":"IF('Tex-743-I'!$H$39=\"\",\"\",'Tex-743-I'!$H$39)","v":""},{"$f":"IF('Tex-743-I'!$B$6=\"\",\"\",'Tex-743-I'!$B$6)","v":"Tex-743-I:DMS-4510"},{"$f":"IF('Tex-743-I'!$B$28=\"\",\"\",'Tex-743-I'!$B$28)","v":"Sample"},{"$f":"IF('Tex-743-I'!$B$39=\"\",\"\",'Tex-743-I'!$B$39)","v":8},{"$f":"IF('Tex-743-I'!$H$28=\"\",\"\",'Tex-743-I'!$H$28)","v":"Percent of Nominal Yield, (%)"}]
[82,{"$f":"IF('Tex-743-I'!$I$39=\"\",\"\",'Tex-743-I'!$I$39)","v":""},{"$f":"IF('Tex-743-I'!$B$6=\"\",\"\",'Tex-743-I'!$B$6)","v":"Tex-743-I:DMS-4510"},{"$f":"IF('Tex-743-I'!$B$28=\"\",\"\",'Tex-743-I'!$B$28)","v":"Sample"},{"$f":"IF('Tex-743-I'!$B$39=\"\",\"\",'Tex-743-I'!$B$39)","v":8},{"$f":"IF('Tex-743-I'!$I$28=\"\",\"\",'Tex-743-I'!$I$28)","v":"Fatigue Loaded"}]
[83,{"$f":"IF('Tex-743-I'!$J$39=\"\",\"\",'Tex-743-I'!$J$39)","v":""},{"$f":"IF('Tex-743-I'!$B$6=\"\",\"\",'Tex-743-I'!$B$6)","v":"Tex-743-I:DMS-4510"},{"$f":"IF('Tex-743-I'!$B$28=\"\",\"\",'Tex-743-I'!$B$28)","v":"Sample"},{"$f":"IF('Tex-743-I'!$B$39=\"\",\"\",'Tex-743-I'!$B$39)","v":8},{"$f":"IF('Tex-743-I'!$J$28=\"\",\"\",'Tex-743-I'!$J$28)","v":"Fracture Location"}]
[84,{"$f":"IF('Tex-743-I'!$K$39=\"\",\"\",'Tex-743-I'!$K$39)","v":""},{"$f":"IF('Tex-743-I'!$B$6=\"\",\"\",'Tex-743-I'!$B$6)","v":"Tex-743-I:DMS-4510"},{"$f":"IF('Tex-743-I'!$B$28=\"\",\"\",'Tex-743-I'!$B$28)","v":"Sample"},{"$f":"IF('Tex-743-I'!$B$39=\"\",\"\",'Tex-743-I'!$B$39)","v":8},{"$f":"IF('Tex-743-I'!$K$28=\"\",\"\",'Tex-743-I'!$K$28)","v":"Slip "}]
[85,{"$f":"IF('Tex-743-I'!$G$41=\"\",\"\",'Tex-743-I'!$G$41)","v":""},{"$f":"IF('Tex-743-I'!$B$6=\"\",\"\",'Tex-743-I'!$B$6)","v":"Tex-743-I:DMS-4510"},{"$f":"IF('Tex-743-I'!$D$41=\"\",\"\",'Tex-743-I'!$D$41)","v":"Were samples taken to breaking point?"}]
[86,{"$f":"IF('Tex-743-I'!$G$42=\"\",\"\",'Tex-743-I'!$G$42)","v":""},{"$f":"IF('Tex-743-I'!$B$6=\"\",\"\",'Tex-743-I'!$B$6)","v":"Tex-743-I:DMS-4510"},{"$f":"IF('Tex-743-I'!$D$42=\"\",\"\",'Tex-743-I'!$D$42)","v":"Did samples meet specifications?"}]