{"text_format":"1","workbook":"xlsx","n_sheets":4,"sheets":["Control Charts","Target","DATA","DATA_CHART"],"not_rendered":{"charts":1,"images":1,"macros":1,"external_links":1,"defined_names":16,"comments":0,"pivot_tables":0},"unopened":[],"bounds":{"document_bytes":16777216,"sheet_cells":100000,"rows_first":2000,"rows_last":500,"rows_between":2000,"halvings":0,"cell_chars":16384,"cell_head_chars":4096},"cells_cut":0,"cells_raw":0,"read":"whole","date_system":"1900"}

{"sheet":"Control Charts","index":0,"n_rows":13,"n_cols":14,"rows_kept":13,"cut":false,"hidden":false,"merged":[[0,3,0,7],[8,4,8,5],[9,4,9,8],[10,4,10,8],[11,4,11,5],[2,4,2,5],[3,4,3,5],[4,4,4,5],[5,4,5,5],[6,4,6,5],[7,4,7,5]]}
[null,null,null,"TEXAS DEPARTMENT OF TRANSPORTATION                                                                                                                  Plot Control Chart - 2014 QC/QA Template",null,null,null,null,null,null,"TXCC14 - File Version :: 07-22-2025"]
[]
[null,null,null,"SAMPLE ID:",{"$f":"IFERROR(IF(INDIRECT(FIRST_LOT&\"!A1\")<>\"\",INDIRECT(FIRST_LOT&\"!A1\"),\"\"),\"\")","v":""},null,null,"SAMPLED DATE:",{"$f":"IFERROR(IF(INDIRECT(FIRST_LOT&\"!B1\")<>\"\",INDIRECT(FIRST_LOT&\"!B1\"),\"\"),\"\")","v":""}]
[null,null,null,"LOT NUMBER:",{"$f":"IFERROR(IF(INDIRECT(FIRST_LOT&\"!A2\")<>\"\",INDIRECT(FIRST_LOT&\"!A2\"),\"\"),\"\")","v":""},null,null,"LETTING DATE:",{"$f":"IFERROR(IF(INDIRECT(FIRST_LOT&\"!B2\")<>\"\",INDIRECT(FIRST_LOT&\"!B2\"),\"\"),\"\")","v":""}]
[null,null,null,"SAMPLE STATUS:",{"$f":"IFERROR(IF(INDIRECT(FIRST_LOT&\"!A3\")<>\"\",INDIRECT(FIRST_LOT&\"!A3\"),\"\"),\"\")","v":""},null,null,"CONTROLLING CSJ:",{"$f":"IFERROR(IF(INDIRECT(FIRST_LOT&\"!B3\")<>\"\",INDIRECT(FIRST_LOT&\"!B3\"),\"\"),\"\")","v":""}]
[null,null,null,"COUNTY:",{"$f":"IFERROR(IF(INDIRECT(FIRST_LOT&\"!A4\")<>\"\",INDIRECT(FIRST_LOT&\"!A4\"),\"\"),\"\")","v":""},null,null,"SPEC YEAR:",{"$f":"IFERROR(IF(INDIRECT(FIRST_LOT&\"!B4\")<>\"\",INDIRECT(FIRST_LOT&\"!B4\"),\"\"),\"\")","v":""}]
[null,null,null,"SAMPLED BY:",{"$f":"IFERROR(IF(INDIRECT(FIRST_LOT&\"!A5\")<>\"\",INDIRECT(FIRST_LOT&\"!A5\"),\"\"),\"\")","v":""},null,null,"SPEC ITEM:",{"$f":"IFERROR(IF(INDIRECT(FIRST_LOT&\"!B5\")<>\"\",INDIRECT(FIRST_LOT&\"!B5\"),\"\"),\"\")","v":""}]
[null,null,null,"SAMPLE LOCATION:",{"$f":"IFERROR(IF(INDIRECT(FIRST_LOT&\"!A6\")<>\"\",INDIRECT(FIRST_LOT&\"!A6\"),\"\"),\"\")","v":""},null,null,"SPECIAL PROVISION:",{"$f":"IFERROR(IF(INDIRECT(FIRST_LOT&\"!B6\")<>\"\",INDIRECT(FIRST_LOT&\"!B6\"),\"\"),\"\")","v":""},null,"Select a lot:"]
[null,null,null,"MATERIAL CODE:",{"$f":"IFERROR(IF(INDIRECT(FIRST_LOT&\"!A7\")<>\"\",INDIRECT(FIRST_LOT&\"!A7\"),\"\"),\"\")","v":""},null,null,"MIX TYPE:",{"$f":"IFERROR(IF(INDIRECT(FIRST_LOT&\"!B7\")<>\"\",INDIRECT(FIRST_LOT&\"!B7\"),\"\"),\"\")","v":""}]
[null,null,null,"MATERIAL NAME:",{"$f":"IFERROR(IF(INDIRECT(FIRST_LOT&\"!A8\")<>\"\",INDIRECT(FIRST_LOT&\"!A8\"),\"\"),\"\")","v":""}]
[null,null,null,"PRODUCER:",{"$f":"IFERROR(IF(INDIRECT(FIRST_LOT&\"!A9\")<>\"\",INDIRECT(FIRST_LOT&\"!A9\"),\"\"),\"\")","v":""}]
[null,null,null,"AREA ENGINEER:",{"$f":"IFERROR(IF(INDIRECT(FIRST_LOT&\"!A10\")<>\"\",INDIRECT(FIRST_LOT&\"!A10\"),\"\"),\"\")","v":""},null,null,"PROJECT MANAGER:",{"$f":"IFERROR(IF(INDIRECT(FIRST_LOT&\"!B8\")<>\"\",INDIRECT(FIRST_LOT&\"!B8\"),\"\"),\"\")","v":""},null,"Plot what:"]
[null,null,null,"COURSE\\LIFT:",{"$f":"IFERROR(IF(INDIRECT(FIRST_LOT&\"!B9\")<>\"\",INDIRECT(FIRST_LOT&\"!B9\"),\"\"),\"\")","v":""},"STATION:",{"$f":"IFERROR(IF(INDIRECT(FIRST_LOT&\"!B10\")<>\"\",INDIRECT(FIRST_LOT&\"!B10\"),\"\"),\"\")","v":""},"DIST. FROM CL:",{"$f":"IFERROR(IF(INDIRECT(FIRST_LOT&\"!B11\")<>\"\",INDIRECT(FIRST_LOT&\"!B11\"),\"\"),\"\")","v":""},null,"In-place air voids",null,null,{"$f":"VLOOKUP(K13,DATA!B2:C19,2,0)","v":17}]

{"sheet":"Target","index":1,"n_rows":20,"n_cols":10,"rows_kept":20,"cut":false,"hidden":true,"merged":[]}
[null,null,"Sieve1",null,{"$error":"#N/A"},{"$error":"#N/A"}]
[null,null,"Sieve2",null,{"$error":"#N/A"},{"$error":"#N/A"}]
[null,null,"Sieve3",null,{"$error":"#N/A"},{"$error":"#N/A"}]
[null,null,"Sieve4",null,{"$error":"#N/A"},{"$error":"#N/A"}]
[null,null,"Sieve5",null,{"$error":"#N/A"},{"$error":"#N/A"}]
[null,null,"Sieve6",null,{"$error":"#N/A"},{"$error":"#N/A"}]
[null,null,"Sieve7",null,{"$error":"#N/A"},{"$error":"#N/A"}]
[null,null,"Sieve8",null,{"$error":"#N/A"},{"$error":"#N/A"}]
[null,null,"Sieve9",null,{"$error":"#N/A"},{"$error":"#N/A"}]
[null,null,"Sieve10",null,{"$error":"#N/A"},{"$error":"#N/A"}]
[null,null,"Pan",null,{"$error":"#N/A"},{"$error":"#N/A"}]
[null,null,"AC",0,-0.3,0.3]
[null,null,"Rice"]
[null,null,"Density",0,{"$error":"#N/A"},{"$error":"#N/A"}]
[null,null,"SG"]
[null,null,"VIM"]
[null,null,"In-place air voids",null,null,null,0,null,null,8]
[]
[]
[{"$f":"SUMPRODUCT(MID(0&A2,LARGE(INDEX(ISNUMBER(--MID(A2,ROW($1:$25),1))*\n ROW($1:$25),0),ROW($1:$25))+1,1)*10^ROW($1:$25)/10)","v":0}]

{"sheet":"DATA","index":2,"n_rows":102,"n_cols":6,"rows_kept":102,"cut":false,"hidden":true,"merged":[]}
[null,"FIRST LOT",{"$f":"IF(LOT_NO=\"\",F2,LOT_NO)","v":""},null,"Lots","SortedLots"]
[null,"2\"",{"$f":"MATCH(B2,INDIRECT(FIRST_LOT&\"!SIEVES\"),0)","v":{"$error":"#REF!"}},null,null,{"$f":"IFERROR(INDEX(LOTSALOTS,SMALL((IF(LEN(LOTSALOTS),ROW(INDIRECT(\"1:\"&ROWS(LOTSALOTS))))),ROW(A1)),1),\"\")","v":""}]
[null,"1-1/2\"",{"$error":"#REF!"},null,null,{"$f":"IFERROR(INDEX(LOTSALOTS,SMALL((IF(LEN(LOTSALOTS),ROW(INDIRECT(\"1:\"&ROWS(LOTSALOTS))))),ROW(A2)),1),\"\")","v":""}]
[null,"1\"",{"$error":"#REF!"},null,null,{"$f":"IFERROR(INDEX(LOTSALOTS,SMALL((IF(LEN(LOTSALOTS),ROW(INDIRECT(\"1:\"&ROWS(LOTSALOTS))))),ROW(A3)),1),\"\")","v":""}]
[null,"3/4\"",{"$error":"#REF!"},null,null,{"$f":"IFERROR(INDEX(LOTSALOTS,SMALL((IF(LEN(LOTSALOTS),ROW(INDIRECT(\"1:\"&ROWS(LOTSALOTS))))),ROW(A4)),1),\"\")","v":""}]
[null,"1/2\"",{"$error":"#REF!"},null,null,{"$f":"IFERROR(INDEX(LOTSALOTS,SMALL((IF(LEN(LOTSALOTS),ROW(INDIRECT(\"1:\"&ROWS(LOTSALOTS))))),ROW(A5)),1),\"\")","v":""}]
[null,"#4",{"$error":"#REF!"},null,null,{"$f":"IFERROR(INDEX(LOTSALOTS,SMALL((IF(LEN(LOTSALOTS),ROW(INDIRECT(\"1:\"&ROWS(LOTSALOTS))))),ROW(A6)),1),\"\")","v":""}]
[null,"#8",{"$error":"#REF!"},null,null,{"$f":"IFERROR(INDEX(LOTSALOTS,SMALL((IF(LEN(LOTSALOTS),ROW(INDIRECT(\"1:\"&ROWS(LOTSALOTS))))),ROW(A7)),1),\"\")","v":""}]
[null,"#30",{"$error":"#REF!"},null,null,{"$f":"IFERROR(INDEX(LOTSALOTS,SMALL((IF(LEN(LOTSALOTS),ROW(INDIRECT(\"1:\"&ROWS(LOTSALOTS))))),ROW(A8)),1),\"\")","v":""}]
[null,"#50",{"$error":"#REF!"},null,null,{"$f":"IFERROR(INDEX(LOTSALOTS,SMALL((IF(LEN(LOTSALOTS),ROW(INDIRECT(\"1:\"&ROWS(LOTSALOTS))))),ROW(A9)),1),\"\")","v":""}]
[null,"#200",{"$error":"#REF!"},null,null,{"$f":"IFERROR(INDEX(LOTSALOTS,SMALL((IF(LEN(LOTSALOTS),ROW(INDIRECT(\"1:\"&ROWS(LOTSALOTS))))),ROW(A10)),1),\"\")","v":""}]
[null,"Pan",11,null,null,{"$f":"IFERROR(INDEX(LOTSALOTS,SMALL((IF(LEN(LOTSALOTS),ROW(INDIRECT(\"1:\"&ROWS(LOTSALOTS))))),ROW(A11)),1),\"\")","v":""}]
[null,"AC",12,null,null,{"$f":"IFERROR(INDEX(LOTSALOTS,SMALL((IF(LEN(LOTSALOTS),ROW(INDIRECT(\"1:\"&ROWS(LOTSALOTS))))),ROW(A12)),1),\"\")","v":""}]
[null,"Rice",13,null,null,{"$f":"IFERROR(INDEX(LOTSALOTS,SMALL((IF(LEN(LOTSALOTS),ROW(INDIRECT(\"1:\"&ROWS(LOTSALOTS))))),ROW(A13)),1),\"\")","v":""}]
[null,"Density",14,null,null,{"$f":"IFERROR(INDEX(LOTSALOTS,SMALL((IF(LEN(LOTSALOTS),ROW(INDIRECT(\"1:\"&ROWS(LOTSALOTS))))),ROW(A14)),1),\"\")","v":""}]
[null,"SG",15,null,null,{"$f":"IFERROR(INDEX(LOTSALOTS,SMALL((IF(LEN(LOTSALOTS),ROW(INDIRECT(\"1:\"&ROWS(LOTSALOTS))))),ROW(A15)),1),\"\")","v":""}]
[null,"VIM",16,null,null,{"$f":"IFERROR(INDEX(LOTSALOTS,SMALL((IF(LEN(LOTSALOTS),ROW(INDIRECT(\"1:\"&ROWS(LOTSALOTS))))),ROW(A16)),1),\"\")","v":""}]
[null,"In-place air voids",17,null,null,{"$f":"IFERROR(INDEX(LOTSALOTS,SMALL((IF(LEN(LOTSALOTS),ROW(INDIRECT(\"1:\"&ROWS(LOTSALOTS))))),ROW(A17)),1),\"\")","v":""}]
[null,"VMA",18,null,null,{"$f":"IFERROR(INDEX(LOTSALOTS,SMALL((IF(LEN(LOTSALOTS),ROW(INDIRECT(\"1:\"&ROWS(LOTSALOTS))))),ROW(A18)),1),\"\")","v":""}]
[null,"Drain down",19,null,null,{"$f":"IFERROR(INDEX(LOTSALOTS,SMALL((IF(LEN(LOTSALOTS),ROW(INDIRECT(\"1:\"&ROWS(LOTSALOTS))))),ROW(A19)),1),\"\")","v":""}]
[null,"Cantabro loss",20,null,null,{"$f":"IFERROR(INDEX(LOTSALOTS,SMALL((IF(LEN(LOTSALOTS),ROW(INDIRECT(\"1:\"&ROWS(LOTSALOTS))))),ROW(A20)),1),\"\")","v":""}]
[null,"Mem. app. rate",21,null,null,{"$f":"IFERROR(INDEX(LOTSALOTS,SMALL((IF(LEN(LOTSALOTS),ROW(INDIRECT(\"1:\"&ROWS(LOTSALOTS))))),ROW(A21)),1),\"\")","v":""}]
[null,null,null,null,null,{"$f":"IFERROR(INDEX(LOTSALOTS,SMALL((IF(LEN(LOTSALOTS),ROW(INDIRECT(\"1:\"&ROWS(LOTSALOTS))))),ROW(A22)),1),\"\")","v":""}]
[null,null,null,null,null,{"$f":"IFERROR(INDEX(LOTSALOTS,SMALL((IF(LEN(LOTSALOTS),ROW(INDIRECT(\"1:\"&ROWS(LOTSALOTS))))),ROW(A23)),1),\"\")","v":""}]
[null,null,null,null,null,{"$f":"IFERROR(INDEX(LOTSALOTS,SMALL((IF(LEN(LOTSALOTS),ROW(INDIRECT(\"1:\"&ROWS(LOTSALOTS))))),ROW(A24)),1),\"\")","v":""}]
[null,null,null,null,null,{"$f":"IFERROR(INDEX(LOTSALOTS,SMALL((IF(LEN(LOTSALOTS),ROW(INDIRECT(\"1:\"&ROWS(LOTSALOTS))))),ROW(A25)),1),\"\")","v":""}]
[null,null,null,null,null,{"$f":"IFERROR(INDEX(LOTSALOTS,SMALL((IF(LEN(LOTSALOTS),ROW(INDIRECT(\"1:\"&ROWS(LOTSALOTS))))),ROW(A26)),1),\"\")","v":""}]
[null,null,null,null,null,{"$f":"IFERROR(INDEX(LOTSALOTS,SMALL((IF(LEN(LOTSALOTS),ROW(INDIRECT(\"1:\"&ROWS(LOTSALOTS))))),ROW(A27)),1),\"\")","v":""}]
[null,null,null,null,null,{"$f":"IFERROR(INDEX(LOTSALOTS,SMALL((IF(LEN(LOTSALOTS),ROW(INDIRECT(\"1:\"&ROWS(LOTSALOTS))))),ROW(A28)),1),\"\")","v":""}]
[null,null,null,null,null,{"$f":"IFERROR(INDEX(LOTSALOTS,SMALL((IF(LEN(LOTSALOTS),ROW(INDIRECT(\"1:\"&ROWS(LOTSALOTS))))),ROW(A29)),1),\"\")","v":""}]
[null,null,null,null,null,{"$f":"IFERROR(INDEX(LOTSALOTS,SMALL((IF(LEN(LOTSALOTS),ROW(INDIRECT(\"1:\"&ROWS(LOTSALOTS))))),ROW(A30)),1),\"\")","v":""}]
[null,null,null,null,null,{"$f":"IFERROR(INDEX(LOTSALOTS,SMALL((IF(LEN(LOTSALOTS),ROW(INDIRECT(\"1:\"&ROWS(LOTSALOTS))))),ROW(A31)),1),\"\")","v":""}]
[null,null,null,null,null,{"$f":"IFERROR(INDEX(LOTSALOTS,SMALL((IF(LEN(LOTSALOTS),ROW(INDIRECT(\"1:\"&ROWS(LOTSALOTS))))),ROW(A32)),1),\"\")","v":""}]
[null,null,null,null,null,{"$f":"IFERROR(INDEX(LOTSALOTS,SMALL((IF(LEN(LOTSALOTS),ROW(INDIRECT(\"1:\"&ROWS(LOTSALOTS))))),ROW(A33)),1),\"\")","v":""}]
[null,null,null,null,null,{"$f":"IFERROR(INDEX(LOTSALOTS,SMALL((IF(LEN(LOTSALOTS),ROW(INDIRECT(\"1:\"&ROWS(LOTSALOTS))))),ROW(A34)),1),\"\")","v":""}]
[null,null,null,null,null,{"$f":"IFERROR(INDEX(LOTSALOTS,SMALL((IF(LEN(LOTSALOTS),ROW(INDIRECT(\"1:\"&ROWS(LOTSALOTS))))),ROW(A35)),1),\"\")","v":""}]
[null,null,null,null,null,{"$f":"IFERROR(INDEX(LOTSALOTS,SMALL((IF(LEN(LOTSALOTS),ROW(INDIRECT(\"1:\"&ROWS(LOTSALOTS))))),ROW(A36)),1),\"\")","v":""}]
[null,null,null,null,null,{"$f":"IFERROR(INDEX(LOTSALOTS,SMALL((IF(LEN(LOTSALOTS),ROW(INDIRECT(\"1:\"&ROWS(LOTSALOTS))))),ROW(A37)),1),\"\")","v":""}]
[null,null,null,null,null,{"$f":"IFERROR(INDEX(LOTSALOTS,SMALL((IF(LEN(LOTSALOTS),ROW(INDIRECT(\"1:\"&ROWS(LOTSALOTS))))),ROW(A38)),1),\"\")","v":""}]
[null,null,null,null,null,{"$f":"IFERROR(INDEX(LOTSALOTS,SMALL((IF(LEN(LOTSALOTS),ROW(INDIRECT(\"1:\"&ROWS(LOTSALOTS))))),ROW(A39)),1),\"\")","v":""}]
[null,null,null,null,null,{"$f":"IFERROR(INDEX(LOTSALOTS,SMALL((IF(LEN(LOTSALOTS),ROW(INDIRECT(\"1:\"&ROWS(LOTSALOTS))))),ROW(A40)),1),\"\")","v":""}]
[null,null,null,null,null,{"$f":"IFERROR(INDEX(LOTSALOTS,SMALL((IF(LEN(LOTSALOTS),ROW(INDIRECT(\"1:\"&ROWS(LOTSALOTS))))),ROW(A41)),1),\"\")","v":""}]
[null,null,null,null,null,{"$f":"IFERROR(INDEX(LOTSALOTS,SMALL((IF(LEN(LOTSALOTS),ROW(INDIRECT(\"1:\"&ROWS(LOTSALOTS))))),ROW(A42)),1),\"\")","v":""}]
[null,null,null,null,null,{"$f":"IFERROR(INDEX(LOTSALOTS,SMALL((IF(LEN(LOTSALOTS),ROW(INDIRECT(\"1:\"&ROWS(LOTSALOTS))))),ROW(A43)),1),\"\")","v":""}]
[null,null,null,null,null,{"$f":"IFERROR(INDEX(LOTSALOTS,SMALL((IF(LEN(LOTSALOTS),ROW(INDIRECT(\"1:\"&ROWS(LOTSALOTS))))),ROW(A44)),1),\"\")","v":""}]
[null,null,null,null,null,{"$f":"IFERROR(INDEX(LOTSALOTS,SMALL((IF(LEN(LOTSALOTS),ROW(INDIRECT(\"1:\"&ROWS(LOTSALOTS))))),ROW(A45)),1),\"\")","v":""}]
[null,null,null,null,null,{"$f":"IFERROR(INDEX(LOTSALOTS,SMALL((IF(LEN(LOTSALOTS),ROW(INDIRECT(\"1:\"&ROWS(LOTSALOTS))))),ROW(A46)),1),\"\")","v":""}]
[null,null,null,null,null,{"$f":"IFERROR(INDEX(LOTSALOTS,SMALL((IF(LEN(LOTSALOTS),ROW(INDIRECT(\"1:\"&ROWS(LOTSALOTS))))),ROW(A47)),1),\"\")","v":""}]
[null,null,null,null,null,{"$f":"IFERROR(INDEX(LOTSALOTS,SMALL((IF(LEN(LOTSALOTS),ROW(INDIRECT(\"1:\"&ROWS(LOTSALOTS))))),ROW(A48)),1),\"\")","v":""}]
[null,null,null,null,null,{"$f":"IFERROR(INDEX(LOTSALOTS,SMALL((IF(LEN(LOTSALOTS),ROW(INDIRECT(\"1:\"&ROWS(LOTSALOTS))))),ROW(A49)),1),\"\")","v":""}]
[null,null,null,null,null,{"$f":"IFERROR(INDEX(LOTSALOTS,SMALL((IF(LEN(LOTSALOTS),ROW(INDIRECT(\"1:\"&ROWS(LOTSALOTS))))),ROW(A50)),1),\"\")","v":""}]
[null,null,null,null,null,{"$f":"IFERROR(INDEX(LOTSALOTS,SMALL((IF(LEN(LOTSALOTS),ROW(INDIRECT(\"1:\"&ROWS(LOTSALOTS))))),ROW(A51)),1),\"\")","v":""}]
[null,null,null,null,null,{"$f":"IFERROR(INDEX(LOTSALOTS,SMALL((IF(LEN(LOTSALOTS),ROW(INDIRECT(\"1:\"&ROWS(LOTSALOTS))))),ROW(A52)),1),\"\")","v":""}]
[null,null,null,null,null,{"$f":"IFERROR(INDEX(LOTSALOTS,SMALL((IF(LEN(LOTSALOTS),ROW(INDIRECT(\"1:\"&ROWS(LOTSALOTS))))),ROW(A53)),1),\"\")","v":""}]
[null,null,null,null,null,{"$f":"IFERROR(INDEX(LOTSALOTS,SMALL((IF(LEN(LOTSALOTS),ROW(INDIRECT(\"1:\"&ROWS(LOTSALOTS))))),ROW(A54)),1),\"\")","v":""}]
[null,null,null,null,null,{"$f":"IFERROR(INDEX(LOTSALOTS,SMALL((IF(LEN(LOTSALOTS),ROW(INDIRECT(\"1:\"&ROWS(LOTSALOTS))))),ROW(A55)),1),\"\")","v":""}]
[null,null,null,null,null,{"$f":"IFERROR(INDEX(LOTSALOTS,SMALL((IF(LEN(LOTSALOTS),ROW(INDIRECT(\"1:\"&ROWS(LOTSALOTS))))),ROW(A56)),1),\"\")","v":""}]
[null,null,null,null,null,{"$f":"IFERROR(INDEX(LOTSALOTS,SMALL((IF(LEN(LOTSALOTS),ROW(INDIRECT(\"1:\"&ROWS(LOTSALOTS))))),ROW(A57)),1),\"\")","v":""}]
[null,null,null,null,null,{"$f":"IFERROR(INDEX(LOTSALOTS,SMALL((IF(LEN(LOTSALOTS),ROW(INDIRECT(\"1:\"&ROWS(LOTSALOTS))))),ROW(A58)),1),\"\")","v":""}]
[null,null,null,null,null,{"$f":"IFERROR(INDEX(LOTSALOTS,SMALL((IF(LEN(LOTSALOTS),ROW(INDIRECT(\"1:\"&ROWS(LOTSALOTS))))),ROW(A59)),1),\"\")","v":""}]
[null,null,null,null,null,{"$f":"IFERROR(INDEX(LOTSALOTS,SMALL((IF(LEN(LOTSALOTS),ROW(INDIRECT(\"1:\"&ROWS(LOTSALOTS))))),ROW(A60)),1),\"\")","v":""}]
[null,null,null,null,null,{"$f":"IFERROR(INDEX(LOTSALOTS,SMALL((IF(LEN(LOTSALOTS),ROW(INDIRECT(\"1:\"&ROWS(LOTSALOTS))))),ROW(A61)),1),\"\")","v":""}]
[null,null,null,null,null,{"$f":"IFERROR(INDEX(LOTSALOTS,SMALL((IF(LEN(LOTSALOTS),ROW(INDIRECT(\"1:\"&ROWS(LOTSALOTS))))),ROW(A62)),1),\"\")","v":""}]
[null,null,null,null,null,{"$f":"IFERROR(INDEX(LOTSALOTS,SMALL((IF(LEN(LOTSALOTS),ROW(INDIRECT(\"1:\"&ROWS(LOTSALOTS))))),ROW(A63)),1),\"\")","v":""}]
[null,null,null,null,null,{"$f":"IFERROR(INDEX(LOTSALOTS,SMALL((IF(LEN(LOTSALOTS),ROW(INDIRECT(\"1:\"&ROWS(LOTSALOTS))))),ROW(A64)),1),\"\")","v":""}]
[null,null,null,null,null,{"$f":"IFERROR(INDEX(LOTSALOTS,SMALL((IF(LEN(LOTSALOTS),ROW(INDIRECT(\"1:\"&ROWS(LOTSALOTS))))),ROW(A65)),1),\"\")","v":""}]
[null,null,null,null,null,{"$f":"IFERROR(INDEX(LOTSALOTS,SMALL((IF(LEN(LOTSALOTS),ROW(INDIRECT(\"1:\"&ROWS(LOTSALOTS))))),ROW(A66)),1),\"\")","v":""}]
[null,null,null,null,null,{"$f":"IFERROR(INDEX(LOTSALOTS,SMALL((IF(LEN(LOTSALOTS),ROW(INDIRECT(\"1:\"&ROWS(LOTSALOTS))))),ROW(A67)),1),\"\")","v":""}]
[null,null,null,null,null,{"$f":"IFERROR(INDEX(LOTSALOTS,SMALL((IF(LEN(LOTSALOTS),ROW(INDIRECT(\"1:\"&ROWS(LOTSALOTS))))),ROW(A68)),1),\"\")","v":""}]
[null,null,null,null,null,{"$f":"IFERROR(INDEX(LOTSALOTS,SMALL((IF(LEN(LOTSALOTS),ROW(INDIRECT(\"1:\"&ROWS(LOTSALOTS))))),ROW(A69)),1),\"\")","v":""}]
[null,null,null,null,null,{"$f":"IFERROR(INDEX(LOTSALOTS,SMALL((IF(LEN(LOTSALOTS),ROW(INDIRECT(\"1:\"&ROWS(LOTSALOTS))))),ROW(A70)),1),\"\")","v":""}]
[null,null,null,null,null,{"$f":"IFERROR(INDEX(LOTSALOTS,SMALL((IF(LEN(LOTSALOTS),ROW(INDIRECT(\"1:\"&ROWS(LOTSALOTS))))),ROW(A71)),1),\"\")","v":""}]
[null,null,null,null,null,{"$f":"IFERROR(INDEX(LOTSALOTS,SMALL((IF(LEN(LOTSALOTS),ROW(INDIRECT(\"1:\"&ROWS(LOTSALOTS))))),ROW(A72)),1),\"\")","v":""}]
[null,null,null,null,null,{"$f":"IFERROR(INDEX(LOTSALOTS,SMALL((IF(LEN(LOTSALOTS),ROW(INDIRECT(\"1:\"&ROWS(LOTSALOTS))))),ROW(A73)),1),\"\")","v":""}]
[null,null,null,null,null,{"$f":"IFERROR(INDEX(LOTSALOTS,SMALL((IF(LEN(LOTSALOTS),ROW(INDIRECT(\"1:\"&ROWS(LOTSALOTS))))),ROW(A74)),1),\"\")","v":""}]
[null,null,null,null,null,{"$f":"IFERROR(INDEX(LOTSALOTS,SMALL((IF(LEN(LOTSALOTS),ROW(INDIRECT(\"1:\"&ROWS(LOTSALOTS))))),ROW(A75)),1),\"\")","v":""}]
[null,null,null,null,null,{"$f":"IFERROR(INDEX(LOTSALOTS,SMALL((IF(LEN(LOTSALOTS),ROW(INDIRECT(\"1:\"&ROWS(LOTSALOTS))))),ROW(A76)),1),\"\")","v":""}]
[null,null,null,null,null,{"$f":"IFERROR(INDEX(LOTSALOTS,SMALL((IF(LEN(LOTSALOTS),ROW(INDIRECT(\"1:\"&ROWS(LOTSALOTS))))),ROW(A77)),1),\"\")","v":""}]
[null,null,null,null,null,{"$f":"IFERROR(INDEX(LOTSALOTS,SMALL((IF(LEN(LOTSALOTS),ROW(INDIRECT(\"1:\"&ROWS(LOTSALOTS))))),ROW(A78)),1),\"\")","v":""}]
[null,null,null,null,null,{"$f":"IFERROR(INDEX(LOTSALOTS,SMALL((IF(LEN(LOTSALOTS),ROW(INDIRECT(\"1:\"&ROWS(LOTSALOTS))))),ROW(A79)),1),\"\")","v":""}]
{"$rows_left_out":23}
{"sheet":"DATA_CHART","index":3,"n_rows":403,"n_cols":15,"rows_kept":403,"cut":false,"hidden":true,"merged":[]}
[]
[null,null,"DOT","CON","LO","HI","ISBLANK","ISBLANK","ISBLANK","ISBLANK","ISERROR","ISERROR","ISERROR","ISERROR","Both blank?"]
[1,1.1000000000000001,null,null,null,null,null,null,null,null,null,null,null,null,{"$f":"AND(OR(ISBLANK(C3),ISERROR(C3)),OR(ISBLANK(D3),ISERROR(D3)))","v":true}]
[1,1.2,null,null,null,null,null,null,null,null,null,null,null,null,true]
[1,1.3,null,null,null,null,null,null,null,null,null,null,null,null,true]
[1,1.4,null,null,null,null,null,null,null,null,null,null,null,null,true]
[2,2.1,null,null,null,null,null,null,null,null,null,null,null,null,true]
[2,2.2000000000000002,null,null,null,null,null,null,null,null,null,null,null,null,true]
[2,2.2999999999999998,null,null,null,null,null,null,null,null,null,null,null,null,true]
[2,2.4,null,null,null,null,null,null,null,null,null,null,null,null,true]
[3,3.1,null,null,null,null,null,null,null,null,null,null,null,null,true]
[3,3.2,null,null,null,null,null,null,null,null,null,null,null,null,true]
[3,3.3,null,null,null,null,null,null,null,null,null,null,null,null,true]
[3,3.4,null,null,null,null,null,null,null,null,null,null,null,null,true]
[4,4.0999999999999996,null,null,null,null,null,null,null,null,null,null,null,null,true]
[4,4.2,null,null,null,null,null,null,null,null,null,null,null,null,true]
[4,4.3,null,null,null,null,null,null,null,null,null,null,null,null,true]
[4,4.4000000000000004,null,null,null,null,null,null,null,null,null,null,null,null,true]
[5,5.0999999999999996,null,null,null,null,null,null,null,null,null,null,null,null,true]
[5,5.2,null,null,null,null,null,null,null,null,null,null,null,null,true]
[5,5.3,null,null,null,null,null,null,null,null,null,null,null,null,true]
[5,5.4,null,null,null,null,null,null,null,null,null,null,null,null,true]
[6,6.1,null,null,null,null,null,null,null,null,null,null,null,null,true]
[6,6.2,null,null,null,null,null,null,null,null,null,null,null,null,true]
[6,6.3,null,null,null,null,null,null,null,null,null,null,null,null,true]
[6,6.4,null,null,null,null,null,null,null,null,null,null,null,null,true]
[7,7.1,null,null,null,null,null,null,null,null,null,null,null,null,true]
[7,7.2,null,null,null,null,null,null,null,null,null,null,null,null,true]
[7,7.3,null,null,null,null,null,null,null,null,null,null,null,null,true]
[7,7.4,null,null,null,null,null,null,null,null,null,null,null,null,true]
[8,8.1,null,null,null,null,null,null,null,null,null,null,null,null,true]
[8,8.1999999999999993,null,null,null,null,null,null,null,null,null,null,null,null,true]
[8,8.3000000000000007,null,null,null,null,null,null,null,null,null,null,null,null,true]
[8,8.4,null,null,null,null,null,null,null,null,null,null,null,null,true]
[9,9.1,null,null,null,null,null,null,null,null,null,null,null,null,true]
[9,9.1999999999999993,null,null,null,null,null,null,null,null,null,null,null,null,true]
[9,9.3000000000000007,null,null,null,null,null,null,null,null,null,null,null,null,true]
[9,9.4,null,null,null,null,null,null,null,null,null,null,null,null,true]
[10,10.1,null,null,null,null,null,null,null,null,null,null,null,null,true]
[10,10.199999999999999,null,null,null,null,null,null,null,null,null,null,null,null,true]
[10,10.3,null,null,null,null,null,null,null,null,null,null,null,null,true]
[10,10.4,null,null,null,null,null,null,null,null,null,null,null,null,true]
[11,11.1,null,null,null,null,null,null,null,null,null,null,null,null,true]
[11,11.2,null,null,null,null,null,null,null,null,null,null,null,null,true]
[11,11.3,null,null,null,null,null,null,null,null,null,null,null,null,true]
[11,11.4,null,null,null,null,null,null,null,null,null,null,null,null,true]
[12,12.1,null,null,null,null,null,null,null,null,null,null,null,null,true]
[12,12.2,null,null,null,null,null,null,null,null,null,null,null,null,true]
[12,12.3,null,null,null,null,null,null,null,null,null,null,null,null,true]
[12,12.4,null,null,null,null,null,null,null,null,null,null,null,null,true]
[13,13.1,null,null,null,null,null,null,null,null,null,null,null,null,true]
[13,13.2,null,null,null,null,null,null,null,null,null,null,null,null,true]
[13,13.3,null,null,null,null,null,null,null,null,null,null,null,null,true]
[13,13.4,null,null,null,null,null,null,null,null,null,null,null,null,true]
[14,14.1,null,null,null,null,null,null,null,null,null,null,null,null,true]
[14,14.2,null,null,null,null,null,null,null,null,null,null,null,null,true]
[14,14.3,null,null,null,null,null,null,null,null,null,null,null,null,true]
[14,14.4,null,null,null,null,null,null,null,null,null,null,null,null,true]
[15,15.1,null,null,null,null,null,null,null,null,null,null,null,null,true]
[15,15.2,null,null,null,null,null,null,null,null,null,null,null,null,true]
[15,15.3,null,null,null,null,null,null,null,null,null,null,null,null,true]
[15,15.4,null,null,null,null,null,null,null,null,null,null,null,null,true]
[16,16.100000000000001,null,null,null,null,null,null,null,null,null,null,null,null,true]
[16,16.2,null,null,null,null,null,null,null,null,null,null,null,null,true]
[16,16.3,null,null,null,null,null,null,null,null,null,null,null,null,true]
[16,16.399999999999999,null,null,null,null,null,null,null,null,null,null,null,null,true]
[17,17.100000000000001,null,null,null,null,null,null,null,null,null,null,null,null,{"$f":"AND(OR(ISBLANK(C67),ISERROR(C67)),OR(ISBLANK(D67),ISERROR(D67)))","v":true}]
[17,17.2,null,null,null,null,null,null,null,null,null,null,null,null,true]
[17,17.3,null,null,null,null,null,null,null,null,null,null,null,null,true]
[17,17.399999999999999,null,null,null,null,null,null,null,null,null,null,null,null,true]
[18,18.100000000000001,null,null,null,null,null,null,null,null,null,null,null,null,true]
[18,18.2,null,null,null,null,null,null,null,null,null,null,null,null,true]
[18,18.3,null,null,null,null,null,null,null,null,null,null,null,null,true]
[18,18.399999999999999,null,null,null,null,null,null,null,null,null,null,null,null,true]
[19,19.100000000000001,null,null,null,null,null,null,null,null,null,null,null,null,true]
[19,19.2,null,null,null,null,null,null,null,null,null,null,null,null,true]
[19,19.3,null,null,null,null,null,null,null,null,null,null,null,null,true]
[19,19.399999999999999,null,null,null,null,null,null,null,null,null,null,null,null,true]
[20,20.100000000000001,null,null,null,null,null,null,null,null,null,null,null,null,true]
[20,20.2,null,null,null,null,null,null,null,null,null,null,null,null,true]
{"$rows_left_out":323}