{"text_format":"1","workbook":"xlsx","n_sheets":3,"sheets":["Piling","Formulas","RX"],"not_rendered":{"charts":0,"images":1,"macros":1,"external_links":0,"defined_names":329,"comments":1,"pivot_tables":0},"unopened":[],"bounds":{"document_bytes":16777216,"sheet_cells":100000,"rows_first":2000,"rows_last":500,"rows_between":2000,"halvings":0,"cell_chars":16384,"cell_head_chars":4096},"cells_cut":0,"cells_raw":0,"read":"whole","date_system":"1900"}

{"sheet":"Piling","index":0,"n_rows":67,"n_cols":20,"rows_kept":67,"cut":false,"hidden":false,"merged":[[43,0,46,0],[22,7,22,9],[24,1,24,2],[24,3,24,7],[22,3,22,6],[30,13,30,14],[24,9,24,10],[36,13,36,14],[27,16,27,17],[27,13,27,14],[28,13,28,14],[29,13,29,14],[31,16,31,17],[32,13,32,14],[32,16,32,17],[31,13,31,14],[39,0,42,0],[27,0,30,0],[31,0,34,0],[35,0,38,0],[35,1,38,1],[35,2,38,2],[40,13,40,14],[29,16,29,17],[10,9,10,12],[12,5,12,8],[22,17,22,18],[24,16,24,18],[22,1,22,2],[22,11,22,12],[22,13,22,15],[24,11,24,15],[13,13,13,16],[15,5,15,16],[13,5,13,8],[20,6,20,7],[20,13,20,14],[16,13,16,16],[18,5,18,6],[18,7,18,8],[18,9,18,10],[18,14,18,16],[20,4,20,5],[15,1,15,4],[16,9,16,12],[20,2,20,3],[14,1,14,4],[14,5,14,16],[11,9,11,12],[12,9,12,12],[11,13,11,16],[10,5,10,8],[11,5,11,8],[12,13,12,16],[0,0,0,2],[0,4,0,5],[7,5,7,8],[8,5,8,8],[9,5,9,8],[7,1,7,4],[8,1,8,4],[9,1,9,4],[10,1,10,4],[11,1,11,4],[12,1,12,4],[7,13,7,16],[8,13,8,16],[9,13,9,16],[10,13,10,16],[7,9,7,12],[8,9,8,12],[9,9,9,12],[20,8,20,9],[31,1,34,1],[31,2,34,2],[50,9,50,12],[60,1,60,2],[60,3,60,8],[60,9,60,10],[27,2,30,2],[13,9,13,12],[13,1,13,4],[18,1,18,4],[50,4,50,7],[48,4,48,7],[27,1,30,1],[52,1,52,3],[35,3,38,3],[50,1,50,3],[39,1,42,1],[31,3,34,3],[16,1,16,4],[16,5,16,8],[20,10,20,12],[27,3,30,3],[33,16,33,17],[37,13,37,14],[38,13,38,14],[62,7,62,8],[62,1,62,6],[43,3,46,3],[49,1,49,3],[53,1,53,3],[51,1,51,3],[51,4,51,7],[53,4,53,7],[39,2,42,2],[39,3,42,3],[43,1,46,1],[43,2,46,2],[34,18,34,19],[36,18,36,19],[45,18,45,19],[46,18,46,19],[43,18,43,19],[44,16,44,17],[45,13,45,14],[45,16,45,17],[43,13,43,14],[42,16,42,17],[42,13,42,14],[39,13,39,14],[43,16,43,17],[46,13,46,14],[46,16,46,17],[44,13,44,14],[35,18,35,19],[40,18,40,19],[37,18,37,19],[38,18,38,19],[28,18,28,19],[31,18,31,19],[39,18,39,19],[66,1,66,6],[66,7,66,8],[56,1,57,15],[64,1,64,2],[64,3,64,4],[64,5,64,6],[49,4,49,7],[64,7,64,8],[62,11,62,16],[62,9,62,10],[51,9,51,12],[52,9,52,12],[52,13,52,18],[52,4,52,7],[59,9,59,10],[49,9,49,12],[50,13,50,18],[51,13,51,18],[42,18,42,19],[41,18,41,19],[33,13,33,14],[32,18,32,19],[33,18,33,19],[38,16,38,17],[26,18,26,19],[27,18,27,19],[44,18,44,19],[49,13,49,18],[48,13,48,18],[28,16,28,17],[30,16,30,17],[35,16,35,17],[40,16,40,17],[41,13,41,14],[41,16,41,17],[36,16,36,17],[34,16,34,17],[35,13,35,14],[34,13,34,14],[39,16,39,17],[37,16,37,17],[26,16,26,17],[26,13,26,14],[29,18,29,19],[30,18,30,19]]}
["TxDOT Manuals >"]
[null,"TEXAS DEPARTMENT OF TRANSPORTATION",null,null,null,null,null,null,null,null,null,null,null,null,null,null,null,null,null,275]
[null,null,null,null,null,null,null,null,null,null,null,null,null,null,null,null,null,null,null,1]
[null,null,null,null,null,null,null,null,null,null,null,null,null,null,null,null,null,null,null,"txplng.xlsm::45616.660556"]
[null,"Pile Record"]
[]
[null,null,null,null,null,null,null,null,null,null,null,null,null,null,null,null,{"$f":"\"File Version: \" & TEXT(MID(sn,SEARCH(\"::\",sn,1)+2,20),\"mm/dd/yy hh:mm:ss\")","v":"File Version: 11/20/24 15:51:12"}]
[null,"SAMPLE ID:",null,null,null,null,null,null,null,"SAMPLED DATE:"]
[null,"TEST NUMBER:",null,null,null,null,null,null,null,"LETTING DATE:"]
[null,"SAMPLE STATUS:",null,null,null,null,null,null,null,"CONTROLLING CSJ:"]
[null,"COUNTY:",null,null,null,null,null,null,null,"SPEC YEAR:"]
[null,"SAMPLED BY:",null,null,null,null,null,null,null,"SPEC ITEM:"]
[null,"SAMPLE LOCATION:",null,null,null,null,null,null,null,"SPECIAL PROVISION:"]
[null,"MATERIAL CODE:",null,null,null,null,null,null,null,"GRADE:"]
[null,"MATERIAL NAME:"]
[null,"PRODUCER:"]
[null,"AREA ENGINEER:",null,null,null,null,null,null,null,"PROJECT MANAGER:"]
[]
[null,"COURSE\\LIFT:",null,null,null,null,null,"STATION:",null,null,null,null,null,"DIST. FROM CL:"]
[]
[null,"CSJ:",null,null,"Pile Type:",null,null,null,"Structure Name:",null,null,null,null,"Structure #:"]
[]
[null,"Hammer Type:",null,null,null,null,null,"Ram Weight, (lbs.):",null,null,null,"Formula Used:",null,null,null,null,null,"K-factor:",null,{"$f":"IF($T$25<>\"\",$T$25,1)","v":1}]
[]
[null,"From station:",null,null,null,null,null,null,null,"To station:",null,null,null,null,null,null,"Adjusted K-factor:"]
[]
[null,"Bent No. ","Pile Size","Design Load Or Nominal Driving Resistance (tons)","Footing & pile No. Or Trestle Pile No.","Btm. of Ftg. Or Ground Elev. (Ft.)","Btm. of Pilot Hole Elev. (Ft.)","Approved Length (Ft.)","Date Driven","Actual Length Left in Place (Ft)","Length Cut-off (Ft.)","Buildup or Splice?","Pile Tip Elev. (Ft.)","Stoke Height (ft) or Energy of Hammer (ft-lbs)",null,"Penetration     (in/Blow)","Input Computed Resistance @ Actual Length (tons)",null,"Auto Computed Resistance @ Actual Length (tons)"]
[1,null,null,null,null,null,null,null,null,null,null,null,null,null,null,null,null,null,{"$f":"IF(P28=0,\"\",IF(FormulaUsed=\"2WH/S+.1\",(RamWeight*2*N28*K_factor/(P28+0.1))/2000,IF(FormulaUsed=\"2E/S+.1\",(2*N28*K_factor/(P28+0.1))/2000,IF(FormulaUsed=\"0.5(1.75sqrt(WH)log(10/S)-100)\",((1.75*SQRT(RamWeight*N28*K_factor)*LOG(10/P28))-100)/2,IF(FormulaUsed=\"0.5(1.75sqrt(E)log(10/S)-100)\",((1.75*SQRT(N28*K_factor)*LOG(10/P28))-100)/2,\"\")))))","v":""}]
[null,null,null,null,null,null,null,null,null,null,null,null,null,null,null,null,null,null,""]
[null,null,null,null,null,null,null,null,null,null,null,null,null,null,null,null,null,null,""]
[null,null,null,null,null,null,null,null,null,null,null,null,null,null,null,null,null,null,""]
[2,null,null,null,null,null,null,null,null,null,null,null,null,null,null,null,null,null,""]
[null,null,null,null,null,null,null,null,null,null,null,null,null,null,null,null,null,null,""]
[null,null,null,null,null,null,null,null,null,null,null,null,null,null,null,null,null,null,""]
[null,null,null,null,null,null,null,null,null,null,null,null,null,null,null,null,null,null,""]
[3,null,null,null,null,null,null,null,null,null,null,null,null,null,null,null,null,null,""]
[null,null,null,null,null,null,null,null,null,null,null,null,null,null,null,null,null,null,""]
[null,null,null,null,null,null,null,null,null,null,null,null,null,null,null,null,null,null,""]
[null,null,null,null,null,null,null,null,null,null,null,null,null,null,null,null,null,null,""]
[4,null,null,null,null,null,null,null,null,null,null,null,null,null,null,null,null,null,""]
[null,null,null,null,null,null,null,null,null,null,null,null,null,null,null,null,null,null,""]
[null,null,null,null,null,null,null,null,null,null,null,null,null,null,null,null,null,null,""]
[null,null,null,null,null,null,null,null,null,null,null,null,null,null,null,null,null,null,""]
[5,null,null,null,null,null,null,null,null,null,null,null,null,null,null,null,null,null,""]
[null,null,null,null,null,null,null,null,null,null,null,null,null,null,null,null,null,null,""]
[null,null,null,null,null,null,null,null,null,null,null,null,null,null,null,null,null,null,""]
[null,null,null,null,null,null,null,null,null,null,null,null,null,null,null,null,null,null,""]
[]
[null,null,null,null,"Cushion",null,null,null,null,null,null,null,null,"Total This Sheet - Req. Piling"]
[null,"Material Type:",null,null,null,null,null,null,null,"Piling(L.F.)",null,null,null,{"$f":"IF(SUM(J28:J31,J32:J35,J36:J39,J40:J43,J44:J46)=0,\"\",SUM(J28:J31,J32:J35,J36:J39,J40:J43,J44:J47))","v":""}]
[null,"Dimensions:",null,null,null,null,null,null,null,"Cut-off (L.F.)",null,null,null,{"$f":"IF(SUM(K28:K31,K32:K35,K36:K39,K40:K43,K44:K47)=0,\"\",SUM(K28:K31,K32:K35,K36:K39,K40:K43,K44:K47))","v":""}]
[null,"Thickness (in.):",null,null,null,null,null,null,null,"Build-UP (Ea.)",null,null,null,{"$f":"IF((COUNTIF((L28:L31),\"Y\")+COUNTIF(L32:L35,\"Y\")+COUNTIF(L36:L39,\"Y\")+COUNTIF(L40:L43,\"Y\")+COUNTIF(L44:L47,\"Y\"))=0,\"\",(COUNTIF((L28:L31),\"Y\")+COUNTIF(L32:L35,\"Y\")+COUNTIF(L36:L39,\"Y\")+COUNTIF(L40:L43,\"Y\")+COUNTIF(L44:L47,\"Y\")))","v":""}]
[null,"Direction Grain**:",null,null,null,null,null,null,null,"Pay Quantity (This Structure)"]
[null,"Pay Quantity (This Sheet):"]
[]
[null,"Remarks:",null,{"$f":"NOW()","v":"2024-11-20T15:51:12.230"}]
[]
[]
[]
[null,"Test Method:",null,"Tested By:",null,null,null,null,null,"Tested Date:"]
[null,"TXPLNG"]
[null,"Test Stamp Code:",null,null,null,null,null,"Omit Test:",null,"Completed Date:",null,"Reviewed By:"]
[]
[null,"Locked By:",null,"TxDOT:",null,"District:",null,"Area:"]
[]
[null,"Authorized By:",null,null,null,null,null,"Authorized Date:"]
[null,null,null,null,null,null,null,null,null,{"$f":"IF(OR(ISBLANK(AuthorizedDate),AuthorizedDate>45626),1,0)","v":1}]

{"sheet":"Formulas","index":1,"n_rows":7,"n_cols":2,"rows_kept":7,"cut":false,"hidden":true,"merged":[]}
["version0","version1"]
["2WH/S+.1","2WH/S+.1"]
["2E/S+.1","2E/S+.1"]
["Wave Equation","0.5(1.75sqrt(WH)log(10/S)-100)"]
["Other","0.5(1.75sqrt(E)log(10/S)-100)"]
[null,"Wave Equation"]
[null,"Other"]

{"sheet":"RX","index":2,"n_rows":300,"n_cols":19,"rows_kept":300,"cut":false,"hidden":true,"merged":[]}
[298]
["Fld_nbr","Value","Desc_1","Desc_2","Desc_3","Desc_4","Desc_5","Desc_6","Desc_7"]
[1,{"$f":"IF(Piling!$B$57=\"\",\"\",Piling!$B$57)","v":""},{"$f":"Piling!$B$56","v":"Remarks:"}]
[2,{"$f":"IF(Piling!$F$19=\"\",\"\",Piling!$F$19)","v":""},{"$f":"IF(Piling!$B$19=\"\",\"\",Piling!$B$19)","v":"COURSE\\LIFT:"}]
[3,{"$f":"IF(Piling!$C$21=\"\",\"\",Piling!$C$21)","v":""},{"$f":"IF( Piling!$B$5=\"\",\"\", Piling!$B$5)","v":"Pile Record"},{"$f":"IF(Piling!$B$21=\"\",\"\",Piling!$B$21)","v":"CSJ:"}]
[4,{"$f":"IF(Piling!$G$21=\"\",\"\",Piling!$G$21)","v":""},{"$f":"IF( Piling!$B$5=\"\",\"\", Piling!$B$5)","v":"Pile Record"},{"$f":"IF(Piling!$E$21=\"\",\"\",Piling!$E$21)","v":"Pile Type:"}]
[5,{"$f":"IF(Piling!$K$21=\"\",\"\",Piling!$K$21)","v":""},{"$f":"IF( Piling!$B$5=\"\",\"\", Piling!$B$5)","v":"Pile Record"},{"$f":"IF(Piling!$I$21=\"\",\"\",Piling!$I$21)","v":"Structure Name:"}]
[6,{"$f":"IF(Piling!$P$21=\"\",\"\",Piling!$P$21)","v":""},{"$f":"IF( Piling!$B$5=\"\",\"\", Piling!$B$5)","v":"Pile Record"},{"$f":"IF(Piling!$N$21=\"\",\"\",Piling!$N$21)","v":"Structure #:"}]
[7,{"$f":"IF(Piling!$D$23=\"\",\"\",Piling!$D$23)","v":""},{"$f":"IF( Piling!$B$5=\"\",\"\", Piling!$B$5)","v":"Pile Record"},{"$f":"IF(Piling!$B$23=\"\",\"\",Piling!$B$23)","v":"Hammer Type:"}]
[8,{"$f":"IF(Piling!$K$23=\"\",\"\",Piling!$K$23)","v":""},{"$f":"IF( Piling!$B$5=\"\",\"\", Piling!$B$5)","v":"Pile Record"},{"$f":"IF(Piling!$H$23=\"\",\"\",Piling!$H$23)","v":"Ram Weight, (lbs.):"}]
[9,{"$f":"IF(Piling!$N$23=\"\",\"\",Piling!$N$23)","v":""},{"$f":"IF( Piling!$B$5=\"\",\"\", Piling!$B$5)","v":"Pile Record"},{"$f":"IF(Piling!$L$23=\"\",\"\",Piling!$L$23)","v":"Formula Used:"}]
[10,{"$f":"IF(Piling!$D$25=\"\",\"\",Piling!$D$25)","v":""},{"$f":"IF( Piling!$B$5=\"\",\"\", Piling!$B$5)","v":"Pile Record"},{"$f":"IF(Piling!$B$25=\"\",\"\",Piling!$B$25)","v":"From station:"}]
[11,{"$f":"IF(Piling!$L$25=\"\",\"\",Piling!$L$25)","v":""},{"$f":"IF( Piling!$B$5=\"\",\"\", Piling!$B$5)","v":"Pile Record"},{"$f":"IF(Piling!$J$25=\"\",\"\",Piling!$J$25)","v":"To station:"}]
[12,{"$f":"IF(Piling!$B$28=\"\",\"\",Piling!$B$28)","v":""},{"$f":"IF( Piling!$B$5=\"\",\"\", Piling!$B$5)","v":"Pile Record"},{"$f":"IF(Piling!$B$27=\"\",\"\",Piling!$B$27)","v":"Bent No. "},{"$f":"IF(Piling!$A$28=\"\",\"\",Piling!$A$28)","v":1}]
[13,{"$f":"IF(Piling!$B$32=\"\",\"\",Piling!$B$32)","v":""},{"$f":"IF( Piling!$B$5=\"\",\"\", Piling!$B$5)","v":"Pile Record"},{"$f":"IF(Piling!$B$27=\"\",\"\",Piling!$B$27)","v":"Bent No. "},{"$f":"IF(Piling!$A$32=\"\",\"\",Piling!$A$32)","v":2}]
[14,{"$f":"IF(Piling!$B$36=\"\",\"\",Piling!$B$36)","v":""},{"$f":"IF( Piling!$B$5=\"\",\"\", Piling!$B$5)","v":"Pile Record"},{"$f":"IF(Piling!$B$27=\"\",\"\",Piling!$B$27)","v":"Bent No. "},{"$f":"IF(Piling!$A$36=\"\",\"\",Piling!$A$36)","v":3}]
[15,{"$f":"IF(Piling!$B$40=\"\",\"\",Piling!$B$40)","v":""},{"$f":"IF( Piling!$B$5=\"\",\"\", Piling!$B$5)","v":"Pile Record"},{"$f":"IF(Piling!$B$27=\"\",\"\",Piling!$B$27)","v":"Bent No. "},{"$f":"IF(Piling!$A$40=\"\",\"\",Piling!$A$40)","v":4}]
[16,{"$f":"IF(Piling!$B$44=\"\",\"\",Piling!$B$44)","v":""},{"$f":"IF( Piling!$B$5=\"\",\"\", Piling!$B$5)","v":"Pile Record"},{"$f":"IF(Piling!$B$27=\"\",\"\",Piling!$B$27)","v":"Bent No. "},{"$f":"IF(Piling!$A$44=\"\",\"\",Piling!$A$44)","v":5}]
[17,{"$f":"IF(Piling!$C$28=\"\",\"\",Piling!$C$28)","v":""},{"$f":"IF( Piling!$B$5=\"\",\"\", Piling!$B$5)","v":"Pile Record"},{"$f":"IF(Piling!$C$27=\"\",\"\",Piling!$C$27)","v":"Pile Size"},{"$f":"IF(Piling!$A$28=\"\",\"\",Piling!$A$28)","v":1}]
[18,{"$f":"IF(Piling!$C$32=\"\",\"\",Piling!$C$32)","v":""},{"$f":"IF( Piling!$B$5=\"\",\"\", Piling!$B$5)","v":"Pile Record"},{"$f":"IF(Piling!$C$27=\"\",\"\",Piling!$C$27)","v":"Pile Size"},{"$f":"IF(Piling!$A$32=\"\",\"\",Piling!$A$32)","v":2}]
[19,{"$f":"IF(Piling!$C$36=\"\",\"\",Piling!$C$36)","v":""},{"$f":"IF( Piling!$B$5=\"\",\"\", Piling!$B$5)","v":"Pile Record"},{"$f":"IF(Piling!$C$27=\"\",\"\",Piling!$C$27)","v":"Pile Size"},{"$f":"IF(Piling!$A$36=\"\",\"\",Piling!$A$36)","v":3}]
[20,{"$f":"IF(Piling!$C$40=\"\",\"\",Piling!$C$40)","v":""},{"$f":"IF( Piling!$B$5=\"\",\"\", Piling!$B$5)","v":"Pile Record"},{"$f":"IF(Piling!$C$27=\"\",\"\",Piling!$C$27)","v":"Pile Size"},{"$f":"IF(Piling!$A$40=\"\",\"\",Piling!$A$40)","v":4}]
[21,{"$f":"IF(Piling!$C$44=\"\",\"\",Piling!$C$44)","v":""},{"$f":"IF( Piling!$B$5=\"\",\"\", Piling!$B$5)","v":"Pile Record"},{"$f":"IF(Piling!$C$27=\"\",\"\",Piling!$C$27)","v":"Pile Size"},{"$f":"IF(Piling!$A$44=\"\",\"\",Piling!$A$44)","v":5}]
[22,{"$f":"IF(Piling!$D$28=\"\",\"\",Piling!$D$28)","v":""},{"$f":"IF( Piling!$B$5=\"\",\"\", Piling!$B$5)","v":"Pile Record"},{"$f":"IF(Piling!$D$27=\"\",\"\",Piling!$D$27)","v":"Design Load Or Nominal Driving Resistance (tons)"},{"$f":"IF(Piling!$A$28=\"\",\"\",Piling!$A$28)","v":1}]
[23,{"$f":"IF(Piling!$D$32=\"\",\"\",Piling!$D$32)","v":""},{"$f":"IF( Piling!$B$5=\"\",\"\", Piling!$B$5)","v":"Pile Record"},{"$f":"IF(Piling!$D$27=\"\",\"\",Piling!$D$27)","v":"Design Load Or Nominal Driving Resistance (tons)"},{"$f":"IF(Piling!$A$32=\"\",\"\",Piling!$A$32)","v":2}]
[24,{"$f":"IF(Piling!$D$36=\"\",\"\",Piling!$D$36)","v":""},{"$f":"IF( Piling!$B$5=\"\",\"\", Piling!$B$5)","v":"Pile Record"},{"$f":"IF(Piling!$D$27=\"\",\"\",Piling!$D$27)","v":"Design Load Or Nominal Driving Resistance (tons)"},{"$f":"IF(Piling!$A$36=\"\",\"\",Piling!$A$36)","v":3}]
[25,{"$f":"IF(Piling!$D$40=\"\",\"\",Piling!$D$40)","v":""},{"$f":"IF( Piling!$B$5=\"\",\"\", Piling!$B$5)","v":"Pile Record"},{"$f":"IF(Piling!$D$27=\"\",\"\",Piling!$D$27)","v":"Design Load Or Nominal Driving Resistance (tons)"},{"$f":"IF(Piling!$A$40=\"\",\"\",Piling!$A$40)","v":4}]
[26,{"$f":"IF(Piling!$D$44=\"\",\"\",Piling!$D$44)","v":""},{"$f":"IF( Piling!$B$5=\"\",\"\", Piling!$B$5)","v":"Pile Record"},{"$f":"IF(Piling!$D$27=\"\",\"\",Piling!$D$27)","v":"Design Load Or Nominal Driving Resistance (tons)"},{"$f":"IF(Piling!$A$44=\"\",\"\",Piling!$A$44)","v":5}]
[27,{"$f":"IF(Piling!$E$28=\"\",\"\",Piling!$E$28)","v":""},{"$f":"IF( Piling!$B$5=\"\",\"\", Piling!$B$5)","v":"Pile Record"},{"$f":"IF(Piling!$E$27=\"\",\"\",Piling!$E$27)","v":"Footing & pile No. Or Trestle Pile No."},{"$f":"IF(Piling!$A$28=\"\",\"\",Piling!$A$28)","v":1}]
[28,{"$f":"IF(Piling!$E$29=\"\",\"\",Piling!$E$29)","v":""},{"$f":"IF( Piling!$B$5=\"\",\"\", Piling!$B$5)","v":"Pile Record"},{"$f":"IF(Piling!$E$27=\"\",\"\",Piling!$E$27)","v":"Footing & pile No. Or Trestle Pile No."},{"$f":"IF(Piling!$A$28=\"\",\"\",Piling!$A$28)","v":1}]
[29,{"$f":"IF(Piling!$E$30=\"\",\"\",Piling!$E$30)","v":""},{"$f":"IF( Piling!$B$5=\"\",\"\", Piling!$B$5)","v":"Pile Record"},{"$f":"IF(Piling!$E$27=\"\",\"\",Piling!$E$27)","v":"Footing & pile No. Or Trestle Pile No."},{"$f":"IF(Piling!$A$28=\"\",\"\",Piling!$A$28)","v":1},null,null,null,null,null,null,null,null,null,null,null,null,null,{"$f":"IF(P31=0,\"\",IF(FormulaUsed=\"2WH/S+.1\",(RamWeight*2*N31*K_factor/(P31+0.1))/2000,IF(FormulaUsed=\"2E/S+.1\",(2*N31*K_factor/(P31+0.1))/2000,\"\")))","v":""}]
[30,{"$f":"IF(Piling!$E$31=\"\",\"\",Piling!$E$31)","v":""},{"$f":"IF( Piling!$B$5=\"\",\"\", Piling!$B$5)","v":"Pile Record"},{"$f":"IF(Piling!$E$27=\"\",\"\",Piling!$E$27)","v":"Footing & pile No. Or Trestle Pile No."},{"$f":"IF(Piling!$A$28=\"\",\"\",Piling!$A$28)","v":1}]
[31,{"$f":"IF(Piling!$E$32=\"\",\"\",Piling!$E$32)","v":""},{"$f":"IF( Piling!$B$5=\"\",\"\", Piling!$B$5)","v":"Pile Record"},{"$f":"IF(Piling!$E$27=\"\",\"\",Piling!$E$27)","v":"Footing & pile No. Or Trestle Pile No."},{"$f":"IF(Piling!$A$32=\"\",\"\",Piling!$A$32)","v":2}]
[32,{"$f":"IF(Piling!$E$33=\"\",\"\",Piling!$E$33)","v":""},{"$f":"IF( Piling!$B$5=\"\",\"\", Piling!$B$5)","v":"Pile Record"},{"$f":"IF(Piling!$E$27=\"\",\"\",Piling!$E$27)","v":"Footing & pile No. Or Trestle Pile No."},{"$f":"IF(Piling!$A$32=\"\",\"\",Piling!$A$32)","v":2}]
[33,{"$f":"IF(Piling!$E$34=\"\",\"\",Piling!$E$34)","v":""},{"$f":"IF( Piling!$B$5=\"\",\"\", Piling!$B$5)","v":"Pile Record"},{"$f":"IF(Piling!$E$27=\"\",\"\",Piling!$E$27)","v":"Footing & pile No. Or Trestle Pile No."},{"$f":"IF(Piling!$A$32=\"\",\"\",Piling!$A$32)","v":2}]
[34,{"$f":"IF(Piling!$E$35=\"\",\"\",Piling!$E$35)","v":""},{"$f":"IF( Piling!$B$5=\"\",\"\", Piling!$B$5)","v":"Pile Record"},{"$f":"IF(Piling!$E$27=\"\",\"\",Piling!$E$27)","v":"Footing & pile No. Or Trestle Pile No."},{"$f":"IF(Piling!$A$32=\"\",\"\",Piling!$A$32)","v":2}]
[35,{"$f":"IF(Piling!$E$36=\"\",\"\",Piling!$E$36)","v":""},{"$f":"IF( Piling!$B$5=\"\",\"\", Piling!$B$5)","v":"Pile Record"},{"$f":"IF(Piling!$E$27=\"\",\"\",Piling!$E$27)","v":"Footing & pile No. Or Trestle Pile No."},{"$f":"IF(Piling!$A$36=\"\",\"\",Piling!$A$36)","v":3}]
[36,{"$f":"IF(Piling!$E$37=\"\",\"\",Piling!$E$37)","v":""},{"$f":"IF( Piling!$B$5=\"\",\"\", Piling!$B$5)","v":"Pile Record"},{"$f":"IF(Piling!$E$27=\"\",\"\",Piling!$E$27)","v":"Footing & pile No. Or Trestle Pile No."},{"$f":"IF(Piling!$A$36=\"\",\"\",Piling!$A$36)","v":3}]
[37,{"$f":"IF(Piling!$E$38=\"\",\"\",Piling!$E$38)","v":""},{"$f":"IF( Piling!$B$5=\"\",\"\", Piling!$B$5)","v":"Pile Record"},{"$f":"IF(Piling!$E$27=\"\",\"\",Piling!$E$27)","v":"Footing & pile No. Or Trestle Pile No."},{"$f":"IF(Piling!$A$36=\"\",\"\",Piling!$A$36)","v":3}]
[38,{"$f":"IF(Piling!$E$39=\"\",\"\",Piling!$E$39)","v":""},{"$f":"IF( Piling!$B$5=\"\",\"\", Piling!$B$5)","v":"Pile Record"},{"$f":"IF(Piling!$E$27=\"\",\"\",Piling!$E$27)","v":"Footing & pile No. Or Trestle Pile No."},{"$f":"IF(Piling!$A$36=\"\",\"\",Piling!$A$36)","v":3}]
[39,{"$f":"IF(Piling!$E$40=\"\",\"\",Piling!$E$40)","v":""},{"$f":"IF( Piling!$B$5=\"\",\"\", Piling!$B$5)","v":"Pile Record"},{"$f":"IF(Piling!$E$27=\"\",\"\",Piling!$E$27)","v":"Footing & pile No. Or Trestle Pile No."},{"$f":"IF(Piling!$A$40=\"\",\"\",Piling!$A$40)","v":4}]
[40,{"$f":"IF(Piling!$E$41=\"\",\"\",Piling!$E$41)","v":""},{"$f":"IF( Piling!$B$5=\"\",\"\", Piling!$B$5)","v":"Pile Record"},{"$f":"IF(Piling!$E$27=\"\",\"\",Piling!$E$27)","v":"Footing & pile No. Or Trestle Pile No."},{"$f":"IF(Piling!$A$40=\"\",\"\",Piling!$A$40)","v":4}]
[41,{"$f":"IF(Piling!$E$42=\"\",\"\",Piling!$E$42)","v":""},{"$f":"IF( Piling!$B$5=\"\",\"\", Piling!$B$5)","v":"Pile Record"},{"$f":"IF(Piling!$E$27=\"\",\"\",Piling!$E$27)","v":"Footing & pile No. Or Trestle Pile No."},{"$f":"IF(Piling!$A$40=\"\",\"\",Piling!$A$40)","v":4}]
[42,{"$f":"IF(Piling!$E$43=\"\",\"\",Piling!$E$43)","v":""},{"$f":"IF( Piling!$B$5=\"\",\"\", Piling!$B$5)","v":"Pile Record"},{"$f":"IF(Piling!$E$27=\"\",\"\",Piling!$E$27)","v":"Footing & pile No. Or Trestle Pile No."},{"$f":"IF(Piling!$A$40=\"\",\"\",Piling!$A$40)","v":4}]
[43,{"$f":"IF(Piling!$E$44=\"\",\"\",Piling!$E$44)","v":""},{"$f":"IF( Piling!$B$5=\"\",\"\", Piling!$B$5)","v":"Pile Record"},{"$f":"IF(Piling!$E$27=\"\",\"\",Piling!$E$27)","v":"Footing & pile No. Or Trestle Pile No."},{"$f":"IF(Piling!$A$44=\"\",\"\",Piling!$A$44)","v":5}]
[44,{"$f":"IF(Piling!$E$45=\"\",\"\",Piling!$E$45)","v":""},{"$f":"IF( Piling!$B$5=\"\",\"\", Piling!$B$5)","v":"Pile Record"},{"$f":"IF(Piling!$E$27=\"\",\"\",Piling!$E$27)","v":"Footing & pile No. Or Trestle Pile No."},{"$f":"IF(Piling!$A$44=\"\",\"\",Piling!$A$44)","v":5}]
[45,{"$f":"IF(Piling!$E$46=\"\",\"\",Piling!$E$46)","v":""},{"$f":"IF( Piling!$B$5=\"\",\"\", Piling!$B$5)","v":"Pile Record"},{"$f":"IF(Piling!$E$27=\"\",\"\",Piling!$E$27)","v":"Footing & pile No. Or Trestle Pile No."},{"$f":"IF(Piling!$A$44=\"\",\"\",Piling!$A$44)","v":5}]
[46,{"$f":"IF(Piling!$E$47=\"\",\"\",Piling!$E$47)","v":""},{"$f":"IF( Piling!$B$5=\"\",\"\", Piling!$B$5)","v":"Pile Record"},{"$f":"IF(Piling!$E$27=\"\",\"\",Piling!$E$27)","v":"Footing & pile No. Or Trestle Pile No."},{"$f":"IF(Piling!$A$44=\"\",\"\",Piling!$A$44)","v":5}]
[47,{"$f":"IF(Piling!$F$28=\"\",\"\",Piling!$F$28)","v":""},{"$f":"IF( Piling!$B$5=\"\",\"\", Piling!$B$5)","v":"Pile Record"},{"$f":"IF(Piling!$F$27=\"\",\"\",Piling!$F$27)","v":"Btm. of Ftg. Or Ground Elev. (Ft.)"},{"$f":"IF(Piling!$A$28=\"\",\"\",Piling!$A$28)","v":1}]
[48,{"$f":"IF(Piling!$F$29=\"\",\"\",Piling!$F$29)","v":""},{"$f":"IF( Piling!$B$5=\"\",\"\", Piling!$B$5)","v":"Pile Record"},{"$f":"IF(Piling!$F$27=\"\",\"\",Piling!$F$27)","v":"Btm. of Ftg. Or Ground Elev. (Ft.)"},{"$f":"IF(Piling!$A$28=\"\",\"\",Piling!$A$28)","v":1}]
[49,{"$f":"IF(Piling!$F$30=\"\",\"\",Piling!$F$30)","v":""},{"$f":"IF( Piling!$B$5=\"\",\"\", Piling!$B$5)","v":"Pile Record"},{"$f":"IF(Piling!$F$27=\"\",\"\",Piling!$F$27)","v":"Btm. of Ftg. Or Ground Elev. (Ft.)"},{"$f":"IF(Piling!$A$28=\"\",\"\",Piling!$A$28)","v":1}]
[50,{"$f":"IF(Piling!$F$31=\"\",\"\",Piling!$F$31)","v":""},{"$f":"IF( Piling!$B$5=\"\",\"\", Piling!$B$5)","v":"Pile Record"},{"$f":"IF(Piling!$F$27=\"\",\"\",Piling!$F$27)","v":"Btm. of Ftg. Or Ground Elev. (Ft.)"},{"$f":"IF(Piling!$A$28=\"\",\"\",Piling!$A$28)","v":1}]
[51,{"$f":"IF(Piling!$F$32=\"\",\"\",Piling!$F$32)","v":""},{"$f":"IF( Piling!$B$5=\"\",\"\", Piling!$B$5)","v":"Pile Record"},{"$f":"IF(Piling!$F$27=\"\",\"\",Piling!$F$27)","v":"Btm. of Ftg. Or Ground Elev. (Ft.)"},{"$f":"IF(Piling!$A$32=\"\",\"\",Piling!$A$32)","v":2}]
[52,{"$f":"IF(Piling!$F$33=\"\",\"\",Piling!$F$33)","v":""},{"$f":"IF( Piling!$B$5=\"\",\"\", Piling!$B$5)","v":"Pile Record"},{"$f":"IF(Piling!$F$27=\"\",\"\",Piling!$F$27)","v":"Btm. of Ftg. Or Ground Elev. (Ft.)"},{"$f":"IF(Piling!$A$32=\"\",\"\",Piling!$A$32)","v":2}]
[53,{"$f":"IF(Piling!$F$34=\"\",\"\",Piling!$F$34)","v":""},{"$f":"IF( Piling!$B$5=\"\",\"\", Piling!$B$5)","v":"Pile Record"},{"$f":"IF(Piling!$F$27=\"\",\"\",Piling!$F$27)","v":"Btm. of Ftg. Or Ground Elev. (Ft.)"},{"$f":"IF(Piling!$A$32=\"\",\"\",Piling!$A$32)","v":2}]
[54,{"$f":"IF(Piling!$F$35=\"\",\"\",Piling!$F$35)","v":""},{"$f":"IF( Piling!$B$5=\"\",\"\", Piling!$B$5)","v":"Pile Record"},{"$f":"IF(Piling!$F$27=\"\",\"\",Piling!$F$27)","v":"Btm. of Ftg. Or Ground Elev. (Ft.)"},{"$f":"IF(Piling!$A$32=\"\",\"\",Piling!$A$32)","v":2}]
[55,{"$f":"IF(Piling!$F$36=\"\",\"\",Piling!$F$36)","v":""},{"$f":"IF( Piling!$B$5=\"\",\"\", Piling!$B$5)","v":"Pile Record"},{"$f":"IF(Piling!$F$27=\"\",\"\",Piling!$F$27)","v":"Btm. of Ftg. Or Ground Elev. (Ft.)"},{"$f":"IF(Piling!$A$36=\"\",\"\",Piling!$A$36)","v":3}]
[56,{"$f":"IF(Piling!$F$37=\"\",\"\",Piling!$F$37)","v":""},{"$f":"IF( Piling!$B$5=\"\",\"\", Piling!$B$5)","v":"Pile Record"},{"$f":"IF(Piling!$F$27=\"\",\"\",Piling!$F$27)","v":"Btm. of Ftg. Or Ground Elev. (Ft.)"},{"$f":"IF(Piling!$A$36=\"\",\"\",Piling!$A$36)","v":3}]
[57,{"$f":"IF(Piling!$F$38=\"\",\"\",Piling!$F$38)","v":""},{"$f":"IF( Piling!$B$5=\"\",\"\", Piling!$B$5)","v":"Pile Record"},{"$f":"IF(Piling!$F$27=\"\",\"\",Piling!$F$27)","v":"Btm. of Ftg. Or Ground Elev. (Ft.)"},{"$f":"IF(Piling!$A$36=\"\",\"\",Piling!$A$36)","v":3}]
[58,{"$f":"IF(Piling!$F$39=\"\",\"\",Piling!$F$39)","v":""},{"$f":"IF( Piling!$B$5=\"\",\"\", Piling!$B$5)","v":"Pile Record"},{"$f":"IF(Piling!$F$27=\"\",\"\",Piling!$F$27)","v":"Btm. of Ftg. Or Ground Elev. (Ft.)"},{"$f":"IF(Piling!$A$36=\"\",\"\",Piling!$A$36)","v":3}]
[59,{"$f":"IF(Piling!$F$40=\"\",\"\",Piling!$F$40)","v":""},{"$f":"IF( Piling!$B$5=\"\",\"\", Piling!$B$5)","v":"Pile Record"},{"$f":"IF(Piling!$F$27=\"\",\"\",Piling!$F$27)","v":"Btm. of Ftg. Or Ground Elev. (Ft.)"},{"$f":"IF(Piling!$A$40=\"\",\"\",Piling!$A$40)","v":4}]
[60,{"$f":"IF(Piling!$F$41=\"\",\"\",Piling!$F$41)","v":""},{"$f":"IF( Piling!$B$5=\"\",\"\", Piling!$B$5)","v":"Pile Record"},{"$f":"IF(Piling!$F$27=\"\",\"\",Piling!$F$27)","v":"Btm. of Ftg. Or Ground Elev. (Ft.)"},{"$f":"IF(Piling!$A$40=\"\",\"\",Piling!$A$40)","v":4}]
[61,{"$f":"IF(Piling!$F$42=\"\",\"\",Piling!$F$42)","v":""},{"$f":"IF( Piling!$B$5=\"\",\"\", Piling!$B$5)","v":"Pile Record"},{"$f":"IF(Piling!$F$27=\"\",\"\",Piling!$F$27)","v":"Btm. of Ftg. Or Ground Elev. (Ft.)"},{"$f":"IF(Piling!$A$40=\"\",\"\",Piling!$A$40)","v":4}]
[62,{"$f":"IF(Piling!$F$43=\"\",\"\",Piling!$F$43)","v":""},{"$f":"IF( Piling!$B$5=\"\",\"\", Piling!$B$5)","v":"Pile Record"},{"$f":"IF(Piling!$F$27=\"\",\"\",Piling!$F$27)","v":"Btm. of Ftg. Or Ground Elev. (Ft.)"},{"$f":"IF(Piling!$A$40=\"\",\"\",Piling!$A$40)","v":4}]
[63,{"$f":"IF(Piling!$F$44=\"\",\"\",Piling!$F$44)","v":""},{"$f":"IF( Piling!$B$5=\"\",\"\", Piling!$B$5)","v":"Pile Record"},{"$f":"IF(Piling!$F$27=\"\",\"\",Piling!$F$27)","v":"Btm. of Ftg. Or Ground Elev. (Ft.)"},{"$f":"IF(Piling!$A$44=\"\",\"\",Piling!$A$44)","v":5}]
[64,{"$f":"IF(Piling!$F$45=\"\",\"\",Piling!$F$45)","v":""},{"$f":"IF( Piling!$B$5=\"\",\"\", Piling!$B$5)","v":"Pile Record"},{"$f":"IF(Piling!$F$27=\"\",\"\",Piling!$F$27)","v":"Btm. of Ftg. Or Ground Elev. (Ft.)"},{"$f":"IF(Piling!$A$44=\"\",\"\",Piling!$A$44)","v":5}]
[65,{"$f":"IF(Piling!$F$46=\"\",\"\",Piling!$F$46)","v":""},{"$f":"IF( Piling!$B$5=\"\",\"\", Piling!$B$5)","v":"Pile Record"},{"$f":"IF(Piling!$F$27=\"\",\"\",Piling!$F$27)","v":"Btm. of Ftg. Or Ground Elev. (Ft.)"},{"$f":"IF(Piling!$A$44=\"\",\"\",Piling!$A$44)","v":5}]
[66,{"$f":"IF(Piling!$F$47=\"\",\"\",Piling!$F$47)","v":""},{"$f":"IF( Piling!$B$5=\"\",\"\", Piling!$B$5)","v":"Pile Record"},{"$f":"IF(Piling!$F$27=\"\",\"\",Piling!$F$27)","v":"Btm. of Ftg. Or Ground Elev. (Ft.)"},{"$f":"IF(Piling!$A$44=\"\",\"\",Piling!$A$44)","v":5}]
[67,{"$f":"IF(Piling!$G$28=\"\",\"\",Piling!$G$28)","v":""},{"$f":"IF( Piling!$B$5=\"\",\"\", Piling!$B$5)","v":"Pile Record"},{"$f":"IF(Piling!$G$27=\"\",\"\",Piling!$G$27)","v":"Btm. of Pilot Hole Elev. (Ft.)"},{"$f":"IF(Piling!$A$28=\"\",\"\",Piling!$A$28)","v":1}]
[68,{"$f":"IF(Piling!$G$29=\"\",\"\",Piling!$G$29)","v":""},{"$f":"IF( Piling!$B$5=\"\",\"\", Piling!$B$5)","v":"Pile Record"},{"$f":"IF(Piling!$G$27=\"\",\"\",Piling!$G$27)","v":"Btm. of Pilot Hole Elev. (Ft.)"},{"$f":"IF(Piling!$A$28=\"\",\"\",Piling!$A$28)","v":1}]
[69,{"$f":"IF(Piling!$G$30=\"\",\"\",Piling!$G$30)","v":""},{"$f":"IF( Piling!$B$5=\"\",\"\", Piling!$B$5)","v":"Pile Record"},{"$f":"IF(Piling!$G$27=\"\",\"\",Piling!$G$27)","v":"Btm. of Pilot Hole Elev. (Ft.)"},{"$f":"IF(Piling!$A$28=\"\",\"\",Piling!$A$28)","v":1}]
[70,{"$f":"IF(Piling!$G$31=\"\",\"\",Piling!$G$31)","v":""},{"$f":"IF( Piling!$B$5=\"\",\"\", Piling!$B$5)","v":"Pile Record"},{"$f":"IF(Piling!$G$27=\"\",\"\",Piling!$G$27)","v":"Btm. of Pilot Hole Elev. (Ft.)"},{"$f":"IF(Piling!$A$28=\"\",\"\",Piling!$A$28)","v":1}]
[71,{"$f":"IF(Piling!$G$32=\"\",\"\",Piling!$G$32)","v":""},{"$f":"IF( Piling!$B$5=\"\",\"\", Piling!$B$5)","v":"Pile Record"},{"$f":"IF(Piling!$G$27=\"\",\"\",Piling!$G$27)","v":"Btm. of Pilot Hole Elev. (Ft.)"},{"$f":"IF(Piling!$A$32=\"\",\"\",Piling!$A$32)","v":2}]
[72,{"$f":"IF(Piling!$G$33=\"\",\"\",Piling!$G$33)","v":""},{"$f":"IF( Piling!$B$5=\"\",\"\", Piling!$B$5)","v":"Pile Record"},{"$f":"IF(Piling!$G$27=\"\",\"\",Piling!$G$27)","v":"Btm. of Pilot Hole Elev. (Ft.)"},{"$f":"IF(Piling!$A$32=\"\",\"\",Piling!$A$32)","v":2}]
[73,{"$f":"IF(Piling!$G$34=\"\",\"\",Piling!$G$34)","v":""},{"$f":"IF( Piling!$B$5=\"\",\"\", Piling!$B$5)","v":"Pile Record"},{"$f":"IF(Piling!$G$27=\"\",\"\",Piling!$G$27)","v":"Btm. of Pilot Hole Elev. (Ft.)"},{"$f":"IF(Piling!$A$32=\"\",\"\",Piling!$A$32)","v":2}]
[74,{"$f":"IF(Piling!$G$35=\"\",\"\",Piling!$G$35)","v":""},{"$f":"IF( Piling!$B$5=\"\",\"\", Piling!$B$5)","v":"Pile Record"},{"$f":"IF(Piling!$G$27=\"\",\"\",Piling!$G$27)","v":"Btm. of Pilot Hole Elev. (Ft.)"},{"$f":"IF(Piling!$A$32=\"\",\"\",Piling!$A$32)","v":2}]
[75,{"$f":"IF(Piling!$G$36=\"\",\"\",Piling!$G$36)","v":""},{"$f":"IF( Piling!$B$5=\"\",\"\", Piling!$B$5)","v":"Pile Record"},{"$f":"IF(Piling!$G$27=\"\",\"\",Piling!$G$27)","v":"Btm. of Pilot Hole Elev. (Ft.)"},{"$f":"IF(Piling!$A$36=\"\",\"\",Piling!$A$36)","v":3}]
[76,{"$f":"IF(Piling!$G$37=\"\",\"\",Piling!$G$37)","v":""},{"$f":"IF( Piling!$B$5=\"\",\"\", Piling!$B$5)","v":"Pile Record"},{"$f":"IF(Piling!$G$27=\"\",\"\",Piling!$G$27)","v":"Btm. of Pilot Hole Elev. (Ft.)"},{"$f":"IF(Piling!$A$36=\"\",\"\",Piling!$A$36)","v":3}]
[77,{"$f":"IF(Piling!$G$38=\"\",\"\",Piling!$G$38)","v":""},{"$f":"IF( Piling!$B$5=\"\",\"\", Piling!$B$5)","v":"Pile Record"},{"$f":"IF(Piling!$G$27=\"\",\"\",Piling!$G$27)","v":"Btm. of Pilot Hole Elev. (Ft.)"},{"$f":"IF(Piling!$A$36=\"\",\"\",Piling!$A$36)","v":3}]
[78,{"$f":"IF(Piling!$G$39=\"\",\"\",Piling!$G$39)","v":""},{"$f":"IF( Piling!$B$5=\"\",\"\", Piling!$B$5)","v":"Pile Record"},{"$f":"IF(Piling!$G$27=\"\",\"\",Piling!$G$27)","v":"Btm. of Pilot Hole Elev. (Ft.)"},{"$f":"IF(Piling!$A$36=\"\",\"\",Piling!$A$36)","v":3}]
[79,{"$f":"IF(Piling!$G$40=\"\",\"\",Piling!$G$40)","v":""},{"$f":"IF( Piling!$B$5=\"\",\"\", Piling!$B$5)","v":"Pile Record"},{"$f":"IF(Piling!$G$27=\"\",\"\",Piling!$G$27)","v":"Btm. of Pilot Hole Elev. (Ft.)"},{"$f":"IF(Piling!$A$40=\"\",\"\",Piling!$A$40)","v":4}]
[80,{"$f":"IF(Piling!$G$41=\"\",\"\",Piling!$G$41)","v":""},{"$f":"IF( Piling!$B$5=\"\",\"\", Piling!$B$5)","v":"Pile Record"},{"$f":"IF(Piling!$G$27=\"\",\"\",Piling!$G$27)","v":"Btm. of Pilot Hole Elev. (Ft.)"},{"$f":"IF(Piling!$A$40=\"\",\"\",Piling!$A$40)","v":4}]
[81,{"$f":"IF(Piling!$G$42=\"\",\"\",Piling!$G$42)","v":""},{"$f":"IF( Piling!$B$5=\"\",\"\", Piling!$B$5)","v":"Pile Record"},{"$f":"IF(Piling!$G$27=\"\",\"\",Piling!$G$27)","v":"Btm. of Pilot Hole Elev. (Ft.)"},{"$f":"IF(Piling!$A$40=\"\",\"\",Piling!$A$40)","v":4}]
[82,{"$f":"IF(Piling!$G$43=\"\",\"\",Piling!$G$43)","v":""},{"$f":"IF( Piling!$B$5=\"\",\"\", Piling!$B$5)","v":"Pile Record"},{"$f":"IF(Piling!$G$27=\"\",\"\",Piling!$G$27)","v":"Btm. of Pilot Hole Elev. (Ft.)"},{"$f":"IF(Piling!$A$40=\"\",\"\",Piling!$A$40)","v":4}]
[83,{"$f":"IF(Piling!$G$44=\"\",\"\",Piling!$G$44)","v":""},{"$f":"IF( Piling!$B$5=\"\",\"\", Piling!$B$5)","v":"Pile Record"},{"$f":"IF(Piling!$G$27=\"\",\"\",Piling!$G$27)","v":"Btm. of Pilot Hole Elev. (Ft.)"},{"$f":"IF(Piling!$A$44=\"\",\"\",Piling!$A$44)","v":5}]
[84,{"$f":"IF(Piling!$G$45=\"\",\"\",Piling!$G$45)","v":""},{"$f":"IF( Piling!$B$5=\"\",\"\", Piling!$B$5)","v":"Pile Record"},{"$f":"IF(Piling!$G$27=\"\",\"\",Piling!$G$27)","v":"Btm. of Pilot Hole Elev. (Ft.)"},{"$f":"IF(Piling!$A$44=\"\",\"\",Piling!$A$44)","v":5}]
[85,{"$f":"IF(Piling!$G$46=\"\",\"\",Piling!$G$46)","v":""},{"$f":"IF( Piling!$B$5=\"\",\"\", Piling!$B$5)","v":"Pile Record"},{"$f":"IF(Piling!$G$27=\"\",\"\",Piling!$G$27)","v":"Btm. of Pilot Hole Elev. (Ft.)"},{"$f":"IF(Piling!$A$44=\"\",\"\",Piling!$A$44)","v":5}]
[86,{"$f":"IF(Piling!$G$47=\"\",\"\",Piling!$G$47)","v":""},{"$f":"IF( Piling!$B$5=\"\",\"\", Piling!$B$5)","v":"Pile Record"},{"$f":"IF(Piling!$G$27=\"\",\"\",Piling!$G$27)","v":"Btm. of Pilot Hole Elev. (Ft.)"},{"$f":"IF(Piling!$A$44=\"\",\"\",Piling!$A$44)","v":5}]
[87,{"$f":"IF(Piling!$H$28=\"\",\"\",Piling!$H$28)","v":""},{"$f":"IF( Piling!$B$5=\"\",\"\", Piling!$B$5)","v":"Pile Record"},{"$f":"IF(Piling!$H$27=\"\",\"\",Piling!$H$27)","v":"Approved Length (Ft.)"},{"$f":"IF(Piling!$A$28=\"\",\"\",Piling!$A$28)","v":1}]
[88,{"$f":"IF(Piling!$H$29=\"\",\"\",Piling!$H$29)","v":""},{"$f":"IF( Piling!$B$5=\"\",\"\", Piling!$B$5)","v":"Pile Record"},{"$f":"IF(Piling!$H$27=\"\",\"\",Piling!$H$27)","v":"Approved Length (Ft.)"},{"$f":"IF(Piling!$A$28=\"\",\"\",Piling!$A$28)","v":1}]
[89,{"$f":"IF(Piling!$H$30=\"\",\"\",Piling!$H$30)","v":""},{"$f":"IF( Piling!$B$5=\"\",\"\", Piling!$B$5)","v":"Pile Record"},{"$f":"IF(Piling!$H$27=\"\",\"\",Piling!$H$27)","v":"Approved Length (Ft.)"},{"$f":"IF(Piling!$A$28=\"\",\"\",Piling!$A$28)","v":1}]
[90,{"$f":"IF(Piling!$H$31=\"\",\"\",Piling!$H$31)","v":""},{"$f":"IF( Piling!$B$5=\"\",\"\", Piling!$B$5)","v":"Pile Record"},{"$f":"IF(Piling!$H$27=\"\",\"\",Piling!$H$27)","v":"Approved Length (Ft.)"},{"$f":"IF(Piling!$A$28=\"\",\"\",Piling!$A$28)","v":1}]
[91,{"$f":"IF(Piling!$H$32=\"\",\"\",Piling!$H$32)","v":""},{"$f":"IF( Piling!$B$5=\"\",\"\", Piling!$B$5)","v":"Pile Record"},{"$f":"IF(Piling!$H$27=\"\",\"\",Piling!$H$27)","v":"Approved Length (Ft.)"},{"$f":"IF(Piling!$A$32=\"\",\"\",Piling!$A$32)","v":2}]
[92,{"$f":"IF(Piling!$H$33=\"\",\"\",Piling!$H$33)","v":""},{"$f":"IF( Piling!$B$5=\"\",\"\", Piling!$B$5)","v":"Pile Record"},{"$f":"IF(Piling!$H$27=\"\",\"\",Piling!$H$27)","v":"Approved Length (Ft.)"},{"$f":"IF(Piling!$A$32=\"\",\"\",Piling!$A$32)","v":2}]
[93,{"$f":"IF(Piling!$H$34=\"\",\"\",Piling!$H$34)","v":""},{"$f":"IF( Piling!$B$5=\"\",\"\", Piling!$B$5)","v":"Pile Record"},{"$f":"IF(Piling!$H$27=\"\",\"\",Piling!$H$27)","v":"Approved Length (Ft.)"},{"$f":"IF(Piling!$A$32=\"\",\"\",Piling!$A$32)","v":2}]
[94,{"$f":"IF(Piling!$H$35=\"\",\"\",Piling!$H$35)","v":""},{"$f":"IF( Piling!$B$5=\"\",\"\", Piling!$B$5)","v":"Pile Record"},{"$f":"IF(Piling!$H$27=\"\",\"\",Piling!$H$27)","v":"Approved Length (Ft.)"},{"$f":"IF(Piling!$A$32=\"\",\"\",Piling!$A$32)","v":2}]
[95,{"$f":"IF(Piling!$H$36=\"\",\"\",Piling!$H$36)","v":""},{"$f":"IF( Piling!$B$5=\"\",\"\", Piling!$B$5)","v":"Pile Record"},{"$f":"IF(Piling!$H$27=\"\",\"\",Piling!$H$27)","v":"Approved Length (Ft.)"},{"$f":"IF(Piling!$A$36=\"\",\"\",Piling!$A$36)","v":3}]
[96,{"$f":"IF(Piling!$H$37=\"\",\"\",Piling!$H$37)","v":""},{"$f":"IF( Piling!$B$5=\"\",\"\", Piling!$B$5)","v":"Pile Record"},{"$f":"IF(Piling!$H$27=\"\",\"\",Piling!$H$27)","v":"Approved Length (Ft.)"},{"$f":"IF(Piling!$A$36=\"\",\"\",Piling!$A$36)","v":3}]
[97,{"$f":"IF(Piling!$H$38=\"\",\"\",Piling!$H$38)","v":""},{"$f":"IF( Piling!$B$5=\"\",\"\", Piling!$B$5)","v":"Pile Record"},{"$f":"IF(Piling!$H$27=\"\",\"\",Piling!$H$27)","v":"Approved Length (Ft.)"},{"$f":"IF(Piling!$A$36=\"\",\"\",Piling!$A$36)","v":3}]
[98,{"$f":"IF(Piling!$H$39=\"\",\"\",Piling!$H$39)","v":""},{"$f":"IF( Piling!$B$5=\"\",\"\", Piling!$B$5)","v":"Pile Record"},{"$f":"IF(Piling!$H$27=\"\",\"\",Piling!$H$27)","v":"Approved Length (Ft.)"},{"$f":"IF(Piling!$A$36=\"\",\"\",Piling!$A$36)","v":3}]
[99,{"$f":"IF(Piling!$H$40=\"\",\"\",Piling!$H$40)","v":""},{"$f":"IF( Piling!$B$5=\"\",\"\", Piling!$B$5)","v":"Pile Record"},{"$f":"IF(Piling!$H$27=\"\",\"\",Piling!$H$27)","v":"Approved Length (Ft.)"},{"$f":"IF(Piling!$A$40=\"\",\"\",Piling!$A$40)","v":4}]
[100,{"$f":"IF(Piling!$H$41=\"\",\"\",Piling!$H$41)","v":""},{"$f":"IF( Piling!$B$5=\"\",\"\", Piling!$B$5)","v":"Pile Record"},{"$f":"IF(Piling!$H$27=\"\",\"\",Piling!$H$27)","v":"Approved Length (Ft.)"},{"$f":"IF(Piling!$A$40=\"\",\"\",Piling!$A$40)","v":4}]
[101,{"$f":"IF(Piling!$H$42=\"\",\"\",Piling!$H$42)","v":""},{"$f":"IF( Piling!$B$5=\"\",\"\", Piling!$B$5)","v":"Pile Record"},{"$f":"IF(Piling!$H$27=\"\",\"\",Piling!$H$27)","v":"Approved Length (Ft.)"},{"$f":"IF(Piling!$A$40=\"\",\"\",Piling!$A$40)","v":4}]
[102,{"$f":"IF(Piling!$H$43=\"\",\"\",Piling!$H$43)","v":""},{"$f":"IF( Piling!$B$5=\"\",\"\", Piling!$B$5)","v":"Pile Record"},{"$f":"IF(Piling!$H$27=\"\",\"\",Piling!$H$27)","v":"Approved Length (Ft.)"},{"$f":"IF(Piling!$A$40=\"\",\"\",Piling!$A$40)","v":4}]
[103,{"$f":"IF(Piling!$H$44=\"\",\"\",Piling!$H$44)","v":""},{"$f":"IF( Piling!$B$5=\"\",\"\", Piling!$B$5)","v":"Pile Record"},{"$f":"IF(Piling!$H$27=\"\",\"\",Piling!$H$27)","v":"Approved Length (Ft.)"},{"$f":"IF(Piling!$A$44=\"\",\"\",Piling!$A$44)","v":5}]
[104,{"$f":"IF(Piling!$H$45=\"\",\"\",Piling!$H$45)","v":""},{"$f":"IF( Piling!$B$5=\"\",\"\", Piling!$B$5)","v":"Pile Record"},{"$f":"IF(Piling!$H$27=\"\",\"\",Piling!$H$27)","v":"Approved Length (Ft.)"},{"$f":"IF(Piling!$A$44=\"\",\"\",Piling!$A$44)","v":5}]
[105,{"$f":"IF(Piling!$H$46=\"\",\"\",Piling!$H$46)","v":""},{"$f":"IF( Piling!$B$5=\"\",\"\", Piling!$B$5)","v":"Pile Record"},{"$f":"IF(Piling!$H$27=\"\",\"\",Piling!$H$27)","v":"Approved Length (Ft.)"},{"$f":"IF(Piling!$A$44=\"\",\"\",Piling!$A$44)","v":5}]
[106,{"$f":"IF(Piling!$H$47=\"\",\"\",Piling!$H$47)","v":""},{"$f":"IF( Piling!$B$5=\"\",\"\", Piling!$B$5)","v":"Pile Record"},{"$f":"IF(Piling!$H$27=\"\",\"\",Piling!$H$27)","v":"Approved Length (Ft.)"},{"$f":"IF(Piling!$A$44=\"\",\"\",Piling!$A$44)","v":5}]
[107,{"$f":"IF(Piling!$I$28=\"\",\"\",Piling!$I$28)","v":""},{"$f":"IF( Piling!$B$5=\"\",\"\", Piling!$B$5)","v":"Pile Record"},{"$f":"IF(Piling!$I$27=\"\",\"\",Piling!$I$27)","v":"Date Driven"},{"$f":"IF(Piling!$A$28=\"\",\"\",Piling!$A$28)","v":1}]
[108,{"$f":"IF(Piling!$I$29=\"\",\"\",Piling!$I$29)","v":""},{"$f":"IF( Piling!$B$5=\"\",\"\", Piling!$B$5)","v":"Pile Record"},{"$f":"IF(Piling!$I$27=\"\",\"\",Piling!$I$27)","v":"Date Driven"},{"$f":"IF(Piling!$A$28=\"\",\"\",Piling!$A$28)","v":1}]
[109,{"$f":"IF(Piling!$I$30=\"\",\"\",Piling!$I$30)","v":""},{"$f":"IF( Piling!$B$5=\"\",\"\", Piling!$B$5)","v":"Pile Record"},{"$f":"IF(Piling!$I$27=\"\",\"\",Piling!$I$27)","v":"Date Driven"},{"$f":"IF(Piling!$A$28=\"\",\"\",Piling!$A$28)","v":1}]
[110,{"$f":"IF(Piling!$I$31=\"\",\"\",Piling!$I$31)","v":""},{"$f":"IF( Piling!$B$5=\"\",\"\", Piling!$B$5)","v":"Pile Record"},{"$f":"IF(Piling!$I$27=\"\",\"\",Piling!$I$27)","v":"Date Driven"},{"$f":"IF(Piling!$A$28=\"\",\"\",Piling!$A$28)","v":1}]
[111,{"$f":"IF(Piling!$I$32=\"\",\"\",Piling!$I$32)","v":""},{"$f":"IF( Piling!$B$5=\"\",\"\", Piling!$B$5)","v":"Pile Record"},{"$f":"IF(Piling!$I$27=\"\",\"\",Piling!$I$27)","v":"Date Driven"},{"$f":"IF(Piling!$A$32=\"\",\"\",Piling!$A$32)","v":2}]
[112,{"$f":"IF(Piling!$I$33=\"\",\"\",Piling!$I$33)","v":""},{"$f":"IF( Piling!$B$5=\"\",\"\", Piling!$B$5)","v":"Pile Record"},{"$f":"IF(Piling!$I$27=\"\",\"\",Piling!$I$27)","v":"Date Driven"},{"$f":"IF(Piling!$A$32=\"\",\"\",Piling!$A$32)","v":2}]
[113,{"$f":"IF(Piling!$I$34=\"\",\"\",Piling!$I$34)","v":""},{"$f":"IF( Piling!$B$5=\"\",\"\", Piling!$B$5)","v":"Pile Record"},{"$f":"IF(Piling!$I$27=\"\",\"\",Piling!$I$27)","v":"Date Driven"},{"$f":"IF(Piling!$A$32=\"\",\"\",Piling!$A$32)","v":2}]
[114,{"$f":"IF(Piling!$I$35=\"\",\"\",Piling!$I$35)","v":""},{"$f":"IF( Piling!$B$5=\"\",\"\", Piling!$B$5)","v":"Pile Record"},{"$f":"IF(Piling!$I$27=\"\",\"\",Piling!$I$27)","v":"Date Driven"},{"$f":"IF(Piling!$A$32=\"\",\"\",Piling!$A$32)","v":2}]
[115,{"$f":"IF(Piling!$I$36=\"\",\"\",Piling!$I$36)","v":""},{"$f":"IF( Piling!$B$5=\"\",\"\", Piling!$B$5)","v":"Pile Record"},{"$f":"IF(Piling!$I$27=\"\",\"\",Piling!$I$27)","v":"Date Driven"},{"$f":"IF(Piling!$A$36=\"\",\"\",Piling!$A$36)","v":3}]
[116,{"$f":"IF(Piling!$I$37=\"\",\"\",Piling!$I$37)","v":""},{"$f":"IF( Piling!$B$5=\"\",\"\", Piling!$B$5)","v":"Pile Record"},{"$f":"IF(Piling!$I$27=\"\",\"\",Piling!$I$27)","v":"Date Driven"},{"$f":"IF(Piling!$A$36=\"\",\"\",Piling!$A$36)","v":3}]
[117,{"$f":"IF(Piling!$I$38=\"\",\"\",Piling!$I$38)","v":""},{"$f":"IF( Piling!$B$5=\"\",\"\", Piling!$B$5)","v":"Pile Record"},{"$f":"IF(Piling!$I$27=\"\",\"\",Piling!$I$27)","v":"Date Driven"},{"$f":"IF(Piling!$A$36=\"\",\"\",Piling!$A$36)","v":3}]
[118,{"$f":"IF(Piling!$I$39=\"\",\"\",Piling!$I$39)","v":""},{"$f":"IF( Piling!$B$5=\"\",\"\", Piling!$B$5)","v":"Pile Record"},{"$f":"IF(Piling!$I$27=\"\",\"\",Piling!$I$27)","v":"Date Driven"},{"$f":"IF(Piling!$A$36=\"\",\"\",Piling!$A$36)","v":3}]
[119,{"$f":"IF(Piling!$I$40=\"\",\"\",Piling!$I$40)","v":""},{"$f":"IF( Piling!$B$5=\"\",\"\", Piling!$B$5)","v":"Pile Record"},{"$f":"IF(Piling!$I$27=\"\",\"\",Piling!$I$27)","v":"Date Driven"},{"$f":"IF(Piling!$A$40=\"\",\"\",Piling!$A$40)","v":4}]
[120,{"$f":"IF(Piling!$I$41=\"\",\"\",Piling!$I$41)","v":""},{"$f":"IF( Piling!$B$5=\"\",\"\", Piling!$B$5)","v":"Pile Record"},{"$f":"IF(Piling!$I$27=\"\",\"\",Piling!$I$27)","v":"Date Driven"},{"$f":"IF(Piling!$A$40=\"\",\"\",Piling!$A$40)","v":4}]
[121,{"$f":"IF(Piling!$I$42=\"\",\"\",Piling!$I$42)","v":""},{"$f":"IF( Piling!$B$5=\"\",\"\", Piling!$B$5)","v":"Pile Record"},{"$f":"IF(Piling!$I$27=\"\",\"\",Piling!$I$27)","v":"Date Driven"},{"$f":"IF(Piling!$A$40=\"\",\"\",Piling!$A$40)","v":4}]
[122,{"$f":"IF(Piling!$I$43=\"\",\"\",Piling!$I$43)","v":""},{"$f":"IF( Piling!$B$5=\"\",\"\", Piling!$B$5)","v":"Pile Record"},{"$f":"IF(Piling!$I$27=\"\",\"\",Piling!$I$27)","v":"Date Driven"},{"$f":"IF(Piling!$A$40=\"\",\"\",Piling!$A$40)","v":4}]
[123,{"$f":"IF(Piling!$I$44=\"\",\"\",Piling!$I$44)","v":""},{"$f":"IF( Piling!$B$5=\"\",\"\", Piling!$B$5)","v":"Pile Record"},{"$f":"IF(Piling!$I$27=\"\",\"\",Piling!$I$27)","v":"Date Driven"},{"$f":"IF(Piling!$A$44=\"\",\"\",Piling!$A$44)","v":5}]
[124,{"$f":"IF(Piling!$I$45=\"\",\"\",Piling!$I$45)","v":""},{"$f":"IF( Piling!$B$5=\"\",\"\", Piling!$B$5)","v":"Pile Record"},{"$f":"IF(Piling!$I$27=\"\",\"\",Piling!$I$27)","v":"Date Driven"},{"$f":"IF(Piling!$A$44=\"\",\"\",Piling!$A$44)","v":5}]
[125,{"$f":"IF(Piling!$I$46=\"\",\"\",Piling!$I$46)","v":""},{"$f":"IF( Piling!$B$5=\"\",\"\", Piling!$B$5)","v":"Pile Record"},{"$f":"IF(Piling!$I$27=\"\",\"\",Piling!$I$27)","v":"Date Driven"},{"$f":"IF(Piling!$A$44=\"\",\"\",Piling!$A$44)","v":5}]
[126,{"$f":"IF(Piling!$I$47=\"\",\"\",Piling!$I$47)","v":""},{"$f":"IF( Piling!$B$5=\"\",\"\", Piling!$B$5)","v":"Pile Record"},{"$f":"IF(Piling!$I$27=\"\",\"\",Piling!$I$27)","v":"Date Driven"},{"$f":"IF(Piling!$A$44=\"\",\"\",Piling!$A$44)","v":5}]
[127,{"$f":"IF(Piling!$J$28=\"\",\"\",Piling!$J$28)","v":""},{"$f":"IF( Piling!$B$5=\"\",\"\", Piling!$B$5)","v":"Pile Record"},{"$f":"IF(Piling!$J$27=\"\",\"\",Piling!$J$27)","v":"Actual Length Left in Place (Ft)"},{"$f":"IF(Piling!$A$28=\"\",\"\",Piling!$A$28)","v":1}]
[128,{"$f":"IF(Piling!$J$29=\"\",\"\",Piling!$J$29)","v":""},{"$f":"IF( Piling!$B$5=\"\",\"\", Piling!$B$5)","v":"Pile Record"},{"$f":"IF(Piling!$J$27=\"\",\"\",Piling!$J$27)","v":"Actual Length Left in Place (Ft)"},{"$f":"IF(Piling!$A$28=\"\",\"\",Piling!$A$28)","v":1}]
[129,{"$f":"IF(Piling!$J$30=\"\",\"\",Piling!$J$30)","v":""},{"$f":"IF( Piling!$B$5=\"\",\"\", Piling!$B$5)","v":"Pile Record"},{"$f":"IF(Piling!$J$27=\"\",\"\",Piling!$J$27)","v":"Actual Length Left in Place (Ft)"},{"$f":"IF(Piling!$A$28=\"\",\"\",Piling!$A$28)","v":1}]
[130,{"$f":"IF(Piling!$J$31=\"\",\"\",Piling!$J$31)","v":""},{"$f":"IF( Piling!$B$5=\"\",\"\", Piling!$B$5)","v":"Pile Record"},{"$f":"IF(Piling!$J$27=\"\",\"\",Piling!$J$27)","v":"Actual Length Left in Place (Ft)"},{"$f":"IF(Piling!$A$28=\"\",\"\",Piling!$A$28)","v":1}]
[131,{"$f":"IF(Piling!$J$32=\"\",\"\",Piling!$J$32)","v":""},{"$f":"IF( Piling!$B$5=\"\",\"\", Piling!$B$5)","v":"Pile Record"},{"$f":"IF(Piling!$J$27=\"\",\"\",Piling!$J$27)","v":"Actual Length Left in Place (Ft)"},{"$f":"IF(Piling!$A$32=\"\",\"\",Piling!$A$32)","v":2}]
[132,{"$f":"IF(Piling!$J$33=\"\",\"\",Piling!$J$33)","v":""},{"$f":"IF( Piling!$B$5=\"\",\"\", Piling!$B$5)","v":"Pile Record"},{"$f":"IF(Piling!$J$27=\"\",\"\",Piling!$J$27)","v":"Actual Length Left in Place (Ft)"},{"$f":"IF(Piling!$A$32=\"\",\"\",Piling!$A$32)","v":2}]
[133,{"$f":"IF(Piling!$J$34=\"\",\"\",Piling!$J$34)","v":""},{"$f":"IF( Piling!$B$5=\"\",\"\", Piling!$B$5)","v":"Pile Record"},{"$f":"IF(Piling!$J$27=\"\",\"\",Piling!$J$27)","v":"Actual Length Left in Place (Ft)"},{"$f":"IF(Piling!$A$32=\"\",\"\",Piling!$A$32)","v":2}]
[134,{"$f":"IF(Piling!$J$35=\"\",\"\",Piling!$J$35)","v":""},{"$f":"IF( Piling!$B$5=\"\",\"\", Piling!$B$5)","v":"Pile Record"},{"$f":"IF(Piling!$J$27=\"\",\"\",Piling!$J$27)","v":"Actual Length Left in Place (Ft)"},{"$f":"IF(Piling!$A$32=\"\",\"\",Piling!$A$32)","v":2}]
[135,{"$f":"IF(Piling!$J$36=\"\",\"\",Piling!$J$36)","v":""},{"$f":"IF( Piling!$B$5=\"\",\"\", Piling!$B$5)","v":"Pile Record"},{"$f":"IF(Piling!$J$27=\"\",\"\",Piling!$J$27)","v":"Actual Length Left in Place (Ft)"},{"$f":"IF(Piling!$A$36=\"\",\"\",Piling!$A$36)","v":3}]
[136,{"$f":"IF(Piling!$J$37=\"\",\"\",Piling!$J$37)","v":""},{"$f":"IF( Piling!$B$5=\"\",\"\", Piling!$B$5)","v":"Pile Record"},{"$f":"IF(Piling!$J$27=\"\",\"\",Piling!$J$27)","v":"Actual Length Left in Place (Ft)"},{"$f":"IF(Piling!$A$36=\"\",\"\",Piling!$A$36)","v":3}]
[137,{"$f":"IF(Piling!$J$38=\"\",\"\",Piling!$J$38)","v":""},{"$f":"IF( Piling!$B$5=\"\",\"\", Piling!$B$5)","v":"Pile Record"},{"$f":"IF(Piling!$J$27=\"\",\"\",Piling!$J$27)","v":"Actual Length Left in Place (Ft)"},{"$f":"IF(Piling!$A$36=\"\",\"\",Piling!$A$36)","v":3}]
[138,{"$f":"IF(Piling!$J$39=\"\",\"\",Piling!$J$39)","v":""},{"$f":"IF( Piling!$B$5=\"\",\"\", Piling!$B$5)","v":"Pile Record"},{"$f":"IF(Piling!$J$27=\"\",\"\",Piling!$J$27)","v":"Actual Length Left in Place (Ft)"},{"$f":"IF(Piling!$A$36=\"\",\"\",Piling!$A$36)","v":3}]
[139,{"$f":"IF(Piling!$J$40=\"\",\"\",Piling!$J$40)","v":""},{"$f":"IF( Piling!$B$5=\"\",\"\", Piling!$B$5)","v":"Pile Record"},{"$f":"IF(Piling!$J$27=\"\",\"\",Piling!$J$27)","v":"Actual Length Left in Place (Ft)"},{"$f":"IF(Piling!$A$40=\"\",\"\",Piling!$A$40)","v":4}]
[140,{"$f":"IF(Piling!$J$41=\"\",\"\",Piling!$J$41)","v":""},{"$f":"IF( Piling!$B$5=\"\",\"\", Piling!$B$5)","v":"Pile Record"},{"$f":"IF(Piling!$J$27=\"\",\"\",Piling!$J$27)","v":"Actual Length Left in Place (Ft)"},{"$f":"IF(Piling!$A$40=\"\",\"\",Piling!$A$40)","v":4}]
[141,{"$f":"IF(Piling!$J$42=\"\",\"\",Piling!$J$42)","v":""},{"$f":"IF( Piling!$B$5=\"\",\"\", Piling!$B$5)","v":"Pile Record"},{"$f":"IF(Piling!$J$27=\"\",\"\",Piling!$J$27)","v":"Actual Length Left in Place (Ft)"},{"$f":"IF(Piling!$A$40=\"\",\"\",Piling!$A$40)","v":4}]
[142,{"$f":"IF(Piling!$J$43=\"\",\"\",Piling!$J$43)","v":""},{"$f":"IF( Piling!$B$5=\"\",\"\", Piling!$B$5)","v":"Pile Record"},{"$f":"IF(Piling!$J$27=\"\",\"\",Piling!$J$27)","v":"Actual Length Left in Place (Ft)"},{"$f":"IF(Piling!$A$40=\"\",\"\",Piling!$A$40)","v":4}]
[143,{"$f":"IF(Piling!$J$44=\"\",\"\",Piling!$J$44)","v":""},{"$f":"IF( Piling!$B$5=\"\",\"\", Piling!$B$5)","v":"Pile Record"},{"$f":"IF(Piling!$J$27=\"\",\"\",Piling!$J$27)","v":"Actual Length Left in Place (Ft)"},{"$f":"IF(Piling!$A$44=\"\",\"\",Piling!$A$44)","v":5}]
[144,{"$f":"IF(Piling!$J$45=\"\",\"\",Piling!$J$45)","v":""},{"$f":"IF( Piling!$B$5=\"\",\"\", Piling!$B$5)","v":"Pile Record"},{"$f":"IF(Piling!$J$27=\"\",\"\",Piling!$J$27)","v":"Actual Length Left in Place (Ft)"},{"$f":"IF(Piling!$A$44=\"\",\"\",Piling!$A$44)","v":5}]
[145,{"$f":"IF(Piling!$J$46=\"\",\"\",Piling!$J$46)","v":""},{"$f":"IF( Piling!$B$5=\"\",\"\", Piling!$B$5)","v":"Pile Record"},{"$f":"IF(Piling!$J$27=\"\",\"\",Piling!$J$27)","v":"Actual Length Left in Place (Ft)"},{"$f":"IF(Piling!$A$44=\"\",\"\",Piling!$A$44)","v":5}]
[146,{"$f":"IF(Piling!$J$47=\"\",\"\",Piling!$J$47)","v":""},{"$f":"IF( Piling!$B$5=\"\",\"\", Piling!$B$5)","v":"Pile Record"},{"$f":"IF(Piling!$J$27=\"\",\"\",Piling!$J$27)","v":"Actual Length Left in Place (Ft)"},{"$f":"IF(Piling!$A$44=\"\",\"\",Piling!$A$44)","v":5}]
[147,{"$f":"IF(Piling!$K$28=\"\",\"\",Piling!$K$28)","v":""},{"$f":"IF( Piling!$B$5=\"\",\"\", Piling!$B$5)","v":"Pile Record"},{"$f":"IF(Piling!$K$27=\"\",\"\",Piling!$K$27)","v":"Length Cut-off (Ft.)"},{"$f":"IF(Piling!$A$28=\"\",\"\",Piling!$A$28)","v":1}]
[148,{"$f":"IF(Piling!$K$29=\"\",\"\",Piling!$K$29)","v":""},{"$f":"IF( Piling!$B$5=\"\",\"\", Piling!$B$5)","v":"Pile Record"},{"$f":"IF(Piling!$K$27=\"\",\"\",Piling!$K$27)","v":"Length Cut-off (Ft.)"},{"$f":"IF(Piling!$A$28=\"\",\"\",Piling!$A$28)","v":1}]
[149,{"$f":"IF(Piling!$K$30=\"\",\"\",Piling!$K$30)","v":""},{"$f":"IF( Piling!$B$5=\"\",\"\", Piling!$B$5)","v":"Pile Record"},{"$f":"IF(Piling!$K$27=\"\",\"\",Piling!$K$27)","v":"Length Cut-off (Ft.)"},{"$f":"IF(Piling!$A$28=\"\",\"\",Piling!$A$28)","v":1}]
[150,{"$f":"IF(Piling!$K$31=\"\",\"\",Piling!$K$31)","v":""},{"$f":"IF( Piling!$B$5=\"\",\"\", Piling!$B$5)","v":"Pile Record"},{"$f":"IF(Piling!$K$27=\"\",\"\",Piling!$K$27)","v":"Length Cut-off (Ft.)"},{"$f":"IF(Piling!$A$28=\"\",\"\",Piling!$A$28)","v":1}]
[151,{"$f":"IF(Piling!$K$32=\"\",\"\",Piling!$K$32)","v":""},{"$f":"IF( Piling!$B$5=\"\",\"\", Piling!$B$5)","v":"Pile Record"},{"$f":"IF(Piling!$K$27=\"\",\"\",Piling!$K$27)","v":"Length Cut-off (Ft.)"},{"$f":"IF(Piling!$A$32=\"\",\"\",Piling!$A$32)","v":2}]
[152,{"$f":"IF(Piling!$K$33=\"\",\"\",Piling!$K$33)","v":""},{"$f":"IF( Piling!$B$5=\"\",\"\", Piling!$B$5)","v":"Pile Record"},{"$f":"IF(Piling!$K$27=\"\",\"\",Piling!$K$27)","v":"Length Cut-off (Ft.)"},{"$f":"IF(Piling!$A$32=\"\",\"\",Piling!$A$32)","v":2}]
[153,{"$f":"IF(Piling!$K$34=\"\",\"\",Piling!$K$34)","v":""},{"$f":"IF( Piling!$B$5=\"\",\"\", Piling!$B$5)","v":"Pile Record"},{"$f":"IF(Piling!$K$27=\"\",\"\",Piling!$K$27)","v":"Length Cut-off (Ft.)"},{"$f":"IF(Piling!$A$32=\"\",\"\",Piling!$A$32)","v":2}]
[154,{"$f":"IF(Piling!$K$35=\"\",\"\",Piling!$K$35)","v":""},{"$f":"IF( Piling!$B$5=\"\",\"\", Piling!$B$5)","v":"Pile Record"},{"$f":"IF(Piling!$K$27=\"\",\"\",Piling!$K$27)","v":"Length Cut-off (Ft.)"},{"$f":"IF(Piling!$A$32=\"\",\"\",Piling!$A$32)","v":2}]
[155,{"$f":"IF(Piling!$K$36=\"\",\"\",Piling!$K$36)","v":""},{"$f":"IF( Piling!$B$5=\"\",\"\", Piling!$B$5)","v":"Pile Record"},{"$f":"IF(Piling!$K$27=\"\",\"\",Piling!$K$27)","v":"Length Cut-off (Ft.)"},{"$f":"IF(Piling!$A$36=\"\",\"\",Piling!$A$36)","v":3}]
[156,{"$f":"IF(Piling!$K$37=\"\",\"\",Piling!$K$37)","v":""},{"$f":"IF( Piling!$B$5=\"\",\"\", Piling!$B$5)","v":"Pile Record"},{"$f":"IF(Piling!$K$27=\"\",\"\",Piling!$K$27)","v":"Length Cut-off (Ft.)"},{"$f":"IF(Piling!$A$36=\"\",\"\",Piling!$A$36)","v":3}]
[157,{"$f":"IF(Piling!$K$38=\"\",\"\",Piling!$K$38)","v":""},{"$f":"IF( Piling!$B$5=\"\",\"\", Piling!$B$5)","v":"Pile Record"},{"$f":"IF(Piling!$K$27=\"\",\"\",Piling!$K$27)","v":"Length Cut-off (Ft.)"},{"$f":"IF(Piling!$A$36=\"\",\"\",Piling!$A$36)","v":3}]
[158,{"$f":"IF(Piling!$K$39=\"\",\"\",Piling!$K$39)","v":""},{"$f":"IF( Piling!$B$5=\"\",\"\", Piling!$B$5)","v":"Pile Record"},{"$f":"IF(Piling!$K$27=\"\",\"\",Piling!$K$27)","v":"Length Cut-off (Ft.)"},{"$f":"IF(Piling!$A$36=\"\",\"\",Piling!$A$36)","v":3}]
[159,{"$f":"IF(Piling!$K$40=\"\",\"\",Piling!$K$40)","v":""},{"$f":"IF( Piling!$B$5=\"\",\"\", Piling!$B$5)","v":"Pile Record"},{"$f":"IF(Piling!$K$27=\"\",\"\",Piling!$K$27)","v":"Length Cut-off (Ft.)"},{"$f":"IF(Piling!$A$40=\"\",\"\",Piling!$A$40)","v":4}]
[160,{"$f":"IF(Piling!$K$41=\"\",\"\",Piling!$K$41)","v":""},{"$f":"IF( Piling!$B$5=\"\",\"\", Piling!$B$5)","v":"Pile Record"},{"$f":"IF(Piling!$K$27=\"\",\"\",Piling!$K$27)","v":"Length Cut-off (Ft.)"},{"$f":"IF(Piling!$A$40=\"\",\"\",Piling!$A$40)","v":4}]
[161,{"$f":"IF(Piling!$K$42=\"\",\"\",Piling!$K$42)","v":""},{"$f":"IF( Piling!$B$5=\"\",\"\", Piling!$B$5)","v":"Pile Record"},{"$f":"IF(Piling!$K$27=\"\",\"\",Piling!$K$27)","v":"Length Cut-off (Ft.)"},{"$f":"IF(Piling!$A$40=\"\",\"\",Piling!$A$40)","v":4}]
[162,{"$f":"IF(Piling!$K$43=\"\",\"\",Piling!$K$43)","v":""},{"$f":"IF( Piling!$B$5=\"\",\"\", Piling!$B$5)","v":"Pile Record"},{"$f":"IF(Piling!$K$27=\"\",\"\",Piling!$K$27)","v":"Length Cut-off (Ft.)"},{"$f":"IF(Piling!$A$40=\"\",\"\",Piling!$A$40)","v":4}]
[163,{"$f":"IF(Piling!$K$44=\"\",\"\",Piling!$K$44)","v":""},{"$f":"IF( Piling!$B$5=\"\",\"\", Piling!$B$5)","v":"Pile Record"},{"$f":"IF(Piling!$K$27=\"\",\"\",Piling!$K$27)","v":"Length Cut-off (Ft.)"},{"$f":"IF(Piling!$A$44=\"\",\"\",Piling!$A$44)","v":5}]
[164,{"$f":"IF(Piling!$K$45=\"\",\"\",Piling!$K$45)","v":""},{"$f":"IF( Piling!$B$5=\"\",\"\", Piling!$B$5)","v":"Pile Record"},{"$f":"IF(Piling!$K$27=\"\",\"\",Piling!$K$27)","v":"Length Cut-off (Ft.)"},{"$f":"IF(Piling!$A$44=\"\",\"\",Piling!$A$44)","v":5}]
[165,{"$f":"IF(Piling!$K$46=\"\",\"\",Piling!$K$46)","v":""},{"$f":"IF( Piling!$B$5=\"\",\"\", Piling!$B$5)","v":"Pile Record"},{"$f":"IF(Piling!$K$27=\"\",\"\",Piling!$K$27)","v":"Length Cut-off (Ft.)"},{"$f":"IF(Piling!$A$44=\"\",\"\",Piling!$A$44)","v":5}]
[166,{"$f":"IF(Piling!$K$47=\"\",\"\",Piling!$K$47)","v":""},{"$f":"IF( Piling!$B$5=\"\",\"\", Piling!$B$5)","v":"Pile Record"},{"$f":"IF(Piling!$K$27=\"\",\"\",Piling!$K$27)","v":"Length Cut-off (Ft.)"},{"$f":"IF(Piling!$A$44=\"\",\"\",Piling!$A$44)","v":5}]
[167,{"$f":"IF(Piling!$L$28=\"\",\"\",Piling!$L$28)","v":""},{"$f":"IF( Piling!$B$5=\"\",\"\", Piling!$B$5)","v":"Pile Record"},{"$f":"IF(Piling!$L$27=\"\",\"\",Piling!$L$27)","v":"Buildup or Splice?"},{"$f":"IF(Piling!$A$28=\"\",\"\",Piling!$A$28)","v":1}]
[168,{"$f":"IF(Piling!$L$29=\"\",\"\",Piling!$L$29)","v":""},{"$f":"IF( Piling!$B$5=\"\",\"\", Piling!$B$5)","v":"Pile Record"},{"$f":"IF(Piling!$L$27=\"\",\"\",Piling!$L$27)","v":"Buildup or Splice?"},{"$f":"IF(Piling!$A$28=\"\",\"\",Piling!$A$28)","v":1}]
[169,{"$f":"IF(Piling!$L$30=\"\",\"\",Piling!$L$30)","v":""},{"$f":"IF( Piling!$B$5=\"\",\"\", Piling!$B$5)","v":"Pile Record"},{"$f":"IF(Piling!$L$27=\"\",\"\",Piling!$L$27)","v":"Buildup or Splice?"},{"$f":"IF(Piling!$A$28=\"\",\"\",Piling!$A$28)","v":1}]
[170,{"$f":"IF(Piling!$L$31=\"\",\"\",Piling!$L$31)","v":""},{"$f":"IF( Piling!$B$5=\"\",\"\", Piling!$B$5)","v":"Pile Record"},{"$f":"IF(Piling!$L$27=\"\",\"\",Piling!$L$27)","v":"Buildup or Splice?"},{"$f":"IF(Piling!$A$28=\"\",\"\",Piling!$A$28)","v":1}]
[171,{"$f":"IF(Piling!$L$32=\"\",\"\",Piling!$L$32)","v":""},{"$f":"IF( Piling!$B$5=\"\",\"\", Piling!$B$5)","v":"Pile Record"},{"$f":"IF(Piling!$L$27=\"\",\"\",Piling!$L$27)","v":"Buildup or Splice?"},{"$f":"IF(Piling!$A$32=\"\",\"\",Piling!$A$32)","v":2}]
[172,{"$f":"IF(Piling!$L$33=\"\",\"\",Piling!$L$33)","v":""},{"$f":"IF( Piling!$B$5=\"\",\"\", Piling!$B$5)","v":"Pile Record"},{"$f":"IF(Piling!$L$27=\"\",\"\",Piling!$L$27)","v":"Buildup or Splice?"},{"$f":"IF(Piling!$A$32=\"\",\"\",Piling!$A$32)","v":2}]
[173,{"$f":"IF(Piling!$L$34=\"\",\"\",Piling!$L$34)","v":""},{"$f":"IF( Piling!$B$5=\"\",\"\", Piling!$B$5)","v":"Pile Record"},{"$f":"IF(Piling!$L$27=\"\",\"\",Piling!$L$27)","v":"Buildup or Splice?"},{"$f":"IF(Piling!$A$32=\"\",\"\",Piling!$A$32)","v":2}]
[174,{"$f":"IF(Piling!$L$35=\"\",\"\",Piling!$L$35)","v":""},{"$f":"IF( Piling!$B$5=\"\",\"\", Piling!$B$5)","v":"Pile Record"},{"$f":"IF(Piling!$L$27=\"\",\"\",Piling!$L$27)","v":"Buildup or Splice?"},{"$f":"IF(Piling!$A$32=\"\",\"\",Piling!$A$32)","v":2}]
[175,{"$f":"IF(Piling!$L$36=\"\",\"\",Piling!$L$36)","v":""},{"$f":"IF( Piling!$B$5=\"\",\"\", Piling!$B$5)","v":"Pile Record"},{"$f":"IF(Piling!$L$27=\"\",\"\",Piling!$L$27)","v":"Buildup or Splice?"},{"$f":"IF(Piling!$A$36=\"\",\"\",Piling!$A$36)","v":3}]
[176,{"$f":"IF(Piling!$L$37=\"\",\"\",Piling!$L$37)","v":""},{"$f":"IF( Piling!$B$5=\"\",\"\", Piling!$B$5)","v":"Pile Record"},{"$f":"IF(Piling!$L$27=\"\",\"\",Piling!$L$27)","v":"Buildup or Splice?"},{"$f":"IF(Piling!$A$36=\"\",\"\",Piling!$A$36)","v":3}]
[177,{"$f":"IF(Piling!$L$38=\"\",\"\",Piling!$L$38)","v":""},{"$f":"IF( Piling!$B$5=\"\",\"\", Piling!$B$5)","v":"Pile Record"},{"$f":"IF(Piling!$L$27=\"\",\"\",Piling!$L$27)","v":"Buildup or Splice?"},{"$f":"IF(Piling!$A$36=\"\",\"\",Piling!$A$36)","v":3}]
[178,{"$f":"IF(Piling!$L$39=\"\",\"\",Piling!$L$39)","v":""},{"$f":"IF( Piling!$B$5=\"\",\"\", Piling!$B$5)","v":"Pile Record"},{"$f":"IF(Piling!$L$27=\"\",\"\",Piling!$L$27)","v":"Buildup or Splice?"},{"$f":"IF(Piling!$A$36=\"\",\"\",Piling!$A$36)","v":3}]
[179,{"$f":"IF(Piling!$L$40=\"\",\"\",Piling!$L$40)","v":""},{"$f":"IF( Piling!$B$5=\"\",\"\", Piling!$B$5)","v":"Pile Record"},{"$f":"IF(Piling!$L$27=\"\",\"\",Piling!$L$27)","v":"Buildup or Splice?"},{"$f":"IF(Piling!$A$40=\"\",\"\",Piling!$A$40)","v":4}]
[180,{"$f":"IF(Piling!$L$41=\"\",\"\",Piling!$L$41)","v":""},{"$f":"IF( Piling!$B$5=\"\",\"\", Piling!$B$5)","v":"Pile Record"},{"$f":"IF(Piling!$L$27=\"\",\"\",Piling!$L$27)","v":"Buildup or Splice?"},{"$f":"IF(Piling!$A$40=\"\",\"\",Piling!$A$40)","v":4}]
[181,{"$f":"IF(Piling!$L$42=\"\",\"\",Piling!$L$42)","v":""},{"$f":"IF( Piling!$B$5=\"\",\"\", Piling!$B$5)","v":"Pile Record"},{"$f":"IF(Piling!$L$27=\"\",\"\",Piling!$L$27)","v":"Buildup or Splice?"},{"$f":"IF(Piling!$A$40=\"\",\"\",Piling!$A$40)","v":4}]
[182,{"$f":"IF(Piling!$L$43=\"\",\"\",Piling!$L$43)","v":""},{"$f":"IF( Piling!$B$5=\"\",\"\", Piling!$B$5)","v":"Pile Record"},{"$f":"IF(Piling!$L$27=\"\",\"\",Piling!$L$27)","v":"Buildup or Splice?"},{"$f":"IF(Piling!$A$40=\"\",\"\",Piling!$A$40)","v":4}]
[183,{"$f":"IF(Piling!$L$44=\"\",\"\",Piling!$L$44)","v":""},{"$f":"IF( Piling!$B$5=\"\",\"\", Piling!$B$5)","v":"Pile Record"},{"$f":"IF(Piling!$L$27=\"\",\"\",Piling!$L$27)","v":"Buildup or Splice?"},{"$f":"IF(Piling!$A$44=\"\",\"\",Piling!$A$44)","v":5}]
[184,{"$f":"IF(Piling!$L$45=\"\",\"\",Piling!$L$45)","v":""},{"$f":"IF( Piling!$B$5=\"\",\"\", Piling!$B$5)","v":"Pile Record"},{"$f":"IF(Piling!$L$27=\"\",\"\",Piling!$L$27)","v":"Buildup or Splice?"},{"$f":"IF(Piling!$A$44=\"\",\"\",Piling!$A$44)","v":5}]
[185,{"$f":"IF(Piling!$L$46=\"\",\"\",Piling!$L$46)","v":""},{"$f":"IF( Piling!$B$5=\"\",\"\", Piling!$B$5)","v":"Pile Record"},{"$f":"IF(Piling!$L$27=\"\",\"\",Piling!$L$27)","v":"Buildup or Splice?"},{"$f":"IF(Piling!$A$44=\"\",\"\",Piling!$A$44)","v":5}]
[186,{"$f":"IF(Piling!$L$47=\"\",\"\",Piling!$L$47)","v":""},{"$f":"IF( Piling!$B$5=\"\",\"\", Piling!$B$5)","v":"Pile Record"},{"$f":"IF(Piling!$L$27=\"\",\"\",Piling!$L$27)","v":"Buildup or Splice?"},{"$f":"IF(Piling!$A$44=\"\",\"\",Piling!$A$44)","v":5}]
[187,{"$f":"IF(Piling!$M$28=\"\",\"\",Piling!$M$28)","v":""},{"$f":"IF( Piling!$B$5=\"\",\"\", Piling!$B$5)","v":"Pile Record"},{"$f":"IF(Piling!$M$27=\"\",\"\",Piling!$M$27)","v":"Pile Tip Elev. (Ft.)"},{"$f":"IF(Piling!$A$28=\"\",\"\",Piling!$A$28)","v":1}]
[188,{"$f":"IF(Piling!$M$29=\"\",\"\",Piling!$M$29)","v":""},{"$f":"IF( Piling!$B$5=\"\",\"\", Piling!$B$5)","v":"Pile Record"},{"$f":"IF(Piling!$M$27=\"\",\"\",Piling!$M$27)","v":"Pile Tip Elev. (Ft.)"},{"$f":"IF(Piling!$A$28=\"\",\"\",Piling!$A$28)","v":1}]
[189,{"$f":"IF(Piling!$M$30=\"\",\"\",Piling!$M$30)","v":""},{"$f":"IF( Piling!$B$5=\"\",\"\", Piling!$B$5)","v":"Pile Record"},{"$f":"IF(Piling!$M$27=\"\",\"\",Piling!$M$27)","v":"Pile Tip Elev. (Ft.)"},{"$f":"IF(Piling!$A$28=\"\",\"\",Piling!$A$28)","v":1}]
[190,{"$f":"IF(Piling!$M$31=\"\",\"\",Piling!$M$31)","v":""},{"$f":"IF( Piling!$B$5=\"\",\"\", Piling!$B$5)","v":"Pile Record"},{"$f":"IF(Piling!$M$27=\"\",\"\",Piling!$M$27)","v":"Pile Tip Elev. (Ft.)"},{"$f":"IF(Piling!$A$28=\"\",\"\",Piling!$A$28)","v":1}]
[191,{"$f":"IF(Piling!$M$32=\"\",\"\",Piling!$M$32)","v":""},{"$f":"IF( Piling!$B$5=\"\",\"\", Piling!$B$5)","v":"Pile Record"},{"$f":"IF(Piling!$M$27=\"\",\"\",Piling!$M$27)","v":"Pile Tip Elev. (Ft.)"},{"$f":"IF(Piling!$A$32=\"\",\"\",Piling!$A$32)","v":2}]
[192,{"$f":"IF(Piling!$M$33=\"\",\"\",Piling!$M$33)","v":""},{"$f":"IF( Piling!$B$5=\"\",\"\", Piling!$B$5)","v":"Pile Record"},{"$f":"IF(Piling!$M$27=\"\",\"\",Piling!$M$27)","v":"Pile Tip Elev. (Ft.)"},{"$f":"IF(Piling!$A$32=\"\",\"\",Piling!$A$32)","v":2}]
[193,{"$f":"IF(Piling!$M$34=\"\",\"\",Piling!$M$34)","v":""},{"$f":"IF( Piling!$B$5=\"\",\"\", Piling!$B$5)","v":"Pile Record"},{"$f":"IF(Piling!$M$27=\"\",\"\",Piling!$M$27)","v":"Pile Tip Elev. (Ft.)"},{"$f":"IF(Piling!$A$32=\"\",\"\",Piling!$A$32)","v":2}]
[194,{"$f":"IF(Piling!$M$35=\"\",\"\",Piling!$M$35)","v":""},{"$f":"IF( Piling!$B$5=\"\",\"\", Piling!$B$5)","v":"Pile Record"},{"$f":"IF(Piling!$M$27=\"\",\"\",Piling!$M$27)","v":"Pile Tip Elev. (Ft.)"},{"$f":"IF(Piling!$A$32=\"\",\"\",Piling!$A$32)","v":2}]
[195,{"$f":"IF(Piling!$M$36=\"\",\"\",Piling!$M$36)","v":""},{"$f":"IF( Piling!$B$5=\"\",\"\", Piling!$B$5)","v":"Pile Record"},{"$f":"IF(Piling!$M$27=\"\",\"\",Piling!$M$27)","v":"Pile Tip Elev. (Ft.)"},{"$f":"IF(Piling!$A$36=\"\",\"\",Piling!$A$36)","v":3}]
[196,{"$f":"IF(Piling!$M$37=\"\",\"\",Piling!$M$37)","v":""},{"$f":"IF( Piling!$B$5=\"\",\"\", Piling!$B$5)","v":"Pile Record"},{"$f":"IF(Piling!$M$27=\"\",\"\",Piling!$M$27)","v":"Pile Tip Elev. (Ft.)"},{"$f":"IF(Piling!$A$36=\"\",\"\",Piling!$A$36)","v":3}]
[197,{"$f":"IF(Piling!$M$38=\"\",\"\",Piling!$M$38)","v":""},{"$f":"IF( Piling!$B$5=\"\",\"\", Piling!$B$5)","v":"Pile Record"},{"$f":"IF(Piling!$M$27=\"\",\"\",Piling!$M$27)","v":"Pile Tip Elev. (Ft.)"},{"$f":"IF(Piling!$A$36=\"\",\"\",Piling!$A$36)","v":3}]
[198,{"$f":"IF(Piling!$M$39=\"\",\"\",Piling!$M$39)","v":""},{"$f":"IF( Piling!$B$5=\"\",\"\", Piling!$B$5)","v":"Pile Record"},{"$f":"IF(Piling!$M$27=\"\",\"\",Piling!$M$27)","v":"Pile Tip Elev. (Ft.)"},{"$f":"IF(Piling!$A$36=\"\",\"\",Piling!$A$36)","v":3}]
[199,{"$f":"IF(Piling!$M$40=\"\",\"\",Piling!$M$40)","v":""},{"$f":"IF( Piling!$B$5=\"\",\"\", Piling!$B$5)","v":"Pile Record"},{"$f":"IF(Piling!$M$27=\"\",\"\",Piling!$M$27)","v":"Pile Tip Elev. (Ft.)"},{"$f":"IF(Piling!$A$40=\"\",\"\",Piling!$A$40)","v":4}]
[200,{"$f":"IF(Piling!$M$41=\"\",\"\",Piling!$M$41)","v":""},{"$f":"IF( Piling!$B$5=\"\",\"\", Piling!$B$5)","v":"Pile Record"},{"$f":"IF(Piling!$M$27=\"\",\"\",Piling!$M$27)","v":"Pile Tip Elev. (Ft.)"},{"$f":"IF(Piling!$A$40=\"\",\"\",Piling!$A$40)","v":4}]
[201,{"$f":"IF(Piling!$M$42=\"\",\"\",Piling!$M$42)","v":""},{"$f":"IF( Piling!$B$5=\"\",\"\", Piling!$B$5)","v":"Pile Record"},{"$f":"IF(Piling!$M$27=\"\",\"\",Piling!$M$27)","v":"Pile Tip Elev. (Ft.)"},{"$f":"IF(Piling!$A$40=\"\",\"\",Piling!$A$40)","v":4}]
[202,{"$f":"IF(Piling!$M$43=\"\",\"\",Piling!$M$43)","v":""},{"$f":"IF( Piling!$B$5=\"\",\"\", Piling!$B$5)","v":"Pile Record"},{"$f":"IF(Piling!$M$27=\"\",\"\",Piling!$M$27)","v":"Pile Tip Elev. (Ft.)"},{"$f":"IF(Piling!$A$40=\"\",\"\",Piling!$A$40)","v":4}]
[203,{"$f":"IF(Piling!$M$44=\"\",\"\",Piling!$M$44)","v":""},{"$f":"IF( Piling!$B$5=\"\",\"\", Piling!$B$5)","v":"Pile Record"},{"$f":"IF(Piling!$M$27=\"\",\"\",Piling!$M$27)","v":"Pile Tip Elev. (Ft.)"},{"$f":"IF(Piling!$A$44=\"\",\"\",Piling!$A$44)","v":5}]
[204,{"$f":"IF(Piling!$M$45=\"\",\"\",Piling!$M$45)","v":""},{"$f":"IF( Piling!$B$5=\"\",\"\", Piling!$B$5)","v":"Pile Record"},{"$f":"IF(Piling!$M$27=\"\",\"\",Piling!$M$27)","v":"Pile Tip Elev. (Ft.)"},{"$f":"IF(Piling!$A$44=\"\",\"\",Piling!$A$44)","v":5}]
[205,{"$f":"IF(Piling!$M$46=\"\",\"\",Piling!$M$46)","v":""},{"$f":"IF( Piling!$B$5=\"\",\"\", Piling!$B$5)","v":"Pile Record"},{"$f":"IF(Piling!$M$27=\"\",\"\",Piling!$M$27)","v":"Pile Tip Elev. (Ft.)"},{"$f":"IF(Piling!$A$44=\"\",\"\",Piling!$A$44)","v":5}]
[206,{"$f":"IF(Piling!$M$47=\"\",\"\",Piling!$M$47)","v":""},{"$f":"IF( Piling!$B$5=\"\",\"\", Piling!$B$5)","v":"Pile Record"},{"$f":"IF(Piling!$M$27=\"\",\"\",Piling!$M$27)","v":"Pile Tip Elev. (Ft.)"},{"$f":"IF(Piling!$A$44=\"\",\"\",Piling!$A$44)","v":5}]
[207,{"$f":"IF(Piling!$N$28=\"\",\"\",Piling!$N$28)","v":""},{"$f":"IF( Piling!$B$5=\"\",\"\", Piling!$B$5)","v":"Pile Record"},{"$f":"IF(Piling!$N$27=\"\",\"\",Piling!$N$27)","v":"Stoke Height (ft) or Energy of Hammer (ft-lbs)"},{"$f":"IF(Piling!$A$28=\"\",\"\",Piling!$A$28)","v":1}]
[208,{"$f":"IF(Piling!$N$29=\"\",\"\",Piling!$N$29)","v":""},{"$f":"IF( Piling!$B$5=\"\",\"\", Piling!$B$5)","v":"Pile Record"},{"$f":"IF(Piling!$N$27=\"\",\"\",Piling!$N$27)","v":"Stoke Height (ft) or Energy of Hammer (ft-lbs)"},{"$f":"IF(Piling!$A$28=\"\",\"\",Piling!$A$28)","v":1}]
[209,{"$f":"IF(Piling!$N$30=\"\",\"\",Piling!$N$30)","v":""},{"$f":"IF( Piling!$B$5=\"\",\"\", Piling!$B$5)","v":"Pile Record"},{"$f":"IF(Piling!$N$27=\"\",\"\",Piling!$N$27)","v":"Stoke Height (ft) or Energy of Hammer (ft-lbs)"},{"$f":"IF(Piling!$A$28=\"\",\"\",Piling!$A$28)","v":1}]
[210,{"$f":"IF(Piling!$N$31=\"\",\"\",Piling!$N$31)","v":""},{"$f":"IF( Piling!$B$5=\"\",\"\", Piling!$B$5)","v":"Pile Record"},{"$f":"IF(Piling!$N$27=\"\",\"\",Piling!$N$27)","v":"Stoke Height (ft) or Energy of Hammer (ft-lbs)"},{"$f":"IF(Piling!$A$28=\"\",\"\",Piling!$A$28)","v":1}]
[211,{"$f":"IF(Piling!$N$32=\"\",\"\",Piling!$N$32)","v":""},{"$f":"IF( Piling!$B$5=\"\",\"\", Piling!$B$5)","v":"Pile Record"},{"$f":"IF(Piling!$N$27=\"\",\"\",Piling!$N$27)","v":"Stoke Height (ft) or Energy of Hammer (ft-lbs)"},{"$f":"IF(Piling!$A$32=\"\",\"\",Piling!$A$32)","v":2}]
[212,{"$f":"IF(Piling!$N$33=\"\",\"\",Piling!$N$33)","v":""},{"$f":"IF( Piling!$B$5=\"\",\"\", Piling!$B$5)","v":"Pile Record"},{"$f":"IF(Piling!$N$27=\"\",\"\",Piling!$N$27)","v":"Stoke Height (ft) or Energy of Hammer (ft-lbs)"},{"$f":"IF(Piling!$A$32=\"\",\"\",Piling!$A$32)","v":2}]
[213,{"$f":"IF(Piling!$N$34=\"\",\"\",Piling!$N$34)","v":""},{"$f":"IF( Piling!$B$5=\"\",\"\", Piling!$B$5)","v":"Pile Record"},{"$f":"IF(Piling!$N$27=\"\",\"\",Piling!$N$27)","v":"Stoke Height (ft) or Energy of Hammer (ft-lbs)"},{"$f":"IF(Piling!$A$32=\"\",\"\",Piling!$A$32)","v":2}]
[214,{"$f":"IF(Piling!$N$35=\"\",\"\",Piling!$N$35)","v":""},{"$f":"IF( Piling!$B$5=\"\",\"\", Piling!$B$5)","v":"Pile Record"},{"$f":"IF(Piling!$N$27=\"\",\"\",Piling!$N$27)","v":"Stoke Height (ft) or Energy of Hammer (ft-lbs)"},{"$f":"IF(Piling!$A$32=\"\",\"\",Piling!$A$32)","v":2}]
[215,{"$f":"IF(Piling!$N$36=\"\",\"\",Piling!$N$36)","v":""},{"$f":"IF( Piling!$B$5=\"\",\"\", Piling!$B$5)","v":"Pile Record"},{"$f":"IF(Piling!$N$27=\"\",\"\",Piling!$N$27)","v":"Stoke Height (ft) or Energy of Hammer (ft-lbs)"},{"$f":"IF(Piling!$A$36=\"\",\"\",Piling!$A$36)","v":3}]
[216,{"$f":"IF(Piling!$N$37=\"\",\"\",Piling!$N$37)","v":""},{"$f":"IF( Piling!$B$5=\"\",\"\", Piling!$B$5)","v":"Pile Record"},{"$f":"IF(Piling!$N$27=\"\",\"\",Piling!$N$27)","v":"Stoke Height (ft) or Energy of Hammer (ft-lbs)"},{"$f":"IF(Piling!$A$36=\"\",\"\",Piling!$A$36)","v":3}]
[217,{"$f":"IF(Piling!$N$38=\"\",\"\",Piling!$N$38)","v":""},{"$f":"IF( Piling!$B$5=\"\",\"\", Piling!$B$5)","v":"Pile Record"},{"$f":"IF(Piling!$N$27=\"\",\"\",Piling!$N$27)","v":"Stoke Height (ft) or Energy of Hammer (ft-lbs)"},{"$f":"IF(Piling!$A$36=\"\",\"\",Piling!$A$36)","v":3}]
[218,{"$f":"IF(Piling!$N$39=\"\",\"\",Piling!$N$39)","v":""},{"$f":"IF( Piling!$B$5=\"\",\"\", Piling!$B$5)","v":"Pile Record"},{"$f":"IF(Piling!$N$27=\"\",\"\",Piling!$N$27)","v":"Stoke Height (ft) or Energy of Hammer (ft-lbs)"},{"$f":"IF(Piling!$A$36=\"\",\"\",Piling!$A$36)","v":3}]
[219,{"$f":"IF(Piling!$N$40=\"\",\"\",Piling!$N$40)","v":""},{"$f":"IF( Piling!$B$5=\"\",\"\", Piling!$B$5)","v":"Pile Record"},{"$f":"IF(Piling!$N$27=\"\",\"\",Piling!$N$27)","v":"Stoke Height (ft) or Energy of Hammer (ft-lbs)"},{"$f":"IF(Piling!$A$40=\"\",\"\",Piling!$A$40)","v":4}]
[220,{"$f":"IF(Piling!$N$41=\"\",\"\",Piling!$N$41)","v":""},{"$f":"IF( Piling!$B$5=\"\",\"\", Piling!$B$5)","v":"Pile Record"},{"$f":"IF(Piling!$N$27=\"\",\"\",Piling!$N$27)","v":"Stoke Height (ft) or Energy of Hammer (ft-lbs)"},{"$f":"IF(Piling!$A$40=\"\",\"\",Piling!$A$40)","v":4}]
[221,{"$f":"IF(Piling!$N$42=\"\",\"\",Piling!$N$42)","v":""},{"$f":"IF( Piling!$B$5=\"\",\"\", Piling!$B$5)","v":"Pile Record"},{"$f":"IF(Piling!$N$27=\"\",\"\",Piling!$N$27)","v":"Stoke Height (ft) or Energy of Hammer (ft-lbs)"},{"$f":"IF(Piling!$A$40=\"\",\"\",Piling!$A$40)","v":4}]
[222,{"$f":"IF(Piling!$N$43=\"\",\"\",Piling!$N$43)","v":""},{"$f":"IF( Piling!$B$5=\"\",\"\", Piling!$B$5)","v":"Pile Record"},{"$f":"IF(Piling!$N$27=\"\",\"\",Piling!$N$27)","v":"Stoke Height (ft) or Energy of Hammer (ft-lbs)"},{"$f":"IF(Piling!$A$40=\"\",\"\",Piling!$A$40)","v":4}]
[223,{"$f":"IF(Piling!$N$44=\"\",\"\",Piling!$N$44)","v":""},{"$f":"IF( Piling!$B$5=\"\",\"\", Piling!$B$5)","v":"Pile Record"},{"$f":"IF(Piling!$N$27=\"\",\"\",Piling!$N$27)","v":"Stoke Height (ft) or Energy of Hammer (ft-lbs)"},{"$f":"IF(Piling!$A$44=\"\",\"\",Piling!$A$44)","v":5}]
[224,{"$f":"IF(Piling!$N$45=\"\",\"\",Piling!$N$45)","v":""},{"$f":"IF( Piling!$B$5=\"\",\"\", Piling!$B$5)","v":"Pile Record"},{"$f":"IF(Piling!$N$27=\"\",\"\",Piling!$N$27)","v":"Stoke Height (ft) or Energy of Hammer (ft-lbs)"},{"$f":"IF(Piling!$A$44=\"\",\"\",Piling!$A$44)","v":5}]
[225,{"$f":"IF(Piling!$N$46=\"\",\"\",Piling!$N$46)","v":""},{"$f":"IF( Piling!$B$5=\"\",\"\", Piling!$B$5)","v":"Pile Record"},{"$f":"IF(Piling!$N$27=\"\",\"\",Piling!$N$27)","v":"Stoke Height (ft) or Energy of Hammer (ft-lbs)"},{"$f":"IF(Piling!$A$44=\"\",\"\",Piling!$A$44)","v":5}]
[226,{"$f":"IF(Piling!$N$47=\"\",\"\",Piling!$N$47)","v":""},{"$f":"IF( Piling!$B$5=\"\",\"\", Piling!$B$5)","v":"Pile Record"},{"$f":"IF(Piling!$N$27=\"\",\"\",Piling!$N$27)","v":"Stoke Height (ft) or Energy of Hammer (ft-lbs)"},{"$f":"IF(Piling!$A$44=\"\",\"\",Piling!$A$44)","v":5}]
[227,{"$f":"IF(Piling!$P$28=\"\",\"\",Piling!$P$28)","v":""},{"$f":"IF( Piling!$B$5=\"\",\"\", Piling!$B$5)","v":"Pile Record"},{"$f":"IF(Piling!$P$27=\"\",\"\",Piling!$P$27)","v":"Penetration     (in/Blow)"},{"$f":"IF(Piling!$A$28=\"\",\"\",Piling!$A$28)","v":1}]
[228,{"$f":"IF(Piling!$P$29=\"\",\"\",Piling!$P$29)","v":""},{"$f":"IF( Piling!$B$5=\"\",\"\", Piling!$B$5)","v":"Pile Record"},{"$f":"IF(Piling!$P$27=\"\",\"\",Piling!$P$27)","v":"Penetration     (in/Blow)"},{"$f":"IF(Piling!$A$28=\"\",\"\",Piling!$A$28)","v":1}]
[229,{"$f":"IF(Piling!$P$30=\"\",\"\",Piling!$P$30)","v":""},{"$f":"IF( Piling!$B$5=\"\",\"\", Piling!$B$5)","v":"Pile Record"},{"$f":"IF(Piling!$P$27=\"\",\"\",Piling!$P$27)","v":"Penetration     (in/Blow)"},{"$f":"IF(Piling!$A$28=\"\",\"\",Piling!$A$28)","v":1}]
[230,{"$f":"IF(Piling!$P$31=\"\",\"\",Piling!$P$31)","v":""},{"$f":"IF( Piling!$B$5=\"\",\"\", Piling!$B$5)","v":"Pile Record"},{"$f":"IF(Piling!$P$27=\"\",\"\",Piling!$P$27)","v":"Penetration     (in/Blow)"},{"$f":"IF(Piling!$A$28=\"\",\"\",Piling!$A$28)","v":1}]
[231,{"$f":"IF(Piling!$P$32=\"\",\"\",Piling!$P$32)","v":""},{"$f":"IF( Piling!$B$5=\"\",\"\", Piling!$B$5)","v":"Pile Record"},{"$f":"IF(Piling!$P$27=\"\",\"\",Piling!$P$27)","v":"Penetration     (in/Blow)"},{"$f":"IF(Piling!$A$32=\"\",\"\",Piling!$A$32)","v":2}]
[232,{"$f":"IF(Piling!$P$33=\"\",\"\",Piling!$P$33)","v":""},{"$f":"IF( Piling!$B$5=\"\",\"\", Piling!$B$5)","v":"Pile Record"},{"$f":"IF(Piling!$P$27=\"\",\"\",Piling!$P$27)","v":"Penetration     (in/Blow)"},{"$f":"IF(Piling!$A$32=\"\",\"\",Piling!$A$32)","v":2}]
[233,{"$f":"IF(Piling!$P$34=\"\",\"\",Piling!$P$34)","v":""},{"$f":"IF( Piling!$B$5=\"\",\"\", Piling!$B$5)","v":"Pile Record"},{"$f":"IF(Piling!$P$27=\"\",\"\",Piling!$P$27)","v":"Penetration     (in/Blow)"},{"$f":"IF(Piling!$A$32=\"\",\"\",Piling!$A$32)","v":2}]
[234,{"$f":"IF(Piling!$P$35=\"\",\"\",Piling!$P$35)","v":""},{"$f":"IF( Piling!$B$5=\"\",\"\", Piling!$B$5)","v":"Pile Record"},{"$f":"IF(Piling!$P$27=\"\",\"\",Piling!$P$27)","v":"Penetration     (in/Blow)"},{"$f":"IF(Piling!$A$32=\"\",\"\",Piling!$A$32)","v":2}]
[235,{"$f":"IF(Piling!$P$36=\"\",\"\",Piling!$P$36)","v":""},{"$f":"IF( Piling!$B$5=\"\",\"\", Piling!$B$5)","v":"Pile Record"},{"$f":"IF(Piling!$P$27=\"\",\"\",Piling!$P$27)","v":"Penetration     (in/Blow)"},{"$f":"IF(Piling!$A$36=\"\",\"\",Piling!$A$36)","v":3}]
[236,{"$f":"IF(Piling!$P$37=\"\",\"\",Piling!$P$37)","v":""},{"$f":"IF( Piling!$B$5=\"\",\"\", Piling!$B$5)","v":"Pile Record"},{"$f":"IF(Piling!$P$27=\"\",\"\",Piling!$P$27)","v":"Penetration     (in/Blow)"},{"$f":"IF(Piling!$A$36=\"\",\"\",Piling!$A$36)","v":3}]
[237,{"$f":"IF(Piling!$P$38=\"\",\"\",Piling!$P$38)","v":""},{"$f":"IF( Piling!$B$5=\"\",\"\", Piling!$B$5)","v":"Pile Record"},{"$f":"IF(Piling!$P$27=\"\",\"\",Piling!$P$27)","v":"Penetration     (in/Blow)"},{"$f":"IF(Piling!$A$36=\"\",\"\",Piling!$A$36)","v":3}]
[238,{"$f":"IF(Piling!$P$39=\"\",\"\",Piling!$P$39)","v":""},{"$f":"IF( Piling!$B$5=\"\",\"\", Piling!$B$5)","v":"Pile Record"},{"$f":"IF(Piling!$P$27=\"\",\"\",Piling!$P$27)","v":"Penetration     (in/Blow)"},{"$f":"IF(Piling!$A$36=\"\",\"\",Piling!$A$36)","v":3}]
[239,{"$f":"IF(Piling!$P$40=\"\",\"\",Piling!$P$40)","v":""},{"$f":"IF( Piling!$B$5=\"\",\"\", Piling!$B$5)","v":"Pile Record"},{"$f":"IF(Piling!$P$27=\"\",\"\",Piling!$P$27)","v":"Penetration     (in/Blow)"},{"$f":"IF(Piling!$A$40=\"\",\"\",Piling!$A$40)","v":4}]
[240,{"$f":"IF(Piling!$P$41=\"\",\"\",Piling!$P$41)","v":""},{"$f":"IF( Piling!$B$5=\"\",\"\", Piling!$B$5)","v":"Pile Record"},{"$f":"IF(Piling!$P$27=\"\",\"\",Piling!$P$27)","v":"Penetration     (in/Blow)"},{"$f":"IF(Piling!$A$40=\"\",\"\",Piling!$A$40)","v":4}]
[241,{"$f":"IF(Piling!$P$42=\"\",\"\",Piling!$P$42)","v":""},{"$f":"IF( Piling!$B$5=\"\",\"\", Piling!$B$5)","v":"Pile Record"},{"$f":"IF(Piling!$P$27=\"\",\"\",Piling!$P$27)","v":"Penetration     (in/Blow)"},{"$f":"IF(Piling!$A$40=\"\",\"\",Piling!$A$40)","v":4}]
[242,{"$f":"IF(Piling!$P$43=\"\",\"\",Piling!$P$43)","v":""},{"$f":"IF( Piling!$B$5=\"\",\"\", Piling!$B$5)","v":"Pile Record"},{"$f":"IF(Piling!$P$27=\"\",\"\",Piling!$P$27)","v":"Penetration     (in/Blow)"},{"$f":"IF(Piling!$A$40=\"\",\"\",Piling!$A$40)","v":4}]
[243,{"$f":"IF(Piling!$P$44=\"\",\"\",Piling!$P$44)","v":""},{"$f":"IF( Piling!$B$5=\"\",\"\", Piling!$B$5)","v":"Pile Record"},{"$f":"IF(Piling!$P$27=\"\",\"\",Piling!$P$27)","v":"Penetration     (in/Blow)"},{"$f":"IF(Piling!$A$44=\"\",\"\",Piling!$A$44)","v":5}]
[244,{"$f":"IF(Piling!$P$45=\"\",\"\",Piling!$P$45)","v":""},{"$f":"IF( Piling!$B$5=\"\",\"\", Piling!$B$5)","v":"Pile Record"},{"$f":"IF(Piling!$P$27=\"\",\"\",Piling!$P$27)","v":"Penetration     (in/Blow)"},{"$f":"IF(Piling!$A$44=\"\",\"\",Piling!$A$44)","v":5}]
[245,{"$f":"IF(Piling!$P$46=\"\",\"\",Piling!$P$46)","v":""},{"$f":"IF( Piling!$B$5=\"\",\"\", Piling!$B$5)","v":"Pile Record"},{"$f":"IF(Piling!$P$27=\"\",\"\",Piling!$P$27)","v":"Penetration     (in/Blow)"},{"$f":"IF(Piling!$A$44=\"\",\"\",Piling!$A$44)","v":5}]
[246,{"$f":"IF(Piling!$P$47=\"\",\"\",Piling!$P$47)","v":""},{"$f":"IF( Piling!$B$5=\"\",\"\", Piling!$B$5)","v":"Pile Record"},{"$f":"IF(Piling!$P$27=\"\",\"\",Piling!$P$27)","v":"Penetration     (in/Blow)"},{"$f":"IF(Piling!$A$44=\"\",\"\",Piling!$A$44)","v":5}]
[247,{"$f":"IF(Piling!$Q$28=\"\",\"\",Piling!$Q$28)","v":""},{"$f":"IF( Piling!$B$5=\"\",\"\", Piling!$B$5)","v":"Pile Record"},{"$f":"IF(Piling!$Q$27=\"\",\"\",Piling!$Q$27)","v":"Input Computed Resistance @ Actual Length (tons)"},{"$f":"IF(Piling!$A$28=\"\",\"\",Piling!$A$28)","v":1}]
[248,{"$f":"IF(Piling!$Q$29=\"\",\"\",Piling!$Q$29)","v":""},{"$f":"IF( Piling!$B$5=\"\",\"\", Piling!$B$5)","v":"Pile Record"},{"$f":"IF(Piling!$Q$27=\"\",\"\",Piling!$Q$27)","v":"Input Computed Resistance @ Actual Length (tons)"},{"$f":"IF(Piling!$A$28=\"\",\"\",Piling!$A$28)","v":1}]
[249,{"$f":"IF(Piling!$Q$30=\"\",\"\",Piling!$Q$30)","v":""},{"$f":"IF( Piling!$B$5=\"\",\"\", Piling!$B$5)","v":"Pile Record"},{"$f":"IF(Piling!$Q$27=\"\",\"\",Piling!$Q$27)","v":"Input Computed Resistance @ Actual Length (tons)"},{"$f":"IF(Piling!$A$28=\"\",\"\",Piling!$A$28)","v":1}]
[250,{"$f":"IF(Piling!$Q$31=\"\",\"\",Piling!$Q$31)","v":""},{"$f":"IF( Piling!$B$5=\"\",\"\", Piling!$B$5)","v":"Pile Record"},{"$f":"IF(Piling!$Q$27=\"\",\"\",Piling!$Q$27)","v":"Input Computed Resistance @ Actual Length (tons)"},{"$f":"IF(Piling!$A$28=\"\",\"\",Piling!$A$28)","v":1}]
[251,{"$f":"IF(Piling!$Q$32=\"\",\"\",Piling!$Q$32)","v":""},{"$f":"IF( Piling!$B$5=\"\",\"\", Piling!$B$5)","v":"Pile Record"},{"$f":"IF(Piling!$Q$27=\"\",\"\",Piling!$Q$27)","v":"Input Computed Resistance @ Actual Length (tons)"},{"$f":"IF(Piling!$A$32=\"\",\"\",Piling!$A$32)","v":2}]
[252,{"$f":"IF(Piling!$Q$33=\"\",\"\",Piling!$Q$33)","v":""},{"$f":"IF( Piling!$B$5=\"\",\"\", Piling!$B$5)","v":"Pile Record"},{"$f":"IF(Piling!$Q$27=\"\",\"\",Piling!$Q$27)","v":"Input Computed Resistance @ Actual Length (tons)"},{"$f":"IF(Piling!$A$32=\"\",\"\",Piling!$A$32)","v":2}]
[253,{"$f":"IF(Piling!$Q$34=\"\",\"\",Piling!$Q$34)","v":""},{"$f":"IF( Piling!$B$5=\"\",\"\", Piling!$B$5)","v":"Pile Record"},{"$f":"IF(Piling!$Q$27=\"\",\"\",Piling!$Q$27)","v":"Input Computed Resistance @ Actual Length (tons)"},{"$f":"IF(Piling!$A$32=\"\",\"\",Piling!$A$32)","v":2}]
[254,{"$f":"IF(Piling!$Q$35=\"\",\"\",Piling!$Q$35)","v":""},{"$f":"IF( Piling!$B$5=\"\",\"\", Piling!$B$5)","v":"Pile Record"},{"$f":"IF(Piling!$Q$27=\"\",\"\",Piling!$Q$27)","v":"Input Computed Resistance @ Actual Length (tons)"},{"$f":"IF(Piling!$A$32=\"\",\"\",Piling!$A$32)","v":2}]
[255,{"$f":"IF(Piling!$Q$36=\"\",\"\",Piling!$Q$36)","v":""},{"$f":"IF( Piling!$B$5=\"\",\"\", Piling!$B$5)","v":"Pile Record"},{"$f":"IF(Piling!$Q$27=\"\",\"\",Piling!$Q$27)","v":"Input Computed Resistance @ Actual Length (tons)"},{"$f":"IF(Piling!$A$36=\"\",\"\",Piling!$A$36)","v":3}]
[256,{"$f":"IF(Piling!$Q$37=\"\",\"\",Piling!$Q$37)","v":""},{"$f":"IF( Piling!$B$5=\"\",\"\", Piling!$B$5)","v":"Pile Record"},{"$f":"IF(Piling!$Q$27=\"\",\"\",Piling!$Q$27)","v":"Input Computed Resistance @ Actual Length (tons)"},{"$f":"IF(Piling!$A$36=\"\",\"\",Piling!$A$36)","v":3}]
[257,{"$f":"IF(Piling!$Q$38=\"\",\"\",Piling!$Q$38)","v":""},{"$f":"IF( Piling!$B$5=\"\",\"\", Piling!$B$5)","v":"Pile Record"},{"$f":"IF(Piling!$Q$27=\"\",\"\",Piling!$Q$27)","v":"Input Computed Resistance @ Actual Length (tons)"},{"$f":"IF(Piling!$A$36=\"\",\"\",Piling!$A$36)","v":3}]
[258,{"$f":"IF(Piling!$Q$39=\"\",\"\",Piling!$Q$39)","v":""},{"$f":"IF( Piling!$B$5=\"\",\"\", Piling!$B$5)","v":"Pile Record"},{"$f":"IF(Piling!$Q$27=\"\",\"\",Piling!$Q$27)","v":"Input Computed Resistance @ Actual Length (tons)"},{"$f":"IF(Piling!$A$36=\"\",\"\",Piling!$A$36)","v":3}]
[259,{"$f":"IF(Piling!$Q$40=\"\",\"\",Piling!$Q$40)","v":""},{"$f":"IF( Piling!$B$5=\"\",\"\", Piling!$B$5)","v":"Pile Record"},{"$f":"IF(Piling!$Q$27=\"\",\"\",Piling!$Q$27)","v":"Input Computed Resistance @ Actual Length (tons)"},{"$f":"IF(Piling!$A$40=\"\",\"\",Piling!$A$40)","v":4}]
[260,{"$f":"IF(Piling!$Q$41=\"\",\"\",Piling!$Q$41)","v":""},{"$f":"IF( Piling!$B$5=\"\",\"\", Piling!$B$5)","v":"Pile Record"},{"$f":"IF(Piling!$Q$27=\"\",\"\",Piling!$Q$27)","v":"Input Computed Resistance @ Actual Length (tons)"},{"$f":"IF(Piling!$A$40=\"\",\"\",Piling!$A$40)","v":4}]
[261,{"$f":"IF(Piling!$Q$42=\"\",\"\",Piling!$Q$42)","v":""},{"$f":"IF( Piling!$B$5=\"\",\"\", Piling!$B$5)","v":"Pile Record"},{"$f":"IF(Piling!$Q$27=\"\",\"\",Piling!$Q$27)","v":"Input Computed Resistance @ Actual Length (tons)"},{"$f":"IF(Piling!$A$40=\"\",\"\",Piling!$A$40)","v":4}]
[262,{"$f":"IF(Piling!$Q$43=\"\",\"\",Piling!$Q$43)","v":""},{"$f":"IF( Piling!$B$5=\"\",\"\", Piling!$B$5)","v":"Pile Record"},{"$f":"IF(Piling!$Q$27=\"\",\"\",Piling!$Q$27)","v":"Input Computed Resistance @ Actual Length (tons)"},{"$f":"IF(Piling!$A$40=\"\",\"\",Piling!$A$40)","v":4}]
[263,{"$f":"IF(Piling!$Q$44=\"\",\"\",Piling!$Q$44)","v":""},{"$f":"IF( Piling!$B$5=\"\",\"\", Piling!$B$5)","v":"Pile Record"},{"$f":"IF(Piling!$Q$27=\"\",\"\",Piling!$Q$27)","v":"Input Computed Resistance @ Actual Length (tons)"},{"$f":"IF(Piling!$A$44=\"\",\"\",Piling!$A$44)","v":5}]
[264,{"$f":"IF(Piling!$Q$45=\"\",\"\",Piling!$Q$45)","v":""},{"$f":"IF( Piling!$B$5=\"\",\"\", Piling!$B$5)","v":"Pile Record"},{"$f":"IF(Piling!$Q$27=\"\",\"\",Piling!$Q$27)","v":"Input Computed Resistance @ Actual Length (tons)"},{"$f":"IF(Piling!$A$44=\"\",\"\",Piling!$A$44)","v":5}]
[265,{"$f":"IF(Piling!$Q$46=\"\",\"\",Piling!$Q$46)","v":""},{"$f":"IF( Piling!$B$5=\"\",\"\", Piling!$B$5)","v":"Pile Record"},{"$f":"IF(Piling!$Q$27=\"\",\"\",Piling!$Q$27)","v":"Input Computed Resistance @ Actual Length (tons)"},{"$f":"IF(Piling!$A$44=\"\",\"\",Piling!$A$44)","v":5}]
[266,{"$f":"IF(Piling!$Q$47=\"\",\"\",Piling!$Q$47)","v":""},{"$f":"IF( Piling!$B$5=\"\",\"\", Piling!$B$5)","v":"Pile Record"},{"$f":"IF(Piling!$Q$27=\"\",\"\",Piling!$Q$27)","v":"Input Computed Resistance @ Actual Length (tons)"},{"$f":"IF(Piling!$A$44=\"\",\"\",Piling!$A$44)","v":5}]
[267,{"$f":"IF(Piling!$S$28=\"\",\"\",Piling!$S$28)","v":""},{"$f":"IF( Piling!$B$5=\"\",\"\", Piling!$B$5)","v":"Pile Record"},{"$f":"IF(Piling!$S$27=\"\",\"\",Piling!$S$27)","v":"Auto Computed Resistance @ Actual Length (tons)"},{"$f":"IF(Piling!$A$28=\"\",\"\",Piling!$A$28)","v":1}]
[268,{"$f":"IF(Piling!$S$29=\"\",\"\",Piling!$S$29)","v":""},{"$f":"IF( Piling!$B$5=\"\",\"\", Piling!$B$5)","v":"Pile Record"},{"$f":"IF(Piling!$S$27=\"\",\"\",Piling!$S$27)","v":"Auto Computed Resistance @ Actual Length (tons)"},{"$f":"IF(Piling!$A$28=\"\",\"\",Piling!$A$28)","v":1}]
[269,{"$f":"IF(Piling!$S$30=\"\",\"\",Piling!$S$30)","v":""},{"$f":"IF( Piling!$B$5=\"\",\"\", Piling!$B$5)","v":"Pile Record"},{"$f":"IF(Piling!$S$27=\"\",\"\",Piling!$S$27)","v":"Auto Computed Resistance @ Actual Length (tons)"},{"$f":"IF(Piling!$A$28=\"\",\"\",Piling!$A$28)","v":1}]
[270,{"$f":"IF(Piling!$S$31=\"\",\"\",Piling!$S$31)","v":""},{"$f":"IF( Piling!$B$5=\"\",\"\", Piling!$B$5)","v":"Pile Record"},{"$f":"IF(Piling!$S$27=\"\",\"\",Piling!$S$27)","v":"Auto Computed Resistance @ Actual Length (tons)"},{"$f":"IF(Piling!$A$28=\"\",\"\",Piling!$A$28)","v":1}]
[271,{"$f":"IF(Piling!$S$32=\"\",\"\",Piling!$S$32)","v":""},{"$f":"IF( Piling!$B$5=\"\",\"\", Piling!$B$5)","v":"Pile Record"},{"$f":"IF(Piling!$S$27=\"\",\"\",Piling!$S$27)","v":"Auto Computed Resistance @ Actual Length (tons)"},{"$f":"IF(Piling!$A$32=\"\",\"\",Piling!$A$32)","v":2}]
[272,{"$f":"IF(Piling!$S$33=\"\",\"\",Piling!$S$33)","v":""},{"$f":"IF( Piling!$B$5=\"\",\"\", Piling!$B$5)","v":"Pile Record"},{"$f":"IF(Piling!$S$27=\"\",\"\",Piling!$S$27)","v":"Auto Computed Resistance @ Actual Length (tons)"},{"$f":"IF(Piling!$A$32=\"\",\"\",Piling!$A$32)","v":2}]
[273,{"$f":"IF(Piling!$S$34=\"\",\"\",Piling!$S$34)","v":""},{"$f":"IF( Piling!$B$5=\"\",\"\", Piling!$B$5)","v":"Pile Record"},{"$f":"IF(Piling!$S$27=\"\",\"\",Piling!$S$27)","v":"Auto Computed Resistance @ Actual Length (tons)"},{"$f":"IF(Piling!$A$32=\"\",\"\",Piling!$A$32)","v":2}]
[274,{"$f":"IF(Piling!$S$35=\"\",\"\",Piling!$S$35)","v":""},{"$f":"IF( Piling!$B$5=\"\",\"\", Piling!$B$5)","v":"Pile Record"},{"$f":"IF(Piling!$S$27=\"\",\"\",Piling!$S$27)","v":"Auto Computed Resistance @ Actual Length (tons)"},{"$f":"IF(Piling!$A$32=\"\",\"\",Piling!$A$32)","v":2}]
[275,{"$f":"IF(Piling!$S$36=\"\",\"\",Piling!$S$36)","v":""},{"$f":"IF( Piling!$B$5=\"\",\"\", Piling!$B$5)","v":"Pile Record"},{"$f":"IF(Piling!$S$27=\"\",\"\",Piling!$S$27)","v":"Auto Computed Resistance @ Actual Length (tons)"},{"$f":"IF(Piling!$A$36=\"\",\"\",Piling!$A$36)","v":3}]
[276,{"$f":"IF(Piling!$S$37=\"\",\"\",Piling!$S$37)","v":""},{"$f":"IF( Piling!$B$5=\"\",\"\", Piling!$B$5)","v":"Pile Record"},{"$f":"IF(Piling!$S$27=\"\",\"\",Piling!$S$27)","v":"Auto Computed Resistance @ Actual Length (tons)"},{"$f":"IF(Piling!$A$36=\"\",\"\",Piling!$A$36)","v":3}]
[277,{"$f":"IF(Piling!$S$38=\"\",\"\",Piling!$S$38)","v":""},{"$f":"IF( Piling!$B$5=\"\",\"\", Piling!$B$5)","v":"Pile Record"},{"$f":"IF(Piling!$S$27=\"\",\"\",Piling!$S$27)","v":"Auto Computed Resistance @ Actual Length (tons)"},{"$f":"IF(Piling!$A$36=\"\",\"\",Piling!$A$36)","v":3}]
[278,{"$f":"IF(Piling!$S$39=\"\",\"\",Piling!$S$39)","v":""},{"$f":"IF( Piling!$B$5=\"\",\"\", Piling!$B$5)","v":"Pile Record"},{"$f":"IF(Piling!$S$27=\"\",\"\",Piling!$S$27)","v":"Auto Computed Resistance @ Actual Length (tons)"},{"$f":"IF(Piling!$A$36=\"\",\"\",Piling!$A$36)","v":3}]
[279,{"$f":"IF(Piling!$S$40=\"\",\"\",Piling!$S$40)","v":""},{"$f":"IF( Piling!$B$5=\"\",\"\", Piling!$B$5)","v":"Pile Record"},{"$f":"IF(Piling!$S$27=\"\",\"\",Piling!$S$27)","v":"Auto Computed Resistance @ Actual Length (tons)"},{"$f":"IF(Piling!$A$40=\"\",\"\",Piling!$A$40)","v":4}]
[280,{"$f":"IF(Piling!$S$41=\"\",\"\",Piling!$S$41)","v":""},{"$f":"IF( Piling!$B$5=\"\",\"\", Piling!$B$5)","v":"Pile Record"},{"$f":"IF(Piling!$S$27=\"\",\"\",Piling!$S$27)","v":"Auto Computed Resistance @ Actual Length (tons)"},{"$f":"IF(Piling!$A$40=\"\",\"\",Piling!$A$40)","v":4}]
[281,{"$f":"IF(Piling!$S$42=\"\",\"\",Piling!$S$42)","v":""},{"$f":"IF( Piling!$B$5=\"\",\"\", Piling!$B$5)","v":"Pile Record"},{"$f":"IF(Piling!$S$27=\"\",\"\",Piling!$S$27)","v":"Auto Computed Resistance @ Actual Length (tons)"},{"$f":"IF(Piling!$A$40=\"\",\"\",Piling!$A$40)","v":4}]
[282,{"$f":"IF(Piling!$S$43=\"\",\"\",Piling!$S$43)","v":""},{"$f":"IF( Piling!$B$5=\"\",\"\", Piling!$B$5)","v":"Pile Record"},{"$f":"IF(Piling!$S$27=\"\",\"\",Piling!$S$27)","v":"Auto Computed Resistance @ Actual Length (tons)"},{"$f":"IF(Piling!$A$40=\"\",\"\",Piling!$A$40)","v":4}]
[283,{"$f":"IF(Piling!$S$44=\"\",\"\",Piling!$S$44)","v":""},{"$f":"IF( Piling!$B$5=\"\",\"\", Piling!$B$5)","v":"Pile Record"},{"$f":"IF(Piling!$S$27=\"\",\"\",Piling!$S$27)","v":"Auto Computed Resistance @ Actual Length (tons)"},{"$f":"IF(Piling!$A$44=\"\",\"\",Piling!$A$44)","v":5}]
[284,{"$f":"IF(Piling!$S$45=\"\",\"\",Piling!$S$45)","v":""},{"$f":"IF( Piling!$B$5=\"\",\"\", Piling!$B$5)","v":"Pile Record"},{"$f":"IF(Piling!$S$27=\"\",\"\",Piling!$S$27)","v":"Auto Computed Resistance @ Actual Length (tons)"},{"$f":"IF(Piling!$A$44=\"\",\"\",Piling!$A$44)","v":5}]
[285,{"$f":"IF(Piling!$S$46=\"\",\"\",Piling!$S$46)","v":""},{"$f":"IF( Piling!$B$5=\"\",\"\", Piling!$B$5)","v":"Pile Record"},{"$f":"IF(Piling!$S$27=\"\",\"\",Piling!$S$27)","v":"Auto Computed Resistance @ Actual Length (tons)"},{"$f":"IF(Piling!$A$44=\"\",\"\",Piling!$A$44)","v":5}]
[286,{"$f":"IF(Piling!$S$47=\"\",\"\",Piling!$S$47)","v":""},{"$f":"IF( Piling!$B$5=\"\",\"\", Piling!$B$5)","v":"Pile Record"},{"$f":"IF(Piling!$S$27=\"\",\"\",Piling!$S$27)","v":"Auto Computed Resistance @ Actual Length (tons)"},{"$f":"IF(Piling!$A$44=\"\",\"\",Piling!$A$44)","v":5}]
[287,{"$f":"IF([0]!K_factor=\"\",\"\",[0]!K_factor)","v":1},{"$f":"IF( Piling!$B$5=\"\",\"\", Piling!$B$5)","v":"Pile Record"},{"$f":"IF(Piling!$R$23=\"\",\"\",Piling!$R$23)","v":"K-factor:"}]
[288,{"$f":"IF(Piling!E50=\"\",\"\",Piling!E50)","v":""},{"$f":"IF( Piling!$B$5=\"\",\"\", Piling!$B$5)","v":"Pile Record"},{"$f":"IF(Piling!$E$49=\"\",\"\",Piling!$E$49)","v":"Cushion"},{"$f":"IF(Piling!B50=\"\",\"\",Piling!B50)","v":"Material Type:"}]
[289,{"$f":"IF(Piling!E51=\"\",\"\",Piling!E51)","v":""},{"$f":"IF( Piling!$B$5=\"\",\"\", Piling!$B$5)","v":"Pile Record"},{"$f":"IF(Piling!$E$49=\"\",\"\",Piling!$E$49)","v":"Cushion"},{"$f":"IF(Piling!B51=\"\",\"\",Piling!B51)","v":"Dimensions:"}]
[290,{"$f":"IF(Piling!E52=\"\",\"\",Piling!E52)","v":""},{"$f":"IF( Piling!$B$5=\"\",\"\", Piling!$B$5)","v":"Pile Record"},{"$f":"IF(Piling!$E$49=\"\",\"\",Piling!$E$49)","v":"Cushion"},{"$f":"IF(Piling!B52=\"\",\"\",Piling!B52)","v":"Thickness (in.):"}]
[291,{"$f":"IF(Piling!E53=\"\",\"\",Piling!E53)","v":""},{"$f":"IF( Piling!$B$5=\"\",\"\", Piling!$B$5)","v":"Pile Record"},{"$f":"IF(Piling!$E$49=\"\",\"\",Piling!$E$49)","v":"Cushion"},{"$f":"IF(Piling!B53=\"\",\"\",Piling!B53)","v":"Direction Grain**:"}]
[292,{"$f":"IF(Piling!E54=\"\",\"\",Piling!E54)","v":""},{"$f":"IF( Piling!$B$5=\"\",\"\", Piling!$B$5)","v":"Pile Record"},{"$f":"IF(Piling!$E$49=\"\",\"\",Piling!$E$49)","v":"Cushion"},{"$f":"IF(Piling!B54=\"\",\"\",Piling!B54)","v":"Pay Quantity (This Sheet):"}]
[293,{"$f":"IF(Piling!N50=\"\",\"\",Piling!N50)","v":""},{"$f":"IF( Piling!$B$5=\"\",\"\", Piling!$B$5)","v":"Pile Record"},{"$f":"IF(Piling!$N$49=\"\",\"\",Piling!$N$49)","v":"Total This Sheet - Req. Piling"},{"$f":"IF(Piling!J50=\"\",\"\",Piling!J50)","v":"Piling(L.F.)"}]
[294,{"$f":"IF(Piling!N51=\"\",\"\",Piling!N51)","v":""},{"$f":"IF( Piling!$B$5=\"\",\"\", Piling!$B$5)","v":"Pile Record"},{"$f":"IF(Piling!$N$49=\"\",\"\",Piling!$N$49)","v":"Total This Sheet - Req. Piling"},{"$f":"IF(Piling!J51=\"\",\"\",Piling!J51)","v":"Cut-off (L.F.)"}]
[295,{"$f":"IF(Piling!N52=\"\",\"\",Piling!N52)","v":""},{"$f":"IF( Piling!$B$5=\"\",\"\", Piling!$B$5)","v":"Pile Record"},{"$f":"IF(Piling!$N$49=\"\",\"\",Piling!$N$49)","v":"Total This Sheet - Req. Piling"},{"$f":"IF(Piling!J52=\"\",\"\",Piling!J52)","v":"Build-UP (Ea.)"}]
[296,{"$f":"IF(Piling!N53=\"\",\"\",Piling!N53)","v":""},{"$f":"IF( Piling!$B$5=\"\",\"\", Piling!$B$5)","v":"Pile Record"},{"$f":"IF(Piling!$N$49=\"\",\"\",Piling!$N$49)","v":"Total This Sheet - Req. Piling"},{"$f":"IF(Piling!J53=\"\",\"\",Piling!J53)","v":"Pay Quantity (This Structure)"}]
[297,{"$f":"IF(TestPerson1=\"\",\"\",TestPerson1)","v":""},"Tested By",{"$f":"IF(Test1=\"\",\"\",Test1)","v":"TXPLNG"},{"$f":"IF(Piling!J54=\"\",\"\",Piling!J54)","v":""}]
[298,{"$f":"IF(TestDate1=\"\",\"\",TestDate1)","v":""},"Test Date",{"$f":"IF(Test1=\"\",\"\",Test1)","v":"TXPLNG"},{"$f":"IF(Piling!J55=\"\",\"\",Piling!J55)","v":""}]